Console Output

Skipping 1,097 KB.. Full Log
race_dispatch
20:35:05 [2021-11-27T01:35:05.749Z] 	at org.eclipse.ease.debugging.AbstractEaseDebugger.handleEventsInSuspendedState(AbstractEaseDebugger.java:331)
20:35:05 [2021-11-27T01:35:05.749Z] 	at org.eclipse.ease.debugging.AbstractEaseDebugger.suspend(AbstractEaseDebugger.java:257)
20:35:05 [2021-11-27T01:35:05.749Z] 	at org.eclipse.ease.debugging.AbstractEaseDebugger.processLine(AbstractEaseDebugger.java:492)
20:35:05 [2021-11-27T01:35:05.749Z] 	at org.eclipse.ease.lang.python.debugger.PythonDebugger.traceDispatch(PythonDebugger.java:179)
20:35:05 [2021-11-27T01:35:05.749Z] 	at org.eclipse.ease.lang.python.jython.debugger.JythonDebugger.traceDispatch(JythonDebugger.java:46)
20:35:05 [2021-11-27T01:35:05.749Z] 	at jdk.internal.reflect.GeneratedMethodAccessor25.invoke(Unknown Source)
20:35:05 [2021-11-27T01:35:05.749Z] 	at java.base/jdk.internal.reflect.DelegatingMethodAccessorImpl.invoke(DelegatingMethodAccessorImpl.java:43)
20:35:05 [2021-11-27T01:35:05.749Z] 	at java.base/java.lang.reflect.Method.invoke(Method.java:564)
20:35:05 [2021-11-27T01:35:05.749Z] 
20:35:05 [2021-11-27T01:35:05.749Z] org.eclipse.ease.ScriptEngineCancellationException: org.eclipse.ease.ScriptEngineCancellationException: Terminated on user request
20:35:05 [2021-11-27T01:35:05.750Z] Start of script
20:35:05 [2021-11-27T01:35:05.750Z] include file start
20:35:05 [2021-11-27T01:35:05.750Z] include file processed
20:35:05 [2021-11-27T01:35:05.750Z] Result of testMethod = 5
20:35:05 [2021-11-27T01:35:05.750Z] End of script
20:35:06 [2021-11-27T01:35:06.026Z] Start of script
20:35:06 [2021-11-27T01:35:06.026Z] include file start
20:35:06 [2021-11-27T01:35:06.026Z] include file processed
20:35:06 [2021-11-27T01:35:06.297Z] Result of testMethod = 5
20:35:06 [2021-11-27T01:35:06.297Z] End of script
20:35:06 [2021-11-27T01:35:06.297Z] Start of script
20:35:06 [2021-11-27T01:35:06.297Z] include file start
20:35:06 [2021-11-27T01:35:06.297Z] include file processed
20:35:06 [2021-11-27T01:35:06.297Z] Result of testMethod = 5
20:35:06 [2021-11-27T01:35:06.297Z] End of script
20:35:06 [2021-11-27T01:35:06.554Z] Tests run: 41, Failures: 0, Errors: 0, Skipped: 0, Time elapsed: 14.192 s - in org.eclipse.ease.lang.python.jython.debugger.JythonDebugTest
20:35:06 [2021-11-27T01:35:06.554Z] disconnectProcessInSuspendedState  Time elapsed: 3.383 s
20:35:06 [2021-11-27T01:35:06.554Z] stepReturnIncludeCommand  Time elapsed: 0.214 s
20:35:06 [2021-11-27T01:35:06.554Z] arrayVariableSorting  Time elapsed: 0.308 s
20:35:06 [2021-11-27T01:35:06.554Z] stepOverOnDebugTarget  Time elapsed: 0.31 s
20:35:06 [2021-11-27T01:35:06.554Z] disconnectThreadInSuspendedState  Time elapsed: 0.208 s
20:35:06 [2021-11-27T01:35:06.554Z] stepReturnOnDebugTarget  Time elapsed: 0.307 s
20:35:06 [2021-11-27T01:35:06.554Z] nullVariable  Time elapsed: 0.42 s
20:35:06 [2021-11-27T01:35:06.554Z] stepOverOnStackFrame  Time elapsed: 0.307 s
20:35:06 [2021-11-27T01:35:06.555Z] resumeOnDebugTarget  Time elapsed: 0.205 s
20:35:06 [2021-11-27T01:35:06.555Z] modifyVariableKeepingType  Time elapsed: 0.507 s
20:35:06 [2021-11-27T01:35:06.555Z] resumeOnLastIncludeLine  Time elapsed: 0.205 s
20:35:06 [2021-11-27T01:35:06.555Z] stepReturnOnStackFrame  Time elapsed: 0.306 s
20:35:06 [2021-11-27T01:35:06.555Z] terminateStackFrameInSuspendedState  Time elapsed: 0.205 s
20:35:06 [2021-11-27T01:35:06.555Z] breakpointLocation  Time elapsed: 0.205 s
20:35:06 [2021-11-27T01:35:06.555Z] stepReturnOnThread  Time elapsed: 0.306 s
20:35:06 [2021-11-27T01:35:06.555Z] javaClassVariable  Time elapsed: 0.327 s
20:35:06 [2021-11-27T01:35:06.555Z] stepIntoOnThread  Time elapsed: 0.307 s
20:35:06 [2021-11-27T01:35:06.555Z] terminateThreadInSuspendedState  Time elapsed: 0.206 s
20:35:06 [2021-11-27T01:35:06.555Z] resumeOnThread  Time elapsed: 0.205 s
20:35:06 [2021-11-27T01:35:06.555Z] stepIntoOnStackFrame  Time elapsed: 0.305 s
20:35:06 [2021-11-27T01:35:06.555Z] terminateProcessInSuspendedState  Time elapsed: 0.205 s
20:35:06 [2021-11-27T01:35:06.555Z] stepOverOnProcess  Time elapsed: 0.306 s
20:35:06 [2021-11-27T01:35:06.555Z] nativeArrayVariable  Time elapsed: 0.306 s
20:35:06 [2021-11-27T01:35:06.555Z] disconnectDebugTargetInSuspendedState  Time elapsed: 0.205 s
20:35:06 [2021-11-27T01:35:06.555Z] stepIntoOnProcess  Time elapsed: 0.306 s
20:35:06 [2021-11-27T01:35:06.555Z] terminatedState  Time elapsed: 0.104 s
20:35:06 [2021-11-27T01:35:06.555Z] stepOverIncludeCommand  Time elapsed: 0.305 s
20:35:06 [2021-11-27T01:35:06.555Z] innerScopeVariableBeforeOuterScopeVariable  Time elapsed: 0.305 s
20:35:06 [2021-11-27T01:35:06.555Z] stepIntoIncludeCommand  Time elapsed: 0.305 s
20:35:06 [2021-11-27T01:35:06.555Z] primitiveStringVariable  Time elapsed: 0.305 s
20:35:06 [2021-11-27T01:35:06.555Z] resumeOnProcess  Time elapsed: 0.204 s
20:35:06 [2021-11-27T01:35:06.555Z] stepIntoOnDebugTarget  Time elapsed: 0.304 s
20:35:06 [2021-11-27T01:35:06.555Z] stepOverOnThread  Time elapsed: 0.305 s
20:35:06 [2021-11-27T01:35:06.555Z] suspendedState  Time elapsed: 0.204 s
20:35:06 [2021-11-27T01:35:06.555Z] primitiveDoubleVariable  Time elapsed: 0.305 s
20:35:06 [2021-11-27T01:35:06.555Z] resumeOnStackFrame  Time elapsed: 0.204 s
20:35:06 [2021-11-27T01:35:06.555Z] nativeObjectVariable  Time elapsed: 0.306 s
20:35:06 [2021-11-27T01:35:06.555Z] terminateDebugTargetInSuspendedState  Time elapsed: 0.205 s
20:35:06 [2021-11-27T01:35:06.555Z] disconnectStackFrameInSuspendedState  Time elapsed: 0.205 s
20:35:06 [2021-11-27T01:35:06.555Z] stepReturnOnProcess  Time elapsed: 0.306 s
20:35:06 [2021-11-27T01:35:06.555Z] evaluateWatchExpression  Time elapsed: 0.218 s
20:35:06 [2021-11-27T01:35:06.555Z] 
20:35:06 [2021-11-27T01:35:06.555Z] Results:
20:35:06 [2021-11-27T01:35:06.555Z] 
20:35:06 [2021-11-27T01:35:06.555Z] Tests run: 41, Failures: 0, Errors: 0, Skipped: 0
20:35:06 [2021-11-27T01:35:06.555Z] 
20:35:06 [2021-11-27T01:35:06.813Z] [INFO] All tests passed!
20:35:06 [2021-11-27T01:35:06.813Z] [INFO] 
20:35:06 [2021-11-27T01:35:06.813Z] [INFO] --- maven-pmd-plugin:3.15.0:pmd (pmd-integration) @ org.eclipse.ease.lang.python.jython.test ---
20:35:06 [2021-11-27T01:35:06.813Z] [INFO] PMD version: 6.38.0
20:35:06 [2021-11-27T01:35:06.813Z] [WARNING] Could not find class org.eclipse.ease.lang.python.jython.debugger.JythonDebugTest, due to: java.lang.IncompatibleClassChangeError: class net.sourceforge.pmd.lang.java.typeresolution.visitors.PMDASMVisitor has interface org.objectweb.asm.ClassVisitor as super class
20:35:07 [2021-11-27T01:35:07.099Z] [INFO] 
20:35:07 [2021-11-27T01:35:07.099Z] [INFO] --- maven-pmd-plugin:3.15.0:cpd (pmd-integration) @ org.eclipse.ease.lang.python.jython.test ---
20:35:07 [2021-11-27T01:35:07.099Z] [INFO] PMD version: 6.38.0
20:35:07 [2021-11-27T01:35:07.099Z] [INFO] 
20:35:07 [2021-11-27T01:35:07.099Z] [INFO] --- spotbugs-maven-plugin:4.1.4:spotbugs (spotbugs-integration) @ org.eclipse.ease.lang.python.jython.test ---
20:35:07 [2021-11-27T01:35:07.099Z] [INFO] Fork Value is false
20:35:07 [2021-11-27T01:35:07.099Z]      [java] JVM args ignored when same JVM is used.
20:35:09 [2021-11-27T01:35:09.698Z] [INFO] Done SpotBugs Analysis....
20:35:09 [2021-11-27T01:35:09.698Z] [INFO] 
20:35:09 [2021-11-27T01:35:09.698Z] [INFO] --- maven-checkstyle-plugin:3.1.1:check (checkstyle-integration) @ org.eclipse.ease.lang.python.jython.test ---
20:35:09 [2021-11-27T01:35:09.698Z] [INFO] You have 0 Checkstyle violations.
20:35:09 [2021-11-27T01:35:09.698Z] [INFO] 
20:35:09 [2021-11-27T01:35:09.698Z] [INFO] --- maven-install-plugin:2.3.1:install (default-install) @ org.eclipse.ease.lang.python.jython.test ---
20:35:09 [2021-11-27T01:35:09.698Z] [INFO] Installing /home/jenkins/agent/workspace/ease.verify.core.target.2020-03/tests/org.eclipse.ease.lang.python.jython.test/target/org.eclipse.ease.lang.python.jython.test-0.9.0-SNAPSHOT.jar to /home/jenkins/.m2/repository/org/eclipse/ease/org.eclipse.ease.lang.python.jython.test/0.9.0-SNAPSHOT/org.eclipse.ease.lang.python.jython.test-0.9.0-SNAPSHOT.jar
20:35:09 [2021-11-27T01:35:09.698Z] [INFO] Installing /home/jenkins/agent/workspace/ease.verify.core.target.2020-03/tests/org.eclipse.ease.lang.python.jython.test/pom.xml to /home/jenkins/.m2/repository/org/eclipse/ease/org.eclipse.ease.lang.python.jython.test/0.9.0-SNAPSHOT/org.eclipse.ease.lang.python.jython.test-0.9.0-SNAPSHOT.pom
20:35:09 [2021-11-27T01:35:09.699Z] [INFO] Installing /home/jenkins/agent/workspace/ease.verify.core.target.2020-03/tests/org.eclipse.ease.lang.python.jython.test/target/p2content.xml to /home/jenkins/.m2/repository/org/eclipse/ease/org.eclipse.ease.lang.python.jython.test/0.9.0-SNAPSHOT/org.eclipse.ease.lang.python.jython.test-0.9.0-SNAPSHOT-p2metadata.xml
20:35:09 [2021-11-27T01:35:09.699Z] [INFO] Installing /home/jenkins/agent/workspace/ease.verify.core.target.2020-03/tests/org.eclipse.ease.lang.python.jython.test/target/p2artifacts.xml to /home/jenkins/.m2/repository/org/eclipse/ease/org.eclipse.ease.lang.python.jython.test/0.9.0-SNAPSHOT/org.eclipse.ease.lang.python.jython.test-0.9.0-SNAPSHOT-p2artifacts.xml
20:35:09 [2021-11-27T01:35:09.699Z] [INFO] 
20:35:09 [2021-11-27T01:35:09.699Z] [INFO] --- tycho-p2-plugin:2.2.0:update-local-index (default-update-local-index) @ org.eclipse.ease.lang.python.jython.test ---
20:35:09 [2021-11-27T01:35:09.699Z] [INFO] 
20:35:09 [2021-11-27T01:35:09.699Z] [INFO] -----< org.eclipse.ease:org.eclipse.ease.lang.scriptarchive.test >------
20:35:09 [2021-11-27T01:35:09.699Z] [INFO] Building org.eclipse.ease.lang.scriptarchive.test 0.9.0-SNAPSHOT [43/49]
20:35:09 [2021-11-27T01:35:09.699Z] [INFO] ------------------------[ eclipse-test-plugin ]-------------------------
20:35:09 [2021-11-27T01:35:09.699Z] [INFO] 
20:35:09 [2021-11-27T01:35:09.699Z] [INFO] --- maven-clean-plugin:2.5:clean (default-clean) @ org.eclipse.ease.lang.scriptarchive.test ---
20:35:09 [2021-11-27T01:35:09.699Z] [INFO] 
20:35:09 [2021-11-27T01:35:09.699Z] [INFO] --- tycho-packaging-plugin:2.2.0:build-qualifier (default-build-qualifier) @ org.eclipse.ease.lang.scriptarchive.test ---
20:35:09 [2021-11-27T01:35:09.699Z] [INFO] The project's OSGi version is 0.9.0.I202106220815
20:35:09 [2021-11-27T01:35:09.699Z] [INFO] 
20:35:09 [2021-11-27T01:35:09.699Z] [INFO] --- tycho-packaging-plugin:2.2.0:validate-id (default-validate-id) @ org.eclipse.ease.lang.scriptarchive.test ---
20:35:09 [2021-11-27T01:35:09.699Z] [INFO] 
20:35:09 [2021-11-27T01:35:09.699Z] [INFO] --- tycho-packaging-plugin:2.2.0:validate-version (default-validate-version) @ org.eclipse.ease.lang.scriptarchive.test ---
20:35:09 [2021-11-27T01:35:09.699Z] [INFO] 
20:35:09 [2021-11-27T01:35:09.699Z] [INFO] --- maven-resources-plugin:2.4.3:resources (default-resources) @ org.eclipse.ease.lang.scriptarchive.test ---
20:35:09 [2021-11-27T01:35:09.699Z] [INFO] Using 'UTF-8' encoding to copy filtered resources.
20:35:09 [2021-11-27T01:35:09.699Z] [INFO] skip non existing resourceDirectory /home/jenkins/agent/workspace/ease.verify.core.target.2020-03/tests/org.eclipse.ease.lang.scriptarchive.test/src/main/resources
20:35:09 [2021-11-27T01:35:09.699Z] [INFO] 
20:35:09 [2021-11-27T01:35:09.699Z] [INFO] --- tycho-compiler-plugin:2.2.0:compile (default-compile) @ org.eclipse.ease.lang.scriptarchive.test ---
20:35:09 [2021-11-27T01:35:09.699Z] [INFO] Compiling 1 source file to /home/jenkins/agent/workspace/ease.verify.core.target.2020-03/tests/org.eclipse.ease.lang.scriptarchive.test/target/classes
20:35:09 [2021-11-27T01:35:09.699Z] [INFO] 
20:35:09 [2021-11-27T01:35:09.699Z] [INFO] --- maven-resources-plugin:2.4.3:testResources (default-testResources) @ org.eclipse.ease.lang.scriptarchive.test ---
20:35:09 [2021-11-27T01:35:09.699Z] [INFO] Using 'UTF-8' encoding to copy filtered resources.
20:35:09 [2021-11-27T01:35:09.699Z] [INFO] skip non existing resourceDirectory /home/jenkins/agent/workspace/ease.verify.core.target.2020-03/tests/org.eclipse.ease.lang.scriptarchive.test/src/test/resources
20:35:09 [2021-11-27T01:35:09.699Z] [INFO] 
20:35:09 [2021-11-27T01:35:09.700Z] [INFO] --- target-platform-configuration:2.2.0:target-platform (default-target-platform) @ org.eclipse.ease.lang.scriptarchive.test ---
20:35:09 [2021-11-27T01:35:09.700Z] [INFO] 
20:35:09 [2021-11-27T01:35:09.700Z] [INFO] --- tycho-packaging-plugin:2.2.0:package-plugin (default-package-plugin) @ org.eclipse.ease.lang.scriptarchive.test ---
20:35:09 [2021-11-27T01:35:09.700Z] [INFO] Building jar: /home/jenkins/agent/workspace/ease.verify.core.target.2020-03/tests/org.eclipse.ease.lang.scriptarchive.test/target/org.eclipse.ease.lang.scriptarchive.test-0.9.0-SNAPSHOT.jar
20:35:09 [2021-11-27T01:35:09.700Z] [INFO] 
20:35:09 [2021-11-27T01:35:09.700Z] [INFO] --- tycho-p2-plugin:2.2.0:p2-metadata-default (default-p2-metadata-default) @ org.eclipse.ease.lang.scriptarchive.test ---
20:35:09 [2021-11-27T01:35:09.700Z] [INFO] 
20:35:09 [2021-11-27T01:35:09.700Z] [INFO] --- jacoco-maven-plugin:0.8.6:prepare-agent (jacoco-initialize) @ org.eclipse.ease.lang.scriptarchive.test ---
20:35:09 [2021-11-27T01:35:09.700Z] [INFO] tycho.testArgLine set to -javaagent:/home/jenkins/.m2/repository/org/jacoco/org.jacoco.agent/0.8.6/org.jacoco.agent-0.8.6-runtime.jar=destfile=/home/jenkins/agent/workspace/ease.verify.core.target.2020-03/tests/org.eclipse.ease.lang.scriptarchive.test/target/jacoco.exec,output=file
20:35:09 [2021-11-27T01:35:09.700Z] [INFO] 
20:35:09 [2021-11-27T01:35:09.700Z] [INFO] --- tycho-surefire-plugin:2.2.0:test (default-test) @ org.eclipse.ease.lang.scriptarchive.test ---
20:35:09 [2021-11-27T01:35:09.700Z] [INFO] Executing Test Runtime with timeout 0, logs (if any) will be placed at: /home/jenkins/agent/workspace/ease.verify.core.target.2020-03/tests/org.eclipse.ease.lang.scriptarchive.test/target/work/data/.metadata/.log
20:35:09 [2021-11-27T01:35:09.700Z] [INFO] Command line:
20:35:09 [2021-11-27T01:35:09.700Z] 	[/opt/tools/java/openjdk/jdk-15/15.0.2+7/bin/java, -Dosgi.noShutdown=false, -Dosgi.os=linux, -Dosgi.ws=gtk, -Dosgi.arch=x86_64, -javaagent:/home/jenkins/.m2/repository/org/jacoco/org.jacoco.agent/0.8.6/org.jacoco.agent-0.8.6-runtime.jar=destfile=/home/jenkins/agent/workspace/ease.verify.core.target.2020-03/tests/org.eclipse.ease.lang.scriptarchive.test/target/jacoco.exec,output=file, -Dosgi.clean=true, -jar, /home/jenkins/.m2/repository/p2/osgi/bundle/org.eclipse.equinox.launcher/1.6.300.v20210813-1054/org.eclipse.equinox.launcher-1.6.300.v20210813-1054.jar, -data, /home/jenkins/agent/workspace/ease.verify.core.target.2020-03/tests/org.eclipse.ease.lang.scriptarchive.test/target/work/data, -install, /home/jenkins/agent/workspace/ease.verify.core.target.2020-03/tests/org.eclipse.ease.lang.scriptarchive.test/target/work, -configuration, /home/jenkins/agent/workspace/ease.verify.core.target.2020-03/tests/org.eclipse.ease.lang.scriptarchive.test/target/work/configuration, -application, org.eclipse.tycho.surefire.osgibooter.headlesstest, -testproperties, /home/jenkins/agent/workspace/ease.verify.core.target.2020-03/tests/org.eclipse.ease.lang.scriptarchive.test/target/surefire.properties]
20:35:09 [2021-11-27T01:35:09.700Z] Picked up JAVA_TOOL_OPTIONS: -Dmaven.ext.class.path="/home/jenkins/agent/workspace/ease.verify.core.target.2020-03@tmp/withMavencb38ccb9/pipeline-maven-spy.jar" -Dorg.jenkinsci.plugins.pipeline.maven.reportsFolder="/home/jenkins/agent/workspace/ease.verify.core.target.2020-03@tmp/withMavencb38ccb9" 
20:35:13 [2021-11-27T01:35:13.051Z] Running org.eclipse.ease.lang.scriptarchive.ArchiveEngineTest
20:35:13 [2021-11-27T01:35:13.051Z] We are running from a zip file!
20:35:13 [2021-11-27T01:35:13.308Z] org.eclipse.ease.ScriptExecutionException: SyntaxError: missing ; before statement (workspace://__EASE_ScriptArchive_1/scripts/Master.js#3)
20:35:13 [2021-11-27T01:35:13.308Z] this is an error
20:35:13 [2021-11-27T01:35:13.308Z]        ^
20:35:13 [2021-11-27T01:35:13.308Z] 	at Master.js,workspace://__EASE_ScriptArchive_1/scripts/Master.js
20:35:13 [2021-11-27T01:35:13.308Z] org.eclipse.ease.ScriptExecutionException: SyntaxError: missing ; before statement (workspace://__EASE_ScriptArchive_1/scripts/Master.js#3)
20:35:13 [2021-11-27T01:35:13.308Z] this is an error
20:35:13 [2021-11-27T01:35:13.308Z]        ^
20:35:13 [2021-11-27T01:35:13.309Z] 	at Master.js,workspace://__EASE_ScriptArchive_1/scripts/Master.js
20:35:13 [2021-11-27T01:35:13.309Z] Tests run: 7, Failures: 0, Errors: 0, Skipped: 0, Time elapsed: 0.861 s - in org.eclipse.ease.lang.scriptarchive.ArchiveEngineTest
20:35:13 [2021-11-27T01:35:13.309Z] executeWithManifest  Time elapsed: 0.692 s
20:35:13 [2021-11-27T01:35:13.309Z] zipFileRegistration  Time elapsed: 0.034 s
20:35:13 [2021-11-27T01:35:13.309Z] engineIdRegistration  Time elapsed: 0 s
20:35:13 [2021-11-27T01:35:13.309Z] jarFileRegistration  Time elapsed: 0.001 s
20:35:13 [2021-11-27T01:35:13.309Z] sarFileRegistration  Time elapsed: 0.001 s
20:35:13 [2021-11-27T01:35:13.309Z] executeWithErrors  Time elapsed: 0.048 s
20:35:13 [2021-11-27T01:35:13.309Z] executeWithIncludes  Time elapsed: 0.072 s
20:35:13 [2021-11-27T01:35:13.309Z] 
20:35:13 [2021-11-27T01:35:13.309Z] Results:
20:35:13 [2021-11-27T01:35:13.309Z] 
20:35:13 [2021-11-27T01:35:13.309Z] Tests run: 7, Failures: 0, Errors: 0, Skipped: 0
20:35:13 [2021-11-27T01:35:13.309Z] 
20:35:13 [2021-11-27T01:35:13.565Z] [INFO] All tests passed!
20:35:13 [2021-11-27T01:35:13.565Z] [INFO] 
20:35:13 [2021-11-27T01:35:13.566Z] [INFO] --- maven-pmd-plugin:3.15.0:pmd (pmd-integration) @ org.eclipse.ease.lang.scriptarchive.test ---
20:35:13 [2021-11-27T01:35:13.566Z] [INFO] PMD version: 6.38.0
20:35:13 [2021-11-27T01:35:13.566Z] [WARNING] Could not find class org.eclipse.ease.lang.scriptarchive.ArchiveEngineTest, due to: java.lang.IncompatibleClassChangeError: class net.sourceforge.pmd.lang.java.typeresolution.visitors.PMDASMVisitor has interface org.objectweb.asm.ClassVisitor as super class
20:35:13 [2021-11-27T01:35:13.823Z] [INFO] 
20:35:13 [2021-11-27T01:35:13.823Z] [INFO] --- maven-pmd-plugin:3.15.0:cpd (pmd-integration) @ org.eclipse.ease.lang.scriptarchive.test ---
20:35:13 [2021-11-27T01:35:13.823Z] [INFO] PMD version: 6.38.0
20:35:13 [2021-11-27T01:35:13.823Z] [INFO] 
20:35:13 [2021-11-27T01:35:13.823Z] [INFO] --- spotbugs-maven-plugin:4.1.4:spotbugs (spotbugs-integration) @ org.eclipse.ease.lang.scriptarchive.test ---
20:35:13 [2021-11-27T01:35:13.823Z] [INFO] Fork Value is false
20:35:13 [2021-11-27T01:35:13.823Z]      [java] JVM args ignored when same JVM is used.
20:35:16 [2021-11-27T01:35:16.396Z] [INFO] Done SpotBugs Analysis....
20:35:16 [2021-11-27T01:35:16.396Z] [INFO] 
20:35:16 [2021-11-27T01:35:16.396Z] [INFO] --- maven-checkstyle-plugin:3.1.1:check (checkstyle-integration) @ org.eclipse.ease.lang.scriptarchive.test ---
20:35:16 [2021-11-27T01:35:16.396Z] [INFO] You have 0 Checkstyle violations.
20:35:16 [2021-11-27T01:35:16.396Z] [INFO] 
20:35:16 [2021-11-27T01:35:16.396Z] [INFO] --- maven-install-plugin:2.3.1:install (default-install) @ org.eclipse.ease.lang.scriptarchive.test ---
20:35:16 [2021-11-27T01:35:16.397Z] [INFO] Installing /home/jenkins/agent/workspace/ease.verify.core.target.2020-03/tests/org.eclipse.ease.lang.scriptarchive.test/target/org.eclipse.ease.lang.scriptarchive.test-0.9.0-SNAPSHOT.jar to /home/jenkins/.m2/repository/org/eclipse/ease/org.eclipse.ease.lang.scriptarchive.test/0.9.0-SNAPSHOT/org.eclipse.ease.lang.scriptarchive.test-0.9.0-SNAPSHOT.jar
20:35:16 [2021-11-27T01:35:16.397Z] [INFO] Installing /home/jenkins/agent/workspace/ease.verify.core.target.2020-03/tests/org.eclipse.ease.lang.scriptarchive.test/pom.xml to /home/jenkins/.m2/repository/org/eclipse/ease/org.eclipse.ease.lang.scriptarchive.test/0.9.0-SNAPSHOT/org.eclipse.ease.lang.scriptarchive.test-0.9.0-SNAPSHOT.pom
20:35:16 [2021-11-27T01:35:16.397Z] [INFO] Installing /home/jenkins/agent/workspace/ease.verify.core.target.2020-03/tests/org.eclipse.ease.lang.scriptarchive.test/target/p2content.xml to /home/jenkins/.m2/repository/org/eclipse/ease/org.eclipse.ease.lang.scriptarchive.test/0.9.0-SNAPSHOT/org.eclipse.ease.lang.scriptarchive.test-0.9.0-SNAPSHOT-p2metadata.xml
20:35:16 [2021-11-27T01:35:16.397Z] [INFO] Installing /home/jenkins/agent/workspace/ease.verify.core.target.2020-03/tests/org.eclipse.ease.lang.scriptarchive.test/target/p2artifacts.xml to /home/jenkins/.m2/repository/org/eclipse/ease/org.eclipse.ease.lang.scriptarchive.test/0.9.0-SNAPSHOT/org.eclipse.ease.lang.scriptarchive.test-0.9.0-SNAPSHOT-p2artifacts.xml
20:35:16 [2021-11-27T01:35:16.397Z] [INFO] 
20:35:16 [2021-11-27T01:35:16.397Z] [INFO] --- tycho-p2-plugin:2.2.0:update-local-index (default-update-local-index) @ org.eclipse.ease.lang.scriptarchive.test ---
20:35:16 [2021-11-27T01:35:16.397Z] [INFO] 
20:35:16 [2021-11-27T01:35:16.397Z] [INFO] --------< org.eclipse.ease:org.eclipse.ease.lang.unittest.test >--------
20:35:16 [2021-11-27T01:35:16.397Z] [INFO] Building org.eclipse.ease.lang.unittest.test 0.9.0-SNAPSHOT      [44/49]
20:35:16 [2021-11-27T01:35:16.397Z] [INFO] ------------------------[ eclipse-test-plugin ]-------------------------
20:35:16 [2021-11-27T01:35:16.397Z] [INFO] 
20:35:16 [2021-11-27T01:35:16.397Z] [INFO] --- maven-clean-plugin:2.5:clean (default-clean) @ org.eclipse.ease.lang.unittest.test ---
20:35:16 [2021-11-27T01:35:16.397Z] [INFO] 
20:35:16 [2021-11-27T01:35:16.397Z] [INFO] --- tycho-packaging-plugin:2.2.0:build-qualifier (default-build-qualifier) @ org.eclipse.ease.lang.unittest.test ---
20:35:16 [2021-11-27T01:35:16.397Z] [INFO] The project's OSGi version is 0.9.0.I202111240844
20:35:16 [2021-11-27T01:35:16.397Z] [INFO] 
20:35:16 [2021-11-27T01:35:16.397Z] [INFO] --- tycho-packaging-plugin:2.2.0:validate-id (default-validate-id) @ org.eclipse.ease.lang.unittest.test ---
20:35:16 [2021-11-27T01:35:16.397Z] [INFO] 
20:35:16 [2021-11-27T01:35:16.397Z] [INFO] --- tycho-packaging-plugin:2.2.0:validate-version (default-validate-version) @ org.eclipse.ease.lang.unittest.test ---
20:35:16 [2021-11-27T01:35:16.397Z] [INFO] 
20:35:16 [2021-11-27T01:35:16.397Z] [INFO] --- maven-resources-plugin:2.4.3:resources (default-resources) @ org.eclipse.ease.lang.unittest.test ---
20:35:16 [2021-11-27T01:35:16.397Z] [INFO] Using 'UTF-8' encoding to copy filtered resources.
20:35:16 [2021-11-27T01:35:16.397Z] [INFO] skip non existing resourceDirectory /home/jenkins/agent/workspace/ease.verify.core.target.2020-03/tests/org.eclipse.ease.lang.unittest.test/src/main/resources
20:35:16 [2021-11-27T01:35:16.397Z] [INFO] 
20:35:16 [2021-11-27T01:35:16.398Z] [INFO] --- tycho-compiler-plugin:2.2.0:compile (default-compile) @ org.eclipse.ease.lang.unittest.test ---
20:35:16 [2021-11-27T01:35:16.398Z] [INFO] Compiling 8 source files to /home/jenkins/agent/workspace/ease.verify.core.target.2020-03/tests/org.eclipse.ease.lang.unittest.test/target/classes
20:35:16 [2021-11-27T01:35:16.398Z] [INFO] 
20:35:16 [2021-11-27T01:35:16.398Z] [INFO] --- maven-resources-plugin:2.4.3:testResources (default-testResources) @ org.eclipse.ease.lang.unittest.test ---
20:35:16 [2021-11-27T01:35:16.398Z] [INFO] Using 'UTF-8' encoding to copy filtered resources.
20:35:16 [2021-11-27T01:35:16.398Z] [INFO] skip non existing resourceDirectory /home/jenkins/agent/workspace/ease.verify.core.target.2020-03/tests/org.eclipse.ease.lang.unittest.test/src/test/resources
20:35:16 [2021-11-27T01:35:16.398Z] [INFO] 
20:35:16 [2021-11-27T01:35:16.398Z] [INFO] --- target-platform-configuration:2.2.0:target-platform (default-target-platform) @ org.eclipse.ease.lang.unittest.test ---
20:35:16 [2021-11-27T01:35:16.398Z] [INFO] 
20:35:16 [2021-11-27T01:35:16.398Z] [INFO] --- tycho-packaging-plugin:2.2.0:package-plugin (default-package-plugin) @ org.eclipse.ease.lang.unittest.test ---
20:35:16 [2021-11-27T01:35:16.398Z] [INFO] Building jar: /home/jenkins/agent/workspace/ease.verify.core.target.2020-03/tests/org.eclipse.ease.lang.unittest.test/target/org.eclipse.ease.lang.unittest.test-0.9.0-SNAPSHOT.jar
20:35:16 [2021-11-27T01:35:16.398Z] [INFO] 
20:35:16 [2021-11-27T01:35:16.398Z] [INFO] --- tycho-p2-plugin:2.2.0:p2-metadata-default (default-p2-metadata-default) @ org.eclipse.ease.lang.unittest.test ---
20:35:16 [2021-11-27T01:35:16.398Z] [INFO] 
20:35:16 [2021-11-27T01:35:16.398Z] [INFO] --- jacoco-maven-plugin:0.8.6:prepare-agent (jacoco-initialize) @ org.eclipse.ease.lang.unittest.test ---
20:35:16 [2021-11-27T01:35:16.398Z] [INFO] tycho.testArgLine set to -javaagent:/home/jenkins/.m2/repository/org/jacoco/org.jacoco.agent/0.8.6/org.jacoco.agent-0.8.6-runtime.jar=destfile=/home/jenkins/agent/workspace/ease.verify.core.target.2020-03/tests/org.eclipse.ease.lang.unittest.test/target/jacoco.exec,output=file
20:35:16 [2021-11-27T01:35:16.398Z] [INFO] 
20:35:16 [2021-11-27T01:35:16.398Z] [INFO] --- tycho-surefire-plugin:2.2.0:test (default-test) @ org.eclipse.ease.lang.unittest.test ---
20:35:16 [2021-11-27T01:35:16.655Z] [INFO] Executing Test Runtime with timeout 0, logs (if any) will be placed at: /home/jenkins/agent/workspace/ease.verify.core.target.2020-03/tests/org.eclipse.ease.lang.unittest.test/target/work/data/.metadata/.log
20:35:16 [2021-11-27T01:35:16.655Z] [INFO] Command line:
20:35:16 [2021-11-27T01:35:16.656Z] 	[/opt/tools/java/openjdk/jdk-15/15.0.2+7/bin/java, -Dosgi.noShutdown=false, -Dosgi.os=linux, -Dosgi.ws=gtk, -Dosgi.arch=x86_64, -javaagent:/home/jenkins/.m2/repository/org/jacoco/org.jacoco.agent/0.8.6/org.jacoco.agent-0.8.6-runtime.jar=destfile=/home/jenkins/agent/workspace/ease.verify.core.target.2020-03/tests/org.eclipse.ease.lang.unittest.test/target/jacoco.exec,output=file, -Dosgi.clean=true, -jar, /home/jenkins/.m2/repository/p2/osgi/bundle/org.eclipse.equinox.launcher/1.6.300.v20210813-1054/org.eclipse.equinox.launcher-1.6.300.v20210813-1054.jar, -data, /home/jenkins/agent/workspace/ease.verify.core.target.2020-03/tests/org.eclipse.ease.lang.unittest.test/target/work/data, -install, /home/jenkins/agent/workspace/ease.verify.core.target.2020-03/tests/org.eclipse.ease.lang.unittest.test/target/work, -configuration, /home/jenkins/agent/workspace/ease.verify.core.target.2020-03/tests/org.eclipse.ease.lang.unittest.test/target/work/configuration, -application, org.eclipse.tycho.surefire.osgibooter.headlesstest, -testproperties, /home/jenkins/agent/workspace/ease.verify.core.target.2020-03/tests/org.eclipse.ease.lang.unittest.test/target/surefire.properties]
20:35:16 [2021-11-27T01:35:16.656Z] Picked up JAVA_TOOL_OPTIONS: -Dmaven.ext.class.path="/home/jenkins/agent/workspace/ease.verify.core.target.2020-03@tmp/withMavencb38ccb9/pipeline-maven-spy.jar" -Dorg.jenkinsci.plugins.pipeline.maven.reportsFolder="/home/jenkins/agent/workspace/ease.verify.core.target.2020-03@tmp/withMavencb38ccb9" 
20:35:19 [2021-11-27T01:35:19.948Z] Running org.eclipse.ease.lang.unittest.runtime.impl.TestTest
20:35:20 [2021-11-27T01:35:20.882Z] Tests run: 30, Failures: 0, Errors: 0, Skipped: 0, Time elapsed: 1.112 s - in org.eclipse.ease.lang.unittest.runtime.impl.TestTest
20:35:20 [2021-11-27T01:35:20.882Z] reset_clears_results  Time elapsed: 0.037 s
20:35:20 [2021-11-27T01:35:20.882Z] hasError_is_false_when_no_error_exists  Time elapsed: 0.001 s
20:35:20 [2021-11-27T01:35:20.882Z] getDuration_is_0_for_not_executed_test  Time elapsed: 0.001 s
20:35:20 [2021-11-27T01:35:20.882Z] getStatus_is_DISABLED_when_1_result_is_disabled  Time elapsed: 0.002 s
20:35:20 [2021-11-27T01:35:20.882Z] reset_clears_status  Time elapsed: 0.125 s
20:35:20 [2021-11-27T01:35:20.882Z] getResults_FAILURE_returns_only_matching_results  Time elapsed: 0.001 s
20:35:20 [2021-11-27T01:35:20.882Z] isDisabled_is_false_for_finished_test  Time elapsed: 0 s
20:35:20 [2021-11-27T01:35:20.882Z] getStatus_is_DISABLED_when_entity_status_is_disabled  Time elapsed: 0.001 s
20:35:20 [2021-11-27T01:35:20.882Z] getStatus_is_status_of_worst_result  Time elapsed: 0 s
20:35:20 [2021-11-27T01:35:20.882Z] getEstimatedDuration_is_minus_1_by_default  Time elapsed: 0.001 s
20:35:20 [2021-11-27T01:35:20.882Z] getDuration_returns_current_execution_time_for_running_test  Time elapsed: 0.201 s
20:35:20 [2021-11-27T01:35:20.882Z] setDisabled_marks_test_as_disabled  Time elapsed: 0 s
20:35:20 [2021-11-27T01:35:20.882Z] getStatus_is_entity_status_if_it_is_the_worst_status  Time elapsed: 0 s
20:35:20 [2021-11-27T01:35:20.882Z] reset_clears_timestamps  Time elapsed: 0 s
20:35:20 [2021-11-27T01:35:20.882Z] getResource_returns_parent_resource  Time elapsed: 0.005 s
20:35:20 [2021-11-27T01:35:20.882Z] isDisabled_is_true_when_1_result_is_DISABLED  Time elapsed: 0.001 s
20:35:20 [2021-11-27T01:35:20.882Z] getFullPath_returns_test_name  Time elapsed: 0 s
20:35:20 [2021-11-27T01:35:20.882Z] getDuration_returns_execution_time_for_completed_test  Time elapsed: 0.101 s
20:35:20 [2021-11-27T01:35:20.882Z] addError_adds_error_result  Time elapsed: 0.365 s
20:35:20 [2021-11-27T01:35:20.882Z] getFullPath_returns_parent_path_and_test_name  Time elapsed: 0.001 s
20:35:20 [2021-11-27T01:35:20.882Z] reset_clears_metadata  Time elapsed: 0.001 s
20:35:20 [2021-11-27T01:35:20.882Z] getRoot_returns_root_element  Time elapsed: 0 s
20:35:20 [2021-11-27T01:35:20.882Z] hasError_is_true_when_error_exists  Time elapsed: 0 s
20:35:20 [2021-11-27T01:35:20.882Z] setEntityStatus_FINISHED_sets_end_timestamp  Time elapsed: 0.002 s
20:35:20 [2021-11-27T01:35:20.882Z] getWorstResult_returns_worst_execution_result  Time elapsed: 0 s
20:35:20 [2021-11-27T01:35:20.883Z] getTestSuite_returns_master_suite  Time elapsed: 0.001 s
20:35:20 [2021-11-27T01:35:20.883Z] isDisabled_is_true_when_status_is_DISABLED  Time elapsed: 0 s
20:35:20 [2021-11-27T01:35:20.883Z] setEntityStatus_RUNNING_sets_start_timestamp  Time elapsed: 0 s
20:35:20 [2021-11-27T01:35:20.883Z] setEndTimestamp_verifies_duration_limit  Time elapsed: 0.022 s
20:35:20 [2021-11-27T01:35:20.883Z] setStackTrace_stores_a_clone_of_the_trace  Time elapsed: 0.215 s
20:35:20 [2021-11-27T01:35:20.883Z] Running org.eclipse.ease.lang.unittest.runtime.impl.TestEntityTest
20:35:21 [2021-11-27T01:35:21.141Z] Tests run: 28, Failures: 0, Errors: 0, Skipped: 0, Time elapsed: 0.317 s - in org.eclipse.ease.lang.unittest.runtime.impl.TestEntityTest
20:35:21 [2021-11-27T01:35:21.141Z] reset_clears_results  Time elapsed: 0 s
20:35:21 [2021-11-27T01:35:21.141Z] hasError_is_false_when_no_error_exists  Time elapsed: 0 s
20:35:21 [2021-11-27T01:35:21.141Z] getDuration_is_0_for_not_executed_test  Time elapsed: 0.001 s
20:35:21 [2021-11-27T01:35:21.141Z] getStatus_is_DISABLED_when_1_result_is_disabled  Time elapsed: 0 s
20:35:21 [2021-11-27T01:35:21.141Z] reset_clears_status  Time elapsed: 0 s
20:35:21 [2021-11-27T01:35:21.141Z] getResults_FAILURE_returns_only_matching_results  Time elapsed: 0.001 s
20:35:21 [2021-11-27T01:35:21.141Z] isDisabled_is_false_for_finished_test  Time elapsed: 0 s
20:35:21 [2021-11-27T01:35:21.141Z] getStatus_is_DISABLED_when_entity_status_is_disabled  Time elapsed: 0 s
20:35:21 [2021-11-27T01:35:21.141Z] getStatus_is_status_of_worst_result  Time elapsed: 0.001 s
20:35:21 [2021-11-27T01:35:21.141Z] getEstimatedDuration_is_minus_1_by_default  Time elapsed: 0 s
20:35:21 [2021-11-27T01:35:21.141Z] getDuration_returns_current_execution_time_for_running_test  Time elapsed: 0.201 s
20:35:21 [2021-11-27T01:35:21.141Z] setDisabled_marks_test_as_disabled  Time elapsed: 0.001 s
20:35:21 [2021-11-27T01:35:21.141Z] getStatus_is_entity_status_if_it_is_the_worst_status  Time elapsed: 0 s
20:35:21 [2021-11-27T01:35:21.141Z] reset_clears_timestamps  Time elapsed: 0 s
20:35:21 [2021-11-27T01:35:21.141Z] getResource_returns_parent_resource  Time elapsed: 0 s
20:35:21 [2021-11-27T01:35:21.141Z] isDisabled_is_true_when_1_result_is_DISABLED  Time elapsed: 0 s
20:35:21 [2021-11-27T01:35:21.141Z] getFullPath_returns_test_name  Time elapsed: 0 s
20:35:21 [2021-11-27T01:35:21.141Z] getDuration_returns_execution_time_for_completed_test  Time elapsed: 0.1 s
20:35:21 [2021-11-27T01:35:21.141Z] addError_adds_error_result  Time elapsed: 0.005 s
20:35:21 [2021-11-27T01:35:21.141Z] getFullPath_returns_parent_path_and_test_name  Time elapsed: 0 s
20:35:21 [2021-11-27T01:35:21.141Z] reset_clears_metadata  Time elapsed: 0.001 s
20:35:21 [2021-11-27T01:35:21.141Z] getRoot_returns_root_element  Time elapsed: 0 s
20:35:21 [2021-11-27T01:35:21.141Z] hasError_is_true_when_error_exists  Time elapsed: 0 s
20:35:21 [2021-11-27T01:35:21.141Z] setEntityStatus_FINISHED_sets_end_timestamp  Time elapsed: 0 s
20:35:21 [2021-11-27T01:35:21.141Z] getWorstResult_returns_worst_execution_result  Time elapsed: 0 s
20:35:21 [2021-11-27T01:35:21.141Z] getTestSuite_returns_master_suite  Time elapsed: 0.001 s
20:35:21 [2021-11-27T01:35:21.141Z] isDisabled_is_true_when_status_is_DISABLED  Time elapsed: 0 s
20:35:21 [2021-11-27T01:35:21.141Z] setEntityStatus_RUNNING_sets_start_timestamp  Time elapsed: 0 s
20:35:21 [2021-11-27T01:35:21.141Z] Running org.eclipse.ease.lang.unittest.runtime.impl.TestContainerTest
20:35:21 [2021-11-27T01:35:21.399Z] Tests run: 38, Failures: 0, Errors: 0, Skipped: 1, Time elapsed: 0.334 s - in org.eclipse.ease.lang.unittest.runtime.impl.TestContainerTest
20:35:21 [2021-11-27T01:35:21.399Z] reset_clears_results  Time elapsed: 0 s
20:35:21 [2021-11-27T01:35:21.399Z] hasError_is_false_when_no_error_exists  Time elapsed: 0 s
20:35:21 [2021-11-27T01:35:21.399Z] getDuration_is_0_for_not_executed_test  Time elapsed: 0 s
20:35:21 [2021-11-27T01:35:21.399Z] getStatus_is_DISABLED_when_1_result_is_disabled  Time elapsed: 0 s
20:35:21 [2021-11-27T01:35:21.399Z] reset_clears_status  Time elapsed: 0.001 s
20:35:21 [2021-11-27T01:35:21.399Z] getResults_FAILURE_returns_only_matching_results  Time elapsed: 0 s
20:35:21 [2021-11-27T01:35:21.399Z] isDisabled_is_false_for_finished_test  Time elapsed: 0 s
20:35:21 [2021-11-27T01:35:21.399Z] getStatus_is_DISABLED_when_entity_status_is_disabled  Time elapsed: 0.001 s
20:35:21 [2021-11-27T01:35:21.399Z] getStatus_is_status_of_worst_result  Time elapsed: 0 s
20:35:21 [2021-11-27T01:35:21.399Z] getEstimatedDuration_is_minus_1_by_default  Time elapsed: 0 s
20:35:21 [2021-11-27T01:35:21.399Z] getDuration_returns_current_execution_time_for_running_test  Time elapsed: 0.201 s
20:35:21 [2021-11-27T01:35:21.399Z] setDisabled_marks_test_as_disabled  Time elapsed: 0 s
20:35:21 [2021-11-27T01:35:21.399Z] getStatus_is_entity_status_if_it_is_the_worst_status  Time elapsed: 0.001 s
20:35:21 [2021-11-27T01:35:21.399Z] reset_clears_timestamps  Time elapsed: 0 s
20:35:21 [2021-11-27T01:35:21.399Z] isDisabled_is_true_when_1_result_is_DISABLED  Time elapsed: 0 s
20:35:21 [2021-11-27T01:35:21.399Z] getFullPath_returns_test_name  Time elapsed: 0.001 s
20:35:21 [2021-11-27T01:35:21.399Z] getDuration_returns_execution_time_for_completed_test  Time elapsed: 0.101 s
20:35:21 [2021-11-27T01:35:21.399Z] addError_adds_error_result  Time elapsed: 0 s
20:35:21 [2021-11-27T01:35:21.399Z] getFullPath_returns_parent_path_and_test_name  Time elapsed: 0.001 s
20:35:21 [2021-11-27T01:35:21.399Z] reset_clears_metadata  Time elapsed: 0 s
20:35:21 [2021-11-27T01:35:21.399Z] getRoot_returns_root_element  Time elapsed: 0 s
20:35:21 [2021-11-27T01:35:21.399Z] hasError_is_true_when_error_exists  Time elapsed: 0.001 s
20:35:21 [2021-11-27T01:35:21.399Z] setEntityStatus_FINISHED_sets_end_timestamp  Time elapsed: 0 s
20:35:21 [2021-11-27T01:35:21.399Z] getWorstResult_returns_worst_execution_result  Time elapsed: 0 s
20:35:21 [2021-11-27T01:35:21.399Z] getTestSuite_returns_master_suite  Time elapsed: 0 s
20:35:21 [2021-11-27T01:35:21.399Z] isDisabled_is_true_when_status_is_DISABLED  Time elapsed: 0 s
20:35:21 [2021-11-27T01:35:21.399Z] setEntityStatus_RUNNING_sets_start_timestamp  Time elapsed: 0 s
20:35:21 [2021-11-27T01:35:21.399Z] hasError_queries_children_for_error_status  Time elapsed: 0.002 s
20:35:21 [2021-11-27T01:35:21.399Z] setTerminated_terminates_children_too  Time elapsed: 0 s
20:35:21 [2021-11-27T01:35:21.399Z] getTest_is_null_when_child_test_does_not_exist  Time elapsed: 0 s
20:35:21 [2021-11-27T01:35:21.399Z] getTest_returns_child_with_matching_name  Time elapsed: 0 s
20:35:21 [2021-11-27T01:35:21.399Z] getEstimatedDuration_sums_child_estimations  Time elapsed: 0 s
20:35:21 [2021-11-27T01:35:21.399Z] reset_deletes_children_of_type_ITest  Time elapsed: 0 s
20:35:21 [2021-11-27T01:35:21.399Z] getResource_returns_parent_resource skipped
20:35:21 [2021-11-27T01:35:21.399Z] getStatus_returns_worst_child_status  Time elapsed: 0 s
20:35:21 [2021-11-27T01:35:21.399Z] getChildContainers_returns_only_containers  Time elapsed: 0 s
20:35:21 [2021-11-27T01:35:21.399Z] getStatus_returns_entity_status  Time elapsed: 0.001 s
20:35:21 [2021-11-27T01:35:21.400Z] run_executes_each_child  Time elapsed: 0.013 s
20:35:21 [2021-11-27T01:35:21.400Z] Running org.eclipse.ease.lang.unittest.runtime.impl.TestFileTest
20:35:21 [2021-11-27T01:35:21.962Z] Tests run: 43, Failures: 0, Errors: 0, Skipped: 2, Time elapsed: 0.417 s - in org.eclipse.ease.lang.unittest.runtime.impl.TestFileTest
20:35:21 [2021-11-27T01:35:21.962Z] reset_clears_results  Time elapsed: 0 s
20:35:21 [2021-11-27T01:35:21.962Z] hasError_is_false_when_no_error_exists  Time elapsed: 0 s
20:35:21 [2021-11-27T01:35:21.962Z] getDuration_is_0_for_not_executed_test  Time elapsed: 0 s
20:35:21 [2021-11-27T01:35:21.962Z] getStatus_is_DISABLED_when_1_result_is_disabled  Time elapsed: 0 s
20:35:21 [2021-11-27T01:35:21.962Z] reset_clears_status  Time elapsed: 0 s
20:35:21 [2021-11-27T01:35:21.962Z] getResults_FAILURE_returns_only_matching_results  Time elapsed: 0 s
20:35:21 [2021-11-27T01:35:21.962Z] isDisabled_is_false_for_finished_test  Time elapsed: 0 s
20:35:21 [2021-11-27T01:35:21.962Z] getStatus_is_DISABLED_when_entity_status_is_disabled  Time elapsed: 0 s
20:35:21 [2021-11-27T01:35:21.962Z] getStatus_is_status_of_worst_result  Time elapsed: 0 s
20:35:21 [2021-11-27T01:35:21.962Z] getEstimatedDuration_is_minus_1_by_default  Time elapsed: 0 s
20:35:21 [2021-11-27T01:35:21.962Z] getDuration_returns_current_execution_time_for_running_test  Time elapsed: 0.201 s
20:35:21 [2021-11-27T01:35:21.962Z] setDisabled_marks_test_as_disabled  Time elapsed: 0.001 s
20:35:21 [2021-11-27T01:35:21.963Z] getStatus_is_entity_status_if_it_is_the_worst_status  Time elapsed: 0 s
20:35:21 [2021-11-27T01:35:21.963Z] reset_clears_timestamps  Time elapsed: 0.001 s
20:35:21 [2021-11-27T01:35:21.963Z] isDisabled_is_true_when_1_result_is_DISABLED  Time elapsed: 0 s
20:35:21 [2021-11-27T01:35:21.963Z] getFullPath_returns_test_name  Time elapsed: 0.001 s
20:35:21 [2021-11-27T01:35:21.963Z] getDuration_returns_execution_time_for_completed_test  Time elapsed: 0.1 s
20:35:21 [2021-11-27T01:35:21.963Z] addError_adds_error_result  Time elapsed: 0 s
20:35:21 [2021-11-27T01:35:21.963Z] getFullPath_returns_parent_path_and_test_name  Time elapsed: 0 s
20:35:21 [2021-11-27T01:35:21.963Z] reset_clears_metadata  Time elapsed: 0 s
20:35:21 [2021-11-27T01:35:21.963Z] getRoot_returns_root_element  Time elapsed: 0 s
20:35:21 [2021-11-27T01:35:21.963Z] hasError_is_true_when_error_exists  Time elapsed: 0 s
20:35:21 [2021-11-27T01:35:21.963Z] setEntityStatus_FINISHED_sets_end_timestamp  Time elapsed: 0 s
20:35:21 [2021-11-27T01:35:21.963Z] getWorstResult_returns_worst_execution_result  Time elapsed: 0 s
20:35:21 [2021-11-27T01:35:21.963Z] getTestSuite_returns_master_suite  Time elapsed: 0 s
20:35:21 [2021-11-27T01:35:21.963Z] isDisabled_is_true_when_status_is_DISABLED  Time elapsed: 0 s
20:35:21 [2021-11-27T01:35:21.963Z] setEntityStatus_RUNNING_sets_start_timestamp  Time elapsed: 0 s
20:35:21 [2021-11-27T01:35:21.963Z] hasError_queries_children_for_error_status  Time elapsed: 0 s
20:35:21 [2021-11-27T01:35:21.963Z] setTerminated_terminates_children_too  Time elapsed: 0.001 s
20:35:21 [2021-11-27T01:35:21.963Z] getTest_is_null_when_child_test_does_not_exist  Time elapsed: 0 s
20:35:21 [2021-11-27T01:35:21.963Z] getTest_returns_child_with_matching_name  Time elapsed: 0 s
20:35:21 [2021-11-27T01:35:21.963Z] getEstimatedDuration_sums_child_estimations  Time elapsed: 0.001 s
20:35:21 [2021-11-27T01:35:21.963Z] reset_deletes_children_of_type_ITest  Time elapsed: 0 s
20:35:21 [2021-11-27T01:35:21.963Z] getResource_returns_parent_resource skipped
20:35:21 [2021-11-27T01:35:21.963Z] getStatus_returns_worst_child_status  Time elapsed: 0 s
20:35:21 [2021-11-27T01:35:21.963Z] getChildContainers_returns_only_containers  Time elapsed: 0 s
20:35:21 [2021-11-27T01:35:21.963Z] getStatus_returns_entity_status  Time elapsed: 0 s
20:35:21 [2021-11-27T01:35:21.963Z] getEstimatedDuration_is_0_for_disabled_status  Time elapsed: 0.001 s
20:35:21 [2021-11-27T01:35:21.963Z] run_adds_error_when_no_engine_is_found  Time elapsed: 0 s
20:35:21 [2021-11-27T01:35:21.963Z] reset_removes_error_markers_from_files  Time elapsed: 0.069 s
20:35:21 [2021-11-27T01:35:21.963Z] reset_disables_TestFile_when_set_in_suite_description  Time elapsed: 0.03 s
20:35:21 [2021-11-27T01:35:21.963Z] run_does_not_execute_disabled_tests  Time elapsed: 0 s
20:35:21 [2021-11-27T01:35:21.963Z] run_executes_each_child skipped
20:35:21 [2021-11-27T01:35:21.963Z] Running org.eclipse.ease.lang.unittest.ClassicJavaScriptTest
20:35:23 [2021-11-27T01:35:23.339Z] Tests run: 7, Failures: 0, Errors: 0, Skipped: 0, Time elapsed: 1.406 s - in org.eclipse.ease.lang.unittest.ClassicJavaScriptTest
20:35:23 [2021-11-27T01:35:23.339Z] folderStatus  Time elapsed: 0.598 s
20:35:23 [2021-11-27T01:35:23.339Z] errorTestStatus  Time elapsed: 0.163 s
20:35:23 [2021-11-27T01:35:23.339Z] failureTestStatus  Time elapsed: 0.126 s
20:35:23 [2021-11-27T01:35:23.339Z] verifyOutput  Time elapsed: 0.118 s
20:35:23 [2021-11-27T01:35:23.339Z] suiteStatus  Time elapsed: 0.097 s
20:35:23 [2021-11-27T01:35:23.339Z] ignoreTestStatus  Time elapsed: 0.094 s
20:35:23 [2021-11-27T01:35:23.339Z] passTestStatus  Time elapsed: 0.106 s
20:35:23 [2021-11-27T01:35:23.339Z] Running org.eclipse.ease.lang.unittest.ModernJavaScriptTest
20:35:24 [2021-11-27T01:35:24.274Z] Tests run: 8, Failures: 0, Errors: 0, Skipped: 0, Time elapsed: 0.913 s - in org.eclipse.ease.lang.unittest.ModernJavaScriptTest
20:35:24 [2021-11-27T01:35:24.274Z] folderStatus  Time elapsed: 0.12 s
20:35:24 [2021-11-27T01:35:24.274Z] verifyOutput  Time elapsed: 0.108 s
20:35:24 [2021-11-27T01:35:24.274Z] suiteStatus  Time elapsed: 0.145 s
20:35:24 [2021-11-27T01:35:24.274Z] ignoreTestStatus  Time elapsed: 0.105 s
20:35:24 [2021-11-27T01:35:24.274Z] ignoreTestClassStatus  Time elapsed: 0.12 s
20:35:24 [2021-11-27T01:35:24.274Z] failureTestClassStatus  Time elapsed: 0.1 s
20:35:24 [2021-11-27T01:35:24.274Z] errorTestClassStatus  Time elapsed: 0.122 s
20:35:24 [2021-11-27T01:35:24.274Z] passTestClassStatus  Time elapsed: 0.089 s
20:35:24 [2021-11-27T01:35:24.274Z] Running org.eclipse.ease.lang.unittest.adapters.HeadlessResultAdapterTest
20:35:24 [2021-11-27T01:35:24.274Z] Tests run: 7, Failures: 0, Errors: 0, Skipped: 0, Time elapsed: 0.052 s - in org.eclipse.ease.lang.unittest.adapters.HeadlessResultAdapterTest
20:35:24 [2021-11-27T01:35:24.274Z] getAdapter_declines_to_adapt_generic_object  Time elapsed: 0.001 s
20:35:24 [2021-11-27T01:35:24.274Z] getAdapter_adapts_testsuite_with_failures_to_100  Time elapsed: 0.047 s
20:35:24 [2021-11-27T01:35:24.274Z] adapter_can_be_called_via_adapter_framework  Time elapsed: 0.001 s
20:35:24 [2021-11-27T01:35:24.274Z] getAdapter_adapts_testsuite_with_errors_to_200  Time elapsed: 0.001 s
20:35:24 [2021-11-27T01:35:24.274Z] getAdapterList_returns_only_ITestSuite  Time elapsed: 0.001 s
20:35:24 [2021-11-27T01:35:24.274Z] getAdapter_adapts_testsuite_with_no_errors_to_0  Time elapsed: 0 s
20:35:24 [2021-11-27T01:35:24.274Z] getAdapter_declines_to_adapt_to_Boolean  Time elapsed: 0 s
20:35:24 [2021-11-27T01:35:24.274Z] 
20:35:24 [2021-11-27T01:35:24.275Z] Results:
20:35:24 [2021-11-27T01:35:24.275Z] 
20:35:24 [2021-11-27T01:35:24.275Z] Tests run: 161, Failures: 0, Errors: 0, Skipped: 3
20:35:24 [2021-11-27T01:35:24.275Z] 
20:35:24 [2021-11-27T01:35:24.531Z] [INFO] All tests passed!
20:35:24 [2021-11-27T01:35:24.531Z] [INFO] 
20:35:24 [2021-11-27T01:35:24.531Z] [INFO] --- maven-pmd-plugin:3.15.0:pmd (pmd-integration) @ org.eclipse.ease.lang.unittest.test ---
20:35:24 [2021-11-27T01:35:24.531Z] [INFO] PMD version: 6.38.0
20:35:24 [2021-11-27T01:35:24.531Z] [WARNING] Could not find class org.eclipse.ease.lang.unittest.ModernJavaScriptTest, due to: java.lang.IncompatibleClassChangeError: class net.sourceforge.pmd.lang.java.typeresolution.visitors.PMDASMVisitor has interface org.objectweb.asm.ClassVisitor as super class
20:35:24 [2021-11-27T01:35:24.531Z] [WARNING] Could not find class org.eclipse.ease.lang.unittest.ClassicJavaScriptTest, due to: java.lang.IncompatibleClassChangeError: class net.sourceforge.pmd.lang.java.typeresolution.visitors.PMDASMVisitor has interface org.objectweb.asm.ClassVisitor as super class
20:35:24 [2021-11-27T01:35:24.800Z] [WARNING] Could not find class org.eclipse.ease.lang.unittest.adapters.HeadlessResultAdapterTest, due to: java.lang.IncompatibleClassChangeError: class net.sourceforge.pmd.lang.java.typeresolution.visitors.PMDASMVisitor has interface org.objectweb.asm.ClassVisitor as super class
20:35:24 [2021-11-27T01:35:24.800Z] [WARNING] Could not find class org.eclipse.ease.lang.unittest.TestBase, due to: java.lang.IncompatibleClassChangeError: class net.sourceforge.pmd.lang.java.typeresolution.visitors.PMDASMVisitor has interface org.objectweb.asm.ClassVisitor as super class
20:35:24 [2021-11-27T01:35:24.800Z] [WARNING] Could not find class org.eclipse.ease.lang.unittest.runtime.impl.TestContainerTest, due to: java.lang.IncompatibleClassChangeError: class net.sourceforge.pmd.lang.java.typeresolution.visitors.PMDASMVisitor has interface org.objectweb.asm.ClassVisitor as super class
20:35:24 [2021-11-27T01:35:24.800Z] [WARNING] Could not find class org.eclipse.ease.lang.unittest.runtime.impl.TestEntityTest, due to: java.lang.IncompatibleClassChangeError: class net.sourceforge.pmd.lang.java.typeresolution.visitors.PMDASMVisitor has interface org.objectweb.asm.ClassVisitor as super class
20:35:24 [2021-11-27T01:35:24.800Z] [WARNING] Could not find class org.eclipse.ease.lang.unittest.runtime.impl.TestFileTest, due to: java.lang.IncompatibleClassChangeError: class net.sourceforge.pmd.lang.java.typeresolution.visitors.PMDASMVisitor has interface org.objectweb.asm.ClassVisitor as super class
20:35:25 [2021-11-27T01:35:25.057Z] [WARNING] Could not find class org.eclipse.ease.lang.unittest.runtime.impl.TestTest, due to: java.lang.IncompatibleClassChangeError: class net.sourceforge.pmd.lang.java.typeresolution.visitors.PMDASMVisitor has interface org.objectweb.asm.ClassVisitor as super class
20:35:25 [2021-11-27T01:35:25.057Z] [INFO] 
20:35:25 [2021-11-27T01:35:25.057Z] [INFO] --- maven-pmd-plugin:3.15.0:cpd (pmd-integration) @ org.eclipse.ease.lang.unittest.test ---
20:35:25 [2021-11-27T01:35:25.057Z] [INFO] PMD version: 6.38.0
20:35:25 [2021-11-27T01:35:25.057Z] [INFO] 
20:35:25 [2021-11-27T01:35:25.057Z] [INFO] --- spotbugs-maven-plugin:4.1.4:spotbugs (spotbugs-integration) @ org.eclipse.ease.lang.unittest.test ---
20:35:25 [2021-11-27T01:35:25.057Z] [INFO] Fork Value is false
20:35:25 [2021-11-27T01:35:25.057Z]      [java] JVM args ignored when same JVM is used.
20:35:28 [2021-11-27T01:35:28.404Z] [INFO] Done SpotBugs Analysis....
20:35:28 [2021-11-27T01:35:28.404Z] [INFO] 
20:35:28 [2021-11-27T01:35:28.404Z] [INFO] --- maven-checkstyle-plugin:3.1.1:check (checkstyle-integration) @ org.eclipse.ease.lang.unittest.test ---
20:35:28 [2021-11-27T01:35:28.404Z] [INFO] You have 0 Checkstyle violations.
20:35:28 [2021-11-27T01:35:28.405Z] [INFO] 
20:35:28 [2021-11-27T01:35:28.405Z] [INFO] --- maven-install-plugin:2.3.1:install (default-install) @ org.eclipse.ease.lang.unittest.test ---
20:35:28 [2021-11-27T01:35:28.405Z] [INFO] Installing /home/jenkins/agent/workspace/ease.verify.core.target.2020-03/tests/org.eclipse.ease.lang.unittest.test/target/org.eclipse.ease.lang.unittest.test-0.9.0-SNAPSHOT.jar to /home/jenkins/.m2/repository/org/eclipse/ease/org.eclipse.ease.lang.unittest.test/0.9.0-SNAPSHOT/org.eclipse.ease.lang.unittest.test-0.9.0-SNAPSHOT.jar
20:35:28 [2021-11-27T01:35:28.405Z] [INFO] Installing /home/jenkins/agent/workspace/ease.verify.core.target.2020-03/tests/org.eclipse.ease.lang.unittest.test/pom.xml to /home/jenkins/.m2/repository/org/eclipse/ease/org.eclipse.ease.lang.unittest.test/0.9.0-SNAPSHOT/org.eclipse.ease.lang.unittest.test-0.9.0-SNAPSHOT.pom
20:35:28 [2021-11-27T01:35:28.405Z] [INFO] Installing /home/jenkins/agent/workspace/ease.verify.core.target.2020-03/tests/org.eclipse.ease.lang.unittest.test/target/p2content.xml to /home/jenkins/.m2/repository/org/eclipse/ease/org.eclipse.ease.lang.unittest.test/0.9.0-SNAPSHOT/org.eclipse.ease.lang.unittest.test-0.9.0-SNAPSHOT-p2metadata.xml
20:35:28 [2021-11-27T01:35:28.405Z] [INFO] Installing /home/jenkins/agent/workspace/ease.verify.core.target.2020-03/tests/org.eclipse.ease.lang.unittest.test/target/p2artifacts.xml to /home/jenkins/.m2/repository/org/eclipse/ease/org.eclipse.ease.lang.unittest.test/0.9.0-SNAPSHOT/org.eclipse.ease.lang.unittest.test-0.9.0-SNAPSHOT-p2artifacts.xml
20:35:28 [2021-11-27T01:35:28.405Z] [INFO] 
20:35:28 [2021-11-27T01:35:28.405Z] [INFO] --- tycho-p2-plugin:2.2.0:update-local-index (default-update-local-index) @ org.eclipse.ease.lang.unittest.test ---
20:35:28 [2021-11-27T01:35:28.405Z] [INFO] 
20:35:28 [2021-11-27T01:35:28.405Z] [INFO] ---------< org.eclipse.ease:org.eclipse.ease.ui.scripts.test >----------
20:35:28 [2021-11-27T01:35:28.405Z] [INFO] Building org.eclipse.ease.ui.scripts.test 0.9.0-SNAPSHOT         [45/49]
20:35:28 [2021-11-27T01:35:28.405Z] [INFO] ------------------------[ eclipse-test-plugin ]-------------------------
20:35:28 [2021-11-27T01:35:28.405Z] [INFO] 
20:35:28 [2021-11-27T01:35:28.405Z] [INFO] --- maven-clean-plugin:2.5:clean (default-clean) @ org.eclipse.ease.ui.scripts.test ---
20:35:28 [2021-11-27T01:35:28.405Z] [INFO] 
20:35:28 [2021-11-27T01:35:28.405Z] [INFO] --- tycho-packaging-plugin:2.2.0:build-qualifier (default-build-qualifier) @ org.eclipse.ease.ui.scripts.test ---
20:35:28 [2021-11-27T01:35:28.405Z] [INFO] The project's OSGi version is 0.9.0.I202106220815
20:35:28 [2021-11-27T01:35:28.405Z] [INFO] 
20:35:28 [2021-11-27T01:35:28.405Z] [INFO] --- tycho-packaging-plugin:2.2.0:validate-id (default-validate-id) @ org.eclipse.ease.ui.scripts.test ---
20:35:28 [2021-11-27T01:35:28.405Z] [INFO] 
20:35:28 [2021-11-27T01:35:28.405Z] [INFO] --- tycho-packaging-plugin:2.2.0:validate-version (default-validate-version) @ org.eclipse.ease.ui.scripts.test ---
20:35:28 [2021-11-27T01:35:28.405Z] [INFO] 
20:35:28 [2021-11-27T01:35:28.405Z] [INFO] --- maven-resources-plugin:2.4.3:resources (default-resources) @ org.eclipse.ease.ui.scripts.test ---
20:35:28 [2021-11-27T01:35:28.405Z] [INFO] Using 'UTF-8' encoding to copy filtered resources.
20:35:28 [2021-11-27T01:35:28.405Z] [INFO] skip non existing resourceDirectory /home/jenkins/agent/workspace/ease.verify.core.target.2020-03/tests/org.eclipse.ease.ui.scripts.test/src/main/resources
20:35:28 [2021-11-27T01:35:28.406Z] [INFO] 
20:35:28 [2021-11-27T01:35:28.406Z] [INFO] --- tycho-compiler-plugin:2.2.0:compile (default-compile) @ org.eclipse.ease.ui.scripts.test ---
20:35:28 [2021-11-27T01:35:28.406Z] [INFO] Compiling 1 source file to /home/jenkins/agent/workspace/ease.verify.core.target.2020-03/tests/org.eclipse.ease.ui.scripts.test/target/classes
20:35:28 [2021-11-27T01:35:28.406Z] [INFO] 
20:35:28 [2021-11-27T01:35:28.406Z] [INFO] --- maven-resources-plugin:2.4.3:testResources (default-testResources) @ org.eclipse.ease.ui.scripts.test ---
20:35:28 [2021-11-27T01:35:28.406Z] [INFO] Using 'UTF-8' encoding to copy filtered resources.
20:35:28 [2021-11-27T01:35:28.406Z] [INFO] skip non existing resourceDirectory /home/jenkins/agent/workspace/ease.verify.core.target.2020-03/tests/org.eclipse.ease.ui.scripts.test/src/test/resources
20:35:28 [2021-11-27T01:35:28.406Z] [INFO] 
20:35:28 [2021-11-27T01:35:28.406Z] [INFO] --- target-platform-configuration:2.2.0:target-platform (default-target-platform) @ org.eclipse.ease.ui.scripts.test ---
20:35:28 [2021-11-27T01:35:28.406Z] [INFO] 
20:35:28 [2021-11-27T01:35:28.406Z] [INFO] --- tycho-packaging-plugin:2.2.0:package-plugin (default-package-plugin) @ org.eclipse.ease.ui.scripts.test ---
20:35:28 [2021-11-27T01:35:28.406Z] [INFO] Building jar: /home/jenkins/agent/workspace/ease.verify.core.target.2020-03/tests/org.eclipse.ease.ui.scripts.test/target/org.eclipse.ease.ui.scripts.test-0.9.0-SNAPSHOT.jar
20:35:28 [2021-11-27T01:35:28.406Z] [INFO] 
20:35:28 [2021-11-27T01:35:28.406Z] [INFO] --- tycho-p2-plugin:2.2.0:p2-metadata-default (default-p2-metadata-default) @ org.eclipse.ease.ui.scripts.test ---
20:35:28 [2021-11-27T01:35:28.406Z] [INFO] 
20:35:28 [2021-11-27T01:35:28.406Z] [INFO] --- jacoco-maven-plugin:0.8.6:prepare-agent (jacoco-initialize) @ org.eclipse.ease.ui.scripts.test ---
20:35:28 [2021-11-27T01:35:28.406Z] [INFO] tycho.testArgLine set to -javaagent:/home/jenkins/.m2/repository/org/jacoco/org.jacoco.agent/0.8.6/org.jacoco.agent-0.8.6-runtime.jar=destfile=/home/jenkins/agent/workspace/ease.verify.core.target.2020-03/tests/org.eclipse.ease.ui.scripts.test/target/jacoco.exec,output=file
20:35:28 [2021-11-27T01:35:28.406Z] [INFO] 
20:35:28 [2021-11-27T01:35:28.406Z] [INFO] --- tycho-surefire-plugin:2.2.0:test (default-test) @ org.eclipse.ease.ui.scripts.test ---
20:35:28 [2021-11-27T01:35:28.406Z] [INFO] Executing Test Runtime with timeout 0, logs (if any) will be placed at: /home/jenkins/agent/workspace/ease.verify.core.target.2020-03/tests/org.eclipse.ease.ui.scripts.test/target/work/data/.metadata/.log
20:35:28 [2021-11-27T01:35:28.406Z] [INFO] Command line:
20:35:28 [2021-11-27T01:35:28.406Z] 	[/opt/tools/java/openjdk/jdk-15/15.0.2+7/bin/java, -Dosgi.noShutdown=false, -Dosgi.os=linux, -Dosgi.ws=gtk, -Dosgi.arch=x86_64, -javaagent:/home/jenkins/.m2/repository/org/jacoco/org.jacoco.agent/0.8.6/org.jacoco.agent-0.8.6-runtime.jar=destfile=/home/jenkins/agent/workspace/ease.verify.core.target.2020-03/tests/org.eclipse.ease.ui.scripts.test/target/jacoco.exec,output=file, -Dosgi.clean=true, -jar, /home/jenkins/.m2/repository/p2/osgi/bundle/org.eclipse.equinox.launcher/1.6.300.v20210813-1054/org.eclipse.equinox.launcher-1.6.300.v20210813-1054.jar, -data, /home/jenkins/agent/workspace/ease.verify.core.target.2020-03/tests/org.eclipse.ease.ui.scripts.test/target/work/data, -install, /home/jenkins/agent/workspace/ease.verify.core.target.2020-03/tests/org.eclipse.ease.ui.scripts.test/target/work, -configuration, /home/jenkins/agent/workspace/ease.verify.core.target.2020-03/tests/org.eclipse.ease.ui.scripts.test/target/work/configuration, -application, org.eclipse.tycho.surefire.osgibooter.headlesstest, -testproperties, /home/jenkins/agent/workspace/ease.verify.core.target.2020-03/tests/org.eclipse.ease.ui.scripts.test/target/surefire.properties]
20:35:28 [2021-11-27T01:35:28.407Z] Picked up JAVA_TOOL_OPTIONS: -Dmaven.ext.class.path="/home/jenkins/agent/workspace/ease.verify.core.target.2020-03@tmp/withMavencb38ccb9/pipeline-maven-spy.jar" -Dorg.jenkinsci.plugins.pipeline.maven.reportsFolder="/home/jenkins/agent/workspace/ease.verify.core.target.2020-03@tmp/withMavencb38ccb9" 
20:35:30 [2021-11-27T01:35:30.966Z] Running org.eclipse.ease.ui.scripts.expressions.definitions.ExpressionFactoryTest
20:35:30 [2021-11-27T01:35:30.966Z] Tests run: 14, Failures: 0, Errors: 0, Skipped: 0, Time elapsed: 0.07 s - in org.eclipse.ease.ui.scripts.expressions.definitions.ExpressionFactoryTest
20:35:30 [2021-11-27T01:35:30.966Z] loadClassWithExpression  Time elapsed: 0.039 s
20:35:30 [2021-11-27T01:35:30.966Z] createWithExpression  Time elapsed: 0.001 s
20:35:30 [2021-11-27T01:35:30.966Z] createReferenceExpression  Time elapsed: 0.002 s
20:35:30 [2021-11-27T01:35:30.966Z] loadClassReferenceExpression  Time elapsed: 0.001 s
20:35:30 [2021-11-27T01:35:30.966Z] loadClassTestExpression  Time elapsed: 0.001 s
20:35:30 [2021-11-27T01:35:30.966Z] createEqualsExpression  Time elapsed: 0.001 s
20:35:30 [2021-11-27T01:35:30.966Z] loadClassCountExpression  Time elapsed: 0.001 s
20:35:30 [2021-11-27T01:35:30.966Z] loadClassOrExpression  Time elapsed: 0 s
20:35:30 [2021-11-27T01:35:30.966Z] createTestExpression  Time elapsed: 0.003 s
20:35:30 [2021-11-27T01:35:30.966Z] createOrExpression  Time elapsed: 0.001 s
20:35:30 [2021-11-27T01:35:30.966Z] loadClassAndExpression  Time elapsed: 0 s
20:35:30 [2021-11-27T01:35:30.966Z] createAndExpression  Time elapsed: 0 s
20:35:30 [2021-11-27T01:35:30.966Z] loadClassEqualsExpression  Time elapsed: 0 s
20:35:30 [2021-11-27T01:35:30.966Z] createCountExpression  Time elapsed: 0.001 s
20:35:30 [2021-11-27T01:35:30.966Z] 
20:35:30 [2021-11-27T01:35:30.966Z] Results:
20:35:30 [2021-11-27T01:35:30.966Z] 
20:35:30 [2021-11-27T01:35:30.966Z] Tests run: 14, Failures: 0, Errors: 0, Skipped: 0
20:35:30 [2021-11-27T01:35:30.966Z] 
20:35:31 [2021-11-27T01:35:31.224Z] [INFO] All tests passed!
20:35:31 [2021-11-27T01:35:31.224Z] [INFO] 
20:35:31 [2021-11-27T01:35:31.224Z] [INFO] --- maven-pmd-plugin:3.15.0:pmd (pmd-integration) @ org.eclipse.ease.ui.scripts.test ---
20:35:31 [2021-11-27T01:35:31.224Z] [INFO] PMD version: 6.38.0
20:35:31 [2021-11-27T01:35:31.500Z] [WARNING] Could not find class org.eclipse.ease.ui.scripts.expressions.definitions.ExpressionFactoryTest, due to: java.lang.IncompatibleClassChangeError: class net.sourceforge.pmd.lang.java.typeresolution.visitors.PMDASMVisitor has interface org.objectweb.asm.ClassVisitor as super class
20:35:31 [2021-11-27T01:35:31.500Z] [INFO] 
20:35:31 [2021-11-27T01:35:31.500Z] [INFO] --- maven-pmd-plugin:3.15.0:cpd (pmd-integration) @ org.eclipse.ease.ui.scripts.test ---
20:35:31 [2021-11-27T01:35:31.500Z] [INFO] PMD version: 6.38.0
20:35:31 [2021-11-27T01:35:31.500Z] [INFO] 
20:35:31 [2021-11-27T01:35:31.500Z] [INFO] --- spotbugs-maven-plugin:4.1.4:spotbugs (spotbugs-integration) @ org.eclipse.ease.ui.scripts.test ---
20:35:31 [2021-11-27T01:35:31.500Z] [INFO] Fork Value is false
20:35:31 [2021-11-27T01:35:31.500Z]      [java] JVM args ignored when same JVM is used.
20:35:33 [2021-11-27T01:35:33.500Z] [INFO] Done SpotBugs Analysis....
20:35:33 [2021-11-27T01:35:33.500Z] [INFO] 
20:35:33 [2021-11-27T01:35:33.500Z] [INFO] --- maven-checkstyle-plugin:3.1.1:check (checkstyle-integration) @ org.eclipse.ease.ui.scripts.test ---
20:35:33 [2021-11-27T01:35:33.500Z] [INFO] You have 0 Checkstyle violations.
20:35:33 [2021-11-27T01:35:33.500Z] [INFO] 
20:35:33 [2021-11-27T01:35:33.500Z] [INFO] --- maven-install-plugin:2.3.1:install (default-install) @ org.eclipse.ease.ui.scripts.test ---
20:35:33 [2021-11-27T01:35:33.500Z] [INFO] Installing /home/jenkins/agent/workspace/ease.verify.core.target.2020-03/tests/org.eclipse.ease.ui.scripts.test/target/org.eclipse.ease.ui.scripts.test-0.9.0-SNAPSHOT.jar to /home/jenkins/.m2/repository/org/eclipse/ease/org.eclipse.ease.ui.scripts.test/0.9.0-SNAPSHOT/org.eclipse.ease.ui.scripts.test-0.9.0-SNAPSHOT.jar
20:35:33 [2021-11-27T01:35:33.500Z] [INFO] Installing /home/jenkins/agent/workspace/ease.verify.core.target.2020-03/tests/org.eclipse.ease.ui.scripts.test/pom.xml to /home/jenkins/.m2/repository/org/eclipse/ease/org.eclipse.ease.ui.scripts.test/0.9.0-SNAPSHOT/org.eclipse.ease.ui.scripts.test-0.9.0-SNAPSHOT.pom
20:35:33 [2021-11-27T01:35:33.500Z] [INFO] Installing /home/jenkins/agent/workspace/ease.verify.core.target.2020-03/tests/org.eclipse.ease.ui.scripts.test/target/p2content.xml to /home/jenkins/.m2/repository/org/eclipse/ease/org.eclipse.ease.ui.scripts.test/0.9.0-SNAPSHOT/org.eclipse.ease.ui.scripts.test-0.9.0-SNAPSHOT-p2metadata.xml
20:35:33 [2021-11-27T01:35:33.500Z] [INFO] Installing /home/jenkins/agent/workspace/ease.verify.core.target.2020-03/tests/org.eclipse.ease.ui.scripts.test/target/p2artifacts.xml to /home/jenkins/.m2/repository/org/eclipse/ease/org.eclipse.ease.ui.scripts.test/0.9.0-SNAPSHOT/org.eclipse.ease.ui.scripts.test-0.9.0-SNAPSHOT-p2artifacts.xml
20:35:33 [2021-11-27T01:35:33.500Z] [INFO] 
20:35:33 [2021-11-27T01:35:33.501Z] [INFO] --- tycho-p2-plugin:2.2.0:update-local-index (default-update-local-index) @ org.eclipse.ease.ui.scripts.test ---
20:35:33 [2021-11-27T01:35:33.501Z] [INFO] 
20:35:33 [2021-11-27T01:35:33.501Z] [INFO] -------------< org.eclipse.ease:org.eclipse.ease.ui.test >--------------
20:35:33 [2021-11-27T01:35:33.501Z] [INFO] Building org.eclipse.ease.ui.test 0.9.0-SNAPSHOT                 [46/49]
20:35:33 [2021-11-27T01:35:33.501Z] [INFO] ------------------------[ eclipse-test-plugin ]-------------------------
20:35:33 [2021-11-27T01:35:33.501Z] [INFO] 
20:35:33 [2021-11-27T01:35:33.501Z] [INFO] --- maven-clean-plugin:2.5:clean (default-clean) @ org.eclipse.ease.ui.test ---
20:35:33 [2021-11-27T01:35:33.501Z] [INFO] 
20:35:33 [2021-11-27T01:35:33.501Z] [INFO] --- tycho-packaging-plugin:2.2.0:build-qualifier (default-build-qualifier) @ org.eclipse.ease.ui.test ---
20:35:33 [2021-11-27T01:35:33.501Z] [INFO] The project's OSGi version is 0.9.0.I202110141644
20:35:33 [2021-11-27T01:35:33.501Z] [INFO] 
20:35:33 [2021-11-27T01:35:33.501Z] [INFO] --- tycho-packaging-plugin:2.2.0:validate-id (default-validate-id) @ org.eclipse.ease.ui.test ---
20:35:33 [2021-11-27T01:35:33.501Z] [INFO] 
20:35:33 [2021-11-27T01:35:33.501Z] [INFO] --- tycho-packaging-plugin:2.2.0:validate-version (default-validate-version) @ org.eclipse.ease.ui.test ---
20:35:33 [2021-11-27T01:35:33.501Z] [INFO] 
20:35:33 [2021-11-27T01:35:33.501Z] [INFO] --- maven-resources-plugin:2.4.3:resources (default-resources) @ org.eclipse.ease.ui.test ---
20:35:33 [2021-11-27T01:35:33.501Z] [INFO] Using 'UTF-8' encoding to copy filtered resources.
20:35:33 [2021-11-27T01:35:33.501Z] [INFO] skip non existing resourceDirectory /home/jenkins/agent/workspace/ease.verify.core.target.2020-03/tests/org.eclipse.ease.ui.test/src/main/resources
20:35:33 [2021-11-27T01:35:33.501Z] [INFO] 
20:35:33 [2021-11-27T01:35:33.501Z] [INFO] --- tycho-compiler-plugin:2.2.0:compile (default-compile) @ org.eclipse.ease.ui.test ---
20:35:33 [2021-11-27T01:35:33.501Z] [INFO] Compiling 25 source files to /home/jenkins/agent/workspace/ease.verify.core.target.2020-03/tests/org.eclipse.ease.ui.test/target/classes
20:35:34 [2021-11-27T01:35:34.065Z] [INFO] 
20:35:34 [2021-11-27T01:35:34.065Z] [INFO] --- maven-resources-plugin:2.4.3:testResources (default-testResources) @ org.eclipse.ease.ui.test ---
20:35:34 [2021-11-27T01:35:34.065Z] [INFO] Using 'UTF-8' encoding to copy filtered resources.
20:35:34 [2021-11-27T01:35:34.065Z] [INFO] skip non existing resourceDirectory /home/jenkins/agent/workspace/ease.verify.core.target.2020-03/tests/org.eclipse.ease.ui.test/src/test/resources
20:35:34 [2021-11-27T01:35:34.065Z] [INFO] 
20:35:34 [2021-11-27T01:35:34.065Z] [INFO] --- target-platform-configuration:2.2.0:target-platform (default-target-platform) @ org.eclipse.ease.ui.test ---
20:35:34 [2021-11-27T01:35:34.065Z] [INFO] 
20:35:34 [2021-11-27T01:35:34.065Z] [INFO] --- tycho-packaging-plugin:2.2.0:package-plugin (default-package-plugin) @ org.eclipse.ease.ui.test ---
20:35:34 [2021-11-27T01:35:34.322Z] [INFO] Building jar: /home/jenkins/agent/workspace/ease.verify.core.target.2020-03/tests/org.eclipse.ease.ui.test/target/org.eclipse.ease.ui.test-0.9.0-SNAPSHOT.jar
20:35:34 [2021-11-27T01:35:34.322Z] [INFO] 
20:35:34 [2021-11-27T01:35:34.322Z] [INFO] --- tycho-p2-plugin:2.2.0:p2-metadata-default (default-p2-metadata-default) @ org.eclipse.ease.ui.test ---
20:35:34 [2021-11-27T01:35:34.322Z] [INFO] 
20:35:34 [2021-11-27T01:35:34.322Z] [INFO] --- jacoco-maven-plugin:0.8.6:prepare-agent (jacoco-initialize) @ org.eclipse.ease.ui.test ---
20:35:34 [2021-11-27T01:35:34.322Z] [INFO] tycho.testArgLine set to -javaagent:/home/jenkins/.m2/repository/org/jacoco/org.jacoco.agent/0.8.6/org.jacoco.agent-0.8.6-runtime.jar=destfile=/home/jenkins/agent/workspace/ease.verify.core.target.2020-03/tests/org.eclipse.ease.ui.test/target/jacoco.exec,output=file
20:35:34 [2021-11-27T01:35:34.322Z] [INFO] 
20:35:34 [2021-11-27T01:35:34.322Z] [INFO] --- tycho-surefire-plugin:2.2.0:test (default-test) @ org.eclipse.ease.ui.test ---
20:35:34 [2021-11-27T01:35:34.322Z] [INFO] Executing Test Runtime with timeout 0, logs (if any) will be placed at: /home/jenkins/agent/workspace/ease.verify.core.target.2020-03/tests/org.eclipse.ease.ui.test/target/work/data/.metadata/.log
20:35:34 [2021-11-27T01:35:34.322Z] [INFO] Command line:
20:35:34 [2021-11-27T01:35:34.322Z] 	[/opt/tools/java/openjdk/jdk-15/15.0.2+7/bin/java, -Dosgi.noShutdown=false, -Dosgi.os=linux, -Dosgi.ws=gtk, -Dosgi.arch=x86_64, -javaagent:/home/jenkins/.m2/repository/org/jacoco/org.jacoco.agent/0.8.6/org.jacoco.agent-0.8.6-runtime.jar=destfile=/home/jenkins/agent/workspace/ease.verify.core.target.2020-03/tests/org.eclipse.ease.ui.test/target/jacoco.exec,output=file, -Dosgi.clean=true, -jar, /home/jenkins/.m2/repository/p2/osgi/bundle/org.eclipse.equinox.launcher/1.6.300.v20210813-1054/org.eclipse.equinox.launcher-1.6.300.v20210813-1054.jar, -data, /home/jenkins/agent/workspace/ease.verify.core.target.2020-03/tests/org.eclipse.ease.ui.test/target/work/data, -install, /home/jenkins/agent/workspace/ease.verify.core.target.2020-03/tests/org.eclipse.ease.ui.test/target/work, -configuration, /home/jenkins/agent/workspace/ease.verify.core.target.2020-03/tests/org.eclipse.ease.ui.test/target/work/configuration, -application, org.eclipse.tycho.surefire.osgibooter.headlesstest, -testproperties, /home/jenkins/agent/workspace/ease.verify.core.target.2020-03/tests/org.eclipse.ease.ui.test/target/surefire.properties]
20:35:34 [2021-11-27T01:35:34.322Z] Picked up JAVA_TOOL_OPTIONS: -Dmaven.ext.class.path="/home/jenkins/agent/workspace/ease.verify.core.target.2020-03@tmp/withMavencb38ccb9/pipeline-maven-spy.jar" -Dorg.jenkinsci.plugins.pipeline.maven.reportsFolder="/home/jenkins/agent/workspace/ease.verify.core.target.2020-03@tmp/withMavencb38ccb9" 
20:35:37 [2021-11-27T01:35:37.619Z] Running org.eclipse.ease.ui.views.shell.dropins.variables.HiddenVariablesFilterTest
20:35:37 [2021-11-27T01:35:37.898Z] Tests run: 3, Failures: 0, Errors: 0, Skipped: 0, Time elapsed: 0.609 s - in org.eclipse.ease.ui.views.shell.dropins.variables.HiddenVariablesFilterTest
20:35:37 [2021-11-27T01:35:37.898Z] select_accepts_unknown_classes  Time elapsed: 0.177 s
20:35:37 [2021-11-27T01:35:37.898Z] select_accepts_script_variables  Time elapsed: 0.421 s
20:35:37 [2021-11-27T01:35:37.898Z] select_declines_hidden_script_variables  Time elapsed: 0.001 s
20:35:37 [2021-11-27T01:35:37.898Z] Running org.eclipse.ease.ui.views.shell.dropins.variables.VariablesContentProviderTest
20:35:38 [2021-11-27T01:35:38.155Z] Tests run: 5, Failures: 0, Errors: 0, Skipped: 0, Time elapsed: 0.105 s - in org.eclipse.ease.ui.views.shell.dropins.variables.VariablesContentProviderTest
20:35:38 [2021-11-27T01:35:38.155Z] hasChildren_true_when_child_nodes_are_available  Time elapsed: 0.064 s
20:35:38 [2021-11-27T01:35:38.155Z] getChildren_is_empty_when_no_child_nodes_are_available  Time elapsed: 0.002 s
20:35:38 [2021-11-27T01:35:38.155Z] getElements_contains_variables_from_engine  Time elapsed: 0.037 s
20:35:38 [2021-11-27T01:35:38.155Z] hasChildren_false_when_no_child_nodes_are_available  Time elapsed: 0.001 s
20:35:38 [2021-11-27T01:35:38.155Z] getChildren_not_empty_when_child_nodes_are_available  Time elapsed: 0 s
20:35:38 [2021-11-27T01:35:38.155Z] Running org.eclipse.ease.ui.views.shell.dropins.variables.VariablesComparatorTest
20:35:38 [2021-11-27T01:35:38.155Z] Tests run: 1, Failures: 0, Errors: 0, Skipped: 0, Time elapsed: 0.075 s - in org.eclipse.ease.ui.views.shell.dropins.variables.VariablesComparatorTest
20:35:38 [2021-11-27T01:35:38.155Z] lastExecutionResult_comes_before_debugVariable  Time elapsed: 0.075 s
20:35:38 [2021-11-27T01:35:38.155Z] Running org.eclipse.ease.ui.views.shell.dropins.variables.ContentLabelProviderTest
20:35:38 [2021-11-27T01:35:38.155Z] Tests run: 1, Failures: 0, Errors: 0, Skipped: 0, Time elapsed: 0.005 s - in org.eclipse.ease.ui.views.shell.dropins.variables.ContentLabelProviderTest
20:35:38 [2021-11-27T01:35:38.155Z] getText_returns_variable_content  Time elapsed: 0.005 s
20:35:38 [2021-11-27T01:35:38.155Z] Running org.eclipse.ease.ui.views.shell.dropins.variables.VariablesLabelProviderTest
20:35:38 [2021-11-27T01:35:38.155Z] Tests run: 1, Failures: 0, Errors: 0, Skipped: 0, Time elapsed: 0.002 s - in org.eclipse.ease.ui.views.shell.dropins.variables.VariablesLabelProviderTest
20:35:38 [2021-11-27T01:35:38.155Z] getText_returns_variable_name  Time elapsed: 0.002 s
20:35:38 [2021-11-27T01:35:38.155Z] Running org.eclipse.ease.ui.views.shell.dropins.modules.ModulesStackLabelProviderTest
20:35:38 [2021-11-27T01:35:38.155Z] Tests run: 3, Failures: 0, Errors: 0, Skipped: 0, Time elapsed: 0.06 s - in org.eclipse.ease.ui.views.shell.dropins.modules.ModulesStackLabelProviderTest
20:35:38 [2021-11-27T01:35:38.155Z] getText_null_returns_empty_string  Time elapsed: 0.001 s
20:35:38 [2021-11-27T01:35:38.155Z] getText_returns_definition_name  Time elapsed: 0.059 s
20:35:38 [2021-11-27T01:35:38.155Z] getText_returns_full_class_name_name  Time elapsed: 0 s
20:35:38 [2021-11-27T01:35:38.155Z] Running org.eclipse.ease.ui.views.shell.dropins.modules.ModulesStackContentProviderTest
20:35:38 [2021-11-27T01:35:38.413Z] Tests run: 2, Failures: 0, Errors: 0, Skipped: 0, Time elapsed: 0.05 s - in org.eclipse.ease.ui.views.shell.dropins.modules.ModulesStackContentProviderTest
20:35:38 [2021-11-27T01:35:38.413Z] getElements_returns_modules  Time elapsed: 0.05 s
20:35:38 [2021-11-27T01:35:38.413Z] getElements_returns_empty_list_without_environment  Time elapsed: 0 s
20:35:38 [2021-11-27T01:35:38.413Z] Running org.eclipse.ease.ui.completion.provider.LoadModuleCompletionProviderTest
20:35:38 [2021-11-27T01:35:38.413Z] Tests run: 12, Failures: 0, Errors: 0, Skipped: 0, Time elapsed: 0.148 s - in org.eclipse.ease.ui.completion.provider.LoadModuleCompletionProviderTest
20:35:38 [2021-11-27T01:35:38.413Z] getProposals_contains_root_entry_with_absolute_filter  Time elapsed: 0.073 s
20:35:38 [2021-11-27T01:35:38.413Z] getProposals_contains_root_entry_with_relative_filter  Time elapsed: 0.002 s
20:35:38 [2021-11-27T01:35:38.413Z] getProposals_contains_category_with_relative_filter  Time elapsed: 0.001 s
20:35:38 [2021-11-27T01:35:38.413Z] getProposals_does_not_contain_root_entry_on_filter_mismatch  Time elapsed: 0.001 s
20:35:38 [2021-11-27T01:35:38.413Z] isActive_equals_false{String}[1]  Time elapsed: 0.012 s
20:35:38 [2021-11-27T01:35:38.413Z] isActive_equals_false{String}[2]  Time elapsed: 0.002 s
20:35:38 [2021-11-27T01:35:38.413Z] isActive_equals_false{String}[3]  Time elapsed: 0.018 s
20:35:38 [2021-11-27T01:35:38.413Z] getProposals_contains_root_entry  Time elapsed: 0.001 s
20:35:38 [2021-11-27T01:35:38.413Z] isActive_equals_true{String}[1]  Time elapsed: 0.001 s
20:35:38 [2021-11-27T01:35:38.413Z] isActive_equals_true{String}[2]  Time elapsed: 0.001 s
20:35:38 [2021-11-27T01:35:38.413Z] getProposals_contains_child_entry_with_absolute_filter  Time elapsed: 0.001 s
20:35:38 [2021-11-27T01:35:38.413Z] getProposals_does_not_contain_entry_on_completed_input  Time elapsed: 0.001 s
20:35:38 [2021-11-27T01:35:38.413Z] Running org.eclipse.ease.ui.completion.provider.AbstractFileLocationCompletionProviderTest
20:35:38 [2021-11-27T01:35:38.697Z] Tests run: 22, Failures: 0, Errors: 0, Skipped: 0, Time elapsed: 0.141 s - in org.eclipse.ease.ui.completion.provider.AbstractFileLocationCompletionProviderTest
20:35:38 [2021-11-27T01:35:38.697Z] getProposals_does_not_contain_back_proposal_for_project  Time elapsed: 0.102 s
20:35:38 [2021-11-27T01:35:38.697Z] getProposals_does_not_contain_project_root_with_file_resource  Time elapsed: 0.004 s
20:35:38 [2021-11-27T01:35:38.697Z] getProposals_contains_project_root_files_for_project_root  Time elapsed: 0 s
20:35:38 [2021-11-27T01:35:38.697Z] getProposals_contains_files_for_workspace_folder  Time elapsed: 0.001 s
20:35:38 [2021-11-27T01:35:38.697Z] getProposals_contains_back_for_workspace_folder  Time elapsed: 0 s
20:35:38 [2021-11-27T01:35:38.697Z] getProposals_contains_root_file_systems  Time elapsed: 0.007 s
20:35:38 [2021-11-27T01:35:38.697Z] getProposals_contains_files_for_project  Time elapsed: 0.001 s
20:35:38 [2021-11-27T01:35:38.697Z] back_proposal_contains_correct_replacement_string_for_absolute_workspace_folder_link  Time elapsed: 0 s
20:35:38 [2021-11-27T01:35:38.697Z] getProposals_does_not_contain_project_root_without_resource  Time elapsed: 0 s
20:35:38 [2021-11-27T01:35:38.697Z] getProposals_contains_project_root_with_workspace_resource  Time elapsed: 0.001 s
20:35:38 [2021-11-27T01:35:38.697Z] getProposals_contains_back_for_project_folder  Time elapsed: 0 s
20:35:38 [2021-11-27T01:35:38.697Z] getProposals_contains_project_root_folders_for_workspace_project_with_back_path  Time elapsed: 0.001 s
20:35:38 [2021-11-27T01:35:38.697Z] getProposals_contains_projects_for_workspace_root  Time elapsed: 0 s
20:35:38 [2021-11-27T01:35:38.697Z] getProposals_contains_project_root_folders_for_workspace_project  Time elapsed: 0.001 s
20:35:38 [2021-11-27T01:35:38.697Z] getProposals_contains_filesystem_root  Time elapsed: 0 s
20:35:38 [2021-11-27T01:35:38.697Z] getProposals_contains_files_for_project_folder  Time elapsed: 0 s
20:35:38 [2021-11-27T01:35:38.697Z] getProposals_contains_workspace_root  Time elapsed: 0.001 s
20:35:38 [2021-11-27T01:35:38.697Z] getProposals_does_not_contain_back_proposal  Time elapsed: 0 s
20:35:38 [2021-11-27T01:35:38.698Z] getProposals_contains_files_for_filesystem  Time elapsed: 0.001 s
20:35:38 [2021-11-27T01:35:38.698Z] getProposals_contains_project_root_files_for_workspace_project  Time elapsed: 0 s
20:35:38 [2021-11-27T01:35:38.698Z] getProposals_contains_back_for_filesystem  Time elapsed: 0 s
20:35:38 [2021-11-27T01:35:38.698Z] back_proposal_contains_correct_replacement_string_for_relative_workspace_folder_link  Time elapsed: 0.001 s
20:35:38 [2021-11-27T01:35:38.698Z] Running org.eclipse.ease.ui.completion.provider.VariablesCompletionProviderTest
20:35:38 [2021-11-27T01:35:38.698Z] Tests run: 18, Failures: 0, Errors: 0, Skipped: 0, Time elapsed: 0.057 s - in org.eclipse.ease.ui.completion.provider.VariablesCompletionProviderTest
20:35:38 [2021-11-27T01:35:38.698Z] prepareProposals_instance_contains_integer_variable  Time elapsed: 0.003 s
20:35:38 [2021-11-27T01:35:38.698Z] prepareProposals_instance_contains_string_variable  Time elapsed: 0.001 s
20:35:38 [2021-11-27T01:35:38.698Z] prepareProposals_instance_contains_string_variable_for_filter_input_case_insensitive  Time elapsed: 0.001 s
20:35:38 [2021-11-27T01:35:38.698Z] prepareProposals_instance_contains_string_variable_for_filter_input  Time elapsed: 0.001 s
20:35:38 [2021-11-27T01:35:38.698Z] prepareProposals_does_not_contain_internal_variable  Time elapsed: 0.001 s
20:35:38 [2021-11-27T01:35:38.698Z] isActive_equals_false{String}[1]  Time elapsed: 0.001 s
20:35:38 [2021-11-27T01:35:38.698Z] isActive_equals_false{String}[2]  Time elapsed: 0.002 s
20:35:38 [2021-11-27T01:35:38.698Z] isActive_equals_false{String}[3]  Time elapsed: 0.031 s
20:35:38 [2021-11-27T01:35:38.698Z] isActive_equals_false{String}[4]  Time elapsed: 0.001 s
20:35:38 [2021-11-27T01:35:38.698Z] isActive_equals_false{String}[5]  Time elapsed: 0.001 s
20:35:38 [2021-11-27T01:35:38.698Z] isActive_equals_true{String}[1]  Time elapsed: 0.001 s
20:35:38 [2021-11-27T01:35:38.698Z] isActive_equals_true{String}[2]  Time elapsed: 0.001 s
20:35:38 [2021-11-27T01:35:38.698Z] isActive_equals_true{String}[3]  Time elapsed: 0.001 s
20:35:38 [2021-11-27T01:35:38.698Z] isActive_equals_true{String}[4]  Time elapsed: 0.001 s
20:35:38 [2021-11-27T01:35:38.698Z] isActive_equals_true{String}[5]  Time elapsed: 0.001 s
20:35:38 [2021-11-27T01:35:38.698Z] isActive_equals_true{String}[6]  Time elapsed: 0.001 s
20:35:38 [2021-11-27T01:35:38.698Z] isActive_equals_true{String}[7]  Time elapsed: 0.001 s
20:35:38 [2021-11-27T01:35:38.698Z] isActive_equals_true{String}[8]  Time elapsed: 0.001 s
20:35:38 [2021-11-27T01:35:38.698Z] Running org.eclipse.ease.ui.completion.provider.AbstractPathCompletionProviderTest
20:35:38 [2021-11-27T01:35:38.698Z] Tests run: 11, Failures: 0, Errors: 0, Skipped: 0, Time elapsed: 0.005 s - in org.eclipse.ease.ui.completion.provider.AbstractPathCompletionProviderTest
20:35:38 [2021-11-27T01:35:38.698Z] filter_keeps_only_lower_level_on_matching_filter  Time elapsed: 0 s
20:35:38 [2021-11-27T01:35:38.698Z] filter_removes_nothing_if_context_is_empty  Time elapsed: 0 s
20:35:38 [2021-11-27T01:35:38.698Z] getPathsFromElements_is_empty_for_root_elements_only  Time elapsed: 0 s
20:35:38 [2021-11-27T01:35:38.698Z] filter_keeps_only_1st_level_on_empty_filter  Time elapsed: 0 s
20:35:38 [2021-11-27T01:35:38.698Z] filter_keeps_only_1st_level_on_matching_filter  Time elapsed: 0.001 s
20:35:38 [2021-11-27T01:35:38.698Z] getPathsFromElements_is_empty_for_empty_element  Time elapsed: 0 s
20:35:38 [2021-11-27T01:35:38.698Z] filter_removes_mismatches_on_same_level  Time elapsed: 0 s
20:35:38 [2021-11-27T01:35:38.698Z] filter_matches_next_level  Time elapsed: 0.001 s
20:35:38 [2021-11-27T01:35:38.698Z] filter_matches_relative_paths  Time elapsed: 0 s
20:35:38 [2021-11-27T01:35:38.698Z] getPathsFromElements_contains_parent_paths  Time elapsed: 0 s
20:35:38 [2021-11-27T01:35:38.698Z] getPathsFromElements_contains_all_hierarchies  Time elapsed: 0.001 s
20:35:38 [2021-11-27T01:35:38.698Z] Running org.eclipse.ease.ui.completion.provider.AbstractCompletionProviderTest
20:35:38 [2021-11-27T01:35:38.698Z] Tests run: 16, Failures: 0, Errors: 0, Skipped: 0, Time elapsed: 0.028 s - in org.eclipse.ease.ui.completion.provider.AbstractCompletionProviderTest
20:35:38 [2021-11-27T01:35:38.698Z] isStringParameter_equals_true{String}[1]  Time elapsed: 0.002 s
20:35:38 [2021-11-27T01:35:38.698Z] isStringParameter_equals_true{String}[2]  Time elapsed: 0.001 s
20:35:38 [2021-11-27T01:35:38.698Z] isStringParameter_equals_true{String}[3]  Time elapsed: 0.001 s
20:35:38 [2021-11-27T01:35:38.698Z] isStringParameter_equals_true{String}[4]  Time elapsed: 0.001 s
20:35:38 [2021-11-27T01:35:38.698Z] isMethodParameter_equals_true  Time elapsed: 0 s
20:35:38 [2021-11-27T01:35:38.699Z] isMethodParameter_equals_true_for_2nd_parameter  Time elapsed: 0.001 s
20:35:38 [2021-11-27T01:35:38.699Z] isValid_equals_false_for_invalid_context  Time elapsed: 0.013 s
20:35:38 [2021-11-27T01:35:38.699Z] isStringParameter_equals_false{String}[1]  Time elapsed: 0.001 s
20:35:38 [2021-11-27T01:35:38.699Z] isStringParameter_equals_false{String}[2]  Time elapsed: 0.001 s
20:35:38 [2021-11-27T01:35:38.699Z] isStringParameter_equals_false{String}[3]  Time elapsed: 0 s
20:35:38 [2021-11-27T01:35:38.699Z] isStringParameter_equals_false{String}[4]  Time elapsed: 0 s
20:35:38 [2021-11-27T01:35:38.699Z] isStringParameter_equals_false{String}[5]  Time elapsed: 0.001 s
20:35:38 [2021-11-27T01:35:38.699Z] isMethodParameter_equals_false_when_no_method_is_detected  Time elapsed: 0.001 s
20:35:38 [2021-11-27T01:35:38.699Z] isValid_equals_true_for_valid_context  Time elapsed: 0 s
20:35:38 [2021-11-27T01:35:38.699Z] isMethodParameter_equals_false_for_wrong_method_name  Time elapsed: 0.001 s
20:35:38 [2021-11-27T01:35:38.699Z] isMethodParameter_equals_false_for_wrong_parameter_index  Time elapsed: 0.001 s
20:35:38 [2021-11-27T01:35:38.699Z] Running org.eclipse.ease.ui.completion.provider.LoadedModuleCompletionProviderTest
20:35:38 [2021-11-27T01:35:38.699Z] Tests run: 15, Failures: 0, Errors: 0, Skipped: 0, Time elapsed: 0.051 s - in org.eclipse.ease.ui.completion.provider.LoadedModuleCompletionProviderTest
20:35:38 [2021-11-27T01:35:38.699Z] method_proposal_contains_opening_bracket_when_method_has_mandatory_parameters  Time elapsed: 0.006 s
20:35:38 [2021-11-27T01:35:38.699Z] method_proposal_contains_full_method_call_when_method_has_only_optional_parameters  Time elapsed: 0.002 s
20:35:38 [2021-11-27T01:35:38.699Z] getProposals_contains_constant_methods  Time elapsed: 0.002 s
20:35:38 [2021-11-27T01:35:38.699Z] getProposals_contains_module_methods  Time elapsed: 0.002 s
20:35:38 [2021-11-27T01:35:38.699Z] isActive_equals_false{String}[1]  Time elapsed: 0 s
20:35:38 [2021-11-27T01:35:38.699Z] isActive_equals_false{String}[2]  Time elapsed: 0 s
20:35:38 [2021-11-27T01:35:38.699Z] isActive_equals_false{String}[3]  Time elapsed: 0 s
20:35:38 [2021-11-27T01:35:38.699Z] isActive_equals_false{String}[4]  Time elapsed: 0.001 s
20:35:38 [2021-11-27T01:35:38.699Z] isActive_equals_true{String}[1]  Time elapsed: 0.001 s
20:35:38 [2021-11-27T01:35:38.699Z] isActive_equals_true{String}[2]  Time elapsed: 0 s
20:35:38 [2021-11-27T01:35:38.699Z] isActive_equals_true{String}[3]  Time elapsed: 0 s
20:35:38 [2021-11-27T01:35:38.699Z] isActive_equals_true{String}[4]  Time elapsed: 0 s
20:35:38 [2021-11-27T01:35:38.699Z] isActive_equals_true{String}[5]  Time elapsed: 0.001 s
20:35:38 [2021-11-27T01:35:38.699Z] isActive_equals_true{String}[6]  Time elapsed: 0.001 s
20:35:38 [2021-11-27T01:35:38.699Z] method_proposal_contains_full_method_call_when_method_has_no_parameters  Time elapsed: 0.002 s
20:35:38 [2021-11-27T01:35:38.699Z] Running org.eclipse.ease.ui.completion.provider.LocationResolverTest
20:35:38 [2021-11-27T01:35:38.699Z] Tests run: 1, Failures: 0, Errors: 0, Skipped: 0, Time elapsed: 0.001 s - in org.eclipse.ease.ui.completion.provider.LocationResolverTest
20:35:38 [2021-11-27T01:35:38.699Z] getParentString_has_no_trailing_slashes  Time elapsed: 0.001 s
20:35:38 [2021-11-27T01:35:38.699Z] Running org.eclipse.ease.ui.completion.BasicContextTest
20:35:38 [2021-11-27T01:35:38.699Z] Tests run: 12, Failures: 0, Errors: 0, Skipped: 0, Time elapsed: 0.006 s - in org.eclipse.ease.ui.completion.BasicContextTest
20:35:38 [2021-11-27T01:35:38.699Z] isValid_equals_true  Time elapsed: 0.001 s
20:35:38 [2021-11-27T01:35:38.699Z] getScriptEngine_returns_engine  Time elapsed: 0 s
20:35:38 [2021-11-27T01:35:38.699Z] getFilter_removes_string_literal_start  Time elapsed: 0.001 s
20:35:38 [2021-11-27T01:35:38.699Z] getLoadedModules_detects_modules_from_ScriptEngine  Time elapsed: 0 s
20:35:38 [2021-11-27T01:35:38.699Z] getFilter_contains_parameter_prefix  Time elapsed: 0 s
20:35:38 [2021-11-27T01:35:38.699Z] getLoadedModules_contains_environment_on_resource  Time elapsed: 0 s
20:35:38 [2021-11-27T01:35:38.699Z] getLoadedModules_does_not_contain_environment_twice_on_resource  Time elapsed: 0 s
20:35:38 [2021-11-27T01:35:38.699Z] getFilter_is_empty  Time elapsed: 0 s
20:35:38 [2021-11-27T01:35:38.699Z] getFilter_keeps_spaces_in_string_literal  Time elapsed: 0.001 s
20:35:38 [2021-11-27T01:35:38.699Z] getLoadedModules_detects_loadModule_commands  Time elapsed: 0 s
20:35:38 [2021-11-27T01:35:38.699Z] getFilter_is_empty_for_empty_input  Time elapsed: 0.001 s
20:35:38 [2021-11-27T01:35:38.699Z] isInvalid_equals_true  Time elapsed: 0 s
20:35:38 [2021-11-27T01:35:38.700Z] Running org.eclipse.ease.ui.completion.tokenizer.BracketMatcherTest
20:35:38 [2021-11-27T01:35:38.700Z] Tests run: 9, Failures: 0, Errors: 0, Skipped: 0, Time elapsed: 0.002 s - in org.eclipse.ease.ui.completion.tokenizer.BracketMatcherTest
20:35:38 [2021-11-27T01:35:38.700Z] getOpenBrackets_returns_open_brackets_only  Time elapsed: 0 s
20:35:38 [2021-11-27T01:35:38.700Z] getBrackets_detects_1  Time elapsed: 0.001 s
20:35:38 [2021-11-27T01:35:38.700Z] getBrackets_detects_2  Time elapsed: 0 s
20:35:38 [2021-11-27T01:35:38.700Z] getBrackets_detects_3  Time elapsed: 0 s
20:35:38 [2021-11-27T01:35:38.700Z] hasOpenBrackets_equals_true  Time elapsed: 0 s
20:35:38 [2021-11-27T01:35:38.700Z] getBrackets_is_empty  Time elapsed: 0.001 s
20:35:38 [2021-11-27T01:35:38.700Z] hasOpenBrackets_equals_false  Time elapsed: 0 s
20:35:38 [2021-11-27T01:35:38.700Z] getBrackets_detects_open_brackets  Time elapsed: 0 s
20:35:38 [2021-11-27T01:35:38.700Z] getBrackets_detects_nested  Time elapsed: 0 s
20:35:38 [2021-11-27T01:35:38.700Z] Running org.eclipse.ease.ui.completion.tokenizer.InputTokenizerTest
20:35:38 [2021-11-27T01:35:38.700Z] Tests run: 68, Failures: 0, Errors: 0, Skipped: 0, Time elapsed: 0.03 s - in org.eclipse.ease.ui.completion.tokenizer.InputTokenizerTest
20:35:38 [2021-11-27T01:35:38.700Z] getTokens_detects_method_chaining  Time elapsed: 0.001 s
20:35:38 [2021-11-27T01:35:38.700Z] isDelimiter_equals_true{String}[1]  Time elapsed: 0 s
20:35:38 [2021-11-27T01:35:38.700Z] isDelimiter_equals_true{String}[2]  Time elapsed: 0 s
20:35:38 [2021-11-27T01:35:38.700Z] isDelimiter_equals_true{String}[3]  Time elapsed: 0 s
20:35:38 [2021-11-27T01:35:38.700Z] isDelimiter_equals_true{String}[4]  Time elapsed: 0 s
20:35:38 [2021-11-27T01:35:38.700Z] isDelimiter_equals_true{String}[5]  Time elapsed: 0 s
20:35:38 [2021-11-27T01:35:38.700Z] isDelimiter_equals_true{String}[6]  Time elapsed: 0.001 s
20:35:38 [2021-11-27T01:35:38.700Z] isDelimiter_equals_true{String}[7]  Time elapsed: 0 s
20:35:38 [2021-11-27T01:35:38.700Z] getTokens_detects_package_fragments  Time elapsed: 0 s
20:35:38 [2021-11-27T01:35:38.700Z] getTokens_detects_javascript_method_call  Time elapsed: 0 s
20:35:38 [2021-11-27T01:35:38.700Z] getTokens_detects_incomplete_package  Time elapsed: 0 s
20:35:38 [2021-11-27T01:35:38.700Z] getTokens_detects_module_methods_call_chain  Time elapsed: 0.001 s
20:35:38 [2021-11-27T01:35:38.700Z] getTokens_splits_string_literal  Time elapsed: 0 s
20:35:38 [2021-11-27T01:35:38.700Z] getTokens_detects_static_method_call  Time elapsed: 0 s
20:35:38 [2021-11-27T01:35:38.700Z] getTokens_detects_method_call_chain  Time elapsed: 0 s
20:35:38 [2021-11-27T01:35:38.700Z] getTokens_simplifies_multiply_operations  Time elapsed: 0 s
20:35:38 [2021-11-27T01:35:38.700Z] getTokens_detects_method_call_parameter_prefix  Time elapsed: 0.001 s
20:35:38 [2021-11-27T01:35:38.700Z] getTokens_detects_method_call_parameters_with_prefix  Time elapsed: 0 s
20:35:38 [2021-11-27T01:35:38.700Z] getTokens_detects_package  Time elapsed: 0 s
20:35:38 [2021-11-27T01:35:38.700Z] getTokens_detects_partial_package  Time elapsed: 0.001 s
20:35:38 [2021-11-27T01:35:38.700Z] getTokens_simplifies_plus_operations  Time elapsed: 0 s
20:35:38 [2021-11-27T01:35:38.700Z] getTokens_detects_class  Time elapsed: 0 s
20:35:38 [2021-11-27T01:35:38.700Z] getTokens_detects_opened_module_method  Time elapsed: 0.001 s
20:35:38 [2021-11-27T01:35:38.700Z] getTokens_simplifies_brackets_recursively  Time elapsed: 0 s
20:35:38 [2021-11-27T01:35:38.700Z] getTokens_detects_method_call_parameter  Time elapsed: 0 s
20:35:38 [2021-11-27T01:35:38.700Z] getTokens_simplifies_brackets  Time elapsed: 0.001 s
20:35:38 [2021-11-27T01:35:38.700Z] getTokens_removes_new_operator  Time elapsed: 0 s
20:35:38 [2021-11-27T01:35:38.700Z] isDelimiter_equals_false{String}[1]  Time elapsed: 0 s
20:35:38 [2021-11-27T01:35:38.700Z] isDelimiter_equals_false{String}[2]  Time elapsed: 0 s
20:35:38 [2021-11-27T01:35:38.700Z] isDelimiter_equals_false{String}[3]  Time elapsed: 0 s
20:35:38 [2021-11-27T01:35:38.700Z] getTokens_detects_method_call_parameters  Time elapsed: 0 s
20:35:38 [2021-11-27T01:35:38.700Z] getTokens_detects_class_instantiation  Time elapsed: 0 s
20:35:38 [2021-11-27T01:35:38.700Z] getTokens_detects_method_call  Time elapsed: 0 s
20:35:38 [2021-11-27T01:35:38.700Z] getTokens_simplifies_divide_operations  Time elapsed: 0 s
20:35:38 [2021-11-27T01:35:38.700Z] getTokens_removes_left_hand_side_of_assignment  Time elapsed: 0.001 s
20:35:38 [2021-11-27T01:35:38.700Z] getTokens_detects_javascript_class_instantiation  Time elapsed: 0 s
20:35:38 [2021-11-27T01:35:38.701Z] getTokens_simplifies_for_loop  Time elapsed: 0 s
20:35:38 [2021-11-27T01:35:38.701Z] getTokens_detects_resolved_javascript_variable_2  Time elapsed: 0.001 s
20:35:38 [2021-11-27T01:35:38.701Z] getTokens_simplifies_minus_operations  Time elapsed: 0 s
20:35:38 [2021-11-27T01:35:38.701Z] getTokens_detects_class_instantiation_2  Time elapsed: 0 s
20:35:38 [2021-11-27T01:35:38.701Z] getTokens_detects_class_instantiation_3  Time elapsed: 0 s
20:35:38 [2021-11-27T01:35:38.701Z] getTokens_simplifies_assignments  Time elapsed: 0 s
20:35:38 [2021-11-27T01:35:38.701Z] getTokens_detects_inner_class  Time elapsed: 0 s
20:35:38 [2021-11-27T01:35:38.701Z] getTokens_detects_static_method_call_with_dot_prefix  Time elapsed: 0 s
20:35:38 [2021-11-27T01:35:38.701Z] getTokens_detects_class_2  Time elapsed: 0 s
20:35:38 [2021-11-27T01:35:38.701Z] isTextFilter_equals_false{String}[1]  Time elapsed: 0 s
20:35:38 [2021-11-27T01:35:38.701Z] isTextFilter_equals_false{String}[2]  Time elapsed: 0 s
20:35:38 [2021-11-27T01:35:38.701Z] isTextFilter_equals_false{String}[3]  Time elapsed: 0 s
20:35:38 [2021-11-27T01:35:38.701Z] isTextFilter_equals_false{String}[4]  Time elapsed: 0.001 s
20:35:38 [2021-11-27T01:35:38.701Z] isTextFilter_equals_false{String}[5]  Time elapsed: 0 s
20:35:38 [2021-11-27T01:35:38.701Z] getTokens_does_not_split_within_string_literal  Time elapsed: 0 s
20:35:38 [2021-11-27T01:35:38.701Z] getTokens_1  Time elapsed: 0.001 s
20:35:38 [2021-11-27T01:35:38.701Z] isTextFilter_equals_true{String}[1]  Time elapsed: 0 s
20:35:38 [2021-11-27T01:35:38.701Z] isTextFilter_equals_true{String}[2]  Time elapsed: 0 s
20:35:38 [2021-11-27T01:35:38.701Z] getTokens_detects_opened_module_method_with_filter  Time elapsed: 0.001 s
20:35:38 [2021-11-27T01:35:38.701Z] getTokens_detects_method_call_request_with_filter  Time elapsed: 0 s
20:35:38 [2021-11-27T01:35:38.701Z] getTokens_for_empty_input  Time elapsed: 0 s
20:35:38 [2021-11-27T01:35:38.701Z] getTokens_detects_package_with_class_prefix  Time elapsed: 0.001 s
20:35:38 [2021-11-27T01:35:38.701Z] getTokens_detects_module_methods  Time elapsed: 0 s
20:35:38 [2021-11-27T01:35:38.701Z] getTokens_detects_completed_method  Time elapsed: 0.001 s
20:35:38 [2021-11-27T01:35:38.701Z] getTokens_detects_resolved_javascript_variable_with_method  Time elapsed: 0 s
20:35:38 [2021-11-27T01:35:38.701Z] getTokens_detects_resolved_javascript_variable  Time elapsed: 0.001 s
20:35:38 [2021-11-27T01:35:38.701Z] getTokens_simplifies_string_literal_1  Time elapsed: 0 s
20:35:38 [2021-11-27T01:35:38.701Z] getTokens_simplifies_string_literal_2  Time elapsed: 0 s
20:35:38 [2021-11-27T01:35:38.701Z] getTokens_is_empty_after_string_literal  Time elapsed: 0.001 s
20:35:38 [2021-11-27T01:35:38.701Z] getTokens_detects_static_method_call_chain  Time elapsed: 0 s
20:35:38 [2021-11-27T01:35:38.701Z] getTokens_detects_opened_module_method_with_parameter  Time elapsed: 0.001 s
20:35:38 [2021-11-27T01:35:38.701Z] getTokens_detects_javascript_object_call  Time elapsed: 0 s
20:35:38 [2021-11-27T01:35:38.701Z] Running org.eclipse.ease.ui.completion.tokenizer.TokenListTest
20:35:38 [2021-11-27T01:35:38.701Z] Tests run: 1, Failures: 0, Errors: 0, Skipped: 0, Time elapsed: 0 s - in org.eclipse.ease.ui.completion.tokenizer.TokenListTest
20:35:38 [2021-11-27T01:35:38.701Z] new_TokenList_is_empty  Time elapsed: 0 s
20:35:38 [2021-11-27T01:35:38.701Z] Running org.eclipse.ease.ui.completion.ScriptCompletionProposalTest
20:35:38 [2021-11-27T01:35:38.701Z] Tests run: 8, Failures: 0, Errors: 0, Skipped: 0, Time elapsed: 0.002 s - in org.eclipse.ease.ui.completion.ScriptCompletionProposalTest
20:35:38 [2021-11-27T01:35:38.701Z] getCursorPosition_equals_end_of_inserted_text  Time elapsed: 0.001 s
20:35:38 [2021-11-27T01:35:38.701Z] getCursorPosition_equals_end_of_appended_text  Time elapsed: 0 s
20:35:38 [2021-11-27T01:35:38.701Z] compareTo_lists_higher_priority_first  Time elapsed: 0 s
20:35:38 [2021-11-27T01:35:38.701Z] getContent_inserts_replacement_text  Time elapsed: 0 s
20:35:38 [2021-11-27T01:35:38.701Z] getCursorPosition_equals_end_of_set_text  Time elapsed: 0.001 s
20:35:38 [2021-11-27T01:35:38.701Z] getContent_sets_replacement_text  Time elapsed: 0 s
20:35:38 [2021-11-27T01:35:38.701Z] compareTo_lists_same_prio_in_alphabetic_order  Time elapsed: 0 s
20:35:38 [2021-11-27T01:35:38.701Z] getContent_appends_replacement_text  Time elapsed: 0 s
20:35:38 [2021-11-27T01:35:38.701Z] Running org.eclipse.ease.ui.completion.CodeCompletionAggregatorTest
20:35:38 [2021-11-27T01:35:38.959Z] Tests run: 4, Failures: 0, Errors: 0, Skipped: 0, Time elapsed: 0.081 s - in org.eclipse.ease.ui.completion.CodeCompletionAggregatorTest
20:35:38 [2021-11-27T01:35:38.959Z] context_for_empty_input  Time elapsed: 0.075 s
20:35:38 [2021-11-27T01:35:38.959Z] context_for_root_package_with_suffix  Time elapsed: 0.001 s
20:35:38 [2021-11-27T01:35:38.959Z] getProposals_contains_proposal_from_local_provider  Time elapsed: 0.002 s
20:35:38 [2021-11-27T01:35:38.959Z] context_for_root_package  Time elapsed: 0.001 s
20:35:38 [2021-11-27T01:35:38.959Z] Running org.eclipse.ease.ui.dnd.ModulesDropHandlerTest
20:35:38 [2021-11-27T01:35:38.959Z] Tests run: 2, Failures: 0, Errors: 0, Skipped: 0, Time elapsed: 0.011 s - in org.eclipse.ease.ui.dnd.ModulesDropHandlerTest
20:35:38 [2021-11-27T01:35:38.959Z] accepts_true_for_ModuleEntry  Time elapsed: 0.011 s
20:35:38 [2021-11-27T01:35:38.959Z] accepts_true_for_ModuleDefinition  Time elapsed: 0 s
20:35:38 [2021-11-27T01:35:38.959Z] Running org.eclipse.ease.ui.help.hovers.ModuleHelpTest
20:35:38 [2021-11-27T01:35:38.959Z] Tests run: 4, Failures: 0, Errors: 0, Skipped: 4, Time elapsed: 0.002 s - in org.eclipse.ease.ui.help.hovers.ModuleHelpTest
20:35:38 [2021-11-27T01:35:38.959Z] getModuleHelpLocation skipped
20:35:38 [2021-11-27T01:35:38.959Z] getModuleHelp skipped
20:35:38 [2021-11-27T01:35:38.959Z] getMethodHelp skipped
20:35:38 [2021-11-27T01:35:38.959Z] getConstantHelp skipped
20:35:38 [2021-11-27T01:35:38.959Z] 
20:35:38 [2021-11-27T01:35:38.959Z] Results:
20:35:38 [2021-11-27T01:35:38.959Z] 
20:35:38 [2021-11-27T01:35:38.959Z] Tests run: 219, Failures: 0, Errors: 0, Skipped: 4
20:35:38 [2021-11-27T01:35:38.959Z] 
20:35:39 [2021-11-27T01:35:39.217Z] [INFO] All tests passed!
20:35:39 [2021-11-27T01:35:39.217Z] [INFO] 
20:35:39 [2021-11-27T01:35:39.217Z] [INFO] --- maven-pmd-plugin:3.15.0:pmd (pmd-integration) @ org.eclipse.ease.ui.test ---
20:35:39 [2021-11-27T01:35:39.217Z] [INFO] PMD version: 6.38.0
20:35:39 [2021-11-27T01:35:39.218Z] [WARNING] Could not find class org.eclipse.ease.ui.completion.BasicContextTest, due to: java.lang.IncompatibleClassChangeError: class net.sourceforge.pmd.lang.java.typeresolution.visitors.PMDASMVisitor has interface org.objectweb.asm.ClassVisitor as super class
20:35:39 [2021-11-27T01:35:39.218Z] [WARNING] Could not find class org.eclipse.ease.ui.completion.CodeCompletionAggregatorTest, due to: java.lang.IncompatibleClassChangeError: class net.sourceforge.pmd.lang.java.typeresolution.visitors.PMDASMVisitor has interface org.objectweb.asm.ClassVisitor as super class
20:35:39 [2021-11-27T01:35:39.499Z] [WARNING] Could not find class org.eclipse.ease.ui.completion.ScriptCompletionProposalTest, due to: java.lang.IncompatibleClassChangeError: class net.sourceforge.pmd.lang.java.typeresolution.visitors.PMDASMVisitor has interface org.objectweb.asm.ClassVisitor as super class
20:35:39 [2021-11-27T01:35:39.499Z] [WARNING] Could not find class org.eclipse.ease.ui.completion.provider.AbstractCompletionProviderTest, due to: java.lang.IncompatibleClassChangeError: class net.sourceforge.pmd.lang.java.typeresolution.visitors.PMDASMVisitor has interface org.objectweb.asm.ClassVisitor as super class
20:35:39 [2021-11-27T01:35:39.499Z] [WARNING] Could not find class org.eclipse.ease.ui.completion.provider.AbstractPathCompletionProviderTest, due to: java.lang.IncompatibleClassChangeError: class net.sourceforge.pmd.lang.java.typeresolution.visitors.PMDASMVisitor has interface org.objectweb.asm.ClassVisitor as super class
20:35:39 [2021-11-27T01:35:39.499Z] [WARNING] Could not find class org.eclipse.ease.ui.completion.provider.LoadModuleCompletionProviderTest, due to: java.lang.IncompatibleClassChangeError: class net.sourceforge.pmd.lang.java.typeresolution.visitors.PMDASMVisitor has interface org.objectweb.asm.ClassVisitor as super class
20:35:39 [2021-11-27T01:35:39.500Z] [WARNING] Could not find class org.eclipse.ease.ui.completion.provider.LoadedModuleCompletionProviderTest, due to: java.lang.IncompatibleClassChangeError: class net.sourceforge.pmd.lang.java.typeresolution.visitors.PMDASMVisitor has interface org.objectweb.asm.ClassVisitor as super class
20:35:39 [2021-11-27T01:35:39.500Z] [WARNING] Could not find class org.eclipse.ease.ui.completion.provider.LocationResolverTest, due to: java.lang.IncompatibleClassChangeError: class net.sourceforge.pmd.lang.java.typeresolution.visitors.PMDASMVisitor has interface org.objectweb.asm.ClassVisitor as super class
20:35:39 [2021-11-27T01:35:39.500Z] [WARNING] Could not find class org.eclipse.ease.ui.completion.provider.VariablesCompletionProviderTest, due to: java.lang.IncompatibleClassChangeError: class net.sourceforge.pmd.lang.java.typeresolution.visitors.PMDASMVisitor has interface org.objectweb.asm.ClassVisitor as super class
20:35:39 [2021-11-27T01:35:39.500Z] [WARNING] Could not find class org.eclipse.ease.ui.completion.tokenizer.BracketMatcherTest, due to: java.lang.IncompatibleClassChangeError: class net.sourceforge.pmd.lang.java.typeresolution.visitors.PMDASMVisitor has interface org.objectweb.asm.ClassVisitor as super class
20:35:39 [2021-11-27T01:35:39.800Z] [WARNING] Could not find class org.eclipse.ease.ui.completion.tokenizer.TokenListTest, due to: java.lang.IncompatibleClassChangeError: class net.sourceforge.pmd.lang.java.typeresolution.visitors.PMDASMVisitor has interface org.objectweb.asm.ClassVisitor as super class
20:35:39 [2021-11-27T01:35:39.800Z] [WARNING] Could not find class org.eclipse.ease.ui.dnd.ModulesDropHandlerTest, due to: java.lang.IncompatibleClassChangeError: class net.sourceforge.pmd.lang.java.typeresolution.visitors.PMDASMVisitor has interface org.objectweb.asm.ClassVisitor as super class
20:35:39 [2021-11-27T01:35:39.800Z] [WARNING] Could not find class org.eclipse.ease.ui.help.hovers.ModuleHelpTest, due to: java.lang.IncompatibleClassChangeError: class net.sourceforge.pmd.lang.java.typeresolution.visitors.PMDASMVisitor has interface org.objectweb.asm.ClassVisitor as super class
20:35:39 [2021-11-27T01:35:39.800Z] [WARNING] Could not find class org.eclipse.ease.ui.help.hovers.SampleModule, due to: java.lang.IncompatibleClassChangeError: class net.sourceforge.pmd.lang.java.typeresolution.visitors.PMDASMVisitor has interface org.objectweb.asm.ClassVisitor as super class
20:35:39 [2021-11-27T01:35:39.800Z] [WARNING] Could not find class org.eclipse.ease.ui.test.RootModule, due to: java.lang.IncompatibleClassChangeError: class net.sourceforge.pmd.lang.java.typeresolution.visitors.PMDASMVisitor has interface org.objectweb.asm.ClassVisitor as super class
20:35:39 [2021-11-27T01:35:39.800Z] [WARNING] Could not find class org.eclipse.ease.ui.test.SubModule, due to: java.lang.IncompatibleClassChangeError: class net.sourceforge.pmd.lang.java.typeresolution.visitors.PMDASMVisitor has interface org.objectweb.asm.ClassVisitor as super class
20:35:39 [2021-11-27T01:35:39.800Z] [WARNING] Could not find class org.eclipse.ease.ui.views.shell.dropins.modules.ModulesStackLabelProviderTest, due to: java.lang.IncompatibleClassChangeError: class net.sourceforge.pmd.lang.java.typeresolution.visitors.PMDASMVisitor has interface org.objectweb.asm.ClassVisitor as super class
20:35:39 [2021-11-27T01:35:39.800Z] [WARNING] Could not find class org.eclipse.ease.ui.views.shell.dropins.modules.ModulesStackContentProviderTest, due to: java.lang.IncompatibleClassChangeError: class net.sourceforge.pmd.lang.java.typeresolution.visitors.PMDASMVisitor has interface org.objectweb.asm.ClassVisitor as super class
20:35:39 [2021-11-27T01:35:39.801Z] [WARNING] Could not find class org.eclipse.ease.ui.views.shell.dropins.variables.ContentLabelProviderTest, due to: java.lang.IncompatibleClassChangeError: class net.sourceforge.pmd.lang.java.typeresolution.visitors.PMDASMVisitor has interface org.objectweb.asm.ClassVisitor as super class
20:35:39 [2021-11-27T01:35:39.801Z] [WARNING] Could not find class org.eclipse.ease.ui.views.shell.dropins.variables.HiddenVariablesFilterTest, due to: java.lang.IncompatibleClassChangeError: class net.sourceforge.pmd.lang.java.typeresolution.visitors.PMDASMVisitor has interface org.objectweb.asm.ClassVisitor as super class
20:35:39 [2021-11-27T01:35:39.801Z] [WARNING] Could not find class org.eclipse.ease.ui.views.shell.dropins.variables.VariablesComparatorTest, due to: java.lang.IncompatibleClassChangeError: class net.sourceforge.pmd.lang.java.typeresolution.visitors.PMDASMVisitor has interface org.objectweb.asm.ClassVisitor as super class
20:35:39 [2021-11-27T01:35:39.801Z] [WARNING] Could not find class org.eclipse.ease.ui.views.shell.dropins.variables.VariablesContentProviderTest, due to: java.lang.IncompatibleClassChangeError: class net.sourceforge.pmd.lang.java.typeresolution.visitors.PMDASMVisitor has interface org.objectweb.asm.ClassVisitor as super class
20:35:39 [2021-11-27T01:35:39.801Z] [WARNING] Could not find class org.eclipse.ease.ui.views.shell.dropins.variables.VariablesLabelProviderTest, due to: java.lang.IncompatibleClassChangeError: class net.sourceforge.pmd.lang.java.typeresolution.visitors.PMDASMVisitor has interface org.objectweb.asm.ClassVisitor as super class
20:35:39 [2021-11-27T01:35:39.801Z] [WARNING] There are 2 PMD processing errors:
20:35:39 [2021-11-27T01:35:39.801Z] [WARNING] /home/jenkins/agent/workspace/ease.verify.core.target.2020-03/tests/org.eclipse.ease.ui.test/src/org/eclipse/ease/ui/completion/provider/AbstractFileLocationCompletionProviderTest.java: PMDException: Error while processing /home/jenkins/agent/workspace/ease.verify.core.target.2020-03/tests/org.eclipse.ease.ui.test/src/org/eclipse/ease/ui/completion/provider/AbstractFileLocationCompletionProviderTest.java
20:35:39 [2021-11-27T01:35:39.801Z] /home/jenkins/agent/workspace/ease.verify.core.target.2020-03/tests/org.eclipse.ease.ui.test/src/org/eclipse/ease/ui/completion/tokenizer/InputTokenizerTest.java: PMDException: Error while processing /home/jenkins/agent/workspace/ease.verify.core.target.2020-03/tests/org.eclipse.ease.ui.test/src/org/eclipse/ease/ui/completion/tokenizer/InputTokenizerTest.java
20:35:40 [2021-11-27T01:35:40.058Z] [INFO] 
20:35:40 [2021-11-27T01:35:40.058Z] [INFO] --- maven-pmd-plugin:3.15.0:cpd (pmd-integration) @ org.eclipse.ease.ui.test ---
20:35:40 [2021-11-27T01:35:40.058Z] [INFO] PMD version: 6.38.0
20:35:40 [2021-11-27T01:35:40.058Z] [INFO] 
20:35:40 [2021-11-27T01:35:40.058Z] [INFO] --- spotbugs-maven-plugin:4.1.4:spotbugs (spotbugs-integration) @ org.eclipse.ease.ui.test ---
20:35:40 [2021-11-27T01:35:40.059Z] [INFO] Fork Value is false
20:35:40 [2021-11-27T01:35:40.059Z]      [java] JVM args ignored when same JVM is used.
20:35:43 [2021-11-27T01:35:43.351Z] [INFO] Done SpotBugs Analysis....
20:35:43 [2021-11-27T01:35:43.351Z] [INFO] 
20:35:43 [2021-11-27T01:35:43.351Z] [INFO] --- maven-checkstyle-plugin:3.1.1:check (checkstyle-integration) @ org.eclipse.ease.ui.test ---
20:35:43 [2021-11-27T01:35:43.351Z] [INFO] You have 0 Checkstyle violations.
20:35:43 [2021-11-27T01:35:43.351Z] [INFO] 
20:35:43 [2021-11-27T01:35:43.351Z] [INFO] --- maven-install-plugin:2.3.1:install (default-install) @ org.eclipse.ease.ui.test ---
20:35:43 [2021-11-27T01:35:43.351Z] [INFO] Installing /home/jenkins/agent/workspace/ease.verify.core.target.2020-03/tests/org.eclipse.ease.ui.test/target/org.eclipse.ease.ui.test-0.9.0-SNAPSHOT.jar to /home/jenkins/.m2/repository/org/eclipse/ease/org.eclipse.ease.ui.test/0.9.0-SNAPSHOT/org.eclipse.ease.ui.test-0.9.0-SNAPSHOT.jar
20:35:43 [2021-11-27T01:35:43.351Z] [INFO] Installing /home/jenkins/agent/workspace/ease.verify.core.target.2020-03/tests/org.eclipse.ease.ui.test/pom.xml to /home/jenkins/.m2/repository/org/eclipse/ease/org.eclipse.ease.ui.test/0.9.0-SNAPSHOT/org.eclipse.ease.ui.test-0.9.0-SNAPSHOT.pom
20:35:43 [2021-11-27T01:35:43.351Z] [INFO] Installing /home/jenkins/agent/workspace/ease.verify.core.target.2020-03/tests/org.eclipse.ease.ui.test/target/p2content.xml to /home/jenkins/.m2/repository/org/eclipse/ease/org.eclipse.ease.ui.test/0.9.0-SNAPSHOT/org.eclipse.ease.ui.test-0.9.0-SNAPSHOT-p2metadata.xml
20:35:43 [2021-11-27T01:35:43.351Z] [INFO] Installing /home/jenkins/agent/workspace/ease.verify.core.target.2020-03/tests/org.eclipse.ease.ui.test/target/p2artifacts.xml to /home/jenkins/.m2/repository/org/eclipse/ease/org.eclipse.ease.ui.test/0.9.0-SNAPSHOT/org.eclipse.ease.ui.test-0.9.0-SNAPSHOT-p2artifacts.xml
20:35:43 [2021-11-27T01:35:43.351Z] [INFO] 
20:35:43 [2021-11-27T01:35:43.351Z] [INFO] --- tycho-p2-plugin:2.2.0:update-local-index (default-update-local-index) @ org.eclipse.ease.ui.test ---
20:35:43 [2021-11-27T01:35:43.351Z] [INFO] 
20:35:43 [2021-11-27T01:35:43.351Z] [INFO] -----< org.eclipse.ease:org.eclipse.ease.ui.completions.java.test >-----
20:35:43 [2021-11-27T01:35:43.351Z] [INFO] Building org.eclipse.ease.ui.completions.java.test 0.9.0-SNAPSHOT [47/49]
20:35:43 [2021-11-27T01:35:43.351Z] [INFO] ------------------------[ eclipse-test-plugin ]-------------------------
20:35:43 [2021-11-27T01:35:43.351Z] [INFO] 
20:35:43 [2021-11-27T01:35:43.351Z] [INFO] --- maven-clean-plugin:2.5:clean (default-clean) @ org.eclipse.ease.ui.completions.java.test ---
20:35:43 [2021-11-27T01:35:43.351Z] [INFO] 
20:35:43 [2021-11-27T01:35:43.351Z] [INFO] --- tycho-packaging-plugin:2.2.0:build-qualifier (default-build-qualifier) @ org.eclipse.ease.ui.completions.java.test ---
20:35:43 [2021-11-27T01:35:43.351Z] [INFO] The project's OSGi version is 0.9.0.I202110141644
20:35:43 [2021-11-27T01:35:43.351Z] [INFO] 
20:35:43 [2021-11-27T01:35:43.351Z] [INFO] --- tycho-packaging-plugin:2.2.0:validate-id (default-validate-id) @ org.eclipse.ease.ui.completions.java.test ---
20:35:43 [2021-11-27T01:35:43.351Z] [INFO] 
20:35:43 [2021-11-27T01:35:43.351Z] [INFO] --- tycho-packaging-plugin:2.2.0:validate-version (default-validate-version) @ org.eclipse.ease.ui.completions.java.test ---
20:35:43 [2021-11-27T01:35:43.351Z] [INFO] 
20:35:43 [2021-11-27T01:35:43.352Z] [INFO] --- maven-resources-plugin:2.4.3:resources (default-resources) @ org.eclipse.ease.ui.completions.java.test ---
20:35:43 [2021-11-27T01:35:43.352Z] [INFO] Using 'UTF-8' encoding to copy filtered resources.
20:35:43 [2021-11-27T01:35:43.352Z] [INFO] skip non existing resourceDirectory /home/jenkins/agent/workspace/ease.verify.core.target.2020-03/tests/org.eclipse.ease.ui.completions.java.test/src/main/resources
20:35:43 [2021-11-27T01:35:43.352Z] [INFO] 
20:35:43 [2021-11-27T01:35:43.352Z] [INFO] --- tycho-compiler-plugin:2.2.0:compile (default-compile) @ org.eclipse.ease.ui.completions.java.test ---
20:35:43 [2021-11-27T01:35:43.352Z] [INFO] Compiling 4 source files to /home/jenkins/agent/workspace/ease.verify.core.target.2020-03/tests/org.eclipse.ease.ui.completions.java.test/target/classes
20:35:43 [2021-11-27T01:35:43.352Z] [INFO] 
20:35:43 [2021-11-27T01:35:43.352Z] [INFO] --- maven-resources-plugin:2.4.3:testResources (default-testResources) @ org.eclipse.ease.ui.completions.java.test ---
20:35:43 [2021-11-27T01:35:43.352Z] [INFO] Using 'UTF-8' encoding to copy filtered resources.
20:35:43 [2021-11-27T01:35:43.352Z] [INFO] skip non existing resourceDirectory /home/jenkins/agent/workspace/ease.verify.core.target.2020-03/tests/org.eclipse.ease.ui.completions.java.test/src/test/resources
20:35:43 [2021-11-27T01:35:43.352Z] [INFO] 
20:35:43 [2021-11-27T01:35:43.352Z] [INFO] --- target-platform-configuration:2.2.0:target-platform (default-target-platform) @ org.eclipse.ease.ui.completions.java.test ---
20:35:43 [2021-11-27T01:35:43.352Z] [INFO] 
20:35:43 [2021-11-27T01:35:43.352Z] [INFO] --- tycho-packaging-plugin:2.2.0:package-plugin (default-package-plugin) @ org.eclipse.ease.ui.completions.java.test ---
20:35:43 [2021-11-27T01:35:43.352Z] [INFO] Building jar: /home/jenkins/agent/workspace/ease.verify.core.target.2020-03/tests/org.eclipse.ease.ui.completions.java.test/target/org.eclipse.ease.ui.completions.java.test-0.9.0-SNAPSHOT.jar
20:35:43 [2021-11-27T01:35:43.352Z] [INFO] 
20:35:43 [2021-11-27T01:35:43.352Z] [INFO] --- tycho-p2-plugin:2.2.0:p2-metadata-default (default-p2-metadata-default) @ org.eclipse.ease.ui.completions.java.test ---
20:35:43 [2021-11-27T01:35:43.352Z] [INFO] 
20:35:43 [2021-11-27T01:35:43.352Z] [INFO] --- jacoco-maven-plugin:0.8.6:prepare-agent (jacoco-initialize) @ org.eclipse.ease.ui.completions.java.test ---
20:35:43 [2021-11-27T01:35:43.352Z] [INFO] tycho.testArgLine set to -javaagent:/home/jenkins/.m2/repository/org/jacoco/org.jacoco.agent/0.8.6/org.jacoco.agent-0.8.6-runtime.jar=destfile=/home/jenkins/agent/workspace/ease.verify.core.target.2020-03/tests/org.eclipse.ease.ui.completions.java.test/target/jacoco.exec,output=file
20:35:43 [2021-11-27T01:35:43.352Z] [INFO] 
20:35:43 [2021-11-27T01:35:43.352Z] [INFO] --- tycho-surefire-plugin:2.2.0:test (default-test) @ org.eclipse.ease.ui.completions.java.test ---
20:35:43 [2021-11-27T01:35:43.352Z] [INFO] Executing Test Runtime with timeout 0, logs (if any) will be placed at: /home/jenkins/agent/workspace/ease.verify.core.target.2020-03/tests/org.eclipse.ease.ui.completions.java.test/target/work/data/.metadata/.log
20:35:43 [2021-11-27T01:35:43.352Z] [INFO] Command line:
20:35:43 [2021-11-27T01:35:43.353Z] 	[/opt/tools/java/openjdk/jdk-15/15.0.2+7/bin/java, -Dosgi.noShutdown=false, -Dosgi.os=linux, -Dosgi.ws=gtk, -Dosgi.arch=x86_64, -javaagent:/home/jenkins/.m2/repository/org/jacoco/org.jacoco.agent/0.8.6/org.jacoco.agent-0.8.6-runtime.jar=destfile=/home/jenkins/agent/workspace/ease.verify.core.target.2020-03/tests/org.eclipse.ease.ui.completions.java.test/target/jacoco.exec,output=file, -Dosgi.clean=true, -jar, /home/jenkins/.m2/repository/p2/osgi/bundle/org.eclipse.equinox.launcher/1.6.300.v20210813-1054/org.eclipse.equinox.launcher-1.6.300.v20210813-1054.jar, -data, /home/jenkins/agent/workspace/ease.verify.core.target.2020-03/tests/org.eclipse.ease.ui.completions.java.test/target/work/data, -install, /home/jenkins/agent/workspace/ease.verify.core.target.2020-03/tests/org.eclipse.ease.ui.completions.java.test/target/work, -configuration, /home/jenkins/agent/workspace/ease.verify.core.target.2020-03/tests/org.eclipse.ease.ui.completions.java.test/target/work/configuration, -application, org.eclipse.tycho.surefire.osgibooter.headlesstest, -testproperties, /home/jenkins/agent/workspace/ease.verify.core.target.2020-03/tests/org.eclipse.ease.ui.completions.java.test/target/surefire.properties]
20:35:43 [2021-11-27T01:35:43.353Z] Picked up JAVA_TOOL_OPTIONS: -Dmaven.ext.class.path="/home/jenkins/agent/workspace/ease.verify.core.target.2020-03@tmp/withMavencb38ccb9/pipeline-maven-spy.jar" -Dorg.jenkinsci.plugins.pipeline.maven.reportsFolder="/home/jenkins/agent/workspace/ease.verify.core.target.2020-03@tmp/withMavencb38ccb9" 
20:35:46 [2021-11-27T01:35:46.646Z] Running org.eclipse.ease.ui.completions.java.provider.JavaMethodCompletionProviderTest
20:35:47 [2021-11-27T01:35:47.578Z] Tests run: 23, Failures: 0, Errors: 0, Skipped: 0, Time elapsed: 0.819 s - in org.eclipse.ease.ui.completions.java.provider.JavaMethodCompletionProviderTest
20:35:47 [2021-11-27T01:35:47.578Z] prepareProposals_class_does_not_contain_isntance_methods  Time elapsed: 0.731 s
20:35:47 [2021-11-27T01:35:47.578Z] prepareProposals_instance_contains_method_with_filter  Time elapsed: 0.001 s
20:35:47 [2021-11-27T01:35:47.578Z] prepareProposals_method_contains_instance_methods  Time elapsed: 0.001 s
20:35:47 [2021-11-27T01:35:47.578Z] prepareProposals_instance_contains_instance_methods  Time elapsed: 0.001 s
20:35:47 [2021-11-27T01:35:47.578Z] prepareProposals_class_contains_static_methods  Time elapsed: 0.001 s
20:35:47 [2021-11-27T01:35:47.578Z] proposal_replacement_string_contains_leading_dot  Time elapsed: 0.003 s
20:35:47 [2021-11-27T01:35:47.578Z] prepareProposals_instance_does_not_contain_static_methods  Time elapsed: 0.001 s
20:35:47 [2021-11-27T01:35:47.578Z] prepareProposals_class_contains_static_fields  Time elapsed: 0.001 s
20:35:47 [2021-11-27T01:35:47.578Z] prepareProposals_instance_does_not_contain_static_fields  Time elapsed: 0.001 s
20:35:47 [2021-11-27T01:35:47.578Z] prepareProposals_does_not_contain_methods_of_base_class_for_method_context  Time elapsed: 0.002 s
20:35:47 [2021-11-27T01:35:47.578Z] isActive_equals_false{String}[1]  Time elapsed: 0.011 s
20:35:47 [2021-11-27T01:35:47.578Z] isActive_equals_false{String}[2]  Time elapsed: 0 s
20:35:47 [2021-11-27T01:35:47.578Z] isActive_equals_false{String}[3]  Time elapsed: 0 s
20:35:47 [2021-11-27T01:35:47.578Z] isActive_equals_true{String}[1]  Time elapsed: 0.001 s
20:35:47 [2021-11-27T01:35:47.578Z] isActive_equals_true{String}[2]  Time elapsed: 0 s
20:35:47 [2021-11-27T01:35:47.578Z] isActive_equals_true{String}[3]  Time elapsed: 0 s
20:35:47 [2021-11-27T01:35:47.578Z] isActive_equals_true{String}[4]  Time elapsed: 0.001 s
20:35:47 [2021-11-27T01:35:47.578Z] isActive_equals_true{String}[5]  Time elapsed: 0.001 s
20:35:47 [2021-11-27T01:35:47.578Z] isActive_equals_true{String}[6]  Time elapsed: 0 s
20:35:47 [2021-11-27T01:35:47.578Z] isActive_equals_true{String}[7]  Time elapsed: 0 s
20:35:47 [2021-11-27T01:35:47.578Z] isActive_equals_true{String}[8]  Time elapsed: 0.001 s
20:35:47 [2021-11-27T01:35:47.578Z] isActive_equals_true{String}[9]  Time elapsed: 0.001 s
20:35:47 [2021-11-27T01:35:47.578Z] isActive_equals_true{String}[10]  Time elapsed: 0 s
20:35:47 [2021-11-27T01:35:47.578Z] Running org.eclipse.ease.ui.completions.java.provider.JavaResourcesTest
20:35:47 [2021-11-27T01:35:47.836Z] Tests run: 5, Failures: 0, Errors: 0, Skipped: 0, Time elapsed: 0.304 s - in org.eclipse.ease.ui.completions.java.provider.JavaResourcesTest
20:35:47 [2021-11-27T01:35:47.836Z] getClasses_with_filter_is_populated  Time elapsed: 0.001 s
20:35:47 [2021-11-27T01:35:47.836Z] getClasses_is_populated  Time elapsed: 0 s
20:35:47 [2021-11-27T01:35:47.836Z] singleton_exists  Time elapsed: 0 s
20:35:47 [2021-11-27T01:35:47.836Z] getPackages_is_populated  Time elapsed: 0.001 s
20:35:47 [2021-11-27T01:35:47.836Z] getClasses_with_filter_contains_File_class  Time elapsed: 0 s
20:35:47 [2021-11-27T01:35:47.836Z] Running org.eclipse.ease.ui.completions.java.provider.JavaPackagesCompletionProviderTest
20:35:47 [2021-11-27T01:35:47.836Z] Tests run: 28, Failures: 0, Errors: 0, Skipped: 0, Time elapsed: 0.044 s - in org.eclipse.ease.ui.completions.java.provider.JavaPackagesCompletionProviderTest
20:35:47 [2021-11-27T01:35:47.836Z] proposal_java_preserves_suffix  Time elapsed: 0.003 s
20:35:47 [2021-11-27T01:35:47.836Z] proposal_java_appends_to_prefix  Time elapsed: 0.001 s
20:35:47 [2021-11-27T01:35:47.836Z] prepareProposals_instance_contains_root_package_after_new_keyword  Time elapsed: 0 s
20:35:47 [2021-11-27T01:35:47.836Z] proposal_java_replaces_filter  Time elapsed: 0 s
20:35:47 [2021-11-27T01:35:47.836Z] prepareProposals_instance_contains_sub_package  Time elapsed: 0.001 s
20:35:47 [2021-11-27T01:35:47.836Z] prepareProposals_instance_contains_3rd_level  Time elapsed: 0 s
20:35:47 [2021-11-27T01:35:47.836Z] isActive_equals_false{String}[1]  Time elapsed: 0.017 s
20:35:47 [2021-11-27T01:35:47.836Z] isActive_equals_false{String}[2]  Time elapsed: 0.001 s
20:35:47 [2021-11-27T01:35:47.836Z] isActive_equals_false{String}[3]  Time elapsed: 0.001 s
20:35:47 [2021-11-27T01:35:47.836Z] isActive_equals_false{String}[4]  Time elapsed: 0.001 s
20:35:47 [2021-11-27T01:35:47.836Z] prepareProposals_contains_root_package{String}[1]  Time elapsed: 0.001 s
20:35:47 [2021-11-27T01:35:47.836Z] prepareProposals_contains_root_package{String}[2]  Time elapsed: 0.001 s
20:35:47 [2021-11-27T01:35:47.836Z] prepareProposals_contains_root_package{String}[3]  Time elapsed: 0.001 s
20:35:47 [2021-11-27T01:35:47.836Z] isActive_equals_true{String}[1]  Time elapsed: 0 s
20:35:47 [2021-11-27T01:35:47.836Z] isActive_equals_true{String}[2]  Time elapsed: 0 s
20:35:47 [2021-11-27T01:35:47.836Z] isActive_equals_true{String}[3]  Time elapsed: 0.001 s
20:35:47 [2021-11-27T01:35:47.836Z] isActive_equals_true{String}[4]  Time elapsed: 0 s
20:35:47 [2021-11-27T01:35:47.836Z] isActive_equals_true{String}[5]  Time elapsed: 0.001 s
20:35:47 [2021-11-27T01:35:47.836Z] isActive_equals_true{String}[6]  Time elapsed: 0.001 s
20:35:47 [2021-11-27T01:35:47.836Z] isActive_equals_true{String}[7]  Time elapsed: 0 s
20:35:47 [2021-11-27T01:35:47.836Z] isActive_equals_true{String}[8]  Time elapsed: 0 s
20:35:47 [2021-11-27T01:35:47.836Z] isActive_equals_true{String}[9]  Time elapsed: 0 s
20:35:47 [2021-11-27T01:35:47.836Z] isActive_equals_true{String}[10]  Time elapsed: 0 s
20:35:47 [2021-11-27T01:35:47.836Z] isActive_equals_true{String}[11]  Time elapsed: 0 s
20:35:47 [2021-11-27T01:35:47.836Z] isActive_equals_true{String}[12]  Time elapsed: 0 s
20:35:47 [2021-11-27T01:35:47.836Z] isActive_equals_true{String}[13]  Time elapsed: 0 s
20:35:47 [2021-11-27T01:35:47.836Z] isActive_equals_true{String}[14]  Time elapsed: 0.001 s
20:35:47 [2021-11-27T01:35:47.836Z] prepareProposals_is_empty_for_exact_class_context  Time elapsed: 0 s
20:35:47 [2021-11-27T01:35:47.836Z] Running org.eclipse.ease.ui.completions.java.provider.JavaClassCompletionProviderTest
20:35:47 [2021-11-27T01:35:47.836Z] Tests run: 16, Failures: 0, Errors: 0, Skipped: 0, Time elapsed: 0.056 s - in org.eclipse.ease.ui.completions.java.provider.JavaClassCompletionProviderTest
20:35:47 [2021-11-27T01:35:47.836Z] prepareProposals_instance_contains_class_for_package_context_with_filter  Time elapsed: 0.002 s
20:35:47 [2021-11-27T01:35:47.836Z] prepareProposals_instance_contains_inner_class_for_class_context  Time elapsed: 0.002 s
20:35:47 [2021-11-27T01:35:47.836Z] prepareProposals_instance_contains_class_for_package_context  Time elapsed: 0.002 s
20:35:47 [2021-11-27T01:35:47.836Z] prepareProposals_instance_contains_class_for_partial_context  Time elapsed: 0.002 s
20:35:47 [2021-11-27T01:35:47.836Z] prepareProposals_instance_contains_inner_class_for_class_context_with_filter  Time elapsed: 0.001 s
20:35:47 [2021-11-27T01:35:47.836Z] prepareProposals_instance_contains_class_for_global_context  Time elapsed: 0.037 s
20:35:47 [2021-11-27T01:35:47.837Z] prepareProposals_does_not_contain_inner_class_for_a_given_inner_class_context  Time elapsed: 0 s
20:35:47 [2021-11-27T01:35:47.837Z] isActive_equals_false{String}[1]  Time elapsed: 0.001 s
20:35:47 [2021-11-27T01:35:47.837Z] isActive_equals_false{String}[2]  Time elapsed: 0 s
20:35:47 [2021-11-27T01:35:47.837Z] isActive_equals_true{String}[1]  Time elapsed: 0.001 s
20:35:47 [2021-11-27T01:35:47.837Z] isActive_equals_true{String}[2]  Time elapsed: 0 s
20:35:47 [2021-11-27T01:35:47.837Z] isActive_equals_true{String}[3]  Time elapsed: 0 s
20:35:47 [2021-11-27T01:35:47.837Z] isActive_equals_true{String}[4]  Time elapsed: 0 s
20:35:47 [2021-11-27T01:35:47.837Z] isActive_equals_true{String}[5]  Time elapsed: 0.001 s
20:35:47 [2021-11-27T01:35:47.837Z] isActive_equals_true{String}[6]  Time elapsed: 0 s
20:35:47 [2021-11-27T01:35:47.837Z] prepareProposals_is_empty_for_exact_class_context  Time elapsed: 0 s
20:35:47 [2021-11-27T01:35:47.837Z] 
20:35:47 [2021-11-27T01:35:47.837Z] Results:
20:35:47 [2021-11-27T01:35:47.837Z] 
20:35:47 [2021-11-27T01:35:47.837Z] Tests run: 72, Failures: 0, Errors: 0, Skipped: 0
20:35:47 [2021-11-27T01:35:47.837Z] 
20:35:48 [2021-11-27T01:35:48.774Z] [INFO] All tests passed!
20:35:48 [2021-11-27T01:35:48.774Z] [INFO] 
20:35:48 [2021-11-27T01:35:48.774Z] [INFO] --- maven-pmd-plugin:3.15.0:pmd (pmd-integration) @ org.eclipse.ease.ui.completions.java.test ---
20:35:48 [2021-11-27T01:35:48.774Z] [INFO] PMD version: 6.38.0
20:35:48 [2021-11-27T01:35:48.774Z] [WARNING] Could not find class org.eclipse.ease.ui.completions.java.provider.JavaClassCompletionProviderTest, due to: java.lang.IncompatibleClassChangeError: class net.sourceforge.pmd.lang.java.typeresolution.visitors.PMDASMVisitor has interface org.objectweb.asm.ClassVisitor as super class
20:35:48 [2021-11-27T01:35:48.774Z] [WARNING] Could not find class org.eclipse.ease.ui.completions.java.provider.JavaMethodCompletionProviderTest, due to: java.lang.IncompatibleClassChangeError: class net.sourceforge.pmd.lang.java.typeresolution.visitors.PMDASMVisitor has interface org.objectweb.asm.ClassVisitor as super class
20:35:49 [2021-11-27T01:35:49.054Z] [WARNING] Could not find class org.eclipse.ease.ui.completions.java.provider.JavaResourcesTest, due to: java.lang.IncompatibleClassChangeError: class net.sourceforge.pmd.lang.java.typeresolution.visitors.PMDASMVisitor has interface org.objectweb.asm.ClassVisitor as super class
20:35:49 [2021-11-27T01:35:49.054Z] [WARNING] Could not find class org.eclipse.ease.ui.completions.java.provider.JavaPackagesCompletionProviderTest, due to: java.lang.IncompatibleClassChangeError: class net.sourceforge.pmd.lang.java.typeresolution.visitors.PMDASMVisitor has interface org.objectweb.asm.ClassVisitor as super class
20:35:49 [2021-11-27T01:35:49.054Z] [INFO] 
20:35:49 [2021-11-27T01:35:49.054Z] [INFO] --- maven-pmd-plugin:3.15.0:cpd (pmd-integration) @ org.eclipse.ease.ui.completions.java.test ---
20:35:49 [2021-11-27T01:35:49.054Z] [INFO] PMD version: 6.38.0
20:35:49 [2021-11-27T01:35:49.054Z] [INFO] 
20:35:49 [2021-11-27T01:35:49.054Z] [INFO] --- spotbugs-maven-plugin:4.1.4:spotbugs (spotbugs-integration) @ org.eclipse.ease.ui.completions.java.test ---
20:35:49 [2021-11-27T01:35:49.054Z] [INFO] Fork Value is false
20:35:49 [2021-11-27T01:35:49.054Z]      [java] JVM args ignored when same JVM is used.
20:35:51 [2021-11-27T01:35:51.604Z] [INFO] Done SpotBugs Analysis....
20:35:51 [2021-11-27T01:35:51.604Z] [INFO] 
20:35:51 [2021-11-27T01:35:51.604Z] [INFO] --- maven-checkstyle-plugin:3.1.1:check (checkstyle-integration) @ org.eclipse.ease.ui.completions.java.test ---
20:35:51 [2021-11-27T01:35:51.604Z] [INFO] You have 0 Checkstyle violations.
20:35:51 [2021-11-27T01:35:51.604Z] [INFO] 
20:35:51 [2021-11-27T01:35:51.604Z] [INFO] --- maven-install-plugin:2.3.1:install (default-install) @ org.eclipse.ease.ui.completions.java.test ---
20:35:51 [2021-11-27T01:35:51.604Z] [INFO] Installing /home/jenkins/agent/workspace/ease.verify.core.target.2020-03/tests/org.eclipse.ease.ui.completions.java.test/target/org.eclipse.ease.ui.completions.java.test-0.9.0-SNAPSHOT.jar to /home/jenkins/.m2/repository/org/eclipse/ease/org.eclipse.ease.ui.completions.java.test/0.9.0-SNAPSHOT/org.eclipse.ease.ui.completions.java.test-0.9.0-SNAPSHOT.jar
20:35:51 [2021-11-27T01:35:51.604Z] [INFO] Installing /home/jenkins/agent/workspace/ease.verify.core.target.2020-03/tests/org.eclipse.ease.ui.completions.java.test/pom.xml to /home/jenkins/.m2/repository/org/eclipse/ease/org.eclipse.ease.ui.completions.java.test/0.9.0-SNAPSHOT/org.eclipse.ease.ui.completions.java.test-0.9.0-SNAPSHOT.pom
20:35:51 [2021-11-27T01:35:51.604Z] [INFO] Installing /home/jenkins/agent/workspace/ease.verify.core.target.2020-03/tests/org.eclipse.ease.ui.completions.java.test/target/p2content.xml to /home/jenkins/.m2/repository/org/eclipse/ease/org.eclipse.ease.ui.completions.java.test/0.9.0-SNAPSHOT/org.eclipse.ease.ui.completions.java.test-0.9.0-SNAPSHOT-p2metadata.xml
20:35:51 [2021-11-27T01:35:51.604Z] [INFO] Installing /home/jenkins/agent/workspace/ease.verify.core.target.2020-03/tests/org.eclipse.ease.ui.completions.java.test/target/p2artifacts.xml to /home/jenkins/.m2/repository/org/eclipse/ease/org.eclipse.ease.ui.completions.java.test/0.9.0-SNAPSHOT/org.eclipse.ease.ui.completions.java.test-0.9.0-SNAPSHOT-p2artifacts.xml
20:35:51 [2021-11-27T01:35:51.604Z] [INFO] 
20:35:51 [2021-11-27T01:35:51.604Z] [INFO] --- tycho-p2-plugin:2.2.0:update-local-index (default-update-local-index) @ org.eclipse.ease.ui.completions.java.test ---
20:35:51 [2021-11-27T01:35:51.604Z] [INFO] 
20:35:51 [2021-11-27T01:35:51.604Z] [INFO] ---------< org.eclipse.ease:org.eclipse.ease.releng.coverage >----------
20:35:51 [2021-11-27T01:35:51.604Z] [INFO] Building org.eclipse.ease.releng.coverage 0.9.0-SNAPSHOT         [48/49]
20:35:51 [2021-11-27T01:35:51.604Z] [INFO] --------------------------------[ pom ]---------------------------------
20:35:51 [2021-11-27T01:35:51.604Z] [INFO] 
20:35:51 [2021-11-27T01:35:51.605Z] [INFO] --- maven-clean-plugin:2.5:clean (default-clean) @ org.eclipse.ease.releng.coverage ---
20:35:51 [2021-11-27T01:35:51.605Z] [INFO] 
20:35:51 [2021-11-27T01:35:51.605Z] [INFO] --- jacoco-maven-plugin:0.8.6:report-aggregate (default) @ org.eclipse.ease.releng.coverage ---
20:35:51 [2021-11-27T01:35:51.605Z] [INFO] Loading execution data file /home/jenkins/agent/workspace/ease.verify.core.target.2020-03/tests/org.eclipse.ease.test/target/jacoco.exec
20:35:51 [2021-11-27T01:35:51.605Z] [INFO] Loading execution data file /home/jenkins/agent/workspace/ease.verify.core.target.2020-03/tests/org.eclipse.ease.lang.javascript.rhino.test/target/jacoco.exec
20:35:51 [2021-11-27T01:35:51.605Z] [INFO] Loading execution data file /home/jenkins/agent/workspace/ease.verify.core.target.2020-03/tests/org.eclipse.ease.lang.javascript.test/target/jacoco.exec
20:35:51 [2021-11-27T01:35:51.605Z] [INFO] Loading execution data file /home/jenkins/agent/workspace/ease.verify.core.target.2020-03/tests/org.eclipse.ease.lang.python.test/target/jacoco.exec
20:35:51 [2021-11-27T01:35:51.605Z] [INFO] Loading execution data file /home/jenkins/agent/workspace/ease.verify.core.target.2020-03/tests/org.eclipse.ease.lang.python.jython.test/target/jacoco.exec
20:35:51 [2021-11-27T01:35:51.605Z] [INFO] Loading execution data file /home/jenkins/agent/workspace/ease.verify.core.target.2020-03/tests/org.eclipse.ease.lang.scriptarchive.test/target/jacoco.exec
20:35:51 [2021-11-27T01:35:51.605Z] [INFO] Loading execution data file /home/jenkins/agent/workspace/ease.verify.core.target.2020-03/tests/org.eclipse.ease.lang.unittest.test/target/jacoco.exec
20:35:51 [2021-11-27T01:35:51.605Z] [INFO] Loading execution data file /home/jenkins/agent/workspace/ease.verify.core.target.2020-03/tests/org.eclipse.ease.ui.scripts.test/target/jacoco.exec
20:35:51 [2021-11-27T01:35:51.605Z] [INFO] Loading execution data file /home/jenkins/agent/workspace/ease.verify.core.target.2020-03/tests/org.eclipse.ease.ui.test/target/jacoco.exec
20:35:51 [2021-11-27T01:35:51.605Z] [INFO] Loading execution data file /home/jenkins/agent/workspace/ease.verify.core.target.2020-03/tests/org.eclipse.ease.ui.completions.java.test/target/jacoco.exec
20:35:51 [2021-11-27T01:35:51.862Z] [INFO] Analyzed bundle 'org.eclipse.ease' with 105 classes
20:35:52 [2021-11-27T01:35:52.120Z] [INFO] Analyzed bundle 'org.eclipse.ease.classloader' with 1 classes
20:35:52 [2021-11-27T01:35:52.120Z] [INFO] Analyzed bundle 'org.eclipse.ease.ui' with 212 classes
20:35:52 [2021-11-27T01:35:52.379Z] [INFO] Analyzed bundle 'org.eclipse.ease.ui.completions.java' with 14 classes
20:35:52 [2021-11-27T01:35:52.379Z] [INFO] Analyzed bundle 'org.eclipse.ease.ui.scripts' with 157 classes
20:35:52 [2021-11-27T01:35:52.379Z] [INFO] Analyzed bundle 'org.eclipse.ease.help' with 0 classes
20:35:52 [2021-11-27T01:35:52.379Z] [INFO] Analyzed bundle 'org.eclipse.ease.lang.javascript' with 5 classes
20:35:52 [2021-11-27T01:35:52.379Z] [INFO] Analyzed bundle 'org.eclipse.ease.lang.javascript.ui' with 4 classes
20:35:52 [2021-11-27T01:35:52.636Z] [INFO] Analyzed bundle 'org.eclipse.ease.lang.javascript.rhino' with 21 classes
20:35:52 [2021-11-27T01:35:52.636Z] [INFO] Analyzed bundle 'org.eclipse.ease.lang.javascript.nashorn' with 2 classes
20:35:52 [2021-11-27T01:35:52.636Z] [INFO] Analyzed bundle 'org.eclipse.ease.lang.python' with 22 classes
20:35:52 [2021-11-27T01:35:52.636Z] [INFO] Analyzed bundle 'org.eclipse.ease.lang.python.jython' with 13 classes
20:35:52 [2021-11-27T01:35:52.636Z] [INFO] Analyzed bundle 'org.eclipse.ease.lang.python.py4j' with 11 classes
20:35:52 [2021-11-27T01:35:52.636Z] [INFO] Analyzed bundle 'org.eclipse.ease.lang.jvm.compiled' with 2 classes
20:35:52 [2021-11-27T01:35:52.636Z] [INFO] Analyzed bundle 'org.eclipse.ease.lang.groovy' with 3 classes
20:35:52 [2021-11-27T01:35:52.636Z] [INFO] Analyzed bundle 'org.eclipse.ease.lang.groovy.interpreter' with 3 classes
20:35:52 [2021-11-27T01:35:52.636Z] [INFO] Analyzed bundle 'org.eclipse.ease.lang.ruby' with 3 classes
20:35:52 [2021-11-27T01:35:52.636Z] [INFO] Analyzed bundle 'org.eclipse.ease.lang.ruby.jruby' with 2 classes
20:35:52 [2021-11-27T01:35:52.636Z] [INFO] Analyzed bundle 'org.eclipse.ease.lang.scriptarchive' with 3 classes
20:35:52 [2021-11-27T01:35:52.636Z] [INFO] Analyzed bundle 'org.eclipse.ease.lang.scriptarchive.ui' with 8 classes
20:35:52 [2021-11-27T01:35:52.636Z] [INFO] Analyzed bundle 'org.eclipse.ease.lang.unittest' with 51 classes
20:35:52 [2021-11-27T01:35:52.899Z] [INFO] Analyzed bundle 'org.eclipse.ease.lang.unittest.ui' with 79 classes
20:35:52 [2021-11-27T01:35:52.899Z] [INFO] 
20:35:52 [2021-11-27T01:35:52.899Z] [INFO] --- maven-install-plugin:2.4:install (default-install) @ org.eclipse.ease.releng.coverage ---
20:35:52 [2021-11-27T01:35:52.900Z] [INFO] Installing /home/jenkins/agent/workspace/ease.verify.core.target.2020-03/releng/org.eclipse.ease.releng.coverage/pom.xml to /home/jenkins/.m2/repository/org/eclipse/ease/org.eclipse.ease.releng.coverage/0.9.0-SNAPSHOT/org.eclipse.ease.releng.coverage-0.9.0-SNAPSHOT.pom
20:35:52 [2021-11-27T01:35:52.900Z] [INFO] 
20:35:52 [2021-11-27T01:35:52.900Z] [INFO] ---------------------< org.eclipse.ease:ease.core >---------------------
20:35:52 [2021-11-27T01:35:52.900Z] [INFO] Building EASE (Incubation) 0.4.0-SNAPSHOT                        [49/49]
20:35:52 [2021-11-27T01:35:52.900Z] [INFO] --------------------------------[ pom ]---------------------------------
20:35:53 [2021-11-27T01:35:53.157Z] [INFO] 
20:35:53 [2021-11-27T01:35:53.157Z] [INFO] --- maven-clean-plugin:2.5:clean (default-clean) @ ease.core ---
20:35:53 [2021-11-27T01:35:53.157Z] [INFO] 
20:35:53 [2021-11-27T01:35:53.157Z] [INFO] --- maven-install-plugin:2.4:install (default-install) @ ease.core ---
20:35:53 [2021-11-27T01:35:53.157Z] [INFO] Installing /home/jenkins/agent/workspace/ease.verify.core.target.2020-03/pom.xml to /home/jenkins/.m2/repository/org/eclipse/ease/ease.core/0.4.0-SNAPSHOT/ease.core-0.4.0-SNAPSHOT.pom
20:35:53 [2021-11-27T01:35:53.157Z] [INFO] ------------------------------------------------------------------------
20:35:53 [2021-11-27T01:35:53.157Z] [INFO] Reactor Summary:
20:35:53 [2021-11-27T01:35:53.157Z] [INFO] 
20:35:53 [2021-11-27T01:35:53.157Z] [INFO] org.eclipse.ease.classloader 0.9.0-SNAPSHOT ........ SUCCESS [01:00 min]
20:35:53 [2021-11-27T01:35:53.157Z] [INFO] org.eclipse.ease 0.9.0-SNAPSHOT .................... SUCCESS [ 14.199 s]
20:35:53 [2021-11-27T01:35:53.157Z] [INFO] org.eclipse.ease.ui 0.9.0-SNAPSHOT ................. SUCCESS [ 18.448 s]
20:35:53 [2021-11-27T01:35:53.157Z] [INFO] org.eclipse.ease.ui.completions.java 0.9.0-SNAPSHOT  SUCCESS [  6.698 s]
20:35:53 [2021-11-27T01:35:53.157Z] [INFO] org.eclipse.ease.ui.scripts 0.9.0-SNAPSHOT ......... SUCCESS [ 13.789 s]
20:35:53 [2021-11-27T01:35:53.157Z] [INFO] org.eclipse.ease.releng 0.9.0-SNAPSHOT ............. SUCCESS [  2.057 s]
20:35:53 [2021-11-27T01:35:53.157Z] [INFO] org.eclipse.ease.lang.javascript 0.9.0-SNAPSHOT .... SUCCESS [  5.005 s]
20:35:53 [2021-11-27T01:35:53.157Z] [INFO] org.eclipse.ease.lang.scriptarchive 0.9.0-SNAPSHOT . SUCCESS [  4.042 s]
20:35:53 [2021-11-27T01:35:53.157Z] [INFO] org.eclipse.ease.lang.python 0.9.0-SNAPSHOT ........ SUCCESS [  5.956 s]
20:35:53 [2021-11-27T01:35:53.157Z] [INFO] org.eclipse.ease.lang.python.py4j 0.9.0-SNAPSHOT ... SUCCESS [  5.706 s]
20:35:53 [2021-11-27T01:35:53.157Z] [INFO] org.eclipse.ease.lang.groovy 0.9.0-SNAPSHOT ........ SUCCESS [  4.005 s]
20:35:53 [2021-11-27T01:35:53.157Z] [INFO] org.eclipse.ease.lang.groovy.interpreter 0.9.0-SNAPSHOT SUCCESS [  4.320 s]
20:35:53 [2021-11-27T01:35:53.157Z] [INFO] org.eclipse.ease.lang.unittest 0.9.0-SNAPSHOT ...... SUCCESS [  9.100 s]
20:35:53 [2021-11-27T01:35:53.157Z] [INFO] org.eclipse.ease.lang.unittest.ui 0.9.0-SNAPSHOT ... SUCCESS [  9.787 s]
20:35:53 [2021-11-27T01:35:53.157Z] [INFO] org.eclipse.ease.lang.ruby 0.9.0-SNAPSHOT .......... SUCCESS [  4.097 s]
20:35:53 [2021-11-27T01:35:53.157Z] [INFO] org.eclipse.ease.lang.ruby.jruby 0.9.0-SNAPSHOT .... SUCCESS [  3.792 s]
20:35:53 [2021-11-27T01:35:53.157Z] [INFO] org.eclipse.ease.lang.javascript.nashorn 0.9.0-SNAPSHOT SUCCESS [  4.337 s]
20:35:53 [2021-11-27T01:35:53.157Z] [INFO] org.eclipse.ease.lang.javascript.rhino 0.9.0-SNAPSHOT SUCCESS [  6.380 s]
20:35:53 [2021-11-27T01:35:53.157Z] [INFO] org.eclipse.ease.lang.python.jython 0.9.0-SNAPSHOT . SUCCESS [  6.220 s]
20:35:53 [2021-11-27T01:35:53.157Z] [INFO] org.eclipse.ease.lang.javascript.ui 0.9.0-SNAPSHOT . SUCCESS [  4.780 s]
20:35:53 [2021-11-27T01:35:53.157Z] [INFO] org.eclipse.ease.lang.jvm.compiled 0.9.0-SNAPSHOT .. SUCCESS [  4.322 s]
20:35:53 [2021-11-27T01:35:53.157Z] [INFO] org.eclipse.ease.lang.scriptarchive.ui 0.9.0-SNAPSHOT SUCCESS [  5.414 s]
20:35:53 [2021-11-27T01:35:53.157Z] [INFO] org.eclipse.ease.help 0.9.0-SNAPSHOT ............... SUCCESS [  6.959 s]
20:35:53 [2021-11-27T01:35:53.157Z] [INFO] org.eclipse.ease.feature 0.9.0-SNAPSHOT ............ SUCCESS [  0.104 s]
20:35:53 [2021-11-27T01:35:53.157Z] [INFO] org.eclipse.ease.ui.feature 0.9.0-SNAPSHOT ......... SUCCESS [  0.108 s]
20:35:53 [2021-11-27T01:35:53.158Z] [INFO] org.eclipse.ease.lang.javascript.feature 0.9.0-SNAPSHOT SUCCESS [  0.089 s]
20:35:53 [2021-11-27T01:35:53.158Z] [INFO] org.eclipse.ease.lang.python.feature 0.9.0-SNAPSHOT  SUCCESS [  0.127 s]
20:35:53 [2021-11-27T01:35:53.158Z] [INFO] org.eclipse.ease.python.jython.feature 0.9.0-SNAPSHOT SUCCESS [  0.086 s]
20:35:53 [2021-11-27T01:35:53.158Z] [INFO] org.eclipse.ease.lang.python.py4j.feature 0.9.0-SNAPSHOT SUCCESS [  0.088 s]
20:35:53 [2021-11-27T01:35:53.158Z] [INFO] org.eclipse.ease.lang.jvm.feature 0.9.0-SNAPSHOT ... SUCCESS [  0.088 s]
20:35:53 [2021-11-27T01:35:53.158Z] [INFO] org.eclipse.ease.lang.groovy.feature 0.9.0-SNAPSHOT  SUCCESS [  0.092 s]
20:35:53 [2021-11-27T01:35:53.158Z] [INFO] org.eclipse.ease.lang.ruby.feature 0.9.0-SNAPSHOT .. SUCCESS [  0.039 s]
20:35:53 [2021-11-27T01:35:53.158Z] [INFO] org.eclipse.ease.lang.scriptarchive.feature 0.9.0-SNAPSHOT SUCCESS [  0.079 s]
20:35:53 [2021-11-27T01:35:53.158Z] [INFO] org.eclipse.ease.lang.unittest.feature 0.9.0-SNAPSHOT SUCCESS [  0.078 s]
20:35:53 [2021-11-27T01:35:53.158Z] [INFO] org.eclipse.ease.releng.target 0.9.0-SNAPSHOT ...... SUCCESS [  0.003 s]
20:35:53 [2021-11-27T01:35:53.158Z] [INFO] org.eclipse.ease.releng.p2 0.9.0-SNAPSHOT .......... SUCCESS [  5.706 s]
20:35:53 [2021-11-27T01:35:53.158Z] [INFO] org.eclipse.ease.testhelper 0.9.0-SNAPSHOT ......... SUCCESS [  5.897 s]
20:35:53 [2021-11-27T01:35:53.158Z] [INFO] org.eclipse.ease.test 0.9.0-SNAPSHOT ............... SUCCESS [ 35.958 s]
20:35:53 [2021-11-27T01:35:53.158Z] [INFO] org.eclipse.ease.lang.javascript.rhino.test 0.9.0-SNAPSHOT SUCCESS [ 19.503 s]
20:35:53 [2021-11-27T01:35:53.158Z] [INFO] org.eclipse.ease.lang.javascript.test 0.9.0-SNAPSHOT SUCCESS [  5.743 s]
20:35:53 [2021-11-27T01:35:53.158Z] [INFO] org.eclipse.ease.lang.python.test 0.9.0-SNAPSHOT ... SUCCESS [  7.406 s]
20:35:53 [2021-11-27T01:35:53.158Z] [INFO] org.eclipse.ease.lang.python.jython.test 0.9.0-SNAPSHOT SUCCESS [ 20.944 s]
20:35:53 [2021-11-27T01:35:53.158Z] [INFO] org.eclipse.ease.lang.scriptarchive.test 0.9.0-SNAPSHOT SUCCESS [  6.783 s]
20:35:53 [2021-11-27T01:35:53.158Z] [INFO] org.eclipse.ease.lang.unittest.test 0.9.0-SNAPSHOT . SUCCESS [ 11.961 s]
20:35:53 [2021-11-27T01:35:53.158Z] [INFO] org.eclipse.ease.ui.scripts.test 0.9.0-SNAPSHOT .... SUCCESS [  5.399 s]
20:35:53 [2021-11-27T01:35:53.158Z] [INFO] org.eclipse.ease.ui.test 0.9.0-SNAPSHOT ............ SUCCESS [  9.693 s]
20:35:53 [2021-11-27T01:35:53.158Z] [INFO] org.eclipse.ease.ui.completions.java.test 0.9.0-SNAPSHOT SUCCESS [  8.449 s]
20:35:53 [2021-11-27T01:35:53.158Z] [INFO] org.eclipse.ease.releng.coverage 0.9.0-SNAPSHOT .... SUCCESS [  1.410 s]
20:35:53 [2021-11-27T01:35:53.158Z] [INFO] EASE (Incubation) 0.4.0-SNAPSHOT ................... SUCCESS [  0.259 s]
20:35:53 [2021-11-27T01:35:53.158Z] [INFO] ------------------------------------------------------------------------
20:35:53 [2021-11-27T01:35:53.158Z] [INFO] BUILD SUCCESS
20:35:53 [2021-11-27T01:35:53.158Z] [INFO] ------------------------------------------------------------------------
20:35:53 [2021-11-27T01:35:53.158Z] [INFO] Total time:  07:15 min
20:35:53 [2021-11-27T01:35:53.158Z] [INFO] Finished at: 2021-11-27T01:35:53Z
20:35:53 [2021-11-27T01:35:53.158Z] [INFO] ------------------------------------------------------------------------
20:35:53 [2021-11-27T01:35:53.158Z] [INFO] [jenkins-event-spy] Generated /home/jenkins/agent/workspace/ease.verify.core.target.2020-03@tmp/withMavencb38ccb9/maven-spy-20211127-012837-5315233937678384339629.log