FailedConsole Output

Skipping 758 KB.. Full Log
u1gvPjexLDVPzxdEGvvmZ+X75ZekLlOVfvTjc8FPJgaGiiIGKaiG5Py84vycVD1nCA1SyAABjCCFBQCV27OjYAAAAA==[INFO] --- tycho-surefire-plugin:1.5.0:test (default-test) @ org.eclipse.ease.lang.python.test ---
20:32:48 [2020-09-26T00:32:48.303Z] [INFO] Expected eclipse log file: /home/jenkins/agent/workspace/ease.verify.core.target.2020-03/tests/org.eclipse.ease.lang.python.test/target/work/data/.metadata/.log
20:32:48 [2020-09-26T00:32:48.303Z] [INFO] Command line:
20:32:48 [2020-09-26T00:32:48.303Z] 	[/opt/tools/java/openjdk/jdk-11/11.0.2+9/bin/java, -Dosgi.noShutdown=false, -Dosgi.os=linux, -Dosgi.ws=gtk, -Dosgi.arch=x86_64, -Dosgi.clean=true, -jar, /home/jenkins/.m2/repository/p2/osgi/bundle/org.eclipse.equinox.launcher/1.5.800.v20200727-1323/org.eclipse.equinox.launcher-1.5.800.v20200727-1323.jar, -data, /home/jenkins/agent/workspace/ease.verify.core.target.2020-03/tests/org.eclipse.ease.lang.python.test/target/work/data, -install, /home/jenkins/agent/workspace/ease.verify.core.target.2020-03/tests/org.eclipse.ease.lang.python.test/target/work, -configuration, /home/jenkins/agent/workspace/ease.verify.core.target.2020-03/tests/org.eclipse.ease.lang.python.test/target/work/configuration, -application, org.eclipse.tycho.surefire.osgibooter.headlesstest, -testproperties, /home/jenkins/agent/workspace/ease.verify.core.target.2020-03/tests/org.eclipse.ease.lang.python.test/target/surefire.properties]
20:32:48 [2020-09-26T00:32:48.303Z] Picked up JAVA_TOOL_OPTIONS: -Dmaven.ext.class.path="/home/jenkins/agent/workspace/ease.verify.core.target.2020-03@tmp/withMaven9dd1d443/pipeline-maven-spy.jar" -Dorg.jenkinsci.plugins.pipeline.maven.reportsFolder="/home/jenkins/agent/workspace/ease.verify.core.target.2020-03@tmp/withMaven9dd1d443" 
20:32:50 [2020-09-26T00:32:50.231Z] Running org.eclipse.ease.lang.python.PythonCodeFactoryTest
20:32:50 [2020-09-26T00:32:50.231Z] Tests run: 1, Failures: 0, Errors: 0, Skipped: 0, Time elapsed: 0.077 s - in org.eclipse.ease.lang.python.PythonCodeFactoryTest
20:32:50 [2020-09-26T00:32:50.231Z] testCommentCreator(org.eclipse.ease.lang.python.PythonCodeFactoryTest)  Time elapsed: 0.003 s
20:32:50 [2020-09-26T00:32:50.231Z] 
20:32:50 [2020-09-26T00:32:50.231Z] Results:
20:32:50 [2020-09-26T00:32:50.231Z] 
20:32:50 [2020-09-26T00:32:50.231Z] Tests run: 1, Failures: 0, Errors: 0, Skipped: 0
20:32:50 [2020-09-26T00:32:50.231Z] 
20:32:50 [2020-09-26T00:32:50.486Z] [INFO] All tests passed!
20:32:50 [2020-09-26T00:32:50.486Z] [INFO] 
20:32:50 [2020-09-26T00:32:50.486Z] [INFO] --- maven-install-plugin:2.3.1:install (default-install) @ org.eclipse.ease.lang.python.test ---
20:32:50 [2020-09-26T00:32:50.486Z] [INFO] Installing /home/jenkins/agent/workspace/ease.verify.core.target.2020-03/tests/org.eclipse.ease.lang.python.test/target/org.eclipse.ease.lang.python.test-0.8.0-SNAPSHOT.jar to /home/jenkins/.m2/repository/org/eclipse/ease/org.eclipse.ease.lang.python.test/0.8.0-SNAPSHOT/org.eclipse.ease.lang.python.test-0.8.0-SNAPSHOT.jar
20:32:50 [2020-09-26T00:32:50.486Z] [INFO] Installing /home/jenkins/agent/workspace/ease.verify.core.target.2020-03/tests/org.eclipse.ease.lang.python.test/pom.xml to /home/jenkins/.m2/repository/org/eclipse/ease/org.eclipse.ease.lang.python.test/0.8.0-SNAPSHOT/org.eclipse.ease.lang.python.test-0.8.0-SNAPSHOT.pom
20:32:50 [2020-09-26T00:32:50.486Z] [INFO] Installing /home/jenkins/agent/workspace/ease.verify.core.target.2020-03/tests/org.eclipse.ease.lang.python.test/target/org.eclipse.ease.lang.python.test-0.8.0-SNAPSHOT-sources.jar to /home/jenkins/.m2/repository/org/eclipse/ease/org.eclipse.ease.lang.python.test/0.8.0-SNAPSHOT/org.eclipse.ease.lang.python.test-0.8.0-SNAPSHOT-sources.jar
20:32:50 [2020-09-26T00:32:50.486Z] [INFO] Installing /home/jenkins/agent/workspace/ease.verify.core.target.2020-03/tests/org.eclipse.ease.lang.python.test/target/p2content.xml to /home/jenkins/.m2/repository/org/eclipse/ease/org.eclipse.ease.lang.python.test/0.8.0-SNAPSHOT/org.eclipse.ease.lang.python.test-0.8.0-SNAPSHOT-p2metadata.xml
20:32:50 [2020-09-26T00:32:50.487Z] [INFO] Installing /home/jenkins/agent/workspace/ease.verify.core.target.2020-03/tests/org.eclipse.ease.lang.python.test/target/p2artifacts.xml to /home/jenkins/.m2/repository/org/eclipse/ease/org.eclipse.ease.lang.python.test/0.8.0-SNAPSHOT/org.eclipse.ease.lang.python.test-0.8.0-SNAPSHOT-p2artifacts.xml
20:32:50 [2020-09-26T00:32:50.487Z] [INFO] Installing /home/jenkins/agent/workspace/ease.verify.core.target.2020-03/tests/org.eclipse.ease.lang.python.test/target/p2content.xml to /home/jenkins/.m2/repository/org/eclipse/ease/org.eclipse.ease.lang.python.test/0.8.0-SNAPSHOT/org.eclipse.ease.lang.python.test-0.8.0-SNAPSHOT-p2metadata.xml
20:32:50 [2020-09-26T00:32:50.487Z] [INFO] Installing /home/jenkins/agent/workspace/ease.verify.core.target.2020-03/tests/org.eclipse.ease.lang.python.test/target/p2artifacts.xml to /home/jenkins/.m2/repository/org/eclipse/ease/org.eclipse.ease.lang.python.test/0.8.0-SNAPSHOT/org.eclipse.ease.lang.python.test-0.8.0-SNAPSHOT-p2artifacts.xml
20:32:50 [2020-09-26T00:32:50.487Z] [INFO] 
20:32:50 [2020-09-26T00:32:50.487Z] [INFO] --- tycho-p2-plugin:1.5.0:update-local-index (default-update-local-index) @ org.eclipse.ease.lang.python.test ---
20:32:50 [2020-09-26T00:32:50.487Z] [INFO] 
20:32:50 [2020-09-26T00:32:50.487Z] [INFO] -----< org.eclipse.ease:org.eclipse.ease.lang.python.jython.test >------
20:32:50 [2020-09-26T00:32:50.487Z] [INFO] Building org.eclipse.ease.lang.python.jython.test 0.8.0-SNAPSHOT [43/48]
20:32:50 [2020-09-26T00:32:50.487Z] [INFO] ------------------------[ eclipse-test-plugin ]-------------------------
20:32:50 [2020-09-26T00:32:50.487Z] [INFO] 
20:32:50 [2020-09-26T00:32:50.487Z] [INFO] --- maven-clean-plugin:2.5:clean (default-clean) @ org.eclipse.ease.lang.python.jython.test ---
20:32:50 [2020-09-26T00:32:50.487Z] [INFO] 
20:32:50 [2020-09-26T00:32:50.487Z] [INFO] --- tycho-packaging-plugin:1.5.0:build-qualifier (default-build-qualifier) @ org.eclipse.ease.lang.python.jython.test ---
20:32:50 [2020-09-26T00:32:50.487Z] [INFO] The project's OSGi version is 0.8.0.I201911291239
20:32:50 [2020-09-26T00:32:50.487Z] [INFO] 
20:32:50 [2020-09-26T00:32:50.487Z] [INFO] --- tycho-packaging-plugin:1.5.0:validate-id (default-validate-id) @ org.eclipse.ease.lang.python.jython.test ---
20:32:50 [2020-09-26T00:32:50.487Z] [INFO] 
20:32:50 [2020-09-26T00:32:50.487Z] [INFO] --- tycho-packaging-plugin:1.5.0:validate-version (default-validate-version) @ org.eclipse.ease.lang.python.jython.test ---
20:32:50 [2020-09-26T00:32:50.487Z] [INFO] 
20:32:50 [2020-09-26T00:32:50.487Z] [INFO] >>> maven-javadoc-plugin:2.9.1:javadoc (build-docs) > generate-sources @ org.eclipse.ease.lang.python.jython.test >>>
20:32:50 [2020-09-26T00:32:50.487Z] [INFO] 
20:32:50 [2020-09-26T00:32:50.487Z] [INFO] --- tycho-packaging-plugin:1.5.0:build-qualifier (default-build-qualifier) @ org.eclipse.ease.lang.python.jython.test ---
20:32:50 [2020-09-26T00:32:50.487Z] [INFO] The project's OSGi version is 0.8.0.I201911291239
20:32:50 [2020-09-26T00:32:50.487Z] [INFO] 
20:32:50 [2020-09-26T00:32:50.487Z] [INFO] --- tycho-packaging-plugin:1.5.0:validate-id (default-validate-id) @ org.eclipse.ease.lang.python.jython.test ---
20:32:50 [2020-09-26T00:32:50.487Z] [INFO] 
20:32:50 [2020-09-26T00:32:50.487Z] [INFO] --- tycho-packaging-plugin:1.5.0:validate-version (default-validate-version) @ org.eclipse.ease.lang.python.jython.test ---
20:32:50 [2020-09-26T00:32:50.487Z] [INFO] 
20:32:50 [2020-09-26T00:32:50.487Z] [INFO] <<< maven-javadoc-plugin:2.9.1:javadoc (build-docs) < generate-sources @ org.eclipse.ease.lang.python.jython.test <<<
20:32:50 [2020-09-26T00:32:50.487Z] [INFO] 
20:32:50 [2020-09-26T00:32:50.487Z] [INFO] 
20:32:50 [2020-09-26T00:32:50.487Z] [INFO] --- maven-javadoc-plugin:2.9.1:javadoc (build-docs) @ org.eclipse.ease.lang.python.jython.test ---
20:32:50 [2020-09-26T00:32:50.742Z] [ERROR] Error fetching link: http://help.eclipse.org/oxygen/topic/org.eclipse.platform.doc.isv/reference/api/package-list. Ignored it.
20:32:50 [2020-09-26T00:32:50.743Z] [ERROR] Error fetching link: https://ci.eclipse.org/ease/job/ease.build.core/JavaDoc/package-list. Ignored it.
20:32:51 [2020-09-26T00:32:51.704Z] [INFO] 
20:32:51 [2020-09-26T00:32:51.704Z] Loading source files for package org.eclipse.ease.lang.python.jython.debugger...
20:32:51 [2020-09-26T00:32:51.704Z] Constructing Javadoc information...
20:32:51 [2020-09-26T00:32:51.704Z] WARNING: Cannot open location "/home/jenkins/agent/workspace/ease.verify.core.target.2020-03/tests/org.eclipse.ease.lang.python.jython.test/target/javadoc-bundle-options/package-list"
20:32:51 [2020-09-26T00:32:51.704Z] No plugin definition found, skipping
20:32:51 [2020-09-26T00:32:51.704Z] No plugin definition found, skipping
20:32:51 [2020-09-26T00:32:51.704Z] [WARNING] Javadoc Warnings
20:32:51 [2020-09-26T00:32:51.704Z] [WARNING] Picked up JAVA_TOOL_OPTIONS: -Dmaven.ext.class.path="/home/jenkins/agent/workspace/ease.verify.core.target.2020-03@tmp/withMaven9dd1d443/pipeline-maven-spy.jar" -Dorg.jenkinsci.plugins.pipeline.maven.reportsFolder="/home/jenkins/agent/workspace/ease.verify.core.target.2020-03@tmp/withMaven9dd1d443"
20:32:51 [2020-09-26T00:32:51.704Z] [WARNING] javadoc: warning - The old Doclet and Taglet APIs in the packages
20:32:51 [2020-09-26T00:32:51.704Z] [WARNING] com.sun.javadoc, com.sun.tools.doclets and their implementations
20:32:51 [2020-09-26T00:32:51.704Z] [WARNING] are planned to be removed in a future JDK release. These
20:32:51 [2020-09-26T00:32:51.704Z] [WARNING] components have been superseded by the new APIs in jdk.javadoc.doclet.
20:32:51 [2020-09-26T00:32:51.704Z] [WARNING] Users are strongly recommended to migrate to the new APIs.
20:32:51 [2020-09-26T00:32:51.704Z] [INFO] 
20:32:51 [2020-09-26T00:32:51.704Z] [INFO] --- build-helper-maven-plugin:1.9.1:add-resource (add_help) @ org.eclipse.ease.lang.python.jython.test ---
20:32:51 [2020-09-26T00:32:51.704Z] [INFO] 
20:32:51 [2020-09-26T00:32:51.704Z] [INFO] --- maven-resources-plugin:2.4.3:resources (default-resources) @ org.eclipse.ease.lang.python.jython.test ---
20:32:51 [2020-09-26T00:32:51.704Z] [INFO] Using 'UTF-8' encoding to copy filtered resources.
20:32:51 [2020-09-26T00:32:51.704Z] [INFO] skip non existing resourceDirectory /home/jenkins/agent/workspace/ease.verify.core.target.2020-03/tests/org.eclipse.ease.lang.python.jython.test/src/main/resources
20:32:51 [2020-09-26T00:32:51.704Z] [INFO] skip non existing resourceDirectory /home/jenkins/agent/workspace/ease.verify.core.target.2020-03/tests/org.eclipse.ease.lang.python.jython.test/help
20:32:51 [2020-09-26T00:32:51.704Z] [INFO] 
20:32:51 [2020-09-26T00:32:51.704Z] [INFO] --- tycho-compiler-plugin:1.5.0:compile (default-compile) @ org.eclipse.ease.lang.python.jython.test ---
20:32:51 [2020-09-26T00:32:51.704Z] [INFO] Compiling 1 source file to /home/jenkins/agent/workspace/ease.verify.core.target.2020-03/tests/org.eclipse.ease.lang.python.jython.test/target/classes
20:32:51 [2020-09-26T00:32:51.704Z] [INFO] 
20:32:51 [2020-09-26T00:32:51.704Z] [INFO] --- maven-resources-plugin:2.4.3:testResources (default-testResources) @ org.eclipse.ease.lang.python.jython.test ---
20:32:51 [2020-09-26T00:32:51.704Z] [INFO] Using 'UTF-8' encoding to copy filtered resources.
20:32:51 [2020-09-26T00:32:51.704Z] [INFO] skip non existing resourceDirectory /home/jenkins/agent/workspace/ease.verify.core.target.2020-03/tests/org.eclipse.ease.lang.python.jython.test/src/test/resources
20:32:51 [2020-09-26T00:32:51.704Z] [INFO] 
20:32:51 [2020-09-26T00:32:51.704Z] [INFO] --- tycho-source-plugin:1.5.0:plugin-source (plugin-source) @ org.eclipse.ease.lang.python.jython.test ---
20:32:51 [2020-09-26T00:32:51.705Z] [WARNING] Bundle-Vendor header not found in /home/jenkins/agent/workspace/ease.verify.core.target.2020-03/tests/org.eclipse.ease.lang.python.jython.test/META-INF/MANIFEST.MF, fallback to 'unknown' for source bundle
20:32:51 [2020-09-26T00:32:51.705Z] [INFO] Building jar: /home/jenkins/agent/workspace/ease.verify.core.target.2020-03/tests/org.eclipse.ease.lang.python.jython.test/target/org.eclipse.ease.lang.python.jython.test-0.8.0-SNAPSHOT-sources.jar
20:32:51 [2020-09-26T00:32:51.705Z] [INFO] 
20:32:51 [2020-09-26T00:32:51.705Z] [INFO] --- target-platform-configuration:1.5.0:target-platform (default-target-platform) @ org.eclipse.ease.lang.python.jython.test ---
20:32:51 [2020-09-26T00:32:51.705Z] [INFO] 
20:32:51 [2020-09-26T00:32:51.705Z] [INFO] --- tycho-packaging-plugin:1.5.0:package-plugin (default-package-plugin) @ org.eclipse.ease.lang.python.jython.test ---
20:32:51 [2020-09-26T00:32:51.705Z] [INFO] Building jar: /home/jenkins/agent/workspace/ease.verify.core.target.2020-03/tests/org.eclipse.ease.lang.python.jython.test/target/org.eclipse.ease.lang.python.jython.test-0.8.0-SNAPSHOT.jar
20:32:51 [2020-09-26T00:32:51.705Z] [INFO] 
20:32:51 [2020-09-26T00:32:51.705Z] [INFO] --- tycho-p2-plugin:1.5.0:p2-metadata-default (default-p2-metadata-default) @ org.eclipse.ease.lang.python.jython.test ---
20:32:51 [2020-09-26T00:32:51.705Z] [INFO] 
20:32:51 [2020-09-26T00:32:51.705Z] [INFO] --- tycho-source-feature-plugin:1.5.0:source-feature (source-feature) @ org.eclipse.ease.lang.python.jython.test ---
20:32:51 [2020-09-26T00:32:51.705Z] [INFO] 
20:32:51 [2020-09-26T00:32:51.705Z] [INFO] --- tycho-p2-plugin:1.5.0:p2-metadata (attached-p2-metadata) @ org.eclipse.ease.lang.python.jython.test ---
20:32:51 [2020-09-26T00:32:51.705Z] [INFO] 
20:32:51 [2020-09-26T00:32:51.705Z] [INFO] --- tycho-surefire-plugin:1.5.0:test (default-test) @ org.eclipse.ease.lang.python.jython.test ---
20:32:52 [2020-09-26T00:32:52.265Z] [INFO] Expected eclipse log file: /home/jenkins/agent/workspace/ease.verify.core.target.2020-03/tests/org.eclipse.ease.lang.python.jython.test/target/work/data/.metadata/.log
20:32:52 [2020-09-26T00:32:52.265Z] [INFO] Command line:
20:32:52 [2020-09-26T00:32:52.265Z] 	[/opt/tools/java/openjdk/jdk-11/11.0.2+9/bin/java, -Dosgi.noShutdown=false, -Dosgi.os=linux, -Dosgi.ws=gtk, -Dosgi.arch=x86_64, -Dosgi.clean=true, -jar, /home/jenkins/.m2/repository/p2/osgi/bundle/org.eclipse.equinox.launcher/1.5.800.v20200727-1323/org.eclipse.equinox.launcher-1.5.800.v20200727-1323.jar, -data, /home/jenkins/agent/workspace/ease.verify.core.target.2020-03/tests/org.eclipse.ease.lang.python.jython.test/target/work/data, -install, /home/jenkins/agent/workspace/ease.verify.core.target.2020-03/tests/org.eclipse.ease.lang.python.jython.test/target/work, -configuration, /home/jenkins/agent/workspace/ease.verify.core.target.2020-03/tests/org.eclipse.ease.lang.python.jython.test/target/work/configuration, -application, org.eclipse.tycho.surefire.osgibooter.headlesstest, -testproperties, /home/jenkins/agent/workspace/ease.verify.core.target.2020-03/tests/org.eclipse.ease.lang.python.jython.test/target/surefire.properties]
20:32:52 [2020-09-26T00:32:52.265Z] Picked up JAVA_TOOL_OPTIONS: -Dmaven.ext.class.path="/home/jenkins/agent/workspace/ease.verify.core.target.2020-03@tmp/withMaven9dd1d443/pipeline-maven-spy.jar" -Dorg.jenkinsci.plugins.pipeline.maven.reportsFolder="/home/jenkins/agent/workspace/ease.verify.core.target.2020-03@tmp/withMaven9dd1d443" 
20:32:54 [2020-09-26T00:32:54.165Z] WARNING: An illegal reflective access operation has occurred
20:32:54 [2020-09-26T00:32:54.165Z] WARNING: Illegal reflective access by org.python.core.PySystemState (file:/home/jenkins/agent/workspace/ease.verify.core.target.2020-03/tests/org.eclipse.ease.lang.python.jython.test/target/work/plugins/org.jython_2.7.0.I201609090924/jython.jar) to method java.io.Console.encoding()
20:32:54 [2020-09-26T00:32:54.165Z] WARNING: Please consider reporting this to the maintainers of org.python.core.PySystemState
20:32:54 [2020-09-26T00:32:54.165Z] WARNING: Use --illegal-access=warn to enable warnings of further illegal reflective access operations
20:32:54 [2020-09-26T00:32:54.165Z] WARNING: All illegal access operations will be denied in a future release
20:32:54 [2020-09-26T00:32:54.165Z] Running org.eclipse.ease.lang.python.jython.debugger.JythonDebugTest
20:32:56 [2020-09-26T00:32:56.066Z] Start of script
20:32:56 [2020-09-26T00:32:56.066Z] include file start
20:32:56 [2020-09-26T00:32:56.066Z] include file processed
20:32:56 [2020-09-26T00:32:56.066Z] Result of testMethod = 5
20:32:56 [2020-09-26T00:32:56.066Z] End of script
20:32:56 [2020-09-26T00:32:56.066Z] Start of script
20:32:56 [2020-09-26T00:32:56.066Z] include file start
20:32:56 [2020-09-26T00:32:56.066Z] include file processed
20:32:56 [2020-09-26T00:32:56.066Z] Result of testMethod = 5
20:32:56 [2020-09-26T00:32:56.066Z] End of script
20:32:56 [2020-09-26T00:32:56.321Z] Start of script
20:32:56 [2020-09-26T00:32:56.321Z] include file start
20:32:56 [2020-09-26T00:32:56.321Z] include file processed
20:32:56 [2020-09-26T00:32:56.321Z] Result of testMethod = 5
20:32:56 [2020-09-26T00:32:56.321Z] Traceback (most recent call last):
20:32:56 [2020-09-26T00:32:56.321Z]   File "(none)", line 184, in run
20:32:56 [2020-09-26T00:32:56.321Z]   File "__ref_L/Debug Test/Main.py_aflgbfypuk", line 23, in <module>
20:32:56 [2020-09-26T00:32:56.321Z]   File "(none)", line 161, in trace_dispatch
20:32:56 [2020-09-26T00:32:56.321Z] org.eclipse.ease.ExitException: 
20:32:56 [2020-09-26T00:32:56.321Z] 
20:32:56 [2020-09-26T00:32:56.321Z] org.eclipse.ease.ExitException: org.eclipse.ease.ExitException: 
20:32:56 [2020-09-26T00:32:56.577Z] Start of script
20:32:56 [2020-09-26T00:32:56.577Z] include file start
20:32:56 [2020-09-26T00:32:56.577Z] include file processed
20:32:56 [2020-09-26T00:32:56.577Z] Result of testMethod = 5
20:32:56 [2020-09-26T00:32:56.577Z] End of script
20:32:57 [2020-09-26T00:32:57.138Z] Start of script
20:32:57 [2020-09-26T00:32:57.138Z] include file start
20:32:57 [2020-09-26T00:32:57.138Z] include file processed
20:32:57 [2020-09-26T00:32:57.138Z] Result of testMethod = 5
20:32:57 [2020-09-26T00:32:57.138Z] End of script
20:32:57 [2020-09-26T00:32:57.138Z] Start of script
20:32:57 [2020-09-26T00:32:57.138Z] include file start
20:32:57 [2020-09-26T00:32:57.138Z] include file processed
20:32:57 [2020-09-26T00:32:57.394Z] Result of testMethod = 5
20:32:57 [2020-09-26T00:32:57.394Z] End of script
20:32:57 [2020-09-26T00:32:57.394Z] Start of script
20:32:57 [2020-09-26T00:32:57.394Z] include file start
20:32:57 [2020-09-26T00:32:57.394Z] include file processed
20:32:57 [2020-09-26T00:32:57.394Z] Result of testMethod = 5
20:32:57 [2020-09-26T00:32:57.649Z] Traceback (most recent call last):
20:32:57 [2020-09-26T00:32:57.649Z]   File "(none)", line 184, in run
20:32:57 [2020-09-26T00:32:57.649Z]   File "__ref_L/Debug Test/Main.py_aktiyrhmzo", line 23, in <module>
20:32:57 [2020-09-26T00:32:57.649Z]   File "(none)", line 161, in trace_dispatch
20:32:57 [2020-09-26T00:32:57.649Z] org.eclipse.ease.ExitException: 
20:32:57 [2020-09-26T00:32:57.649Z] 
20:32:57 [2020-09-26T00:32:57.649Z] org.eclipse.ease.ExitException: org.eclipse.ease.ExitException: 
20:32:57 [2020-09-26T00:32:57.649Z] Start of script
20:32:57 [2020-09-26T00:32:57.649Z] include file start
20:32:57 [2020-09-26T00:32:57.649Z] include file processed
20:32:57 [2020-09-26T00:32:57.905Z] Result of testMethod = 5
20:32:57 [2020-09-26T00:32:57.905Z] End of script
20:32:58 [2020-09-26T00:32:58.161Z] Start of script
20:32:58 [2020-09-26T00:32:58.161Z] include file start
20:32:58 [2020-09-26T00:32:58.161Z] include file processed
20:32:58 [2020-09-26T00:32:58.161Z] Result of testMethod = 5
20:32:58 [2020-09-26T00:32:58.161Z] End of script
20:32:58 [2020-09-26T00:32:58.161Z] Start of script
20:32:58 [2020-09-26T00:32:58.161Z] include file start
20:32:58 [2020-09-26T00:32:58.161Z] include file processed
20:32:58 [2020-09-26T00:32:58.722Z] Traceback (most recent call last):
20:32:58 [2020-09-26T00:32:58.722Z]   File "(none)", line 184, in run
20:32:58 [2020-09-26T00:32:58.722Z]   File "__ref_L/Debug Test/Main.py_jlcqwldpss", line 22, in <module>
20:32:58 [2020-09-26T00:32:58.723Z]   File "(none)", line 161, in trace_dispatch
20:32:58 [2020-09-26T00:32:58.723Z] org.eclipse.ease.ExitException: 
20:32:58 [2020-09-26T00:32:58.723Z] 
20:32:58 [2020-09-26T00:32:58.723Z] org.eclipse.ease.ExitException: org.eclipse.ease.ExitException: 
20:32:58 [2020-09-26T00:32:58.723Z] Start of script
20:32:58 [2020-09-26T00:32:58.723Z] include file start
20:32:58 [2020-09-26T00:32:58.978Z] include file processed
20:32:58 [2020-09-26T00:32:58.978Z] Result of testMethod = 5
20:32:58 [2020-09-26T00:32:58.978Z] End of script
20:32:58 [2020-09-26T00:32:58.978Z] Start of script
20:32:58 [2020-09-26T00:32:58.978Z] include file start
20:32:58 [2020-09-26T00:32:58.978Z] include file processed
20:32:59 [2020-09-26T00:32:59.233Z] Result of testMethod = 5
20:32:59 [2020-09-26T00:32:59.233Z] End of script
20:32:59 [2020-09-26T00:32:59.489Z] Traceback (most recent call last):
20:32:59 [2020-09-26T00:32:59.489Z]   File "(none)", line 184, in run
20:32:59 [2020-09-26T00:32:59.489Z]   File "__ref_L/Debug Test/Main.py_kyalcoaqru", line 1, in <module>
20:32:59 [2020-09-26T00:32:59.489Z]   File "(none)", line 161, in trace_dispatch
20:32:59 [2020-09-26T00:32:59.489Z] org.eclipse.ease.ExitException: 
20:32:59 [2020-09-26T00:32:59.489Z] 
20:32:59 [2020-09-26T00:32:59.489Z] org.eclipse.ease.ExitException: org.eclipse.ease.ExitException: 
20:32:59 [2020-09-26T00:32:59.489Z] Start of script
20:32:59 [2020-09-26T00:32:59.489Z] include file start
20:32:59 [2020-09-26T00:32:59.489Z] include file processed
20:32:59 [2020-09-26T00:32:59.489Z] Result of testMethod = 5
20:32:59 [2020-09-26T00:32:59.489Z] End of script
20:32:59 [2020-09-26T00:32:59.745Z] Start of script
20:32:59 [2020-09-26T00:32:59.745Z] include file start
20:32:59 [2020-09-26T00:32:59.745Z] include file processed
20:33:00 [2020-09-26T00:33:00.001Z] Result of testMethod = 5
20:33:00 [2020-09-26T00:33:00.001Z] End of script
20:33:00 [2020-09-26T00:33:00.001Z] Start of script
20:33:00 [2020-09-26T00:33:00.001Z] include file start
20:33:00 [2020-09-26T00:33:00.001Z] include file processed
20:33:00 [2020-09-26T00:33:00.001Z] Result of testMethod = 5
20:33:00 [2020-09-26T00:33:00.256Z] Traceback (most recent call last):
20:33:00 [2020-09-26T00:33:00.256Z]   File "(none)", line 184, in run
20:33:00 [2020-09-26T00:33:00.256Z]   File "__ref_L/Debug Test/Main.py_iohzhapfcy", line 23, in <module>
20:33:00 [2020-09-26T00:33:00.256Z]   File "(none)", line 161, in trace_dispatch
20:33:00 [2020-09-26T00:33:00.256Z] org.eclipse.ease.ExitException: 
20:33:00 [2020-09-26T00:33:00.256Z] 
20:33:00 [2020-09-26T00:33:00.256Z] org.eclipse.ease.ExitException: org.eclipse.ease.ExitException: 
20:33:00 [2020-09-26T00:33:00.256Z] Start of script
20:33:00 [2020-09-26T00:33:00.256Z] include file start
20:33:00 [2020-09-26T00:33:00.256Z] include file processed
20:33:00 [2020-09-26T00:33:00.512Z] Result of testMethod = 5
20:33:00 [2020-09-26T00:33:00.512Z] End of script
20:33:00 [2020-09-26T00:33:00.768Z] Traceback (most recent call last):
20:33:00 [2020-09-26T00:33:00.768Z]   File "(none)", line 184, in run
20:33:00 [2020-09-26T00:33:00.768Z]   File "__ref_L/Debug Test/Main.py_lpfynickeg", line 1, in <module>
20:33:00 [2020-09-26T00:33:00.768Z]   File "(none)", line 161, in trace_dispatch
20:33:00 [2020-09-26T00:33:00.768Z] org.eclipse.ease.ExitException: 
20:33:00 [2020-09-26T00:33:00.768Z] 
20:33:00 [2020-09-26T00:33:00.768Z] org.eclipse.ease.ExitException: org.eclipse.ease.ExitException: 
20:33:00 [2020-09-26T00:33:00.768Z] Start of script
20:33:00 [2020-09-26T00:33:00.768Z] include file start
20:33:00 [2020-09-26T00:33:00.768Z] include file processed
20:33:00 [2020-09-26T00:33:00.768Z] Result of testMethod = 5
20:33:01 [2020-09-26T00:33:01.023Z] End of script
20:33:01 [2020-09-26T00:33:01.023Z] Start of script
20:33:01 [2020-09-26T00:33:01.023Z] include file start
20:33:01 [2020-09-26T00:33:01.023Z] include file processed
20:33:01 [2020-09-26T00:33:01.279Z] Result of testMethod = 5
20:33:01 [2020-09-26T00:33:01.279Z] End of script
20:33:01 [2020-09-26T00:33:01.534Z] Traceback (most recent call last):
20:33:01 [2020-09-26T00:33:01.535Z]   File "(none)", line 184, in run
20:33:01 [2020-09-26T00:33:01.535Z]   File "__ref_L/Debug Test/Main.py_txkrxtrkts", line 1, in <module>
20:33:01 [2020-09-26T00:33:01.535Z]   File "(none)", line 161, in trace_dispatch
20:33:01 [2020-09-26T00:33:01.535Z] org.eclipse.ease.ExitException: 
20:33:01 [2020-09-26T00:33:01.535Z] 
20:33:01 [2020-09-26T00:33:01.535Z] org.eclipse.ease.ExitException: org.eclipse.ease.ExitException: 
20:33:01 [2020-09-26T00:33:01.535Z] Start of script
20:33:01 [2020-09-26T00:33:01.535Z] include file start
20:33:01 [2020-09-26T00:33:01.535Z] include file processed
20:33:01 [2020-09-26T00:33:01.790Z] Result of testMethod = 5
20:33:01 [2020-09-26T00:33:01.790Z] End of script
20:33:01 [2020-09-26T00:33:01.790Z] Start of script
20:33:01 [2020-09-26T00:33:01.790Z] include file start
20:33:01 [2020-09-26T00:33:01.790Z] include file processed
20:33:01 [2020-09-26T00:33:01.790Z] Result of testMethod = 5
20:33:02 [2020-09-26T00:33:02.046Z] Traceback (most recent call last):
20:33:02 [2020-09-26T00:33:02.046Z]   File "(none)", line 184, in run
20:33:02 [2020-09-26T00:33:02.046Z]   File "__ref_L/Debug Test/Main.py_fcxsjfevvv", line 23, in <module>
20:33:02 [2020-09-26T00:33:02.046Z]   File "(none)", line 161, in trace_dispatch
20:33:02 [2020-09-26T00:33:02.046Z] org.eclipse.ease.ExitException: 
20:33:02 [2020-09-26T00:33:02.046Z] 
20:33:02 [2020-09-26T00:33:02.046Z] org.eclipse.ease.ExitException: org.eclipse.ease.ExitException: 
20:33:02 [2020-09-26T00:33:02.301Z] Start of script
20:33:02 [2020-09-26T00:33:02.301Z] include file start
20:33:02 [2020-09-26T00:33:02.301Z] include file processed
20:33:02 [2020-09-26T00:33:02.301Z] Result of testMethod = 5
20:33:02 [2020-09-26T00:33:02.301Z] End of script
20:33:02 [2020-09-26T00:33:02.301Z] Start of script
20:33:02 [2020-09-26T00:33:02.301Z] include file start
20:33:02 [2020-09-26T00:33:02.301Z] include file processed
20:33:02 [2020-09-26T00:33:02.556Z] Result of testMethod = 5
20:33:02 [2020-09-26T00:33:02.556Z] End of script
20:33:02 [2020-09-26T00:33:02.556Z] Start of script
20:33:02 [2020-09-26T00:33:02.556Z] include file start
20:33:02 [2020-09-26T00:33:02.556Z] include file processed
20:33:02 [2020-09-26T00:33:02.556Z] Result of testMethod = 5
20:33:02 [2020-09-26T00:33:02.556Z] End of script
20:33:02 [2020-09-26T00:33:02.811Z] Start of script
20:33:02 [2020-09-26T00:33:02.811Z] include file start
20:33:02 [2020-09-26T00:33:02.811Z] include file processed
20:33:03 [2020-09-26T00:33:03.067Z] Result of testMethod = 5
20:33:03 [2020-09-26T00:33:03.067Z] End of script
20:33:03 [2020-09-26T00:33:03.067Z] Start of script
20:33:03 [2020-09-26T00:33:03.067Z] include file start
20:33:03 [2020-09-26T00:33:03.067Z] include file processed
20:33:03 [2020-09-26T00:33:03.323Z] Traceback (most recent call last):
20:33:03 [2020-09-26T00:33:03.323Z]   File "(none)", line 184, in run
20:33:03 [2020-09-26T00:33:03.323Z]   File "__ref_L/Debug Test/Main.py_ywdkxzhhmr", line 21, in <module>
20:33:03 [2020-09-26T00:33:03.323Z]   File "__ref_L/Debug Test/Main.py_ywdkxzhhmr", line 18, in testMethod
20:33:03 [2020-09-26T00:33:03.323Z]   File "(none)", line 161, in trace_dispatch
20:33:03 [2020-09-26T00:33:03.323Z] org.eclipse.ease.ExitException: 
20:33:03 [2020-09-26T00:33:03.323Z] 
20:33:03 [2020-09-26T00:33:03.323Z] org.eclipse.ease.ExitException: org.eclipse.ease.ExitException: 
20:33:03 [2020-09-26T00:33:03.323Z] Start of script
20:33:03 [2020-09-26T00:33:03.578Z] include file start
20:33:03 [2020-09-26T00:33:03.578Z] include file processed
20:33:03 [2020-09-26T00:33:03.578Z] Result of testMethod = 5
20:33:03 [2020-09-26T00:33:03.578Z] End of script
20:33:03 [2020-09-26T00:33:03.578Z] Start of script
20:33:03 [2020-09-26T00:33:03.578Z] include file start
20:33:03 [2020-09-26T00:33:03.578Z] include file processed
20:33:03 [2020-09-26T00:33:03.578Z] Result of testMethod = 5
20:33:03 [2020-09-26T00:33:03.834Z] Traceback (most recent call last):
20:33:03 [2020-09-26T00:33:03.834Z]   File "(none)", line 184, in run
20:33:03 [2020-09-26T00:33:03.834Z]   File "__ref_L/Debug Test/Main.py_ipjpmyekfs", line 23, in <module>
20:33:03 [2020-09-26T00:33:03.835Z]   File "(none)", line 161, in trace_dispatch
20:33:03 [2020-09-26T00:33:03.835Z] org.eclipse.ease.ExitException: 
20:33:03 [2020-09-26T00:33:03.835Z] 
20:33:03 [2020-09-26T00:33:03.835Z] org.eclipse.ease.ExitException: org.eclipse.ease.ExitException: 
20:33:04 [2020-09-26T00:33:04.091Z] Start of script
20:33:04 [2020-09-26T00:33:04.091Z] include file start
20:33:04 [2020-09-26T00:33:04.091Z] include file processed
20:33:04 [2020-09-26T00:33:04.091Z] Result of testMethod = 5
20:33:04 [2020-09-26T00:33:04.091Z] End of script
20:33:04 [2020-09-26T00:33:04.091Z] Start of script
20:33:04 [2020-09-26T00:33:04.091Z] include file start
20:33:04 [2020-09-26T00:33:04.091Z] include file processed
20:33:04 [2020-09-26T00:33:04.349Z] Result of testMethod = 5
20:33:04 [2020-09-26T00:33:04.349Z] End of script
20:33:04 [2020-09-26T00:33:04.604Z] Start of script
20:33:04 [2020-09-26T00:33:04.604Z] include file start
20:33:04 [2020-09-26T00:33:04.604Z] include file processed
20:33:04 [2020-09-26T00:33:04.604Z] Result of testMethod = 5
20:33:04 [2020-09-26T00:33:04.604Z] End of script
20:33:04 [2020-09-26T00:33:04.860Z] Start of script
20:33:04 [2020-09-26T00:33:04.860Z] include file start
20:33:04 [2020-09-26T00:33:04.860Z] include file processed
20:33:04 [2020-09-26T00:33:04.860Z] Result of testMethod = 5
20:33:04 [2020-09-26T00:33:04.860Z] End of script
20:33:05 [2020-09-26T00:33:05.115Z] Start of script
20:33:05 [2020-09-26T00:33:05.115Z] include file start
20:33:05 [2020-09-26T00:33:05.115Z] include file processed
20:33:05 [2020-09-26T00:33:05.115Z] Result of testMethod = 5
20:33:05 [2020-09-26T00:33:05.115Z] Traceback (most recent call last):
20:33:05 [2020-09-26T00:33:05.115Z]   File "(none)", line 184, in run
20:33:05 [2020-09-26T00:33:05.115Z]   File "__ref_L/Debug Test/Main.py_jxnqcfvxuw", line 23, in <module>
20:33:05 [2020-09-26T00:33:05.115Z]   File "(none)", line 161, in trace_dispatch
20:33:05 [2020-09-26T00:33:05.115Z] org.eclipse.ease.ExitException: 
20:33:05 [2020-09-26T00:33:05.115Z] 
20:33:05 [2020-09-26T00:33:05.115Z] org.eclipse.ease.ExitException: org.eclipse.ease.ExitException: 
20:33:05 [2020-09-26T00:33:05.371Z] Start of script
20:33:05 [2020-09-26T00:33:05.371Z] include file start
20:33:05 [2020-09-26T00:33:05.371Z] include file processed
20:33:05 [2020-09-26T00:33:05.371Z] Result of testMethod = 5
20:33:05 [2020-09-26T00:33:05.371Z] End of script
20:33:05 [2020-09-26T00:33:05.627Z] Start of script
20:33:05 [2020-09-26T00:33:05.627Z] include file start
20:33:05 [2020-09-26T00:33:05.627Z] include file processed
20:33:05 [2020-09-26T00:33:05.627Z] Result of testMethod = 5
20:33:05 [2020-09-26T00:33:05.627Z] Traceback (most recent call last):
20:33:05 [2020-09-26T00:33:05.627Z]   File "(none)", line 184, in run
20:33:05 [2020-09-26T00:33:05.627Z]   File "__ref_L/Debug Test/Main.py_fbiycuwjgu", line 23, in <module>
20:33:05 [2020-09-26T00:33:05.627Z]   File "(none)", line 161, in trace_dispatch
20:33:05 [2020-09-26T00:33:05.627Z] org.eclipse.ease.ExitException: 
20:33:05 [2020-09-26T00:33:05.627Z] 
20:33:05 [2020-09-26T00:33:05.627Z] org.eclipse.ease.ExitException: org.eclipse.ease.ExitException: 
20:33:05 [2020-09-26T00:33:05.883Z] Traceback (most recent call last):
20:33:05 [2020-09-26T00:33:05.883Z]   File "(none)", line 184, in run
20:33:05 [2020-09-26T00:33:05.883Z]   File "__ref_L/Debug Test/Main.py_ncgkqpheuh", line 1, in <module>
20:33:05 [2020-09-26T00:33:05.883Z]   File "(none)", line 161, in trace_dispatch
20:33:05 [2020-09-26T00:33:05.883Z] org.eclipse.ease.ExitException: 
20:33:05 [2020-09-26T00:33:05.883Z] 
20:33:05 [2020-09-26T00:33:05.883Z] org.eclipse.ease.ExitException: org.eclipse.ease.ExitException: 
20:33:06 [2020-09-26T00:33:06.138Z] Start of script
20:33:06 [2020-09-26T00:33:06.138Z] include file start
20:33:06 [2020-09-26T00:33:06.138Z] include file processed
20:33:06 [2020-09-26T00:33:06.138Z] Result of testMethod = 5
20:33:06 [2020-09-26T00:33:06.138Z] End of script
20:33:06 [2020-09-26T00:33:06.138Z] Start of script
20:33:06 [2020-09-26T00:33:06.138Z] include file start
20:33:06 [2020-09-26T00:33:06.138Z] include file processed
20:33:06 [2020-09-26T00:33:06.408Z] Result of testMethod = 5
20:33:06 [2020-09-26T00:33:06.408Z] End of script
20:33:06 [2020-09-26T00:33:06.665Z] Start of script
20:33:06 [2020-09-26T00:33:06.665Z] include file start
20:33:06 [2020-09-26T00:33:06.665Z] include file processed
20:33:06 [2020-09-26T00:33:06.665Z] Result of testMethod = 5
20:33:06 [2020-09-26T00:33:06.665Z] End of script
20:33:06 [2020-09-26T00:33:06.665Z] Tests run: 42, Failures: 0, Errors: 0, Skipped: 0, Time elapsed: 12.49 s - in org.eclipse.ease.lang.python.jython.debugger.JythonDebugTest
20:33:06 [2020-09-26T00:33:06.665Z] disconnectProcessInSuspendedState(org.eclipse.ease.lang.python.jython.debugger.JythonDebugTest)  Time elapsed: 1.682 s
20:33:06 [2020-09-26T00:33:06.665Z] stepReturnIncludeCommand(org.eclipse.ease.lang.python.jython.debugger.JythonDebugTest)  Time elapsed: 0.209 s
20:33:06 [2020-09-26T00:33:06.666Z] arrayVariableSorting(org.eclipse.ease.lang.python.jython.debugger.JythonDebugTest)  Time elapsed: 0.309 s
20:33:06 [2020-09-26T00:33:06.666Z] stepOverOnDebugTarget(org.eclipse.ease.lang.python.jython.debugger.JythonDebugTest)  Time elapsed: 0.309 s
20:33:06 [2020-09-26T00:33:06.666Z] hasDebugTarget(org.eclipse.ease.lang.python.jython.debugger.JythonDebugTest)  Time elapsed: 0.105 s
20:33:06 [2020-09-26T00:33:06.666Z] disconnectThreadInSuspendedState(org.eclipse.ease.lang.python.jython.debugger.JythonDebugTest)  Time elapsed: 0.208 s
20:33:06 [2020-09-26T00:33:06.666Z] stepReturnOnDebugTarget(org.eclipse.ease.lang.python.jython.debugger.JythonDebugTest)  Time elapsed: 0.31 s
20:33:06 [2020-09-26T00:33:06.666Z] nullVariable(org.eclipse.ease.lang.python.jython.debugger.JythonDebugTest)  Time elapsed: 0.308 s
20:33:06 [2020-09-26T00:33:06.666Z] stepOverOnStackFrame(org.eclipse.ease.lang.python.jython.debugger.JythonDebugTest)  Time elapsed: 0.307 s
20:33:06 [2020-09-26T00:33:06.666Z] resumeOnDebugTarget(org.eclipse.ease.lang.python.jython.debugger.JythonDebugTest)  Time elapsed: 0.207 s
20:33:06 [2020-09-26T00:33:06.666Z] modifyVariableKeepingType(org.eclipse.ease.lang.python.jython.debugger.JythonDebugTest)  Time elapsed: 0.508 s
20:33:06 [2020-09-26T00:33:06.666Z] resumeOnLastIncludeLine(org.eclipse.ease.lang.python.jython.debugger.JythonDebugTest)  Time elapsed: 0.209 s
20:33:06 [2020-09-26T00:33:06.666Z] stepReturnOnStackFrame(org.eclipse.ease.lang.python.jython.debugger.JythonDebugTest)  Time elapsed: 0.308 s
20:33:06 [2020-09-26T00:33:06.666Z] terminateStackFrameInSuspendedState(org.eclipse.ease.lang.python.jython.debugger.JythonDebugTest)  Time elapsed: 0.208 s
20:33:06 [2020-09-26T00:33:06.666Z] breakpointLocation(org.eclipse.ease.lang.python.jython.debugger.JythonDebugTest)  Time elapsed: 0.208 s
20:33:06 [2020-09-26T00:33:06.666Z] stepReturnOnThread(org.eclipse.ease.lang.python.jython.debugger.JythonDebugTest)  Time elapsed: 0.309 s
20:33:06 [2020-09-26T00:33:06.666Z] javaClassVariable(org.eclipse.ease.lang.python.jython.debugger.JythonDebugTest)  Time elapsed: 0.307 s
20:33:06 [2020-09-26T00:33:06.666Z] stepIntoOnThread(org.eclipse.ease.lang.python.jython.debugger.JythonDebugTest)  Time elapsed: 0.308 s
20:33:06 [2020-09-26T00:33:06.666Z] terminateThreadInSuspendedState(org.eclipse.ease.lang.python.jython.debugger.JythonDebugTest)  Time elapsed: 0.207 s
20:33:06 [2020-09-26T00:33:06.666Z] resumeOnThread(org.eclipse.ease.lang.python.jython.debugger.JythonDebugTest)  Time elapsed: 0.206 s
20:33:06 [2020-09-26T00:33:06.666Z] stepIntoOnStackFrame(org.eclipse.ease.lang.python.jython.debugger.JythonDebugTest)  Time elapsed: 0.307 s
20:33:06 [2020-09-26T00:33:06.666Z] terminateProcessInSuspendedState(org.eclipse.ease.lang.python.jython.debugger.JythonDebugTest)  Time elapsed: 0.206 s
20:33:06 [2020-09-26T00:33:06.666Z] stepOverOnProcess(org.eclipse.ease.lang.python.jython.debugger.JythonDebugTest)  Time elapsed: 0.307 s
20:33:06 [2020-09-26T00:33:06.666Z] nativeArrayVariable(org.eclipse.ease.lang.python.jython.debugger.JythonDebugTest)  Time elapsed: 0.306 s
20:33:06 [2020-09-26T00:33:06.666Z] disconnectDebugTargetInSuspendedState(org.eclipse.ease.lang.python.jython.debugger.JythonDebugTest)  Time elapsed: 0.206 s
20:33:06 [2020-09-26T00:33:06.666Z] stepIntoOnProcess(org.eclipse.ease.lang.python.jython.debugger.JythonDebugTest)  Time elapsed: 0.307 s
20:33:06 [2020-09-26T00:33:06.666Z] terminatedState(org.eclipse.ease.lang.python.jython.debugger.JythonDebugTest)  Time elapsed: 0.104 s
20:33:06 [2020-09-26T00:33:06.666Z] stepOverIncludeCommand(org.eclipse.ease.lang.python.jython.debugger.JythonDebugTest)  Time elapsed: 0.305 s
20:33:06 [2020-09-26T00:33:06.666Z] innerScopeVariableBeforeOuterScopeVariable(org.eclipse.ease.lang.python.jython.debugger.JythonDebugTest)  Time elapsed: 0.306 s
20:33:06 [2020-09-26T00:33:06.666Z] stepIntoIncludeCommand(org.eclipse.ease.lang.python.jython.debugger.JythonDebugTest)  Time elapsed: 0.305 s
20:33:06 [2020-09-26T00:33:06.666Z] primitiveStringVariable(org.eclipse.ease.lang.python.jython.debugger.JythonDebugTest)  Time elapsed: 0.306 s
20:33:06 [2020-09-26T00:33:06.666Z] resumeOnProcess(org.eclipse.ease.lang.python.jython.debugger.JythonDebugTest)  Time elapsed: 0.206 s
20:33:06 [2020-09-26T00:33:06.666Z] stepIntoOnDebugTarget(org.eclipse.ease.lang.python.jython.debugger.JythonDebugTest)  Time elapsed: 0.306 s
20:33:06 [2020-09-26T00:33:06.666Z] stepOverOnThread(org.eclipse.ease.lang.python.jython.debugger.JythonDebugTest)  Time elapsed: 0.306 s
20:33:06 [2020-09-26T00:33:06.666Z] suspendedState(org.eclipse.ease.lang.python.jython.debugger.JythonDebugTest)  Time elapsed: 0.205 s
20:33:06 [2020-09-26T00:33:06.666Z] primitiveDoubleVariable(org.eclipse.ease.lang.python.jython.debugger.JythonDebugTest)  Time elapsed: 0.306 s
20:33:06 [2020-09-26T00:33:06.666Z] resumeOnStackFrame(org.eclipse.ease.lang.python.jython.debugger.JythonDebugTest)  Time elapsed: 0.205 s
20:33:06 [2020-09-26T00:33:06.666Z] nativeObjectVariable(org.eclipse.ease.lang.python.jython.debugger.JythonDebugTest)  Time elapsed: 0.305 s
20:33:06 [2020-09-26T00:33:06.666Z] terminateDebugTargetInSuspendedState(org.eclipse.ease.lang.python.jython.debugger.JythonDebugTest)  Time elapsed: 0.206 s
20:33:06 [2020-09-26T00:33:06.666Z] disconnectStackFrameInSuspendedState(org.eclipse.ease.lang.python.jython.debugger.JythonDebugTest)  Time elapsed: 0.206 s
20:33:06 [2020-09-26T00:33:06.666Z] stepReturnOnProcess(org.eclipse.ease.lang.python.jython.debugger.JythonDebugTest)  Time elapsed: 0.306 s
20:33:06 [2020-09-26T00:33:06.666Z] evaluateWatchExpression(org.eclipse.ease.lang.python.jython.debugger.JythonDebugTest)  Time elapsed: 0.208 s
20:33:06 [2020-09-26T00:33:06.666Z] 
20:33:06 [2020-09-26T00:33:06.666Z] Results:
20:33:06 [2020-09-26T00:33:06.666Z] 
20:33:06 [2020-09-26T00:33:06.666Z] Tests run: 42, Failures: 0, Errors: 0, Skipped: 0
20:33:06 [2020-09-26T00:33:06.666Z] 
20:33:07 [2020-09-26T00:33:07.594Z] [INFO] All tests passed!
20:33:07 [2020-09-26T00:33:07.594Z] [INFO] 
20:33:07 [2020-09-26T00:33:07.594Z] [INFO] --- maven-install-plugin:2.3.1:install (default-install) @ org.eclipse.ease.lang.python.jython.test ---
20:33:07 [2020-09-26T00:33:07.595Z] [INFO] Installing /home/jenkins/agent/workspace/ease.verify.core.target.2020-03/tests/org.eclipse.ease.lang.python.jython.test/target/org.eclipse.ease.lang.python.jython.test-0.8.0-SNAPSHOT.jar to /home/jenkins/.m2/repository/org/eclipse/ease/org.eclipse.ease.lang.python.jython.test/0.8.0-SNAPSHOT/org.eclipse.ease.lang.python.jython.test-0.8.0-SNAPSHOT.jar
20:33:07 [2020-09-26T00:33:07.595Z] [INFO] Installing /home/jenkins/agent/workspace/ease.verify.core.target.2020-03/tests/org.eclipse.ease.lang.python.jython.test/pom.xml to /home/jenkins/.m2/repository/org/eclipse/ease/org.eclipse.ease.lang.python.jython.test/0.8.0-SNAPSHOT/org.eclipse.ease.lang.python.jython.test-0.8.0-SNAPSHOT.pom
20:33:07 [2020-09-26T00:33:07.595Z] [INFO] Installing /home/jenkins/agent/workspace/ease.verify.core.target.2020-03/tests/org.eclipse.ease.lang.python.jython.test/target/org.eclipse.ease.lang.python.jython.test-0.8.0-SNAPSHOT-sources.jar to /home/jenkins/.m2/repository/org/eclipse/ease/org.eclipse.ease.lang.python.jython.test/0.8.0-SNAPSHOT/org.eclipse.ease.lang.python.jython.test-0.8.0-SNAPSHOT-sources.jar
20:33:07 [2020-09-26T00:33:07.595Z] [INFO] Installing /home/jenkins/agent/workspace/ease.verify.core.target.2020-03/tests/org.eclipse.ease.lang.python.jython.test/target/p2content.xml to /home/jenkins/.m2/repository/org/eclipse/ease/org.eclipse.ease.lang.python.jython.test/0.8.0-SNAPSHOT/org.eclipse.ease.lang.python.jython.test-0.8.0-SNAPSHOT-p2metadata.xml
20:33:07 [2020-09-26T00:33:07.595Z] [INFO] Installing /home/jenkins/agent/workspace/ease.verify.core.target.2020-03/tests/org.eclipse.ease.lang.python.jython.test/target/p2artifacts.xml to /home/jenkins/.m2/repository/org/eclipse/ease/org.eclipse.ease.lang.python.jython.test/0.8.0-SNAPSHOT/org.eclipse.ease.lang.python.jython.test-0.8.0-SNAPSHOT-p2artifacts.xml
20:33:07 [2020-09-26T00:33:07.595Z] [INFO] Installing /home/jenkins/agent/workspace/ease.verify.core.target.2020-03/tests/org.eclipse.ease.lang.python.jython.test/target/p2content.xml to /home/jenkins/.m2/repository/org/eclipse/ease/org.eclipse.ease.lang.python.jython.test/0.8.0-SNAPSHOT/org.eclipse.ease.lang.python.jython.test-0.8.0-SNAPSHOT-p2metadata.xml
20:33:07 [2020-09-26T00:33:07.595Z] [INFO] Installing /home/jenkins/agent/workspace/ease.verify.core.target.2020-03/tests/org.eclipse.ease.lang.python.jython.test/target/p2artifacts.xml to /home/jenkins/.m2/repository/org/eclipse/ease/org.eclipse.ease.lang.python.jython.test/0.8.0-SNAPSHOT/org.eclipse.ease.lang.python.jython.test-0.8.0-SNAPSHOT-p2artifacts.xml
20:33:07 [2020-09-26T00:33:07.595Z] [INFO] 
20:33:07 [2020-09-26T00:33:07.595Z] [INFO] --- tycho-p2-plugin:1.5.0:update-local-index (default-update-local-index) @ org.eclipse.ease.lang.python.jython.test ---
20:33:07 [2020-09-26T00:33:07.595Z] [INFO] 
20:33:07 [2020-09-26T00:33:07.595Z] [INFO] -----< org.eclipse.ease:org.eclipse.ease.lang.scriptarchive.test >------
20:33:07 [2020-09-26T00:33:07.595Z] [INFO] Building org.eclipse.ease.lang.scriptarchive.test 0.8.0-SNAPSHOT [44/48]
20:33:07 [2020-09-26T00:33:07.595Z] [INFO] ------------------------[ eclipse-test-plugin ]-------------------------
20:33:07 [2020-09-26T00:33:07.595Z] [INFO] 
20:33:07 [2020-09-26T00:33:07.595Z] [INFO] --- maven-clean-plugin:2.5:clean (default-clean) @ org.eclipse.ease.lang.scriptarchive.test ---
20:33:07 [2020-09-26T00:33:07.595Z] [INFO] 
20:33:07 [2020-09-26T00:33:07.595Z] [INFO] --- tycho-packaging-plugin:1.5.0:build-qualifier (default-build-qualifier) @ org.eclipse.ease.lang.scriptarchive.test ---
20:33:07 [2020-09-26T00:33:07.595Z] [INFO] The project's OSGi version is 0.8.0.I201910171213
20:33:07 [2020-09-26T00:33:07.595Z] [INFO] 
20:33:07 [2020-09-26T00:33:07.595Z] [INFO] --- tycho-packaging-plugin:1.5.0:validate-id (default-validate-id) @ org.eclipse.ease.lang.scriptarchive.test ---
20:33:07 [2020-09-26T00:33:07.595Z] [INFO] 
20:33:07 [2020-09-26T00:33:07.595Z] [INFO] --- tycho-packaging-plugin:1.5.0:validate-version (default-validate-version) @ org.eclipse.ease.lang.scriptarchive.test ---
20:33:07 [2020-09-26T00:33:07.595Z] [INFO] 
20:33:07 [2020-09-26T00:33:07.595Z] [INFO] >>> maven-javadoc-plugin:2.9.1:javadoc (build-docs) > generate-sources @ org.eclipse.ease.lang.scriptarchive.test >>>
20:33:07 [2020-09-26T00:33:07.595Z] [INFO] 
20:33:07 [2020-09-26T00:33:07.595Z] [INFO] --- tycho-packaging-plugin:1.5.0:build-qualifier (default-build-qualifier) @ org.eclipse.ease.lang.scriptarchive.test ---
20:33:07 [2020-09-26T00:33:07.595Z] [INFO] The project's OSGi version is 0.8.0.I201910171213
20:33:07 [2020-09-26T00:33:07.595Z] [INFO] 
20:33:07 [2020-09-26T00:33:07.595Z] [INFO] --- tycho-packaging-plugin:1.5.0:validate-id (default-validate-id) @ org.eclipse.ease.lang.scriptarchive.test ---
20:33:07 [2020-09-26T00:33:07.595Z] [INFO] 
20:33:07 [2020-09-26T00:33:07.595Z] [INFO] --- tycho-packaging-plugin:1.5.0:validate-version (default-validate-version) @ org.eclipse.ease.lang.scriptarchive.test ---
20:33:07 [2020-09-26T00:33:07.595Z] [INFO] 
20:33:07 [2020-09-26T00:33:07.595Z] [INFO] <<< maven-javadoc-plugin:2.9.1:javadoc (build-docs) < generate-sources @ org.eclipse.ease.lang.scriptarchive.test <<<
20:33:07 [2020-09-26T00:33:07.595Z] [INFO] 
20:33:07 [2020-09-26T00:33:07.595Z] [INFO] 
20:33:07 [2020-09-26T00:33:07.595Z] [INFO] --- maven-javadoc-plugin:2.9.1:javadoc (build-docs) @ org.eclipse.ease.lang.scriptarchive.test ---
20:33:07 [2020-09-26T00:33:07.595Z] [ERROR] Error fetching link: http://help.eclipse.org/oxygen/topic/org.eclipse.platform.doc.isv/reference/api/package-list. Ignored it.
20:33:07 [2020-09-26T00:33:07.595Z] [ERROR] Error fetching link: https://ci.eclipse.org/ease/job/ease.build.core/JavaDoc/package-list. Ignored it.
20:33:08 [2020-09-26T00:33:08.572Z] [INFO] 
20:33:08 [2020-09-26T00:33:08.572Z] Loading source files for package org.eclipse.ease.lang.scriptarchive...
20:33:08 [2020-09-26T00:33:08.572Z] Constructing Javadoc information...
20:33:08 [2020-09-26T00:33:08.572Z] WARNING: Cannot open location "/home/jenkins/agent/workspace/ease.verify.core.target.2020-03/tests/org.eclipse.ease.lang.scriptarchive.test/target/javadoc-bundle-options/package-list"
20:33:08 [2020-09-26T00:33:08.572Z] No plugin definition found, skipping
20:33:08 [2020-09-26T00:33:08.572Z] No plugin definition found, skipping
20:33:08 [2020-09-26T00:33:08.572Z] [WARNING] Javadoc Warnings
20:33:08 [2020-09-26T00:33:08.572Z] [WARNING] Picked up JAVA_TOOL_OPTIONS: -Dmaven.ext.class.path="/home/jenkins/agent/workspace/ease.verify.core.target.2020-03@tmp/withMaven9dd1d443/pipeline-maven-spy.jar" -Dorg.jenkinsci.plugins.pipeline.maven.reportsFolder="/home/jenkins/agent/workspace/ease.verify.core.target.2020-03@tmp/withMaven9dd1d443"
20:33:08 [2020-09-26T00:33:08.572Z] [WARNING] javadoc: warning - The old Doclet and Taglet APIs in the packages
20:33:08 [2020-09-26T00:33:08.572Z] [WARNING] com.sun.javadoc, com.sun.tools.doclets and their implementations
20:33:08 [2020-09-26T00:33:08.572Z] [WARNING] are planned to be removed in a future JDK release. These
20:33:08 [2020-09-26T00:33:08.572Z] [WARNING] components have been superseded by the new APIs in jdk.javadoc.doclet.
20:33:08 [2020-09-26T00:33:08.829Z] [WARNING] Users are strongly recommended to migrate to the new APIs.
20:33:08 [2020-09-26T00:33:08.829Z] [INFO] 
20:33:08 [2020-09-26T00:33:08.829Z] [INFO] --- build-helper-maven-plugin:1.9.1:add-resource (add_help) @ org.eclipse.ease.lang.scriptarchive.test ---
20:33:08 [2020-09-26T00:33:08.829Z] [INFO] 
20:33:08 [2020-09-26T00:33:08.829Z] [INFO] --- maven-resources-plugin:2.4.3:resources (default-resources) @ org.eclipse.ease.lang.scriptarchive.test ---
20:33:08 [2020-09-26T00:33:08.829Z] [INFO] Using 'UTF-8' encoding to copy filtered resources.
20:33:08 [2020-09-26T00:33:08.829Z] [INFO] skip non existing resourceDirectory /home/jenkins/agent/workspace/ease.verify.core.target.2020-03/tests/org.eclipse.ease.lang.scriptarchive.test/src/main/resources
20:33:08 [2020-09-26T00:33:08.829Z] [INFO] skip non existing resourceDirectory /home/jenkins/agent/workspace/ease.verify.core.target.2020-03/tests/org.eclipse.ease.lang.scriptarchive.test/help
20:33:08 [2020-09-26T00:33:08.829Z] [INFO] 
20:33:08 [2020-09-26T00:33:08.829Z] [INFO] --- tycho-compiler-plugin:1.5.0:compile (default-compile) @ org.eclipse.ease.lang.scriptarchive.test ---
20:33:08 [2020-09-26T00:33:08.829Z] [INFO] Compiling 1 source file to /home/jenkins/agent/workspace/ease.verify.core.target.2020-03/tests/org.eclipse.ease.lang.scriptarchive.test/target/classes
20:33:08 [2020-09-26T00:33:08.829Z] [INFO] 
20:33:08 [2020-09-26T00:33:08.829Z] [INFO] --- maven-resources-plugin:2.4.3:testResources (default-testResources) @ org.eclipse.ease.lang.scriptarchive.test ---
20:33:08 [2020-09-26T00:33:08.829Z] [INFO] Using 'UTF-8' encoding to copy filtered resources.
20:33:08 [2020-09-26T00:33:08.829Z] [INFO] skip non existing resourceDirectory /home/jenkins/agent/workspace/ease.verify.core.target.2020-03/tests/org.eclipse.ease.lang.scriptarchive.test/src/test/resources
20:33:08 [2020-09-26T00:33:08.829Z] [INFO] 
20:33:08 [2020-09-26T00:33:08.829Z] [INFO] --- tycho-source-plugin:1.5.0:plugin-source (plugin-source) @ org.eclipse.ease.lang.scriptarchive.test ---
20:33:08 [2020-09-26T00:33:08.829Z] [INFO] Building jar: /home/jenkins/agent/workspace/ease.verify.core.target.2020-03/tests/org.eclipse.ease.lang.scriptarchive.test/target/org.eclipse.ease.lang.scriptarchive.test-0.8.0-SNAPSHOT-sources.jar
20:33:08 [2020-09-26T00:33:08.829Z] [INFO] 
20:33:08 [2020-09-26T00:33:08.829Z] [INFO] --- target-platform-configuration:1.5.0:target-platform (default-target-platform) @ org.eclipse.ease.lang.scriptarchive.test ---
20:33:08 [2020-09-26T00:33:08.829Z] [INFO] 
20:33:08 [2020-09-26T00:33:08.829Z] [INFO] --- tycho-packaging-plugin:1.5.0:package-plugin (default-package-plugin) @ org.eclipse.ease.lang.scriptarchive.test ---
20:33:08 [2020-09-26T00:33:08.829Z] [INFO] Building jar: /home/jenkins/agent/workspace/ease.verify.core.target.2020-03/tests/org.eclipse.ease.lang.scriptarchive.test/target/org.eclipse.ease.lang.scriptarchive.test-0.8.0-SNAPSHOT.jar
20:33:08 [2020-09-26T00:33:08.829Z] [INFO] 
20:33:08 [2020-09-26T00:33:08.830Z] [INFO] --- tycho-p2-plugin:1.5.0:p2-metadata-default (default-p2-metadata-default) @ org.eclipse.ease.lang.scriptarchive.test ---
20:33:08 [2020-09-26T00:33:08.830Z] [INFO] 
20:33:08 [2020-09-26T00:33:08.830Z] [INFO] --- tycho-source-feature-plugin:1.5.0:source-feature (source-feature) @ org.eclipse.ease.lang.scriptarchive.test ---
20:33:08 [2020-09-26T00:33:08.830Z] [INFO] 
20:33:08 [2020-09-26T00:33:08.830Z] [INFO] --- tycho-p2-plugin:1.5.0:p2-metadata (attached-p2-metadata) @ org.eclipse.ease.lang.scriptarchive.test ---
20:33:08 [2020-09-26T00:33:08.830Z] [INFO] 
20:33:08 [2020-09-26T00:33:08.830Z] [INFO] --- tycho-surefire-plugin:1.5.0:test (default-test) @ org.eclipse.ease.lang.scriptarchive.test ---
20:33:09 [2020-09-26T00:33:09.101Z] [INFO] Expected eclipse log file: /home/jenkins/agent/workspace/ease.verify.core.target.2020-03/tests/org.eclipse.ease.lang.scriptarchive.test/target/work/data/.metadata/.log
20:33:09 [2020-09-26T00:33:09.101Z] [INFO] Command line:
20:33:09 [2020-09-26T00:33:09.101Z] 	[/opt/tools/java/openjdk/jdk-11/11.0.2+9/bin/java, -Dosgi.noShutdown=false, -Dosgi.os=linux, -Dosgi.ws=gtk, -Dosgi.arch=x86_64, -Dosgi.clean=true, -jar, /home/jenkins/.m2/repository/p2/osgi/bundle/org.eclipse.equinox.launcher/1.5.800.v20200727-1323/org.eclipse.equinox.launcher-1.5.800.v20200727-1323.jar, -data, /home/jenkins/agent/workspace/ease.verify.core.target.2020-03/tests/org.eclipse.ease.lang.scriptarchive.test/target/work/data, -install, /home/jenkins/agent/workspace/ease.verify.core.target.2020-03/tests/org.eclipse.ease.lang.scriptarchive.test/target/work, -configuration, /home/jenkins/agent/workspace/ease.verify.core.target.2020-03/tests/org.eclipse.ease.lang.scriptarchive.test/target/work/configuration, -application, org.eclipse.tycho.surefire.osgibooter.headlesstest, -testproperties, /home/jenkins/agent/workspace/ease.verify.core.target.2020-03/tests/org.eclipse.ease.lang.scriptarchive.test/target/surefire.properties]
20:33:09 [2020-09-26T00:33:09.101Z] Picked up JAVA_TOOL_OPTIONS: -Dmaven.ext.class.path="/home/jenkins/agent/workspace/ease.verify.core.target.2020-03@tmp/withMaven9dd1d443/pipeline-maven-spy.jar" -Dorg.jenkinsci.plugins.pipeline.maven.reportsFolder="/home/jenkins/agent/workspace/ease.verify.core.target.2020-03@tmp/withMaven9dd1d443" 
20:33:10 [2020-09-26T00:33:10.542Z] Running org.eclipse.ease.lang.scriptarchive.ArchiveEngineTest
20:33:10 [2020-09-26T00:33:10.803Z] We are running from a zip file!
20:33:11 [2020-09-26T00:33:11.060Z] org.eclipse.ease.ScriptExecutionException: SyntaxError: missing ; before statement (workspace://__EASE_ScriptArchive_1/scripts/Master.js#3)
20:33:11 [2020-09-26T00:33:11.060Z] this is an error
20:33:11 [2020-09-26T00:33:11.060Z]        ^
20:33:11 [2020-09-26T00:33:11.060Z] 	at Master.js,workspace://__EASE_ScriptArchive_1/scripts/Master.js
20:33:11 [2020-09-26T00:33:11.060Z] org.eclipse.ease.ScriptExecutionException: SyntaxError: missing ; before statement (workspace://__EASE_ScriptArchive_1/scripts/Master.js#3)
20:33:11 [2020-09-26T00:33:11.060Z] this is an error
20:33:11 [2020-09-26T00:33:11.060Z]        ^
20:33:11 [2020-09-26T00:33:11.060Z] 	at Master.js,workspace://__EASE_ScriptArchive_1/scripts/Master.js
20:33:11 [2020-09-26T00:33:11.060Z] Tests run: 7, Failures: 0, Errors: 0, Skipped: 0, Time elapsed: 0.458 s - in org.eclipse.ease.lang.scriptarchive.ArchiveEngineTest
20:33:11 [2020-09-26T00:33:11.060Z] executeWithManifest(org.eclipse.ease.lang.scriptarchive.ArchiveEngineTest)  Time elapsed: 0.27 s
20:33:11 [2020-09-26T00:33:11.060Z] zipFileRegistration(org.eclipse.ease.lang.scriptarchive.ArchiveEngineTest)  Time elapsed: 0.008 s
20:33:11 [2020-09-26T00:33:11.060Z] engineIdRegistration(org.eclipse.ease.lang.scriptarchive.ArchiveEngineTest)  Time elapsed: 0 s
20:33:11 [2020-09-26T00:33:11.060Z] jarFileRegistration(org.eclipse.ease.lang.scriptarchive.ArchiveEngineTest)  Time elapsed: 0 s
20:33:11 [2020-09-26T00:33:11.060Z] sarFileRegistration(org.eclipse.ease.lang.scriptarchive.ArchiveEngineTest)  Time elapsed: 0 s
20:33:11 [2020-09-26T00:33:11.060Z] executeWithErrors(org.eclipse.ease.lang.scriptarchive.ArchiveEngineTest)  Time elapsed: 0.048 s
20:33:11 [2020-09-26T00:33:11.060Z] executeWithIncludes(org.eclipse.ease.lang.scriptarchive.ArchiveEngineTest)  Time elapsed: 0.067 s
20:33:11 [2020-09-26T00:33:11.060Z] 
20:33:11 [2020-09-26T00:33:11.060Z] Results:
20:33:11 [2020-09-26T00:33:11.060Z] 
20:33:11 [2020-09-26T00:33:11.060Z] Tests run: 7, Failures: 0, Errors: 0, Skipped: 0
20:33:11 [2020-09-26T00:33:11.060Z] 
20:33:11 [2020-09-26T00:33:11.622Z] [INFO] All tests passed!
20:33:11 [2020-09-26T00:33:11.622Z] [INFO] 
20:33:11 [2020-09-26T00:33:11.622Z] [INFO] --- maven-install-plugin:2.3.1:install (default-install) @ org.eclipse.ease.lang.scriptarchive.test ---
20:33:11 [2020-09-26T00:33:11.622Z] [INFO] Installing /home/jenkins/agent/workspace/ease.verify.core.target.2020-03/tests/org.eclipse.ease.lang.scriptarchive.test/target/org.eclipse.ease.lang.scriptarchive.test-0.8.0-SNAPSHOT.jar to /home/jenkins/.m2/repository/org/eclipse/ease/org.eclipse.ease.lang.scriptarchive.test/0.8.0-SNAPSHOT/org.eclipse.ease.lang.scriptarchive.test-0.8.0-SNAPSHOT.jar
20:33:11 [2020-09-26T00:33:11.622Z] [INFO] Installing /home/jenkins/agent/workspace/ease.verify.core.target.2020-03/tests/org.eclipse.ease.lang.scriptarchive.test/pom.xml to /home/jenkins/.m2/repository/org/eclipse/ease/org.eclipse.ease.lang.scriptarchive.test/0.8.0-SNAPSHOT/org.eclipse.ease.lang.scriptarchive.test-0.8.0-SNAPSHOT.pom
20:33:11 [2020-09-26T00:33:11.622Z] [INFO] Installing /home/jenkins/agent/workspace/ease.verify.core.target.2020-03/tests/org.eclipse.ease.lang.scriptarchive.test/target/org.eclipse.ease.lang.scriptarchive.test-0.8.0-SNAPSHOT-sources.jar to /home/jenkins/.m2/repository/org/eclipse/ease/org.eclipse.ease.lang.scriptarchive.test/0.8.0-SNAPSHOT/org.eclipse.ease.lang.scriptarchive.test-0.8.0-SNAPSHOT-sources.jar
20:33:11 [2020-09-26T00:33:11.623Z] [INFO] Installing /home/jenkins/agent/workspace/ease.verify.core.target.2020-03/tests/org.eclipse.ease.lang.scriptarchive.test/target/p2content.xml to /home/jenkins/.m2/repository/org/eclipse/ease/org.eclipse.ease.lang.scriptarchive.test/0.8.0-SNAPSHOT/org.eclipse.ease.lang.scriptarchive.test-0.8.0-SNAPSHOT-p2metadata.xml
20:33:11 [2020-09-26T00:33:11.623Z] [INFO] Installing /home/jenkins/agent/workspace/ease.verify.core.target.2020-03/tests/org.eclipse.ease.lang.scriptarchive.test/target/p2artifacts.xml to /home/jenkins/.m2/repository/org/eclipse/ease/org.eclipse.ease.lang.scriptarchive.test/0.8.0-SNAPSHOT/org.eclipse.ease.lang.scriptarchive.test-0.8.0-SNAPSHOT-p2artifacts.xml
20:33:11 [2020-09-26T00:33:11.623Z] [INFO] Installing /home/jenkins/agent/workspace/ease.verify.core.target.2020-03/tests/org.eclipse.ease.lang.scriptarchive.test/target/p2content.xml to /home/jenkins/.m2/repository/org/eclipse/ease/org.eclipse.ease.lang.scriptarchive.test/0.8.0-SNAPSHOT/org.eclipse.ease.lang.scriptarchive.test-0.8.0-SNAPSHOT-p2metadata.xml
20:33:11 [2020-09-26T00:33:11.623Z] [INFO] Installing /home/jenkins/agent/workspace/ease.verify.core.target.2020-03/tests/org.eclipse.ease.lang.scriptarchive.test/target/p2artifacts.xml to /home/jenkins/.m2/repository/org/eclipse/ease/org.eclipse.ease.lang.scriptarchive.test/0.8.0-SNAPSHOT/org.eclipse.ease.lang.scriptarchive.test-0.8.0-SNAPSHOT-p2artifacts.xml
20:33:11 [2020-09-26T00:33:11.623Z] [INFO] 
20:33:11 [2020-09-26T00:33:11.623Z] [INFO] --- tycho-p2-plugin:1.5.0:update-local-index (default-update-local-index) @ org.eclipse.ease.lang.scriptarchive.test ---
20:33:11 [2020-09-26T00:33:11.623Z] [INFO] 
20:33:11 [2020-09-26T00:33:11.623Z] [INFO] --------< org.eclipse.ease:org.eclipse.ease.lang.unittest.test >--------
20:33:11 [2020-09-26T00:33:11.623Z] [INFO] Building org.eclipse.ease.lang.unittest.test 0.8.0-SNAPSHOT      [45/48]
20:33:11 [2020-09-26T00:33:11.623Z] [INFO] ------------------------[ eclipse-test-plugin ]-------------------------
20:33:11 [2020-09-26T00:33:11.623Z] [INFO] 
20:33:11 [2020-09-26T00:33:11.623Z] [INFO] --- maven-clean-plugin:2.5:clean (default-clean) @ org.eclipse.ease.lang.unittest.test ---
20:33:11 [2020-09-26T00:33:11.623Z] [INFO] 
20:33:11 [2020-09-26T00:33:11.623Z] [INFO] --- tycho-packaging-plugin:1.5.0:build-qualifier (default-build-qualifier) @ org.eclipse.ease.lang.unittest.test ---
20:33:11 [2020-09-26T00:33:11.623Z] [INFO] The project's OSGi version is 0.8.0.I202009240747
20:33:11 [2020-09-26T00:33:11.623Z] [INFO] 
20:33:11 [2020-09-26T00:33:11.623Z] [INFO] --- tycho-packaging-plugin:1.5.0:validate-id (default-validate-id) @ org.eclipse.ease.lang.unittest.test ---
20:33:11 [2020-09-26T00:33:11.623Z] [INFO] 
20:33:11 [2020-09-26T00:33:11.623Z] [INFO] --- tycho-packaging-plugin:1.5.0:validate-version (default-validate-version) @ org.eclipse.ease.lang.unittest.test ---
20:33:11 [2020-09-26T00:33:11.623Z] [INFO] 
20:33:11 [2020-09-26T00:33:11.623Z] [INFO] >>> maven-javadoc-plugin:2.9.1:javadoc (build-docs) > generate-sources @ org.eclipse.ease.lang.unittest.test >>>
20:33:11 [2020-09-26T00:33:11.623Z] [INFO] 
20:33:11 [2020-09-26T00:33:11.623Z] [INFO] --- tycho-packaging-plugin:1.5.0:build-qualifier (default-build-qualifier) @ org.eclipse.ease.lang.unittest.test ---
20:33:11 [2020-09-26T00:33:11.623Z] [INFO] The project's OSGi version is 0.8.0.I202009240747
20:33:11 [2020-09-26T00:33:11.623Z] [INFO] 
20:33:11 [2020-09-26T00:33:11.623Z] [INFO] --- tycho-packaging-plugin:1.5.0:validate-id (default-validate-id) @ org.eclipse.ease.lang.unittest.test ---
20:33:11 [2020-09-26T00:33:11.623Z] [INFO] 
20:33:11 [2020-09-26T00:33:11.623Z] [INFO] --- tycho-packaging-plugin:1.5.0:validate-version (default-validate-version) @ org.eclipse.ease.lang.unittest.test ---
20:33:11 [2020-09-26T00:33:11.623Z] [INFO] 
20:33:11 [2020-09-26T00:33:11.623Z] [INFO] <<< maven-javadoc-plugin:2.9.1:javadoc (build-docs) < generate-sources @ org.eclipse.ease.lang.unittest.test <<<
20:33:11 [2020-09-26T00:33:11.623Z] [INFO] 
20:33:11 [2020-09-26T00:33:11.623Z] [INFO] 
20:33:11 [2020-09-26T00:33:11.623Z] [INFO] --- maven-javadoc-plugin:2.9.1:javadoc (build-docs) @ org.eclipse.ease.lang.unittest.test ---
20:33:11 [2020-09-26T00:33:11.879Z] [ERROR] Error fetching link: http://help.eclipse.org/oxygen/topic/org.eclipse.platform.doc.isv/reference/api/package-list. Ignored it.
20:33:11 [2020-09-26T00:33:11.879Z] [ERROR] Error fetching link: https://ci.eclipse.org/ease/job/ease.build.core/JavaDoc/package-list. Ignored it.
20:33:12 [2020-09-26T00:33:12.807Z] [INFO] 
20:33:12 [2020-09-26T00:33:12.807Z] Loading source files for package org.eclipse.ease.lang.unittest...
20:33:12 [2020-09-26T00:33:12.807Z] Constructing Javadoc information...
20:33:12 [2020-09-26T00:33:12.807Z] WARNING: Cannot open location "/home/jenkins/agent/workspace/ease.verify.core.target.2020-03/tests/org.eclipse.ease.lang.unittest.test/target/javadoc-bundle-options/package-list"
20:33:12 [2020-09-26T00:33:12.807Z] No plugin definition found, skipping
20:33:12 [2020-09-26T00:33:12.807Z] No plugin definition found, skipping
20:33:12 [2020-09-26T00:33:12.807Z] [WARNING] Javadoc Warnings
20:33:12 [2020-09-26T00:33:12.807Z] [WARNING] Picked up JAVA_TOOL_OPTIONS: -Dmaven.ext.class.path="/home/jenkins/agent/workspace/ease.verify.core.target.2020-03@tmp/withMaven9dd1d443/pipeline-maven-spy.jar" -Dorg.jenkinsci.plugins.pipeline.maven.reportsFolder="/home/jenkins/agent/workspace/ease.verify.core.target.2020-03@tmp/withMaven9dd1d443"
20:33:12 [2020-09-26T00:33:12.807Z] [WARNING] javadoc: warning - The old Doclet and Taglet APIs in the packages
20:33:12 [2020-09-26T00:33:12.807Z] [WARNING] com.sun.javadoc, com.sun.tools.doclets and their implementations
20:33:12 [2020-09-26T00:33:12.807Z] [WARNING] are planned to be removed in a future JDK release. These
20:33:12 [2020-09-26T00:33:12.807Z] [WARNING] components have been superseded by the new APIs in jdk.javadoc.doclet.
20:33:12 [2020-09-26T00:33:12.807Z] [WARNING] Users are strongly recommended to migrate to the new APIs.
20:33:12 [2020-09-26T00:33:12.807Z] [INFO] 
20:33:12 [2020-09-26T00:33:12.807Z] [INFO] --- build-helper-maven-plugin:1.9.1:add-resource (add_help) @ org.eclipse.ease.lang.unittest.test ---
20:33:12 [2020-09-26T00:33:12.807Z] [INFO] 
20:33:12 [2020-09-26T00:33:12.807Z] [INFO] --- maven-resources-plugin:2.4.3:resources (default-resources) @ org.eclipse.ease.lang.unittest.test ---
20:33:12 [2020-09-26T00:33:12.807Z] [INFO] Using 'UTF-8' encoding to copy filtered resources.
20:33:12 [2020-09-26T00:33:12.807Z] [INFO] skip non existing resourceDirectory /home/jenkins/agent/workspace/ease.verify.core.target.2020-03/tests/org.eclipse.ease.lang.unittest.test/src/main/resources
20:33:12 [2020-09-26T00:33:12.807Z] [INFO] skip non existing resourceDirectory /home/jenkins/agent/workspace/ease.verify.core.target.2020-03/tests/org.eclipse.ease.lang.unittest.test/help
20:33:12 [2020-09-26T00:33:12.807Z] [INFO] 
20:33:12 [2020-09-26T00:33:12.807Z] [INFO] --- tycho-compiler-plugin:1.5.0:compile (default-compile) @ org.eclipse.ease.lang.unittest.test ---
20:33:12 [2020-09-26T00:33:12.807Z] [INFO] Compiling 3 source files to /home/jenkins/agent/workspace/ease.verify.core.target.2020-03/tests/org.eclipse.ease.lang.unittest.test/target/classes
20:33:12 [2020-09-26T00:33:12.807Z] [INFO] 
20:33:12 [2020-09-26T00:33:12.807Z] [INFO] --- maven-resources-plugin:2.4.3:testResources (default-testResources) @ org.eclipse.ease.lang.unittest.test ---
20:33:12 [2020-09-26T00:33:12.807Z] [INFO] Using 'UTF-8' encoding to copy filtered resources.
20:33:12 [2020-09-26T00:33:12.807Z] [INFO] skip non existing resourceDirectory /home/jenkins/agent/workspace/ease.verify.core.target.2020-03/tests/org.eclipse.ease.lang.unittest.test/src/test/resources
20:33:12 [2020-09-26T00:33:12.807Z] [INFO] 
20:33:12 [2020-09-26T00:33:12.807Z] [INFO] --- tycho-source-plugin:1.5.0:plugin-source (plugin-source) @ org.eclipse.ease.lang.unittest.test ---
20:33:12 [2020-09-26T00:33:12.808Z] [WARNING] Bundle-Name header not found in /home/jenkins/agent/workspace/ease.verify.core.target.2020-03/tests/org.eclipse.ease.lang.unittest.test/META-INF/MANIFEST.MF, fallback to Bundle-SymbolicName for source bundle
20:33:12 [2020-09-26T00:33:12.808Z] [WARNING] Bundle-Vendor header not found in /home/jenkins/agent/workspace/ease.verify.core.target.2020-03/tests/org.eclipse.ease.lang.unittest.test/META-INF/MANIFEST.MF, fallback to 'unknown' for source bundle
20:33:12 [2020-09-26T00:33:12.808Z] [INFO] Building jar: /home/jenkins/agent/workspace/ease.verify.core.target.2020-03/tests/org.eclipse.ease.lang.unittest.test/target/org.eclipse.ease.lang.unittest.test-0.8.0-SNAPSHOT-sources.jar
20:33:12 [2020-09-26T00:33:12.808Z] [INFO] 
20:33:12 [2020-09-26T00:33:12.808Z] [INFO] --- target-platform-configuration:1.5.0:target-platform (default-target-platform) @ org.eclipse.ease.lang.unittest.test ---
20:33:12 [2020-09-26T00:33:12.808Z] [INFO] 
20:33:12 [2020-09-26T00:33:12.808Z] [INFO] --- tycho-packaging-plugin:1.5.0:package-plugin (default-package-plugin) @ org.eclipse.ease.lang.unittest.test ---
20:33:12 [2020-09-26T00:33:12.808Z] [INFO] Building jar: /home/jenkins/agent/workspace/ease.verify.core.target.2020-03/tests/org.eclipse.ease.lang.unittest.test/target/org.eclipse.ease.lang.unittest.test-0.8.0-SNAPSHOT.jar
20:33:12 [2020-09-26T00:33:12.808Z] [INFO] 
20:33:12 [2020-09-26T00:33:12.808Z] [INFO] --- tycho-p2-plugin:1.5.0:p2-metadata-default (default-p2-metadata-default) @ org.eclipse.ease.lang.unittest.test ---
20:33:12 [2020-09-26T00:33:12.808Z] [INFO] 
20:33:12 [2020-09-26T00:33:12.808Z] [INFO] --- tycho-source-feature-plugin:1.5.0:source-feature (source-feature) @ org.eclipse.ease.lang.unittest.test ---
20:33:12 [2020-09-26T00:33:12.808Z] [INFO] 
20:33:12 [2020-09-26T00:33:12.808Z] [INFO] --- tycho-p2-plugin:1.5.0:p2-metadata (attached-p2-metadata) @ org.eclipse.ease.lang.unittest.test ---
20:33:12 [2020-09-26T00:33:12.808Z] [INFO] 
20:33:12 [2020-09-26T00:33:12.808Z] [INFO] --- tycho-surefire-plugin:1.5.0:test (default-test) @ org.eclipse.ease.lang.unittest.test ---
20:33:13 [2020-09-26T00:33:13.103Z] [INFO] Expected eclipse log file: /home/jenkins/agent/workspace/ease.verify.core.target.2020-03/tests/org.eclipse.ease.lang.unittest.test/target/work/data/.metadata/.log
20:33:13 [2020-09-26T00:33:13.103Z] [INFO] Command line:
20:33:13 [2020-09-26T00:33:13.103Z] 	[/opt/tools/java/openjdk/jdk-11/11.0.2+9/bin/java, -Dosgi.noShutdown=false, -Dosgi.os=linux, -Dosgi.ws=gtk, -Dosgi.arch=x86_64, -Dosgi.clean=true, -jar, /home/jenkins/.m2/repository/p2/osgi/bundle/org.eclipse.equinox.launcher/1.5.800.v20200727-1323/org.eclipse.equinox.launcher-1.5.800.v20200727-1323.jar, -data, /home/jenkins/agent/workspace/ease.verify.core.target.2020-03/tests/org.eclipse.ease.lang.unittest.test/target/work/data, -install, /home/jenkins/agent/workspace/ease.verify.core.target.2020-03/tests/org.eclipse.ease.lang.unittest.test/target/work, -configuration, /home/jenkins/agent/workspace/ease.verify.core.target.2020-03/tests/org.eclipse.ease.lang.unittest.test/target/work/configuration, -application, org.eclipse.tycho.surefire.osgibooter.headlesstest, -testproperties, /home/jenkins/agent/workspace/ease.verify.core.target.2020-03/tests/org.eclipse.ease.lang.unittest.test/target/surefire.properties]
20:33:13 [2020-09-26T00:33:13.103Z] Picked up JAVA_TOOL_OPTIONS: -Dmaven.ext.class.path="/home/jenkins/agent/workspace/ease.verify.core.target.2020-03@tmp/withMaven9dd1d443/pipeline-maven-spy.jar" -Dorg.jenkinsci.plugins.pipeline.maven.reportsFolder="/home/jenkins/agent/workspace/ease.verify.core.target.2020-03@tmp/withMaven9dd1d443" 
20:33:14 [2020-09-26T00:33:14.994Z] Running org.eclipse.ease.lang.unittest.ClassicJavaScriptTest
20:33:16 [2020-09-26T00:33:16.359Z] Tests run: 7, Failures: 0, Errors: 0, Skipped: 0, Time elapsed: 1.461 s - in org.eclipse.ease.lang.unittest.ClassicJavaScriptTest
20:33:16 [2020-09-26T00:33:16.359Z] folderStatus(org.eclipse.ease.lang.unittest.ClassicJavaScriptTest)  Time elapsed: 0.625 s
20:33:16 [2020-09-26T00:33:16.359Z] errorTestStatus(org.eclipse.ease.lang.unittest.ClassicJavaScriptTest)  Time elapsed: 0.169 s
20:33:16 [2020-09-26T00:33:16.359Z] failureTestStatus(org.eclipse.ease.lang.unittest.ClassicJavaScriptTest)  Time elapsed: 0.115 s
20:33:16 [2020-09-26T00:33:16.359Z] verifyOutput(org.eclipse.ease.lang.unittest.ClassicJavaScriptTest)  Time elapsed: 0.169 s
20:33:16 [2020-09-26T00:33:16.359Z] suiteStatus(org.eclipse.ease.lang.unittest.ClassicJavaScriptTest)  Time elapsed: 0.109 s
20:33:16 [2020-09-26T00:33:16.359Z] ignoreTestStatus(org.eclipse.ease.lang.unittest.ClassicJavaScriptTest)  Time elapsed: 0.105 s
20:33:16 [2020-09-26T00:33:16.359Z] passTestStatus(org.eclipse.ease.lang.unittest.ClassicJavaScriptTest)  Time elapsed: 0.097 s
20:33:16 [2020-09-26T00:33:16.359Z] Running org.eclipse.ease.lang.unittest.ModernJavaScriptTest
20:33:17 [2020-09-26T00:33:17.288Z] Tests run: 8, Failures: 0, Errors: 0, Skipped: 0, Time elapsed: 0.717 s - in org.eclipse.ease.lang.unittest.ModernJavaScriptTest
20:33:17 [2020-09-26T00:33:17.288Z] folderStatus(org.eclipse.ease.lang.unittest.ModernJavaScriptTest)  Time elapsed: 0.122 s
20:33:17 [2020-09-26T00:33:17.288Z] verifyOutput(org.eclipse.ease.lang.unittest.ModernJavaScriptTest)  Time elapsed: 0.091 s
20:33:17 [2020-09-26T00:33:17.288Z] suiteStatus(org.eclipse.ease.lang.unittest.ModernJavaScriptTest)  Time elapsed: 0.102 s
20:33:17 [2020-09-26T00:33:17.288Z] ignoreTestStatus(org.eclipse.ease.lang.unittest.ModernJavaScriptTest)  Time elapsed: 0.088 s
20:33:17 [2020-09-26T00:33:17.288Z] ignoreTestClassStatus(org.eclipse.ease.lang.unittest.ModernJavaScriptTest)  Time elapsed: 0.092 s
20:33:17 [2020-09-26T00:33:17.288Z] failureTestClassStatus(org.eclipse.ease.lang.unittest.ModernJavaScriptTest)  Time elapsed: 0.085 s
20:33:17 [2020-09-26T00:33:17.288Z] errorTestClassStatus(org.eclipse.ease.lang.unittest.ModernJavaScriptTest)  Time elapsed: 0.054 s
20:33:17 [2020-09-26T00:33:17.288Z] passTestClassStatus(org.eclipse.ease.lang.unittest.ModernJavaScriptTest)  Time elapsed: 0.079 s
20:33:17 [2020-09-26T00:33:17.288Z] 
20:33:17 [2020-09-26T00:33:17.288Z] Results:
20:33:17 [2020-09-26T00:33:17.288Z] 
20:33:17 [2020-09-26T00:33:17.288Z] Tests run: 15, Failures: 0, Errors: 0, Skipped: 0
20:33:17 [2020-09-26T00:33:17.288Z] 
20:33:17 [2020-09-26T00:33:17.850Z] [INFO] All tests passed!
20:33:17 [2020-09-26T00:33:17.850Z] [INFO] 
20:33:17 [2020-09-26T00:33:17.850Z] [INFO] --- maven-install-plugin:2.3.1:install (default-install) @ org.eclipse.ease.lang.unittest.test ---
20:33:17 [2020-09-26T00:33:17.850Z] [INFO] Installing /home/jenkins/agent/workspace/ease.verify.core.target.2020-03/tests/org.eclipse.ease.lang.unittest.test/target/org.eclipse.ease.lang.unittest.test-0.8.0-SNAPSHOT.jar to /home/jenkins/.m2/repository/org/eclipse/ease/org.eclipse.ease.lang.unittest.test/0.8.0-SNAPSHOT/org.eclipse.ease.lang.unittest.test-0.8.0-SNAPSHOT.jar
20:33:17 [2020-09-26T00:33:17.850Z] [INFO] Installing /home/jenkins/agent/workspace/ease.verify.core.target.2020-03/tests/org.eclipse.ease.lang.unittest.test/pom.xml to /home/jenkins/.m2/repository/org/eclipse/ease/org.eclipse.ease.lang.unittest.test/0.8.0-SNAPSHOT/org.eclipse.ease.lang.unittest.test-0.8.0-SNAPSHOT.pom
20:33:17 [2020-09-26T00:33:17.851Z] [INFO] Installing /home/jenkins/agent/workspace/ease.verify.core.target.2020-03/tests/org.eclipse.ease.lang.unittest.test/target/org.eclipse.ease.lang.unittest.test-0.8.0-SNAPSHOT-sources.jar to /home/jenkins/.m2/repository/org/eclipse/ease/org.eclipse.ease.lang.unittest.test/0.8.0-SNAPSHOT/org.eclipse.ease.lang.unittest.test-0.8.0-SNAPSHOT-sources.jar
20:33:17 [2020-09-26T00:33:17.851Z] [INFO] Installing /home/jenkins/agent/workspace/ease.verify.core.target.2020-03/tests/org.eclipse.ease.lang.unittest.test/target/p2content.xml to /home/jenkins/.m2/repository/org/eclipse/ease/org.eclipse.ease.lang.unittest.test/0.8.0-SNAPSHOT/org.eclipse.ease.lang.unittest.test-0.8.0-SNAPSHOT-p2metadata.xml
20:33:17 [2020-09-26T00:33:17.851Z] [INFO] Installing /home/jenkins/agent/workspace/ease.verify.core.target.2020-03/tests/org.eclipse.ease.lang.unittest.test/target/p2artifacts.xml to /home/jenkins/.m2/repository/org/eclipse/ease/org.eclipse.ease.lang.unittest.test/0.8.0-SNAPSHOT/org.eclipse.ease.lang.unittest.test-0.8.0-SNAPSHOT-p2artifacts.xml
20:33:17 [2020-09-26T00:33:17.851Z] [INFO] Installing /home/jenkins/agent/workspace/ease.verify.core.target.2020-03/tests/org.eclipse.ease.lang.unittest.test/target/p2content.xml to /home/jenkins/.m2/repository/org/eclipse/ease/org.eclipse.ease.lang.unittest.test/0.8.0-SNAPSHOT/org.eclipse.ease.lang.unittest.test-0.8.0-SNAPSHOT-p2metadata.xml
20:33:17 [2020-09-26T00:33:17.851Z] [INFO] Installing /home/jenkins/agent/workspace/ease.verify.core.target.2020-03/tests/org.eclipse.ease.lang.unittest.test/target/p2artifacts.xml to /home/jenkins/.m2/repository/org/eclipse/ease/org.eclipse.ease.lang.unittest.test/0.8.0-SNAPSHOT/org.eclipse.ease.lang.unittest.test-0.8.0-SNAPSHOT-p2artifacts.xml
20:33:17 [2020-09-26T00:33:17.851Z] [INFO] 
20:33:17 [2020-09-26T00:33:17.851Z] [INFO] --- tycho-p2-plugin:1.5.0:update-local-index (default-update-local-index) @ org.eclipse.ease.lang.unittest.test ---
20:33:17 [2020-09-26T00:33:17.851Z] [INFO] 
20:33:17 [2020-09-26T00:33:17.851Z] [INFO] ---------< org.eclipse.ease:org.eclipse.ease.ui.scripts.test >----------
20:33:17 [2020-09-26T00:33:17.851Z] [INFO] Building org.eclipse.ease.ui.scripts.test 0.8.0-SNAPSHOT         [46/48]
20:33:17 [2020-09-26T00:33:17.851Z] [INFO] ------------------------[ eclipse-test-plugin ]-------------------------
20:33:17 [2020-09-26T00:33:17.851Z] [INFO] 
20:33:17 [2020-09-26T00:33:17.851Z] [INFO] --- maven-clean-plugin:2.5:clean (default-clean) @ org.eclipse.ease.ui.scripts.test ---
20:33:17 [2020-09-26T00:33:17.851Z] [INFO] 
20:33:17 [2020-09-26T00:33:17.851Z] [INFO] --- tycho-packaging-plugin:1.5.0:build-qualifier (default-build-qualifier) @ org.eclipse.ease.ui.scripts.test ---
20:33:17 [2020-09-26T00:33:17.851Z] [INFO] The project's OSGi version is 0.8.0.I202009240747
20:33:17 [2020-09-26T00:33:17.851Z] [INFO] 
20:33:17 [2020-09-26T00:33:17.851Z] [INFO] --- tycho-packaging-plugin:1.5.0:validate-id (default-validate-id) @ org.eclipse.ease.ui.scripts.test ---
20:33:17 [2020-09-26T00:33:17.851Z] [INFO] 
20:33:17 [2020-09-26T00:33:17.851Z] [INFO] --- tycho-packaging-plugin:1.5.0:validate-version (default-validate-version) @ org.eclipse.ease.ui.scripts.test ---
20:33:17 [2020-09-26T00:33:17.851Z] [INFO] 
20:33:17 [2020-09-26T00:33:17.851Z] [INFO] >>> maven-javadoc-plugin:2.9.1:javadoc (build-docs) > generate-sources @ org.eclipse.ease.ui.scripts.test >>>
20:33:17 [2020-09-26T00:33:17.851Z] [INFO] 
20:33:17 [2020-09-26T00:33:17.851Z] [INFO] --- tycho-packaging-plugin:1.5.0:build-qualifier (default-build-qualifier) @ org.eclipse.ease.ui.scripts.test ---
20:33:17 [2020-09-26T00:33:17.851Z] [INFO] The project's OSGi version is 0.8.0.I202009240747
20:33:17 [2020-09-26T00:33:17.851Z] [INFO] 
20:33:17 [2020-09-26T00:33:17.851Z] [INFO] --- tycho-packaging-plugin:1.5.0:validate-id (default-validate-id) @ org.eclipse.ease.ui.scripts.test ---
20:33:17 [2020-09-26T00:33:17.851Z] [INFO] 
20:33:17 [2020-09-26T00:33:17.851Z] [INFO] --- tycho-packaging-plugin:1.5.0:validate-version (default-validate-version) @ org.eclipse.ease.ui.scripts.test ---
20:33:17 [2020-09-26T00:33:17.851Z] [INFO] 
20:33:17 [2020-09-26T00:33:17.851Z] [INFO] <<< maven-javadoc-plugin:2.9.1:javadoc (build-docs) < generate-sources @ org.eclipse.ease.ui.scripts.test <<<
20:33:17 [2020-09-26T00:33:17.851Z] [INFO] 
20:33:17 [2020-09-26T00:33:17.851Z] [INFO] 
20:33:17 [2020-09-26T00:33:17.851Z] [INFO] --- maven-javadoc-plugin:2.9.1:javadoc (build-docs) @ org.eclipse.ease.ui.scripts.test ---
20:33:17 [2020-09-26T00:33:17.851Z] [ERROR] Error fetching link: http://help.eclipse.org/oxygen/topic/org.eclipse.platform.doc.isv/reference/api/package-list. Ignored it.
20:33:18 [2020-09-26T00:33:18.107Z] [ERROR] Error fetching link: https://ci.eclipse.org/ease/job/ease.build.core/JavaDoc/package-list. Ignored it.
20:33:19 [2020-09-26T00:33:19.034Z] [INFO] 
20:33:19 [2020-09-26T00:33:19.034Z] Loading source files for package org.eclipse.ease.ui.scripts.expressions.definitions...
20:33:19 [2020-09-26T00:33:19.034Z] Constructing Javadoc information...
20:33:19 [2020-09-26T00:33:19.034Z] WARNING: Cannot open location "/home/jenkins/agent/workspace/ease.verify.core.target.2020-03/tests/org.eclipse.ease.ui.scripts.test/target/javadoc-bundle-options/package-list"
20:33:19 [2020-09-26T00:33:19.034Z] No plugin definition found, skipping
20:33:19 [2020-09-26T00:33:19.034Z] No plugin definition found, skipping
20:33:19 [2020-09-26T00:33:19.034Z] [WARNING] Javadoc Warnings
20:33:19 [2020-09-26T00:33:19.034Z] [WARNING] Picked up JAVA_TOOL_OPTIONS: -Dmaven.ext.class.path="/home/jenkins/agent/workspace/ease.verify.core.target.2020-03@tmp/withMaven9dd1d443/pipeline-maven-spy.jar" -Dorg.jenkinsci.plugins.pipeline.maven.reportsFolder="/home/jenkins/agent/workspace/ease.verify.core.target.2020-03@tmp/withMaven9dd1d443"
20:33:19 [2020-09-26T00:33:19.034Z] [WARNING] javadoc: warning - The old Doclet and Taglet APIs in the packages
20:33:19 [2020-09-26T00:33:19.034Z] [WARNING] com.sun.javadoc, com.sun.tools.doclets and their implementations
20:33:19 [2020-09-26T00:33:19.034Z] [WARNING] are planned to be removed in a future JDK release. These
20:33:19 [2020-09-26T00:33:19.034Z] [WARNING] components have been superseded by the new APIs in jdk.javadoc.doclet.
20:33:19 [2020-09-26T00:33:19.034Z] [WARNING] Users are strongly recommended to migrate to the new APIs.
20:33:19 [2020-09-26T00:33:19.034Z] [INFO] 
20:33:19 [2020-09-26T00:33:19.034Z] [INFO] --- build-helper-maven-plugin:1.9.1:add-resource (add_help) @ org.eclipse.ease.ui.scripts.test ---
20:33:19 [2020-09-26T00:33:19.034Z] [INFO] 
20:33:19 [2020-09-26T00:33:19.034Z] [INFO] --- maven-resources-plugin:2.4.3:resources (default-resources) @ org.eclipse.ease.ui.scripts.test ---
20:33:19 [2020-09-26T00:33:19.034Z] [INFO] Using 'UTF-8' encoding to copy filtered resources.
20:33:19 [2020-09-26T00:33:19.034Z] [INFO] skip non existing resourceDirectory /home/jenkins/agent/workspace/ease.verify.core.target.2020-03/tests/org.eclipse.ease.ui.scripts.test/src/main/resources
20:33:19 [2020-09-26T00:33:19.034Z] [INFO] skip non existing resourceDirectory /home/jenkins/agent/workspace/ease.verify.core.target.2020-03/tests/org.eclipse.ease.ui.scripts.test/help
20:33:19 [2020-09-26T00:33:19.034Z] [INFO] 
20:33:19 [2020-09-26T00:33:19.034Z] [INFO] --- tycho-compiler-plugin:1.5.0:compile (default-compile) @ org.eclipse.ease.ui.scripts.test ---
20:33:19 [2020-09-26T00:33:19.034Z] [INFO] Compiling 1 source file to /home/jenkins/agent/workspace/ease.verify.core.target.2020-03/tests/org.eclipse.ease.ui.scripts.test/target/classes
20:33:19 [2020-09-26T00:33:19.034Z] [INFO] 
20:33:19 [2020-09-26T00:33:19.034Z] [INFO] --- maven-resources-plugin:2.4.3:testResources (default-testResources) @ org.eclipse.ease.ui.scripts.test ---
20:33:19 [2020-09-26T00:33:19.034Z] [INFO] Using 'UTF-8' encoding to copy filtered resources.
20:33:19 [2020-09-26T00:33:19.034Z] [INFO] skip non existing resourceDirectory /home/jenkins/agent/workspace/ease.verify.core.target.2020-03/tests/org.eclipse.ease.ui.scripts.test/src/test/resources
20:33:19 [2020-09-26T00:33:19.034Z] [INFO] 
20:33:19 [2020-09-26T00:33:19.034Z] [INFO] --- tycho-source-plugin:1.5.0:plugin-source (plugin-source) @ org.eclipse.ease.ui.scripts.test ---
20:33:19 [2020-09-26T00:33:19.034Z] [INFO] Building jar: /home/jenkins/agent/workspace/ease.verify.core.target.2020-03/tests/org.eclipse.ease.ui.scripts.test/target/org.eclipse.ease.ui.scripts.test-0.8.0-SNAPSHOT-sources.jar
20:33:19 [2020-09-26T00:33:19.034Z] [INFO] 
20:33:19 [2020-09-26T00:33:19.034Z] [INFO] --- target-platform-configuration:1.5.0:target-platform (default-target-platform) @ org.eclipse.ease.ui.scripts.test ---
20:33:19 [2020-09-26T00:33:19.034Z] [INFO] 
20:33:19 [2020-09-26T00:33:19.034Z] [INFO] --- tycho-packaging-plugin:1.5.0:package-plugin (default-package-plugin) @ org.eclipse.ease.ui.scripts.test ---
20:33:19 [2020-09-26T00:33:19.034Z] [INFO] Building jar: /home/jenkins/agent/workspace/ease.verify.core.target.2020-03/tests/org.eclipse.ease.ui.scripts.test/target/org.eclipse.ease.ui.scripts.test-0.8.0-SNAPSHOT.jar
20:33:19 [2020-09-26T00:33:19.034Z] [INFO] 
20:33:19 [2020-09-26T00:33:19.034Z] [INFO] --- tycho-p2-plugin:1.5.0:p2-metadata-default (default-p2-metadata-default) @ org.eclipse.ease.ui.scripts.test ---
20:33:19 [2020-09-26T00:33:19.034Z] [INFO] 
20:33:19 [2020-09-26T00:33:19.034Z] [INFO] --- tycho-source-feature-plugin:1.5.0:source-feature (source-feature) @ org.eclipse.ease.ui.scripts.test ---
20:33:19 [2020-09-26T00:33:19.034Z] [INFO] 
20:33:19 [2020-09-26T00:33:19.034Z] [INFO] --- tycho-p2-plugin:1.5.0:p2-metadata (attached-p2-metadata) @ org.eclipse.ease.ui.scripts.test ---
20:33:19 [2020-09-26T00:33:19.034Z] [INFO] 
20:33:19 [2020-09-26T00:33:19.034Z] [INFO] --- tycho-surefire-plugin:1.5.0:test (default-test) @ org.eclipse.ease.ui.scripts.test ---
20:33:19 [2020-09-26T00:33:19.035Z] [INFO] Expected eclipse log file: /home/jenkins/agent/workspace/ease.verify.core.target.2020-03/tests/org.eclipse.ease.ui.scripts.test/target/work/data/.metadata/.log
20:33:19 [2020-09-26T00:33:19.035Z] [INFO] Command line:
20:33:19 [2020-09-26T00:33:19.035Z] 	[/opt/tools/java/openjdk/jdk-11/11.0.2+9/bin/java, -Dosgi.noShutdown=false, -Dosgi.os=linux, -Dosgi.ws=gtk, -Dosgi.arch=x86_64, -Dosgi.clean=true, -jar, /home/jenkins/.m2/repository/p2/osgi/bundle/org.eclipse.equinox.launcher/1.5.800.v20200727-1323/org.eclipse.equinox.launcher-1.5.800.v20200727-1323.jar, -data, /home/jenkins/agent/workspace/ease.verify.core.target.2020-03/tests/org.eclipse.ease.ui.scripts.test/target/work/data, -install, /home/jenkins/agent/workspace/ease.verify.core.target.2020-03/tests/org.eclipse.ease.ui.scripts.test/target/work, -configuration, /home/jenkins/agent/workspace/ease.verify.core.target.2020-03/tests/org.eclipse.ease.ui.scripts.test/target/work/configuration, -application, org.eclipse.tycho.surefire.osgibooter.headlesstest, -testproperties, /home/jenkins/agent/workspace/ease.verify.core.target.2020-03/tests/org.eclipse.ease.ui.scripts.test/target/surefire.properties]
20:33:19 [2020-09-26T00:33:19.035Z] Picked up JAVA_TOOL_OPTIONS: -Dmaven.ext.class.path="/home/jenkins/agent/workspace/ease.verify.core.target.2020-03@tmp/withMaven9dd1d443/pipeline-maven-spy.jar" -Dorg.jenkinsci.plugins.pipeline.maven.reportsFolder="/home/jenkins/agent/workspace/ease.verify.core.target.2020-03@tmp/withMaven9dd1d443" 
20:33:20 [2020-09-26T00:33:20.964Z] Running org.eclipse.ease.ui.scripts.expressions.definitions.ExpressionFactoryTest
20:33:20 [2020-09-26T00:33:20.964Z] Tests run: 14, Failures: 0, Errors: 0, Skipped: 0, Time elapsed: 0.022 s - in org.eclipse.ease.ui.scripts.expressions.definitions.ExpressionFactoryTest
20:33:20 [2020-09-26T00:33:20.964Z] loadClassWithExpression  Time elapsed: 0.007 s
20:33:20 [2020-09-26T00:33:20.964Z] createWithExpression  Time elapsed: 0 s
20:33:20 [2020-09-26T00:33:20.964Z] createReferenceExpression  Time elapsed: 0.001 s
20:33:20 [2020-09-26T00:33:20.964Z] loadClassReferenceExpression  Time elapsed: 0.001 s
20:33:20 [2020-09-26T00:33:20.964Z] loadClassTestExpression  Time elapsed: 0.001 s
20:33:20 [2020-09-26T00:33:20.964Z] createEqualsExpression  Time elapsed: 0 s
20:33:20 [2020-09-26T00:33:20.964Z] loadClassCountExpression  Time elapsed: 0 s
20:33:20 [2020-09-26T00:33:20.964Z] loadClassOrExpression  Time elapsed: 0.001 s
20:33:20 [2020-09-26T00:33:20.964Z] createTestExpression  Time elapsed: 0.002 s
20:33:20 [2020-09-26T00:33:20.964Z] createOrExpression  Time elapsed: 0 s
20:33:20 [2020-09-26T00:33:20.964Z] loadClassAndExpression  Time elapsed: 0 s
20:33:20 [2020-09-26T00:33:20.964Z] createAndExpression  Time elapsed: 0.001 s
20:33:20 [2020-09-26T00:33:20.964Z] loadClassEqualsExpression  Time elapsed: 0 s
20:33:20 [2020-09-26T00:33:20.964Z] createCountExpression  Time elapsed: 0.001 s
20:33:20 [2020-09-26T00:33:20.964Z] 
20:33:20 [2020-09-26T00:33:20.964Z] Results:
20:33:20 [2020-09-26T00:33:20.964Z] 
20:33:20 [2020-09-26T00:33:20.964Z] Tests run: 14, Failures: 0, Errors: 0, Skipped: 0
20:33:20 [2020-09-26T00:33:20.964Z] 
20:33:21 [2020-09-26T00:33:21.525Z] [INFO] All tests passed!
20:33:21 [2020-09-26T00:33:21.525Z] [INFO] 
20:33:21 [2020-09-26T00:33:21.525Z] [INFO] --- maven-install-plugin:2.3.1:install (default-install) @ org.eclipse.ease.ui.scripts.test ---
20:33:21 [2020-09-26T00:33:21.525Z] [INFO] Installing /home/jenkins/agent/workspace/ease.verify.core.target.2020-03/tests/org.eclipse.ease.ui.scripts.test/target/org.eclipse.ease.ui.scripts.test-0.8.0-SNAPSHOT.jar to /home/jenkins/.m2/repository/org/eclipse/ease/org.eclipse.ease.ui.scripts.test/0.8.0-SNAPSHOT/org.eclipse.ease.ui.scripts.test-0.8.0-SNAPSHOT.jar
20:33:21 [2020-09-26T00:33:21.525Z] [INFO] Installing /home/jenkins/agent/workspace/ease.verify.core.target.2020-03/tests/org.eclipse.ease.ui.scripts.test/pom.xml to /home/jenkins/.m2/repository/org/eclipse/ease/org.eclipse.ease.ui.scripts.test/0.8.0-SNAPSHOT/org.eclipse.ease.ui.scripts.test-0.8.0-SNAPSHOT.pom
20:33:21 [2020-09-26T00:33:21.526Z] [INFO] Installing /home/jenkins/agent/workspace/ease.verify.core.target.2020-03/tests/org.eclipse.ease.ui.scripts.test/target/org.eclipse.ease.ui.scripts.test-0.8.0-SNAPSHOT-sources.jar to /home/jenkins/.m2/repository/org/eclipse/ease/org.eclipse.ease.ui.scripts.test/0.8.0-SNAPSHOT/org.eclipse.ease.ui.scripts.test-0.8.0-SNAPSHOT-sources.jar
20:33:21 [2020-09-26T00:33:21.526Z] [INFO] Installing /home/jenkins/agent/workspace/ease.verify.core.target.2020-03/tests/org.eclipse.ease.ui.scripts.test/target/p2content.xml to /home/jenkins/.m2/repository/org/eclipse/ease/org.eclipse.ease.ui.scripts.test/0.8.0-SNAPSHOT/org.eclipse.ease.ui.scripts.test-0.8.0-SNAPSHOT-p2metadata.xml
20:33:21 [2020-09-26T00:33:21.526Z] [INFO] Installing /home/jenkins/agent/workspace/ease.verify.core.target.2020-03/tests/org.eclipse.ease.ui.scripts.test/target/p2artifacts.xml to /home/jenkins/.m2/repository/org/eclipse/ease/org.eclipse.ease.ui.scripts.test/0.8.0-SNAPSHOT/org.eclipse.ease.ui.scripts.test-0.8.0-SNAPSHOT-p2artifacts.xml
20:33:21 [2020-09-26T00:33:21.526Z] [INFO] Installing /home/jenkins/agent/workspace/ease.verify.core.target.2020-03/tests/org.eclipse.ease.ui.scripts.test/target/p2content.xml to /home/jenkins/.m2/repository/org/eclipse/ease/org.eclipse.ease.ui.scripts.test/0.8.0-SNAPSHOT/org.eclipse.ease.ui.scripts.test-0.8.0-SNAPSHOT-p2metadata.xml
20:33:21 [2020-09-26T00:33:21.526Z] [INFO] Installing /home/jenkins/agent/workspace/ease.verify.core.target.2020-03/tests/org.eclipse.ease.ui.scripts.test/target/p2artifacts.xml to /home/jenkins/.m2/repository/org/eclipse/ease/org.eclipse.ease.ui.scripts.test/0.8.0-SNAPSHOT/org.eclipse.ease.ui.scripts.test-0.8.0-SNAPSHOT-p2artifacts.xml
20:33:21 [2020-09-26T00:33:21.526Z] [INFO] 
20:33:21 [2020-09-26T00:33:21.526Z] [INFO] --- tycho-p2-plugin:1.5.0:update-local-index (default-update-local-index) @ org.eclipse.ease.ui.scripts.test ---
20:33:21 [2020-09-26T00:33:21.526Z] [INFO] 
20:33:21 [2020-09-26T00:33:21.526Z] [INFO] -------------< org.eclipse.ease:org.eclipse.ease.ui.test >--------------
20:33:21 [2020-09-26T00:33:21.526Z] [INFO] Building org.eclipse.ease.ui.test 0.8.0-SNAPSHOT                 [47/48]
20:33:21 [2020-09-26T00:33:21.526Z] [INFO] ------------------------[ eclipse-test-plugin ]-------------------------
20:33:21 [2020-09-26T00:33:21.526Z] [INFO] 
20:33:21 [2020-09-26T00:33:21.526Z] [INFO] --- maven-clean-plugin:2.5:clean (default-clean) @ org.eclipse.ease.ui.test ---
20:33:21 [2020-09-26T00:33:21.526Z] [INFO] 
20:33:21 [2020-09-26T00:33:21.526Z] [INFO] --- tycho-packaging-plugin:1.5.0:build-qualifier (default-build-qualifier) @ org.eclipse.ease.ui.test ---
20:33:21 [2020-09-26T00:33:21.526Z] [INFO] The project's OSGi version is 0.8.0.I201910171213
20:33:21 [2020-09-26T00:33:21.526Z] [INFO] 
20:33:21 [2020-09-26T00:33:21.526Z] [INFO] --- tycho-packaging-plugin:1.5.0:validate-id (default-validate-id) @ org.eclipse.ease.ui.test ---
20:33:21 [2020-09-26T00:33:21.526Z] [INFO] 
20:33:21 [2020-09-26T00:33:21.526Z] [INFO] --- tycho-packaging-plugin:1.5.0:validate-version (default-validate-version) @ org.eclipse.ease.ui.test ---
20:33:21 [2020-09-26T00:33:21.526Z] [INFO] 
20:33:21 [2020-09-26T00:33:21.526Z] [INFO] >>> maven-javadoc-plugin:2.9.1:javadoc (build-docs) > generate-sources @ org.eclipse.ease.ui.test >>>
20:33:21 [2020-09-26T00:33:21.526Z] [INFO] 
20:33:21 [2020-09-26T00:33:21.526Z] [INFO] --- tycho-packaging-plugin:1.5.0:build-qualifier (default-build-qualifier) @ org.eclipse.ease.ui.test ---
20:33:21 [2020-09-26T00:33:21.526Z] [INFO] The project's OSGi version is 0.8.0.I201910171213
20:33:21 [2020-09-26T00:33:21.526Z] [INFO] 
20:33:21 [2020-09-26T00:33:21.526Z] [INFO] --- tycho-packaging-plugin:1.5.0:validate-id (default-validate-id) @ org.eclipse.ease.ui.test ---
20:33:21 [2020-09-26T00:33:21.526Z] [INFO] 
20:33:21 [2020-09-26T00:33:21.526Z] [INFO] --- tycho-packaging-plugin:1.5.0:validate-version (default-validate-version) @ org.eclipse.ease.ui.test ---
20:33:21 [2020-09-26T00:33:21.526Z] [INFO] 
20:33:21 [2020-09-26T00:33:21.526Z] [INFO] <<< maven-javadoc-plugin:2.9.1:javadoc (build-docs) < generate-sources @ org.eclipse.ease.ui.test <<<
20:33:21 [2020-09-26T00:33:21.526Z] [INFO] 
20:33:21 [2020-09-26T00:33:21.526Z] [INFO] 
20:33:21 [2020-09-26T00:33:21.526Z] [INFO] --- maven-javadoc-plugin:2.9.1:javadoc (build-docs) @ org.eclipse.ease.ui.test ---
20:33:21 [2020-09-26T00:33:21.781Z] [ERROR] Error fetching link: http://help.eclipse.org/oxygen/topic/org.eclipse.platform.doc.isv/reference/api/package-list. Ignored it.
20:33:21 [2020-09-26T00:33:21.782Z] [ERROR] Error fetching link: https://ci.eclipse.org/ease/job/ease.build.core/JavaDoc/package-list. Ignored it.
20:33:23 [2020-09-26T00:33:23.145Z] [INFO] 
20:33:23 [2020-09-26T00:33:23.145Z] Loading source files for package org.eclipse.ease.ui.completion...
20:33:23 [2020-09-26T00:33:23.145Z] Loading source files for package org.eclipse.ease.ui.completion.provider...
20:33:23 [2020-09-26T00:33:23.145Z] Loading source files for package org.eclipse.ease.ui.completions.java.provider...
20:33:23 [2020-09-26T00:33:23.145Z] Loading source files for package org.eclipse.ease.ui.help.hovers...
20:33:23 [2020-09-26T00:33:23.145Z] Constructing Javadoc information...
20:33:23 [2020-09-26T00:33:23.145Z] WARNING: Cannot open location "/home/jenkins/agent/workspace/ease.verify.core.target.2020-03/tests/org.eclipse.ease.ui.test/target/javadoc-bundle-options/package-list"
20:33:23 [2020-09-26T00:33:23.145Z] [WARNING] Javadoc Warnings
20:33:23 [2020-09-26T00:33:23.145Z] [WARNING] Picked up JAVA_TOOL_OPTIONS: -Dmaven.ext.class.path="/home/jenkins/agent/workspace/ease.verify.core.target.2020-03@tmp/withMaven9dd1d443/pipeline-maven-spy.jar" -Dorg.jenkinsci.plugins.pipeline.maven.reportsFolder="/home/jenkins/agent/workspace/ease.verify.core.target.2020-03@tmp/withMaven9dd1d443"
20:33:23 [2020-09-26T00:33:23.145Z] [WARNING] javadoc: warning - The old Doclet and Taglet APIs in the packages
20:33:23 [2020-09-26T00:33:23.145Z] [WARNING] com.sun.javadoc, com.sun.tools.doclets and their implementations
20:33:23 [2020-09-26T00:33:23.145Z] [WARNING] are planned to be removed in a future JDK release. These
20:33:23 [2020-09-26T00:33:23.145Z] [WARNING] components have been superseded by the new APIs in jdk.javadoc.doclet.
20:33:23 [2020-09-26T00:33:23.145Z] [WARNING] Users are strongly recommended to migrate to the new APIs.
20:33:23 [2020-09-26T00:33:23.145Z] [INFO] 
20:33:23 [2020-09-26T00:33:23.145Z] [INFO] --- build-helper-maven-plugin:1.9.1:add-resource (add_help) @ org.eclipse.ease.ui.test ---
20:33:23 [2020-09-26T00:33:23.145Z] [INFO] 
20:33:23 [2020-09-26T00:33:23.145Z] [INFO] --- maven-resources-plugin:2.4.3:resources (default-resources) @ org.eclipse.ease.ui.test ---
20:33:23 [2020-09-26T00:33:23.145Z] [INFO] Using 'UTF-8' encoding to copy filtered resources.
20:33:23 [2020-09-26T00:33:23.145Z] [INFO] skip non existing resourceDirectory /home/jenkins/agent/workspace/ease.verify.core.target.2020-03/tests/org.eclipse.ease.ui.test/src/main/resources
20:33:23 [2020-09-26T00:33:23.145Z] [INFO] Copying 2 resources to help
20:33:23 [2020-09-26T00:33:23.145Z] [INFO] 
20:33:23 [2020-09-26T00:33:23.145Z] [INFO] --- tycho-compiler-plugin:1.5.0:compile (default-compile) @ org.eclipse.ease.ui.test ---
20:33:23 [2020-09-26T00:33:23.145Z] [INFO] Compiling 6 source files to /home/jenkins/agent/workspace/ease.verify.core.target.2020-03/tests/org.eclipse.ease.ui.test/target/classes
20:33:23 [2020-09-26T00:33:23.145Z] [INFO] 
20:33:23 [2020-09-26T00:33:23.145Z] [INFO] --- maven-resources-plugin:2.4.3:testResources (default-testResources) @ org.eclipse.ease.ui.test ---
20:33:23 [2020-09-26T00:33:23.145Z] [INFO] Using 'UTF-8' encoding to copy filtered resources.
20:33:23 [2020-09-26T00:33:23.145Z] [INFO] skip non existing resourceDirectory /home/jenkins/agent/workspace/ease.verify.core.target.2020-03/tests/org.eclipse.ease.ui.test/src/test/resources
20:33:23 [2020-09-26T00:33:23.145Z] [INFO] 
20:33:23 [2020-09-26T00:33:23.145Z] [INFO] --- tycho-source-plugin:1.5.0:plugin-source (plugin-source) @ org.eclipse.ease.ui.test ---
20:33:23 [2020-09-26T00:33:23.145Z] [WARNING] Bundle-Vendor header not found in /home/jenkins/agent/workspace/ease.verify.core.target.2020-03/tests/org.eclipse.ease.ui.test/META-INF/MANIFEST.MF, fallback to 'unknown' for source bundle
20:33:23 [2020-09-26T00:33:23.145Z] [INFO] Building jar: /home/jenkins/agent/workspace/ease.verify.core.target.2020-03/tests/org.eclipse.ease.ui.test/target/org.eclipse.ease.ui.test-0.8.0-SNAPSHOT-sources.jar
20:33:23 [2020-09-26T00:33:23.145Z] [INFO] 
20:33:23 [2020-09-26T00:33:23.145Z] [INFO] --- target-platform-configuration:1.5.0:target-platform (default-target-platform) @ org.eclipse.ease.ui.test ---
20:33:23 [2020-09-26T00:33:23.145Z] [INFO] 
20:33:23 [2020-09-26T00:33:23.145Z] [INFO] --- tycho-packaging-plugin:1.5.0:package-plugin (default-package-plugin) @ org.eclipse.ease.ui.test ---
20:33:23 [2020-09-26T00:33:23.145Z] [INFO] Building jar: /home/jenkins/agent/workspace/ease.verify.core.target.2020-03/tests/org.eclipse.ease.ui.test/target/org.eclipse.ease.ui.test-0.8.0-SNAPSHOT.jar
20:33:23 [2020-09-26T00:33:23.145Z] [INFO] 
20:33:23 [2020-09-26T00:33:23.145Z] [INFO] --- tycho-p2-plugin:1.5.0:p2-metadata-default (default-p2-metadata-default) @ org.eclipse.ease.ui.test ---
20:33:23 [2020-09-26T00:33:23.145Z] [INFO] 
20:33:23 [2020-09-26T00:33:23.145Z] [INFO] --- tycho-source-feature-plugin:1.5.0:source-feature (source-feature) @ org.eclipse.ease.ui.test ---
20:33:23 [2020-09-26T00:33:23.145Z] [INFO] 
20:33:23 [2020-09-26T00:33:23.145Z] [INFO] --- tycho-p2-plugin:1.5.0:p2-metadata (attached-p2-metadata) @ org.eclipse.ease.ui.test ---
20:33:23 [2020-09-26T00:33:23.145Z] [INFO] 
20:33:23 [2020-09-26T00:33:23.146Z] [INFO] --- tycho-surefire-plugin:1.5.0:test (default-test) @ org.eclipse.ease.ui.test ---
20:33:23 [2020-09-26T00:33:23.146Z] [INFO] Expected eclipse log file: /home/jenkins/agent/workspace/ease.verify.core.target.2020-03/tests/org.eclipse.ease.ui.test/target/work/data/.metadata/.log
20:33:23 [2020-09-26T00:33:23.146Z] [INFO] Command line:
20:33:23 [2020-09-26T00:33:23.146Z] 	[/opt/tools/java/openjdk/jdk-11/11.0.2+9/bin/java, -Dosgi.noShutdown=false, -Dosgi.os=linux, -Dosgi.ws=gtk, -Dosgi.arch=x86_64, -Dosgi.clean=true, -jar, /home/jenkins/.m2/repository/p2/osgi/bundle/org.eclipse.equinox.launcher/1.5.800.v20200727-1323/org.eclipse.equinox.launcher-1.5.800.v20200727-1323.jar, -data, /home/jenkins/agent/workspace/ease.verify.core.target.2020-03/tests/org.eclipse.ease.ui.test/target/work/data, -install, /home/jenkins/agent/workspace/ease.verify.core.target.2020-03/tests/org.eclipse.ease.ui.test/target/work, -configuration, /home/jenkins/agent/workspace/ease.verify.core.target.2020-03/tests/org.eclipse.ease.ui.test/target/work/configuration, -application, org.eclipse.tycho.surefire.osgibooter.headlesstest, -testproperties, /home/jenkins/agent/workspace/ease.verify.core.target.2020-03/tests/org.eclipse.ease.ui.test/target/surefire.properties]
20:33:23 [2020-09-26T00:33:23.146Z] Picked up JAVA_TOOL_OPTIONS: -Dmaven.ext.class.path="/home/jenkins/agent/workspace/ease.verify.core.target.2020-03@tmp/withMaven9dd1d443/pipeline-maven-spy.jar" -Dorg.jenkinsci.plugins.pipeline.maven.reportsFolder="/home/jenkins/agent/workspace/ease.verify.core.target.2020-03@tmp/withMaven9dd1d443" 
20:33:25 [2020-09-26T00:33:25.066Z] Running org.eclipse.ease.ui.completions.java.provider.JavaPackagesCompletionsProviderTest
20:33:25 [2020-09-26T00:33:25.066Z] WARNING: An illegal reflective access operation has occurred
20:33:25 [2020-09-26T00:33:25.066Z] WARNING: Illegal reflective access by org.mockito.cglib.core.ReflectUtils$2 (file:/home/jenkins/.m2/repository/p2/osgi/bundle/org.mockito/1.9.5.v201605172210/org.mockito-1.9.5.v201605172210.jar) to method java.lang.ClassLoader.defineClass(java.lang.String,byte[],int,int,java.security.ProtectionDomain)
20:33:25 [2020-09-26T00:33:25.066Z] WARNING: Please consider reporting this to the maintainers of org.mockito.cglib.core.ReflectUtils$2
20:33:25 [2020-09-26T00:33:25.066Z] WARNING: Use --illegal-access=warn to enable warnings of further illegal reflective access operations
20:33:25 [2020-09-26T00:33:25.066Z] WARNING: All illegal access operations will be denied in a future release
20:33:31 [2020-09-26T00:33:31.614Z] Tests run: 4, Failures: 0, Errors: 0, Skipped: 0, Time elapsed: 5.994 s - in org.eclipse.ease.ui.completions.java.provider.JavaPackagesCompletionsProviderTest
20:33:31 [2020-09-26T00:33:31.614Z] containsJavaLangPackageProposal(org.eclipse.ease.ui.completions.java.provider.JavaPackagesCompletionsProviderTest)  Time elapsed: 0.482 s
20:33:31 [2020-09-26T00:33:31.614Z] containsOrgRootPackageProposal(org.eclipse.ease.ui.completions.java.provider.JavaPackagesCompletionsProviderTest)  Time elapsed: 0.008 s
20:33:31 [2020-09-26T00:33:31.614Z] containsJavaRootPackageProposal(org.eclipse.ease.ui.completions.java.provider.JavaPackagesCompletionsProviderTest)  Time elapsed: 0.007 s
20:33:31 [2020-09-26T00:33:31.614Z] containsOrgEclipsePackageProposal(org.eclipse.ease.ui.completions.java.provider.JavaPackagesCompletionsProviderTest)  Time elapsed: 0.071 s
20:33:31 [2020-09-26T00:33:31.614Z] Running org.eclipse.ease.ui.completions.java.provider.JavaClassCompletionsProviderTest
20:33:36 [2020-09-26T00:33:36.859Z] Tests run: 6, Failures: 0, Errors: 0, Skipped: 0, Time elapsed: 5.162 s - in org.eclipse.ease.ui.completions.java.provider.JavaClassCompletionsProviderTest
20:33:36 [2020-09-26T00:33:36.859Z] containsPackageFileCompletion(org.eclipse.ease.ui.completions.java.provider.JavaClassCompletionsProviderTest)  Time elapsed: 0.007 s
20:33:36 [2020-09-26T00:33:36.859Z] containsGlobalFileCompletion(org.eclipse.ease.ui.completions.java.provider.JavaClassCompletionsProviderTest)  Time elapsed: 0.039 s
20:33:36 [2020-09-26T00:33:36.859Z] containsJavaLangPackageProposal(org.eclipse.ease.ui.completions.java.provider.JavaClassCompletionsProviderTest)  Time elapsed: 0.048 s
20:33:36 [2020-09-26T00:33:36.859Z] containsOrgRootPackageProposal(org.eclipse.ease.ui.completions.java.provider.JavaClassCompletionsProviderTest)  Time elapsed: 0.005 s
20:33:36 [2020-09-26T00:33:36.859Z] containsJavaRootPackageProposal(org.eclipse.ease.ui.completions.java.provider.JavaClassCompletionsProviderTest)  Time elapsed: 0.005 s
20:33:36 [2020-09-26T00:33:36.859Z] containsOrgEclipsePackageProposal(org.eclipse.ease.ui.completions.java.provider.JavaClassCompletionsProviderTest)  Time elapsed: 0.051 s
20:33:36 [2020-09-26T00:33:36.859Z] Running org.eclipse.ease.ui.completion.provider.AbstractFileLocationCompletionProviderTest
20:33:36 [2020-09-26T00:33:36.859Z] Tests run: 8, Failures: 0, Errors: 0, Skipped: 8, Time elapsed: 0.003 s - in org.eclipse.ease.ui.completion.provider.AbstractFileLocationCompletionProviderTest
20:33:36 [2020-09-26T00:33:36.859Z] workspaceProjectProposals(org.eclipse.ease.ui.completion.provider.AbstractFileLocationCompletionProviderTest) skipped
20:33:36 [2020-09-26T00:33:36.859Z] checkOperatingSystem(org.eclipse.ease.ui.completion.provider.AbstractFileLocationCompletionProviderTest) skipped
20:33:36 [2020-09-26T00:33:36.859Z] absoluteRootWorkspaceProposals(org.eclipse.ease.ui.completion.provider.AbstractFileLocationCompletionProviderTest) skipped
20:33:36 [2020-09-26T00:33:36.859Z] workspaceFolderProposals(org.eclipse.ease.ui.completion.provider.AbstractFileLocationCompletionProviderTest) skipped
20:33:36 [2020-09-26T00:33:36.859Z] fileSystemFolderProposals(org.eclipse.ease.ui.completion.provider.AbstractFileLocationCompletionProviderTest) skipped
20:33:36 [2020-09-26T00:33:36.859Z] workspaceProposals(org.eclipse.ease.ui.completion.provider.AbstractFileLocationCompletionProviderTest) skipped
20:33:36 [2020-09-26T00:33:36.859Z] relativeRootWorkspaceProposals(org.eclipse.ease.ui.completion.provider.AbstractFileLocationCompletionProviderTest) skipped
20:33:36 [2020-09-26T00:33:36.859Z] fileSystemRootProposals(org.eclipse.ease.ui.completion.provider.AbstractFileLocationCompletionProviderTest) skipped
20:33:36 [2020-09-26T00:33:36.859Z] Running org.eclipse.ease.ui.completion.CompletionContextTest
20:33:36 [2020-09-26T00:33:36.859Z] Tests run: 9, Failures: 0, Errors: 0, Skipped: 0, Time elapsed: 0.004 s - in org.eclipse.ease.ui.completion.CompletionContextTest
20:33:36 [2020-09-26T00:33:36.859Z] resolveStaticClass(org.eclipse.ease.ui.completion.CompletionContextTest)  Time elapsed: 0.001 s
20:33:36 [2020-09-26T00:33:36.859Z] resolveClassWithFilter(org.eclipse.ease.ui.completion.CompletionContextTest)  Time elapsed: 0 s
20:33:36 [2020-09-26T00:33:36.859Z] simplifyCalls(org.eclipse.ease.ui.completion.CompletionContextTest)  Time elapsed: 0 s
20:33:36 [2020-09-26T00:33:36.859Z] resolveClass(org.eclipse.ease.ui.completion.CompletionContextTest)  Time elapsed: 0 s
20:33:36 [2020-09-26T00:33:36.859Z] replaceEscapedStringLiterals(org.eclipse.ease.ui.completion.CompletionContextTest)  Time elapsed: 0 s
20:33:36 [2020-09-26T00:33:36.859Z] replaceSimpleStringLiterals(org.eclipse.ease.ui.completion.CompletionContextTest)  Time elapsed: 0 s
20:33:36 [2020-09-26T00:33:36.859Z] resolveStaticClassWithFilter(org.eclipse.ease.ui.completion.CompletionContextTest)  Time elapsed: 0 s
20:33:36 [2020-09-26T00:33:36.859Z] resolveClassWithParameters(org.eclipse.ease.ui.completion.CompletionContextTest)  Time elapsed: 0.001 s
20:33:36 [2020-09-26T00:33:36.859Z] replaceMultipleStringLiterals(org.eclipse.ease.ui.completion.CompletionContextTest)  Time elapsed: 0 s
20:33:36 [2020-09-26T00:33:36.859Z] Running org.eclipse.ease.ui.help.hovers.ModuleHelpTest
20:33:36 [2020-09-26T00:33:36.859Z] Tests run: 4, Failures: 0, Errors: 0, Skipped: 4, Time elapsed: 0.001 s - in org.eclipse.ease.ui.help.hovers.ModuleHelpTest
20:33:36 [2020-09-26T00:33:36.859Z] getModuleHelpLocation(org.eclipse.ease.ui.help.hovers.ModuleHelpTest) skipped
20:33:36 [2020-09-26T00:33:36.859Z] getModuleHelp(org.eclipse.ease.ui.help.hovers.ModuleHelpTest) skipped
20:33:36 [2020-09-26T00:33:36.859Z] getMethodHelp(org.eclipse.ease.ui.help.hovers.ModuleHelpTest) skipped
20:33:36 [2020-09-26T00:33:36.859Z] getConstantHelp(org.eclipse.ease.ui.help.hovers.ModuleHelpTest) skipped
20:33:36 [2020-09-26T00:33:36.859Z] 
20:33:36 [2020-09-26T00:33:36.859Z] Results:
20:33:36 [2020-09-26T00:33:36.859Z] 
20:33:36 [2020-09-26T00:33:36.859Z] Tests run: 31, Failures: 0, Errors: 0, Skipped: 12
20:33:36 [2020-09-26T00:33:36.859Z] 
20:33:37 [2020-09-26T00:33:37.420Z] [INFO] All tests passed!
20:33:37 [2020-09-26T00:33:37.420Z] [INFO] 
20:33:37 [2020-09-26T00:33:37.420Z] [INFO] --- maven-install-plugin:2.3.1:install (default-install) @ org.eclipse.ease.ui.test ---
20:33:37 [2020-09-26T00:33:37.420Z] [INFO] Installing /home/jenkins/agent/workspace/ease.verify.core.target.2020-03/tests/org.eclipse.ease.ui.test/target/org.eclipse.ease.ui.test-0.8.0-SNAPSHOT.jar to /home/jenkins/.m2/repository/org/eclipse/ease/org.eclipse.ease.ui.test/0.8.0-SNAPSHOT/org.eclipse.ease.ui.test-0.8.0-SNAPSHOT.jar
20:33:37 [2020-09-26T00:33:37.420Z] [INFO] Installing /home/jenkins/agent/workspace/ease.verify.core.target.2020-03/tests/org.eclipse.ease.ui.test/pom.xml to /home/jenkins/.m2/repository/org/eclipse/ease/org.eclipse.ease.ui.test/0.8.0-SNAPSHOT/org.eclipse.ease.ui.test-0.8.0-SNAPSHOT.pom
20:33:37 [2020-09-26T00:33:37.420Z] [INFO] Installing /home/jenkins/agent/workspace/ease.verify.core.target.2020-03/tests/org.eclipse.ease.ui.test/target/org.eclipse.ease.ui.test-0.8.0-SNAPSHOT-sources.jar to /home/jenkins/.m2/repository/org/eclipse/ease/org.eclipse.ease.ui.test/0.8.0-SNAPSHOT/org.eclipse.ease.ui.test-0.8.0-SNAPSHOT-sources.jar
20:33:37 [2020-09-26T00:33:37.420Z] [INFO] Installing /home/jenkins/agent/workspace/ease.verify.core.target.2020-03/tests/org.eclipse.ease.ui.test/target/p2content.xml to /home/jenkins/.m2/repository/org/eclipse/ease/org.eclipse.ease.ui.test/0.8.0-SNAPSHOT/org.eclipse.ease.ui.test-0.8.0-SNAPSHOT-p2metadata.xml
20:33:37 [2020-09-26T00:33:37.420Z] [INFO] Installing /home/jenkins/agent/workspace/ease.verify.core.target.2020-03/tests/org.eclipse.ease.ui.test/target/p2artifacts.xml to /home/jenkins/.m2/repository/org/eclipse/ease/org.eclipse.ease.ui.test/0.8.0-SNAPSHOT/org.eclipse.ease.ui.test-0.8.0-SNAPSHOT-p2artifacts.xml
20:33:37 [2020-09-26T00:33:37.420Z] [INFO] Installing /home/jenkins/agent/workspace/ease.verify.core.target.2020-03/tests/org.eclipse.ease.ui.test/target/p2content.xml to /home/jenkins/.m2/repository/org/eclipse/ease/org.eclipse.ease.ui.test/0.8.0-SNAPSHOT/org.eclipse.ease.ui.test-0.8.0-SNAPSHOT-p2metadata.xml
20:33:37 [2020-09-26T00:33:37.420Z] [INFO] Installing /home/jenkins/agent/workspace/ease.verify.core.target.2020-03/tests/org.eclipse.ease.ui.test/target/p2artifacts.xml to /home/jenkins/.m2/repository/org/eclipse/ease/org.eclipse.ease.ui.test/0.8.0-SNAPSHOT/org.eclipse.ease.ui.test-0.8.0-SNAPSHOT-p2artifacts.xml
20:33:37 [2020-09-26T00:33:37.420Z] [INFO] 
20:33:37 [2020-09-26T00:33:37.420Z] [INFO] --- tycho-p2-plugin:1.5.0:update-local-index (default-update-local-index) @ org.eclipse.ease.ui.test ---
20:33:37 [2020-09-26T00:33:37.420Z] [INFO] 
20:33:37 [2020-09-26T00:33:37.420Z] [INFO] ---------------------< org.eclipse.ease:ease.core >---------------------
20:33:37 [2020-09-26T00:33:37.420Z] [INFO] Building EASE (Incubation) 0.4.0-SNAPSHOT                        [48/48]
20:33:37 [2020-09-26T00:33:37.420Z] [INFO] --------------------------------[ pom ]---------------------------------
20:33:37 [2020-09-26T00:33:37.420Z] [INFO] 
20:33:37 [2020-09-26T00:33:37.421Z] [INFO] --- maven-clean-plugin:2.5:clean (default-clean) @ ease.core ---
20:33:37 [2020-09-26T00:33:37.676Z] [INFO] 
20:33:37 [2020-09-26T00:33:37.676Z] [INFO] --- maven-install-plugin:2.4:install (default-install) @ ease.core ---
20:33:37 [2020-09-26T00:33:37.676Z] [INFO] Installing /home/jenkins/agent/workspace/ease.verify.core.target.2020-03/pom.xml to /home/jenkins/.m2/repository/org/eclipse/ease/ease.core/0.4.0-SNAPSHOT/ease.core-0.4.0-SNAPSHOT.pom
20:33:37 [2020-09-26T00:33:37.676Z] [INFO] ------------------------------------------------------------------------
20:33:37 [2020-09-26T00:33:37.676Z] [INFO] Reactor Summary:
20:33:37 [2020-09-26T00:33:37.676Z] [INFO] 
20:33:37 [2020-09-26T00:33:37.676Z] [INFO] org.eclipse.ease.releng 0.8.0-SNAPSHOT ............. SUCCESS [ 10.486 s]
20:33:37 [2020-09-26T00:33:37.676Z] [INFO] org.eclipse.ease.classloader 0.8.0-SNAPSHOT ........ SUCCESS [  8.288 s]
20:33:37 [2020-09-26T00:33:37.676Z] [INFO] org.eclipse.ease 0.8.0-SNAPSHOT .................... SUCCESS [  2.933 s]
20:33:37 [2020-09-26T00:33:37.676Z] [INFO] org.eclipse.ease.ui 0.8.0-SNAPSHOT ................. SUCCESS [  3.187 s]
20:33:37 [2020-09-26T00:33:37.676Z] [INFO] org.eclipse.ease.ui.completions.java 0.8.0-SNAPSHOT  SUCCESS [  2.234 s]
20:33:37 [2020-09-26T00:33:37.676Z] [INFO] org.eclipse.ease.ui.scripts 0.8.0-SNAPSHOT ......... SUCCESS [  2.572 s]
20:33:37 [2020-09-26T00:33:37.676Z] [INFO] org.eclipse.ease.lang.javascript 0.8.0-SNAPSHOT .... SUCCESS [  1.704 s]
20:33:37 [2020-09-26T00:33:37.676Z] [INFO] org.eclipse.ease.lang.scriptarchive 0.8.0-SNAPSHOT . SUCCESS [  1.313 s]
20:33:37 [2020-09-26T00:33:37.676Z] [INFO] org.eclipse.ease.lang.python 0.8.0-SNAPSHOT ........ SUCCESS [  1.688 s]
20:33:37 [2020-09-26T00:33:37.676Z] [INFO] org.eclipse.ease.lang.python.py4j 0.8.0-SNAPSHOT ... SUCCESS [  1.725 s]
20:33:37 [2020-09-26T00:33:37.676Z] [INFO] org.eclipse.ease.lang.groovy 0.8.0-SNAPSHOT ........ SUCCESS [  1.346 s]
20:33:37 [2020-09-26T00:33:37.676Z] [INFO] org.eclipse.ease.lang.groovy.interpreter 0.8.0-SNAPSHOT SUCCESS [  1.443 s]
20:33:37 [2020-09-26T00:33:37.676Z] [INFO] org.eclipse.ease.lang.unittest 0.8.0-SNAPSHOT ...... SUCCESS [  2.291 s]
20:33:37 [2020-09-26T00:33:37.676Z] [INFO] org.eclipse.ease.lang.unittest.ui 0.8.0-SNAPSHOT ... SUCCESS [  2.111 s]
20:33:37 [2020-09-26T00:33:37.676Z] [INFO] org.eclipse.ease.lang.ruby 0.8.0-SNAPSHOT .......... SUCCESS [  1.381 s]
20:33:37 [2020-09-26T00:33:37.676Z] [INFO] org.eclipse.ease.lang.ruby.jruby 0.8.0-SNAPSHOT .... SUCCESS [  1.499 s]
20:33:37 [2020-09-26T00:33:37.676Z] [INFO] org.eclipse.ease.lang.javascript.nashorn 0.8.0-SNAPSHOT SUCCESS [  1.497 s]
20:33:37 [2020-09-26T00:33:37.676Z] [INFO] org.eclipse.ease.lang.javascript.rhino 0.8.0-SNAPSHOT SUCCESS [  1.820 s]
20:33:37 [2020-09-26T00:33:37.676Z] [INFO] org.eclipse.ease.lang.python.jython 0.8.0-SNAPSHOT . SUCCESS [  1.657 s]
20:33:37 [2020-09-26T00:33:37.676Z] [INFO] org.eclipse.ease.lang.javascript.ui 0.8.0-SNAPSHOT . SUCCESS [  1.529 s]
20:33:37 [2020-09-26T00:33:37.676Z] [INFO] org.eclipse.ease.lang.jvm.compiled 0.8.0-SNAPSHOT .. SUCCESS [  1.431 s]
20:33:37 [2020-09-26T00:33:37.676Z] [INFO] org.eclipse.ease.lang.scriptarchive.ui 0.8.0-SNAPSHOT SUCCESS [  1.467 s]
20:33:37 [2020-09-26T00:33:37.676Z] [INFO] org.eclipse.ease.help 0.8.0-SNAPSHOT ............... SUCCESS [  0.200 s]
20:33:37 [2020-09-26T00:33:37.676Z] [INFO] org.eclipse.ease.feature 0.8.0-SNAPSHOT ............ SUCCESS [  0.182 s]
20:33:37 [2020-09-26T00:33:37.677Z] [INFO] org.eclipse.ease.ui.feature 0.8.0-SNAPSHOT ......... SUCCESS [  0.206 s]
20:33:37 [2020-09-26T00:33:37.677Z] [INFO] org.eclipse.ease.lang.javascript.feature 0.8.0-SNAPSHOT SUCCESS [  0.105 s]
20:33:37 [2020-09-26T00:33:37.677Z] [INFO] org.eclipse.ease.lang.python.feature 0.8.0-SNAPSHOT  SUCCESS [  0.109 s]
20:33:37 [2020-09-26T00:33:37.677Z] [INFO] org.eclipse.ease.python.jython.feature 0.8.0-SNAPSHOT SUCCESS [  0.105 s]
20:33:37 [2020-09-26T00:33:37.677Z] [INFO] org.eclipse.ease.lang.python.py4j.feature 0.8.0-SNAPSHOT SUCCESS [  0.091 s]
20:33:37 [2020-09-26T00:33:37.677Z] [INFO] org.eclipse.ease.lang.jvm.feature 0.8.0-SNAPSHOT ... SUCCESS [  0.094 s]
20:33:37 [2020-09-26T00:33:37.677Z] [INFO] org.eclipse.ease.lang.groovy.feature 0.8.0-SNAPSHOT  SUCCESS [  0.124 s]
20:33:37 [2020-09-26T00:33:37.677Z] [INFO] org.eclipse.ease.lang.ruby.feature 0.8.0-SNAPSHOT .. SUCCESS [  0.093 s]
20:33:37 [2020-09-26T00:33:37.677Z] [INFO] org.eclipse.ease.lang.scriptarchive.feature 0.8.0-SNAPSHOT SUCCESS [  0.095 s]
20:33:37 [2020-09-26T00:33:37.677Z] [INFO] org.eclipse.ease.lang.unittest.feature 0.8.0-SNAPSHOT SUCCESS [  0.102 s]
20:33:37 [2020-09-26T00:33:37.677Z] [INFO] org.eclipse.ease.releng.target 0.8.0-SNAPSHOT ...... SUCCESS [  0.012 s]
20:33:37 [2020-09-26T00:33:37.677Z] [INFO] org.eclipse.ease.releng.p2 0.8.0-SNAPSHOT .......... SUCCESS [  3.310 s]
20:33:37 [2020-09-26T00:33:37.677Z] [INFO] org.eclipse.ease.testhelper 0.8.0-SNAPSHOT ......... SUCCESS [  1.475 s]
20:33:37 [2020-09-26T00:33:37.677Z] [INFO] org.eclipse.ease.test 0.8.0-SNAPSHOT ............... SUCCESS [ 14.645 s]
20:33:37 [2020-09-26T00:33:37.677Z] [INFO] org.eclipse.ease.lang.javascript.nashorn.test 0.8.0-SNAPSHOT SUCCESS [  4.455 s]
20:33:37 [2020-09-26T00:33:37.677Z] [INFO] org.eclipse.ease.lang.javascript.rhino.test 0.8.0-SNAPSHOT SUCCESS [ 16.067 s]
20:33:37 [2020-09-26T00:33:37.677Z] [INFO] org.eclipse.ease.lang.javascript.test 0.8.0-SNAPSHOT SUCCESS [  4.038 s]
20:33:37 [2020-09-26T00:33:37.677Z] [INFO] org.eclipse.ease.lang.python.test 0.8.0-SNAPSHOT ... SUCCESS [  3.634 s]
20:33:37 [2020-09-26T00:33:37.677Z] [INFO] org.eclipse.ease.lang.python.jython.test 0.8.0-SNAPSHOT SUCCESS [ 16.892 s]
20:33:37 [2020-09-26T00:33:37.677Z] [INFO] org.eclipse.ease.lang.scriptarchive.test 0.8.0-SNAPSHOT SUCCESS [  4.224 s]
20:33:37 [2020-09-26T00:33:37.677Z] [INFO] org.eclipse.ease.lang.unittest.test 0.8.0-SNAPSHOT . SUCCESS [  6.170 s]
20:33:37 [2020-09-26T00:33:37.677Z] [INFO] org.eclipse.ease.ui.scripts.test 0.8.0-SNAPSHOT .... SUCCESS [  3.811 s]
20:33:37 [2020-09-26T00:33:37.677Z] [INFO] org.eclipse.ease.ui.test 0.8.0-SNAPSHOT ............ SUCCESS [ 15.844 s]
20:33:37 [2020-09-26T00:33:37.677Z] [INFO] EASE (Incubation) 0.4.0-SNAPSHOT ................... SUCCESS [  0.197 s]
20:33:37 [2020-09-26T00:33:37.677Z] [INFO] ------------------------------------------------------------------------
20:33:37 [2020-09-26T00:33:37.677Z] [INFO] BUILD SUCCESS
20:33:37 [2020-09-26T00:33:37.677Z] [INFO] ------------------------------------------------------------------------
20:33:37 [2020-09-26T00:33:37.677Z] [INFO] Total time:  05:10 min
20:33:37 [2020-09-26T00:33:37.677Z] [INFO] Finished at: 2020-09-26T00:33:37Z
20:33:37 [2020-09-26T00:33:37.677Z] [INFO] ------------------------------------------------------------------------
20:33:37 [2020-09-26T00:33:37.677Z] [INFO] [jenkins-event-spy] Generated /home/jenkins/agent/workspace/ease.verify.core.target.2020-03@tmp/withMaven9dd1d443/maven-spy-20200926-002827-3208511846394866142760.log
[Pipeline] }
20:33:40 [2020-09-26T00:33:40.387Z] [withMaven] Publishers: Pipeline Graph Publisher: 33 ms, Invoker Publisher: 1 ms, Junit Publisher: 1 ms, Concordion Publisher: 1 ms, Dependencies Fingerprint Publisher: 1058 ms, Findbugs Publisher: 1 ms
[Pipeline] // withMaven
[Pipeline] }
[Pipeline] // stage
[Pipeline] stage
[Pipeline] { (Test)
[Pipeline] sh
20:33:40 [2020-09-26T00:33:40.682Z] + cp 'releng/org.eclipse.ease.releng.target/previous targets/2020-03.target' releng/org.eclipse.ease.releng.target/org.eclipse.ease.releng.target.target
[Pipeline] withMaven
20:33:40 [2020-09-26T00:33:40.688Z] [withMaven] Options: [org.jenkinsci.plugins.pipeline.maven.publishers.GeneratedArtifactsPublisher[disabled=true], org.jenkinsci.plugins.pipeline.maven.publishers.FindbugsAnalysisPublisher[disabled='false', healthy='', unHealthy='', thresholdLimit='low'], org.jenkinsci.plugins.pipeline.maven.publishers.TasksScannerPublisher[disabled='true', healthy='', unHealthy='', thresholdLimit='low']]
20:33:40 [2020-09-26T00:33:40.688Z] [withMaven] Available options: 
20:33:40 [2020-09-26T00:33:40.688Z] [withMaven] using JDK installation openjdk-jdk11-latest
20:33:40 [2020-09-26T00:33:40.693Z] [withMaven] using Maven installation 'apache-maven-latest'
[Pipeline] {
[Pipeline] sh
20:33:40 [2020-09-26T00:33:40.971Z] + mvn integration-test -f releng/org.eclipse.ease.releng/target-tests-pom.xml
20:33:40 [2020-09-26T00:33:40.971Z] ----- withMaven Wrapper script -----
20:33:40 [2020-09-26T00:33:40.971Z] Picked up JAVA_TOOL_OPTIONS: -Dmaven.ext.class.path="/home/jenkins/agent/workspace/ease.verify.core.target.2020-03@tmp/withMavend9e0738b/pipeline-maven-spy.jar" -Dorg.jenkinsci.plugins.pipeline.maven.reportsFolder="/home/jenkins/agent/workspace/ease.verify.core.target.2020-03@tmp/withMavend9e0738b" 
20:33:40 [2020-09-26T00:33:40.971Z] Apache Maven 3.6.3 (cecedd343002696d0abb50b32b541b8a6ba2883f)
20:33:40 [2020-09-26T00:33:40.971Z] Maven home: /opt/tools/apache-maven/latest
20:33:40 [2020-09-26T00:33:40.971Z] Java version: 11.0.2, vendor: Oracle Corporation, runtime: /opt/tools/java/openjdk/jdk-11/11.0.2+9
20:33:40 [2020-09-26T00:33:40.971Z] Default locale: en_US, platform encoding: UTF-8
20:33:40 [2020-09-26T00:33:40.971Z] OS name: "linux", version: "3.10.0-1062.el7.x86_64", arch: "amd64", family: "unix"
20:33:41 [2020-09-26T00:33:41.903Z] [INFO] [jenkins-event-spy] Generate /home/jenkins/agent/workspace/ease.verify.core.target.2020-03@tmp/withMavend9e0738b/maven-spy-20200926-003341-56415773228327616969846.log.tmp ...
20:33:41 [2020-09-26T00:33:41.903Z] [INFO] Scanning for projects...
20:33:44 [2020-09-26T00:33:44.430Z] [ERROR] Several versions of tycho plugins are configured [1.3.0, 1.5.0]:
20:33:44 [2020-09-26T00:33:44.430Z] [ERROR] 1.3.0:
20:33:44 [2020-09-26T00:33:44.430Z] [ERROR] 	MavenProject: org.eclipse.ease:org.eclipse.ease.releng:0.8.0-SNAPSHOT @ /home/jenkins/agent/workspace/ease.verify.core.target.2020-03/releng/org.eclipse.ease.releng/target-tests-pom.xml
20:33:44 [2020-09-26T00:33:44.430Z] [ERROR] 1.5.0:
20:33:44 [2020-09-26T00:33:44.430Z] [ERROR] 	MavenProject: org.eclipse.ease:org.eclipse.ease.releng.target:0.8.0-SNAPSHOT @ /home/jenkins/agent/workspace/ease.verify.core.target.2020-03/releng/org.eclipse.ease.releng.target/pom.xml
20:33:44 [2020-09-26T00:33:44.430Z] [ERROR] 	MavenProject: org.eclipse.ease:org.eclipse.ease.test:0.8.0-SNAPSHOT @ /home/jenkins/agent/workspace/ease.verify.core.target.2020-03/tests/org.eclipse.ease.test/pom.xml
20:33:44 [2020-09-26T00:33:44.430Z] [ERROR] 	MavenProject: org.eclipse.ease:org.eclipse.ease.lang.javascript.nashorn.test:0.8.0-SNAPSHOT @ /home/jenkins/agent/workspace/ease.verify.core.target.2020-03/tests/org.eclipse.ease.lang.javascript.nashorn.test/pom.xml
20:33:44 [2020-09-26T00:33:44.430Z] [ERROR] 	MavenProject: org.eclipse.ease:org.eclipse.ease.lang.javascript.rhino.test:0.8.0-SNAPSHOT @ /home/jenkins/agent/workspace/ease.verify.core.target.2020-03/tests/org.eclipse.ease.lang.javascript.rhino.test/pom.xml
20:33:44 [2020-09-26T00:33:44.430Z] [ERROR] 	MavenProject: org.eclipse.ease:org.eclipse.ease.lang.javascript.test:0.8.0-SNAPSHOT @ /home/jenkins/agent/workspace/ease.verify.core.target.2020-03/tests/org.eclipse.ease.lang.javascript.test/pom.xml
20:33:44 [2020-09-26T00:33:44.430Z] [ERROR] 	MavenProject: org.eclipse.ease:org.eclipse.ease.lang.python.test:0.8.0-SNAPSHOT @ /home/jenkins/agent/workspace/ease.verify.core.target.2020-03/tests/org.eclipse.ease.lang.python.test/pom.xml
20:33:44 [2020-09-26T00:33:44.430Z] [ERROR] 	MavenProject: org.eclipse.ease:org.eclipse.ease.lang.python.jython.test:0.8.0-SNAPSHOT @ /home/jenkins/agent/workspace/ease.verify.core.target.2020-03/tests/org.eclipse.ease.lang.python.jython.test/pom.xml
20:33:44 [2020-09-26T00:33:44.430Z] [ERROR] 	MavenProject: org.eclipse.ease:org.eclipse.ease.lang.python.py4j.test:0.8.0-SNAPSHOT @ /home/jenkins/agent/workspace/ease.verify.core.target.2020-03/tests/org.eclipse.ease.lang.python.py4j.test/pom.xml
20:33:44 [2020-09-26T00:33:44.430Z] [ERROR] 	MavenProject: org.eclipse.ease:org.eclipse.ease.lang.scriptarchive.test:0.8.0-SNAPSHOT @ /home/jenkins/agent/workspace/ease.verify.core.target.2020-03/tests/org.eclipse.ease.lang.scriptarchive.test/pom.xml
20:33:44 [2020-09-26T00:33:44.430Z] [ERROR] 	MavenProject: org.eclipse.ease:org.eclipse.ease.ui.test:0.8.0-SNAPSHOT @ /home/jenkins/agent/workspace/ease.verify.core.target.2020-03/tests/org.eclipse.ease.ui.test/pom.xml
20:33:44 [2020-09-26T00:33:44.430Z] [INFO] [jenkins-event-spy] Generated /home/jenkins/agent/workspace/ease.verify.core.target.2020-03@tmp/withMavend9e0738b/maven-spy-20200926-003341-56415773228327616969846.log
20:33:44 [2020-09-26T00:33:44.430Z] [ERROR] All tycho plugins configured in one reactor must use the same version -> [Help 1]
20:33:44 [2020-09-26T00:33:44.430Z] [ERROR] 
20:33:44 [2020-09-26T00:33:44.430Z] [ERROR] To see the full stack trace of the errors, re-run Maven with the -e switch.
20:33:44 [2020-09-26T00:33:44.430Z] [ERROR] Re-run Maven using the -X switch to enable full debug logging.
20:33:44 [2020-09-26T00:33:44.431Z] [ERROR] 
20:33:44 [2020-09-26T00:33:44.431Z] [ERROR] For more information about the errors and possible solutions, please read the following articles:
20:33:44 [2020-09-26T00:33:44.431Z] [ERROR] [Help 1] http://cwiki.apache.org/confluence/display/MAVEN/MavenExecutionException
[Pipeline] }
20:33:44 [2020-09-26T00:33:44.712Z] [withMaven] Publishers: 
[Pipeline] // withMaven
[Pipeline] }
[Pipeline] // stage
[Pipeline] stage
[Pipeline] { (Declarative: Post Actions)
[Pipeline] archiveArtifacts
20:33:44 [2020-09-26T00:33:44.741Z] Archiving artifacts
[Pipeline] emailext
20:34:04 [2020-09-26T00:34:04.411Z] Sending email to: christian.pontesegger@web.de
[Pipeline] }
[Pipeline] // stage
[Pipeline] }
[Pipeline] // timeout
[Pipeline] }
[Pipeline] // timestamps
[Pipeline] }
[Pipeline] // node
[Pipeline] End of Pipeline
ERROR: script returned exit code 1
Finished: FAILURE