FailedConsole Output

Skipping 606 KB.. Full Log
JgaGiiIGKaiG5Py84vycVD1nCA1SyAABjCCFBQCV27OjYAAAAA==[INFO] --- maven-install-plugin:2.3.1:install (default-install) @ org.eclipse.ease.test ---
06:39:59 [2020-07-18T10:39:59.370Z] [INFO] Installing /home/jenkins/agent/workspace/ease.verify.core.target.2019-12/tests/org.eclipse.ease.test/target/org.eclipse.ease.test-0.8.0-SNAPSHOT.jar to /home/jenkins/.m2/repository/org/eclipse/ease/org.eclipse.ease.test/0.8.0-SNAPSHOT/org.eclipse.ease.test-0.8.0-SNAPSHOT.jar
06:39:59 [2020-07-18T10:39:59.370Z] [INFO] Installing /home/jenkins/agent/workspace/ease.verify.core.target.2019-12/tests/org.eclipse.ease.test/pom.xml to /home/jenkins/.m2/repository/org/eclipse/ease/org.eclipse.ease.test/0.8.0-SNAPSHOT/org.eclipse.ease.test-0.8.0-SNAPSHOT.pom
06:39:59 [2020-07-18T10:39:59.370Z] [INFO] Installing /home/jenkins/agent/workspace/ease.verify.core.target.2019-12/tests/org.eclipse.ease.test/target/org.eclipse.ease.test-0.8.0-SNAPSHOT-sources.jar to /home/jenkins/.m2/repository/org/eclipse/ease/org.eclipse.ease.test/0.8.0-SNAPSHOT/org.eclipse.ease.test-0.8.0-SNAPSHOT-sources.jar
06:39:59 [2020-07-18T10:39:59.370Z] [INFO] Installing /home/jenkins/agent/workspace/ease.verify.core.target.2019-12/tests/org.eclipse.ease.test/target/p2content.xml to /home/jenkins/.m2/repository/org/eclipse/ease/org.eclipse.ease.test/0.8.0-SNAPSHOT/org.eclipse.ease.test-0.8.0-SNAPSHOT-p2metadata.xml
06:39:59 [2020-07-18T10:39:59.370Z] [INFO] Installing /home/jenkins/agent/workspace/ease.verify.core.target.2019-12/tests/org.eclipse.ease.test/target/p2artifacts.xml to /home/jenkins/.m2/repository/org/eclipse/ease/org.eclipse.ease.test/0.8.0-SNAPSHOT/org.eclipse.ease.test-0.8.0-SNAPSHOT-p2artifacts.xml
06:39:59 [2020-07-18T10:39:59.370Z] [INFO] Installing /home/jenkins/agent/workspace/ease.verify.core.target.2019-12/tests/org.eclipse.ease.test/target/p2content.xml to /home/jenkins/.m2/repository/org/eclipse/ease/org.eclipse.ease.test/0.8.0-SNAPSHOT/org.eclipse.ease.test-0.8.0-SNAPSHOT-p2metadata.xml
06:39:59 [2020-07-18T10:39:59.370Z] [INFO] Installing /home/jenkins/agent/workspace/ease.verify.core.target.2019-12/tests/org.eclipse.ease.test/target/p2artifacts.xml to /home/jenkins/.m2/repository/org/eclipse/ease/org.eclipse.ease.test/0.8.0-SNAPSHOT/org.eclipse.ease.test-0.8.0-SNAPSHOT-p2artifacts.xml
06:39:59 [2020-07-18T10:39:59.370Z] [INFO] 
06:39:59 [2020-07-18T10:39:59.370Z] [INFO] --- tycho-p2-plugin:1.3.0:update-local-index (default-update-local-index) @ org.eclipse.ease.test ---
06:39:59 [2020-07-18T10:39:59.370Z] [INFO] 
06:39:59 [2020-07-18T10:39:59.370Z] [INFO] ---< org.eclipse.ease:org.eclipse.ease.lang.javascript.nashorn.test >---
06:39:59 [2020-07-18T10:39:59.370Z] [INFO] Building org.eclipse.ease.lang.javascript.nashorn.test 0.8.0-SNAPSHOT [39/48]
06:39:59 [2020-07-18T10:39:59.370Z] [INFO] ------------------------[ eclipse-test-plugin ]-------------------------
06:39:59 [2020-07-18T10:39:59.370Z] [INFO] 
06:39:59 [2020-07-18T10:39:59.370Z] [INFO] --- maven-clean-plugin:2.5:clean (default-clean) @ org.eclipse.ease.lang.javascript.nashorn.test ---
06:39:59 [2020-07-18T10:39:59.370Z] [INFO] 
06:39:59 [2020-07-18T10:39:59.370Z] [INFO] --- tycho-packaging-plugin:1.3.0:build-qualifier (default-build-qualifier) @ org.eclipse.ease.lang.javascript.nashorn.test ---
06:39:59 [2020-07-18T10:39:59.370Z] [INFO] The project's OSGi version is 0.8.0.I201910171213
06:39:59 [2020-07-18T10:39:59.370Z] [INFO] 
06:39:59 [2020-07-18T10:39:59.370Z] [INFO] --- tycho-packaging-plugin:1.3.0:validate-id (default-validate-id) @ org.eclipse.ease.lang.javascript.nashorn.test ---
06:39:59 [2020-07-18T10:39:59.370Z] [INFO] 
06:39:59 [2020-07-18T10:39:59.370Z] [INFO] --- tycho-packaging-plugin:1.3.0:validate-version (default-validate-version) @ org.eclipse.ease.lang.javascript.nashorn.test ---
06:39:59 [2020-07-18T10:39:59.370Z] [INFO] 
06:39:59 [2020-07-18T10:39:59.370Z] [INFO] >>> maven-javadoc-plugin:2.9.1:javadoc (build-docs) > generate-sources @ org.eclipse.ease.lang.javascript.nashorn.test >>>
06:39:59 [2020-07-18T10:39:59.370Z] [INFO] 
06:39:59 [2020-07-18T10:39:59.370Z] [INFO] --- tycho-packaging-plugin:1.3.0:build-qualifier (default-build-qualifier) @ org.eclipse.ease.lang.javascript.nashorn.test ---
06:39:59 [2020-07-18T10:39:59.370Z] [INFO] The project's OSGi version is 0.8.0.I201910171213
06:39:59 [2020-07-18T10:39:59.370Z] [INFO] 
06:39:59 [2020-07-18T10:39:59.370Z] [INFO] --- tycho-packaging-plugin:1.3.0:validate-id (default-validate-id) @ org.eclipse.ease.lang.javascript.nashorn.test ---
06:39:59 [2020-07-18T10:39:59.370Z] [INFO] 
06:39:59 [2020-07-18T10:39:59.370Z] [INFO] --- tycho-packaging-plugin:1.3.0:validate-version (default-validate-version) @ org.eclipse.ease.lang.javascript.nashorn.test ---
06:39:59 [2020-07-18T10:39:59.370Z] [INFO] 
06:39:59 [2020-07-18T10:39:59.370Z] [INFO] <<< maven-javadoc-plugin:2.9.1:javadoc (build-docs) < generate-sources @ org.eclipse.ease.lang.javascript.nashorn.test <<<
06:39:59 [2020-07-18T10:39:59.370Z] [INFO] 
06:39:59 [2020-07-18T10:39:59.370Z] [INFO] 
06:39:59 [2020-07-18T10:39:59.371Z] [INFO] --- maven-javadoc-plugin:2.9.1:javadoc (build-docs) @ org.eclipse.ease.lang.javascript.nashorn.test ---
06:39:59 [2020-07-18T10:39:59.371Z] [ERROR] Error fetching link: http://help.eclipse.org/oxygen/topic/org.eclipse.platform.doc.isv/reference/api/package-list. Ignored it.
06:40:00 [2020-07-18T10:40:00.299Z] [INFO] 
06:40:00 [2020-07-18T10:40:00.299Z] Loading source files for package org.eclipse.ease.lang.javascript.nashorn...
06:40:00 [2020-07-18T10:40:00.299Z] Constructing Javadoc information...
06:40:00 [2020-07-18T10:40:00.299Z] WARNING: Cannot open location "/home/jenkins/agent/workspace/ease.verify.core.target.2019-12/tests/org.eclipse.ease.lang.javascript.nashorn.test/target/javadoc-bundle-options/package-list"
06:40:00 [2020-07-18T10:40:00.299Z] No plugin definition found, skipping
06:40:00 [2020-07-18T10:40:00.299Z] No plugin definition found, skipping
06:40:00 [2020-07-18T10:40:00.299Z] [WARNING] Javadoc Warnings
06:40:00 [2020-07-18T10:40:00.299Z] [WARNING] Picked up JAVA_TOOL_OPTIONS: -Dmaven.ext.class.path="/home/jenkins/agent/workspace/ease.verify.core.target.2019-12@tmp/withMaven53839bc7/pipeline-maven-spy.jar" -Dorg.jenkinsci.plugins.pipeline.maven.reportsFolder="/home/jenkins/agent/workspace/ease.verify.core.target.2019-12@tmp/withMaven53839bc7"
06:40:00 [2020-07-18T10:40:00.299Z] [INFO] 
06:40:00 [2020-07-18T10:40:00.299Z] [INFO] --- build-helper-maven-plugin:1.9.1:add-resource (add_help) @ org.eclipse.ease.lang.javascript.nashorn.test ---
06:40:00 [2020-07-18T10:40:00.299Z] [INFO] 
06:40:00 [2020-07-18T10:40:00.299Z] [INFO] --- maven-resources-plugin:2.4.3:resources (default-resources) @ org.eclipse.ease.lang.javascript.nashorn.test ---
06:40:00 [2020-07-18T10:40:00.299Z] [INFO] Using 'UTF-8' encoding to copy filtered resources.
06:40:00 [2020-07-18T10:40:00.299Z] [INFO] skip non existing resourceDirectory /home/jenkins/agent/workspace/ease.verify.core.target.2019-12/tests/org.eclipse.ease.lang.javascript.nashorn.test/src/main/resources
06:40:00 [2020-07-18T10:40:00.299Z] [INFO] skip non existing resourceDirectory /home/jenkins/agent/workspace/ease.verify.core.target.2019-12/tests/org.eclipse.ease.lang.javascript.nashorn.test/help
06:40:00 [2020-07-18T10:40:00.299Z] [INFO] 
06:40:00 [2020-07-18T10:40:00.299Z] [INFO] --- tycho-compiler-plugin:1.3.0:compile (default-compile) @ org.eclipse.ease.lang.javascript.nashorn.test ---
06:40:00 [2020-07-18T10:40:00.299Z] [INFO] Compiling 1 source file to /home/jenkins/agent/workspace/ease.verify.core.target.2019-12/tests/org.eclipse.ease.lang.javascript.nashorn.test/target/classes
06:40:00 [2020-07-18T10:40:00.299Z] [INFO] 
06:40:00 [2020-07-18T10:40:00.299Z] [INFO] --- maven-resources-plugin:2.4.3:testResources (default-testResources) @ org.eclipse.ease.lang.javascript.nashorn.test ---
06:40:00 [2020-07-18T10:40:00.299Z] [INFO] Using 'UTF-8' encoding to copy filtered resources.
06:40:00 [2020-07-18T10:40:00.299Z] [INFO] skip non existing resourceDirectory /home/jenkins/agent/workspace/ease.verify.core.target.2019-12/tests/org.eclipse.ease.lang.javascript.nashorn.test/src/test/resources
06:40:00 [2020-07-18T10:40:00.299Z] [INFO] 
06:40:00 [2020-07-18T10:40:00.299Z] [INFO] --- tycho-source-plugin:1.3.0:plugin-source (plugin-source) @ org.eclipse.ease.lang.javascript.nashorn.test ---
06:40:00 [2020-07-18T10:40:00.299Z] [WARNING] Bundle-Vendor header not found in /home/jenkins/agent/workspace/ease.verify.core.target.2019-12/tests/org.eclipse.ease.lang.javascript.nashorn.test/META-INF/MANIFEST.MF, fallback to 'unknown' for source bundle
06:40:00 [2020-07-18T10:40:00.299Z] [INFO] Building jar: /home/jenkins/agent/workspace/ease.verify.core.target.2019-12/tests/org.eclipse.ease.lang.javascript.nashorn.test/target/org.eclipse.ease.lang.javascript.nashorn.test-0.8.0-SNAPSHOT-sources.jar
06:40:00 [2020-07-18T10:40:00.555Z] [INFO] 
06:40:00 [2020-07-18T10:40:00.555Z] [INFO] --- target-platform-configuration:1.3.0:target-platform (default-target-platform) @ org.eclipse.ease.lang.javascript.nashorn.test ---
06:40:00 [2020-07-18T10:40:00.555Z] [INFO] 
06:40:00 [2020-07-18T10:40:00.555Z] [INFO] --- tycho-packaging-plugin:1.3.0:package-plugin (default-package-plugin) @ org.eclipse.ease.lang.javascript.nashorn.test ---
06:40:00 [2020-07-18T10:40:00.555Z] [INFO] Building jar: /home/jenkins/agent/workspace/ease.verify.core.target.2019-12/tests/org.eclipse.ease.lang.javascript.nashorn.test/target/org.eclipse.ease.lang.javascript.nashorn.test-0.8.0-SNAPSHOT.jar
06:40:00 [2020-07-18T10:40:00.555Z] [INFO] 
06:40:00 [2020-07-18T10:40:00.555Z] [INFO] --- tycho-p2-plugin:1.3.0:p2-metadata-default (default-p2-metadata-default) @ org.eclipse.ease.lang.javascript.nashorn.test ---
06:40:00 [2020-07-18T10:40:00.555Z] [INFO] 
06:40:00 [2020-07-18T10:40:00.555Z] [INFO] --- tycho-source-feature-plugin:1.3.0:source-feature (source-feature) @ org.eclipse.ease.lang.javascript.nashorn.test ---
06:40:00 [2020-07-18T10:40:00.555Z] [INFO] 
06:40:00 [2020-07-18T10:40:00.555Z] [INFO] --- tycho-p2-plugin:1.3.0:p2-metadata (attached-p2-metadata) @ org.eclipse.ease.lang.javascript.nashorn.test ---
06:40:00 [2020-07-18T10:40:00.555Z] [INFO] 
06:40:00 [2020-07-18T10:40:00.555Z] [INFO] --- tycho-surefire-plugin:1.3.0:test (default-test) @ org.eclipse.ease.lang.javascript.nashorn.test ---
06:40:00 [2020-07-18T10:40:00.555Z] [INFO] Expected eclipse log file: /home/jenkins/agent/workspace/ease.verify.core.target.2019-12/tests/org.eclipse.ease.lang.javascript.nashorn.test/target/work/data/.metadata/.log
06:40:00 [2020-07-18T10:40:00.555Z] [INFO] Command line:
06:40:00 [2020-07-18T10:40:00.555Z] 	[/opt/tools/java/oracle/jdk-8/1.8.0_202/jre/bin/java, -Dosgi.noShutdown=false, -Dosgi.os=linux, -Dosgi.ws=gtk, -Dosgi.arch=x86_64, -Dosgi.clean=true, -jar, /home/jenkins/.m2/repository/p2/osgi/bundle/org.eclipse.equinox.launcher/1.5.700.v20200207-2156/org.eclipse.equinox.launcher-1.5.700.v20200207-2156.jar, -data, /home/jenkins/agent/workspace/ease.verify.core.target.2019-12/tests/org.eclipse.ease.lang.javascript.nashorn.test/target/work/data, -install, /home/jenkins/agent/workspace/ease.verify.core.target.2019-12/tests/org.eclipse.ease.lang.javascript.nashorn.test/target/work, -configuration, /home/jenkins/agent/workspace/ease.verify.core.target.2019-12/tests/org.eclipse.ease.lang.javascript.nashorn.test/target/work/configuration, -application, org.eclipse.tycho.surefire.osgibooter.headlesstest, -testproperties, /home/jenkins/agent/workspace/ease.verify.core.target.2019-12/tests/org.eclipse.ease.lang.javascript.nashorn.test/target/surefire.properties]
06:40:00 [2020-07-18T10:40:00.555Z] Picked up JAVA_TOOL_OPTIONS: -Dmaven.ext.class.path="/home/jenkins/agent/workspace/ease.verify.core.target.2019-12@tmp/withMaven53839bc7/pipeline-maven-spy.jar" -Dorg.jenkinsci.plugins.pipeline.maven.reportsFolder="/home/jenkins/agent/workspace/ease.verify.core.target.2019-12@tmp/withMaven53839bc7" 
06:40:01 [2020-07-18T10:40:01.936Z] Running org.eclipse.ease.lang.javascript.nashorn.NashornEnvironmentTest
06:40:02 [2020-07-18T10:40:02.497Z] Tests run: 5, Failures: 0, Errors: 0, Skipped: 0, Time elapsed: 0.636 s - in org.eclipse.ease.lang.javascript.nashorn.NashornEnvironmentTest
06:40:02 [2020-07-18T10:40:02.497Z] reloadEnvironment(org.eclipse.ease.lang.javascript.nashorn.NashornEnvironmentTest)  Time elapsed: 0.421 s
06:40:02 [2020-07-18T10:40:02.497Z] bootstrappedEnvironment(org.eclipse.ease.lang.javascript.nashorn.NashornEnvironmentTest)  Time elapsed: 0.022 s
06:40:02 [2020-07-18T10:40:02.497Z] postMethodCallback(org.eclipse.ease.lang.javascript.nashorn.NashornEnvironmentTest)  Time elapsed: 0.105 s
06:40:02 [2020-07-18T10:40:02.497Z] preMethodCallback(org.eclipse.ease.lang.javascript.nashorn.NashornEnvironmentTest)  Time elapsed: 0.041 s
06:40:02 [2020-07-18T10:40:02.497Z] reloadFunctionDefinitions(org.eclipse.ease.lang.javascript.nashorn.NashornEnvironmentTest)  Time elapsed: 0.031 s
06:40:02 [2020-07-18T10:40:02.497Z] 
06:40:02 [2020-07-18T10:40:02.497Z] Results:
06:40:02 [2020-07-18T10:40:02.497Z] 
06:40:02 [2020-07-18T10:40:02.497Z] Tests run: 5, Failures: 0, Errors: 0, Skipped: 0
06:40:02 [2020-07-18T10:40:02.497Z] 
06:40:03 [2020-07-18T10:40:03.058Z] [INFO] All tests passed!
06:40:03 [2020-07-18T10:40:03.058Z] [INFO] 
06:40:03 [2020-07-18T10:40:03.058Z] [INFO] --- maven-install-plugin:2.3.1:install (default-install) @ org.eclipse.ease.lang.javascript.nashorn.test ---
06:40:03 [2020-07-18T10:40:03.058Z] [INFO] Installing /home/jenkins/agent/workspace/ease.verify.core.target.2019-12/tests/org.eclipse.ease.lang.javascript.nashorn.test/target/org.eclipse.ease.lang.javascript.nashorn.test-0.8.0-SNAPSHOT.jar to /home/jenkins/.m2/repository/org/eclipse/ease/org.eclipse.ease.lang.javascript.nashorn.test/0.8.0-SNAPSHOT/org.eclipse.ease.lang.javascript.nashorn.test-0.8.0-SNAPSHOT.jar
06:40:03 [2020-07-18T10:40:03.058Z] [INFO] Installing /home/jenkins/agent/workspace/ease.verify.core.target.2019-12/tests/org.eclipse.ease.lang.javascript.nashorn.test/pom.xml to /home/jenkins/.m2/repository/org/eclipse/ease/org.eclipse.ease.lang.javascript.nashorn.test/0.8.0-SNAPSHOT/org.eclipse.ease.lang.javascript.nashorn.test-0.8.0-SNAPSHOT.pom
06:40:03 [2020-07-18T10:40:03.058Z] [INFO] Installing /home/jenkins/agent/workspace/ease.verify.core.target.2019-12/tests/org.eclipse.ease.lang.javascript.nashorn.test/target/org.eclipse.ease.lang.javascript.nashorn.test-0.8.0-SNAPSHOT-sources.jar to /home/jenkins/.m2/repository/org/eclipse/ease/org.eclipse.ease.lang.javascript.nashorn.test/0.8.0-SNAPSHOT/org.eclipse.ease.lang.javascript.nashorn.test-0.8.0-SNAPSHOT-sources.jar
06:40:03 [2020-07-18T10:40:03.058Z] [INFO] Installing /home/jenkins/agent/workspace/ease.verify.core.target.2019-12/tests/org.eclipse.ease.lang.javascript.nashorn.test/target/p2content.xml to /home/jenkins/.m2/repository/org/eclipse/ease/org.eclipse.ease.lang.javascript.nashorn.test/0.8.0-SNAPSHOT/org.eclipse.ease.lang.javascript.nashorn.test-0.8.0-SNAPSHOT-p2metadata.xml
06:40:03 [2020-07-18T10:40:03.058Z] [INFO] Installing /home/jenkins/agent/workspace/ease.verify.core.target.2019-12/tests/org.eclipse.ease.lang.javascript.nashorn.test/target/p2artifacts.xml to /home/jenkins/.m2/repository/org/eclipse/ease/org.eclipse.ease.lang.javascript.nashorn.test/0.8.0-SNAPSHOT/org.eclipse.ease.lang.javascript.nashorn.test-0.8.0-SNAPSHOT-p2artifacts.xml
06:40:03 [2020-07-18T10:40:03.058Z] [INFO] Installing /home/jenkins/agent/workspace/ease.verify.core.target.2019-12/tests/org.eclipse.ease.lang.javascript.nashorn.test/target/p2content.xml to /home/jenkins/.m2/repository/org/eclipse/ease/org.eclipse.ease.lang.javascript.nashorn.test/0.8.0-SNAPSHOT/org.eclipse.ease.lang.javascript.nashorn.test-0.8.0-SNAPSHOT-p2metadata.xml
06:40:03 [2020-07-18T10:40:03.058Z] [INFO] Installing /home/jenkins/agent/workspace/ease.verify.core.target.2019-12/tests/org.eclipse.ease.lang.javascript.nashorn.test/target/p2artifacts.xml to /home/jenkins/.m2/repository/org/eclipse/ease/org.eclipse.ease.lang.javascript.nashorn.test/0.8.0-SNAPSHOT/org.eclipse.ease.lang.javascript.nashorn.test-0.8.0-SNAPSHOT-p2artifacts.xml
06:40:03 [2020-07-18T10:40:03.058Z] [INFO] 
06:40:03 [2020-07-18T10:40:03.058Z] [INFO] --- tycho-p2-plugin:1.3.0:update-local-index (default-update-local-index) @ org.eclipse.ease.lang.javascript.nashorn.test ---
06:40:03 [2020-07-18T10:40:03.058Z] [INFO] 
06:40:03 [2020-07-18T10:40:03.058Z] [INFO] ----< org.eclipse.ease:org.eclipse.ease.lang.javascript.rhino.test >----
06:40:03 [2020-07-18T10:40:03.058Z] [INFO] Building org.eclipse.ease.lang.javascript.rhino.test 0.8.0-SNAPSHOT [40/48]
06:40:03 [2020-07-18T10:40:03.058Z] [INFO] ------------------------[ eclipse-test-plugin ]-------------------------
06:40:03 [2020-07-18T10:40:03.058Z] [INFO] 
06:40:03 [2020-07-18T10:40:03.058Z] [INFO] --- maven-clean-plugin:2.5:clean (default-clean) @ org.eclipse.ease.lang.javascript.rhino.test ---
06:40:03 [2020-07-18T10:40:03.058Z] [INFO] 
06:40:03 [2020-07-18T10:40:03.058Z] [INFO] --- tycho-packaging-plugin:1.3.0:build-qualifier (default-build-qualifier) @ org.eclipse.ease.lang.javascript.rhino.test ---
06:40:03 [2020-07-18T10:40:03.058Z] [INFO] The project's OSGi version is 0.8.0.I201911291239
06:40:03 [2020-07-18T10:40:03.058Z] [INFO] 
06:40:03 [2020-07-18T10:40:03.058Z] [INFO] --- tycho-packaging-plugin:1.3.0:validate-id (default-validate-id) @ org.eclipse.ease.lang.javascript.rhino.test ---
06:40:03 [2020-07-18T10:40:03.058Z] [INFO] 
06:40:03 [2020-07-18T10:40:03.058Z] [INFO] --- tycho-packaging-plugin:1.3.0:validate-version (default-validate-version) @ org.eclipse.ease.lang.javascript.rhino.test ---
06:40:03 [2020-07-18T10:40:03.058Z] [INFO] 
06:40:03 [2020-07-18T10:40:03.058Z] [INFO] >>> maven-javadoc-plugin:2.9.1:javadoc (build-docs) > generate-sources @ org.eclipse.ease.lang.javascript.rhino.test >>>
06:40:03 [2020-07-18T10:40:03.058Z] [INFO] 
06:40:03 [2020-07-18T10:40:03.058Z] [INFO] --- tycho-packaging-plugin:1.3.0:build-qualifier (default-build-qualifier) @ org.eclipse.ease.lang.javascript.rhino.test ---
06:40:03 [2020-07-18T10:40:03.058Z] [INFO] The project's OSGi version is 0.8.0.I201911291239
06:40:03 [2020-07-18T10:40:03.058Z] [INFO] 
06:40:03 [2020-07-18T10:40:03.058Z] [INFO] --- tycho-packaging-plugin:1.3.0:validate-id (default-validate-id) @ org.eclipse.ease.lang.javascript.rhino.test ---
06:40:03 [2020-07-18T10:40:03.058Z] [INFO] 
06:40:03 [2020-07-18T10:40:03.058Z] [INFO] --- tycho-packaging-plugin:1.3.0:validate-version (default-validate-version) @ org.eclipse.ease.lang.javascript.rhino.test ---
06:40:03 [2020-07-18T10:40:03.058Z] [INFO] 
06:40:03 [2020-07-18T10:40:03.059Z] [INFO] <<< maven-javadoc-plugin:2.9.1:javadoc (build-docs) < generate-sources @ org.eclipse.ease.lang.javascript.rhino.test <<<
06:40:03 [2020-07-18T10:40:03.059Z] [INFO] 
06:40:03 [2020-07-18T10:40:03.059Z] [INFO] 
06:40:03 [2020-07-18T10:40:03.059Z] [INFO] --- maven-javadoc-plugin:2.9.1:javadoc (build-docs) @ org.eclipse.ease.lang.javascript.rhino.test ---
06:40:03 [2020-07-18T10:40:03.059Z] [ERROR] Error fetching link: http://help.eclipse.org/oxygen/topic/org.eclipse.platform.doc.isv/reference/api/package-list. Ignored it.
06:40:04 [2020-07-18T10:40:04.424Z] [INFO] 
06:40:04 [2020-07-18T10:40:04.424Z] Loading source files for package org.eclipse.ease.lang.javascript.rhino...
06:40:04 [2020-07-18T10:40:04.424Z] Constructing Javadoc information...
06:40:04 [2020-07-18T10:40:04.424Z] WARNING: Cannot open location "/home/jenkins/agent/workspace/ease.verify.core.target.2019-12/tests/org.eclipse.ease.lang.javascript.rhino.test/target/javadoc-bundle-options/package-list"
06:40:04 [2020-07-18T10:40:04.424Z] No plugin definition found, skipping
06:40:04 [2020-07-18T10:40:04.424Z] No plugin definition found, skipping
06:40:04 [2020-07-18T10:40:04.424Z] [WARNING] Javadoc Warnings
06:40:04 [2020-07-18T10:40:04.424Z] [WARNING] Picked up JAVA_TOOL_OPTIONS: -Dmaven.ext.class.path="/home/jenkins/agent/workspace/ease.verify.core.target.2019-12@tmp/withMaven53839bc7/pipeline-maven-spy.jar" -Dorg.jenkinsci.plugins.pipeline.maven.reportsFolder="/home/jenkins/agent/workspace/ease.verify.core.target.2019-12@tmp/withMaven53839bc7"
06:40:04 [2020-07-18T10:40:04.424Z] [INFO] 
06:40:04 [2020-07-18T10:40:04.424Z] [INFO] --- build-helper-maven-plugin:1.9.1:add-resource (add_help) @ org.eclipse.ease.lang.javascript.rhino.test ---
06:40:04 [2020-07-18T10:40:04.424Z] [INFO] 
06:40:04 [2020-07-18T10:40:04.424Z] [INFO] --- maven-resources-plugin:2.4.3:resources (default-resources) @ org.eclipse.ease.lang.javascript.rhino.test ---
06:40:04 [2020-07-18T10:40:04.424Z] [INFO] Using 'UTF-8' encoding to copy filtered resources.
06:40:04 [2020-07-18T10:40:04.424Z] [INFO] skip non existing resourceDirectory /home/jenkins/agent/workspace/ease.verify.core.target.2019-12/tests/org.eclipse.ease.lang.javascript.rhino.test/src/main/resources
06:40:04 [2020-07-18T10:40:04.424Z] [INFO] skip non existing resourceDirectory /home/jenkins/agent/workspace/ease.verify.core.target.2019-12/tests/org.eclipse.ease.lang.javascript.rhino.test/help
06:40:04 [2020-07-18T10:40:04.424Z] [INFO] 
06:40:04 [2020-07-18T10:40:04.424Z] [INFO] --- tycho-compiler-plugin:1.3.0:compile (default-compile) @ org.eclipse.ease.lang.javascript.rhino.test ---
06:40:04 [2020-07-18T10:40:04.424Z] [INFO] Compiling 4 source files to /home/jenkins/agent/workspace/ease.verify.core.target.2019-12/tests/org.eclipse.ease.lang.javascript.rhino.test/target/classes
06:40:04 [2020-07-18T10:40:04.424Z] [INFO] 
06:40:04 [2020-07-18T10:40:04.424Z] [INFO] --- maven-resources-plugin:2.4.3:testResources (default-testResources) @ org.eclipse.ease.lang.javascript.rhino.test ---
06:40:04 [2020-07-18T10:40:04.424Z] [INFO] Using 'UTF-8' encoding to copy filtered resources.
06:40:04 [2020-07-18T10:40:04.424Z] [INFO] skip non existing resourceDirectory /home/jenkins/agent/workspace/ease.verify.core.target.2019-12/tests/org.eclipse.ease.lang.javascript.rhino.test/src/test/resources
06:40:04 [2020-07-18T10:40:04.424Z] [INFO] 
06:40:04 [2020-07-18T10:40:04.424Z] [INFO] --- tycho-source-plugin:1.3.0:plugin-source (plugin-source) @ org.eclipse.ease.lang.javascript.rhino.test ---
06:40:04 [2020-07-18T10:40:04.424Z] [WARNING] Bundle-Vendor header not found in /home/jenkins/agent/workspace/ease.verify.core.target.2019-12/tests/org.eclipse.ease.lang.javascript.rhino.test/META-INF/MANIFEST.MF, fallback to 'unknown' for source bundle
06:40:04 [2020-07-18T10:40:04.424Z] [INFO] Building jar: /home/jenkins/agent/workspace/ease.verify.core.target.2019-12/tests/org.eclipse.ease.lang.javascript.rhino.test/target/org.eclipse.ease.lang.javascript.rhino.test-0.8.0-SNAPSHOT-sources.jar
06:40:04 [2020-07-18T10:40:04.424Z] [INFO] 
06:40:04 [2020-07-18T10:40:04.424Z] [INFO] --- target-platform-configuration:1.3.0:target-platform (default-target-platform) @ org.eclipse.ease.lang.javascript.rhino.test ---
06:40:04 [2020-07-18T10:40:04.424Z] [INFO] 
06:40:04 [2020-07-18T10:40:04.424Z] [INFO] --- tycho-packaging-plugin:1.3.0:package-plugin (default-package-plugin) @ org.eclipse.ease.lang.javascript.rhino.test ---
06:40:04 [2020-07-18T10:40:04.424Z] [INFO] Building jar: /home/jenkins/agent/workspace/ease.verify.core.target.2019-12/tests/org.eclipse.ease.lang.javascript.rhino.test/target/org.eclipse.ease.lang.javascript.rhino.test-0.8.0-SNAPSHOT.jar
06:40:04 [2020-07-18T10:40:04.424Z] [INFO] 
06:40:04 [2020-07-18T10:40:04.424Z] [INFO] --- tycho-p2-plugin:1.3.0:p2-metadata-default (default-p2-metadata-default) @ org.eclipse.ease.lang.javascript.rhino.test ---
06:40:04 [2020-07-18T10:40:04.424Z] [INFO] 
06:40:04 [2020-07-18T10:40:04.424Z] [INFO] --- tycho-source-feature-plugin:1.3.0:source-feature (source-feature) @ org.eclipse.ease.lang.javascript.rhino.test ---
06:40:04 [2020-07-18T10:40:04.424Z] [INFO] 
06:40:04 [2020-07-18T10:40:04.424Z] [INFO] --- tycho-p2-plugin:1.3.0:p2-metadata (attached-p2-metadata) @ org.eclipse.ease.lang.javascript.rhino.test ---
06:40:04 [2020-07-18T10:40:04.424Z] [INFO] 
06:40:04 [2020-07-18T10:40:04.424Z] [INFO] --- tycho-surefire-plugin:1.3.0:test (default-test) @ org.eclipse.ease.lang.javascript.rhino.test ---
06:40:04 [2020-07-18T10:40:04.424Z] [INFO] Expected eclipse log file: /home/jenkins/agent/workspace/ease.verify.core.target.2019-12/tests/org.eclipse.ease.lang.javascript.rhino.test/target/work/data/.metadata/.log
06:40:04 [2020-07-18T10:40:04.424Z] [INFO] Command line:
06:40:04 [2020-07-18T10:40:04.424Z] 	[/opt/tools/java/oracle/jdk-8/1.8.0_202/jre/bin/java, -Dosgi.noShutdown=false, -Dosgi.os=linux, -Dosgi.ws=gtk, -Dosgi.arch=x86_64, -Dosgi.clean=true, -jar, /home/jenkins/.m2/repository/p2/osgi/bundle/org.eclipse.equinox.launcher/1.5.700.v20200207-2156/org.eclipse.equinox.launcher-1.5.700.v20200207-2156.jar, -data, /home/jenkins/agent/workspace/ease.verify.core.target.2019-12/tests/org.eclipse.ease.lang.javascript.rhino.test/target/work/data, -install, /home/jenkins/agent/workspace/ease.verify.core.target.2019-12/tests/org.eclipse.ease.lang.javascript.rhino.test/target/work, -configuration, /home/jenkins/agent/workspace/ease.verify.core.target.2019-12/tests/org.eclipse.ease.lang.javascript.rhino.test/target/work/configuration, -application, org.eclipse.tycho.surefire.osgibooter.headlesstest, -testproperties, /home/jenkins/agent/workspace/ease.verify.core.target.2019-12/tests/org.eclipse.ease.lang.javascript.rhino.test/target/surefire.properties]
06:40:04 [2020-07-18T10:40:04.425Z] Picked up JAVA_TOOL_OPTIONS: -Dmaven.ext.class.path="/home/jenkins/agent/workspace/ease.verify.core.target.2019-12@tmp/withMaven53839bc7/pipeline-maven-spy.jar" -Dorg.jenkinsci.plugins.pipeline.maven.reportsFolder="/home/jenkins/agent/workspace/ease.verify.core.target.2019-12@tmp/withMaven53839bc7" 
06:40:05 [2020-07-18T10:40:05.838Z] Running org.eclipse.ease.lang.javascript.rhino.RhinoScriptEngineTest
06:40:06 [2020-07-18T10:40:06.102Z] org.eclipse.ease.ScriptExecutionException: JavaError: NotThere cannot be found by org.mozilla.javascript_1.7.10.v20190430-1943
06:40:06 [2020-07-18T10:40:06.102Z] 	at <unknown source>
06:40:06 [2020-07-18T10:40:06.102Z] 
06:40:06 [2020-07-18T10:40:06.102Z] Java Stacktrace:
06:40:06 [2020-07-18T10:40:06.102Z] java.lang.ClassNotFoundException: NotThere cannot be found by org.mozilla.javascript_1.7.10.v20190430-1943
06:40:06 [2020-07-18T10:40:06.102Z] 	at org.eclipse.osgi.internal.loader.BundleLoader.findClass(BundleLoader.java:516)
06:40:06 [2020-07-18T10:40:06.102Z] 	at org.eclipse.osgi.internal.loader.ModuleClassLoader.loadClass(ModuleClassLoader.java:171)
06:40:06 [2020-07-18T10:40:06.102Z] 	at java.lang.ClassLoader.loadClass(ClassLoader.java:357)
06:40:06 [2020-07-18T10:40:06.102Z] 	at java.lang.Class.forName0(Native Method)
06:40:06 [2020-07-18T10:40:06.102Z] 	at java.lang.Class.forName(Class.java:264)
06:40:06 [2020-07-18T10:40:06.102Z] 	at sun.reflect.NativeMethodAccessorImpl.invoke0(Native Method)
06:40:06 [2020-07-18T10:40:06.102Z] 	at sun.reflect.NativeMethodAccessorImpl.invoke(NativeMethodAccessorImpl.java:62)
06:40:06 [2020-07-18T10:40:06.102Z] 	at sun.reflect.DelegatingMethodAccessorImpl.invoke(DelegatingMethodAccessorImpl.java:43)
06:40:06 [2020-07-18T10:40:06.102Z] 	at java.lang.reflect.Method.invoke(Method.java:498)
06:40:06 [2020-07-18T10:40:06.102Z] 	at org.mozilla.javascript.MemberBox.invoke(MemberBox.java:126)
06:40:06 [2020-07-18T10:40:06.102Z] 	at org.mozilla.javascript.NativeJavaMethod.call(NativeJavaMethod.java:225)
06:40:06 [2020-07-18T10:40:06.102Z] 	at org.mozilla.javascript.optimizer.OptRuntime.call1(OptRuntime.java:32)
06:40:06 [2020-07-18T10:40:06.102Z] 	at org.mozilla.javascript.gen.c_3._c_script_0(Unknown Source)
06:40:06 [2020-07-18T10:40:06.102Z] 	at org.mozilla.javascript.gen.c_3.call(Unknown Source)
06:40:06 [2020-07-18T10:40:06.102Z] 	at org.mozilla.javascript.ContextFactory.doTopCall(ContextFactory.java:405)
06:40:06 [2020-07-18T10:40:06.102Z] 	at org.mozilla.javascript.ScriptRuntime.doTopCall(ScriptRuntime.java:3508)
06:40:06 [2020-07-18T10:40:06.102Z] 	at org.mozilla.javascript.gen.c_3.call(Unknown Source)
06:40:06 [2020-07-18T10:40:06.102Z] 	at org.mozilla.javascript.gen.c_3.exec(Unknown Source)
06:40:06 [2020-07-18T10:40:06.102Z] 	at org.mozilla.javascript.Context.evaluateReader(Context.java:1293)
06:40:06 [2020-07-18T10:40:06.102Z] 	at org.eclipse.ease.lang.javascript.rhino.RhinoScriptEngine.internalExecute(RhinoScriptEngine.java:222)
06:40:06 [2020-07-18T10:40:06.102Z] 	at org.eclipse.ease.lang.javascript.rhino.RhinoScriptEngine.execute(RhinoScriptEngine.java:201)
06:40:06 [2020-07-18T10:40:06.102Z] 	at org.eclipse.ease.AbstractScriptEngine.inject(AbstractScriptEngine.java:222)
06:40:06 [2020-07-18T10:40:06.102Z] 	at org.eclipse.ease.AbstractScriptEngine.run(AbstractScriptEngine.java:272)
06:40:06 [2020-07-18T10:40:06.102Z] 	at org.eclipse.core.internal.jobs.Worker.run(Worker.java:63)
06:40:06 [2020-07-18T10:40:06.102Z] org.eclipse.ease.ScriptExecutionException: TypeError: Cannot call method "foobar" of undefined
06:40:06 [2020-07-18T10:40:06.102Z] 	at <unknown source>
06:40:06 [2020-07-18T10:40:06.102Z] org.eclipse.ease.ScriptExecutionException: ScriptException: test
06:40:06 [2020-07-18T10:40:06.102Z] 	at <unknown source>
06:40:06 [2020-07-18T10:40:06.103Z] org.eclipse.ease.ScriptExecutionException: JavaError: java.lang.Exception
06:40:06 [2020-07-18T10:40:06.103Z] 	at <unknown source>
06:40:06 [2020-07-18T10:40:06.103Z] 
06:40:06 [2020-07-18T10:40:06.103Z] Java Stacktrace:
06:40:06 [2020-07-18T10:40:06.103Z] java.lang.Exception
06:40:06 [2020-07-18T10:40:06.103Z] 	at sun.reflect.NativeConstructorAccessorImpl.newInstance0(Native Method)
06:40:06 [2020-07-18T10:40:06.103Z] 	at sun.reflect.NativeConstructorAccessorImpl.newInstance(NativeConstructorAccessorImpl.java:62)
06:40:06 [2020-07-18T10:40:06.103Z] 	at sun.reflect.DelegatingConstructorAccessorImpl.newInstance(DelegatingConstructorAccessorImpl.java:45)
06:40:06 [2020-07-18T10:40:06.103Z] 	at java.lang.reflect.Constructor.newInstance(Constructor.java:423)
06:40:06 [2020-07-18T10:40:06.103Z] 	at org.mozilla.javascript.MemberBox.newInstance(MemberBox.java:159)
06:40:06 [2020-07-18T10:40:06.103Z] 	at org.mozilla.javascript.NativeJavaClass.constructInternal(NativeJavaClass.java:266)
06:40:06 [2020-07-18T10:40:06.103Z] 	at org.mozilla.javascript.NativeJavaClass.constructSpecific(NativeJavaClass.java:205)
06:40:06 [2020-07-18T10:40:06.103Z] 	at org.mozilla.javascript.NativeJavaClass.construct(NativeJavaClass.java:166)
06:40:06 [2020-07-18T10:40:06.103Z] 	at org.mozilla.javascript.ScriptRuntime.newObject(ScriptRuntime.java:2655)
06:40:06 [2020-07-18T10:40:06.103Z] 	at org.mozilla.javascript.gen.c_21._c_script_0(Unknown Source)
06:40:06 [2020-07-18T10:40:06.103Z] 	at org.mozilla.javascript.gen.c_21.call(Unknown Source)
06:40:06 [2020-07-18T10:40:06.103Z] 	at org.mozilla.javascript.ContextFactory.doTopCall(ContextFactory.java:405)
06:40:06 [2020-07-18T10:40:06.103Z] 	at org.mozilla.javascript.ScriptRuntime.doTopCall(ScriptRuntime.java:3508)
06:40:06 [2020-07-18T10:40:06.103Z] 	at org.mozilla.javascript.gen.c_21.call(Unknown Source)
06:40:06 [2020-07-18T10:40:06.103Z] 	at org.mozilla.javascript.gen.c_21.exec(Unknown Source)
06:40:06 [2020-07-18T10:40:06.103Z] 	at org.mozilla.javascript.Context.evaluateReader(Context.java:1293)
06:40:06 [2020-07-18T10:40:06.103Z] 	at org.eclipse.ease.lang.javascript.rhino.RhinoScriptEngine.internalExecute(RhinoScriptEngine.java:222)
06:40:06 [2020-07-18T10:40:06.103Z] 	at org.eclipse.ease.lang.javascript.rhino.RhinoScriptEngine.execute(RhinoScriptEngine.java:201)
06:40:06 [2020-07-18T10:40:06.103Z] 	at org.eclipse.ease.AbstractScriptEngine.inject(AbstractScriptEngine.java:222)
06:40:06 [2020-07-18T10:40:06.103Z] 	at org.eclipse.ease.AbstractScriptEngine.run(AbstractScriptEngine.java:272)
06:40:06 [2020-07-18T10:40:06.103Z] 	at org.eclipse.core.internal.jobs.Worker.run(Worker.java:63)
06:40:06 [2020-07-18T10:40:06.103Z] org.eclipse.ease.ScriptExecutionException: ScriptException: JavaScript
06:40:06 [2020-07-18T10:40:06.103Z] 	at <unknown source>
06:40:06 [2020-07-18T10:40:06.103Z] org.eclipse.ease.ScriptExecutionException: SyntaxError: unterminated string literal (#1)
06:40:06 [2020-07-18T10:40:06.103Z] 'asdf
06:40:06 [2020-07-18T10:40:06.103Z]     ^
06:40:06 [2020-07-18T10:40:06.103Z] 	at <unknown source>
06:40:06 [2020-07-18T10:40:06.358Z] Tests run: 11, Failures: 0, Errors: 0, Skipped: 0, Time elapsed: 0.405 s - in org.eclipse.ease.lang.javascript.rhino.RhinoScriptEngineTest
06:40:06 [2020-07-18T10:40:06.358Z] causeWrappedException(org.eclipse.ease.lang.javascript.rhino.RhinoScriptEngineTest)  Time elapsed: 0.203 s
06:40:06 [2020-07-18T10:40:06.358Z] optionalModuleParameters(org.eclipse.ease.lang.javascript.rhino.RhinoScriptEngineTest)  Time elapsed: 0.04 s
06:40:06 [2020-07-18T10:40:06.358Z] simpleScriptCode(org.eclipse.ease.lang.javascript.rhino.RhinoScriptEngineTest)  Time elapsed: 0.017 s
06:40:06 [2020-07-18T10:40:06.358Z] causeRuntimeErrorException(org.eclipse.ease.lang.javascript.rhino.RhinoScriptEngineTest)  Time elapsed: 0.016 s
06:40:06 [2020-07-18T10:40:06.359Z] callModuleCode(org.eclipse.ease.lang.javascript.rhino.RhinoScriptEngineTest)  Time elapsed: 0.013 s
06:40:06 [2020-07-18T10:40:06.359Z] throwJavaClass(org.eclipse.ease.lang.javascript.rhino.RhinoScriptEngineTest)  Time elapsed: 0.05 s
06:40:06 [2020-07-18T10:40:06.359Z] throwJavaException(org.eclipse.ease.lang.javascript.rhino.RhinoScriptEngineTest)  Time elapsed: 0.011 s
06:40:06 [2020-07-18T10:40:06.359Z] accessJavaClasses(org.eclipse.ease.lang.javascript.rhino.RhinoScriptEngineTest)  Time elapsed: 0.01 s
06:40:06 [2020-07-18T10:40:06.359Z] accessEclipseClasses(org.eclipse.ease.lang.javascript.rhino.RhinoScriptEngineTest)  Time elapsed: 0.01 s
06:40:06 [2020-07-18T10:40:06.359Z] throwJavaScriptException(org.eclipse.ease.lang.javascript.rhino.RhinoScriptEngineTest)  Time elapsed: 0.008 s
06:40:06 [2020-07-18T10:40:06.359Z] causeSyntaxErrorException(org.eclipse.ease.lang.javascript.rhino.RhinoScriptEngineTest)  Time elapsed: 0.009 s
06:40:06 [2020-07-18T10:40:06.359Z] Running org.eclipse.ease.lang.javascript.rhino.RhinoEnvironmentTest
06:40:06 [2020-07-18T10:40:06.359Z] Tests run: 5, Failures: 0, Errors: 0, Skipped: 0, Time elapsed: 0.158 s - in org.eclipse.ease.lang.javascript.rhino.RhinoEnvironmentTest
06:40:06 [2020-07-18T10:40:06.359Z] reloadEnvironment(org.eclipse.ease.lang.javascript.rhino.RhinoEnvironmentTest)  Time elapsed: 0.019 s
06:40:06 [2020-07-18T10:40:06.359Z] bootstrappedEnvironment(org.eclipse.ease.lang.javascript.rhino.RhinoEnvironmentTest)  Time elapsed: 0.013 s
06:40:06 [2020-07-18T10:40:06.359Z] postMethodCallback(org.eclipse.ease.lang.javascript.rhino.RhinoEnvironmentTest)  Time elapsed: 0.081 s
06:40:06 [2020-07-18T10:40:06.359Z] preMethodCallback(org.eclipse.ease.lang.javascript.rhino.RhinoEnvironmentTest)  Time elapsed: 0.015 s
06:40:06 [2020-07-18T10:40:06.359Z] reloadFunctionDefinitions(org.eclipse.ease.lang.javascript.rhino.RhinoEnvironmentTest)  Time elapsed: 0.029 s
06:40:06 [2020-07-18T10:40:06.359Z] Running org.eclipse.ease.lang.javascript.rhino.RhinoDebuggerEngineTest
06:40:06 [2020-07-18T10:40:06.614Z] org.eclipse.ease.ScriptExecutionException: JavaError: NotThere cannot be found by org.mozilla.javascript_1.7.10.v20190430-1943
06:40:06 [2020-07-18T10:40:06.614Z] 
06:40:06 [2020-07-18T10:40:06.614Z] Java Stacktrace:
06:40:06 [2020-07-18T10:40:06.614Z] java.lang.ClassNotFoundException: NotThere cannot be found by org.mozilla.javascript_1.7.10.v20190430-1943
06:40:06 [2020-07-18T10:40:06.614Z] 	at org.eclipse.osgi.internal.loader.BundleLoader.findClass(BundleLoader.java:516)
06:40:06 [2020-07-18T10:40:06.614Z] 	at org.eclipse.osgi.internal.loader.ModuleClassLoader.loadClass(ModuleClassLoader.java:171)
06:40:06 [2020-07-18T10:40:06.614Z] 	at java.lang.ClassLoader.loadClass(ClassLoader.java:357)
06:40:06 [2020-07-18T10:40:06.614Z] 	at java.lang.Class.forName0(Native Method)
06:40:06 [2020-07-18T10:40:06.614Z] 	at java.lang.Class.forName(Class.java:264)
06:40:06 [2020-07-18T10:40:06.614Z] 	at sun.reflect.NativeMethodAccessorImpl.invoke0(Native Method)
06:40:06 [2020-07-18T10:40:06.614Z] 	at sun.reflect.NativeMethodAccessorImpl.invoke(NativeMethodAccessorImpl.java:62)
06:40:06 [2020-07-18T10:40:06.614Z] 	at sun.reflect.DelegatingMethodAccessorImpl.invoke(DelegatingMethodAccessorImpl.java:43)
06:40:06 [2020-07-18T10:40:06.614Z] 	at java.lang.reflect.Method.invoke(Method.java:498)
06:40:06 [2020-07-18T10:40:06.614Z] 	at org.mozilla.javascript.MemberBox.invoke(MemberBox.java:126)
06:40:06 [2020-07-18T10:40:06.614Z] 	at org.mozilla.javascript.NativeJavaMethod.call(NativeJavaMethod.java:225)
06:40:06 [2020-07-18T10:40:06.614Z] 	at org.mozilla.javascript.Interpreter.interpretLoop(Interpreter.java:1573)
06:40:06 [2020-07-18T10:40:06.614Z] 	at org.mozilla.javascript.Interpreter.interpret(Interpreter.java:911)
06:40:06 [2020-07-18T10:40:06.614Z] 	at org.mozilla.javascript.InterpretedFunction.call(InterpretedFunction.java:109)
06:40:06 [2020-07-18T10:40:06.614Z] 	at org.mozilla.javascript.ContextFactory.doTopCall(ContextFactory.java:405)
06:40:06 [2020-07-18T10:40:06.614Z] 	at org.mozilla.javascript.ScriptRuntime.doTopCall(ScriptRuntime.java:3508)
06:40:06 [2020-07-18T10:40:06.614Z] 	at org.mozilla.javascript.InterpretedFunction.exec(InterpretedFunction.java:120)
06:40:06 [2020-07-18T10:40:06.614Z] 	at org.mozilla.javascript.Context.evaluateReader(Context.java:1293)
06:40:06 [2020-07-18T10:40:06.614Z] 	at org.eclipse.ease.lang.javascript.rhino.RhinoScriptEngine.internalExecute(RhinoScriptEngine.java:222)
06:40:06 [2020-07-18T10:40:06.614Z] 	at org.eclipse.ease.lang.javascript.rhino.RhinoScriptEngine.execute(RhinoScriptEngine.java:201)
06:40:06 [2020-07-18T10:40:06.614Z] 	at org.eclipse.ease.AbstractScriptEngine.inject(AbstractScriptEngine.java:222)
06:40:06 [2020-07-18T10:40:06.614Z] 	at org.eclipse.ease.AbstractScriptEngine.run(AbstractScriptEngine.java:272)
06:40:06 [2020-07-18T10:40:06.614Z] 	at org.eclipse.core.internal.jobs.Worker.run(Worker.java:63)
06:40:06 [2020-07-18T10:40:06.614Z] org.eclipse.ease.ScriptExecutionException: TypeError: Cannot call method "foobar" of undefined
06:40:06 [2020-07-18T10:40:06.614Z] org.eclipse.ease.ScriptExecutionException: ScriptException: test
06:40:06 [2020-07-18T10:40:06.614Z] org.eclipse.ease.ScriptExecutionException: JavaError: java.lang.Exception
06:40:06 [2020-07-18T10:40:06.614Z] 
06:40:06 [2020-07-18T10:40:06.614Z] Java Stacktrace:
06:40:06 [2020-07-18T10:40:06.614Z] java.lang.Exception
06:40:06 [2020-07-18T10:40:06.614Z] 	at sun.reflect.NativeConstructorAccessorImpl.newInstance0(Native Method)
06:40:06 [2020-07-18T10:40:06.614Z] 	at sun.reflect.NativeConstructorAccessorImpl.newInstance(NativeConstructorAccessorImpl.java:62)
06:40:06 [2020-07-18T10:40:06.614Z] 	at sun.reflect.DelegatingConstructorAccessorImpl.newInstance(DelegatingConstructorAccessorImpl.java:45)
06:40:06 [2020-07-18T10:40:06.614Z] 	at java.lang.reflect.Constructor.newInstance(Constructor.java:423)
06:40:06 [2020-07-18T10:40:06.614Z] 	at org.mozilla.javascript.MemberBox.newInstance(MemberBox.java:159)
06:40:06 [2020-07-18T10:40:06.615Z] 	at org.mozilla.javascript.NativeJavaClass.constructInternal(NativeJavaClass.java:266)
06:40:06 [2020-07-18T10:40:06.615Z] 	at org.mozilla.javascript.NativeJavaClass.constructSpecific(NativeJavaClass.java:205)
06:40:06 [2020-07-18T10:40:06.615Z] 	at org.mozilla.javascript.NativeJavaClass.construct(NativeJavaClass.java:166)
06:40:06 [2020-07-18T10:40:06.615Z] 	at org.mozilla.javascript.Interpreter.interpretLoop(Interpreter.java:1617)
06:40:06 [2020-07-18T10:40:06.615Z] 	at org.mozilla.javascript.Interpreter.interpret(Interpreter.java:911)
06:40:06 [2020-07-18T10:40:06.615Z] 	at org.mozilla.javascript.InterpretedFunction.call(InterpretedFunction.java:109)
06:40:06 [2020-07-18T10:40:06.615Z] 	at org.mozilla.javascript.ContextFactory.doTopCall(ContextFactory.java:405)
06:40:06 [2020-07-18T10:40:06.615Z] 	at org.mozilla.javascript.ScriptRuntime.doTopCall(ScriptRuntime.java:3508)
06:40:06 [2020-07-18T10:40:06.615Z] 	at org.mozilla.javascript.InterpretedFunction.exec(InterpretedFunction.java:120)
06:40:06 [2020-07-18T10:40:06.615Z] 	at org.mozilla.javascript.Context.evaluateReader(Context.java:1293)
06:40:06 [2020-07-18T10:40:06.615Z] 	at org.eclipse.ease.lang.javascript.rhino.RhinoScriptEngine.internalExecute(RhinoScriptEngine.java:222)
06:40:06 [2020-07-18T10:40:06.615Z] 	at org.eclipse.ease.lang.javascript.rhino.RhinoScriptEngine.execute(RhinoScriptEngine.java:201)
06:40:06 [2020-07-18T10:40:06.615Z] 	at org.eclipse.ease.AbstractScriptEngine.inject(AbstractScriptEngine.java:222)
06:40:06 [2020-07-18T10:40:06.615Z] 	at org.eclipse.ease.AbstractScriptEngine.run(AbstractScriptEngine.java:272)
06:40:06 [2020-07-18T10:40:06.615Z] 	at org.eclipse.core.internal.jobs.Worker.run(Worker.java:63)
06:40:06 [2020-07-18T10:40:06.615Z] org.eclipse.ease.ScriptExecutionException: ScriptException: JavaScript
06:40:06 [2020-07-18T10:40:06.615Z] org.eclipse.ease.ScriptExecutionException: SyntaxError: unterminated string literal (#1)
06:40:06 [2020-07-18T10:40:06.615Z] 'asdf
06:40:06 [2020-07-18T10:40:06.615Z]     ^
06:40:06 [2020-07-18T10:40:06.615Z] 	at <unknown source>:1
06:40:06 [2020-07-18T10:40:06.615Z] Tests run: 12, Failures: 0, Errors: 0, Skipped: 0, Time elapsed: 0.278 s - in org.eclipse.ease.lang.javascript.rhino.RhinoDebuggerEngineTest
06:40:06 [2020-07-18T10:40:06.615Z] getExceptionStackTrace(org.eclipse.ease.lang.javascript.rhino.RhinoDebuggerEngineTest)  Time elapsed: 0.083 s
06:40:06 [2020-07-18T10:40:06.615Z] causeWrappedException(org.eclipse.ease.lang.javascript.rhino.RhinoDebuggerEngineTest)  Time elapsed: 0.017 s
06:40:06 [2020-07-18T10:40:06.615Z] optionalModuleParameters(org.eclipse.ease.lang.javascript.rhino.RhinoDebuggerEngineTest)  Time elapsed: 0.037 s
06:40:06 [2020-07-18T10:40:06.615Z] simpleScriptCode(org.eclipse.ease.lang.javascript.rhino.RhinoDebuggerEngineTest)  Time elapsed: 0.013 s
06:40:06 [2020-07-18T10:40:06.615Z] causeRuntimeErrorException(org.eclipse.ease.lang.javascript.rhino.RhinoDebuggerEngineTest)  Time elapsed: 0.011 s
06:40:06 [2020-07-18T10:40:06.615Z] callModuleCode(org.eclipse.ease.lang.javascript.rhino.RhinoDebuggerEngineTest)  Time elapsed: 0.013 s
06:40:06 [2020-07-18T10:40:06.615Z] throwJavaClass(org.eclipse.ease.lang.javascript.rhino.RhinoDebuggerEngineTest)  Time elapsed: 0.011 s
06:40:06 [2020-07-18T10:40:06.615Z] throwJavaException(org.eclipse.ease.lang.javascript.rhino.RhinoDebuggerEngineTest)  Time elapsed: 0.049 s
06:40:06 [2020-07-18T10:40:06.615Z] accessJavaClasses(org.eclipse.ease.lang.javascript.rhino.RhinoDebuggerEngineTest)  Time elapsed: 0.011 s
06:40:06 [2020-07-18T10:40:06.615Z] accessEclipseClasses(org.eclipse.ease.lang.javascript.rhino.RhinoDebuggerEngineTest)  Time elapsed: 0.009 s
06:40:06 [2020-07-18T10:40:06.615Z] throwJavaScriptException(org.eclipse.ease.lang.javascript.rhino.RhinoDebuggerEngineTest)  Time elapsed: 0.012 s
06:40:06 [2020-07-18T10:40:06.615Z] causeSyntaxErrorException(org.eclipse.ease.lang.javascript.rhino.RhinoDebuggerEngineTest)  Time elapsed: 0.009 s
06:40:06 [2020-07-18T10:40:06.615Z] Running org.eclipse.ease.lang.javascript.rhino.RhinoDebugTest
06:40:06 [2020-07-18T10:40:06.870Z] Start of script
06:40:06 [2020-07-18T10:40:06.870Z] include file start
06:40:06 [2020-07-18T10:40:06.870Z] Include file processed
06:40:06 [2020-07-18T10:40:06.870Z] line after include file
06:40:06 [2020-07-18T10:40:06.870Z] Result of testMethod = 5
06:40:06 [2020-07-18T10:40:06.870Z] End of script
06:40:06 [2020-07-18T10:40:06.870Z] Start of script
06:40:07 [2020-07-18T10:40:07.126Z] include file start
06:40:07 [2020-07-18T10:40:07.126Z] Include file processed
06:40:07 [2020-07-18T10:40:07.126Z] line after include file
06:40:07 [2020-07-18T10:40:07.126Z] Result of testMethod = 5
06:40:07 [2020-07-18T10:40:07.126Z] End of script
06:40:07 [2020-07-18T10:40:07.126Z] Start of script
06:40:07 [2020-07-18T10:40:07.126Z] include file start
06:40:07 [2020-07-18T10:40:07.126Z] Include file processed
06:40:07 [2020-07-18T10:40:07.126Z] line after include file
06:40:07 [2020-07-18T10:40:07.126Z] Result of testMethod = 5
06:40:07 [2020-07-18T10:40:07.381Z] Start of script
06:40:07 [2020-07-18T10:40:07.381Z] include file start
06:40:07 [2020-07-18T10:40:07.382Z] Include file processed
06:40:07 [2020-07-18T10:40:07.382Z] line after include file
06:40:07 [2020-07-18T10:40:07.637Z] Result of testMethod = 5
06:40:07 [2020-07-18T10:40:07.637Z] End of script
06:40:07 [2020-07-18T10:40:07.893Z] Start of script
06:40:07 [2020-07-18T10:40:07.893Z] include file start
06:40:07 [2020-07-18T10:40:07.893Z] Include file processed
06:40:07 [2020-07-18T10:40:07.893Z] line after include file
06:40:07 [2020-07-18T10:40:07.893Z] Result of testMethod = 5
06:40:07 [2020-07-18T10:40:07.893Z] End of script
06:40:08 [2020-07-18T10:40:08.148Z] Start of script
06:40:08 [2020-07-18T10:40:08.148Z] include file start
06:40:08 [2020-07-18T10:40:08.148Z] Include file processed
06:40:08 [2020-07-18T10:40:08.148Z] line after include file
06:40:08 [2020-07-18T10:40:08.148Z] Result of testMethod = 5
06:40:08 [2020-07-18T10:40:08.148Z] End of script
06:40:08 [2020-07-18T10:40:08.404Z] Start of script
06:40:08 [2020-07-18T10:40:08.404Z] include file start
06:40:08 [2020-07-18T10:40:08.404Z] Include file processed
06:40:08 [2020-07-18T10:40:08.404Z] line after include file
06:40:08 [2020-07-18T10:40:08.404Z] Result of testMethod = 5
06:40:08 [2020-07-18T10:40:08.659Z] Start of script
06:40:08 [2020-07-18T10:40:08.659Z] include file start
06:40:08 [2020-07-18T10:40:08.659Z] Include file processed
06:40:08 [2020-07-18T10:40:08.659Z] line after include file
06:40:08 [2020-07-18T10:40:08.915Z] Result of testMethod = 5
06:40:08 [2020-07-18T10:40:08.915Z] End of script
06:40:08 [2020-07-18T10:40:08.915Z] Start of script
06:40:08 [2020-07-18T10:40:08.915Z] include file start
06:40:08 [2020-07-18T10:40:08.915Z] Include file processed
06:40:08 [2020-07-18T10:40:08.915Z] line after include file
06:40:08 [2020-07-18T10:40:08.915Z] Result of testMethod = 5
06:40:09 [2020-07-18T10:40:09.171Z] End of script
06:40:09 [2020-07-18T10:40:09.171Z] Start of script
06:40:09 [2020-07-18T10:40:09.171Z] include file start
06:40:09 [2020-07-18T10:40:09.171Z] Include file processed
06:40:09 [2020-07-18T10:40:09.171Z] line after include file
06:40:09 [2020-07-18T10:40:09.732Z] Start of script
06:40:09 [2020-07-18T10:40:09.732Z] include file start
06:40:09 [2020-07-18T10:40:09.732Z] Include file processed
06:40:09 [2020-07-18T10:40:09.732Z] line after include file
06:40:09 [2020-07-18T10:40:09.732Z] Result of testMethod = 5
06:40:09 [2020-07-18T10:40:09.732Z] End of script
06:40:09 [2020-07-18T10:40:09.732Z] Start of script
06:40:09 [2020-07-18T10:40:09.732Z] include file start
06:40:09 [2020-07-18T10:40:09.732Z] Include file processed
06:40:09 [2020-07-18T10:40:09.732Z] line after include file
06:40:09 [2020-07-18T10:40:09.987Z] Result of testMethod = 5
06:40:09 [2020-07-18T10:40:09.987Z] End of script
06:40:10 [2020-07-18T10:40:10.243Z] Start of script
06:40:10 [2020-07-18T10:40:10.498Z] include file start
06:40:10 [2020-07-18T10:40:10.498Z] Include file processed
06:40:10 [2020-07-18T10:40:10.498Z] line after include file
06:40:10 [2020-07-18T10:40:10.498Z] Result of testMethod = 5
06:40:10 [2020-07-18T10:40:10.498Z] End of script
06:40:10 [2020-07-18T10:40:10.498Z] Start of script
06:40:10 [2020-07-18T10:40:10.498Z] include file start
06:40:10 [2020-07-18T10:40:10.498Z] Include file processed
06:40:10 [2020-07-18T10:40:10.498Z] line after include file
06:40:10 [2020-07-18T10:40:10.754Z] Result of testMethod = 5
06:40:10 [2020-07-18T10:40:10.754Z] End of script
06:40:10 [2020-07-18T10:40:10.754Z] Start of script
06:40:10 [2020-07-18T10:40:10.754Z] include file start
06:40:10 [2020-07-18T10:40:10.754Z] Include file processed
06:40:10 [2020-07-18T10:40:10.754Z] line after include file
06:40:10 [2020-07-18T10:40:10.754Z] Result of testMethod = 5
06:40:11 [2020-07-18T10:40:11.009Z] Start of script
06:40:11 [2020-07-18T10:40:11.265Z] include file start
06:40:11 [2020-07-18T10:40:11.266Z] Include file processed
06:40:11 [2020-07-18T10:40:11.266Z] line after include file
06:40:11 [2020-07-18T10:40:11.266Z] Result of testMethod = 5
06:40:11 [2020-07-18T10:40:11.266Z] End of script
06:40:11 [2020-07-18T10:40:11.827Z] Start of script
06:40:11 [2020-07-18T10:40:11.827Z] include file start
06:40:11 [2020-07-18T10:40:11.827Z] Include file processed
06:40:11 [2020-07-18T10:40:11.827Z] line after include file
06:40:11 [2020-07-18T10:40:11.827Z] Result of testMethod = 5
06:40:11 [2020-07-18T10:40:11.827Z] End of script
06:40:11 [2020-07-18T10:40:11.827Z] Start of script
06:40:11 [2020-07-18T10:40:11.827Z] include file start
06:40:11 [2020-07-18T10:40:11.827Z] Include file processed
06:40:11 [2020-07-18T10:40:11.827Z] line after include file
06:40:12 [2020-07-18T10:40:12.083Z] Result of testMethod = 5
06:40:12 [2020-07-18T10:40:12.083Z] End of script
06:40:12 [2020-07-18T10:40:12.339Z] Start of script
06:40:12 [2020-07-18T10:40:12.339Z] include file start
06:40:12 [2020-07-18T10:40:12.339Z] Include file processed
06:40:12 [2020-07-18T10:40:12.339Z] line after include file
06:40:12 [2020-07-18T10:40:12.594Z] Result of testMethod = 5
06:40:12 [2020-07-18T10:40:12.594Z] End of script
06:40:12 [2020-07-18T10:40:12.594Z] Start of script
06:40:12 [2020-07-18T10:40:12.594Z] include file start
06:40:12 [2020-07-18T10:40:12.594Z] Include file processed
06:40:12 [2020-07-18T10:40:12.594Z] line after include file
06:40:12 [2020-07-18T10:40:12.594Z] Result of testMethod = 5
06:40:13 [2020-07-18T10:40:13.156Z] Start of script
06:40:13 [2020-07-18T10:40:13.156Z] include file start
06:40:13 [2020-07-18T10:40:13.156Z] Include file processed
06:40:13 [2020-07-18T10:40:13.156Z] line after include file
06:40:13 [2020-07-18T10:40:13.156Z] Result of testMethod = 5
06:40:13 [2020-07-18T10:40:13.156Z] End of script
06:40:13 [2020-07-18T10:40:13.156Z] Start of script
06:40:13 [2020-07-18T10:40:13.156Z] include file start
06:40:13 [2020-07-18T10:40:13.156Z] Include file processed
06:40:13 [2020-07-18T10:40:13.156Z] line after include file
06:40:13 [2020-07-18T10:40:13.412Z] Result of testMethod = 5
06:40:13 [2020-07-18T10:40:13.412Z] End of script
06:40:13 [2020-07-18T10:40:13.412Z] Start of script
06:40:13 [2020-07-18T10:40:13.412Z] include file start
06:40:13 [2020-07-18T10:40:13.412Z] Include file processed
06:40:13 [2020-07-18T10:40:13.412Z] line after include file
06:40:13 [2020-07-18T10:40:13.412Z] Result of testMethod = 5
06:40:13 [2020-07-18T10:40:13.412Z] End of script
06:40:13 [2020-07-18T10:40:13.668Z] Start of script
06:40:13 [2020-07-18T10:40:13.668Z] include file start
06:40:13 [2020-07-18T10:40:13.668Z] Include file processed
06:40:13 [2020-07-18T10:40:13.668Z] line after include file
06:40:13 [2020-07-18T10:40:13.668Z] Result of testMethod = 5
06:40:13 [2020-07-18T10:40:13.668Z] End of script
06:40:13 [2020-07-18T10:40:13.924Z] Start of script
06:40:13 [2020-07-18T10:40:13.924Z] include file start
06:40:13 [2020-07-18T10:40:13.924Z] Include file processed
06:40:13 [2020-07-18T10:40:13.924Z] line after include file
06:40:14 [2020-07-18T10:40:14.181Z] Start of script
06:40:14 [2020-07-18T10:40:14.440Z] include file start
06:40:14 [2020-07-18T10:40:14.440Z] Include file processed
06:40:14 [2020-07-18T10:40:14.440Z] line after include file
06:40:14 [2020-07-18T10:40:14.440Z] Result of testMethod = 5
06:40:14 [2020-07-18T10:40:14.440Z] End of script
06:40:14 [2020-07-18T10:40:14.440Z] Start of script
06:40:14 [2020-07-18T10:40:14.440Z] include file start
06:40:14 [2020-07-18T10:40:14.440Z] Include file processed
06:40:14 [2020-07-18T10:40:14.440Z] line after include file
06:40:14 [2020-07-18T10:40:14.440Z] Result of testMethod = 5
06:40:14 [2020-07-18T10:40:14.702Z] Start of script
06:40:14 [2020-07-18T10:40:14.702Z] include file start
06:40:14 [2020-07-18T10:40:14.702Z] Include file processed
06:40:14 [2020-07-18T10:40:14.702Z] line after include file
06:40:14 [2020-07-18T10:40:14.702Z] Result of testMethod = 5
06:40:14 [2020-07-18T10:40:14.961Z] End of script
06:40:14 [2020-07-18T10:40:14.962Z] Start of script
06:40:14 [2020-07-18T10:40:14.962Z] include file start
06:40:14 [2020-07-18T10:40:14.962Z] Include file processed
06:40:14 [2020-07-18T10:40:14.962Z] line after include file
06:40:15 [2020-07-18T10:40:15.216Z] Result of testMethod = 5
06:40:15 [2020-07-18T10:40:15.217Z] End of script
06:40:15 [2020-07-18T10:40:15.217Z] Start of script
06:40:15 [2020-07-18T10:40:15.217Z] include file start
06:40:15 [2020-07-18T10:40:15.217Z] Include file processed
06:40:15 [2020-07-18T10:40:15.217Z] line after include file
06:40:15 [2020-07-18T10:40:15.472Z] Result of testMethod = 5
06:40:15 [2020-07-18T10:40:15.472Z] End of script
06:40:15 [2020-07-18T10:40:15.728Z] Start of script
06:40:15 [2020-07-18T10:40:15.728Z] include file start
06:40:15 [2020-07-18T10:40:15.728Z] Include file processed
06:40:15 [2020-07-18T10:40:15.728Z] line after include file
06:40:15 [2020-07-18T10:40:15.728Z] Result of testMethod = 5
06:40:15 [2020-07-18T10:40:15.728Z] End of script
06:40:15 [2020-07-18T10:40:15.728Z] Start of script
06:40:15 [2020-07-18T10:40:15.728Z] include file start
06:40:15 [2020-07-18T10:40:15.728Z] Include file processed
06:40:15 [2020-07-18T10:40:15.728Z] line after include file
06:40:15 [2020-07-18T10:40:15.728Z] Result of testMethod = 5
06:40:16 [2020-07-18T10:40:16.290Z] Start of script
06:40:16 [2020-07-18T10:40:16.290Z] include file start
06:40:16 [2020-07-18T10:40:16.290Z] Include file processed
06:40:16 [2020-07-18T10:40:16.290Z] line after include file
06:40:16 [2020-07-18T10:40:16.290Z] Result of testMethod = 5
06:40:16 [2020-07-18T10:40:16.290Z] End of script
06:40:16 [2020-07-18T10:40:16.290Z] Start of script
06:40:16 [2020-07-18T10:40:16.290Z] include file start
06:40:16 [2020-07-18T10:40:16.290Z] Include file processed
06:40:16 [2020-07-18T10:40:16.290Z] line after include file
06:40:16 [2020-07-18T10:40:16.290Z] Result of testMethod = 5
06:40:16 [2020-07-18T10:40:16.850Z] Start of script
06:40:16 [2020-07-18T10:40:16.850Z] include file start
06:40:16 [2020-07-18T10:40:16.850Z] Include file processed
06:40:16 [2020-07-18T10:40:16.850Z] line after include file
06:40:16 [2020-07-18T10:40:16.850Z] Result of testMethod = 5
06:40:16 [2020-07-18T10:40:16.850Z] End of script
06:40:17 [2020-07-18T10:40:17.106Z] Start of script
06:40:17 [2020-07-18T10:40:17.106Z] include file start
06:40:17 [2020-07-18T10:40:17.106Z] Include file processed
06:40:17 [2020-07-18T10:40:17.106Z] line after include file
06:40:17 [2020-07-18T10:40:17.361Z] Result of testMethod = 5
06:40:17 [2020-07-18T10:40:17.361Z] End of script
06:40:17 [2020-07-18T10:40:17.361Z] Start of script
06:40:17 [2020-07-18T10:40:17.361Z] include file start
06:40:17 [2020-07-18T10:40:17.361Z] Include file processed
06:40:17 [2020-07-18T10:40:17.361Z] line after include file
06:40:17 [2020-07-18T10:40:17.361Z] Result of testMethod = 5
06:40:17 [2020-07-18T10:40:17.361Z] End of script
06:40:17 [2020-07-18T10:40:17.616Z] Tests run: 42, Failures: 0, Errors: 0, Skipped: 0, Time elapsed: 10.893 s - in org.eclipse.ease.lang.javascript.rhino.RhinoDebugTest
06:40:17 [2020-07-18T10:40:17.616Z] disconnectProcessInSuspendedState(org.eclipse.ease.lang.javascript.rhino.RhinoDebugTest)  Time elapsed: 0.247 s
06:40:17 [2020-07-18T10:40:17.616Z] stepReturnIncludeCommand(org.eclipse.ease.lang.javascript.rhino.RhinoDebugTest)  Time elapsed: 0.209 s
06:40:17 [2020-07-18T10:40:17.616Z] arrayVariableSorting(org.eclipse.ease.lang.javascript.rhino.RhinoDebugTest)  Time elapsed: 0.307 s
06:40:17 [2020-07-18T10:40:17.616Z] stepOverOnDebugTarget(org.eclipse.ease.lang.javascript.rhino.RhinoDebugTest)  Time elapsed: 0.307 s
06:40:17 [2020-07-18T10:40:17.616Z] hasDebugTarget(org.eclipse.ease.lang.javascript.rhino.RhinoDebugTest)  Time elapsed: 0.104 s
06:40:17 [2020-07-18T10:40:17.616Z] disconnectThreadInSuspendedState(org.eclipse.ease.lang.javascript.rhino.RhinoDebugTest)  Time elapsed: 0.205 s
06:40:17 [2020-07-18T10:40:17.616Z] stepReturnOnDebugTarget(org.eclipse.ease.lang.javascript.rhino.RhinoDebugTest)  Time elapsed: 0.307 s
06:40:17 [2020-07-18T10:40:17.617Z] nullVariable(org.eclipse.ease.lang.javascript.rhino.RhinoDebugTest)  Time elapsed: 0.305 s
06:40:17 [2020-07-18T10:40:17.617Z] stepOverOnStackFrame(org.eclipse.ease.lang.javascript.rhino.RhinoDebugTest)  Time elapsed: 0.307 s
06:40:17 [2020-07-18T10:40:17.617Z] resumeOnDebugTarget(org.eclipse.ease.lang.javascript.rhino.RhinoDebugTest)  Time elapsed: 0.206 s
06:40:17 [2020-07-18T10:40:17.617Z] modifyVariableKeepingType(org.eclipse.ease.lang.javascript.rhino.RhinoDebugTest)  Time elapsed: 0.405 s
06:40:17 [2020-07-18T10:40:17.617Z] resumeOnLastIncludeLine(org.eclipse.ease.lang.javascript.rhino.RhinoDebugTest)  Time elapsed: 0.206 s
06:40:17 [2020-07-18T10:40:17.617Z] stepReturnOnStackFrame(org.eclipse.ease.lang.javascript.rhino.RhinoDebugTest)  Time elapsed: 0.306 s
06:40:17 [2020-07-18T10:40:17.617Z] terminateStackFrameInSuspendedState(org.eclipse.ease.lang.javascript.rhino.RhinoDebugTest)  Time elapsed: 0.206 s
06:40:17 [2020-07-18T10:40:17.617Z] breakpointLocation(org.eclipse.ease.lang.javascript.rhino.RhinoDebugTest)  Time elapsed: 0.206 s
06:40:17 [2020-07-18T10:40:17.617Z] stepReturnOnThread(org.eclipse.ease.lang.javascript.rhino.RhinoDebugTest)  Time elapsed: 0.307 s
06:40:17 [2020-07-18T10:40:17.617Z] javaClassVariable(org.eclipse.ease.lang.javascript.rhino.RhinoDebugTest)  Time elapsed: 0.307 s
06:40:17 [2020-07-18T10:40:17.617Z] stepIntoOnThread(org.eclipse.ease.lang.javascript.rhino.RhinoDebugTest)  Time elapsed: 0.306 s
06:40:17 [2020-07-18T10:40:17.617Z] terminateThreadInSuspendedState(org.eclipse.ease.lang.javascript.rhino.RhinoDebugTest)  Time elapsed: 0.206 s
06:40:17 [2020-07-18T10:40:17.617Z] resumeOnThread(org.eclipse.ease.lang.javascript.rhino.RhinoDebugTest)  Time elapsed: 0.205 s
06:40:17 [2020-07-18T10:40:17.617Z] stepIntoOnStackFrame(org.eclipse.ease.lang.javascript.rhino.RhinoDebugTest)  Time elapsed: 0.306 s
06:40:17 [2020-07-18T10:40:17.617Z] terminateProcessInSuspendedState(org.eclipse.ease.lang.javascript.rhino.RhinoDebugTest)  Time elapsed: 0.205 s
06:40:17 [2020-07-18T10:40:17.617Z] stepOverOnProcess(org.eclipse.ease.lang.javascript.rhino.RhinoDebugTest)  Time elapsed: 0.306 s
06:40:17 [2020-07-18T10:40:17.617Z] nativeArrayVariable(org.eclipse.ease.lang.javascript.rhino.RhinoDebugTest)  Time elapsed: 0.306 s
06:40:17 [2020-07-18T10:40:17.617Z] disconnectDebugTargetInSuspendedState(org.eclipse.ease.lang.javascript.rhino.RhinoDebugTest)  Time elapsed: 0.205 s
06:40:17 [2020-07-18T10:40:17.617Z] stepIntoOnProcess(org.eclipse.ease.lang.javascript.rhino.RhinoDebugTest)  Time elapsed: 0.306 s
06:40:17 [2020-07-18T10:40:17.617Z] terminatedState(org.eclipse.ease.lang.javascript.rhino.RhinoDebugTest)  Time elapsed: 0.104 s
06:40:17 [2020-07-18T10:40:17.617Z] stepOverIncludeCommand(org.eclipse.ease.lang.javascript.rhino.RhinoDebugTest)  Time elapsed: 0.305 s
06:40:17 [2020-07-18T10:40:17.617Z] innerScopeVariableBeforeOuterScopeVariable(org.eclipse.ease.lang.javascript.rhino.RhinoDebugTest)  Time elapsed: 0.306 s
06:40:17 [2020-07-18T10:40:17.617Z] stepIntoIncludeCommand(org.eclipse.ease.lang.javascript.rhino.RhinoDebugTest)  Time elapsed: 0.304 s
06:40:17 [2020-07-18T10:40:17.617Z] primitiveStringVariable(org.eclipse.ease.lang.javascript.rhino.RhinoDebugTest)  Time elapsed: 0.305 s
06:40:17 [2020-07-18T10:40:17.617Z] resumeOnProcess(org.eclipse.ease.lang.javascript.rhino.RhinoDebugTest)  Time elapsed: 0.205 s
06:40:17 [2020-07-18T10:40:17.617Z] stepIntoOnDebugTarget(org.eclipse.ease.lang.javascript.rhino.RhinoDebugTest)  Time elapsed: 0.306 s
06:40:17 [2020-07-18T10:40:17.617Z] stepOverOnThread(org.eclipse.ease.lang.javascript.rhino.RhinoDebugTest)  Time elapsed: 0.306 s
06:40:17 [2020-07-18T10:40:17.617Z] suspendedState(org.eclipse.ease.lang.javascript.rhino.RhinoDebugTest)  Time elapsed: 0.205 s
06:40:17 [2020-07-18T10:40:17.617Z] primitiveDoubleVariable(org.eclipse.ease.lang.javascript.rhino.RhinoDebugTest)  Time elapsed: 0.305 s
06:40:17 [2020-07-18T10:40:17.617Z] resumeOnStackFrame(org.eclipse.ease.lang.javascript.rhino.RhinoDebugTest)  Time elapsed: 0.205 s
06:40:17 [2020-07-18T10:40:17.617Z] nativeObjectVariable(org.eclipse.ease.lang.javascript.rhino.RhinoDebugTest)  Time elapsed: 0.305 s
06:40:17 [2020-07-18T10:40:17.617Z] terminateDebugTargetInSuspendedState(org.eclipse.ease.lang.javascript.rhino.RhinoDebugTest)  Time elapsed: 0.211 s
06:40:17 [2020-07-18T10:40:17.617Z] disconnectStackFrameInSuspendedState(org.eclipse.ease.lang.javascript.rhino.RhinoDebugTest)  Time elapsed: 0.206 s
06:40:17 [2020-07-18T10:40:17.617Z] stepReturnOnProcess(org.eclipse.ease.lang.javascript.rhino.RhinoDebugTest)  Time elapsed: 0.305 s
06:40:17 [2020-07-18T10:40:17.617Z] evaluateWatchExpression(org.eclipse.ease.lang.javascript.rhino.RhinoDebugTest)  Time elapsed: 0.207 s
06:40:17 [2020-07-18T10:40:17.617Z] 
06:40:17 [2020-07-18T10:40:17.617Z] Results:
06:40:17 [2020-07-18T10:40:17.617Z] 
06:40:17 [2020-07-18T10:40:17.617Z] Tests run: 70, Failures: 0, Errors: 0, Skipped: 0
06:40:17 [2020-07-18T10:40:17.617Z] 
06:40:18 [2020-07-18T10:40:18.178Z] [INFO] All tests passed!
06:40:18 [2020-07-18T10:40:18.178Z] [INFO] 
06:40:18 [2020-07-18T10:40:18.178Z] [INFO] --- maven-install-plugin:2.3.1:install (default-install) @ org.eclipse.ease.lang.javascript.rhino.test ---
06:40:18 [2020-07-18T10:40:18.178Z] [INFO] Installing /home/jenkins/agent/workspace/ease.verify.core.target.2019-12/tests/org.eclipse.ease.lang.javascript.rhino.test/target/org.eclipse.ease.lang.javascript.rhino.test-0.8.0-SNAPSHOT.jar to /home/jenkins/.m2/repository/org/eclipse/ease/org.eclipse.ease.lang.javascript.rhino.test/0.8.0-SNAPSHOT/org.eclipse.ease.lang.javascript.rhino.test-0.8.0-SNAPSHOT.jar
06:40:18 [2020-07-18T10:40:18.178Z] [INFO] Installing /home/jenkins/agent/workspace/ease.verify.core.target.2019-12/tests/org.eclipse.ease.lang.javascript.rhino.test/pom.xml to /home/jenkins/.m2/repository/org/eclipse/ease/org.eclipse.ease.lang.javascript.rhino.test/0.8.0-SNAPSHOT/org.eclipse.ease.lang.javascript.rhino.test-0.8.0-SNAPSHOT.pom
06:40:18 [2020-07-18T10:40:18.178Z] [INFO] Installing /home/jenkins/agent/workspace/ease.verify.core.target.2019-12/tests/org.eclipse.ease.lang.javascript.rhino.test/target/org.eclipse.ease.lang.javascript.rhino.test-0.8.0-SNAPSHOT-sources.jar to /home/jenkins/.m2/repository/org/eclipse/ease/org.eclipse.ease.lang.javascript.rhino.test/0.8.0-SNAPSHOT/org.eclipse.ease.lang.javascript.rhino.test-0.8.0-SNAPSHOT-sources.jar
06:40:18 [2020-07-18T10:40:18.178Z] [INFO] Installing /home/jenkins/agent/workspace/ease.verify.core.target.2019-12/tests/org.eclipse.ease.lang.javascript.rhino.test/target/p2content.xml to /home/jenkins/.m2/repository/org/eclipse/ease/org.eclipse.ease.lang.javascript.rhino.test/0.8.0-SNAPSHOT/org.eclipse.ease.lang.javascript.rhino.test-0.8.0-SNAPSHOT-p2metadata.xml
06:40:18 [2020-07-18T10:40:18.178Z] [INFO] Installing /home/jenkins/agent/workspace/ease.verify.core.target.2019-12/tests/org.eclipse.ease.lang.javascript.rhino.test/target/p2artifacts.xml to /home/jenkins/.m2/repository/org/eclipse/ease/org.eclipse.ease.lang.javascript.rhino.test/0.8.0-SNAPSHOT/org.eclipse.ease.lang.javascript.rhino.test-0.8.0-SNAPSHOT-p2artifacts.xml
06:40:18 [2020-07-18T10:40:18.178Z] [INFO] Installing /home/jenkins/agent/workspace/ease.verify.core.target.2019-12/tests/org.eclipse.ease.lang.javascript.rhino.test/target/p2content.xml to /home/jenkins/.m2/repository/org/eclipse/ease/org.eclipse.ease.lang.javascript.rhino.test/0.8.0-SNAPSHOT/org.eclipse.ease.lang.javascript.rhino.test-0.8.0-SNAPSHOT-p2metadata.xml
06:40:18 [2020-07-18T10:40:18.178Z] [INFO] Installing /home/jenkins/agent/workspace/ease.verify.core.target.2019-12/tests/org.eclipse.ease.lang.javascript.rhino.test/target/p2artifacts.xml to /home/jenkins/.m2/repository/org/eclipse/ease/org.eclipse.ease.lang.javascript.rhino.test/0.8.0-SNAPSHOT/org.eclipse.ease.lang.javascript.rhino.test-0.8.0-SNAPSHOT-p2artifacts.xml
06:40:18 [2020-07-18T10:40:18.178Z] [INFO] 
06:40:18 [2020-07-18T10:40:18.178Z] [INFO] --- tycho-p2-plugin:1.3.0:update-local-index (default-update-local-index) @ org.eclipse.ease.lang.javascript.rhino.test ---
06:40:18 [2020-07-18T10:40:18.178Z] [INFO] 
06:40:18 [2020-07-18T10:40:18.178Z] [INFO] -------< org.eclipse.ease:org.eclipse.ease.lang.javascript.test >-------
06:40:18 [2020-07-18T10:40:18.178Z] [INFO] Building org.eclipse.ease.lang.javascript.test 0.8.0-SNAPSHOT    [41/48]
06:40:18 [2020-07-18T10:40:18.178Z] [INFO] ------------------------[ eclipse-test-plugin ]-------------------------
06:40:18 [2020-07-18T10:40:18.178Z] [INFO] 
06:40:18 [2020-07-18T10:40:18.178Z] [INFO] --- maven-clean-plugin:2.5:clean (default-clean) @ org.eclipse.ease.lang.javascript.test ---
06:40:18 [2020-07-18T10:40:18.178Z] [INFO] 
06:40:18 [2020-07-18T10:40:18.178Z] [INFO] --- tycho-packaging-plugin:1.3.0:build-qualifier (default-build-qualifier) @ org.eclipse.ease.lang.javascript.test ---
06:40:18 [2020-07-18T10:40:18.178Z] [INFO] The project's OSGi version is 0.8.0.I201910171213
06:40:18 [2020-07-18T10:40:18.178Z] [INFO] 
06:40:18 [2020-07-18T10:40:18.178Z] [INFO] --- tycho-packaging-plugin:1.3.0:validate-id (default-validate-id) @ org.eclipse.ease.lang.javascript.test ---
06:40:18 [2020-07-18T10:40:18.178Z] [INFO] 
06:40:18 [2020-07-18T10:40:18.178Z] [INFO] --- tycho-packaging-plugin:1.3.0:validate-version (default-validate-version) @ org.eclipse.ease.lang.javascript.test ---
06:40:18 [2020-07-18T10:40:18.178Z] [INFO] 
06:40:18 [2020-07-18T10:40:18.178Z] [INFO] >>> maven-javadoc-plugin:2.9.1:javadoc (build-docs) > generate-sources @ org.eclipse.ease.lang.javascript.test >>>
06:40:18 [2020-07-18T10:40:18.178Z] [INFO] 
06:40:18 [2020-07-18T10:40:18.178Z] [INFO] --- tycho-packaging-plugin:1.3.0:build-qualifier (default-build-qualifier) @ org.eclipse.ease.lang.javascript.test ---
06:40:18 [2020-07-18T10:40:18.179Z] [INFO] The project's OSGi version is 0.8.0.I201910171213
06:40:18 [2020-07-18T10:40:18.179Z] [INFO] 
06:40:18 [2020-07-18T10:40:18.179Z] [INFO] --- tycho-packaging-plugin:1.3.0:validate-id (default-validate-id) @ org.eclipse.ease.lang.javascript.test ---
06:40:18 [2020-07-18T10:40:18.179Z] [INFO] 
06:40:18 [2020-07-18T10:40:18.179Z] [INFO] --- tycho-packaging-plugin:1.3.0:validate-version (default-validate-version) @ org.eclipse.ease.lang.javascript.test ---
06:40:18 [2020-07-18T10:40:18.179Z] [INFO] 
06:40:18 [2020-07-18T10:40:18.179Z] [INFO] <<< maven-javadoc-plugin:2.9.1:javadoc (build-docs) < generate-sources @ org.eclipse.ease.lang.javascript.test <<<
06:40:18 [2020-07-18T10:40:18.179Z] [INFO] 
06:40:18 [2020-07-18T10:40:18.179Z] [INFO] 
06:40:18 [2020-07-18T10:40:18.179Z] [INFO] --- maven-javadoc-plugin:2.9.1:javadoc (build-docs) @ org.eclipse.ease.lang.javascript.test ---
06:40:18 [2020-07-18T10:40:18.434Z] [ERROR] Error fetching link: http://help.eclipse.org/oxygen/topic/org.eclipse.platform.doc.isv/reference/api/package-list. Ignored it.
06:40:19 [2020-07-18T10:40:19.798Z] [INFO] 
06:40:19 [2020-07-18T10:40:19.798Z] Loading source files for package org.eclipse.ease.lang.javascript...
06:40:19 [2020-07-18T10:40:19.798Z] Constructing Javadoc information...
06:40:19 [2020-07-18T10:40:19.798Z] WARNING: Cannot open location "/home/jenkins/agent/workspace/ease.verify.core.target.2019-12/tests/org.eclipse.ease.lang.javascript.test/target/javadoc-bundle-options/package-list"
06:40:19 [2020-07-18T10:40:19.798Z] No plugin definition found, skipping
06:40:19 [2020-07-18T10:40:19.798Z] No plugin definition found, skipping
06:40:19 [2020-07-18T10:40:19.798Z] [WARNING] Javadoc Warnings
06:40:19 [2020-07-18T10:40:19.798Z] [WARNING] Picked up JAVA_TOOL_OPTIONS: -Dmaven.ext.class.path="/home/jenkins/agent/workspace/ease.verify.core.target.2019-12@tmp/withMaven53839bc7/pipeline-maven-spy.jar" -Dorg.jenkinsci.plugins.pipeline.maven.reportsFolder="/home/jenkins/agent/workspace/ease.verify.core.target.2019-12@tmp/withMaven53839bc7"
06:40:19 [2020-07-18T10:40:19.798Z] [INFO] 
06:40:19 [2020-07-18T10:40:19.798Z] [INFO] --- build-helper-maven-plugin:1.9.1:add-resource (add_help) @ org.eclipse.ease.lang.javascript.test ---
06:40:19 [2020-07-18T10:40:19.798Z] [INFO] 
06:40:19 [2020-07-18T10:40:19.798Z] [INFO] --- maven-resources-plugin:2.4.3:resources (default-resources) @ org.eclipse.ease.lang.javascript.test ---
06:40:19 [2020-07-18T10:40:19.798Z] [INFO] Using 'UTF-8' encoding to copy filtered resources.
06:40:19 [2020-07-18T10:40:19.798Z] [INFO] skip non existing resourceDirectory /home/jenkins/agent/workspace/ease.verify.core.target.2019-12/tests/org.eclipse.ease.lang.javascript.test/src/main/resources
06:40:19 [2020-07-18T10:40:19.798Z] [INFO] skip non existing resourceDirectory /home/jenkins/agent/workspace/ease.verify.core.target.2019-12/tests/org.eclipse.ease.lang.javascript.test/help
06:40:19 [2020-07-18T10:40:19.798Z] [INFO] 
06:40:19 [2020-07-18T10:40:19.798Z] [INFO] --- tycho-compiler-plugin:1.3.0:compile (default-compile) @ org.eclipse.ease.lang.javascript.test ---
06:40:19 [2020-07-18T10:40:19.798Z] [INFO] Compiling 2 source files to /home/jenkins/agent/workspace/ease.verify.core.target.2019-12/tests/org.eclipse.ease.lang.javascript.test/target/classes
06:40:19 [2020-07-18T10:40:19.798Z] [INFO] 
06:40:19 [2020-07-18T10:40:19.798Z] [INFO] --- maven-resources-plugin:2.4.3:testResources (default-testResources) @ org.eclipse.ease.lang.javascript.test ---
06:40:19 [2020-07-18T10:40:19.798Z] [INFO] Using 'UTF-8' encoding to copy filtered resources.
06:40:19 [2020-07-18T10:40:19.798Z] [INFO] skip non existing resourceDirectory /home/jenkins/agent/workspace/ease.verify.core.target.2019-12/tests/org.eclipse.ease.lang.javascript.test/src/test/resources
06:40:19 [2020-07-18T10:40:19.798Z] [INFO] 
06:40:19 [2020-07-18T10:40:19.798Z] [INFO] --- tycho-source-plugin:1.3.0:plugin-source (plugin-source) @ org.eclipse.ease.lang.javascript.test ---
06:40:19 [2020-07-18T10:40:19.798Z] [WARNING] Bundle-Vendor header not found in /home/jenkins/agent/workspace/ease.verify.core.target.2019-12/tests/org.eclipse.ease.lang.javascript.test/META-INF/MANIFEST.MF, fallback to 'unknown' for source bundle
06:40:19 [2020-07-18T10:40:19.798Z] [INFO] Building jar: /home/jenkins/agent/workspace/ease.verify.core.target.2019-12/tests/org.eclipse.ease.lang.javascript.test/target/org.eclipse.ease.lang.javascript.test-0.8.0-SNAPSHOT-sources.jar
06:40:19 [2020-07-18T10:40:19.798Z] [INFO] 
06:40:19 [2020-07-18T10:40:19.799Z] [INFO] --- target-platform-configuration:1.3.0:target-platform (default-target-platform) @ org.eclipse.ease.lang.javascript.test ---
06:40:19 [2020-07-18T10:40:19.799Z] [INFO] 
06:40:19 [2020-07-18T10:40:19.799Z] [INFO] --- tycho-packaging-plugin:1.3.0:package-plugin (default-package-plugin) @ org.eclipse.ease.lang.javascript.test ---
06:40:19 [2020-07-18T10:40:19.799Z] [INFO] Building jar: /home/jenkins/agent/workspace/ease.verify.core.target.2019-12/tests/org.eclipse.ease.lang.javascript.test/target/org.eclipse.ease.lang.javascript.test-0.8.0-SNAPSHOT.jar
06:40:19 [2020-07-18T10:40:19.799Z] [INFO] 
06:40:19 [2020-07-18T10:40:19.799Z] [INFO] --- tycho-p2-plugin:1.3.0:p2-metadata-default (default-p2-metadata-default) @ org.eclipse.ease.lang.javascript.test ---
06:40:19 [2020-07-18T10:40:19.799Z] [INFO] 
06:40:19 [2020-07-18T10:40:19.799Z] [INFO] --- tycho-source-feature-plugin:1.3.0:source-feature (source-feature) @ org.eclipse.ease.lang.javascript.test ---
06:40:19 [2020-07-18T10:40:19.799Z] [INFO] 
06:40:19 [2020-07-18T10:40:19.799Z] [INFO] --- tycho-p2-plugin:1.3.0:p2-metadata (attached-p2-metadata) @ org.eclipse.ease.lang.javascript.test ---
06:40:19 [2020-07-18T10:40:19.799Z] [INFO] 
06:40:19 [2020-07-18T10:40:19.799Z] [INFO] --- tycho-surefire-plugin:1.3.0:test (default-test) @ org.eclipse.ease.lang.javascript.test ---
06:40:19 [2020-07-18T10:40:19.799Z] [INFO] Expected eclipse log file: /home/jenkins/agent/workspace/ease.verify.core.target.2019-12/tests/org.eclipse.ease.lang.javascript.test/target/work/data/.metadata/.log
06:40:19 [2020-07-18T10:40:19.799Z] [INFO] Command line:
06:40:19 [2020-07-18T10:40:19.799Z] 	[/opt/tools/java/oracle/jdk-8/1.8.0_202/jre/bin/java, -Dosgi.noShutdown=false, -Dosgi.os=linux, -Dosgi.ws=gtk, -Dosgi.arch=x86_64, -Dosgi.clean=true, -jar, /home/jenkins/.m2/repository/p2/osgi/bundle/org.eclipse.equinox.launcher/1.5.700.v20200207-2156/org.eclipse.equinox.launcher-1.5.700.v20200207-2156.jar, -data, /home/jenkins/agent/workspace/ease.verify.core.target.2019-12/tests/org.eclipse.ease.lang.javascript.test/target/work/data, -install, /home/jenkins/agent/workspace/ease.verify.core.target.2019-12/tests/org.eclipse.ease.lang.javascript.test/target/work, -configuration, /home/jenkins/agent/workspace/ease.verify.core.target.2019-12/tests/org.eclipse.ease.lang.javascript.test/target/work/configuration, -application, org.eclipse.tycho.surefire.osgibooter.headlesstest, -testproperties, /home/jenkins/agent/workspace/ease.verify.core.target.2019-12/tests/org.eclipse.ease.lang.javascript.test/target/surefire.properties]
06:40:19 [2020-07-18T10:40:19.799Z] Picked up JAVA_TOOL_OPTIONS: -Dmaven.ext.class.path="/home/jenkins/agent/workspace/ease.verify.core.target.2019-12@tmp/withMaven53839bc7/pipeline-maven-spy.jar" -Dorg.jenkinsci.plugins.pipeline.maven.reportsFolder="/home/jenkins/agent/workspace/ease.verify.core.target.2019-12@tmp/withMaven53839bc7" 
06:40:21 [2020-07-18T10:40:21.238Z] Running org.eclipse.ease.lang.javascript.JavaScriptCodeFactoryTest
06:40:21 [2020-07-18T10:40:21.238Z] Tests run: 1, Failures: 0, Errors: 0, Skipped: 0, Time elapsed: 0.07 s - in org.eclipse.ease.lang.javascript.JavaScriptCodeFactoryTest
06:40:21 [2020-07-18T10:40:21.238Z] testCommentCreator(org.eclipse.ease.lang.javascript.JavaScriptCodeFactoryTest)  Time elapsed: 0.004 s
06:40:21 [2020-07-18T10:40:21.238Z] Running org.eclipse.ease.lang.javascript.JavaScriptCompletionContextTest
06:40:21 [2020-07-18T10:40:21.238Z] Tests run: 8, Failures: 0, Errors: 0, Skipped: 0, Time elapsed: 0.18 s - in org.eclipse.ease.lang.javascript.JavaScriptCompletionContextTest
06:40:21 [2020-07-18T10:40:21.238Z] verifyStaticClassTypes(org.eclipse.ease.lang.javascript.JavaScriptCompletionContextTest)  Time elapsed: 0.004 s
06:40:21 [2020-07-18T10:40:21.238Z] verifyClassInstanceTypes(org.eclipse.ease.lang.javascript.JavaScriptCompletionContextTest)  Time elapsed: 0.031 s
06:40:21 [2020-07-18T10:40:21.238Z] verifyTypesForScriptEngine(org.eclipse.ease.lang.javascript.JavaScriptCompletionContextTest)  Time elapsed: 0.142 s
06:40:21 [2020-07-18T10:40:21.238Z] verifyPackageTypes(org.eclipse.ease.lang.javascript.JavaScriptCompletionContextTest)  Time elapsed: 0 s
06:40:21 [2020-07-18T10:40:21.238Z] definedVariableTypes(org.eclipse.ease.lang.javascript.JavaScriptCompletionContextTest)  Time elapsed: 0.001 s
06:40:21 [2020-07-18T10:40:21.238Z] verifyStringLiteralTypes(org.eclipse.ease.lang.javascript.JavaScriptCompletionContextTest)  Time elapsed: 0 s
06:40:21 [2020-07-18T10:40:21.238Z] verifyUnknownTypes(org.eclipse.ease.lang.javascript.JavaScriptCompletionContextTest)  Time elapsed: 0 s
06:40:21 [2020-07-18T10:40:21.238Z] verifyNoneTypes(org.eclipse.ease.lang.javascript.JavaScriptCompletionContextTest)  Time elapsed: 0 s
06:40:21 [2020-07-18T10:40:21.238Z] 
06:40:21 [2020-07-18T10:40:21.238Z] Results:
06:40:21 [2020-07-18T10:40:21.238Z] 
06:40:21 [2020-07-18T10:40:21.238Z] Tests run: 9, Failures: 0, Errors: 0, Skipped: 0
06:40:21 [2020-07-18T10:40:21.238Z] 
06:40:22 [2020-07-18T10:40:22.163Z] [INFO] All tests passed!
06:40:22 [2020-07-18T10:40:22.163Z] [INFO] 
06:40:22 [2020-07-18T10:40:22.163Z] [INFO] --- maven-install-plugin:2.3.1:install (default-install) @ org.eclipse.ease.lang.javascript.test ---
06:40:22 [2020-07-18T10:40:22.164Z] [INFO] Installing /home/jenkins/agent/workspace/ease.verify.core.target.2019-12/tests/org.eclipse.ease.lang.javascript.test/target/org.eclipse.ease.lang.javascript.test-0.8.0-SNAPSHOT.jar to /home/jenkins/.m2/repository/org/eclipse/ease/org.eclipse.ease.lang.javascript.test/0.8.0-SNAPSHOT/org.eclipse.ease.lang.javascript.test-0.8.0-SNAPSHOT.jar
06:40:22 [2020-07-18T10:40:22.164Z] [INFO] Installing /home/jenkins/agent/workspace/ease.verify.core.target.2019-12/tests/org.eclipse.ease.lang.javascript.test/pom.xml to /home/jenkins/.m2/repository/org/eclipse/ease/org.eclipse.ease.lang.javascript.test/0.8.0-SNAPSHOT/org.eclipse.ease.lang.javascript.test-0.8.0-SNAPSHOT.pom
06:40:22 [2020-07-18T10:40:22.164Z] [INFO] Installing /home/jenkins/agent/workspace/ease.verify.core.target.2019-12/tests/org.eclipse.ease.lang.javascript.test/target/org.eclipse.ease.lang.javascript.test-0.8.0-SNAPSHOT-sources.jar to /home/jenkins/.m2/repository/org/eclipse/ease/org.eclipse.ease.lang.javascript.test/0.8.0-SNAPSHOT/org.eclipse.ease.lang.javascript.test-0.8.0-SNAPSHOT-sources.jar
06:40:22 [2020-07-18T10:40:22.164Z] [INFO] Installing /home/jenkins/agent/workspace/ease.verify.core.target.2019-12/tests/org.eclipse.ease.lang.javascript.test/target/p2content.xml to /home/jenkins/.m2/repository/org/eclipse/ease/org.eclipse.ease.lang.javascript.test/0.8.0-SNAPSHOT/org.eclipse.ease.lang.javascript.test-0.8.0-SNAPSHOT-p2metadata.xml
06:40:22 [2020-07-18T10:40:22.164Z] [INFO] Installing /home/jenkins/agent/workspace/ease.verify.core.target.2019-12/tests/org.eclipse.ease.lang.javascript.test/target/p2artifacts.xml to /home/jenkins/.m2/repository/org/eclipse/ease/org.eclipse.ease.lang.javascript.test/0.8.0-SNAPSHOT/org.eclipse.ease.lang.javascript.test-0.8.0-SNAPSHOT-p2artifacts.xml
06:40:22 [2020-07-18T10:40:22.164Z] [INFO] Installing /home/jenkins/agent/workspace/ease.verify.core.target.2019-12/tests/org.eclipse.ease.lang.javascript.test/target/p2content.xml to /home/jenkins/.m2/repository/org/eclipse/ease/org.eclipse.ease.lang.javascript.test/0.8.0-SNAPSHOT/org.eclipse.ease.lang.javascript.test-0.8.0-SNAPSHOT-p2metadata.xml
06:40:22 [2020-07-18T10:40:22.164Z] [INFO] Installing /home/jenkins/agent/workspace/ease.verify.core.target.2019-12/tests/org.eclipse.ease.lang.javascript.test/target/p2artifacts.xml to /home/jenkins/.m2/repository/org/eclipse/ease/org.eclipse.ease.lang.javascript.test/0.8.0-SNAPSHOT/org.eclipse.ease.lang.javascript.test-0.8.0-SNAPSHOT-p2artifacts.xml
06:40:22 [2020-07-18T10:40:22.164Z] [INFO] 
06:40:22 [2020-07-18T10:40:22.164Z] [INFO] --- tycho-p2-plugin:1.3.0:update-local-index (default-update-local-index) @ org.eclipse.ease.lang.javascript.test ---
06:40:22 [2020-07-18T10:40:22.164Z] [INFO] 
06:40:22 [2020-07-18T10:40:22.164Z] [INFO] ---------< org.eclipse.ease:org.eclipse.ease.lang.python.test >---------
06:40:22 [2020-07-18T10:40:22.164Z] [INFO] Building org.eclipse.ease.lang.python.test 0.8.0-SNAPSHOT        [42/48]
06:40:22 [2020-07-18T10:40:22.164Z] [INFO] ------------------------[ eclipse-test-plugin ]-------------------------
06:40:22 [2020-07-18T10:40:22.164Z] [INFO] 
06:40:22 [2020-07-18T10:40:22.164Z] [INFO] --- maven-clean-plugin:2.5:clean (default-clean) @ org.eclipse.ease.lang.python.test ---
06:40:22 [2020-07-18T10:40:22.164Z] [INFO] 
06:40:22 [2020-07-18T10:40:22.164Z] [INFO] --- tycho-packaging-plugin:1.3.0:build-qualifier (default-build-qualifier) @ org.eclipse.ease.lang.python.test ---
06:40:22 [2020-07-18T10:40:22.164Z] [INFO] The project's OSGi version is 0.8.0.I201910171213
06:40:22 [2020-07-18T10:40:22.164Z] [INFO] 
06:40:22 [2020-07-18T10:40:22.164Z] [INFO] --- tycho-packaging-plugin:1.3.0:validate-id (default-validate-id) @ org.eclipse.ease.lang.python.test ---
06:40:22 [2020-07-18T10:40:22.164Z] [INFO] 
06:40:22 [2020-07-18T10:40:22.164Z] [INFO] --- tycho-packaging-plugin:1.3.0:validate-version (default-validate-version) @ org.eclipse.ease.lang.python.test ---
06:40:22 [2020-07-18T10:40:22.164Z] [INFO] 
06:40:22 [2020-07-18T10:40:22.164Z] [INFO] >>> maven-javadoc-plugin:2.9.1:javadoc (build-docs) > generate-sources @ org.eclipse.ease.lang.python.test >>>
06:40:22 [2020-07-18T10:40:22.164Z] [INFO] 
06:40:22 [2020-07-18T10:40:22.164Z] [INFO] --- tycho-packaging-plugin:1.3.0:build-qualifier (default-build-qualifier) @ org.eclipse.ease.lang.python.test ---
06:40:22 [2020-07-18T10:40:22.164Z] [INFO] The project's OSGi version is 0.8.0.I201910171213
06:40:22 [2020-07-18T10:40:22.164Z] [INFO] 
06:40:22 [2020-07-18T10:40:22.164Z] [INFO] --- tycho-packaging-plugin:1.3.0:validate-id (default-validate-id) @ org.eclipse.ease.lang.python.test ---
06:40:22 [2020-07-18T10:40:22.164Z] [INFO] 
06:40:22 [2020-07-18T10:40:22.164Z] [INFO] --- tycho-packaging-plugin:1.3.0:validate-version (default-validate-version) @ org.eclipse.ease.lang.python.test ---
06:40:22 [2020-07-18T10:40:22.164Z] [INFO] 
06:40:22 [2020-07-18T10:40:22.164Z] [INFO] <<< maven-javadoc-plugin:2.9.1:javadoc (build-docs) < generate-sources @ org.eclipse.ease.lang.python.test <<<
06:40:22 [2020-07-18T10:40:22.164Z] [INFO] 
06:40:22 [2020-07-18T10:40:22.164Z] [INFO] 
06:40:22 [2020-07-18T10:40:22.164Z] [INFO] --- maven-javadoc-plugin:2.9.1:javadoc (build-docs) @ org.eclipse.ease.lang.python.test ---
06:40:22 [2020-07-18T10:40:22.164Z] [ERROR] Error fetching link: http://help.eclipse.org/oxygen/topic/org.eclipse.platform.doc.isv/reference/api/package-list. Ignored it.
06:40:23 [2020-07-18T10:40:23.528Z] [INFO] 
06:40:23 [2020-07-18T10:40:23.528Z] Loading source files for package org.eclipse.ease.lang.python...
06:40:23 [2020-07-18T10:40:23.528Z] Constructing Javadoc information...
06:40:23 [2020-07-18T10:40:23.528Z] WARNING: Cannot open location "/home/jenkins/agent/workspace/ease.verify.core.target.2019-12/tests/org.eclipse.ease.lang.python.test/target/javadoc-bundle-options/package-list"
06:40:23 [2020-07-18T10:40:23.528Z] No plugin definition found, skipping
06:40:23 [2020-07-18T10:40:23.528Z] No plugin definition found, skipping
06:40:23 [2020-07-18T10:40:23.528Z] [WARNING] Javadoc Warnings
06:40:23 [2020-07-18T10:40:23.528Z] [WARNING] Picked up JAVA_TOOL_OPTIONS: -Dmaven.ext.class.path="/home/jenkins/agent/workspace/ease.verify.core.target.2019-12@tmp/withMaven53839bc7/pipeline-maven-spy.jar" -Dorg.jenkinsci.plugins.pipeline.maven.reportsFolder="/home/jenkins/agent/workspace/ease.verify.core.target.2019-12@tmp/withMaven53839bc7"
06:40:23 [2020-07-18T10:40:23.528Z] [INFO] 
06:40:23 [2020-07-18T10:40:23.528Z] [INFO] --- build-helper-maven-plugin:1.9.1:add-resource (add_help) @ org.eclipse.ease.lang.python.test ---
06:40:23 [2020-07-18T10:40:23.528Z] [INFO] 
06:40:23 [2020-07-18T10:40:23.528Z] [INFO] --- maven-resources-plugin:2.4.3:resources (default-resources) @ org.eclipse.ease.lang.python.test ---
06:40:23 [2020-07-18T10:40:23.528Z] [INFO] Using 'UTF-8' encoding to copy filtered resources.
06:40:23 [2020-07-18T10:40:23.528Z] [INFO] skip non existing resourceDirectory /home/jenkins/agent/workspace/ease.verify.core.target.2019-12/tests/org.eclipse.ease.lang.python.test/src/main/resources
06:40:23 [2020-07-18T10:40:23.528Z] [INFO] skip non existing resourceDirectory /home/jenkins/agent/workspace/ease.verify.core.target.2019-12/tests/org.eclipse.ease.lang.python.test/help
06:40:23 [2020-07-18T10:40:23.528Z] [INFO] 
06:40:23 [2020-07-18T10:40:23.528Z] [INFO] --- tycho-compiler-plugin:1.3.0:compile (default-compile) @ org.eclipse.ease.lang.python.test ---
06:40:23 [2020-07-18T10:40:23.528Z] [INFO] Compiling 1 source file to /home/jenkins/agent/workspace/ease.verify.core.target.2019-12/tests/org.eclipse.ease.lang.python.test/target/classes
06:40:23 [2020-07-18T10:40:23.528Z] [INFO] 
06:40:23 [2020-07-18T10:40:23.528Z] [INFO] --- maven-resources-plugin:2.4.3:testResources (default-testResources) @ org.eclipse.ease.lang.python.test ---
06:40:23 [2020-07-18T10:40:23.528Z] [INFO] Using 'UTF-8' encoding to copy filtered resources.
06:40:23 [2020-07-18T10:40:23.528Z] [INFO] skip non existing resourceDirectory /home/jenkins/agent/workspace/ease.verify.core.target.2019-12/tests/org.eclipse.ease.lang.python.test/src/test/resources
06:40:23 [2020-07-18T10:40:23.528Z] [INFO] 
06:40:23 [2020-07-18T10:40:23.529Z] [INFO] --- tycho-source-plugin:1.3.0:plugin-source (plugin-source) @ org.eclipse.ease.lang.python.test ---
06:40:23 [2020-07-18T10:40:23.529Z] [WARNING] Bundle-Vendor header not found in /home/jenkins/agent/workspace/ease.verify.core.target.2019-12/tests/org.eclipse.ease.lang.python.test/META-INF/MANIFEST.MF, fallback to 'unknown' for source bundle
06:40:23 [2020-07-18T10:40:23.529Z] [INFO] Building jar: /home/jenkins/agent/workspace/ease.verify.core.target.2019-12/tests/org.eclipse.ease.lang.python.test/target/org.eclipse.ease.lang.python.test-0.8.0-SNAPSHOT-sources.jar
06:40:23 [2020-07-18T10:40:23.529Z] [INFO] 
06:40:23 [2020-07-18T10:40:23.529Z] [INFO] --- target-platform-configuration:1.3.0:target-platform (default-target-platform) @ org.eclipse.ease.lang.python.test ---
06:40:23 [2020-07-18T10:40:23.529Z] [INFO] 
06:40:23 [2020-07-18T10:40:23.529Z] [INFO] --- tycho-packaging-plugin:1.3.0:package-plugin (default-package-plugin) @ org.eclipse.ease.lang.python.test ---
06:40:23 [2020-07-18T10:40:23.529Z] [INFO] Building jar: /home/jenkins/agent/workspace/ease.verify.core.target.2019-12/tests/org.eclipse.ease.lang.python.test/target/org.eclipse.ease.lang.python.test-0.8.0-SNAPSHOT.jar
06:40:23 [2020-07-18T10:40:23.529Z] [INFO] 
06:40:23 [2020-07-18T10:40:23.529Z] [INFO] --- tycho-p2-plugin:1.3.0:p2-metadata-default (default-p2-metadata-default) @ org.eclipse.ease.lang.python.test ---
06:40:23 [2020-07-18T10:40:23.529Z] [INFO] 
06:40:23 [2020-07-18T10:40:23.529Z] [INFO] --- tycho-source-feature-plugin:1.3.0:source-feature (source-feature) @ org.eclipse.ease.lang.python.test ---
06:40:23 [2020-07-18T10:40:23.529Z] [INFO] 
06:40:23 [2020-07-18T10:40:23.529Z] [INFO] --- tycho-p2-plugin:1.3.0:p2-metadata (attached-p2-metadata) @ org.eclipse.ease.lang.python.test ---
06:40:23 [2020-07-18T10:40:23.529Z] [INFO] 
06:40:23 [2020-07-18T10:40:23.529Z] [INFO] --- tycho-surefire-plugin:1.3.0:test (default-test) @ org.eclipse.ease.lang.python.test ---
06:40:23 [2020-07-18T10:40:23.529Z] [INFO] Expected eclipse log file: /home/jenkins/agent/workspace/ease.verify.core.target.2019-12/tests/org.eclipse.ease.lang.python.test/target/work/data/.metadata/.log
06:40:23 [2020-07-18T10:40:23.529Z] [INFO] Command line:
06:40:23 [2020-07-18T10:40:23.529Z] 	[/opt/tools/java/oracle/jdk-8/1.8.0_202/jre/bin/java, -Dosgi.noShutdown=false, -Dosgi.os=linux, -Dosgi.ws=gtk, -Dosgi.arch=x86_64, -Dosgi.clean=true, -jar, /home/jenkins/.m2/repository/p2/osgi/bundle/org.eclipse.equinox.launcher/1.5.700.v20200207-2156/org.eclipse.equinox.launcher-1.5.700.v20200207-2156.jar, -data, /home/jenkins/agent/workspace/ease.verify.core.target.2019-12/tests/org.eclipse.ease.lang.python.test/target/work/data, -install, /home/jenkins/agent/workspace/ease.verify.core.target.2019-12/tests/org.eclipse.ease.lang.python.test/target/work, -configuration, /home/jenkins/agent/workspace/ease.verify.core.target.2019-12/tests/org.eclipse.ease.lang.python.test/target/work/configuration, -application, org.eclipse.tycho.surefire.osgibooter.headlesstest, -testproperties, /home/jenkins/agent/workspace/ease.verify.core.target.2019-12/tests/org.eclipse.ease.lang.python.test/target/surefire.properties]
06:40:23 [2020-07-18T10:40:23.529Z] Picked up JAVA_TOOL_OPTIONS: -Dmaven.ext.class.path="/home/jenkins/agent/workspace/ease.verify.core.target.2019-12@tmp/withMaven53839bc7/pipeline-maven-spy.jar" -Dorg.jenkinsci.plugins.pipeline.maven.reportsFolder="/home/jenkins/agent/workspace/ease.verify.core.target.2019-12@tmp/withMaven53839bc7" 
06:40:24 [2020-07-18T10:40:24.473Z] Running org.eclipse.ease.lang.python.PythonCodeFactoryTest
06:40:24 [2020-07-18T10:40:24.473Z] Tests run: 1, Failures: 0, Errors: 0, Skipped: 0, Time elapsed: 0.024 s - in org.eclipse.ease.lang.python.PythonCodeFactoryTest
06:40:24 [2020-07-18T10:40:24.473Z] testCommentCreator(org.eclipse.ease.lang.python.PythonCodeFactoryTest)  Time elapsed: 0.004 s
06:40:24 [2020-07-18T10:40:24.473Z] 
06:40:24 [2020-07-18T10:40:24.473Z] Results:
06:40:24 [2020-07-18T10:40:24.473Z] 
06:40:24 [2020-07-18T10:40:24.473Z] Tests run: 1, Failures: 0, Errors: 0, Skipped: 0
06:40:24 [2020-07-18T10:40:24.473Z] 
06:40:25 [2020-07-18T10:40:25.034Z] [INFO] All tests passed!
06:40:25 [2020-07-18T10:40:25.034Z] [INFO] 
06:40:25 [2020-07-18T10:40:25.034Z] [INFO] --- maven-install-plugin:2.3.1:install (default-install) @ org.eclipse.ease.lang.python.test ---
06:40:25 [2020-07-18T10:40:25.034Z] [INFO] Installing /home/jenkins/agent/workspace/ease.verify.core.target.2019-12/tests/org.eclipse.ease.lang.python.test/target/org.eclipse.ease.lang.python.test-0.8.0-SNAPSHOT.jar to /home/jenkins/.m2/repository/org/eclipse/ease/org.eclipse.ease.lang.python.test/0.8.0-SNAPSHOT/org.eclipse.ease.lang.python.test-0.8.0-SNAPSHOT.jar
06:40:25 [2020-07-18T10:40:25.034Z] [INFO] Installing /home/jenkins/agent/workspace/ease.verify.core.target.2019-12/tests/org.eclipse.ease.lang.python.test/pom.xml to /home/jenkins/.m2/repository/org/eclipse/ease/org.eclipse.ease.lang.python.test/0.8.0-SNAPSHOT/org.eclipse.ease.lang.python.test-0.8.0-SNAPSHOT.pom
06:40:25 [2020-07-18T10:40:25.034Z] [INFO] Installing /home/jenkins/agent/workspace/ease.verify.core.target.2019-12/tests/org.eclipse.ease.lang.python.test/target/org.eclipse.ease.lang.python.test-0.8.0-SNAPSHOT-sources.jar to /home/jenkins/.m2/repository/org/eclipse/ease/org.eclipse.ease.lang.python.test/0.8.0-SNAPSHOT/org.eclipse.ease.lang.python.test-0.8.0-SNAPSHOT-sources.jar
06:40:25 [2020-07-18T10:40:25.034Z] [INFO] Installing /home/jenkins/agent/workspace/ease.verify.core.target.2019-12/tests/org.eclipse.ease.lang.python.test/target/p2content.xml to /home/jenkins/.m2/repository/org/eclipse/ease/org.eclipse.ease.lang.python.test/0.8.0-SNAPSHOT/org.eclipse.ease.lang.python.test-0.8.0-SNAPSHOT-p2metadata.xml
06:40:25 [2020-07-18T10:40:25.034Z] [INFO] Installing /home/jenkins/agent/workspace/ease.verify.core.target.2019-12/tests/org.eclipse.ease.lang.python.test/target/p2artifacts.xml to /home/jenkins/.m2/repository/org/eclipse/ease/org.eclipse.ease.lang.python.test/0.8.0-SNAPSHOT/org.eclipse.ease.lang.python.test-0.8.0-SNAPSHOT-p2artifacts.xml
06:40:25 [2020-07-18T10:40:25.034Z] [INFO] Installing /home/jenkins/agent/workspace/ease.verify.core.target.2019-12/tests/org.eclipse.ease.lang.python.test/target/p2content.xml to /home/jenkins/.m2/repository/org/eclipse/ease/org.eclipse.ease.lang.python.test/0.8.0-SNAPSHOT/org.eclipse.ease.lang.python.test-0.8.0-SNAPSHOT-p2metadata.xml
06:40:25 [2020-07-18T10:40:25.034Z] [INFO] Installing /home/jenkins/agent/workspace/ease.verify.core.target.2019-12/tests/org.eclipse.ease.lang.python.test/target/p2artifacts.xml to /home/jenkins/.m2/repository/org/eclipse/ease/org.eclipse.ease.lang.python.test/0.8.0-SNAPSHOT/org.eclipse.ease.lang.python.test-0.8.0-SNAPSHOT-p2artifacts.xml
06:40:25 [2020-07-18T10:40:25.034Z] [INFO] 
06:40:25 [2020-07-18T10:40:25.034Z] [INFO] --- tycho-p2-plugin:1.3.0:update-local-index (default-update-local-index) @ org.eclipse.ease.lang.python.test ---
06:40:25 [2020-07-18T10:40:25.034Z] [INFO] 
06:40:25 [2020-07-18T10:40:25.034Z] [INFO] -----< org.eclipse.ease:org.eclipse.ease.lang.python.jython.test >------
06:40:25 [2020-07-18T10:40:25.034Z] [INFO] Building org.eclipse.ease.lang.python.jython.test 0.8.0-SNAPSHOT [43/48]
06:40:25 [2020-07-18T10:40:25.034Z] [INFO] ------------------------[ eclipse-test-plugin ]-------------------------
06:40:25 [2020-07-18T10:40:25.034Z] [INFO] 
06:40:25 [2020-07-18T10:40:25.034Z] [INFO] --- maven-clean-plugin:2.5:clean (default-clean) @ org.eclipse.ease.lang.python.jython.test ---
06:40:25 [2020-07-18T10:40:25.034Z] [INFO] 
06:40:25 [2020-07-18T10:40:25.034Z] [INFO] --- tycho-packaging-plugin:1.3.0:build-qualifier (default-build-qualifier) @ org.eclipse.ease.lang.python.jython.test ---
06:40:25 [2020-07-18T10:40:25.289Z] [INFO] The project's OSGi version is 0.8.0.I201911291239
06:40:25 [2020-07-18T10:40:25.289Z] [INFO] 
06:40:25 [2020-07-18T10:40:25.289Z] [INFO] --- tycho-packaging-plugin:1.3.0:validate-id (default-validate-id) @ org.eclipse.ease.lang.python.jython.test ---
06:40:25 [2020-07-18T10:40:25.289Z] [INFO] 
06:40:25 [2020-07-18T10:40:25.289Z] [INFO] --- tycho-packaging-plugin:1.3.0:validate-version (default-validate-version) @ org.eclipse.ease.lang.python.jython.test ---
06:40:25 [2020-07-18T10:40:25.289Z] [INFO] 
06:40:25 [2020-07-18T10:40:25.289Z] [INFO] >>> maven-javadoc-plugin:2.9.1:javadoc (build-docs) > generate-sources @ org.eclipse.ease.lang.python.jython.test >>>
06:40:25 [2020-07-18T10:40:25.289Z] [INFO] 
06:40:25 [2020-07-18T10:40:25.289Z] [INFO] --- tycho-packaging-plugin:1.3.0:build-qualifier (default-build-qualifier) @ org.eclipse.ease.lang.python.jython.test ---
06:40:25 [2020-07-18T10:40:25.289Z] [INFO] The project's OSGi version is 0.8.0.I201911291239
06:40:25 [2020-07-18T10:40:25.289Z] [INFO] 
06:40:25 [2020-07-18T10:40:25.289Z] [INFO] --- tycho-packaging-plugin:1.3.0:validate-id (default-validate-id) @ org.eclipse.ease.lang.python.jython.test ---
06:40:25 [2020-07-18T10:40:25.289Z] [INFO] 
06:40:25 [2020-07-18T10:40:25.289Z] [INFO] --- tycho-packaging-plugin:1.3.0:validate-version (default-validate-version) @ org.eclipse.ease.lang.python.jython.test ---
06:40:25 [2020-07-18T10:40:25.289Z] [INFO] 
06:40:25 [2020-07-18T10:40:25.289Z] [INFO] <<< maven-javadoc-plugin:2.9.1:javadoc (build-docs) < generate-sources @ org.eclipse.ease.lang.python.jython.test <<<
06:40:25 [2020-07-18T10:40:25.289Z] [INFO] 
06:40:25 [2020-07-18T10:40:25.289Z] [INFO] 
06:40:25 [2020-07-18T10:40:25.289Z] [INFO] --- maven-javadoc-plugin:2.9.1:javadoc (build-docs) @ org.eclipse.ease.lang.python.jython.test ---
06:40:25 [2020-07-18T10:40:25.290Z] [ERROR] Error fetching link: http://help.eclipse.org/oxygen/topic/org.eclipse.platform.doc.isv/reference/api/package-list. Ignored it.
06:40:26 [2020-07-18T10:40:26.651Z] [INFO] 
06:40:26 [2020-07-18T10:40:26.651Z] Loading source files for package org.eclipse.ease.lang.python.jython.debugger...
06:40:26 [2020-07-18T10:40:26.651Z] Constructing Javadoc information...
06:40:26 [2020-07-18T10:40:26.652Z] WARNING: Cannot open location "/home/jenkins/agent/workspace/ease.verify.core.target.2019-12/tests/org.eclipse.ease.lang.python.jython.test/target/javadoc-bundle-options/package-list"
06:40:26 [2020-07-18T10:40:26.652Z] No plugin definition found, skipping
06:40:26 [2020-07-18T10:40:26.652Z] No plugin definition found, skipping
06:40:26 [2020-07-18T10:40:26.652Z] [WARNING] Javadoc Warnings
06:40:26 [2020-07-18T10:40:26.652Z] [WARNING] Picked up JAVA_TOOL_OPTIONS: -Dmaven.ext.class.path="/home/jenkins/agent/workspace/ease.verify.core.target.2019-12@tmp/withMaven53839bc7/pipeline-maven-spy.jar" -Dorg.jenkinsci.plugins.pipeline.maven.reportsFolder="/home/jenkins/agent/workspace/ease.verify.core.target.2019-12@tmp/withMaven53839bc7"
06:40:26 [2020-07-18T10:40:26.652Z] [INFO] 
06:40:26 [2020-07-18T10:40:26.652Z] [INFO] --- build-helper-maven-plugin:1.9.1:add-resource (add_help) @ org.eclipse.ease.lang.python.jython.test ---
06:40:26 [2020-07-18T10:40:26.652Z] [INFO] 
06:40:26 [2020-07-18T10:40:26.652Z] [INFO] --- maven-resources-plugin:2.4.3:resources (default-resources) @ org.eclipse.ease.lang.python.jython.test ---
06:40:26 [2020-07-18T10:40:26.652Z] [INFO] Using 'UTF-8' encoding to copy filtered resources.
06:40:26 [2020-07-18T10:40:26.652Z] [INFO] skip non existing resourceDirectory /home/jenkins/agent/workspace/ease.verify.core.target.2019-12/tests/org.eclipse.ease.lang.python.jython.test/src/main/resources
06:40:26 [2020-07-18T10:40:26.652Z] [INFO] skip non existing resourceDirectory /home/jenkins/agent/workspace/ease.verify.core.target.2019-12/tests/org.eclipse.ease.lang.python.jython.test/help
06:40:26 [2020-07-18T10:40:26.652Z] [INFO] 
06:40:26 [2020-07-18T10:40:26.652Z] [INFO] --- tycho-compiler-plugin:1.3.0:compile (default-compile) @ org.eclipse.ease.lang.python.jython.test ---
06:40:26 [2020-07-18T10:40:26.652Z] [INFO] Compiling 1 source file to /home/jenkins/agent/workspace/ease.verify.core.target.2019-12/tests/org.eclipse.ease.lang.python.jython.test/target/classes
06:40:26 [2020-07-18T10:40:26.652Z] [INFO] 
06:40:26 [2020-07-18T10:40:26.652Z] [INFO] --- maven-resources-plugin:2.4.3:testResources (default-testResources) @ org.eclipse.ease.lang.python.jython.test ---
06:40:26 [2020-07-18T10:40:26.652Z] [INFO] Using 'UTF-8' encoding to copy filtered resources.
06:40:26 [2020-07-18T10:40:26.652Z] [INFO] skip non existing resourceDirectory /home/jenkins/agent/workspace/ease.verify.core.target.2019-12/tests/org.eclipse.ease.lang.python.jython.test/src/test/resources
06:40:26 [2020-07-18T10:40:26.652Z] [INFO] 
06:40:26 [2020-07-18T10:40:26.652Z] [INFO] --- tycho-source-plugin:1.3.0:plugin-source (plugin-source) @ org.eclipse.ease.lang.python.jython.test ---
06:40:26 [2020-07-18T10:40:26.652Z] [WARNING] Bundle-Vendor header not found in /home/jenkins/agent/workspace/ease.verify.core.target.2019-12/tests/org.eclipse.ease.lang.python.jython.test/META-INF/MANIFEST.MF, fallback to 'unknown' for source bundle
06:40:26 [2020-07-18T10:40:26.652Z] [INFO] Building jar: /home/jenkins/agent/workspace/ease.verify.core.target.2019-12/tests/org.eclipse.ease.lang.python.jython.test/target/org.eclipse.ease.lang.python.jython.test-0.8.0-SNAPSHOT-sources.jar
06:40:26 [2020-07-18T10:40:26.652Z] [INFO] 
06:40:26 [2020-07-18T10:40:26.652Z] [INFO] --- target-platform-configuration:1.3.0:target-platform (default-target-platform) @ org.eclipse.ease.lang.python.jython.test ---
06:40:26 [2020-07-18T10:40:26.652Z] [INFO] 
06:40:26 [2020-07-18T10:40:26.652Z] [INFO] --- tycho-packaging-plugin:1.3.0:package-plugin (default-package-plugin) @ org.eclipse.ease.lang.python.jython.test ---
06:40:26 [2020-07-18T10:40:26.652Z] [INFO] Building jar: /home/jenkins/agent/workspace/ease.verify.core.target.2019-12/tests/org.eclipse.ease.lang.python.jython.test/target/org.eclipse.ease.lang.python.jython.test-0.8.0-SNAPSHOT.jar
06:40:26 [2020-07-18T10:40:26.652Z] [INFO] 
06:40:26 [2020-07-18T10:40:26.652Z] [INFO] --- tycho-p2-plugin:1.3.0:p2-metadata-default (default-p2-metadata-default) @ org.eclipse.ease.lang.python.jython.test ---
06:40:26 [2020-07-18T10:40:26.652Z] [INFO] 
06:40:26 [2020-07-18T10:40:26.652Z] [INFO] --- tycho-source-feature-plugin:1.3.0:source-feature (source-feature) @ org.eclipse.ease.lang.python.jython.test ---
06:40:26 [2020-07-18T10:40:26.652Z] [INFO] 
06:40:26 [2020-07-18T10:40:26.652Z] [INFO] --- tycho-p2-plugin:1.3.0:p2-metadata (attached-p2-metadata) @ org.eclipse.ease.lang.python.jython.test ---
06:40:26 [2020-07-18T10:40:26.652Z] [INFO] 
06:40:26 [2020-07-18T10:40:26.652Z] [INFO] --- tycho-surefire-plugin:1.3.0:test (default-test) @ org.eclipse.ease.lang.python.jython.test ---
06:40:27 [2020-07-18T10:40:27.213Z] [INFO] Expected eclipse log file: /home/jenkins/agent/workspace/ease.verify.core.target.2019-12/tests/org.eclipse.ease.lang.python.jython.test/target/work/data/.metadata/.log
06:40:27 [2020-07-18T10:40:27.213Z] [INFO] Command line:
06:40:27 [2020-07-18T10:40:27.213Z] 	[/opt/tools/java/oracle/jdk-8/1.8.0_202/jre/bin/java, -Dosgi.noShutdown=false, -Dosgi.os=linux, -Dosgi.ws=gtk, -Dosgi.arch=x86_64, -Dosgi.clean=true, -jar, /home/jenkins/.m2/repository/p2/osgi/bundle/org.eclipse.equinox.launcher/1.5.700.v20200207-2156/org.eclipse.equinox.launcher-1.5.700.v20200207-2156.jar, -data, /home/jenkins/agent/workspace/ease.verify.core.target.2019-12/tests/org.eclipse.ease.lang.python.jython.test/target/work/data, -install, /home/jenkins/agent/workspace/ease.verify.core.target.2019-12/tests/org.eclipse.ease.lang.python.jython.test/target/work, -configuration, /home/jenkins/agent/workspace/ease.verify.core.target.2019-12/tests/org.eclipse.ease.lang.python.jython.test/target/work/configuration, -application, org.eclipse.tycho.surefire.osgibooter.headlesstest, -testproperties, /home/jenkins/agent/workspace/ease.verify.core.target.2019-12/tests/org.eclipse.ease.lang.python.jython.test/target/surefire.properties]
06:40:27 [2020-07-18T10:40:27.213Z] Picked up JAVA_TOOL_OPTIONS: -Dmaven.ext.class.path="/home/jenkins/agent/workspace/ease.verify.core.target.2019-12@tmp/withMaven53839bc7/pipeline-maven-spy.jar" -Dorg.jenkinsci.plugins.pipeline.maven.reportsFolder="/home/jenkins/agent/workspace/ease.verify.core.target.2019-12@tmp/withMaven53839bc7" 
06:40:29 [2020-07-18T10:40:29.726Z] Running org.eclipse.ease.lang.python.jython.debugger.JythonDebugTest
06:40:30 [2020-07-18T10:40:30.672Z] Start of script
06:40:30 [2020-07-18T10:40:30.672Z] include file start
06:40:30 [2020-07-18T10:40:30.672Z] include file processed
06:40:30 [2020-07-18T10:40:30.672Z] Result of testMethod = 5
06:40:30 [2020-07-18T10:40:30.672Z] End of script
06:40:30 [2020-07-18T10:40:30.672Z] Start of script
06:40:30 [2020-07-18T10:40:30.927Z] include file start
06:40:30 [2020-07-18T10:40:30.927Z] include file processed
06:40:30 [2020-07-18T10:40:30.927Z] Result of testMethod = 5
06:40:30 [2020-07-18T10:40:30.927Z] End of script
06:40:30 [2020-07-18T10:40:30.927Z] Start of script
06:40:30 [2020-07-18T10:40:30.927Z] include file start
06:40:30 [2020-07-18T10:40:30.927Z] include file processed
06:40:30 [2020-07-18T10:40:30.927Z] Result of testMethod = 5
06:40:31 [2020-07-18T10:40:31.183Z] Traceback (most recent call last):
06:40:31 [2020-07-18T10:40:31.183Z]   File "(none)", line 184, in run
06:40:31 [2020-07-18T10:40:31.183Z]   File "__ref_L/Debug Test/Main.py_esvxwiftie", line 23, in <module>
06:40:31 [2020-07-18T10:40:31.183Z]   File "(none)", line 161, in trace_dispatch
06:40:31 [2020-07-18T10:40:31.183Z] org.eclipse.ease.ExitException: 
06:40:31 [2020-07-18T10:40:31.183Z] 
06:40:31 [2020-07-18T10:40:31.183Z] org.eclipse.ease.ExitException: org.eclipse.ease.ExitException: 
06:40:31 [2020-07-18T10:40:31.183Z] Start of script
06:40:31 [2020-07-18T10:40:31.183Z] include file start
06:40:31 [2020-07-18T10:40:31.183Z] include file processed
06:40:31 [2020-07-18T10:40:31.439Z] Result of testMethod = 5
06:40:31 [2020-07-18T10:40:31.439Z] End of script
06:40:31 [2020-07-18T10:40:31.694Z] Start of script
06:40:31 [2020-07-18T10:40:31.694Z] include file start
06:40:31 [2020-07-18T10:40:31.694Z] include file processed
06:40:31 [2020-07-18T10:40:31.694Z] Result of testMethod = 5
06:40:31 [2020-07-18T10:40:31.694Z] End of script
06:40:31 [2020-07-18T10:40:31.950Z] Start of script
06:40:31 [2020-07-18T10:40:31.950Z] include file start
06:40:31 [2020-07-18T10:40:31.950Z] include file processed
06:40:32 [2020-07-18T10:40:32.206Z] Result of testMethod = 5
06:40:32 [2020-07-18T10:40:32.206Z] End of script
06:40:32 [2020-07-18T10:40:32.206Z] Start of script
06:40:32 [2020-07-18T10:40:32.206Z] include file start
06:40:32 [2020-07-18T10:40:32.206Z] include file processed
06:40:32 [2020-07-18T10:40:32.206Z] Result of testMethod = 5
06:40:32 [2020-07-18T10:40:32.462Z] Traceback (most recent call last):
06:40:32 [2020-07-18T10:40:32.462Z]   File "(none)", line 184, in run
06:40:32 [2020-07-18T10:40:32.462Z]   File "__ref_L/Debug Test/Main.py_uuirrumaul", line 23, in <module>
06:40:32 [2020-07-18T10:40:32.462Z]   File "(none)", line 161, in trace_dispatch
06:40:32 [2020-07-18T10:40:32.462Z] org.eclipse.ease.ExitException: 
06:40:32 [2020-07-18T10:40:32.462Z] 
06:40:32 [2020-07-18T10:40:32.462Z] org.eclipse.ease.ExitException: org.eclipse.ease.ExitException: 
06:40:32 [2020-07-18T10:40:32.462Z] Start of script
06:40:32 [2020-07-18T10:40:32.462Z] include file start
06:40:32 [2020-07-18T10:40:32.462Z] include file processed
06:40:32 [2020-07-18T10:40:32.717Z] Result of testMethod = 5
06:40:32 [2020-07-18T10:40:32.717Z] End of script
06:40:32 [2020-07-18T10:40:32.717Z] Start of script
06:40:32 [2020-07-18T10:40:32.717Z] include file start
06:40:32 [2020-07-18T10:40:32.717Z] include file processed
06:40:32 [2020-07-18T10:40:32.717Z] Result of testMethod = 5
06:40:32 [2020-07-18T10:40:32.973Z] End of script
06:40:32 [2020-07-18T10:40:32.973Z] Start of script
06:40:32 [2020-07-18T10:40:32.973Z] include file start
06:40:32 [2020-07-18T10:40:32.973Z] include file processed
06:40:33 [2020-07-18T10:40:33.535Z] Traceback (most recent call last):
06:40:33 [2020-07-18T10:40:33.535Z]   File "(none)", line 184, in run
06:40:33 [2020-07-18T10:40:33.536Z]   File "__ref_L/Debug Test/Main.py_eaqvgklkts", line 22, in <module>
06:40:33 [2020-07-18T10:40:33.536Z]   File "(none)", line 161, in trace_dispatch
06:40:33 [2020-07-18T10:40:33.536Z] org.eclipse.ease.ExitException: 
06:40:33 [2020-07-18T10:40:33.536Z] 
06:40:33 [2020-07-18T10:40:33.536Z] org.eclipse.ease.ExitException: org.eclipse.ease.ExitException: 
06:40:33 [2020-07-18T10:40:33.536Z] Start of script
06:40:33 [2020-07-18T10:40:33.536Z] include file start
06:40:33 [2020-07-18T10:40:33.536Z] include file processed
06:40:33 [2020-07-18T10:40:33.536Z] Result of testMethod = 5
06:40:33 [2020-07-18T10:40:33.536Z] End of script
06:40:33 [2020-07-18T10:40:33.792Z] Start of script
06:40:33 [2020-07-18T10:40:33.792Z] include file start
06:40:33 [2020-07-18T10:40:33.792Z] include file processed
06:40:34 [2020-07-18T10:40:34.048Z] Result of testMethod = 5
06:40:34 [2020-07-18T10:40:34.048Z] End of script
06:40:34 [2020-07-18T10:40:34.048Z] Traceback (most recent call last):
06:40:34 [2020-07-18T10:40:34.048Z]   File "(none)", line 184, in run
06:40:34 [2020-07-18T10:40:34.048Z]   File "__ref_L/Debug Test/Main.py_toggcthzkq", line 1, in <module>
06:40:34 [2020-07-18T10:40:34.048Z]   File "(none)", line 161, in trace_dispatch
06:40:34 [2020-07-18T10:40:34.048Z] org.eclipse.ease.ExitException: 
06:40:34 [2020-07-18T10:40:34.048Z] 
06:40:34 [2020-07-18T10:40:34.048Z] org.eclipse.ease.ExitException: org.eclipse.ease.ExitException: 
06:40:34 [2020-07-18T10:40:34.303Z] Start of script
06:40:34 [2020-07-18T10:40:34.303Z] include file start
06:40:34 [2020-07-18T10:40:34.303Z] include file processed
06:40:34 [2020-07-18T10:40:34.303Z] Result of testMethod = 5
06:40:34 [2020-07-18T10:40:34.303Z] End of script
06:40:34 [2020-07-18T10:40:34.303Z] Start of script
06:40:34 [2020-07-18T10:40:34.303Z] include file start
06:40:34 [2020-07-18T10:40:34.303Z] include file processed
06:40:34 [2020-07-18T10:40:34.559Z] Result of testMethod = 5
06:40:34 [2020-07-18T10:40:34.559Z] End of script
06:40:34 [2020-07-18T10:40:34.559Z] Start of script
06:40:34 [2020-07-18T10:40:34.559Z] include file start
06:40:34 [2020-07-18T10:40:34.559Z] include file processed
06:40:34 [2020-07-18T10:40:34.559Z] Result of testMethod = 5
06:40:34 [2020-07-18T10:40:34.815Z] Traceback (most recent call last):
06:40:34 [2020-07-18T10:40:34.815Z]   File "(none)", line 184, in run
06:40:34 [2020-07-18T10:40:34.815Z]   File "__ref_L/Debug Test/Main.py_qlqybqscin", line 23, in <module>
06:40:34 [2020-07-18T10:40:34.815Z]   File "(none)", line 161, in trace_dispatch
06:40:34 [2020-07-18T10:40:34.815Z] org.eclipse.ease.ExitException: 
06:40:34 [2020-07-18T10:40:34.815Z] 
06:40:34 [2020-07-18T10:40:34.815Z] org.eclipse.ease.ExitException: org.eclipse.ease.ExitException: 
06:40:35 [2020-07-18T10:40:35.070Z] Start of script
06:40:35 [2020-07-18T10:40:35.070Z] include file start
06:40:35 [2020-07-18T10:40:35.070Z] include file processed
06:40:35 [2020-07-18T10:40:35.070Z] Result of testMethod = 5
06:40:35 [2020-07-18T10:40:35.070Z] End of script
06:40:35 [2020-07-18T10:40:35.326Z] Traceback (most recent call last):
06:40:35 [2020-07-18T10:40:35.327Z]   File "(none)", line 184, in run
06:40:35 [2020-07-18T10:40:35.327Z]   File "__ref_L/Debug Test/Main.py_bxxggljrfx", line 1, in <module>
06:40:35 [2020-07-18T10:40:35.327Z]   File "(none)", line 161, in trace_dispatch
06:40:35 [2020-07-18T10:40:35.327Z] org.eclipse.ease.ExitException: 
06:40:35 [2020-07-18T10:40:35.327Z] 
06:40:35 [2020-07-18T10:40:35.327Z] org.eclipse.ease.ExitException: org.eclipse.ease.ExitException: 
06:40:35 [2020-07-18T10:40:35.582Z] Start of script
06:40:35 [2020-07-18T10:40:35.582Z] include file start
06:40:35 [2020-07-18T10:40:35.582Z] include file processed
06:40:35 [2020-07-18T10:40:35.582Z] Result of testMethod = 5
06:40:35 [2020-07-18T10:40:35.582Z] End of script
06:40:35 [2020-07-18T10:40:35.582Z] Start of script
06:40:35 [2020-07-18T10:40:35.582Z] include file start
06:40:35 [2020-07-18T10:40:35.582Z] include file processed
06:40:35 [2020-07-18T10:40:35.839Z] Result of testMethod = 5
06:40:35 [2020-07-18T10:40:35.839Z] End of script
06:40:36 [2020-07-18T10:40:36.095Z] Traceback (most recent call last):
06:40:36 [2020-07-18T10:40:36.095Z]   File "(none)", line 184, in run
06:40:36 [2020-07-18T10:40:36.095Z]   File "__ref_L/Debug Test/Main.py_zzxesdjgos", line 1, in <module>
06:40:36 [2020-07-18T10:40:36.095Z]   File "(none)", line 161, in trace_dispatch
06:40:36 [2020-07-18T10:40:36.095Z] org.eclipse.ease.ExitException: 
06:40:36 [2020-07-18T10:40:36.095Z] 
06:40:36 [2020-07-18T10:40:36.095Z] org.eclipse.ease.ExitException: org.eclipse.ease.ExitException: 
06:40:36 [2020-07-18T10:40:36.095Z] Start of script
06:40:36 [2020-07-18T10:40:36.095Z] include file start
06:40:36 [2020-07-18T10:40:36.095Z] include file processed
06:40:36 [2020-07-18T10:40:36.351Z] Result of testMethod = 5
06:40:36 [2020-07-18T10:40:36.351Z] End of script
06:40:36 [2020-07-18T10:40:36.606Z] Start of script
06:40:36 [2020-07-18T10:40:36.606Z] include file start
06:40:36 [2020-07-18T10:40:36.606Z] include file processed
06:40:36 [2020-07-18T10:40:36.606Z] Result of testMethod = 5
06:40:36 [2020-07-18T10:40:36.606Z] Traceback (most recent call last):
06:40:36 [2020-07-18T10:40:36.606Z]   File "(none)", line 184, in run
06:40:36 [2020-07-18T10:40:36.606Z]   File "__ref_L/Debug Test/Main.py_nbzfveiyvc", line 23, in <module>
06:40:36 [2020-07-18T10:40:36.606Z]   File "(none)", line 161, in trace_dispatch
06:40:36 [2020-07-18T10:40:36.606Z] org.eclipse.ease.ExitException: 
06:40:36 [2020-07-18T10:40:36.606Z] 
06:40:36 [2020-07-18T10:40:36.606Z] org.eclipse.ease.ExitException: org.eclipse.ease.ExitException: 
06:40:36 [2020-07-18T10:40:36.862Z] Start of script
06:40:36 [2020-07-18T10:40:36.862Z] include file start
06:40:36 [2020-07-18T10:40:36.862Z] include file processed
06:40:36 [2020-07-18T10:40:36.862Z] Result of testMethod = 5
06:40:36 [2020-07-18T10:40:36.862Z] End of script
06:40:37 [2020-07-18T10:40:37.118Z] Start of script
06:40:37 [2020-07-18T10:40:37.118Z] include file start
06:40:37 [2020-07-18T10:40:37.118Z] include file processed
06:40:37 [2020-07-18T10:40:37.118Z] Result of testMethod = 5
06:40:37 [2020-07-18T10:40:37.118Z] End of script
06:40:37 [2020-07-18T10:40:37.374Z] Start of script
06:40:37 [2020-07-18T10:40:37.374Z] include file start
06:40:37 [2020-07-18T10:40:37.374Z] include file processed
06:40:37 [2020-07-18T10:40:37.374Z] Result of testMethod = 5
06:40:37 [2020-07-18T10:40:37.374Z] End of script
06:40:37 [2020-07-18T10:40:37.374Z] Start of script
06:40:37 [2020-07-18T10:40:37.631Z] include file start
06:40:37 [2020-07-18T10:40:37.631Z] include file processed
06:40:37 [2020-07-18T10:40:37.631Z] Result of testMethod = 5
06:40:37 [2020-07-18T10:40:37.631Z] End of script
06:40:37 [2020-07-18T10:40:37.631Z] Start of script
06:40:37 [2020-07-18T10:40:37.631Z] include file start
06:40:37 [2020-07-18T10:40:37.631Z] include file processed
06:40:37 [2020-07-18T10:40:37.893Z] Traceback (most recent call last):
06:40:37 [2020-07-18T10:40:37.893Z]   File "(none)", line 184, in run
06:40:37 [2020-07-18T10:40:37.893Z]   File "__ref_L/Debug Test/Main.py_mdfxasjnay", line 21, in <module>
06:40:37 [2020-07-18T10:40:37.893Z]   File "__ref_L/Debug Test/Main.py_mdfxasjnay", line 18, in testMethod
06:40:37 [2020-07-18T10:40:37.893Z]   File "(none)", line 161, in trace_dispatch
06:40:37 [2020-07-18T10:40:37.893Z] org.eclipse.ease.ExitException: 
06:40:37 [2020-07-18T10:40:37.893Z] 
06:40:37 [2020-07-18T10:40:37.893Z] org.eclipse.ease.ExitException: org.eclipse.ease.ExitException: 
06:40:38 [2020-07-18T10:40:38.154Z] Start of script
06:40:38 [2020-07-18T10:40:38.154Z] include file start
06:40:38 [2020-07-18T10:40:38.154Z] include file processed
06:40:38 [2020-07-18T10:40:38.154Z] Result of testMethod = 5
06:40:38 [2020-07-18T10:40:38.154Z] End of script
06:40:38 [2020-07-18T10:40:38.411Z] Start of script
06:40:38 [2020-07-18T10:40:38.411Z] include file start
06:40:38 [2020-07-18T10:40:38.411Z] include file processed
06:40:38 [2020-07-18T10:40:38.411Z] Result of testMethod = 5
06:40:38 [2020-07-18T10:40:38.411Z] Traceback (most recent call last):
06:40:38 [2020-07-18T10:40:38.411Z]   File "(none)", line 184, in run
06:40:38 [2020-07-18T10:40:38.411Z]   File "__ref_L/Debug Test/Main.py_wdpskrmfsq", line 23, in <module>
06:40:38 [2020-07-18T10:40:38.411Z]   File "(none)", line 161, in trace_dispatch
06:40:38 [2020-07-18T10:40:38.411Z] org.eclipse.ease.ExitException: 
06:40:38 [2020-07-18T10:40:38.411Z] 
06:40:38 [2020-07-18T10:40:38.411Z] org.eclipse.ease.ExitException: org.eclipse.ease.ExitException: 
06:40:38 [2020-07-18T10:40:38.667Z] Start of script
06:40:38 [2020-07-18T10:40:38.667Z] include file start
06:40:38 [2020-07-18T10:40:38.667Z] include file processed
06:40:38 [2020-07-18T10:40:38.667Z] Result of testMethod = 5
06:40:38 [2020-07-18T10:40:38.667Z] End of script
06:40:38 [2020-07-18T10:40:38.922Z] Start of script
06:40:38 [2020-07-18T10:40:38.922Z] include file start
06:40:38 [2020-07-18T10:40:38.922Z] include file processed
06:40:38 [2020-07-18T10:40:38.922Z] Result of testMethod = 5
06:40:38 [2020-07-18T10:40:38.922Z] End of script
06:40:39 [2020-07-18T10:40:39.178Z] Start of script
06:40:39 [2020-07-18T10:40:39.178Z] include file start
06:40:39 [2020-07-18T10:40:39.178Z] include file processed
06:40:39 [2020-07-18T10:40:39.433Z] Result of testMethod = 5
06:40:39 [2020-07-18T10:40:39.433Z] End of script
06:40:39 [2020-07-18T10:40:39.433Z] Start of script
06:40:39 [2020-07-18T10:40:39.433Z] include file start
06:40:39 [2020-07-18T10:40:39.433Z] include file processed
06:40:39 [2020-07-18T10:40:39.433Z] Result of testMethod = 5
06:40:39 [2020-07-18T10:40:39.433Z] End of script
06:40:39 [2020-07-18T10:40:39.689Z] Start of script
06:40:39 [2020-07-18T10:40:39.689Z] include file start
06:40:39 [2020-07-18T10:40:39.690Z] include file processed
06:40:39 [2020-07-18T10:40:39.690Z] Result of testMethod = 5
06:40:39 [2020-07-18T10:40:39.945Z] Traceback (most recent call last):
06:40:39 [2020-07-18T10:40:39.945Z]   File "(none)", line 184, in run
06:40:39 [2020-07-18T10:40:39.946Z]   File "__ref_L/Debug Test/Main.py_isasmfuszh", line 23, in <module>
06:40:39 [2020-07-18T10:40:39.946Z]   File "(none)", line 161, in trace_dispatch
06:40:39 [2020-07-18T10:40:39.946Z] org.eclipse.ease.ExitException: 
06:40:39 [2020-07-18T10:40:39.946Z] 
06:40:39 [2020-07-18T10:40:39.946Z] org.eclipse.ease.ExitException: org.eclipse.ease.ExitException: 
06:40:39 [2020-07-18T10:40:39.946Z] Start of script
06:40:39 [2020-07-18T10:40:39.946Z] include file start
06:40:39 [2020-07-18T10:40:39.946Z] include file processed
06:40:39 [2020-07-18T10:40:39.946Z] Result of testMethod = 5
06:40:39 [2020-07-18T10:40:39.946Z] End of script
06:40:40 [2020-07-18T10:40:40.201Z] Start of script
06:40:40 [2020-07-18T10:40:40.201Z] include file start
06:40:40 [2020-07-18T10:40:40.201Z] include file processed
06:40:40 [2020-07-18T10:40:40.201Z] Result of testMethod = 5
06:40:40 [2020-07-18T10:40:40.456Z] Traceback (most recent call last):
06:40:40 [2020-07-18T10:40:40.456Z]   File "(none)", line 184, in run
06:40:40 [2020-07-18T10:40:40.456Z]   File "__ref_L/Debug Test/Main.py_vrcdrjqwsb", line 23, in <module>
06:40:40 [2020-07-18T10:40:40.456Z]   File "(none)", line 161, in trace_dispatch
06:40:40 [2020-07-18T10:40:40.456Z] org.eclipse.ease.ExitException: 
06:40:40 [2020-07-18T10:40:40.456Z] 
06:40:40 [2020-07-18T10:40:40.456Z] org.eclipse.ease.ExitException: org.eclipse.ease.ExitException: 
06:40:40 [2020-07-18T10:40:40.456Z] Traceback (most recent call last):
06:40:40 [2020-07-18T10:40:40.456Z]   File "(none)", line 184, in run
06:40:40 [2020-07-18T10:40:40.456Z]   File "__ref_L/Debug Test/Main.py_xjsaikustl", line 1, in <module>
06:40:40 [2020-07-18T10:40:40.456Z]   File "(none)", line 161, in trace_dispatch
06:40:40 [2020-07-18T10:40:40.456Z] org.eclipse.ease.ExitException: 
06:40:40 [2020-07-18T10:40:40.456Z] 
06:40:40 [2020-07-18T10:40:40.457Z] org.eclipse.ease.ExitException: org.eclipse.ease.ExitException: 
06:40:40 [2020-07-18T10:40:40.712Z] Start of script
06:40:40 [2020-07-18T10:40:40.712Z] include file start
06:40:40 [2020-07-18T10:40:40.712Z] include file processed
06:40:40 [2020-07-18T10:40:40.712Z] Result of testMethod = 5
06:40:40 [2020-07-18T10:40:40.712Z] End of script
06:40:40 [2020-07-18T10:40:40.967Z] Start of script
06:40:40 [2020-07-18T10:40:40.967Z] include file start
06:40:40 [2020-07-18T10:40:40.967Z] include file processed
06:40:40 [2020-07-18T10:40:40.967Z] Result of testMethod = 5
06:40:40 [2020-07-18T10:40:40.967Z] End of script
06:40:41 [2020-07-18T10:40:41.223Z] Start of script
06:40:41 [2020-07-18T10:40:41.223Z] include file start
06:40:41 [2020-07-18T10:40:41.223Z] include file processed
06:40:41 [2020-07-18T10:40:41.223Z] Result of testMethod = 5
06:40:41 [2020-07-18T10:40:41.223Z] End of script
06:40:41 [2020-07-18T10:40:41.479Z] Tests run: 42, Failures: 1, Errors: 0, Skipped: 0, Time elapsed: 12.169 s <<< FAILURE! - in org.eclipse.ease.lang.python.jython.debugger.JythonDebugTest
06:40:41 [2020-07-18T10:40:41.479Z] disconnectProcessInSuspendedState(org.eclipse.ease.lang.python.jython.debugger.JythonDebugTest)  Time elapsed: 1.487 s
06:40:41 [2020-07-18T10:40:41.479Z] stepReturnIncludeCommand(org.eclipse.ease.lang.python.jython.debugger.JythonDebugTest)  Time elapsed: 0.21 s
06:40:41 [2020-07-18T10:40:41.479Z] arrayVariableSorting(org.eclipse.ease.lang.python.jython.debugger.JythonDebugTest)  Time elapsed: 0.308 s
06:40:41 [2020-07-18T10:40:41.479Z] stepOverOnDebugTarget(org.eclipse.ease.lang.python.jython.debugger.JythonDebugTest)  Time elapsed: 0.31 s
06:40:41 [2020-07-18T10:40:41.479Z] hasDebugTarget(org.eclipse.ease.lang.python.jython.debugger.JythonDebugTest)  Time elapsed: 0.106 s
06:40:41 [2020-07-18T10:40:41.479Z] disconnectThreadInSuspendedState(org.eclipse.ease.lang.python.jython.debugger.JythonDebugTest)  Time elapsed: 0.209 s
06:40:41 [2020-07-18T10:40:41.479Z] stepReturnOnDebugTarget(org.eclipse.ease.lang.python.jython.debugger.JythonDebugTest)  Time elapsed: 0.308 s
06:40:41 [2020-07-18T10:40:41.479Z] nullVariable(org.eclipse.ease.lang.python.jython.debugger.JythonDebugTest)  Time elapsed: 0.308 s
06:40:41 [2020-07-18T10:40:41.479Z] stepOverOnStackFrame(org.eclipse.ease.lang.python.jython.debugger.JythonDebugTest)  Time elapsed: 0.307 s
06:40:41 [2020-07-18T10:40:41.479Z] resumeOnDebugTarget(org.eclipse.ease.lang.python.jython.debugger.JythonDebugTest)  Time elapsed: 0.206 s
06:40:41 [2020-07-18T10:40:41.479Z] modifyVariableKeepingType(org.eclipse.ease.lang.python.jython.debugger.JythonDebugTest)  Time elapsed: 0.506 s
06:40:41 [2020-07-18T10:40:41.479Z] resumeOnLastIncludeLine(org.eclipse.ease.lang.python.jython.debugger.JythonDebugTest)  Time elapsed: 0.206 s
06:40:41 [2020-07-18T10:40:41.479Z] stepReturnOnStackFrame(org.eclipse.ease.lang.python.jython.debugger.JythonDebugTest)  Time elapsed: 0.306 s
06:40:41 [2020-07-18T10:40:41.479Z] terminateStackFrameInSuspendedState(org.eclipse.ease.lang.python.jython.debugger.JythonDebugTest)  Time elapsed: 0.208 s
06:40:41 [2020-07-18T10:40:41.479Z] breakpointLocation(org.eclipse.ease.lang.python.jython.debugger.JythonDebugTest)  Time elapsed: 0.107 s  <<< FAILURE!
06:40:41 [2020-07-18T10:40:41.479Z] java.lang.AssertionError: expected:<1> but was:<0>
06:40:41 [2020-07-18T10:40:41.479Z] 
06:40:41 [2020-07-18T10:40:41.479Z] stepReturnOnThread(org.eclipse.ease.lang.python.jython.debugger.JythonDebugTest)  Time elapsed: 0.307 s
06:40:41 [2020-07-18T10:40:41.479Z] javaClassVariable(org.eclipse.ease.lang.python.jython.debugger.JythonDebugTest)  Time elapsed: 0.307 s
06:40:41 [2020-07-18T10:40:41.479Z] stepIntoOnThread(org.eclipse.ease.lang.python.jython.debugger.JythonDebugTest)  Time elapsed: 0.307 s
06:40:41 [2020-07-18T10:40:41.479Z] terminateThreadInSuspendedState(org.eclipse.ease.lang.python.jython.debugger.JythonDebugTest)  Time elapsed: 0.205 s
06:40:41 [2020-07-18T10:40:41.479Z] resumeOnThread(org.eclipse.ease.lang.python.jython.debugger.JythonDebugTest)  Time elapsed: 0.206 s
06:40:41 [2020-07-18T10:40:41.479Z] stepIntoOnStackFrame(org.eclipse.ease.lang.python.jython.debugger.JythonDebugTest)  Time elapsed: 0.307 s
06:40:41 [2020-07-18T10:40:41.479Z] terminateProcessInSuspendedState(org.eclipse.ease.lang.python.jython.debugger.JythonDebugTest)  Time elapsed: 0.206 s
06:40:41 [2020-07-18T10:40:41.479Z] stepOverOnProcess(org.eclipse.ease.lang.python.jython.debugger.JythonDebugTest)  Time elapsed: 0.306 s
06:40:41 [2020-07-18T10:40:41.479Z] nativeArrayVariable(org.eclipse.ease.lang.python.jython.debugger.JythonDebugTest)  Time elapsed: 0.307 s
06:40:41 [2020-07-18T10:40:41.479Z] disconnectDebugTargetInSuspendedState(org.eclipse.ease.lang.python.jython.debugger.JythonDebugTest)  Time elapsed: 0.205 s
06:40:41 [2020-07-18T10:40:41.479Z] stepIntoOnProcess(org.eclipse.ease.lang.python.jython.debugger.JythonDebugTest)  Time elapsed: 0.306 s
06:40:41 [2020-07-18T10:40:41.479Z] terminatedState(org.eclipse.ease.lang.python.jython.debugger.JythonDebugTest)  Time elapsed: 0.105 s
06:40:41 [2020-07-18T10:40:41.479Z] stepOverIncludeCommand(org.eclipse.ease.lang.python.jython.debugger.JythonDebugTest)  Time elapsed: 0.304 s
06:40:41 [2020-07-18T10:40:41.479Z] innerScopeVariableBeforeOuterScopeVariable(org.eclipse.ease.lang.python.jython.debugger.JythonDebugTest)  Time elapsed: 0.306 s
06:40:41 [2020-07-18T10:40:41.479Z] stepIntoIncludeCommand(org.eclipse.ease.lang.python.jython.debugger.JythonDebugTest)  Time elapsed: 0.305 s
06:40:41 [2020-07-18T10:40:41.479Z] primitiveStringVariable(org.eclipse.ease.lang.python.jython.debugger.JythonDebugTest)  Time elapsed: 0.306 s
06:40:41 [2020-07-18T10:40:41.479Z] resumeOnProcess(org.eclipse.ease.lang.python.jython.debugger.JythonDebugTest)  Time elapsed: 0.204 s
06:40:41 [2020-07-18T10:40:41.479Z] stepIntoOnDebugTarget(org.eclipse.ease.lang.python.jython.debugger.JythonDebugTest)  Time elapsed: 0.307 s
06:40:41 [2020-07-18T10:40:41.479Z] stepOverOnThread(org.eclipse.ease.lang.python.jython.debugger.JythonDebugTest)  Time elapsed: 0.306 s
06:40:41 [2020-07-18T10:40:41.479Z] suspendedState(org.eclipse.ease.lang.python.jython.debugger.JythonDebugTest)  Time elapsed: 0.205 s
06:40:41 [2020-07-18T10:40:41.479Z] primitiveDoubleVariable(org.eclipse.ease.lang.python.jython.debugger.JythonDebugTest)  Time elapsed: 0.305 s
06:40:41 [2020-07-18T10:40:41.479Z] resumeOnStackFrame(org.eclipse.ease.lang.python.jython.debugger.JythonDebugTest)  Time elapsed: 0.205 s
06:40:41 [2020-07-18T10:40:41.479Z] nativeObjectVariable(org.eclipse.ease.lang.python.jython.debugger.JythonDebugTest)  Time elapsed: 0.306 s
06:40:41 [2020-07-18T10:40:41.479Z] terminateDebugTargetInSuspendedState(org.eclipse.ease.lang.python.jython.debugger.JythonDebugTest)  Time elapsed: 0.205 s
06:40:41 [2020-07-18T10:40:41.479Z] disconnectStackFrameInSuspendedState(org.eclipse.ease.lang.python.jython.debugger.JythonDebugTest)  Time elapsed: 0.205 s
06:40:41 [2020-07-18T10:40:41.479Z] stepReturnOnProcess(org.eclipse.ease.lang.python.jython.debugger.JythonDebugTest)  Time elapsed: 0.306 s
06:40:41 [2020-07-18T10:40:41.479Z] evaluateWatchExpression(org.eclipse.ease.lang.python.jython.debugger.JythonDebugTest)  Time elapsed: 0.207 s
06:40:41 [2020-07-18T10:40:41.479Z] 
06:40:41 [2020-07-18T10:40:41.480Z] Results:
06:40:41 [2020-07-18T10:40:41.480Z] 
06:40:41 [2020-07-18T10:40:41.480Z] Failures: 
06:40:41 [2020-07-18T10:40:41.480Z]   JythonDebugTest>AbstractDebugTest.breakpointLocation:150 expected:<1> but was:<0>
06:40:41 [2020-07-18T10:40:41.480Z] 
06:40:41 [2020-07-18T10:40:41.480Z] Tests run: 42, Failures: 1, Errors: 0, Skipped: 0
06:40:41 [2020-07-18T10:40:41.480Z] 
06:40:42 [2020-07-18T10:40:42.040Z] [INFO] ------------------------------------------------------------------------
06:40:42 [2020-07-18T10:40:42.040Z] [INFO] Reactor Summary:
06:40:42 [2020-07-18T10:40:42.040Z] [INFO] 
06:40:42 [2020-07-18T10:40:42.040Z] [INFO] org.eclipse.ease.releng 0.8.0-SNAPSHOT ............. SUCCESS [  9.289 s]
06:40:42 [2020-07-18T10:40:42.040Z] [INFO] org.eclipse.ease.classloader 0.8.0-SNAPSHOT ........ SUCCESS [  3.924 s]
06:40:42 [2020-07-18T10:40:42.040Z] [INFO] org.eclipse.ease 0.8.0-SNAPSHOT .................... SUCCESS [  2.448 s]
06:40:42 [2020-07-18T10:40:42.040Z] [INFO] org.eclipse.ease.ui 0.8.0-SNAPSHOT ................. SUCCESS [  2.487 s]
06:40:42 [2020-07-18T10:40:42.040Z] [INFO] org.eclipse.ease.ui.completions.java 0.8.0-SNAPSHOT  SUCCESS [  1.764 s]
06:40:42 [2020-07-18T10:40:42.040Z] [INFO] org.eclipse.ease.ui.scripts 0.8.0-SNAPSHOT ......... SUCCESS [  2.526 s]
06:40:42 [2020-07-18T10:40:42.040Z] [INFO] org.eclipse.ease.lang.javascript 0.8.0-SNAPSHOT .... SUCCESS [  1.392 s]
06:40:42 [2020-07-18T10:40:42.040Z] [INFO] org.eclipse.ease.lang.scriptarchive 0.8.0-SNAPSHOT . SUCCESS [  1.348 s]
06:40:42 [2020-07-18T10:40:42.040Z] [INFO] org.eclipse.ease.lang.python 0.8.0-SNAPSHOT ........ SUCCESS [  1.583 s]
06:40:42 [2020-07-18T10:40:42.040Z] [INFO] org.eclipse.ease.lang.python.py4j 0.8.0-SNAPSHOT ... SUCCESS [  1.696 s]
06:40:42 [2020-07-18T10:40:42.040Z] [INFO] org.eclipse.ease.lang.groovy 0.8.0-SNAPSHOT ........ SUCCESS [  1.300 s]
06:40:42 [2020-07-18T10:40:42.040Z] [INFO] org.eclipse.ease.lang.groovy.interpreter 0.8.0-SNAPSHOT SUCCESS [  1.393 s]
06:40:42 [2020-07-18T10:40:42.040Z] [INFO] org.eclipse.ease.lang.unittest 0.8.0-SNAPSHOT ...... SUCCESS [  1.863 s]
06:40:42 [2020-07-18T10:40:42.040Z] [INFO] org.eclipse.ease.lang.unittest.ui 0.8.0-SNAPSHOT ... SUCCESS [  1.802 s]
06:40:42 [2020-07-18T10:40:42.040Z] [INFO] org.eclipse.ease.lang.ruby 0.8.0-SNAPSHOT .......... SUCCESS [  1.271 s]
06:40:42 [2020-07-18T10:40:42.040Z] [INFO] org.eclipse.ease.lang.ruby.jruby 0.8.0-SNAPSHOT .... SUCCESS [  1.524 s]
06:40:42 [2020-07-18T10:40:42.041Z] [INFO] org.eclipse.ease.lang.javascript.nashorn 0.8.0-SNAPSHOT SUCCESS [  1.424 s]
06:40:42 [2020-07-18T10:40:42.041Z] [INFO] org.eclipse.ease.lang.javascript.rhino 0.8.0-SNAPSHOT SUCCESS [  1.553 s]
06:40:42 [2020-07-18T10:40:42.041Z] [INFO] org.eclipse.ease.lang.python.jython 0.8.0-SNAPSHOT . SUCCESS [  1.556 s]
06:40:42 [2020-07-18T10:40:42.041Z] [INFO] org.eclipse.ease.lang.javascript.ui 0.8.0-SNAPSHOT . SUCCESS [  1.657 s]
06:40:42 [2020-07-18T10:40:42.041Z] [INFO] org.eclipse.ease.lang.jvm.compiled 0.8.0-SNAPSHOT .. SUCCESS [  1.422 s]
06:40:42 [2020-07-18T10:40:42.041Z] [INFO] org.eclipse.ease.lang.scriptarchive.ui 0.8.0-SNAPSHOT SUCCESS [  1.385 s]
06:40:42 [2020-07-18T10:40:42.041Z] [INFO] org.eclipse.ease.help 0.8.0-SNAPSHOT ............... SUCCESS [  0.078 s]
06:40:42 [2020-07-18T10:40:42.041Z] [INFO] org.eclipse.ease.feature 0.8.0-SNAPSHOT ............ SUCCESS [  0.157 s]
06:40:42 [2020-07-18T10:40:42.041Z] [INFO] org.eclipse.ease.ui.feature 0.8.0-SNAPSHOT ......... SUCCESS [  0.191 s]
06:40:42 [2020-07-18T10:40:42.041Z] [INFO] org.eclipse.ease.lang.javascript.feature 0.8.0-SNAPSHOT SUCCESS [  0.084 s]
06:40:42 [2020-07-18T10:40:42.041Z] [INFO] org.eclipse.ease.lang.python.feature 0.8.0-SNAPSHOT  SUCCESS [  0.071 s]
06:40:42 [2020-07-18T10:40:42.041Z] [INFO] org.eclipse.ease.python.jython.feature 0.8.0-SNAPSHOT SUCCESS [  0.088 s]
06:40:42 [2020-07-18T10:40:42.041Z] [INFO] org.eclipse.ease.lang.python.py4j.feature 0.8.0-SNAPSHOT SUCCESS [  0.087 s]
06:40:42 [2020-07-18T10:40:42.041Z] [INFO] org.eclipse.ease.lang.jvm.feature 0.8.0-SNAPSHOT ... SUCCESS [  0.081 s]
06:40:42 [2020-07-18T10:40:42.041Z] [INFO] org.eclipse.ease.lang.groovy.feature 0.8.0-SNAPSHOT  SUCCESS [  0.087 s]
06:40:42 [2020-07-18T10:40:42.041Z] [INFO] org.eclipse.ease.lang.ruby.feature 0.8.0-SNAPSHOT .. SUCCESS [  0.097 s]
06:40:42 [2020-07-18T10:40:42.041Z] [INFO] org.eclipse.ease.lang.scriptarchive.feature 0.8.0-SNAPSHOT SUCCESS [  0.081 s]
06:40:42 [2020-07-18T10:40:42.041Z] [INFO] org.eclipse.ease.lang.unittest.feature 0.8.0-SNAPSHOT SUCCESS [  0.098 s]
06:40:42 [2020-07-18T10:40:42.041Z] [INFO] org.eclipse.ease.releng.target 0.8.0-SNAPSHOT ...... SUCCESS [  0.009 s]
06:40:42 [2020-07-18T10:40:42.041Z] [INFO] org.eclipse.ease.releng.p2 0.8.0-SNAPSHOT .......... SUCCESS [  3.105 s]
06:40:42 [2020-07-18T10:40:42.041Z] [INFO] org.eclipse.ease.testhelper 0.8.0-SNAPSHOT ......... SUCCESS [  1.421 s]
06:40:42 [2020-07-18T10:40:42.041Z] [INFO] org.eclipse.ease.test 0.8.0-SNAPSHOT ............... SUCCESS [ 11.238 s]
06:40:42 [2020-07-18T10:40:42.041Z] [INFO] org.eclipse.ease.lang.javascript.nashorn.test 0.8.0-SNAPSHOT SUCCESS [  3.753 s]
06:40:42 [2020-07-18T10:40:42.041Z] [INFO] org.eclipse.ease.lang.javascript.rhino.test 0.8.0-SNAPSHOT SUCCESS [ 15.248 s]
06:40:42 [2020-07-18T10:40:42.041Z] [INFO] org.eclipse.ease.lang.javascript.test 0.8.0-SNAPSHOT SUCCESS [  3.736 s]
06:40:42 [2020-07-18T10:40:42.041Z] [INFO] org.eclipse.ease.lang.python.test 0.8.0-SNAPSHOT ... SUCCESS [  3.204 s]
06:40:42 [2020-07-18T10:40:42.041Z] [INFO] org.eclipse.ease.lang.python.jython.test 0.8.0-SNAPSHOT FAILURE [ 16.838 s]
06:40:42 [2020-07-18T10:40:42.041Z] [INFO] org.eclipse.ease.lang.python.py4j.test 0.8.0-SNAPSHOT SKIPPED
06:40:42 [2020-07-18T10:40:42.041Z] [INFO] org.eclipse.ease.lang.scriptarchive.test 0.8.0-SNAPSHOT SKIPPED
06:40:42 [2020-07-18T10:40:42.041Z] [INFO] org.eclipse.ease.lang.unittest.test 0.8.0-SNAPSHOT . SKIPPED
06:40:42 [2020-07-18T10:40:42.041Z] [INFO] org.eclipse.ease.ui.test 0.8.0-SNAPSHOT ............ SKIPPED
06:40:42 [2020-07-18T10:40:42.041Z] [INFO] EASE (Incubation) 0.4.0-SNAPSHOT ................... SKIPPED
06:40:42 [2020-07-18T10:40:42.041Z] [INFO] ------------------------------------------------------------------------
06:40:42 [2020-07-18T10:40:42.041Z] [INFO] BUILD FAILURE
06:40:42 [2020-07-18T10:40:42.041Z] [INFO] ------------------------------------------------------------------------
06:40:42 [2020-07-18T10:40:42.041Z] [INFO] Total time:  04:14 min
06:40:42 [2020-07-18T10:40:42.041Z] [INFO] Finished at: 2020-07-18T10:40:41Z
06:40:42 [2020-07-18T10:40:42.041Z] [INFO] ------------------------------------------------------------------------
06:40:42 [2020-07-18T10:40:42.041Z] [INFO] [jenkins-event-spy] Generated /home/jenkins/agent/workspace/ease.verify.core.target.2019-12@tmp/withMaven53839bc7/maven-spy-20200718-103627-1688697007101627527790.log
06:40:42 [2020-07-18T10:40:42.041Z] [ERROR] Failed to execute goal org.eclipse.tycho:tycho-surefire-plugin:1.3.0:test (default-test) on project org.eclipse.ease.lang.python.jython.test: There are test failures.
06:40:42 [2020-07-18T10:40:42.041Z] [ERROR] 
06:40:42 [2020-07-18T10:40:42.041Z] [ERROR] Please refer to /home/jenkins/agent/workspace/ease.verify.core.target.2019-12/tests/org.eclipse.ease.lang.python.jython.test/target/surefire-reports for the individual test results.
06:40:42 [2020-07-18T10:40:42.041Z] [ERROR] -> [Help 1]
06:40:42 [2020-07-18T10:40:42.041Z] [ERROR] 
06:40:42 [2020-07-18T10:40:42.041Z] [ERROR] To see the full stack trace of the errors, re-run Maven with the -e switch.
06:40:42 [2020-07-18T10:40:42.041Z] [ERROR] Re-run Maven using the -X switch to enable full debug logging.
06:40:42 [2020-07-18T10:40:42.041Z] [ERROR] 
06:40:42 [2020-07-18T10:40:42.041Z] [ERROR] For more information about the errors and possible solutions, please read the following articles:
06:40:42 [2020-07-18T10:40:42.041Z] [ERROR] [Help 1] http://cwiki.apache.org/confluence/display/MAVEN/MojoFailureException
06:40:42 [2020-07-18T10:40:42.041Z] [ERROR] 
06:40:42 [2020-07-18T10:40:42.041Z] [ERROR] After correcting the problems, you can resume the build with the command
06:40:42 [2020-07-18T10:40:42.041Z] [ERROR]   mvn <args> -rf :org.eclipse.ease.lang.python.jython.test
[Pipeline] }
06:40:44 [2020-07-18T10:40:44.485Z] [withMaven] Publishers: Pipeline Graph Publisher: 34 ms, Invoker Publisher: 1 ms, Junit Publisher: 1 ms, Dependencies Fingerprint Publisher: 827 ms
[Pipeline] // withMaven
[Pipeline] }
[Pipeline] // stage
[Pipeline] stage
[Pipeline] { (Test)
Stage "Test" skipped due to earlier failure(s)
[Pipeline] }
[Pipeline] // stage
[Pipeline] stage
[Pipeline] { (Declarative: Post Actions)
[Pipeline] archiveArtifacts
06:40:44 [2020-07-18T10:40:44.532Z] Archiving artifacts
[Pipeline] emailext
06:40:55 [2020-07-18T10:40:55.907Z] Sending email to: christian.pontesegger@web.de
[Pipeline] }
[Pipeline] // stage
[Pipeline] }
[Pipeline] // timeout
[Pipeline] }
[Pipeline] // timestamps
[Pipeline] }
[Pipeline] // node
[Pipeline] End of Pipeline
ERROR: script returned exit code 1
Finished: FAILURE