AbortedConsole Output

Skipping 835 KB.. Full Log
eclipse.org/releases/2019-12/201912181000/plugins/ (284.94kB)
[INFO] Fetching org.eclipse.equinox.http.jetty_3.7.300.v20191015-2006.jar.pack.gz from http://download.eclipse.org/releases/2019-12/201912181000/plugins/ (16.29kB)
[INFO] Fetching org.eclipse.equinox.http.jetty_3.7.300.v20191015-2006.jar.pack.gz from http://download.eclipse.org/releases/2019-12/201912181000/plugins/ (16.29kB)
[INFO] Fetching org.eclipse.ui.browser_3.6.600.v20191122-2109.jar.pack.gz from http://download.eclipse.org/releases/2019-12/201912181000/plugins/ (97.35kB)
[INFO] Fetching org.eclipse.ui.browser_3.6.600.v20191122-2109.jar.pack.gz from http://download.eclipse.org/releases/2019-12/201912181000/plugins/ (97.35kB)
[INFO] Fetching org.eclipse.equinox.http.servlet_1.6.300.v20191011-1612.jar.pack.gz from http://download.eclipse.org/releases/2019-12/201912181000/plugins/ (76.5kB)
[INFO] Fetching org.eclipse.equinox.http.servlet_1.6.300.v20191011-1612.jar.pack.gz from http://download.eclipse.org/releases/2019-12/201912181000/plugins/ (76.5kB)
[INFO] Fetching org.eclipse.jetty.http_9.4.24.v20191120.jar from http://download.eclipse.org/releases/2019-12/201912181000/plugins/ (219.72kB)
[INFO] Fetching org.eclipse.jetty.http_9.4.24.v20191120.jar from http://download.eclipse.org/releases/2019-12/201912181000/plugins/ (219.72kB)
[INFO] Fetching org.eclipse.jetty.server_9.4.24.v20191120.jar from http://download.eclipse.org/releases/2019-12/201912181000/plugins/ (691.08kB)
[INFO] Fetching org.eclipse.jetty.server_9.4.24.v20191120.jar from http://download.eclipse.org/releases/2019-12/201912181000/plugins/ (691.08kB)
[INFO] Fetching org.eclipse.jetty.servlet_9.4.24.v20191120.jar from http://download.eclipse.org/releases/2019-12/201912181000/plugins/ (139.05kB)
[INFO] Fetching org.eclipse.jetty.servlet_9.4.24.v20191120.jar from http://download.eclipse.org/releases/2019-12/201912181000/plugins/ (139.05kB)
[INFO] Fetching org.eclipse.jetty.util_9.4.24.v20191120.jar from http://download.eclipse.org/releases/2019-12/201912181000/plugins/ (571.31kB)
[INFO] Fetching org.eclipse.jetty.util_9.4.24.v20191120.jar from http://download.eclipse.org/releases/2019-12/201912181000/plugins/ (571.31kB)
[INFO] Fetching org.eclipse.equinox.jsp.jasper_1.1.300.v20190714-1850.jar.pack.gz from http://download.eclipse.org/releases/2019-12/201912181000/plugins/ (14.71kB)
[INFO] Fetching org.eclipse.equinox.jsp.jasper_1.1.300.v20190714-1850.jar.pack.gz from http://download.eclipse.org/releases/2019-12/201912181000/plugins/ (14.71kB)
[INFO] Fetching org.eclipse.help.base_4.2.800.v20191210-0610.jar.pack.gz from http://download.eclipse.org/releases/2019-12/201912181000/plugins/ (175.92kB)
[INFO] Fetching org.eclipse.help.base_4.2.800.v20191210-0610.jar.pack.gz from http://download.eclipse.org/releases/2019-12/201912181000/plugins/ (175.92kB)
[INFO] Fetching org.eclipse.jdt.core.manipulation_1.13.0.v20191203-0859.jar.pack.gz from http://download.eclipse.org/releases/2019-12/201912181000/plugins/ (485.06kB)
[INFO] Fetching org.eclipse.jdt.core.manipulation_1.13.0.v20191203-0859.jar.pack.gz from http://download.eclipse.org/releases/2019-12/201912181000/plugins/ (485.06kB)
[INFO] Fetching org.eclipse.jdt.launching_3.16.0.v20191108-0353.jar.pack.gz from http://download.eclipse.org/releases/2019-12/201912181000/plugins/ (273.76kB)
[INFO] Fetching org.eclipse.jdt.launching_3.16.0.v20191108-0353.jar.pack.gz from http://download.eclipse.org/releases/2019-12/201912181000/plugins/ (273.76kB)
[INFO] Fetching org.eclipse.jdt.debug_3.14.0.v20191105-0758.jar.pack.gz from http://download.eclipse.org/releases/2019-12/201912181000/plugins/ (937.08kB)
[INFO] Fetching org.eclipse.jdt.debug_3.14.0.v20191105-0758.jar.pack.gz from http://download.eclipse.org/releases/2019-12/201912181000/plugins/ (937.08kB)
[INFO] Fetching org.eclipse.jetty.io_9.4.24.v20191120.jar from http://download.eclipse.org/releases/2019-12/201912181000/plugins/ (170.14kB)
[INFO] Fetching org.eclipse.jetty.io_9.4.24.v20191120.jar from http://download.eclipse.org/releases/2019-12/201912181000/plugins/ (170.14kB)
[INFO] Fetching org.eclipse.jetty.security_9.4.24.v20191120.jar from http://download.eclipse.org/releases/2019-12/201912181000/plugins/ (126.39kB)
[INFO] Fetching org.eclipse.jetty.security_9.4.24.v20191120.jar from http://download.eclipse.org/releases/2019-12/201912181000/plugins/ (126.39kB)
[WARNING] The following locally built units have been used to resolve project dependencies:
[WARNING]   org.eclipse.ease.ui/0.8.0.I202003230858
[WARNING]   org.eclipse.ease.ui.completions.java/0.8.0.I201910171213
[WARNING]   org.eclipse.ease/0.8.0.I202006040906
[WARNING]   org.eclipse.ease.classloader/0.8.0.I201910171213
[INFO] Resolving class path of MavenProject: org.eclipse.ease:org.eclipse.ease.ui.test:0.8.0-SNAPSHOT @ /home/jenkins/agent/workspace/ease.verify.core.target.2019-12/tests/org.eclipse.ease.ui.test/pom.xml
[WARNING] The project org.eclipse.ease:org.eclipse.ease.releng:pom:0.8.0-SNAPSHOT uses prerequisites which is only intended for maven-plugin projects but not for non maven-plugin projects. For such purposes you should use the maven-enforcer-plugin. See https://maven.apache.org/enforcer/enforcer-rules/requireMavenVersion.html
[WARNING] [jenkins-event-spy] Unexpected Maven project file name 'target-tests-pom.xml', problems may occur
[INFO] ------------------------------------------------------------------------
[INFO] Reactor Build Order:
[INFO] 
[INFO] org.eclipse.ease.releng                                            [pom]
[INFO] org.eclipse.ease.releng.target               [eclipse-target-definition]
[INFO] org.eclipse.ease.test                              [eclipse-test-plugin]
[INFO] org.eclipse.ease.lang.javascript.nashorn.test      [eclipse-test-plugin]
[INFO] org.eclipse.ease.lang.javascript.rhino.test        [eclipse-test-plugin]
[INFO] org.eclipse.ease.lang.javascript.test              [eclipse-test-plugin]
[INFO] org.eclipse.ease.lang.python.test                  [eclipse-test-plugin]
[INFO] org.eclipse.ease.lang.python.jython.test           [eclipse-test-plugin]
[INFO] org.eclipse.ease.lang.python.py4j.test             [eclipse-test-plugin]
[INFO] org.eclipse.ease.lang.scriptarchive.test           [eclipse-test-plugin]
[INFO] org.eclipse.ease.ui.test                           [eclipse-test-plugin]
[WARNING] [jenkins-event-spy] Unexpected Maven project file name 'target-tests-pom.xml', problems may occur
[INFO] 
[INFO] --------------< org.eclipse.ease:org.eclipse.ease.releng >--------------
[INFO] Building org.eclipse.ease.releng 0.8.0-SNAPSHOT                   [1/11]
[INFO] --------------------------------[ pom ]---------------------------------
[WARNING] [jenkins-event-spy] Unexpected Maven project file name 'target-tests-pom.xml', problems may occur
[INFO] 
[INFO] ----------< org.eclipse.ease:org.eclipse.ease.releng.target >-----------
[INFO] Building org.eclipse.ease.releng.target 0.8.0-SNAPSHOT            [2/11]
[INFO] ---------------------[ eclipse-target-definition ]----------------------
[INFO] 
[INFO] --- tycho-source-plugin:1.3.0:plugin-source (plugin-source) @ org.eclipse.ease.releng.target ---
[INFO] 
[INFO] --- tycho-packaging-plugin:1.3.0:package-target-definition (default-package-target-definition) @ org.eclipse.ease.releng.target ---
[INFO] 
[INFO] --- tycho-source-feature-plugin:1.3.0:source-feature (source-feature) @ org.eclipse.ease.releng.target ---
[INFO] 
[INFO] --- tycho-p2-plugin:1.3.0:p2-metadata (attached-p2-metadata) @ org.eclipse.ease.releng.target ---
[INFO] 
[INFO] ---------------< org.eclipse.ease:org.eclipse.ease.test >---------------
[INFO] Building org.eclipse.ease.test 0.8.0-SNAPSHOT                     [3/11]
[INFO] ------------------------[ eclipse-test-plugin ]-------------------------
[INFO] 
[INFO] --- tycho-packaging-plugin:1.3.0:build-qualifier (default-build-qualifier) @ org.eclipse.ease.test ---
[INFO] The project's OSGi version is 0.8.0.I201910171213
[INFO] 
[INFO] --- tycho-packaging-plugin:1.3.0:validate-id (default-validate-id) @ org.eclipse.ease.test ---
[INFO] 
[INFO] --- tycho-packaging-plugin:1.3.0:validate-version (default-validate-version) @ org.eclipse.ease.test ---
[INFO] 
[INFO] --- maven-resources-plugin:2.4.3:resources (default-resources) @ org.eclipse.ease.test ---
[INFO] Using 'UTF-8' encoding to copy filtered resources.
[INFO] skip non existing resourceDirectory /home/jenkins/agent/workspace/ease.verify.core.target.2019-12/tests/org.eclipse.ease.test/src/main/resources
[INFO] 
[INFO] --- tycho-compiler-plugin:1.3.0:compile (default-compile) @ org.eclipse.ease.test ---
[INFO] Nothing to compile - all classes are up to date
[INFO] 
[INFO] --- maven-resources-plugin:2.4.3:testResources (default-testResources) @ org.eclipse.ease.test ---
[INFO] Using 'UTF-8' encoding to copy filtered resources.
[INFO] skip non existing resourceDirectory /home/jenkins/agent/workspace/ease.verify.core.target.2019-12/tests/org.eclipse.ease.test/src/test/resources
[INFO] 
[INFO] --- tycho-source-plugin:1.3.0:plugin-source (plugin-source) @ org.eclipse.ease.test ---
[INFO] Building jar: /home/jenkins/agent/workspace/ease.verify.core.target.2019-12/tests/org.eclipse.ease.test/target/org.eclipse.ease.test-0.8.0-SNAPSHOT-sources.jar
[INFO] 
[INFO] --- target-platform-configuration:1.3.0:target-platform (default-target-platform) @ org.eclipse.ease.test ---
[INFO] 
[INFO] --- tycho-packaging-plugin:1.3.0:package-plugin (default-package-plugin) @ org.eclipse.ease.test ---
[INFO] Building jar: /home/jenkins/agent/workspace/ease.verify.core.target.2019-12/tests/org.eclipse.ease.test/target/org.eclipse.ease.test-0.8.0-SNAPSHOT.jar
[INFO] 
[INFO] --- tycho-p2-plugin:1.3.0:p2-metadata-default (default-p2-metadata-default) @ org.eclipse.ease.test ---
[INFO] 
[INFO] --- tycho-source-feature-plugin:1.3.0:source-feature (source-feature) @ org.eclipse.ease.test ---
[INFO] 
[INFO] --- tycho-p2-plugin:1.3.0:p2-metadata (attached-p2-metadata) @ org.eclipse.ease.test ---
[INFO] 
[INFO] --- tycho-surefire-plugin:1.3.0:test (default-test) @ org.eclipse.ease.test ---
[INFO] Expected eclipse log file: /home/jenkins/agent/workspace/ease.verify.core.target.2019-12/tests/org.eclipse.ease.test/target/work/data/.metadata/.log
[INFO] Command line:
	[/opt/tools/java/oracle/jdk-8/1.8.0_202/jre/bin/java, -Dosgi.noShutdown=false, -Dosgi.os=linux, -Dosgi.ws=gtk, -Dosgi.arch=x86_64, -Dosgi.clean=true, -jar, /home/jenkins/.m2/repository/p2/osgi/bundle/org.eclipse.equinox.launcher/1.5.600.v20191014-2022/org.eclipse.equinox.launcher-1.5.600.v20191014-2022.jar, -data, /home/jenkins/agent/workspace/ease.verify.core.target.2019-12/tests/org.eclipse.ease.test/target/work/data, -install, /home/jenkins/agent/workspace/ease.verify.core.target.2019-12/tests/org.eclipse.ease.test/target/work, -configuration, /home/jenkins/agent/workspace/ease.verify.core.target.2019-12/tests/org.eclipse.ease.test/target/work/configuration, -application, org.eclipse.tycho.surefire.osgibooter.headlesstest, -testproperties, /home/jenkins/agent/workspace/ease.verify.core.target.2019-12/tests/org.eclipse.ease.test/target/surefire.properties]
Picked up JAVA_TOOL_OPTIONS: -XX:+IgnoreUnrecognizedVMOptions -XX:+UseContainerSupport -XX:+UnlockExperimentalVMOptions -XX:+UseCGroupMemoryLimitForHeap -Dmaven.ext.class.path="/home/jenkins/agent/workspace/ease.verify.core.target.2019-12@tmp/withMaven4ab1285b/pipeline-maven-spy.jar" -Dorg.jenkinsci.plugins.pipeline.maven.reportsFolder="/home/jenkins/agent/workspace/ease.verify.core.target.2019-12@tmp/withMaven4ab1285b" 
Picked up _JAVA_OPTIONS: -XX:MaxRAMPercentage=64.0
Running org.eclipse.ease.AbstractCodeFactoryTest
Tests run: 1, Failures: 0, Errors: 0, Skipped: 0, Time elapsed: 0.317 s - in org.eclipse.ease.AbstractCodeFactoryTest
createNewKeywordHeader(org.eclipse.ease.AbstractCodeFactoryTest)  Time elapsed: 0.28 s
Running org.eclipse.ease.tools.StringToolsTest
Tests run: 8, Failures: 0, Errors: 0, Skipped: 0, Time elapsed: 0.008 s - in org.eclipse.ease.tools.StringToolsTest
parseArgumentsNull(org.eclipse.ease.tools.StringToolsTest)  Time elapsed: 0.001 s
parseArgumentsQuotedSingle(org.eclipse.ease.tools.StringToolsTest)  Time elapsed: 0.001 s
parseArgumentsEmpty(org.eclipse.ease.tools.StringToolsTest)  Time elapsed: 0 s
parseArgumentsMixedMultiple(org.eclipse.ease.tools.StringToolsTest)  Time elapsed: 0 s
parseArgumentsMixedMultipleLines(org.eclipse.ease.tools.StringToolsTest)  Time elapsed: 0.001 s
parseArgumentsNonQuotedMultiple(org.eclipse.ease.tools.StringToolsTest)  Time elapsed: 0 s
parseArgumentsNonQuotedSingle(org.eclipse.ease.tools.StringToolsTest)  Time elapsed: 0.001 s
parseArgumentsQuotedMultiple(org.eclipse.ease.tools.StringToolsTest)  Time elapsed: 0 s
Running org.eclipse.ease.tools.ResourceToolsTest
Tests run: 47, Failures: 0, Errors: 0, Skipped: 0, Time elapsed: 0.271 s - in org.eclipse.ease.tools.ResourceToolsTest
resolveScriptLocation(org.eclipse.ease.tools.ResourceToolsTest)  Time elapsed: 0.145 s
getWorkspaceInputStream(org.eclipse.ease.tools.ResourceToolsTest)  Time elapsed: 0.001 s
resolvePlatformURI(org.eclipse.ease.tools.ResourceToolsTest)  Time elapsed: 0.001 s
resolveScriptLocationWithSpacesInPath(org.eclipse.ease.tools.ResourceToolsTest)  Time elapsed: 0.005 s
resolveURL(org.eclipse.ease.tools.ResourceToolsTest)  Time elapsed: 0.002 s
invalidIsAbsolute(org.eclipse.ease.tools.ResourceToolsTest)  Time elapsed: 0 s
getFilesystemInputStream(org.eclipse.ease.tools.ResourceToolsTest)  Time elapsed: 0.002 s
toRelativeLocationInWorkspace(org.eclipse.ease.tools.ResourceToolsTest)  Time elapsed: 0 s
checkOperatingSystem(org.eclipse.ease.tools.ResourceToolsTest)  Time elapsed: 0 s
inputStreamToString(org.eclipse.ease.tools.ResourceToolsTest)  Time elapsed: 0.001 s
fileSystemToAbsoluteLocationOnLinux(org.eclipse.ease.tools.ResourceToolsTest)  Time elapsed: 0.001 s
exists(org.eclipse.ease.tools.ResourceToolsTest)  Time elapsed: 0 s
resolveRelativeInWorkspace(org.eclipse.ease.tools.ResourceToolsTest)  Time elapsed: 0.002 s
isFile(org.eclipse.ease.tools.ResourceToolsTest)  Time elapsed: 0 s
invalidToFile(org.eclipse.ease.tools.ResourceToolsTest)  Time elapsed: 0 s
resolveAbsoluteInFileSystem(org.eclipse.ease.tools.ResourceToolsTest)  Time elapsed: 0.001 s
resolveWindowsRoot(org.eclipse.ease.tools.ResourceToolsTest)  Time elapsed: 0 s
resolveRelativeInFileSystemOnWindows(org.eclipse.ease.tools.ResourceToolsTest)  Time elapsed: 0 s
isAbsoluteFileSystemPathOnWindows(org.eclipse.ease.tools.ResourceToolsTest)  Time elapsed: 0 s
readerToString(org.eclipse.ease.tools.ResourceToolsTest)  Time elapsed: 0 s
workspaceFileToString(org.eclipse.ease.tools.ResourceToolsTest)  Time elapsed: 0.001 s
toFile(org.eclipse.ease.tools.ResourceToolsTest)  Time elapsed: 0 s
toProjectRelativeLocation(org.eclipse.ease.tools.ResourceToolsTest)  Time elapsed: 0.001 s
getInvalidInputStream(org.eclipse.ease.tools.ResourceToolsTest)  Time elapsed: 0.008 s
resolveRelativeInFileSystemOnLinux(org.eclipse.ease.tools.ResourceToolsTest)  Time elapsed: 0.001 s
isFolder(org.eclipse.ease.tools.ResourceToolsTest)  Time elapsed: 0 s
fileSystemToAbsoluteLocationOnWindows(org.eclipse.ease.tools.ResourceToolsTest)  Time elapsed: 0 s
isAbsoluteWorkspacePath(org.eclipse.ease.tools.ResourceToolsTest)  Time elapsed: 0 s
isAbsoluteFileSystemPathOnLinux(org.eclipse.ease.tools.ResourceToolsTest)  Time elapsed: 0 s
resolveInvalid(org.eclipse.ease.tools.ResourceToolsTest)  Time elapsed: 0 s
resolveAbsoluteInFileSystemOnWindows(org.eclipse.ease.tools.ResourceToolsTest)  Time elapsed: 0.001 s
resolveScriptLocationWithSpacesInDomain(org.eclipse.ease.tools.ResourceToolsTest)  Time elapsed: 0.023 s
resolveRelativefromWorkspaceToFilesystem(org.eclipse.ease.tools.ResourceToolsTest)  Time elapsed: 0 s
resolveRelativeWithoutBaseFile(org.eclipse.ease.tools.ResourceToolsTest)  Time elapsed: 0.001 s
resolveInWorkspace(org.eclipse.ease.tools.ResourceToolsTest)  Time elapsed: 0 s
resolveScriptLocationWithSpecialCharactersInPath(org.eclipse.ease.tools.ResourceToolsTest)  Time elapsed: 0 s
filesystemFileToString(org.eclipse.ease.tools.ResourceToolsTest)  Time elapsed: 0.001 s
createURI(org.eclipse.ease.tools.ResourceToolsTest)  Time elapsed: 0 s
uriToAbsoluteLocation(org.eclipse.ease.tools.ResourceToolsTest)  Time elapsed: 0.001 s
createFolder(org.eclipse.ease.tools.ResourceToolsTest)  Time elapsed: 0.004 s
workspaceToAbsoluteLocation(org.eclipse.ease.tools.ResourceToolsTest)  Time elapsed: 0 s
resolveAbsoluteInFileSystemOnLinux(org.eclipse.ease.tools.ResourceToolsTest)  Time elapsed: 0 s
invalidToString(org.eclipse.ease.tools.ResourceToolsTest)  Time elapsed: 0 s
resolveRelativeURIs(org.eclipse.ease.tools.ResourceToolsTest)  Time elapsed: 0.002 s
resolveRelativeInFileSystem(org.eclipse.ease.tools.ResourceToolsTest)  Time elapsed: 0.001 s
resolveScriptLocationWithSpecialCharactersInDomain(org.eclipse.ease.tools.ResourceToolsTest)  Time elapsed: 0.024 s
isAbsoluteURL(org.eclipse.ease.tools.ResourceToolsTest)  Time elapsed: 0 s
Running org.eclipse.ease.tools.RunnableWithResultTest
Tests run: 2, Failures: 0, Errors: 0, Skipped: 0, Time elapsed: 0.003 s - in org.eclipse.ease.tools.RunnableWithResultTest
testException(org.eclipse.ease.tools.RunnableWithResultTest)  Time elapsed: 0 s
testResult(org.eclipse.ease.tools.RunnableWithResultTest)  Time elapsed: 0 s
Running org.eclipse.ease.adapters.ScriptableAdapterTest
Tests run: 5, Failures: 0, Errors: 0, Skipped: 0, Time elapsed: 0.017 s - in org.eclipse.ease.adapters.ScriptableAdapterTest
adaptURI(org.eclipse.ease.adapters.ScriptableAdapterTest)  Time elapsed: 0.012 s
adaptURL(org.eclipse.ease.adapters.ScriptableAdapterTest)  Time elapsed: 0 s
adaptWorkspaceFile(org.eclipse.ease.adapters.ScriptableAdapterTest)  Time elapsed: 0.001 s
getAdapterList(org.eclipse.ease.adapters.ScriptableAdapterTest)  Time elapsed: 0 s
adaptFilesystemFile(org.eclipse.ease.adapters.ScriptableAdapterTest)  Time elapsed: 0 s
Running org.eclipse.ease.sign.SignatureHelperTest
Tests run: 1, Failures: 0, Errors: 0, Skipped: 0, Time elapsed: 0.037 s - in org.eclipse.ease.sign.SignatureHelperTest
certificateTest(org.eclipse.ease.sign.SignatureHelperTest)  Time elapsed: 0.036 s
Running org.eclipse.ease.sign.VerifySignatureTest
Tests run: 1, Failures: 0, Errors: 0, Skipped: 0, Time elapsed: 0.013 s - in org.eclipse.ease.sign.VerifySignatureTest
testWithNonCodeParserScriptType(org.eclipse.ease.sign.VerifySignatureTest)  Time elapsed: 0.011 s
Running org.eclipse.ease.AbstractReplScriptEngineTest
testorg.eclipse.ease.ScriptExecutionException: Engine got terminated
java.lang.RuntimeException: ERROR
	at org.eclipse.ease.AbstractReplScriptEngineTest$MockedScriptEngine.execute(AbstractReplScriptEngineTest.java:61)
	at org.eclipse.ease.AbstractScriptEngine.inject(AbstractScriptEngine.java:226)
	at org.eclipse.ease.AbstractScriptEngine.run(AbstractScriptEngine.java:277)
	at org.eclipse.core.internal.jobs.Worker.run(Worker.java:63)
Hello worldHello world1Tests run: 20, Failures: 0, Errors: 0, Skipped: 0, Time elapsed: 3.016 s - in org.eclipse.ease.AbstractReplScriptEngineTest
terminateOnIdleAfterSchedule(org.eclipse.ease.AbstractReplScriptEngineTest)  Time elapsed: 0.046 s
terminateEngine(org.eclipse.ease.AbstractReplScriptEngineTest)  Time elapsed: 0.002 s
keepRunningOnIdle(org.eclipse.ease.AbstractReplScriptEngineTest)  Time elapsed: 1.005 s
extractEmptyArguments(org.eclipse.ease.AbstractReplScriptEngineTest)  Time elapsed: 0.001 s
setNotNullOutputStream(org.eclipse.ease.AbstractReplScriptEngineTest)  Time elapsed: 0 s
terminateViaMonitorCancellation(org.eclipse.ease.AbstractReplScriptEngineTest)  Time elapsed: 0.205 s
inject(org.eclipse.ease.AbstractReplScriptEngineTest)  Time elapsed: 0.002 s
extractArguments(org.eclipse.ease.AbstractReplScriptEngineTest)  Time elapsed: 0 s
executeSync(org.eclipse.ease.AbstractReplScriptEngineTest)  Time elapsed: 1.002 s
setNotNullErrorStream(org.eclipse.ease.AbstractReplScriptEngineTest)  Time elapsed: 0 s
setNullErrorStream(org.eclipse.ease.AbstractReplScriptEngineTest)  Time elapsed: 0 s
isJob(org.eclipse.ease.AbstractReplScriptEngineTest)  Time elapsed: 0 s
streamsAvailable(org.eclipse.ease.AbstractReplScriptEngineTest)  Time elapsed: 0 s
executeValidCodeAndTerminate(org.eclipse.ease.AbstractReplScriptEngineTest)  Time elapsed: 0.002 s
setNullOutputStream(org.eclipse.ease.AbstractReplScriptEngineTest)  Time elapsed: 0 s
terminateMultipleTimes(org.eclipse.ease.AbstractReplScriptEngineTest)  Time elapsed: 0.604 s
engineTerminatesWhenIdle(org.eclipse.ease.AbstractReplScriptEngineTest)  Time elapsed: 0.001 s
terminateViaTerminateMethod(org.eclipse.ease.AbstractReplScriptEngineTest)  Time elapsed: 0.104 s
terminateViaMethodCallback(org.eclipse.ease.AbstractReplScriptEngineTest)  Time elapsed: 0.002 s
executeErrorCodeAndTerminate(org.eclipse.ease.AbstractReplScriptEngineTest)  Time elapsed: 0.004 s
Running org.eclipse.ease.ScriptTest
Tests run: 13, Failures: 0, Errors: 0, Skipped: 0, Time elapsed: 0.028 s - in org.eclipse.ease.ScriptTest
codeFromScriptable(org.eclipse.ease.ScriptTest)  Time elapsed: 0.02 s
codeFromFilesystemFile(org.eclipse.ease.ScriptTest)  Time elapsed: 0.002 s
getCodeStream(org.eclipse.ease.ScriptTest)  Time elapsed: 0.001 s
getFile(org.eclipse.ease.ScriptTest)  Time elapsed: 0 s
codeFromStringBuilder(org.eclipse.ease.ScriptTest)  Time elapsed: 0 s
getResult(org.eclipse.ease.ScriptTest)  Time elapsed: 0 s
getException(org.eclipse.ease.ScriptTest)  Time elapsed: 0.001 s
codeFromWorkspaceFile(org.eclipse.ease.ScriptTest)  Time elapsed: 0 s
codeFromInputStream(org.eclipse.ease.ScriptTest)  Time elapsed: 0.001 s
getTitle(org.eclipse.ease.ScriptTest)  Time elapsed: 0 s
getCommand(org.eclipse.ease.ScriptTest)  Time elapsed: 0 s
codeFromReader(org.eclipse.ease.ScriptTest)  Time elapsed: 0 s
codeFromString(org.eclipse.ease.ScriptTest)  Time elapsed: 0 s
Running org.eclipse.ease.ScriptResultTest
Tests run: 4, Failures: 0, Errors: 0, Skipped: 0, Time elapsed: 0.002 s - in org.eclipse.ease.ScriptResultTest
hasException(org.eclipse.ease.ScriptResultTest)  Time elapsed: 0 s
getResult(org.eclipse.ease.ScriptResultTest)  Time elapsed: 0 s
getException(org.eclipse.ease.ScriptResultTest)  Time elapsed: 0 s
isReady(org.eclipse.ease.ScriptResultTest)  Time elapsed: 0 s
Running org.eclipse.ease.AbstractCodeParserTest
Tests run: 5, Failures: 0, Errors: 0, Skipped: 0, Time elapsed: 0.004 s - in org.eclipse.ease.AbstractCodeParserTest
parseCode(org.eclipse.ease.AbstractCodeParserTest)  Time elapsed: 0 s
parseLineHeader(org.eclipse.ease.AbstractCodeParserTest)  Time elapsed: 0.001 s
parseBlockAfterWhitespace(org.eclipse.ease.AbstractCodeParserTest)  Time elapsed: 0.001 s
parseEmpty(org.eclipse.ease.AbstractCodeParserTest)  Time elapsed: 0 s
parseBlockHeader(org.eclipse.ease.AbstractCodeParserTest)  Time elapsed: 0 s
Running org.eclipse.ease.AbstractScriptEngineTest
testorg.eclipse.ease.ScriptExecutionException: Engine got terminated
java.lang.RuntimeException: ERROR
	at org.eclipse.ease.AbstractScriptEngineTest$MockedScriptEngine.execute(AbstractScriptEngineTest.java:73)
	at org.eclipse.ease.AbstractScriptEngine.inject(AbstractScriptEngine.java:226)
	at org.eclipse.ease.AbstractScriptEngine.run(AbstractScriptEngine.java:277)
	at org.eclipse.core.internal.jobs.Worker.run(Worker.java:63)
1Tests run: 17, Failures: 0, Errors: 0, Skipped: 0, Time elapsed: 1.731 s - in org.eclipse.ease.AbstractScriptEngineTest
extractEmptyArguments(org.eclipse.ease.AbstractScriptEngineTest)  Time elapsed: 0 s
setNotNullOutputStream(org.eclipse.ease.AbstractScriptEngineTest)  Time elapsed: 0 s
terminateViaMonitorCancellation(org.eclipse.ease.AbstractScriptEngineTest)  Time elapsed: 0.204 s
inject(org.eclipse.ease.AbstractScriptEngineTest)  Time elapsed: 0.002 s
extractArguments(org.eclipse.ease.AbstractScriptEngineTest)  Time elapsed: 0 s
executeSync(org.eclipse.ease.AbstractScriptEngineTest)  Time elapsed: 0.002 s
setNotNullErrorStream(org.eclipse.ease.AbstractScriptEngineTest)  Time elapsed: 0.001 s
setNullErrorStream(org.eclipse.ease.AbstractScriptEngineTest)  Time elapsed: 0 s
isJob(org.eclipse.ease.AbstractScriptEngineTest)  Time elapsed: 0 s
streamsAvailable(org.eclipse.ease.AbstractScriptEngineTest)  Time elapsed: 0 s
executeValidCodeAndTerminate(org.eclipse.ease.AbstractScriptEngineTest)  Time elapsed: 0.003 s
setNullOutputStream(org.eclipse.ease.AbstractScriptEngineTest)  Time elapsed: 0 s
terminateMultipleTimes(org.eclipse.ease.AbstractScriptEngineTest)  Time elapsed: 0.303 s
engineTerminatesWhenIdle(org.eclipse.ease.AbstractScriptEngineTest)  Time elapsed: 0.001 s
terminateViaTerminateMethod(org.eclipse.ease.AbstractScriptEngineTest)  Time elapsed: 1.204 s
terminateViaMethodCallback(org.eclipse.ease.AbstractScriptEngineTest)  Time elapsed: 0.003 s
executeErrorCodeAndTerminate(org.eclipse.ease.AbstractScriptEngineTest)  Time elapsed: 0.003 s

Results:

Tests run: 124, Failures: 0, Errors: 0, Skipped: 0

[INFO] All tests passed!
[INFO] 
[INFO] ---< org.eclipse.ease:org.eclipse.ease.lang.javascript.nashorn.test >---
[INFO] Building org.eclipse.ease.lang.javascript.nashorn.test 0.8.0-SNAPSHOT [4/11]
[INFO] ------------------------[ eclipse-test-plugin ]-------------------------
[INFO] 
[INFO] --- tycho-packaging-plugin:1.3.0:build-qualifier (default-build-qualifier) @ org.eclipse.ease.lang.javascript.nashorn.test ---
[INFO] The project's OSGi version is 0.8.0.I201910171213
[INFO] 
[INFO] --- tycho-packaging-plugin:1.3.0:validate-id (default-validate-id) @ org.eclipse.ease.lang.javascript.nashorn.test ---
[INFO] 
[INFO] --- tycho-packaging-plugin:1.3.0:validate-version (default-validate-version) @ org.eclipse.ease.lang.javascript.nashorn.test ---
[INFO] 
[INFO] --- maven-resources-plugin:2.4.3:resources (default-resources) @ org.eclipse.ease.lang.javascript.nashorn.test ---
[INFO] Using 'UTF-8' encoding to copy filtered resources.
[INFO] skip non existing resourceDirectory /home/jenkins/agent/workspace/ease.verify.core.target.2019-12/tests/org.eclipse.ease.lang.javascript.nashorn.test/src/main/resources
[INFO] 
[INFO] --- tycho-compiler-plugin:1.3.0:compile (default-compile) @ org.eclipse.ease.lang.javascript.nashorn.test ---
[INFO] Nothing to compile - all classes are up to date
[INFO] 
[INFO] --- maven-resources-plugin:2.4.3:testResources (default-testResources) @ org.eclipse.ease.lang.javascript.nashorn.test ---
[INFO] Using 'UTF-8' encoding to copy filtered resources.
[INFO] skip non existing resourceDirectory /home/jenkins/agent/workspace/ease.verify.core.target.2019-12/tests/org.eclipse.ease.lang.javascript.nashorn.test/src/test/resources
[INFO] 
[INFO] --- tycho-source-plugin:1.3.0:plugin-source (plugin-source) @ org.eclipse.ease.lang.javascript.nashorn.test ---
[WARNING] Bundle-Vendor header not found in /home/jenkins/agent/workspace/ease.verify.core.target.2019-12/tests/org.eclipse.ease.lang.javascript.nashorn.test/META-INF/MANIFEST.MF, fallback to 'unknown' for source bundle
[INFO] Building jar: /home/jenkins/agent/workspace/ease.verify.core.target.2019-12/tests/org.eclipse.ease.lang.javascript.nashorn.test/target/org.eclipse.ease.lang.javascript.nashorn.test-0.8.0-SNAPSHOT-sources.jar
[INFO] 
[INFO] --- target-platform-configuration:1.3.0:target-platform (default-target-platform) @ org.eclipse.ease.lang.javascript.nashorn.test ---
[INFO] 
[INFO] --- tycho-packaging-plugin:1.3.0:package-plugin (default-package-plugin) @ org.eclipse.ease.lang.javascript.nashorn.test ---
[INFO] Building jar: /home/jenkins/agent/workspace/ease.verify.core.target.2019-12/tests/org.eclipse.ease.lang.javascript.nashorn.test/target/org.eclipse.ease.lang.javascript.nashorn.test-0.8.0-SNAPSHOT.jar
[INFO] 
[INFO] --- tycho-p2-plugin:1.3.0:p2-metadata-default (default-p2-metadata-default) @ org.eclipse.ease.lang.javascript.nashorn.test ---
[INFO] 
[INFO] --- tycho-source-feature-plugin:1.3.0:source-feature (source-feature) @ org.eclipse.ease.lang.javascript.nashorn.test ---
[INFO] 
[INFO] --- tycho-p2-plugin:1.3.0:p2-metadata (attached-p2-metadata) @ org.eclipse.ease.lang.javascript.nashorn.test ---
[INFO] 
[INFO] --- tycho-surefire-plugin:1.3.0:test (default-test) @ org.eclipse.ease.lang.javascript.nashorn.test ---
[INFO] Expected eclipse log file: /home/jenkins/agent/workspace/ease.verify.core.target.2019-12/tests/org.eclipse.ease.lang.javascript.nashorn.test/target/work/data/.metadata/.log
[INFO] Command line:
	[/opt/tools/java/oracle/jdk-8/1.8.0_202/jre/bin/java, -Dosgi.noShutdown=false, -Dosgi.os=linux, -Dosgi.ws=gtk, -Dosgi.arch=x86_64, -Dosgi.clean=true, -jar, /home/jenkins/.m2/repository/p2/osgi/bundle/org.eclipse.equinox.launcher/1.5.600.v20191014-2022/org.eclipse.equinox.launcher-1.5.600.v20191014-2022.jar, -data, /home/jenkins/agent/workspace/ease.verify.core.target.2019-12/tests/org.eclipse.ease.lang.javascript.nashorn.test/target/work/data, -install, /home/jenkins/agent/workspace/ease.verify.core.target.2019-12/tests/org.eclipse.ease.lang.javascript.nashorn.test/target/work, -configuration, /home/jenkins/agent/workspace/ease.verify.core.target.2019-12/tests/org.eclipse.ease.lang.javascript.nashorn.test/target/work/configuration, -application, org.eclipse.tycho.surefire.osgibooter.headlesstest, -testproperties, /home/jenkins/agent/workspace/ease.verify.core.target.2019-12/tests/org.eclipse.ease.lang.javascript.nashorn.test/target/surefire.properties]
Picked up JAVA_TOOL_OPTIONS: -XX:+IgnoreUnrecognizedVMOptions -XX:+UseContainerSupport -XX:+UnlockExperimentalVMOptions -XX:+UseCGroupMemoryLimitForHeap -Dmaven.ext.class.path="/home/jenkins/agent/workspace/ease.verify.core.target.2019-12@tmp/withMaven4ab1285b/pipeline-maven-spy.jar" -Dorg.jenkinsci.plugins.pipeline.maven.reportsFolder="/home/jenkins/agent/workspace/ease.verify.core.target.2019-12@tmp/withMaven4ab1285b" 
Picked up _JAVA_OPTIONS: -XX:MaxRAMPercentage=64.0
Running org.eclipse.ease.lang.javascript.nashorn.NashornEnvironmentTest
Tests run: 5, Failures: 0, Errors: 0, Skipped: 0, Time elapsed: 1.917 s - in org.eclipse.ease.lang.javascript.nashorn.NashornEnvironmentTest
reloadEnvironment(org.eclipse.ease.lang.javascript.nashorn.NashornEnvironmentTest)  Time elapsed: 1.167 s
bootstrappedEnvironment(org.eclipse.ease.lang.javascript.nashorn.NashornEnvironmentTest)  Time elapsed: 0.141 s
postMethodCallback(org.eclipse.ease.lang.javascript.nashorn.NashornEnvironmentTest)  Time elapsed: 0.271 s
preMethodCallback(org.eclipse.ease.lang.javascript.nashorn.NashornEnvironmentTest)  Time elapsed: 0.123 s
reloadFunctionDefinitions(org.eclipse.ease.lang.javascript.nashorn.NashornEnvironmentTest)  Time elapsed: 0.144 s

Results:

Tests run: 5, Failures: 0, Errors: 0, Skipped: 0

[INFO] All tests passed!
[INFO] 
[INFO] ----< org.eclipse.ease:org.eclipse.ease.lang.javascript.rhino.test >----
[INFO] Building org.eclipse.ease.lang.javascript.rhino.test 0.8.0-SNAPSHOT [5/11]
[INFO] ------------------------[ eclipse-test-plugin ]-------------------------
[INFO] 
[INFO] --- tycho-packaging-plugin:1.3.0:build-qualifier (default-build-qualifier) @ org.eclipse.ease.lang.javascript.rhino.test ---
[INFO] The project's OSGi version is 0.8.0.I201911291239
[INFO] 
[INFO] --- tycho-packaging-plugin:1.3.0:validate-id (default-validate-id) @ org.eclipse.ease.lang.javascript.rhino.test ---
[INFO] 
[INFO] --- tycho-packaging-plugin:1.3.0:validate-version (default-validate-version) @ org.eclipse.ease.lang.javascript.rhino.test ---
[INFO] 
[INFO] --- maven-resources-plugin:2.4.3:resources (default-resources) @ org.eclipse.ease.lang.javascript.rhino.test ---
[INFO] Using 'UTF-8' encoding to copy filtered resources.
[INFO] skip non existing resourceDirectory /home/jenkins/agent/workspace/ease.verify.core.target.2019-12/tests/org.eclipse.ease.lang.javascript.rhino.test/src/main/resources
[INFO] 
[INFO] --- tycho-compiler-plugin:1.3.0:compile (default-compile) @ org.eclipse.ease.lang.javascript.rhino.test ---
[INFO] Nothing to compile - all classes are up to date
[INFO] 
[INFO] --- maven-resources-plugin:2.4.3:testResources (default-testResources) @ org.eclipse.ease.lang.javascript.rhino.test ---
[INFO] Using 'UTF-8' encoding to copy filtered resources.
[INFO] skip non existing resourceDirectory /home/jenkins/agent/workspace/ease.verify.core.target.2019-12/tests/org.eclipse.ease.lang.javascript.rhino.test/src/test/resources
[INFO] 
[INFO] --- tycho-source-plugin:1.3.0:plugin-source (plugin-source) @ org.eclipse.ease.lang.javascript.rhino.test ---
[WARNING] Bundle-Vendor header not found in /home/jenkins/agent/workspace/ease.verify.core.target.2019-12/tests/org.eclipse.ease.lang.javascript.rhino.test/META-INF/MANIFEST.MF, fallback to 'unknown' for source bundle
[INFO] Building jar: /home/jenkins/agent/workspace/ease.verify.core.target.2019-12/tests/org.eclipse.ease.lang.javascript.rhino.test/target/org.eclipse.ease.lang.javascript.rhino.test-0.8.0-SNAPSHOT-sources.jar
[INFO] 
[INFO] --- target-platform-configuration:1.3.0:target-platform (default-target-platform) @ org.eclipse.ease.lang.javascript.rhino.test ---
[INFO] 
[INFO] --- tycho-packaging-plugin:1.3.0:package-plugin (default-package-plugin) @ org.eclipse.ease.lang.javascript.rhino.test ---
[INFO] Building jar: /home/jenkins/agent/workspace/ease.verify.core.target.2019-12/tests/org.eclipse.ease.lang.javascript.rhino.test/target/org.eclipse.ease.lang.javascript.rhino.test-0.8.0-SNAPSHOT.jar
[INFO] 
[INFO] --- tycho-p2-plugin:1.3.0:p2-metadata-default (default-p2-metadata-default) @ org.eclipse.ease.lang.javascript.rhino.test ---
[INFO] 
[INFO] --- tycho-source-feature-plugin:1.3.0:source-feature (source-feature) @ org.eclipse.ease.lang.javascript.rhino.test ---
[INFO] 
[INFO] --- tycho-p2-plugin:1.3.0:p2-metadata (attached-p2-metadata) @ org.eclipse.ease.lang.javascript.rhino.test ---
[INFO] 
[INFO] --- tycho-surefire-plugin:1.3.0:test (default-test) @ org.eclipse.ease.lang.javascript.rhino.test ---
[INFO] Expected eclipse log file: /home/jenkins/agent/workspace/ease.verify.core.target.2019-12/tests/org.eclipse.ease.lang.javascript.rhino.test/target/work/data/.metadata/.log
[INFO] Command line:
	[/opt/tools/java/oracle/jdk-8/1.8.0_202/jre/bin/java, -Dosgi.noShutdown=false, -Dosgi.os=linux, -Dosgi.ws=gtk, -Dosgi.arch=x86_64, -Dosgi.clean=true, -jar, /home/jenkins/.m2/repository/p2/osgi/bundle/org.eclipse.equinox.launcher/1.5.600.v20191014-2022/org.eclipse.equinox.launcher-1.5.600.v20191014-2022.jar, -data, /home/jenkins/agent/workspace/ease.verify.core.target.2019-12/tests/org.eclipse.ease.lang.javascript.rhino.test/target/work/data, -install, /home/jenkins/agent/workspace/ease.verify.core.target.2019-12/tests/org.eclipse.ease.lang.javascript.rhino.test/target/work, -configuration, /home/jenkins/agent/workspace/ease.verify.core.target.2019-12/tests/org.eclipse.ease.lang.javascript.rhino.test/target/work/configuration, -application, org.eclipse.tycho.surefire.osgibooter.headlesstest, -testproperties, /home/jenkins/agent/workspace/ease.verify.core.target.2019-12/tests/org.eclipse.ease.lang.javascript.rhino.test/target/surefire.properties]
Picked up JAVA_TOOL_OPTIONS: -XX:+IgnoreUnrecognizedVMOptions -XX:+UseContainerSupport -XX:+UnlockExperimentalVMOptions -XX:+UseCGroupMemoryLimitForHeap -Dmaven.ext.class.path="/home/jenkins/agent/workspace/ease.verify.core.target.2019-12@tmp/withMaven4ab1285b/pipeline-maven-spy.jar" -Dorg.jenkinsci.plugins.pipeline.maven.reportsFolder="/home/jenkins/agent/workspace/ease.verify.core.target.2019-12@tmp/withMaven4ab1285b" 
Picked up _JAVA_OPTIONS: -XX:MaxRAMPercentage=64.0
Running org.eclipse.ease.lang.javascript.rhino.RhinoDebugTest
Start of script
include file start
Include file processed
line after include file
Result of testMethod = 5
End of script
Start of script
include file start
Include file processed
line after include file
Result of testMethod = 5
End of script
Start of script
include file start
Include file processed
line after include file
Result of testMethod = 5
Start of script
include file start
Include file processed
line after include file
Result of testMethod = 5
End of script
Start of script
include file start
Include file processed
line after include file
Result of testMethod = 5
End of script
Start of script
include file start
Include file processed
line after include file
Result of testMethod = 5
End of script
Start of script
include file start
Include file processed
line after include file
Result of testMethod = 5
Start of script
include file start
Include file processed
line after include file
Result of testMethod = 5
End of script
Start of script
include file start
Include file processed
line after include file
Result of testMethod = 5
End of script
Start of script
include file start
Include file processed
line after include file
Start of script
include file start
Include file processed
line after include file
Result of testMethod = 5
End of script
Start of script
include file start
Include file processed
line after include file
Result of testMethod = 5
End of script
Start of script
include file start
Include file processed
line after include file
Result of testMethod = 5
End of script
Start of script
include file start
Include file processed
line after include file
Result of testMethod = 5
End of script
Start of script
include file start
Include file processed
line after include file
Result of testMethod = 5
Start of script
include file start
Include file processed
line after include file
Result of testMethod = 5
End of script
Start of script
include file start
Include file processed
line after include file
Result of testMethod = 5
End of script
Start of script
include file start
Include file processed
line after include file
Result of testMethod = 5
End of script
Start of script
include file start
Include file processed
line after include file
Result of testMethod = 5
End of script
Start of script
include file start
Include file processed
line after include file
Result of testMethod = 5
Start of script
include file start
Include file processed
line after include file
Result of testMethod = 5
End of script
Start of script
include file start
Include file processed
line after include file
Result of testMethod = 5
End of script
Start of script
include file start
Include file processed
line after include file
Result of testMethod = 5
End of script
Start of script
include file start
Include file processed
line after include file
Result of testMethod = 5
End of script
Start of script
include file start
Include file processed
line after include file
Start of script
include file start
Include file processed
line after include file
Result of testMethod = 5
End of script
Start of script
include file start
Include file processed
line after include file
Result of testMethod = 5
Start of script
include file start
Include file processed
line after include file
Result of testMethod = 5
End of script
Start of script
include file start
Include file processed
line after include file
Result of testMethod = 5
End of script
Start of script
include file start
Include file processed
line after include file
Result of testMethod = 5
End of script
Start of script
include file start
Include file processed
line after include file
Result of testMethod = 5
End of script
Start of script
include file start
Include file processed
line after include file
Result of testMethod = 5
Start of script
include file start
Include file processed
line after include file
Result of testMethod = 5
End of script
Start of script
include file start
Include file processed
line after include file
Result of testMethod = 5
Start of script
include file start
Include file processed
line after include file
Result of testMethod = 5
End of script
Start of script
include file start
Include file processed
line after include file
Result of testMethod = 5
End of script
Start of script
include file start
Include file processed
line after include file
Result of testMethod = 5
End of script
Tests run: 42, Failures: 0, Errors: 0, Skipped: 0, Time elapsed: 12.121 s - in org.eclipse.ease.lang.javascript.rhino.RhinoDebugTest
disconnectProcessInSuspendedState(org.eclipse.ease.lang.javascript.rhino.RhinoDebugTest)  Time elapsed: 0.916 s
stepReturnIncludeCommand(org.eclipse.ease.lang.javascript.rhino.RhinoDebugTest)  Time elapsed: 0.225 s
arrayVariableSorting(org.eclipse.ease.lang.javascript.rhino.RhinoDebugTest)  Time elapsed: 0.322 s
stepOverOnDebugTarget(org.eclipse.ease.lang.javascript.rhino.RhinoDebugTest)  Time elapsed: 0.322 s
hasDebugTarget(org.eclipse.ease.lang.javascript.rhino.RhinoDebugTest)  Time elapsed: 0.112 s
disconnectThreadInSuspendedState(org.eclipse.ease.lang.javascript.rhino.RhinoDebugTest)  Time elapsed: 0.218 s
stepReturnOnDebugTarget(org.eclipse.ease.lang.javascript.rhino.RhinoDebugTest)  Time elapsed: 0.321 s
nullVariable(org.eclipse.ease.lang.javascript.rhino.RhinoDebugTest)  Time elapsed: 0.319 s
stepOverOnStackFrame(org.eclipse.ease.lang.javascript.rhino.RhinoDebugTest)  Time elapsed: 0.32 s
resumeOnDebugTarget(org.eclipse.ease.lang.javascript.rhino.RhinoDebugTest)  Time elapsed: 0.223 s
modifyVariableKeepingType(org.eclipse.ease.lang.javascript.rhino.RhinoDebugTest)  Time elapsed: 0.416 s
resumeOnLastIncludeLine(org.eclipse.ease.lang.javascript.rhino.RhinoDebugTest)  Time elapsed: 0.22 s
stepReturnOnStackFrame(org.eclipse.ease.lang.javascript.rhino.RhinoDebugTest)  Time elapsed: 0.317 s
terminateStackFrameInSuspendedState(org.eclipse.ease.lang.javascript.rhino.RhinoDebugTest)  Time elapsed: 0.22 s
breakpointLocation(org.eclipse.ease.lang.javascript.rhino.RhinoDebugTest)  Time elapsed: 0.22 s
stepReturnOnThread(org.eclipse.ease.lang.javascript.rhino.RhinoDebugTest)  Time elapsed: 0.322 s
javaClassVariable(org.eclipse.ease.lang.javascript.rhino.RhinoDebugTest)  Time elapsed: 0.321 s
stepIntoOnThread(org.eclipse.ease.lang.javascript.rhino.RhinoDebugTest)  Time elapsed: 0.319 s
terminateThreadInSuspendedState(org.eclipse.ease.lang.javascript.rhino.RhinoDebugTest)  Time elapsed: 0.216 s
resumeOnThread(org.eclipse.ease.lang.javascript.rhino.RhinoDebugTest)  Time elapsed: 0.217 s
stepIntoOnStackFrame(org.eclipse.ease.lang.javascript.rhino.RhinoDebugTest)  Time elapsed: 0.318 s
terminateProcessInSuspendedState(org.eclipse.ease.lang.javascript.rhino.RhinoDebugTest)  Time elapsed: 0.215 s
stepOverOnProcess(org.eclipse.ease.lang.javascript.rhino.RhinoDebugTest)  Time elapsed: 0.317 s
nativeArrayVariable(org.eclipse.ease.lang.javascript.rhino.RhinoDebugTest)  Time elapsed: 0.316 s
disconnectDebugTargetInSuspendedState(org.eclipse.ease.lang.javascript.rhino.RhinoDebugTest)  Time elapsed: 0.216 s
stepIntoOnProcess(org.eclipse.ease.lang.javascript.rhino.RhinoDebugTest)  Time elapsed: 0.317 s
terminatedState(org.eclipse.ease.lang.javascript.rhino.RhinoDebugTest)  Time elapsed: 0.112 s
stepOverIncludeCommand(org.eclipse.ease.lang.javascript.rhino.RhinoDebugTest)  Time elapsed: 0.315 s
innerScopeVariableBeforeOuterScopeVariable(org.eclipse.ease.lang.javascript.rhino.RhinoDebugTest)  Time elapsed: 0.314 s
stepIntoIncludeCommand(org.eclipse.ease.lang.javascript.rhino.RhinoDebugTest)  Time elapsed: 0.313 s
primitiveStringVariable(org.eclipse.ease.lang.javascript.rhino.RhinoDebugTest)  Time elapsed: 0.315 s
resumeOnProcess(org.eclipse.ease.lang.javascript.rhino.RhinoDebugTest)  Time elapsed: 0.215 s
stepIntoOnDebugTarget(org.eclipse.ease.lang.javascript.rhino.RhinoDebugTest)  Time elapsed: 0.316 s
stepOverOnThread(org.eclipse.ease.lang.javascript.rhino.RhinoDebugTest)  Time elapsed: 0.316 s
suspendedState(org.eclipse.ease.lang.javascript.rhino.RhinoDebugTest)  Time elapsed: 0.215 s
primitiveDoubleVariable(org.eclipse.ease.lang.javascript.rhino.RhinoDebugTest)  Time elapsed: 0.315 s
resumeOnStackFrame(org.eclipse.ease.lang.javascript.rhino.RhinoDebugTest)  Time elapsed: 0.217 s
nativeObjectVariable(org.eclipse.ease.lang.javascript.rhino.RhinoDebugTest)  Time elapsed: 0.315 s
terminateDebugTargetInSuspendedState(org.eclipse.ease.lang.javascript.rhino.RhinoDebugTest)  Time elapsed: 0.215 s
disconnectStackFrameInSuspendedState(org.eclipse.ease.lang.javascript.rhino.RhinoDebugTest)  Time elapsed: 0.216 s
stepReturnOnProcess(org.eclipse.ease.lang.javascript.rhino.RhinoDebugTest)  Time elapsed: 0.321 s
evaluateWatchExpression(org.eclipse.ease.lang.javascript.rhino.RhinoDebugTest)  Time elapsed: 0.224 s
Running org.eclipse.ease.lang.javascript.rhino.RhinoEnvironmentTest
Tests run: 5, Failures: 0, Errors: 0, Skipped: 0, Time elapsed: 0.413 s - in org.eclipse.ease.lang.javascript.rhino.RhinoEnvironmentTest
reloadEnvironment(org.eclipse.ease.lang.javascript.rhino.RhinoEnvironmentTest)  Time elapsed: 0.19 s
bootstrappedEnvironment(org.eclipse.ease.lang.javascript.rhino.RhinoEnvironmentTest)  Time elapsed: 0.034 s
postMethodCallback(org.eclipse.ease.lang.javascript.rhino.RhinoEnvironmentTest)  Time elapsed: 0.076 s
preMethodCallback(org.eclipse.ease.lang.javascript.rhino.RhinoEnvironmentTest)  Time elapsed: 0.034 s
reloadFunctionDefinitions(org.eclipse.ease.lang.javascript.rhino.RhinoEnvironmentTest)  Time elapsed: 0.076 s
Running org.eclipse.ease.lang.javascript.rhino.RhinoDebuggerEngineTest
org.eclipse.ease.ScriptExecutionException: JavaError: NotThere cannot be found by org.mozilla.javascript_1.7.10.v20190430-1943

Java Stacktrace:
java.lang.ClassNotFoundException: NotThere cannot be found by org.mozilla.javascript_1.7.10.v20190430-1943
	at org.eclipse.osgi.internal.loader.BundleLoader.findClassInternal(BundleLoader.java:514)
	at org.eclipse.osgi.internal.loader.BundleLoader.findClass(BundleLoader.java:425)
	at org.eclipse.osgi.internal.loader.BundleLoader.findClass(BundleLoader.java:417)
	at org.eclipse.osgi.internal.loader.ModuleClassLoader.loadClass(ModuleClassLoader.java:171)
	at java.lang.ClassLoader.loadClass(ClassLoader.java:357)
	at java.lang.Class.forName0(Native Method)
	at java.lang.Class.forName(Class.java:264)
	at sun.reflect.NativeMethodAccessorImpl.invoke0(Native Method)
	at sun.reflect.NativeMethodAccessorImpl.invoke(NativeMethodAccessorImpl.java:62)
	at sun.reflect.DelegatingMethodAccessorImpl.invoke(DelegatingMethodAccessorImpl.java:43)
	at java.lang.reflect.Method.invoke(Method.java:498)
	at org.mozilla.javascript.MemberBox.invoke(MemberBox.java:126)
	at org.mozilla.javascript.NativeJavaMethod.call(NativeJavaMethod.java:225)
	at org.mozilla.javascript.Interpreter.interpretLoop(Interpreter.java:1573)
	at org.mozilla.javascript.Interpreter.interpret(Interpreter.java:911)
	at org.mozilla.javascript.InterpretedFunction.call(InterpretedFunction.java:109)
	at org.mozilla.javascript.ContextFactory.doTopCall(ContextFactory.java:405)
	at org.mozilla.javascript.ScriptRuntime.doTopCall(ScriptRuntime.java:3508)
	at org.mozilla.javascript.InterpretedFunction.exec(InterpretedFunction.java:120)
	at org.mozilla.javascript.Context.evaluateReader(Context.java:1293)
	at org.eclipse.ease.lang.javascript.rhino.RhinoScriptEngine.internalExecute(RhinoScriptEngine.java:222)
	at org.eclipse.ease.lang.javascript.rhino.RhinoScriptEngine.execute(RhinoScriptEngine.java:201)
	at org.eclipse.ease.AbstractScriptEngine.inject(AbstractScriptEngine.java:226)
	at org.eclipse.ease.AbstractScriptEngine.run(AbstractScriptEngine.java:277)
	at org.eclipse.core.internal.jobs.Worker.run(Worker.java:63)
org.eclipse.ease.ScriptExecutionException: TypeError: Cannot call method "foobar" of undefined
org.eclipse.ease.ScriptExecutionException: ScriptException: test
org.eclipse.ease.ScriptExecutionException: JavaError: java.lang.Exception

Java Stacktrace:
java.lang.Exception
	at sun.reflect.NativeConstructorAccessorImpl.newInstance0(Native Method)
	at sun.reflect.NativeConstructorAccessorImpl.newInstance(NativeConstructorAccessorImpl.java:62)
	at sun.reflect.DelegatingConstructorAccessorImpl.newInstance(DelegatingConstructorAccessorImpl.java:45)
	at java.lang.reflect.Constructor.newInstance(Constructor.java:423)
	at org.mozilla.javascript.MemberBox.newInstance(MemberBox.java:159)
	at org.mozilla.javascript.NativeJavaClass.constructInternal(NativeJavaClass.java:266)
	at org.mozilla.javascript.NativeJavaClass.constructSpecific(NativeJavaClass.java:205)
	at org.mozilla.javascript.NativeJavaClass.construct(NativeJavaClass.java:166)
	at org.mozilla.javascript.Interpreter.interpretLoop(Interpreter.java:1617)
	at org.mozilla.javascript.Interpreter.interpret(Interpreter.java:911)
	at org.mozilla.javascript.InterpretedFunction.call(InterpretedFunction.java:109)
	at org.mozilla.javascript.ContextFactory.doTopCall(ContextFactory.java:405)
	at org.mozilla.javascript.ScriptRuntime.doTopCall(ScriptRuntime.java:3508)
	at org.mozilla.javascript.InterpretedFunction.exec(InterpretedFunction.java:120)
	at org.mozilla.javascript.Context.evaluateReader(Context.java:1293)
	at org.eclipse.ease.lang.javascript.rhino.RhinoScriptEngine.internalExecute(RhinoScriptEngine.java:222)
	at org.eclipse.ease.lang.javascript.rhino.RhinoScriptEngine.execute(RhinoScriptEngine.java:201)
	at org.eclipse.ease.AbstractScriptEngine.inject(AbstractScriptEngine.java:226)
	at org.eclipse.ease.AbstractScriptEngine.run(AbstractScriptEngine.java:277)
	at org.eclipse.core.internal.jobs.Worker.run(Worker.java:63)
org.eclipse.ease.ScriptExecutionException: ScriptException: JavaScript
org.eclipse.ease.ScriptExecutionException: SyntaxError: unterminated string literal (#1)
'asdf
    ^
	at <unknown source>:1
Tests run: 12, Failures: 0, Errors: 0, Skipped: 0, Time elapsed: 0.436 s - in org.eclipse.ease.lang.javascript.rhino.RhinoDebuggerEngineTest
getExceptionStackTrace(org.eclipse.ease.lang.javascript.rhino.RhinoDebuggerEngineTest)  Time elapsed: 0.078 s
causeWrappedException(org.eclipse.ease.lang.javascript.rhino.RhinoDebuggerEngineTest)  Time elapsed: 0.033 s
optionalModuleParameters(org.eclipse.ease.lang.javascript.rhino.RhinoDebuggerEngineTest)  Time elapsed: 0.049 s
simpleScriptCode(org.eclipse.ease.lang.javascript.rhino.RhinoDebuggerEngineTest)  Time elapsed: 0.027 s
causeRuntimeErrorException(org.eclipse.ease.lang.javascript.rhino.RhinoDebuggerEngineTest)  Time elapsed: 0.026 s
callModuleCode(org.eclipse.ease.lang.javascript.rhino.RhinoDebuggerEngineTest)  Time elapsed: 0.047 s
throwJavaClass(org.eclipse.ease.lang.javascript.rhino.RhinoDebuggerEngineTest)  Time elapsed: 0.028 s
throwJavaException(org.eclipse.ease.lang.javascript.rhino.RhinoDebuggerEngineTest)  Time elapsed: 0.028 s
accessJavaClasses(org.eclipse.ease.lang.javascript.rhino.RhinoDebuggerEngineTest)  Time elapsed: 0.046 s
accessEclipseClasses(org.eclipse.ease.lang.javascript.rhino.RhinoDebuggerEngineTest)  Time elapsed: 0.022 s
throwJavaScriptException(org.eclipse.ease.lang.javascript.rhino.RhinoDebuggerEngineTest)  Time elapsed: 0.027 s
causeSyntaxErrorException(org.eclipse.ease.lang.javascript.rhino.RhinoDebuggerEngineTest)  Time elapsed: 0.021 s
Running org.eclipse.ease.lang.javascript.rhino.RhinoScriptEngineTest
org.eclipse.ease.ScriptExecutionException: JavaError: NotThere cannot be found by org.mozilla.javascript_1.7.10.v20190430-1943
	at <unknown source>

Java Stacktrace:
java.lang.ClassNotFoundException: NotThere cannot be found by org.mozilla.javascript_1.7.10.v20190430-1943
	at org.eclipse.osgi.internal.loader.BundleLoader.findClassInternal(BundleLoader.java:514)
	at org.eclipse.osgi.internal.loader.BundleLoader.findClass(BundleLoader.java:425)
	at org.eclipse.osgi.internal.loader.BundleLoader.findClass(BundleLoader.java:417)
	at org.eclipse.osgi.internal.loader.ModuleClassLoader.loadClass(ModuleClassLoader.java:171)
	at java.lang.ClassLoader.loadClass(ClassLoader.java:357)
	at java.lang.Class.forName0(Native Method)
	at java.lang.Class.forName(Class.java:264)
	at sun.reflect.NativeMethodAccessorImpl.invoke0(Native Method)
	at sun.reflect.NativeMethodAccessorImpl.invoke(NativeMethodAccessorImpl.java:62)
	at sun.reflect.DelegatingMethodAccessorImpl.invoke(DelegatingMethodAccessorImpl.java:43)
	at java.lang.reflect.Method.invoke(Method.java:498)
	at org.mozilla.javascript.MemberBox.invoke(MemberBox.java:126)
	at org.mozilla.javascript.NativeJavaMethod.call(NativeJavaMethod.java:225)
	at org.mozilla.javascript.optimizer.OptRuntime.call1(OptRuntime.java:32)
	at org.mozilla.javascript.gen.c_27._c_script_0(Unknown Source)
	at org.mozilla.javascript.gen.c_27.call(Unknown Source)
	at org.mozilla.javascript.ContextFactory.doTopCall(ContextFactory.java:405)
	at org.mozilla.javascript.ScriptRuntime.doTopCall(ScriptRuntime.java:3508)
	at org.mozilla.javascript.gen.c_27.call(Unknown Source)
	at org.mozilla.javascript.gen.c_27.exec(Unknown Source)
	at org.mozilla.javascript.Context.evaluateReader(Context.java:1293)
	at org.eclipse.ease.lang.javascript.rhino.RhinoScriptEngine.internalExecute(RhinoScriptEngine.java:222)
	at org.eclipse.ease.lang.javascript.rhino.RhinoScriptEngine.execute(RhinoScriptEngine.java:201)
	at org.eclipse.ease.AbstractScriptEngine.inject(AbstractScriptEngine.java:226)
	at org.eclipse.ease.AbstractScriptEngine.run(AbstractScriptEngine.java:277)
	at org.eclipse.core.internal.jobs.Worker.run(Worker.java:63)
org.eclipse.ease.ScriptExecutionException: TypeError: Cannot call method "foobar" of undefined
	at <unknown source>
org.eclipse.ease.ScriptExecutionException: ScriptException: test
	at <unknown source>
org.eclipse.ease.ScriptExecutionException: JavaError: java.lang.Exception
	at <unknown source>

Java Stacktrace:
java.lang.Exception
	at sun.reflect.NativeConstructorAccessorImpl.newInstance0(Native Method)
	at sun.reflect.NativeConstructorAccessorImpl.newInstance(NativeConstructorAccessorImpl.java:62)
	at sun.reflect.DelegatingConstructorAccessorImpl.newInstance(DelegatingConstructorAccessorImpl.java:45)
	at java.lang.reflect.Constructor.newInstance(Constructor.java:423)
	at org.mozilla.javascript.MemberBox.newInstance(MemberBox.java:159)
	at org.mozilla.javascript.NativeJavaClass.constructInternal(NativeJavaClass.java:266)
	at org.mozilla.javascript.NativeJavaClass.constructSpecific(NativeJavaClass.java:205)
	at org.mozilla.javascript.NativeJavaClass.construct(NativeJavaClass.java:166)
	at org.mozilla.javascript.ScriptRuntime.newObject(ScriptRuntime.java:2655)
	at org.mozilla.javascript.gen.c_45._c_script_0(Unknown Source)
	at org.mozilla.javascript.gen.c_45.call(Unknown Source)
	at org.mozilla.javascript.ContextFactory.doTopCall(ContextFactory.java:405)
	at org.mozilla.javascript.ScriptRuntime.doTopCall(ScriptRuntime.java:3508)
	at org.mozilla.javascript.gen.c_45.call(Unknown Source)
	at org.mozilla.javascript.gen.c_45.exec(Unknown Source)
	at org.mozilla.javascript.Context.evaluateReader(Context.java:1293)
	at org.eclipse.ease.lang.javascript.rhino.RhinoScriptEngine.internalExecute(RhinoScriptEngine.java:222)
	at org.eclipse.ease.lang.javascript.rhino.RhinoScriptEngine.execute(RhinoScriptEngine.java:201)
	at org.eclipse.ease.AbstractScriptEngine.inject(AbstractScriptEngine.java:226)
	at org.eclipse.ease.AbstractScriptEngine.run(AbstractScriptEngine.java:277)
	at org.eclipse.core.internal.jobs.Worker.run(Worker.java:63)
org.eclipse.ease.ScriptExecutionException: ScriptException: JavaScript
	at <unknown source>
org.eclipse.ease.ScriptExecutionException: SyntaxError: unterminated string literal (#1)
'asdf
    ^
	at <unknown source>
Tests run: 11, Failures: 0, Errors: 0, Skipped: 0, Time elapsed: 0.385 s - in org.eclipse.ease.lang.javascript.rhino.RhinoScriptEngineTest
causeWrappedException(org.eclipse.ease.lang.javascript.rhino.RhinoScriptEngineTest)  Time elapsed: 0.076 s
optionalModuleParameters(org.eclipse.ease.lang.javascript.rhino.RhinoScriptEngineTest)  Time elapsed: 0.023 s
simpleScriptCode(org.eclipse.ease.lang.javascript.rhino.RhinoScriptEngineTest)  Time elapsed: 0.022 s
causeRuntimeErrorException(org.eclipse.ease.lang.javascript.rhino.RhinoScriptEngineTest)  Time elapsed: 0.023 s
callModuleCode(org.eclipse.ease.lang.javascript.rhino.RhinoScriptEngineTest)  Time elapsed: 0.05 s
throwJavaClass(org.eclipse.ease.lang.javascript.rhino.RhinoScriptEngineTest)  Time elapsed: 0.024 s
throwJavaException(org.eclipse.ease.lang.javascript.rhino.RhinoScriptEngineTest)  Time elapsed: 0.024 s
accessJavaClasses(org.eclipse.ease.lang.javascript.rhino.RhinoScriptEngineTest)  Time elapsed: 0.048 s
accessEclipseClasses(org.eclipse.ease.lang.javascript.rhino.RhinoScriptEngineTest)  Time elapsed: 0.024 s
throwJavaScriptException(org.eclipse.ease.lang.javascript.rhino.RhinoScriptEngineTest)  Time elapsed: 0.023 s
causeSyntaxErrorException(org.eclipse.ease.lang.javascript.rhino.RhinoScriptEngineTest)  Time elapsed: 0.046 s

Results:

Tests run: 70, Failures: 0, Errors: 0, Skipped: 0

[INFO] All tests passed!
[INFO] 
[INFO] -------< org.eclipse.ease:org.eclipse.ease.lang.javascript.test >-------
[INFO] Building org.eclipse.ease.lang.javascript.test 0.8.0-SNAPSHOT     [6/11]
[INFO] ------------------------[ eclipse-test-plugin ]-------------------------
[INFO] 
[INFO] --- tycho-packaging-plugin:1.3.0:build-qualifier (default-build-qualifier) @ org.eclipse.ease.lang.javascript.test ---
[INFO] The project's OSGi version is 0.8.0.I201910171213
[INFO] 
[INFO] --- tycho-packaging-plugin:1.3.0:validate-id (default-validate-id) @ org.eclipse.ease.lang.javascript.test ---
[INFO] 
[INFO] --- tycho-packaging-plugin:1.3.0:validate-version (default-validate-version) @ org.eclipse.ease.lang.javascript.test ---
[INFO] 
[INFO] --- maven-resources-plugin:2.4.3:resources (default-resources) @ org.eclipse.ease.lang.javascript.test ---
[INFO] Using 'UTF-8' encoding to copy filtered resources.
[INFO] skip non existing resourceDirectory /home/jenkins/agent/workspace/ease.verify.core.target.2019-12/tests/org.eclipse.ease.lang.javascript.test/src/main/resources
[INFO] 
[INFO] --- tycho-compiler-plugin:1.3.0:compile (default-compile) @ org.eclipse.ease.lang.javascript.test ---
[INFO] Nothing to compile - all classes are up to date
[INFO] 
[INFO] --- maven-resources-plugin:2.4.3:testResources (default-testResources) @ org.eclipse.ease.lang.javascript.test ---
[INFO] Using 'UTF-8' encoding to copy filtered resources.
[INFO] skip non existing resourceDirectory /home/jenkins/agent/workspace/ease.verify.core.target.2019-12/tests/org.eclipse.ease.lang.javascript.test/src/test/resources
[INFO] 
[INFO] --- tycho-source-plugin:1.3.0:plugin-source (plugin-source) @ org.eclipse.ease.lang.javascript.test ---
[WARNING] Bundle-Vendor header not found in /home/jenkins/agent/workspace/ease.verify.core.target.2019-12/tests/org.eclipse.ease.lang.javascript.test/META-INF/MANIFEST.MF, fallback to 'unknown' for source bundle
[INFO] Building jar: /home/jenkins/agent/workspace/ease.verify.core.target.2019-12/tests/org.eclipse.ease.lang.javascript.test/target/org.eclipse.ease.lang.javascript.test-0.8.0-SNAPSHOT-sources.jar
[INFO] 
[INFO] --- target-platform-configuration:1.3.0:target-platform (default-target-platform) @ org.eclipse.ease.lang.javascript.test ---
[INFO] 
[INFO] --- tycho-packaging-plugin:1.3.0:package-plugin (default-package-plugin) @ org.eclipse.ease.lang.javascript.test ---
[INFO] Building jar: /home/jenkins/agent/workspace/ease.verify.core.target.2019-12/tests/org.eclipse.ease.lang.javascript.test/target/org.eclipse.ease.lang.javascript.test-0.8.0-SNAPSHOT.jar
[INFO] 
[INFO] --- tycho-p2-plugin:1.3.0:p2-metadata-default (default-p2-metadata-default) @ org.eclipse.ease.lang.javascript.test ---
[INFO] 
[INFO] --- tycho-source-feature-plugin:1.3.0:source-feature (source-feature) @ org.eclipse.ease.lang.javascript.test ---
[INFO] 
[INFO] --- tycho-p2-plugin:1.3.0:p2-metadata (attached-p2-metadata) @ org.eclipse.ease.lang.javascript.test ---
[INFO] 
[INFO] --- tycho-surefire-plugin:1.3.0:test (default-test) @ org.eclipse.ease.lang.javascript.test ---
[INFO] Expected eclipse log file: /home/jenkins/agent/workspace/ease.verify.core.target.2019-12/tests/org.eclipse.ease.lang.javascript.test/target/work/data/.metadata/.log
[INFO] Command line:
	[/opt/tools/java/oracle/jdk-8/1.8.0_202/jre/bin/java, -Dosgi.noShutdown=false, -Dosgi.os=linux, -Dosgi.ws=gtk, -Dosgi.arch=x86_64, -Dosgi.clean=true, -jar, /home/jenkins/.m2/repository/p2/osgi/bundle/org.eclipse.equinox.launcher/1.5.600.v20191014-2022/org.eclipse.equinox.launcher-1.5.600.v20191014-2022.jar, -data, /home/jenkins/agent/workspace/ease.verify.core.target.2019-12/tests/org.eclipse.ease.lang.javascript.test/target/work/data, -install, /home/jenkins/agent/workspace/ease.verify.core.target.2019-12/tests/org.eclipse.ease.lang.javascript.test/target/work, -configuration, /home/jenkins/agent/workspace/ease.verify.core.target.2019-12/tests/org.eclipse.ease.lang.javascript.test/target/work/configuration, -application, org.eclipse.tycho.surefire.osgibooter.headlesstest, -testproperties, /home/jenkins/agent/workspace/ease.verify.core.target.2019-12/tests/org.eclipse.ease.lang.javascript.test/target/surefire.properties]
Picked up JAVA_TOOL_OPTIONS: -XX:+IgnoreUnrecognizedVMOptions -XX:+UseContainerSupport -XX:+UnlockExperimentalVMOptions -XX:+UseCGroupMemoryLimitForHeap -Dmaven.ext.class.path="/home/jenkins/agent/workspace/ease.verify.core.target.2019-12@tmp/withMaven4ab1285b/pipeline-maven-spy.jar" -Dorg.jenkinsci.plugins.pipeline.maven.reportsFolder="/home/jenkins/agent/workspace/ease.verify.core.target.2019-12@tmp/withMaven4ab1285b" 
Picked up _JAVA_OPTIONS: -XX:MaxRAMPercentage=64.0
Running org.eclipse.ease.lang.javascript.JavaScriptCodeFactoryTest
Tests run: 1, Failures: 0, Errors: 0, Skipped: 0, Time elapsed: 0.221 s - in org.eclipse.ease.lang.javascript.JavaScriptCodeFactoryTest
testCommentCreator(org.eclipse.ease.lang.javascript.JavaScriptCodeFactoryTest)  Time elapsed: 0.013 s
Running org.eclipse.ease.lang.javascript.JavaScriptCompletionContextTest
Tests run: 8, Failures: 0, Errors: 0, Skipped: 0, Time elapsed: 0.431 s - in org.eclipse.ease.lang.javascript.JavaScriptCompletionContextTest
verifyStaticClassTypes(org.eclipse.ease.lang.javascript.JavaScriptCompletionContextTest)  Time elapsed: 0.011 s
verifyClassInstanceTypes(org.eclipse.ease.lang.javascript.JavaScriptCompletionContextTest)  Time elapsed: 0.014 s
verifyTypesForScriptEngine(org.eclipse.ease.lang.javascript.JavaScriptCompletionContextTest)  Time elapsed: 0.396 s
verifyPackageTypes(org.eclipse.ease.lang.javascript.JavaScriptCompletionContextTest)  Time elapsed: 0.001 s
definedVariableTypes(org.eclipse.ease.lang.javascript.JavaScriptCompletionContextTest)  Time elapsed: 0.001 s
verifyStringLiteralTypes(org.eclipse.ease.lang.javascript.JavaScriptCompletionContextTest)  Time elapsed: 0 s
verifyUnknownTypes(org.eclipse.ease.lang.javascript.JavaScriptCompletionContextTest)  Time elapsed: 0.001 s
verifyNoneTypes(org.eclipse.ease.lang.javascript.JavaScriptCompletionContextTest)  Time elapsed: 0 s

Results:

Tests run: 9, Failures: 0, Errors: 0, Skipped: 0

[INFO] All tests passed!
[INFO] 
[INFO] ---------< org.eclipse.ease:org.eclipse.ease.lang.python.test >---------
[INFO] Building org.eclipse.ease.lang.python.test 0.8.0-SNAPSHOT         [7/11]
[INFO] ------------------------[ eclipse-test-plugin ]-------------------------
[INFO] 
[INFO] --- tycho-packaging-plugin:1.3.0:build-qualifier (default-build-qualifier) @ org.eclipse.ease.lang.python.test ---
[INFO] The project's OSGi version is 0.8.0.I201910171213
[INFO] 
[INFO] --- tycho-packaging-plugin:1.3.0:validate-id (default-validate-id) @ org.eclipse.ease.lang.python.test ---
[INFO] 
[INFO] --- tycho-packaging-plugin:1.3.0:validate-version (default-validate-version) @ org.eclipse.ease.lang.python.test ---
[INFO] 
[INFO] --- maven-resources-plugin:2.4.3:resources (default-resources) @ org.eclipse.ease.lang.python.test ---
[INFO] Using 'UTF-8' encoding to copy filtered resources.
[INFO] skip non existing resourceDirectory /home/jenkins/agent/workspace/ease.verify.core.target.2019-12/tests/org.eclipse.ease.lang.python.test/src/main/resources
[INFO] 
[INFO] --- tycho-compiler-plugin:1.3.0:compile (default-compile) @ org.eclipse.ease.lang.python.test ---
[INFO] Nothing to compile - all classes are up to date
[INFO] 
[INFO] --- maven-resources-plugin:2.4.3:testResources (default-testResources) @ org.eclipse.ease.lang.python.test ---
[INFO] Using 'UTF-8' encoding to copy filtered resources.
[INFO] skip non existing resourceDirectory /home/jenkins/agent/workspace/ease.verify.core.target.2019-12/tests/org.eclipse.ease.lang.python.test/src/test/resources
[INFO] 
[INFO] --- tycho-source-plugin:1.3.0:plugin-source (plugin-source) @ org.eclipse.ease.lang.python.test ---
[WARNING] Bundle-Vendor header not found in /home/jenkins/agent/workspace/ease.verify.core.target.2019-12/tests/org.eclipse.ease.lang.python.test/META-INF/MANIFEST.MF, fallback to 'unknown' for source bundle
[INFO] Building jar: /home/jenkins/agent/workspace/ease.verify.core.target.2019-12/tests/org.eclipse.ease.lang.python.test/target/org.eclipse.ease.lang.python.test-0.8.0-SNAPSHOT-sources.jar
[INFO] 
[INFO] --- target-platform-configuration:1.3.0:target-platform (default-target-platform) @ org.eclipse.ease.lang.python.test ---
[INFO] 
[INFO] --- tycho-packaging-plugin:1.3.0:package-plugin (default-package-plugin) @ org.eclipse.ease.lang.python.test ---
[INFO] Building jar: /home/jenkins/agent/workspace/ease.verify.core.target.2019-12/tests/org.eclipse.ease.lang.python.test/target/org.eclipse.ease.lang.python.test-0.8.0-SNAPSHOT.jar
[INFO] 
[INFO] --- tycho-p2-plugin:1.3.0:p2-metadata-default (default-p2-metadata-default) @ org.eclipse.ease.lang.python.test ---
[INFO] 
[INFO] --- tycho-source-feature-plugin:1.3.0:source-feature (source-feature) @ org.eclipse.ease.lang.python.test ---
[INFO] 
[INFO] --- tycho-p2-plugin:1.3.0:p2-metadata (attached-p2-metadata) @ org.eclipse.ease.lang.python.test ---
[INFO] 
[INFO] --- tycho-surefire-plugin:1.3.0:test (default-test) @ org.eclipse.ease.lang.python.test ---
[INFO] Expected eclipse log file: /home/jenkins/agent/workspace/ease.verify.core.target.2019-12/tests/org.eclipse.ease.lang.python.test/target/work/data/.metadata/.log
[INFO] Command line:
	[/opt/tools/java/oracle/jdk-8/1.8.0_202/jre/bin/java, -Dosgi.noShutdown=false, -Dosgi.os=linux, -Dosgi.ws=gtk, -Dosgi.arch=x86_64, -Dosgi.clean=true, -jar, /home/jenkins/.m2/repository/p2/osgi/bundle/org.eclipse.equinox.launcher/1.5.600.v20191014-2022/org.eclipse.equinox.launcher-1.5.600.v20191014-2022.jar, -data, /home/jenkins/agent/workspace/ease.verify.core.target.2019-12/tests/org.eclipse.ease.lang.python.test/target/work/data, -install, /home/jenkins/agent/workspace/ease.verify.core.target.2019-12/tests/org.eclipse.ease.lang.python.test/target/work, -configuration, /home/jenkins/agent/workspace/ease.verify.core.target.2019-12/tests/org.eclipse.ease.lang.python.test/target/work/configuration, -application, org.eclipse.tycho.surefire.osgibooter.headlesstest, -testproperties, /home/jenkins/agent/workspace/ease.verify.core.target.2019-12/tests/org.eclipse.ease.lang.python.test/target/surefire.properties]
Picked up JAVA_TOOL_OPTIONS: -XX:+IgnoreUnrecognizedVMOptions -XX:+UseContainerSupport -XX:+UnlockExperimentalVMOptions -XX:+UseCGroupMemoryLimitForHeap -Dmaven.ext.class.path="/home/jenkins/agent/workspace/ease.verify.core.target.2019-12@tmp/withMaven4ab1285b/pipeline-maven-spy.jar" -Dorg.jenkinsci.plugins.pipeline.maven.reportsFolder="/home/jenkins/agent/workspace/ease.verify.core.target.2019-12@tmp/withMaven4ab1285b" 
Picked up _JAVA_OPTIONS: -XX:MaxRAMPercentage=64.0
Running org.eclipse.ease.lang.python.PythonCodeFactoryTest
Tests run: 1, Failures: 0, Errors: 0, Skipped: 0, Time elapsed: 0.065 s - in org.eclipse.ease.lang.python.PythonCodeFactoryTest
testCommentCreator(org.eclipse.ease.lang.python.PythonCodeFactoryTest)  Time elapsed: 0.012 s

Results:

Tests run: 1, Failures: 0, Errors: 0, Skipped: 0

[INFO] All tests passed!
[INFO] 
[INFO] -----< org.eclipse.ease:org.eclipse.ease.lang.python.jython.test >------
[INFO] Building org.eclipse.ease.lang.python.jython.test 0.8.0-SNAPSHOT  [8/11]
[INFO] ------------------------[ eclipse-test-plugin ]-------------------------
[INFO] 
[INFO] --- tycho-packaging-plugin:1.3.0:build-qualifier (default-build-qualifier) @ org.eclipse.ease.lang.python.jython.test ---
[INFO] The project's OSGi version is 0.8.0.I201911291239
[INFO] 
[INFO] --- tycho-packaging-plugin:1.3.0:validate-id (default-validate-id) @ org.eclipse.ease.lang.python.jython.test ---
[INFO] 
[INFO] --- tycho-packaging-plugin:1.3.0:validate-version (default-validate-version) @ org.eclipse.ease.lang.python.jython.test ---
[INFO] 
[INFO] --- maven-resources-plugin:2.4.3:resources (default-resources) @ org.eclipse.ease.lang.python.jython.test ---
[INFO] Using 'UTF-8' encoding to copy filtered resources.
[INFO] skip non existing resourceDirectory /home/jenkins/agent/workspace/ease.verify.core.target.2019-12/tests/org.eclipse.ease.lang.python.jython.test/src/main/resources
[INFO] 
[INFO] --- tycho-compiler-plugin:1.3.0:compile (default-compile) @ org.eclipse.ease.lang.python.jython.test ---
[INFO] Nothing to compile - all classes are up to date
[INFO] 
[INFO] --- maven-resources-plugin:2.4.3:testResources (default-testResources) @ org.eclipse.ease.lang.python.jython.test ---
[INFO] Using 'UTF-8' encoding to copy filtered resources.
[INFO] skip non existing resourceDirectory /home/jenkins/agent/workspace/ease.verify.core.target.2019-12/tests/org.eclipse.ease.lang.python.jython.test/src/test/resources
[INFO] 
[INFO] --- tycho-source-plugin:1.3.0:plugin-source (plugin-source) @ org.eclipse.ease.lang.python.jython.test ---
[WARNING] Bundle-Vendor header not found in /home/jenkins/agent/workspace/ease.verify.core.target.2019-12/tests/org.eclipse.ease.lang.python.jython.test/META-INF/MANIFEST.MF, fallback to 'unknown' for source bundle
[INFO] Building jar: /home/jenkins/agent/workspace/ease.verify.core.target.2019-12/tests/org.eclipse.ease.lang.python.jython.test/target/org.eclipse.ease.lang.python.jython.test-0.8.0-SNAPSHOT-sources.jar
[INFO] 
[INFO] --- target-platform-configuration:1.3.0:target-platform (default-target-platform) @ org.eclipse.ease.lang.python.jython.test ---
[INFO] 
[INFO] --- tycho-packaging-plugin:1.3.0:package-plugin (default-package-plugin) @ org.eclipse.ease.lang.python.jython.test ---
[INFO] Building jar: /home/jenkins/agent/workspace/ease.verify.core.target.2019-12/tests/org.eclipse.ease.lang.python.jython.test/target/org.eclipse.ease.lang.python.jython.test-0.8.0-SNAPSHOT.jar
[INFO] 
[INFO] --- tycho-p2-plugin:1.3.0:p2-metadata-default (default-p2-metadata-default) @ org.eclipse.ease.lang.python.jython.test ---
[INFO] 
[INFO] --- tycho-source-feature-plugin:1.3.0:source-feature (source-feature) @ org.eclipse.ease.lang.python.jython.test ---
[INFO] 
[INFO] --- tycho-p2-plugin:1.3.0:p2-metadata (attached-p2-metadata) @ org.eclipse.ease.lang.python.jython.test ---
[INFO] 
[INFO] --- tycho-surefire-plugin:1.3.0:test (default-test) @ org.eclipse.ease.lang.python.jython.test ---
[INFO] Expected eclipse log file: /home/jenkins/agent/workspace/ease.verify.core.target.2019-12/tests/org.eclipse.ease.lang.python.jython.test/target/work/data/.metadata/.log
[INFO] Command line:
	[/opt/tools/java/oracle/jdk-8/1.8.0_202/jre/bin/java, -Dosgi.noShutdown=false, -Dosgi.os=linux, -Dosgi.ws=gtk, -Dosgi.arch=x86_64, -Dosgi.clean=true, -jar, /home/jenkins/.m2/repository/p2/osgi/bundle/org.eclipse.equinox.launcher/1.5.600.v20191014-2022/org.eclipse.equinox.launcher-1.5.600.v20191014-2022.jar, -data, /home/jenkins/agent/workspace/ease.verify.core.target.2019-12/tests/org.eclipse.ease.lang.python.jython.test/target/work/data, -install, /home/jenkins/agent/workspace/ease.verify.core.target.2019-12/tests/org.eclipse.ease.lang.python.jython.test/target/work, -configuration, /home/jenkins/agent/workspace/ease.verify.core.target.2019-12/tests/org.eclipse.ease.lang.python.jython.test/target/work/configuration, -application, org.eclipse.tycho.surefire.osgibooter.headlesstest, -testproperties, /home/jenkins/agent/workspace/ease.verify.core.target.2019-12/tests/org.eclipse.ease.lang.python.jython.test/target/surefire.properties]
Picked up JAVA_TOOL_OPTIONS: -XX:+IgnoreUnrecognizedVMOptions -XX:+UseContainerSupport -XX:+UnlockExperimentalVMOptions -XX:+UseCGroupMemoryLimitForHeap -Dmaven.ext.class.path="/home/jenkins/agent/workspace/ease.verify.core.target.2019-12@tmp/withMaven4ab1285b/pipeline-maven-spy.jar" -Dorg.jenkinsci.plugins.pipeline.maven.reportsFolder="/home/jenkins/agent/workspace/ease.verify.core.target.2019-12@tmp/withMaven4ab1285b" 
Picked up _JAVA_OPTIONS: -XX:MaxRAMPercentage=64.0
Running org.eclipse.ease.lang.python.jython.debugger.JythonDebugTest
Start of script
include file start
include file processed
Result of testMethod = 5
End of script
Start of script
include file start
include file processed
Result of testMethod = 5
End of script
Start of script
include file start
include file processed
Result of testMethod = 5
Traceback (most recent call last):
  File "(none)", line 184, in run
  File "__ref_L/Debug Test/Main.py_wtljqvntwa", line 23, in <module>
  File "(none)", line 161, in trace_dispatch
org.eclipse.ease.ExitException: 

org.eclipse.ease.ExitException: org.eclipse.ease.ExitException: 
Start of script
include file start
include file processed
Result of testMethod = 5
End of script
Start of script
include file start
include file processed
Result of testMethod = 5
End of script
Start of script
include file start
include file processed
Result of testMethod = 5
End of script
Start of script
include file start
include file processed
Result of testMethod = 5
Traceback (most recent call last):
  File "(none)", line 184, in run
  File "__ref_L/Debug Test/Main.py_kpgbrluybl", line 23, in <module>
  File "(none)", line 161, in trace_dispatch
org.eclipse.ease.ExitException: 

org.eclipse.ease.ExitException: org.eclipse.ease.ExitException: 
Start of script
include file start
include file processed
Result of testMethod = 5
End of script
Start of script
include file start
include file processed
Result of testMethod = 5
End of script
Start of script
include file start
include file processed
Traceback (most recent call last):
  File "(none)", line 184, in run
  File "__ref_L/Debug Test/Main.py_tewyluxmmf", line 22, in <module>
  File "(none)", line 161, in trace_dispatch
org.eclipse.ease.ExitException: 

org.eclipse.ease.ExitException: org.eclipse.ease.ExitException: 
Start of script
include file start
include file processed
Result of testMethod = 5
End of script
Start of script
include file start
include file processed
Result of testMethod = 5
End of script
Traceback (most recent call last):
  File "(none)", line 184, in run
  File "__ref_L/Debug Test/Main.py_naonksdpyj", line 1, in <module>
  File "(none)", line 161, in trace_dispatch
org.eclipse.ease.ExitException: 

org.eclipse.ease.ExitException: org.eclipse.ease.ExitException: 
Start of script
include file start
include file processed
Result of testMethod = 5
End of script
Start of script
include file start
include file processed
Result of testMethod = 5
End of script
Start of script
include file start
include file processed
Result of testMethod = 5
Traceback (most recent call last):
  File "(none)", line 184, in run
  File "__ref_L/Debug Test/Main.py_xhyalzzsjc", line 23, in <module>
  File "(none)", line 161, in trace_dispatch
org.eclipse.ease.ExitException: 

org.eclipse.ease.ExitException: org.eclipse.ease.ExitException: 
Start of script
include file start
include file processed
Result of testMethod = 5
End of script
Traceback (most recent call last):
  File "(none)", line 184, in run
  File "__ref_L/Debug Test/Main.py_vzpqjclaqh", line 1, in <module>
  File "(none)", line 161, in trace_dispatch
org.eclipse.ease.ExitException: 

org.eclipse.ease.ExitException: org.eclipse.ease.ExitException: 
Start of script
include file start
include file processed
Result of testMethod = 5
End of script
Start of script
include file start
include file processed
Result of testMethod = 5
End of script
Traceback (most recent call last):
  File "(none)", line 184, in run
  File "__ref_L/Debug Test/Main.py_bpdckyrxmg", line 1, in <module>
  File "(none)", line 161, in trace_dispatch
org.eclipse.ease.ExitException: 

org.eclipse.ease.ExitException: org.eclipse.ease.ExitException: 
Start of script
include file start
include file processed
Result of testMethod = 5
End of script
Start of script
include file start
include file processed
Result of testMethod = 5
Traceback (most recent call last):
  File "(none)", line 184, in run
  File "__ref_L/Debug Test/Main.py_mslwavefsh", line 23, in <module>
  File "(none)", line 161, in trace_dispatch
org.eclipse.ease.ExitException: 

org.eclipse.ease.ExitException: org.eclipse.ease.ExitException: 
Start of script
include file start
include file processed
Result of testMethod = 5
End of script
Start of script
include file start
include file processed
Result of testMethod = 5
End of script
Start of script
include file start
include file processed
Result of testMethod = 5
End of script
Start of script
include file start
include file processed
Result of testMethod = 5
End of script
Start of script
include file start
include file processed
Traceback (most recent call last):
  File "(none)", line 184, in run
  File "__ref_L/Debug Test/Main.py_gluphlejri", line 21, in <module>
  File "__ref_L/Debug Test/Main.py_gluphlejri", line 18, in testMethod
  File "(none)", line 161, in trace_dispatch
org.eclipse.ease.ExitException: 

org.eclipse.ease.ExitException: org.eclipse.ease.ExitException: 
Start of script
include file start
include file processed
Result of testMethod = 5
End of script
Start of script
include file start
include file processed
Result of testMethod = 5
Traceback (most recent call last):
  File "(none)", line 184, in run
  File "__ref_L/Debug Test/Main.py_xyvoqhgjpb", line 23, in <module>
  File "(none)", line 161, in trace_dispatch
org.eclipse.ease.ExitException: 

org.eclipse.ease.ExitException: org.eclipse.ease.ExitException: 
Start of script
include file start
include file processed
Result of testMethod = 5
End of script
Start of script
include file start
include file processed
Result of testMethod = 5
End of script
Start of script
include file start
include file processed
Result of testMethod = 5
End of script
Start of script
include file start
include file processed
Result of testMethod = 5
End of script
Start of script
include file start
include file processed
Result of testMethod = 5
Traceback (most recent call last):
  File "(none)", line 184, in run
  File "__ref_L/Debug Test/Main.py_wozqkzxoht", line 23, in <module>
  File "(none)", line 161, in trace_dispatch
org.eclipse.ease.ExitException: 

org.eclipse.ease.ExitException: org.eclipse.ease.ExitException: 
Start of script
include file start
include file processed
Result of testMethod = 5
End of script
Start of script
include file start
include file processed
Result of testMethod = 5
Traceback (most recent call last):
  File "(none)", line 184, in run
  File "__ref_L/Debug Test/Main.py_qkzkcjnrxr", line 23, in <module>
  File "(none)", line 161, in trace_dispatch
org.eclipse.ease.ExitException: 

org.eclipse.ease.ExitException: org.eclipse.ease.ExitException: 
Traceback (most recent call last):
  File "(none)", line 184, in run
  File "__ref_L/Debug Test/Main.py_ogvtzydhxk", line 1, in <module>
  File "(none)", line 161, in trace_dispatch
org.eclipse.ease.ExitException: 

org.eclipse.ease.ExitException: org.eclipse.ease.ExitException: 
Start of script
include file start
include file processed
Result of testMethod = 5
End of script
Start of script
include file start
include file processed
Result of testMethod = 5
End of script
Start of script
include file start
include file processed
Result of testMethod = 5
End of script
Tests run: 42, Failures: 0, Errors: 0, Skipped: 0, Time elapsed: 16.536 s - in org.eclipse.ease.lang.python.jython.debugger.JythonDebugTest
disconnectProcessInSuspendedState(org.eclipse.ease.lang.python.jython.debugger.JythonDebugTest)  Time elapsed: 4.259 s
stepReturnIncludeCommand(org.eclipse.ease.lang.python.jython.debugger.JythonDebugTest)  Time elapsed: 0.325 s
arrayVariableSorting(org.eclipse.ease.lang.python.jython.debugger.JythonDebugTest)  Time elapsed: 0.321 s
stepOverOnDebugTarget(org.eclipse.ease.lang.python.jython.debugger.JythonDebugTest)  Time elapsed: 0.322 s
hasDebugTarget(org.eclipse.ease.lang.python.jython.debugger.JythonDebugTest)  Time elapsed: 0.112 s
disconnectThreadInSuspendedState(org.eclipse.ease.lang.python.jython.debugger.JythonDebugTest)  Time elapsed: 0.217 s
stepReturnOnDebugTarget(org.eclipse.ease.lang.python.jython.debugger.JythonDebugTest)  Time elapsed: 0.421 s
nullVariable(org.eclipse.ease.lang.python.jython.debugger.JythonDebugTest)  Time elapsed: 0.318 s
stepOverOnStackFrame(org.eclipse.ease.lang.python.jython.debugger.JythonDebugTest)  Time elapsed: 0.318 s
resumeOnDebugTarget(org.eclipse.ease.lang.python.jython.debugger.JythonDebugTest)  Time elapsed: 0.317 s
modifyVariableKeepingType(org.eclipse.ease.lang.python.jython.debugger.JythonDebugTest)  Time elapsed: 0.615 s
resumeOnLastIncludeLine(org.eclipse.ease.lang.python.jython.debugger.JythonDebugTest)  Time elapsed: 0.218 s
stepReturnOnStackFrame(org.eclipse.ease.lang.python.jython.debugger.JythonDebugTest)  Time elapsed: 0.419 s
terminateStackFrameInSuspendedState(org.eclipse.ease.lang.python.jython.debugger.JythonDebugTest)  Time elapsed: 0.221 s
breakpointLocation(org.eclipse.ease.lang.python.jython.debugger.JythonDebugTest)  Time elapsed: 0.219 s
stepReturnOnThread(org.eclipse.ease.lang.python.jython.debugger.JythonDebugTest)  Time elapsed: 0.327 s
javaClassVariable(org.eclipse.ease.lang.python.jython.debugger.JythonDebugTest)  Time elapsed: 0.322 s
stepIntoOnThread(org.eclipse.ease.lang.python.jython.debugger.JythonDebugTest)  Time elapsed: 0.42 s
terminateThreadInSuspendedState(org.eclipse.ease.lang.python.jython.debugger.JythonDebugTest)  Time elapsed: 0.216 s
resumeOnThread(org.eclipse.ease.lang.python.jython.debugger.JythonDebugTest)  Time elapsed: 0.318 s
stepIntoOnStackFrame(org.eclipse.ease.lang.python.jython.debugger.JythonDebugTest)  Time elapsed: 0.422 s
terminateProcessInSuspendedState(org.eclipse.ease.lang.python.jython.debugger.JythonDebugTest)  Time elapsed: 0.215 s
stepOverOnProcess(org.eclipse.ease.lang.python.jython.debugger.JythonDebugTest)  Time elapsed: 0.317 s
nativeArrayVariable(org.eclipse.ease.lang.python.jython.debugger.JythonDebugTest)  Time elapsed: 0.316 s
disconnectDebugTargetInSuspendedState(org.eclipse.ease.lang.python.jython.debugger.JythonDebugTest)  Time elapsed: 0.215 s
stepIntoOnProcess(org.eclipse.ease.lang.python.jython.debugger.JythonDebugTest)  Time elapsed: 0.315 s
terminatedState(org.eclipse.ease.lang.python.jython.debugger.JythonDebugTest)  Time elapsed: 0.111 s
stepOverIncludeCommand(org.eclipse.ease.lang.python.jython.debugger.JythonDebugTest)  Time elapsed: 0.31 s
innerScopeVariableBeforeOuterScopeVariable(org.eclipse.ease.lang.python.jython.debugger.JythonDebugTest)  Time elapsed: 0.315 s
stepIntoIncludeCommand(org.eclipse.ease.lang.python.jython.debugger.JythonDebugTest)  Time elapsed: 0.312 s
primitiveStringVariable(org.eclipse.ease.lang.python.jython.debugger.JythonDebugTest)  Time elapsed: 0.418 s
resumeOnProcess(org.eclipse.ease.lang.python.jython.debugger.JythonDebugTest)  Time elapsed: 0.317 s
stepIntoOnDebugTarget(org.eclipse.ease.lang.python.jython.debugger.JythonDebugTest)  Time elapsed: 0.316 s
stepOverOnThread(org.eclipse.ease.lang.python.jython.debugger.JythonDebugTest)  Time elapsed: 0.317 s
suspendedState(org.eclipse.ease.lang.python.jython.debugger.JythonDebugTest)  Time elapsed: 0.215 s
primitiveDoubleVariable(org.eclipse.ease.lang.python.jython.debugger.JythonDebugTest)  Time elapsed: 0.314 s
resumeOnStackFrame(org.eclipse.ease.lang.python.jython.debugger.JythonDebugTest)  Time elapsed: 0.214 s
nativeObjectVariable(org.eclipse.ease.lang.python.jython.debugger.JythonDebugTest)  Time elapsed: 0.314 s
terminateDebugTargetInSuspendedState(org.eclipse.ease.lang.python.jython.debugger.JythonDebugTest)  Time elapsed: 0.214 s
disconnectStackFrameInSuspendedState(org.eclipse.ease.lang.python.jython.debugger.JythonDebugTest)  Time elapsed: 0.217 s
stepReturnOnProcess(org.eclipse.ease.lang.python.jython.debugger.JythonDebugTest)  Time elapsed: 0.315 s
evaluateWatchExpression(org.eclipse.ease.lang.python.jython.debugger.JythonDebugTest)  Time elapsed: 0.222 s

Results:

Tests run: 42, Failures: 0, Errors: 0, Skipped: 0

[INFO] All tests passed!
[INFO] 
[INFO] ------< org.eclipse.ease:org.eclipse.ease.lang.python.py4j.test >-------
[INFO] Building org.eclipse.ease.lang.python.py4j.test 0.8.0-SNAPSHOT    [9/11]
[INFO] ------------------------[ eclipse-test-plugin ]-------------------------
[INFO] 
[INFO] --- tycho-packaging-plugin:1.3.0:build-qualifier (default-build-qualifier) @ org.eclipse.ease.lang.python.py4j.test ---
[INFO] The project's OSGi version is 0.8.0.I201912021001
[INFO] 
[INFO] --- tycho-packaging-plugin:1.3.0:validate-id (default-validate-id) @ org.eclipse.ease.lang.python.py4j.test ---
[INFO] 
[INFO] --- tycho-packaging-plugin:1.3.0:validate-version (default-validate-version) @ org.eclipse.ease.lang.python.py4j.test ---
[INFO] 
[INFO] --- maven-resources-plugin:2.4.3:resources (default-resources) @ org.eclipse.ease.lang.python.py4j.test ---
[INFO] Using 'UTF-8' encoding to copy filtered resources.
[INFO] skip non existing resourceDirectory /home/jenkins/agent/workspace/ease.verify.core.target.2019-12/tests/org.eclipse.ease.lang.python.py4j.test/src/main/resources
[INFO] 
[INFO] --- tycho-compiler-plugin:1.3.0:compile (default-compile) @ org.eclipse.ease.lang.python.py4j.test ---
[INFO] Nothing to compile - all classes are up to date
[INFO] 
[INFO] --- maven-resources-plugin:2.4.3:testResources (default-testResources) @ org.eclipse.ease.lang.python.py4j.test ---
[INFO] Using 'UTF-8' encoding to copy filtered resources.
[INFO] skip non existing resourceDirectory /home/jenkins/agent/workspace/ease.verify.core.target.2019-12/tests/org.eclipse.ease.lang.python.py4j.test/src/test/resources
[INFO] 
[INFO] --- tycho-source-plugin:1.3.0:plugin-source (plugin-source) @ org.eclipse.ease.lang.python.py4j.test ---
[INFO] Building jar: /home/jenkins/agent/workspace/ease.verify.core.target.2019-12/tests/org.eclipse.ease.lang.python.py4j.test/target/org.eclipse.ease.lang.python.py4j.test-0.8.0-SNAPSHOT-sources.jar
[INFO] 
[INFO] --- target-platform-configuration:1.3.0:target-platform (default-target-platform) @ org.eclipse.ease.lang.python.py4j.test ---
[INFO] 
[INFO] --- tycho-packaging-plugin:1.3.0:package-plugin (default-package-plugin) @ org.eclipse.ease.lang.python.py4j.test ---
[INFO] Building jar: /home/jenkins/agent/workspace/ease.verify.core.target.2019-12/tests/org.eclipse.ease.lang.python.py4j.test/target/org.eclipse.ease.lang.python.py4j.test-0.8.0-SNAPSHOT.jar
[INFO] 
[INFO] --- tycho-p2-plugin:1.3.0:p2-metadata-default (default-p2-metadata-default) @ org.eclipse.ease.lang.python.py4j.test ---
[INFO] 
[INFO] --- tycho-source-feature-plugin:1.3.0:source-feature (source-feature) @ org.eclipse.ease.lang.python.py4j.test ---
[INFO] 
[INFO] --- tycho-p2-plugin:1.3.0:p2-metadata (attached-p2-metadata) @ org.eclipse.ease.lang.python.py4j.test ---
[INFO] 
[INFO] --- tycho-surefire-plugin:1.3.0:test (default-test) @ org.eclipse.ease.lang.python.py4j.test ---
[INFO] Expected eclipse log file: /home/jenkins/agent/workspace/ease.verify.core.target.2019-12/tests/org.eclipse.ease.lang.python.py4j.test/target/work/data/.metadata/.log
[INFO] Command line:
	[/opt/tools/java/oracle/jdk-8/1.8.0_202/jre/bin/java, -Dosgi.noShutdown=false, -Dosgi.os=linux, -Dosgi.ws=gtk, -Dosgi.arch=x86_64, -Dosgi.clean=true, -jar, /home/jenkins/.m2/repository/p2/osgi/bundle/org.eclipse.equinox.launcher/1.5.600.v20191014-2022/org.eclipse.equinox.launcher-1.5.600.v20191014-2022.jar, -data, /home/jenkins/agent/workspace/ease.verify.core.target.2019-12/tests/org.eclipse.ease.lang.python.py4j.test/target/work/data, -install, /home/jenkins/agent/workspace/ease.verify.core.target.2019-12/tests/org.eclipse.ease.lang.python.py4j.test/target/work, -configuration, /home/jenkins/agent/workspace/ease.verify.core.target.2019-12/tests/org.eclipse.ease.lang.python.py4j.test/target/work/configuration, -application, org.eclipse.tycho.surefire.osgibooter.headlesstest, -testproperties, /home/jenkins/agent/workspace/ease.verify.core.target.2019-12/tests/org.eclipse.ease.lang.python.py4j.test/target/surefire.properties]
Picked up JAVA_TOOL_OPTIONS: -XX:+IgnoreUnrecognizedVMOptions -XX:+UseContainerSupport -XX:+UnlockExperimentalVMOptions -XX:+UseCGroupMemoryLimitForHeap -Dmaven.ext.class.path="/home/jenkins/agent/workspace/ease.verify.core.target.2019-12@tmp/withMaven4ab1285b/pipeline-maven-spy.jar" -Dorg.jenkinsci.plugins.pipeline.maven.reportsFolder="/home/jenkins/agent/workspace/ease.verify.core.target.2019-12@tmp/withMaven4ab1285b" 
Picked up _JAVA_OPTIONS: -XX:MaxRAMPercentage=64.0
Running org.eclipse.ease.lang.python.py4j.Py4JPep302ModuleLoadingTest
org.eclipse.ease.ScriptExecutionException: Traceback (most recent call last):
  File "<...>", line 1, in <module>
  File "<...>", line 81, in load_module
ImportError: No EASE module named 'eclipse.test.notthere'

Tests run: 8, Failures: 0, Errors: 0, Skipped: 0, Time elapsed: 2.088 s - in org.eclipse.ease.lang.python.py4j.Py4JPep302ModuleLoadingTest
loadSimpleModule(org.eclipse.ease.lang.python.py4j.Py4JPep302ModuleLoadingTest)  Time elapsed: 0.622 s
loadModuleWithDependencies(org.eclipse.ease.lang.python.py4j.Py4JPep302ModuleLoadingTest)  Time elapsed: 0.245 s
accessAdvancedModule(org.eclipse.ease.lang.python.py4j.Py4JPep302ModuleLoadingTest)  Time elapsed: 0.214 s
importAs(org.eclipse.ease.lang.python.py4j.Py4JPep302ModuleLoadingTest)  Time elapsed: 0.197 s
fromBasicImportMethod(org.eclipse.ease.lang.python.py4j.Py4JPep302ModuleLoadingTest)  Time elapsed: 0.19 s
loadNotExistingModule(org.eclipse.ease.lang.python.py4j.Py4JPep302ModuleLoadingTest)  Time elapsed: 0.179 s
fromBasicImportAll(org.eclipse.ease.lang.python.py4j.Py4JPep302ModuleLoadingTest)  Time elapsed: 0.191 s
accessModule(org.eclipse.ease.lang.python.py4j.Py4JPep302ModuleLoadingTest)  Time elapsed: 0.2 s
Running org.eclipse.ease.lang.python.py4j.Py4JEngineTest
Tests run: 3, Failures: 0, Errors: 0, Skipped: 3, Time elapsed: 0.006 s - in org.eclipse.ease.lang.python.py4j.Py4JEngineTest
print(org.eclipse.ease.lang.python.py4j.Py4JEngineTest) skipped
mixedMode(org.eclipse.ease.lang.python.py4j.Py4JEngineTest) skipped
cleanShutdown(org.eclipse.ease.lang.python.py4j.Py4JEngineTest) skipped
Running org.eclipse.ease.lang.python.py4j.StartStopTest
----------------------------------------------
Starting test: startStop(org.eclipse.ease.lang.python.py4j.StartStopTest)

Finished test: startStop(org.eclipse.ease.lang.python.py4j.StartStopTest)
----------------------------------------------
----------------------------------------------
Starting test: startStopShellNoBootstrap(org.eclipse.ease.lang.python.py4j.StartStopTest)

Finished test: startStopShellNoBootstrap(org.eclipse.ease.lang.python.py4j.StartStopTest)
----------------------------------------------
----------------------------------------------
Starting test: multiStartStop(org.eclipse.ease.lang.python.py4j.StartStopTest)

Finished test: multiStartStop(org.eclipse.ease.lang.python.py4j.StartStopTest)
----------------------------------------------
Tests run: 3, Failures: 0, Errors: 0, Skipped: 0, Time elapsed: 0.641 s - in org.eclipse.ease.lang.python.py4j.StartStopTest
startStop(org.eclipse.ease.lang.python.py4j.StartStopTest)  Time elapsed: 0.227 s
startStopShellNoBootstrap(org.eclipse.ease.lang.python.py4j.StartStopTest)  Time elapsed: 0.203 s
multiStartStop(org.eclipse.ease.lang.python.py4j.StartStopTest)  Time elapsed: 0.204 s
Running org.eclipse.ease.lang.python.py4j.ShellModeEngineTest
----------------------------------------------
Starting test: invalidSyntax(org.eclipse.ease.lang.python.py4j.ShellModeEngineTest)
org.eclipse.ease.ScriptExecutionException:   File "<console>", line 1
    1++
      ^
SyntaxError: invalid syntax


Finished test: invalidSyntax(org.eclipse.ease.lang.python.py4j.ShellModeEngineTest)
----------------------------------------------
----------------------------------------------
Starting test: optionalModuleParameters(org.eclipse.ease.lang.python.py4j.ShellModeEngineTest)

Finished test: optionalModuleParameters(org.eclipse.ease.lang.python.py4j.ShellModeEngineTest)
----------------------------------------------
----------------------------------------------
Starting test: getScriptEngine(org.eclipse.ease.lang.python.py4j.ShellModeEngineTest)

Finished test: getScriptEngine(org.eclipse.ease.lang.python.py4j.ShellModeEngineTest)
----------------------------------------------
----------------------------------------------
Starting test: callModuleCode(org.eclipse.ease.lang.python.py4j.ShellModeEngineTest)

Finished test: callModuleCode(org.eclipse.ease.lang.python.py4j.ShellModeEngineTest)
----------------------------------------------
----------------------------------------------
Starting test: incompleteStatement(org.eclipse.ease.lang.python.py4j.ShellModeEngineTest)

Finished test: incompleteStatement(org.eclipse.ease.lang.python.py4j.ShellModeEngineTest)
----------------------------------------------
----------------------------------------------
Starting test: multiLineStatement(org.eclipse.ease.lang.python.py4j.ShellModeEngineTest)

Finished test: multiLineStatement(org.eclipse.ease.lang.python.py4j.ShellModeEngineTest)
----------------------------------------------
----------------------------------------------
Starting test: runtimeError(org.eclipse.ease.lang.python.py4j.ShellModeEngineTest)
org.eclipse.ease.ScriptExecutionException: Traceback (most recent call last):
  File "<console>", line 1, in <module>
NameError: name 'x' is not defined


Finished test: runtimeError(org.eclipse.ease.lang.python.py4j.ShellModeEngineTest)
----------------------------------------------
----------------------------------------------
Starting test: javaIntArray(org.eclipse.ease.lang.python.py4j.ShellModeEngineTest)

Finished test: javaIntArray(org.eclipse.ease.lang.python.py4j.ShellModeEngineTest)
----------------------------------------------
----------------------------------------------
Starting test: javaDoubleArray(org.eclipse.ease.lang.python.py4j.ShellModeEngineTest)

Finished test: javaDoubleArray(org.eclipse.ease.lang.python.py4j.ShellModeEngineTest)
----------------------------------------------
----------------------------------------------
Starting test: pythonSet(org.eclipse.ease.lang.python.py4j.ShellModeEngineTest)

Finished test: pythonSet(org.eclipse.ease.lang.python.py4j.ShellModeEngineTest)
----------------------------------------------
----------------------------------------------
Starting test: javaStringArray(org.eclipse.ease.lang.python.py4j.ShellModeEngineTest)

Finished test: javaStringArray(org.eclipse.ease.lang.python.py4j.ShellModeEngineTest)
----------------------------------------------
----------------------------------------------
Starting test: javaShortArray(org.eclipse.ease.lang.python.py4j.ShellModeEngineTest)

Finished test: javaShortArray(org.eclipse.ease.lang.python.py4j.ShellModeEngineTest)
----------------------------------------------
----------------------------------------------
Starting test: javaBooleanArray(org.eclipse.ease.lang.python.py4j.ShellModeEngineTest)

Finished test: javaBooleanArray(org.eclipse.ease.lang.python.py4j.ShellModeEngineTest)
----------------------------------------------
----------------------------------------------
Starting test: javaObjectArray(org.eclipse.ease.lang.python.py4j.ShellModeEngineTest)

Finished test: javaObjectArray(org.eclipse.ease.lang.python.py4j.ShellModeEngineTest)
----------------------------------------------
----------------------------------------------
Starting test: javaIntegerArray(org.eclipse.ease.lang.python.py4j.ShellModeEngineTest)

Finished test: javaIntegerArray(org.eclipse.ease.lang.python.py4j.ShellModeEngineTest)
----------------------------------------------
----------------------------------------------
Starting test: javaInteger(org.eclipse.ease.lang.python.py4j.ShellModeEngineTest)

Finished test: javaInteger(org.eclipse.ease.lang.python.py4j.ShellModeEngineTest)
----------------------------------------------
----------------------------------------------
Starting test: javaString(org.eclipse.ease.lang.python.py4j.ShellModeEngineTest)

Finished test: javaString(org.eclipse.ease.lang.python.py4j.ShellModeEngineTest)
----------------------------------------------
----------------------------------------------
Starting test: javaByteArray(org.eclipse.ease.lang.python.py4j.ShellModeEngineTest)

Finished test: javaByteArray(org.eclipse.ease.lang.python.py4j.ShellModeEngineTest)
----------------------------------------------
----------------------------------------------
Starting test: createEclipseClass(org.eclipse.ease.lang.python.py4j.ShellModeEngineTest)

Finished test: createEclipseClass(org.eclipse.ease.lang.python.py4j.ShellModeEngineTest)
----------------------------------------------
----------------------------------------------
Starting test: pythonString(org.eclipse.ease.lang.python.py4j.ShellModeEngineTest)

Finished test: pythonString(org.eclipse.ease.lang.python.py4j.ShellModeEngineTest)
----------------------------------------------
----------------------------------------------
Starting test: varargs(org.eclipse.ease.lang.python.py4j.ShellModeEngineTest)

Finished test: varargs(org.eclipse.ease.lang.python.py4j.ShellModeEngineTest)
----------------------------------------------
----------------------------------------------
Starting test: createJavaType(org.eclipse.ease.lang.python.py4j.ShellModeEngineTest)

Finished test: createJavaType(org.eclipse.ease.lang.python.py4j.ShellModeEngineTest)
----------------------------------------------
----------------------------------------------
Starting test: javaFloatArray(org.eclipse.ease.lang.python.py4j.ShellModeEngineTest)

Finished test: javaFloatArray(org.eclipse.ease.lang.python.py4j.ShellModeEngineTest)
----------------------------------------------
----------------------------------------------
Starting test: implementJavaInterface(org.eclipse.ease.lang.python.py4j.ShellModeEngineTest)

Finished test: implementJavaInterface(org.eclipse.ease.lang.python.py4j.ShellModeEngineTest)
----------------------------------------------
----------------------------------------------
Starting test: pythonDict(org.eclipse.ease.lang.python.py4j.ShellModeEngineTest)

Finished test: pythonDict(org.eclipse.ease.lang.python.py4j.ShellModeEngineTest)
----------------------------------------------
----------------------------------------------
Starting test: pythonList(org.eclipse.ease.lang.python.py4j.ShellModeEngineTest)

Finished test: pythonList(org.eclipse.ease.lang.python.py4j.ShellModeEngineTest)
----------------------------------------------
----------------------------------------------
Starting test: testMultiple(org.eclipse.ease.lang.python.py4j.ShellModeEngineTest)

Finished test: testMultiple(org.eclipse.ease.lang.python.py4j.ShellModeEngineTest)
----------------------------------------------
----------------------------------------------
Starting test: javaLongArray(org.eclipse.ease.lang.python.py4j.ShellModeEngineTest)

Finished test: javaLongArray(org.eclipse.ease.lang.python.py4j.ShellModeEngineTest)
----------------------------------------------
----------------------------------------------
Starting test: createPythonObject(org.eclipse.ease.lang.python.py4j.ShellModeEngineTest)

Finished test: createPythonObject(org.eclipse.ease.lang.python.py4j.ShellModeEngineTest)
----------------------------------------------
----------------------------------------------
Starting test: pythonInteger(org.eclipse.ease.lang.python.py4j.ShellModeEngineTest)

Finished test: pythonInteger(org.eclipse.ease.lang.python.py4j.ShellModeEngineTest)
----------------------------------------------
Tests run: 34, Failures: 0, Errors: 0, Skipped: 4, Time elapsed: 9.945 s - in org.eclipse.ease.lang.python.py4j.ShellModeEngineTest
invalidSyntax(org.eclipse.ease.lang.python.py4j.ShellModeEngineTest)  Time elapsed: 0.394 s
print_(org.eclipse.ease.lang.python.py4j.ShellModeEngineTest) skipped
optionalModuleParameters(org.eclipse.ease.lang.python.py4j.ShellModeEngineTest)  Time elapsed: 0.34 s
print_TextNoNewline(org.eclipse.ease.lang.python.py4j.ShellModeEngineTest) skipped
getScriptEngine(org.eclipse.ease.lang.python.py4j.ShellModeEngineTest)  Time elapsed: 0.328 s
print_Text(org.eclipse.ease.lang.python.py4j.ShellModeEngineTest) skipped
callModuleCode(org.eclipse.ease.lang.python.py4j.ShellModeEngineTest)  Time elapsed: 0.324 s
print_NoNewline(org.eclipse.ease.lang.python.py4j.ShellModeEngineTest) skipped
incompleteStatement(org.eclipse.ease.lang.python.py4j.ShellModeEngineTest)  Time elapsed: 0.327 s
multiLineStatement(org.eclipse.ease.lang.python.py4j.ShellModeEngineTest)  Time elapsed: 0.327 s
runtimeError(org.eclipse.ease.lang.python.py4j.ShellModeEngineTest)  Time elapsed: 0.322 s
javaIntArray(org.eclipse.ease.lang.python.py4j.ShellModeEngineTest)  Time elapsed: 0.332 s
javaDoubleArray(org.eclipse.ease.lang.python.py4j.ShellModeEngineTest)  Time elapsed: 0.332 s
pythonSet(org.eclipse.ease.lang.python.py4j.ShellModeEngineTest)  Time elapsed: 0.325 s
javaStringArray(org.eclipse.ease.lang.python.py4j.ShellModeEngineTest)  Time elapsed: 0.324 s
javaShortArray(org.eclipse.ease.lang.python.py4j.ShellModeEngineTest)  Time elapsed: 0.328 s
javaBooleanArray(org.eclipse.ease.lang.python.py4j.ShellModeEngineTest)  Time elapsed: 0.329 s
javaObjectArray(org.eclipse.ease.lang.python.py4j.ShellModeEngineTest)  Time elapsed: 0.358 s
javaIntegerArray(org.eclipse.ease.lang.python.py4j.ShellModeEngineTest)  Time elapsed: 0.335 s
javaInteger(org.eclipse.ease.lang.python.py4j.ShellModeEngineTest)  Time elapsed: 0.328 s
javaString(org.eclipse.ease.lang.python.py4j.ShellModeEngineTest)  Time elapsed: 0.318 s
javaByteArray(org.eclipse.ease.lang.python.py4j.ShellModeEngineTest)  Time elapsed: 0.328 s
createEclipseClass(org.eclipse.ease.lang.python.py4j.ShellModeEngineTest)  Time elapsed: 0.325 s
pythonString(org.eclipse.ease.lang.python.py4j.ShellModeEngineTest)  Time elapsed: 0.323 s
varargs(org.eclipse.ease.lang.python.py4j.ShellModeEngineTest)  Time elapsed: 0.346 s
createJavaType(org.eclipse.ease.lang.python.py4j.ShellModeEngineTest)  Time elapsed: 0.325 s
javaFloatArray(org.eclipse.ease.lang.python.py4j.ShellModeEngineTest)  Time elapsed: 0.329 s
implementJavaInterface(org.eclipse.ease.lang.python.py4j.ShellModeEngineTest)  Time elapsed: 0.32 s
pythonDict(org.eclipse.ease.lang.python.py4j.ShellModeEngineTest)  Time elapsed: 0.323 s
pythonList(org.eclipse.ease.lang.python.py4j.ShellModeEngineTest)  Time elapsed: 0.325 s
testMultiple(org.eclipse.ease.lang.python.py4j.ShellModeEngineTest)  Time elapsed: 0.346 s
javaLongArray(org.eclipse.ease.lang.python.py4j.ShellModeEngineTest)  Time elapsed: 0.327 s
createPythonObject(org.eclipse.ease.lang.python.py4j.ShellModeEngineTest)  Time elapsed: 0.322 s
pythonInteger(org.eclipse.ease.lang.python.py4j.ShellModeEngineTest)  Time elapsed: 0.321 s
Running org.eclipse.ease.lang.python.py4j.ScriptModeEngineTest
----------------------------------------------
Starting test: invalidSyntax(org.eclipse.ease.lang.python.py4j.ScriptModeEngineTest)
org.eclipse.ease.ScriptExecutionException: Traceback (most recent call last):
  File "/usr/lib64/python2.7/ast.py", line 37, in parse
    return compile(source, filename, mode, PyCF_ONLY_AST)
  File "<unknown>", line 1
    1++
      ^
SyntaxError: invalid syntax


Finished test: invalidSyntax(org.eclipse.ease.lang.python.py4j.ScriptModeEngineTest)
----------------------------------------------
----------------------------------------------
Starting test: getScriptEngine(org.eclipse.ease.lang.python.py4j.ScriptModeEngineTest)
546361432
Finished test: getScriptEngine(org.eclipse.ease.lang.python.py4j.ScriptModeEngineTest)
----------------------------------------------
----------------------------------------------
Starting test: incompleteStatement(org.eclipse.ease.lang.python.py4j.ScriptModeEngineTest)
org.eclipse.ease.ScriptExecutionException: Traceback (most recent call last):
  File "/usr/lib64/python2.7/ast.py", line 37, in parse
    return compile(source, filename, mode, PyCF_ONLY_AST)
  File "<unknown>", line 1
    def a():
           ^
SyntaxError: unexpected EOF while parsing


Finished test: incompleteStatement(org.eclipse.ease.lang.python.py4j.ScriptModeEngineTest)
----------------------------------------------
----------------------------------------------
Starting test: multiLineStatement(org.eclipse.ease.lang.python.py4j.ScriptModeEngineTest)

Finished test: multiLineStatement(org.eclipse.ease.lang.python.py4j.ScriptModeEngineTest)
----------------------------------------------
----------------------------------------------
Starting test: runtimeError(org.eclipse.ease.lang.python.py4j.ScriptModeEngineTest)
org.eclipse.ease.ScriptExecutionException: Traceback (most recent call last):
  File "<...>", line 1, in <module>
NameError: name 'a' is not defined


Finished test: runtimeError(org.eclipse.ease.lang.python.py4j.ScriptModeEngineTest)
----------------------------------------------
----------------------------------------------
Starting test: javaIntArray(org.eclipse.ease.lang.python.py4j.ScriptModeEngineTest)

Finished test: javaIntArray(org.eclipse.ease.lang.python.py4j.ScriptModeEngineTest)
----------------------------------------------
----------------------------------------------
Starting test: javaDoubleArray(org.eclipse.ease.lang.python.py4j.ScriptModeEngineTest)

Finished test: javaDoubleArray(org.eclipse.ease.lang.python.py4j.ScriptModeEngineTest)
----------------------------------------------
----------------------------------------------
Starting test: pythonSet(org.eclipse.ease.lang.python.py4j.ScriptModeEngineTest)

Finished test: pythonSet(org.eclipse.ease.lang.python.py4j.ScriptModeEngineTest)
----------------------------------------------
----------------------------------------------
Starting test: javaStringArray(org.eclipse.ease.lang.python.py4j.ScriptModeEngineTest)

Finished test: javaStringArray(org.eclipse.ease.lang.python.py4j.ScriptModeEngineTest)
----------------------------------------------
----------------------------------------------
Starting test: javaShortArray(org.eclipse.ease.lang.python.py4j.ScriptModeEngineTest)

Finished test: javaShortArray(org.eclipse.ease.lang.python.py4j.ScriptModeEngineTest)
----------------------------------------------
----------------------------------------------
Starting test: javaBooleanArray(org.eclipse.ease.lang.python.py4j.ScriptModeEngineTest)

Finished test: javaBooleanArray(org.eclipse.ease.lang.python.py4j.ScriptModeEngineTest)
----------------------------------------------
----------------------------------------------
Starting test: javaObjectArray(org.eclipse.ease.lang.python.py4j.ScriptModeEngineTest)

Finished test: javaObjectArray(org.eclipse.ease.lang.python.py4j.ScriptModeEngineTest)
----------------------------------------------
----------------------------------------------
Starting test: javaIntegerArray(org.eclipse.ease.lang.python.py4j.ScriptModeEngineTest)

Finished test: javaIntegerArray(org.eclipse.ease.lang.python.py4j.ScriptModeEngineTest)
----------------------------------------------
----------------------------------------------
Starting test: javaInteger(org.eclipse.ease.lang.python.py4j.ScriptModeEngineTest)

Finished test: javaInteger(org.eclipse.ease.lang.python.py4j.ScriptModeEngineTest)
----------------------------------------------
----------------------------------------------
Starting test: javaString(org.eclipse.ease.lang.python.py4j.ScriptModeEngineTest)

Finished test: javaString(org.eclipse.ease.lang.python.py4j.ScriptModeEngineTest)
----------------------------------------------
----------------------------------------------
Starting test: javaByteArray(org.eclipse.ease.lang.python.py4j.ScriptModeEngineTest)

Finished test: javaByteArray(org.eclipse.ease.lang.python.py4j.ScriptModeEngineTest)
----------------------------------------------
----------------------------------------------
Starting test: createEclipseClass(org.eclipse.ease.lang.python.py4j.ScriptModeEngineTest)

Finished test: createEclipseClass(org.eclipse.ease.lang.python.py4j.ScriptModeEngineTest)
----------------------------------------------
----------------------------------------------
Starting test: pythonString(org.eclipse.ease.lang.python.py4j.ScriptModeEngineTest)

Finished test: pythonString(org.eclipse.ease.lang.python.py4j.ScriptModeEngineTest)
----------------------------------------------
----------------------------------------------
Starting test: varargs(org.eclipse.ease.lang.python.py4j.ScriptModeEngineTest)

Finished test: varargs(org.eclipse.ease.lang.python.py4j.ScriptModeEngineTest)
----------------------------------------------
----------------------------------------------
Starting test: createJavaType(org.eclipse.ease.lang.python.py4j.ScriptModeEngineTest)

Finished test: createJavaType(org.eclipse.ease.lang.python.py4j.ScriptModeEngineTest)
----------------------------------------------
----------------------------------------------
Starting test: javaFloatArray(org.eclipse.ease.lang.python.py4j.ScriptModeEngineTest)

Finished test: javaFloatArray(org.eclipse.ease.lang.python.py4j.ScriptModeEngineTest)
----------------------------------------------
----------------------------------------------
Starting test: implementJavaInterface(org.eclipse.ease.lang.python.py4j.ScriptModeEngineTest)

Finished test: implementJavaInterface(org.eclipse.ease.lang.python.py4j.ScriptModeEngineTest)
----------------------------------------------
----------------------------------------------
Starting test: pythonDict(org.eclipse.ease.lang.python.py4j.ScriptModeEngineTest)

Finished test: pythonDict(org.eclipse.ease.lang.python.py4j.ScriptModeEngineTest)
----------------------------------------------
----------------------------------------------
Starting test: pythonList(org.eclipse.ease.lang.python.py4j.ScriptModeEngineTest)

Finished test: pythonList(org.eclipse.ease.lang.python.py4j.ScriptModeEngineTest)
----------------------------------------------
----------------------------------------------
Starting test: testMultiple(org.eclipse.ease.lang.python.py4j.ScriptModeEngineTest)

Finished test: testMultiple(org.eclipse.ease.lang.python.py4j.ScriptModeEngineTest)
----------------------------------------------
----------------------------------------------
Starting test: javaLongArray(org.eclipse.ease.lang.python.py4j.ScriptModeEngineTest)

Finished test: javaLongArray(org.eclipse.ease.lang.python.py4j.ScriptModeEngineTest)
----------------------------------------------
----------------------------------------------
Starting test: createPythonObject(org.eclipse.ease.lang.python.py4j.ScriptModeEngineTest)

Finished test: createPythonObject(org.eclipse.ease.lang.python.py4j.ScriptModeEngineTest)
----------------------------------------------
----------------------------------------------
Starting test: pythonInteger(org.eclipse.ease.lang.python.py4j.ScriptModeEngineTest)

Finished test: pythonInteger(org.eclipse.ease.lang.python.py4j.ScriptModeEngineTest)
----------------------------------------------
Tests run: 30, Failures: 0, Errors: 0, Skipped: 2, Time elapsed: 10.021 s - in org.eclipse.ease.lang.python.py4j.ScriptModeEngineTest
invalidSyntax(org.eclipse.ease.lang.python.py4j.ScriptModeEngineTest)  Time elapsed: 0.317 s
getScriptEngine(org.eclipse.ease.lang.python.py4j.ScriptModeEngineTest)  Time elapsed: 1.322 s
callExit(org.eclipse.ease.lang.python.py4j.ScriptModeEngineTest) skipped
multiLinesOfCode(org.eclipse.ease.lang.python.py4j.ScriptModeEngineTest) skipped
incompleteStatement(org.eclipse.ease.lang.python.py4j.ScriptModeEngineTest)  Time elapsed: 0.317 s
multiLineStatement(org.eclipse.ease.lang.python.py4j.ScriptModeEngineTest)  Time elapsed: 0.318 s
runtimeError(org.eclipse.ease.lang.python.py4j.ScriptModeEngineTest)  Time elapsed: 0.316 s
javaIntArray(org.eclipse.ease.lang.python.py4j.ScriptModeEngineTest)  Time elapsed: 0.32 s
javaDoubleArray(org.eclipse.ease.lang.python.py4j.ScriptModeEngineTest)  Time elapsed: 0.324 s
pythonSet(org.eclipse.ease.lang.python.py4j.ScriptModeEngineTest)  Time elapsed: 0.325 s
javaStringArray(org.eclipse.ease.lang.python.py4j.ScriptModeEngineTest)  Time elapsed: 0.32 s
javaShortArray(org.eclipse.ease.lang.python.py4j.ScriptModeEngineTest)  Time elapsed: 0.319 s
javaBooleanArray(org.eclipse.ease.lang.python.py4j.ScriptModeEngineTest)  Time elapsed: 0.322 s
javaObjectArray(org.eclipse.ease.lang.python.py4j.ScriptModeEngineTest)  Time elapsed: 0.326 s
javaIntegerArray(org.eclipse.ease.lang.python.py4j.ScriptModeEngineTest)  Time elapsed: 0.319 s
javaInteger(org.eclipse.ease.lang.python.py4j.ScriptModeEngineTest)  Time elapsed: 0.323 s
javaString(org.eclipse.ease.lang.python.py4j.ScriptModeEngineTest)  Time elapsed: 0.315 s
javaByteArray(org.eclipse.ease.lang.python.py4j.ScriptModeEngineTest)  Time elapsed: 0.322 s
createEclipseClass(org.eclipse.ease.lang.python.py4j.ScriptModeEngineTest)  Time elapsed: 0.338 s
pythonString(org.eclipse.ease.lang.python.py4j.ScriptModeEngineTest)  Time elapsed: 0.318 s
varargs(org.eclipse.ease.lang.python.py4j.ScriptModeEngineTest)  Time elapsed: 0.325 s
createJavaType(org.eclipse.ease.lang.python.py4j.ScriptModeEngineTest)  Time elapsed: 0.321 s
javaFloatArray(org.eclipse.ease.lang.python.py4j.ScriptModeEngineTest)  Time elapsed: 0.319 s
implementJavaInterface(org.eclipse.ease.lang.python.py4j.ScriptModeEngineTest)  Time elapsed: 0.321 s
pythonDict(org.eclipse.ease.lang.python.py4j.ScriptModeEngineTest)  Time elapsed: 0.317 s
pythonList(org.eclipse.ease.lang.python.py4j.ScriptModeEngineTest)  Time elapsed: 0.327 s
testMultiple(org.eclipse.ease.lang.python.py4j.ScriptModeEngineTest)  Time elapsed: 0.347 s
javaLongArray(org.eclipse.ease.lang.python.py4j.ScriptModeEngineTest)  Time elapsed: 0.322 s
createPythonObject(org.eclipse.ease.lang.python.py4j.ScriptModeEngineTest)  Time elapsed: 0.312 s
pythonInteger(org.eclipse.ease.lang.python.py4j.ScriptModeEngineTest)  Time elapsed: 0.318 s
Running org.eclipse.ease.lang.python.py4j.Py4jDebugTest
Start of script
include file start
include file processed
Result of testMethod = 5
End of script
Start of script
include file start
include file processed
Result of testMethod = 5
End of script
Start of script
include file start
include file processed
Result of testMethod = 5
py4j.Py4JException: An exception was raised by the Python Proxy. Return Message: Traceback (most recent call last):
  File "/home/jenkins/agent/workspace/ease.verify.core.target.2019-12/tests/org.eclipse.ease.lang.python.py4j.test/target/work/plugins/py4j-python_0.10.8.1-bnd-2odeag/src/py4j/clientserver.py", line 581, in _call_proxy
    return_value = getattr(self.pool[obj_id], method)(*params)
  File "<...>", line 424, in run
  File "/usr/lib64/python2.7/bdb.py", line 400, in run
    exec cmd in globals, locals
  File "__ref_L/Debug Test/Main.py_mbogwvouuz", line 23, in <module>
  File "__ref_L/Debug Test/Main.py_mbogwvouuz", line 23, in <module>
  File "<...>", line 231, in trace_dispatch
  File "/usr/lib64/python2.7/bdb.py", line 49, in trace_dispatch
    return self.dispatch_line(frame)
  File "/usr/lib64/python2.7/bdb.py", line 67, in dispatch_line
    self.user_line(frame)
  File "<...>", line 241, in user_line
  File "<...>", line 296, in dispatch
  File "/home/jenkins/agent/workspace/ease.verify.core.target.2019-12/tests/org.eclipse.ease.lang.python.py4j.test/target/work/plugins/py4j-python_0.10.8.1-bnd-2odeag/src/py4j/java_gateway.py", line 1286, in __call__
    answer, self.gateway_client, self.target_id, self.name)
  File "/home/jenkins/agent/workspace/ease.verify.core.target.2019-12/tests/org.eclipse.ease.lang.python.py4j.test/target/work/plugins/py4j-python_0.10.8.1-bnd-2odeag/src/py4j/protocol.py", line 328, in get_return_value
    format(target_id, ".", name), value)
Py4JJavaError: An error occurred while calling o0.traceDispatch.
: org.eclipse.ease.ExitException: 
	at org.eclipse.ease.debugging.AbstractEaseDebugger.handleEventsInSuspendedState(AbstractEaseDebugger.java:329)
	at org.eclipse.ease.debugging.AbstractEaseDebugger.suspend(AbstractEaseDebugger.java:255)
	at org.eclipse.ease.lang.python.py4j.internal.Py4jDebugger.suspend(Py4jDebugger.java:87)
	at org.eclipse.ease.debugging.AbstractEaseDebugger.processLine(AbstractEaseDebugger.java:490)
	at org.eclipse.ease.lang.python.debugger.PythonDebugger.traceDispatch(PythonDebugger.java:178)
	at sun.reflect.GeneratedMethodAccessor14.invoke(Unknown Source)
	at sun.reflect.DelegatingMethodAccessorImpl.invoke(DelegatingMethodAccessorImpl.java:43)
	at java.lang.reflect.Method.invoke(Method.java:498)
	at py4j.reflection.MethodInvoker.invoke(MethodInvoker.java:244)
	at py4j.reflection.ReflectionEngine.invoke(ReflectionEngine.java:357)
	at py4j.Gateway.invoke(Gateway.java:282)
	at py4j.commands.AbstractCommand.invokeMethod(AbstractCommand.java:132)
	at py4j.commands.CallCommand.execute(CallCommand.java:79)
	at py4j.ClientServerConnection.sendCommand(ClientServerConnection.java:244)
	at py4j.CallbackClient.sendCommand(CallbackClient.java:384)
	at py4j.CallbackClient.sendCommand(CallbackClient.java:356)
	at py4j.reflection.PythonProxyHandler.invoke(PythonProxyHandler.java:106)
	at com.sun.proxy.$Proxy13.run(Unknown Source)
	at org.eclipse.ease.lang.python.py4j.internal.Py4jDebugger.execute(Py4jDebugger.java:106)
	at org.eclipse.ease.lang.python.py4j.internal.Py4jDebuggerEngine.internalExecute(Py4jDebuggerEngine.java:85)
	at org.eclipse.ease.lang.python.py4j.internal.Py4jScriptEngine.execute(Py4jScriptEngine.java:226)
	at org.eclipse.ease.AbstractScriptEngine.inject(AbstractScriptEngine.java:226)
	at org.eclipse.ease.AbstractScriptEngine.run(AbstractScriptEngine.java:277)
	at org.eclipse.core.internal.jobs.Worker.run(Worker.java:63)


	at py4j.Protocol.getReturnValue(Protocol.java:476)
	at py4j.reflection.PythonProxyHandler.invoke(PythonProxyHandler.java:108)
	at com.sun.proxy.$Proxy13.run(Unknown Source)
	at org.eclipse.ease.lang.python.py4j.internal.Py4jDebugger.execute(Py4jDebugger.java:106)
	at org.eclipse.ease.lang.python.py4j.internal.Py4jDebuggerEngine.internalExecute(Py4jDebuggerEngine.java:85)
	at org.eclipse.ease.lang.python.py4j.internal.Py4jScriptEngine.execute(Py4jScriptEngine.java:226)
	at org.eclipse.ease.AbstractScriptEngine.inject(AbstractScriptEngine.java:226)
	at org.eclipse.ease.AbstractScriptEngine.run(AbstractScriptEngine.java:277)
	at org.eclipse.core.internal.jobs.Worker.run(Worker.java:63)
Start of script
include file start
include file processed
Result of testMethod = 5
End of script
Start of script
include file start
include file processed
Result of testMethod = 5
End of script
Start of script
include file start
include file processed
Result of testMethod = 5
End of script
Start of script
include file start
include file processed
Result of testMethod = 5
py4j.Py4JException: An exception was raised by the Python Proxy. Return Message: Traceback (most recent call last):
  File "/home/jenkins/agent/workspace/ease.verify.core.target.2019-12/tests/org.eclipse.ease.lang.python.py4j.test/target/work/plugins/py4j-python_0.10.8.1-bnd-2odeag/src/py4j/clientserver.py", line 581, in _call_proxy
    return_value = getattr(self.pool[obj_id], method)(*params)
  File "<...>", line 424, in run
  File "/usr/lib64/python2.7/bdb.py", line 400, in run
    exec cmd in globals, locals
  File "__ref_L/Debug Test/Main.py_wfwlqwkxem", line 23, in <module>
  File "__ref_L/Debug Test/Main.py_wfwlqwkxem", line 23, in <module>
  File "<...>", line 231, in trace_dispatch
  File "/usr/lib64/python2.7/bdb.py", line 49, in trace_dispatch
    return self.dispatch_line(frame)
  File "/usr/lib64/python2.7/bdb.py", line 67, in dispatch_line
    self.user_line(frame)
  File "<...>", line 241, in user_line
  File "<...>", line 296, in dispatch
  File "/home/jenkins/agent/workspace/ease.verify.core.target.2019-12/tests/org.eclipse.ease.lang.python.py4j.test/target/work/plugins/py4j-python_0.10.8.1-bnd-2odeag/src/py4j/java_gateway.py", line 1286, in __call__
    answer, self.gateway_client, self.target_id, self.name)
  File "/home/jenkins/agent/workspace/ease.verify.core.target.2019-12/tests/org.eclipse.ease.lang.python.py4j.test/target/work/plugins/py4j-python_0.10.8.1-bnd-2odeag/src/py4j/protocol.py", line 328, in get_return_value
    format(target_id, ".", name), value)
Py4JJavaError: An error occurred while calling o0.traceDispatch.
: org.eclipse.ease.ExitException: 
	at org.eclipse.ease.debugging.AbstractEaseDebugger.handleEventsInSuspendedState(AbstractEaseDebugger.java:329)
	at org.eclipse.ease.debugging.AbstractEaseDebugger.suspend(AbstractEaseDebugger.java:255)
	at org.eclipse.ease.lang.python.py4j.internal.Py4jDebugger.suspend(Py4jDebugger.java:87)
	at org.eclipse.ease.debugging.AbstractEaseDebugger.processLine(AbstractEaseDebugger.java:490)
	at org.eclipse.ease.lang.python.debugger.PythonDebugger.traceDispatch(PythonDebugger.java:178)
	at sun.reflect.GeneratedMethodAccessor14.invoke(Unknown Source)
	at sun.reflect.DelegatingMethodAccessorImpl.invoke(DelegatingMethodAccessorImpl.java:43)
	at java.lang.reflect.Method.invoke(Method.java:498)
	at py4j.reflection.MethodInvoker.invoke(MethodInvoker.java:244)
	at py4j.reflection.ReflectionEngine.invoke(ReflectionEngine.java:357)
	at py4j.Gateway.invoke(Gateway.java:282)
	at py4j.commands.AbstractCommand.invokeMethod(AbstractCommand.java:132)
	at py4j.commands.CallCommand.execute(CallCommand.java:79)
	at py4j.ClientServerConnection.sendCommand(ClientServerConnection.java:244)
	at py4j.CallbackClient.sendCommand(CallbackClient.java:384)
	at py4j.CallbackClient.sendCommand(CallbackClient.java:356)
	at py4j.reflection.PythonProxyHandler.invoke(PythonProxyHandler.java:106)
	at com.sun.proxy.$Proxy13.run(Unknown Source)
	at org.eclipse.ease.lang.python.py4j.internal.Py4jDebugger.execute(Py4jDebugger.java:106)
	at org.eclipse.ease.lang.python.py4j.internal.Py4jDebuggerEngine.internalExecute(Py4jDebuggerEngine.java:85)
	at org.eclipse.ease.lang.python.py4j.internal.Py4jScriptEngine.execute(Py4jScriptEngine.java:226)
	at org.eclipse.ease.AbstractScriptEngine.inject(AbstractScriptEngine.java:226)
	at org.eclipse.ease.AbstractScriptEngine.run(AbstractScriptEngine.java:277)
	at org.eclipse.core.internal.jobs.Worker.run(Worker.java:63)


	at py4j.Protocol.getReturnValue(Protocol.java:476)
	at py4j.reflection.PythonProxyHandler.invoke(PythonProxyHandler.java:108)
	at com.sun.proxy.$Proxy13.run(Unknown Source)
	at org.eclipse.ease.lang.python.py4j.internal.Py4jDebugger.execute(Py4jDebugger.java:106)
	at org.eclipse.ease.lang.python.py4j.internal.Py4jDebuggerEngine.internalExecute(Py4jDebuggerEngine.java:85)
	at org.eclipse.ease.lang.python.py4j.internal.Py4jScriptEngine.execute(Py4jScriptEngine.java:226)
	at org.eclipse.ease.AbstractScriptEngine.inject(AbstractScriptEngine.java:226)
	at org.eclipse.ease.AbstractScriptEngine.run(AbstractScriptEngine.java:277)
	at org.eclipse.core.internal.jobs.Worker.run(Worker.java:63)
Start of script
include file start
include file processed
Result of testMethod = 5
End of script
Start of script
include file start
include file processed
Result of testMethod = 5
End of script
Start of script
include file start
include file processed
py4j.Py4JException: An exception was raised by the Python Proxy. Return Message: Traceback (most recent call last):
  File "/home/jenkins/agent/workspace/ease.verify.core.target.2019-12/tests/org.eclipse.ease.lang.python.py4j.test/target/work/plugins/py4j-python_0.10.8.1-bnd-2odeag/src/py4j/clientserver.py", line 581, in _call_proxy
    return_value = getattr(self.pool[obj_id], method)(*params)
  File "<...>", line 424, in run
  File "/usr/lib64/python2.7/bdb.py", line 400, in run
    exec cmd in globals, locals
  File "__ref_L/Debug Test/Main.py_gqouwadpaz", line 22, in <module>
  File "__ref_L/Debug Test/Main.py_gqouwadpaz", line 22, in <module>
  File "<...>", line 231, in trace_dispatch
  File "/usr/lib64/python2.7/bdb.py", line 49, in trace_dispatch
    return self.dispatch_line(frame)
  File "/usr/lib64/python2.7/bdb.py", line 67, in dispatch_line
    self.user_line(frame)
  File "<...>", line 241, in user_line
  File "<...>", line 296, in dispatch
  File "/home/jenkins/agent/workspace/ease.verify.core.target.2019-12/tests/org.eclipse.ease.lang.python.py4j.test/target/work/plugins/py4j-python_0.10.8.1-bnd-2odeag/src/py4j/java_gateway.py", line 1286, in __call__
    answer, self.gateway_client, self.target_id, self.name)
  File "/home/jenkins/agent/workspace/ease.verify.core.target.2019-12/tests/org.eclipse.ease.lang.python.py4j.test/target/work/plugins/py4j-python_0.10.8.1-bnd-2odeag/src/py4j/protocol.py", line 328, in get_return_value
    format(target_id, ".", name), value)
Py4JJavaError: An error occurred while calling o0.traceDispatch.
: org.eclipse.ease.ExitException: 
	at org.eclipse.ease.debugging.AbstractEaseDebugger.handleEventsInSuspendedState(AbstractEaseDebugger.java:329)
	at org.eclipse.ease.debugging.AbstractEaseDebugger.suspend(AbstractEaseDebugger.java:255)
	at org.eclipse.ease.lang.python.py4j.internal.Py4jDebugger.suspend(Py4jDebugger.java:87)
	at org.eclipse.ease.debugging.AbstractEaseDebugger.processLine(AbstractEaseDebugger.java:510)
	at org.eclipse.ease.lang.python.debugger.PythonDebugger.traceDispatch(PythonDebugger.java:178)
	at sun.reflect.GeneratedMethodAccessor14.invoke(Unknown Source)
	at sun.reflect.DelegatingMethodAccessorImpl.invoke(DelegatingMethodAccessorImpl.java:43)
	at java.lang.reflect.Method.invoke(Method.java:498)
	at py4j.reflection.MethodInvoker.invoke(MethodInvoker.java:244)
	at py4j.reflection.ReflectionEngine.invoke(ReflectionEngine.java:357)
	at py4j.Gateway.invoke(Gateway.java:282)
	at py4j.commands.AbstractCommand.invokeMethod(AbstractCommand.java:132)
	at py4j.commands.CallCommand.execute(CallCommand.java:79)
	at py4j.ClientServerConnection.sendCommand(ClientServerConnection.java:244)
	at py4j.CallbackClient.sendCommand(CallbackClient.java:384)
	at py4j.CallbackClient.sendCommand(CallbackClient.java:356)
	at py4j.reflection.PythonProxyHandler.invoke(PythonProxyHandler.java:106)
	at com.sun.proxy.$Proxy13.run(Unknown Source)
	at org.eclipse.ease.lang.python.py4j.internal.Py4jDebugger.execute(Py4jDebugger.java:106)
	at org.eclipse.ease.lang.python.py4j.internal.Py4jDebuggerEngine.internalExecute(Py4jDebuggerEngine.java:85)
	at org.eclipse.ease.lang.python.py4j.internal.Py4jScriptEngine.execute(Py4jScriptEngine.java:226)
	at org.eclipse.ease.AbstractScriptEngine.inject(AbstractScriptEngine.java:226)
	at org.eclipse.ease.AbstractScriptEngine.run(AbstractScriptEngine.java:277)
	at org.eclipse.core.internal.jobs.Worker.run(Worker.java:63)


	at py4j.Protocol.getReturnValue(Protocol.java:476)
	at py4j.reflection.PythonProxyHandler.invoke(PythonProxyHandler.java:108)
	at com.sun.proxy.$Proxy13.run(Unknown Source)
	at org.eclipse.ease.lang.python.py4j.internal.Py4jDebugger.execute(Py4jDebugger.java:106)
	at org.eclipse.ease.lang.python.py4j.internal.Py4jDebuggerEngine.internalExecute(Py4jDebuggerEngine.java:85)
	at org.eclipse.ease.lang.python.py4j.internal.Py4jScriptEngine.execute(Py4jScriptEngine.java:226)
	at org.eclipse.ease.AbstractScriptEngine.inject(AbstractScriptEngine.java:226)
	at org.eclipse.ease.AbstractScriptEngine.run(AbstractScriptEngine.java:277)
	at org.eclipse.core.internal.jobs.Worker.run(Worker.java:63)
07:36:25 [2020-06-13T11:36:25.212Z] Cancelling nested steps due to timeout
Sending interrupt signal to process
[INFO] ------------------------------------------------------------------------
[INFO] Reactor Summary for org.eclipse.ease.releng 0.8.0-SNAPSHOT:
[INFO] 
[INFO] org.eclipse.ease.releng ............................ SUCCESS [  0.006 s]
[INFO] org.eclipse.ease.releng.target ..................... SUCCESS [  0.407 s]
[INFO] org.eclipse.ease.test .............................. SUCCESS [ 11.209 s]
[INFO] org.eclipse.ease.lang.javascript.nashorn.test ...... SUCCESS [  6.120 s]
[INFO] org.eclipse.ease.lang.javascript.rhino.test ........ SUCCESS [ 18.218 s]
[INFO] org.eclipse.ease.lang.javascript.test .............. SUCCESS [  4.974 s]
[INFO] org.eclipse.ease.lang.python.test .................. SUCCESS [  4.273 s]
[INFO] org.eclipse.ease.lang.python.jython.test ........... SUCCESS [ 23.234 s]
[INFO] org.eclipse.ease.lang.python.py4j.test ............. FAILURE [48:14 min]
[INFO] org.eclipse.ease.lang.scriptarchive.test ........... SKIPPED
[INFO] org.eclipse.ease.ui.test ........................... SKIPPED
[INFO] ------------------------------------------------------------------------
[INFO] BUILD FAILURE
[INFO] ------------------------------------------------------------------------
[INFO] Total time:  50:40 min
[INFO] Finished at: 2020-06-13T11:36:26Z
[INFO] ------------------------------------------------------------------------
[WARNING] [jenkins-event-spy] Unexpected Maven project file name 'target-tests-pom.xml', problems may occur
[INFO] [jenkins-event-spy] Generated /home/jenkins/agent/workspace/ease.verify.core.target.2019-12@tmp/withMaven4ab1285b/maven-spy-20200613-104545-7227073246512556885768.log
[ERROR] Failed to execute goal org.eclipse.tycho:tycho-surefire-plugin:1.3.0:test (default-test) on project org.eclipse.ease.lang.python.py4j.test: An unexpected error occured while launching the test runtime (return code 143). See log /home/jenkins/agent/workspace/ease.verify.core.target.2019-12/tests/org.eclipse.easescript returned exit code 143
[Pipeline] }
[withMaven] Publishers: Pipeline Graph Publisher: 2 ms
[Pipeline] // withMaven
[Pipeline] }
[Pipeline] // stage
[Pipeline] }
[Pipeline] // timeout
[Pipeline] }
[Pipeline] // timestamps
[Pipeline] }
[Pipeline] // node
[Pipeline] End of Pipeline
Timeout has been exceeded
Finished: ABORTED