FailedConsole Output

Skipping 758 KB.. Full Log
GvvmZ+X75ZekLlOVfvTjc8FPJgaGiiIGKaiG5Py84vycVD1nCA1SyAABjCCFBQCV27OjYAAAAA==[INFO] --- tycho-surefire-plugin:1.5.0:test (default-test) @ org.eclipse.ease.lang.python.test ---
06:43:28 [2020-09-26T10:43:28.489Z] [INFO] Expected eclipse log file: /home/jenkins/agent/workspace/ease.verify.core.target.2019-12/tests/org.eclipse.ease.lang.python.test/target/work/data/.metadata/.log
06:43:28 [2020-09-26T10:43:28.489Z] [INFO] Command line:
06:43:28 [2020-09-26T10:43:28.489Z] 	[/opt/tools/java/openjdk/jdk-11/11.0.2+9/bin/java, -Dosgi.noShutdown=false, -Dosgi.os=linux, -Dosgi.ws=gtk, -Dosgi.arch=x86_64, -Dosgi.clean=true, -jar, /home/jenkins/.m2/repository/p2/osgi/bundle/org.eclipse.equinox.launcher/1.5.800.v20200727-1323/org.eclipse.equinox.launcher-1.5.800.v20200727-1323.jar, -data, /home/jenkins/agent/workspace/ease.verify.core.target.2019-12/tests/org.eclipse.ease.lang.python.test/target/work/data, -install, /home/jenkins/agent/workspace/ease.verify.core.target.2019-12/tests/org.eclipse.ease.lang.python.test/target/work, -configuration, /home/jenkins/agent/workspace/ease.verify.core.target.2019-12/tests/org.eclipse.ease.lang.python.test/target/work/configuration, -application, org.eclipse.tycho.surefire.osgibooter.headlesstest, -testproperties, /home/jenkins/agent/workspace/ease.verify.core.target.2019-12/tests/org.eclipse.ease.lang.python.test/target/surefire.properties]
06:43:28 [2020-09-26T10:43:28.489Z] Picked up JAVA_TOOL_OPTIONS: -Dmaven.ext.class.path="/home/jenkins/agent/workspace/ease.verify.core.target.2019-12@tmp/withMaven3ef2ca9c/pipeline-maven-spy.jar" -Dorg.jenkinsci.plugins.pipeline.maven.reportsFolder="/home/jenkins/agent/workspace/ease.verify.core.target.2019-12@tmp/withMaven3ef2ca9c" 
06:43:29 [2020-09-26T10:43:29.889Z] Running org.eclipse.ease.lang.python.PythonCodeFactoryTest
06:43:30 [2020-09-26T10:43:30.145Z] Tests run: 1, Failures: 0, Errors: 0, Skipped: 0, Time elapsed: 0.084 s - in org.eclipse.ease.lang.python.PythonCodeFactoryTest
06:43:30 [2020-09-26T10:43:30.145Z] testCommentCreator(org.eclipse.ease.lang.python.PythonCodeFactoryTest)  Time elapsed: 0.003 s
06:43:30 [2020-09-26T10:43:30.145Z] 
06:43:30 [2020-09-26T10:43:30.145Z] Results:
06:43:30 [2020-09-26T10:43:30.145Z] 
06:43:30 [2020-09-26T10:43:30.145Z] Tests run: 1, Failures: 0, Errors: 0, Skipped: 0
06:43:30 [2020-09-26T10:43:30.145Z] 
06:43:30 [2020-09-26T10:43:30.706Z] [INFO] All tests passed!
06:43:30 [2020-09-26T10:43:30.706Z] [INFO] 
06:43:30 [2020-09-26T10:43:30.706Z] [INFO] --- maven-install-plugin:2.3.1:install (default-install) @ org.eclipse.ease.lang.python.test ---
06:43:30 [2020-09-26T10:43:30.706Z] [INFO] Installing /home/jenkins/agent/workspace/ease.verify.core.target.2019-12/tests/org.eclipse.ease.lang.python.test/target/org.eclipse.ease.lang.python.test-0.8.0-SNAPSHOT.jar to /home/jenkins/.m2/repository/org/eclipse/ease/org.eclipse.ease.lang.python.test/0.8.0-SNAPSHOT/org.eclipse.ease.lang.python.test-0.8.0-SNAPSHOT.jar
06:43:30 [2020-09-26T10:43:30.706Z] [INFO] Installing /home/jenkins/agent/workspace/ease.verify.core.target.2019-12/tests/org.eclipse.ease.lang.python.test/pom.xml to /home/jenkins/.m2/repository/org/eclipse/ease/org.eclipse.ease.lang.python.test/0.8.0-SNAPSHOT/org.eclipse.ease.lang.python.test-0.8.0-SNAPSHOT.pom
06:43:30 [2020-09-26T10:43:30.706Z] [INFO] Installing /home/jenkins/agent/workspace/ease.verify.core.target.2019-12/tests/org.eclipse.ease.lang.python.test/target/org.eclipse.ease.lang.python.test-0.8.0-SNAPSHOT-sources.jar to /home/jenkins/.m2/repository/org/eclipse/ease/org.eclipse.ease.lang.python.test/0.8.0-SNAPSHOT/org.eclipse.ease.lang.python.test-0.8.0-SNAPSHOT-sources.jar
06:43:30 [2020-09-26T10:43:30.706Z] [INFO] Installing /home/jenkins/agent/workspace/ease.verify.core.target.2019-12/tests/org.eclipse.ease.lang.python.test/target/p2content.xml to /home/jenkins/.m2/repository/org/eclipse/ease/org.eclipse.ease.lang.python.test/0.8.0-SNAPSHOT/org.eclipse.ease.lang.python.test-0.8.0-SNAPSHOT-p2metadata.xml
06:43:30 [2020-09-26T10:43:30.706Z] [INFO] Installing /home/jenkins/agent/workspace/ease.verify.core.target.2019-12/tests/org.eclipse.ease.lang.python.test/target/p2artifacts.xml to /home/jenkins/.m2/repository/org/eclipse/ease/org.eclipse.ease.lang.python.test/0.8.0-SNAPSHOT/org.eclipse.ease.lang.python.test-0.8.0-SNAPSHOT-p2artifacts.xml
06:43:30 [2020-09-26T10:43:30.706Z] [INFO] Installing /home/jenkins/agent/workspace/ease.verify.core.target.2019-12/tests/org.eclipse.ease.lang.python.test/target/p2content.xml to /home/jenkins/.m2/repository/org/eclipse/ease/org.eclipse.ease.lang.python.test/0.8.0-SNAPSHOT/org.eclipse.ease.lang.python.test-0.8.0-SNAPSHOT-p2metadata.xml
06:43:30 [2020-09-26T10:43:30.706Z] [INFO] Installing /home/jenkins/agent/workspace/ease.verify.core.target.2019-12/tests/org.eclipse.ease.lang.python.test/target/p2artifacts.xml to /home/jenkins/.m2/repository/org/eclipse/ease/org.eclipse.ease.lang.python.test/0.8.0-SNAPSHOT/org.eclipse.ease.lang.python.test-0.8.0-SNAPSHOT-p2artifacts.xml
06:43:30 [2020-09-26T10:43:30.706Z] [INFO] 
06:43:30 [2020-09-26T10:43:30.706Z] [INFO] --- tycho-p2-plugin:1.5.0:update-local-index (default-update-local-index) @ org.eclipse.ease.lang.python.test ---
06:43:30 [2020-09-26T10:43:30.706Z] [INFO] 
06:43:30 [2020-09-26T10:43:30.706Z] [INFO] -----< org.eclipse.ease:org.eclipse.ease.lang.python.jython.test >------
06:43:30 [2020-09-26T10:43:30.707Z] [INFO] Building org.eclipse.ease.lang.python.jython.test 0.8.0-SNAPSHOT [43/48]
06:43:30 [2020-09-26T10:43:30.707Z] [INFO] ------------------------[ eclipse-test-plugin ]-------------------------
06:43:30 [2020-09-26T10:43:30.707Z] [INFO] 
06:43:30 [2020-09-26T10:43:30.707Z] [INFO] --- maven-clean-plugin:2.5:clean (default-clean) @ org.eclipse.ease.lang.python.jython.test ---
06:43:30 [2020-09-26T10:43:30.707Z] [INFO] 
06:43:30 [2020-09-26T10:43:30.707Z] [INFO] --- tycho-packaging-plugin:1.5.0:build-qualifier (default-build-qualifier) @ org.eclipse.ease.lang.python.jython.test ---
06:43:30 [2020-09-26T10:43:30.707Z] [INFO] The project's OSGi version is 0.8.0.I201911291239
06:43:30 [2020-09-26T10:43:30.707Z] [INFO] 
06:43:30 [2020-09-26T10:43:30.707Z] [INFO] --- tycho-packaging-plugin:1.5.0:validate-id (default-validate-id) @ org.eclipse.ease.lang.python.jython.test ---
06:43:30 [2020-09-26T10:43:30.707Z] [INFO] 
06:43:30 [2020-09-26T10:43:30.707Z] [INFO] --- tycho-packaging-plugin:1.5.0:validate-version (default-validate-version) @ org.eclipse.ease.lang.python.jython.test ---
06:43:30 [2020-09-26T10:43:30.707Z] [INFO] 
06:43:30 [2020-09-26T10:43:30.707Z] [INFO] >>> maven-javadoc-plugin:2.9.1:javadoc (build-docs) > generate-sources @ org.eclipse.ease.lang.python.jython.test >>>
06:43:30 [2020-09-26T10:43:30.707Z] [INFO] 
06:43:30 [2020-09-26T10:43:30.707Z] [INFO] --- tycho-packaging-plugin:1.5.0:build-qualifier (default-build-qualifier) @ org.eclipse.ease.lang.python.jython.test ---
06:43:30 [2020-09-26T10:43:30.707Z] [INFO] The project's OSGi version is 0.8.0.I201911291239
06:43:30 [2020-09-26T10:43:30.707Z] [INFO] 
06:43:30 [2020-09-26T10:43:30.707Z] [INFO] --- tycho-packaging-plugin:1.5.0:validate-id (default-validate-id) @ org.eclipse.ease.lang.python.jython.test ---
06:43:30 [2020-09-26T10:43:30.707Z] [INFO] 
06:43:30 [2020-09-26T10:43:30.707Z] [INFO] --- tycho-packaging-plugin:1.5.0:validate-version (default-validate-version) @ org.eclipse.ease.lang.python.jython.test ---
06:43:30 [2020-09-26T10:43:30.707Z] [INFO] 
06:43:30 [2020-09-26T10:43:30.707Z] [INFO] <<< maven-javadoc-plugin:2.9.1:javadoc (build-docs) < generate-sources @ org.eclipse.ease.lang.python.jython.test <<<
06:43:30 [2020-09-26T10:43:30.707Z] [INFO] 
06:43:30 [2020-09-26T10:43:30.707Z] [INFO] 
06:43:30 [2020-09-26T10:43:30.707Z] [INFO] --- maven-javadoc-plugin:2.9.1:javadoc (build-docs) @ org.eclipse.ease.lang.python.jython.test ---
06:43:30 [2020-09-26T10:43:30.962Z] [ERROR] Error fetching link: http://help.eclipse.org/oxygen/topic/org.eclipse.platform.doc.isv/reference/api/package-list. Ignored it.
06:43:30 [2020-09-26T10:43:30.962Z] [ERROR] Error fetching link: https://ci.eclipse.org/ease/job/ease.build.core/JavaDoc/package-list. Ignored it.
06:43:31 [2020-09-26T10:43:31.889Z] [INFO] 
06:43:31 [2020-09-26T10:43:31.889Z] Loading source files for package org.eclipse.ease.lang.python.jython.debugger...
06:43:31 [2020-09-26T10:43:31.889Z] Constructing Javadoc information...
06:43:31 [2020-09-26T10:43:31.889Z] WARNING: Cannot open location "/home/jenkins/agent/workspace/ease.verify.core.target.2019-12/tests/org.eclipse.ease.lang.python.jython.test/target/javadoc-bundle-options/package-list"
06:43:31 [2020-09-26T10:43:31.889Z] No plugin definition found, skipping
06:43:31 [2020-09-26T10:43:31.889Z] No plugin definition found, skipping
06:43:31 [2020-09-26T10:43:31.889Z] [WARNING] Javadoc Warnings
06:43:31 [2020-09-26T10:43:31.889Z] [WARNING] Picked up JAVA_TOOL_OPTIONS: -Dmaven.ext.class.path="/home/jenkins/agent/workspace/ease.verify.core.target.2019-12@tmp/withMaven3ef2ca9c/pipeline-maven-spy.jar" -Dorg.jenkinsci.plugins.pipeline.maven.reportsFolder="/home/jenkins/agent/workspace/ease.verify.core.target.2019-12@tmp/withMaven3ef2ca9c"
06:43:31 [2020-09-26T10:43:31.889Z] [WARNING] javadoc: warning - The old Doclet and Taglet APIs in the packages
06:43:31 [2020-09-26T10:43:31.889Z] [WARNING] com.sun.javadoc, com.sun.tools.doclets and their implementations
06:43:31 [2020-09-26T10:43:31.889Z] [WARNING] are planned to be removed in a future JDK release. These
06:43:31 [2020-09-26T10:43:31.889Z] [WARNING] components have been superseded by the new APIs in jdk.javadoc.doclet.
06:43:31 [2020-09-26T10:43:31.889Z] [WARNING] Users are strongly recommended to migrate to the new APIs.
06:43:31 [2020-09-26T10:43:31.889Z] [INFO] 
06:43:31 [2020-09-26T10:43:31.889Z] [INFO] --- build-helper-maven-plugin:1.9.1:add-resource (add_help) @ org.eclipse.ease.lang.python.jython.test ---
06:43:31 [2020-09-26T10:43:31.889Z] [INFO] 
06:43:31 [2020-09-26T10:43:31.889Z] [INFO] --- maven-resources-plugin:2.4.3:resources (default-resources) @ org.eclipse.ease.lang.python.jython.test ---
06:43:31 [2020-09-26T10:43:31.889Z] [INFO] Using 'UTF-8' encoding to copy filtered resources.
06:43:31 [2020-09-26T10:43:31.889Z] [INFO] skip non existing resourceDirectory /home/jenkins/agent/workspace/ease.verify.core.target.2019-12/tests/org.eclipse.ease.lang.python.jython.test/src/main/resources
06:43:31 [2020-09-26T10:43:31.889Z] [INFO] skip non existing resourceDirectory /home/jenkins/agent/workspace/ease.verify.core.target.2019-12/tests/org.eclipse.ease.lang.python.jython.test/help
06:43:31 [2020-09-26T10:43:31.889Z] [INFO] 
06:43:31 [2020-09-26T10:43:31.889Z] [INFO] --- tycho-compiler-plugin:1.5.0:compile (default-compile) @ org.eclipse.ease.lang.python.jython.test ---
06:43:31 [2020-09-26T10:43:31.889Z] [INFO] Compiling 1 source file to /home/jenkins/agent/workspace/ease.verify.core.target.2019-12/tests/org.eclipse.ease.lang.python.jython.test/target/classes
06:43:31 [2020-09-26T10:43:31.889Z] [INFO] 
06:43:31 [2020-09-26T10:43:31.889Z] [INFO] --- maven-resources-plugin:2.4.3:testResources (default-testResources) @ org.eclipse.ease.lang.python.jython.test ---
06:43:31 [2020-09-26T10:43:31.889Z] [INFO] Using 'UTF-8' encoding to copy filtered resources.
06:43:31 [2020-09-26T10:43:31.889Z] [INFO] skip non existing resourceDirectory /home/jenkins/agent/workspace/ease.verify.core.target.2019-12/tests/org.eclipse.ease.lang.python.jython.test/src/test/resources
06:43:31 [2020-09-26T10:43:31.889Z] [INFO] 
06:43:31 [2020-09-26T10:43:31.889Z] [INFO] --- tycho-source-plugin:1.5.0:plugin-source (plugin-source) @ org.eclipse.ease.lang.python.jython.test ---
06:43:31 [2020-09-26T10:43:31.889Z] [WARNING] Bundle-Vendor header not found in /home/jenkins/agent/workspace/ease.verify.core.target.2019-12/tests/org.eclipse.ease.lang.python.jython.test/META-INF/MANIFEST.MF, fallback to 'unknown' for source bundle
06:43:31 [2020-09-26T10:43:31.889Z] [INFO] Building jar: /home/jenkins/agent/workspace/ease.verify.core.target.2019-12/tests/org.eclipse.ease.lang.python.jython.test/target/org.eclipse.ease.lang.python.jython.test-0.8.0-SNAPSHOT-sources.jar
06:43:31 [2020-09-26T10:43:31.889Z] [INFO] 
06:43:31 [2020-09-26T10:43:31.889Z] [INFO] --- target-platform-configuration:1.5.0:target-platform (default-target-platform) @ org.eclipse.ease.lang.python.jython.test ---
06:43:31 [2020-09-26T10:43:31.889Z] [INFO] 
06:43:31 [2020-09-26T10:43:31.889Z] [INFO] --- tycho-packaging-plugin:1.5.0:package-plugin (default-package-plugin) @ org.eclipse.ease.lang.python.jython.test ---
06:43:31 [2020-09-26T10:43:31.889Z] [INFO] Building jar: /home/jenkins/agent/workspace/ease.verify.core.target.2019-12/tests/org.eclipse.ease.lang.python.jython.test/target/org.eclipse.ease.lang.python.jython.test-0.8.0-SNAPSHOT.jar
06:43:31 [2020-09-26T10:43:31.889Z] [INFO] 
06:43:31 [2020-09-26T10:43:31.889Z] [INFO] --- tycho-p2-plugin:1.5.0:p2-metadata-default (default-p2-metadata-default) @ org.eclipse.ease.lang.python.jython.test ---
06:43:31 [2020-09-26T10:43:31.889Z] [INFO] 
06:43:31 [2020-09-26T10:43:31.889Z] [INFO] --- tycho-source-feature-plugin:1.5.0:source-feature (source-feature) @ org.eclipse.ease.lang.python.jython.test ---
06:43:31 [2020-09-26T10:43:31.889Z] [INFO] 
06:43:31 [2020-09-26T10:43:31.889Z] [INFO] --- tycho-p2-plugin:1.5.0:p2-metadata (attached-p2-metadata) @ org.eclipse.ease.lang.python.jython.test ---
06:43:31 [2020-09-26T10:43:31.890Z] [INFO] 
06:43:31 [2020-09-26T10:43:31.890Z] [INFO] --- tycho-surefire-plugin:1.5.0:test (default-test) @ org.eclipse.ease.lang.python.jython.test ---
06:43:32 [2020-09-26T10:43:32.493Z] [INFO] Expected eclipse log file: /home/jenkins/agent/workspace/ease.verify.core.target.2019-12/tests/org.eclipse.ease.lang.python.jython.test/target/work/data/.metadata/.log
06:43:32 [2020-09-26T10:43:32.493Z] [INFO] Command line:
06:43:32 [2020-09-26T10:43:32.493Z] 	[/opt/tools/java/openjdk/jdk-11/11.0.2+9/bin/java, -Dosgi.noShutdown=false, -Dosgi.os=linux, -Dosgi.ws=gtk, -Dosgi.arch=x86_64, -Dosgi.clean=true, -jar, /home/jenkins/.m2/repository/p2/osgi/bundle/org.eclipse.equinox.launcher/1.5.800.v20200727-1323/org.eclipse.equinox.launcher-1.5.800.v20200727-1323.jar, -data, /home/jenkins/agent/workspace/ease.verify.core.target.2019-12/tests/org.eclipse.ease.lang.python.jython.test/target/work/data, -install, /home/jenkins/agent/workspace/ease.verify.core.target.2019-12/tests/org.eclipse.ease.lang.python.jython.test/target/work, -configuration, /home/jenkins/agent/workspace/ease.verify.core.target.2019-12/tests/org.eclipse.ease.lang.python.jython.test/target/work/configuration, -application, org.eclipse.tycho.surefire.osgibooter.headlesstest, -testproperties, /home/jenkins/agent/workspace/ease.verify.core.target.2019-12/tests/org.eclipse.ease.lang.python.jython.test/target/surefire.properties]
06:43:32 [2020-09-26T10:43:32.493Z] Picked up JAVA_TOOL_OPTIONS: -Dmaven.ext.class.path="/home/jenkins/agent/workspace/ease.verify.core.target.2019-12@tmp/withMaven3ef2ca9c/pipeline-maven-spy.jar" -Dorg.jenkinsci.plugins.pipeline.maven.reportsFolder="/home/jenkins/agent/workspace/ease.verify.core.target.2019-12@tmp/withMaven3ef2ca9c" 
06:43:34 [2020-09-26T10:43:34.414Z] WARNING: An illegal reflective access operation has occurred
06:43:34 [2020-09-26T10:43:34.414Z] WARNING: Illegal reflective access by org.python.core.PySystemState (file:/home/jenkins/agent/workspace/ease.verify.core.target.2019-12/tests/org.eclipse.ease.lang.python.jython.test/target/work/plugins/org.jython_2.7.0.I201609090924/jython.jar) to method java.io.Console.encoding()
06:43:34 [2020-09-26T10:43:34.414Z] WARNING: Please consider reporting this to the maintainers of org.python.core.PySystemState
06:43:34 [2020-09-26T10:43:34.414Z] WARNING: Use --illegal-access=warn to enable warnings of further illegal reflective access operations
06:43:34 [2020-09-26T10:43:34.414Z] WARNING: All illegal access operations will be denied in a future release
06:43:34 [2020-09-26T10:43:34.414Z] Running org.eclipse.ease.lang.python.jython.debugger.JythonDebugTest
06:43:36 [2020-09-26T10:43:36.316Z] Start of script
06:43:36 [2020-09-26T10:43:36.316Z] include file start
06:43:36 [2020-09-26T10:43:36.316Z] include file processed
06:43:36 [2020-09-26T10:43:36.316Z] Result of testMethod = 5
06:43:36 [2020-09-26T10:43:36.316Z] End of script
06:43:36 [2020-09-26T10:43:36.316Z] Start of script
06:43:36 [2020-09-26T10:43:36.316Z] include file start
06:43:36 [2020-09-26T10:43:36.316Z] include file processed
06:43:36 [2020-09-26T10:43:36.316Z] Result of testMethod = 5
06:43:36 [2020-09-26T10:43:36.316Z] End of script
06:43:36 [2020-09-26T10:43:36.316Z] Start of script
06:43:36 [2020-09-26T10:43:36.316Z] include file start
06:43:36 [2020-09-26T10:43:36.316Z] include file processed
06:43:36 [2020-09-26T10:43:36.316Z] Result of testMethod = 5
06:43:36 [2020-09-26T10:43:36.572Z] Traceback (most recent call last):
06:43:36 [2020-09-26T10:43:36.572Z]   File "(none)", line 184, in run
06:43:36 [2020-09-26T10:43:36.572Z]   File "__ref_L/Debug Test/Main.py_ppiekpuaeb", line 23, in <module>
06:43:36 [2020-09-26T10:43:36.572Z]   File "(none)", line 161, in trace_dispatch
06:43:36 [2020-09-26T10:43:36.572Z] org.eclipse.ease.ExitException: 
06:43:36 [2020-09-26T10:43:36.572Z] 
06:43:36 [2020-09-26T10:43:36.572Z] org.eclipse.ease.ExitException: org.eclipse.ease.ExitException: 
06:43:36 [2020-09-26T10:43:36.572Z] Start of script
06:43:36 [2020-09-26T10:43:36.572Z] include file start
06:43:36 [2020-09-26T10:43:36.572Z] include file processed
06:43:36 [2020-09-26T10:43:36.829Z] Result of testMethod = 5
06:43:36 [2020-09-26T10:43:36.829Z] End of script
06:43:37 [2020-09-26T10:43:37.085Z] Start of script
06:43:37 [2020-09-26T10:43:37.085Z] include file start
06:43:37 [2020-09-26T10:43:37.085Z] include file processed
06:43:37 [2020-09-26T10:43:37.085Z] Result of testMethod = 5
06:43:37 [2020-09-26T10:43:37.085Z] End of script
06:43:37 [2020-09-26T10:43:37.341Z] Start of script
06:43:37 [2020-09-26T10:43:37.341Z] include file start
06:43:37 [2020-09-26T10:43:37.341Z] include file processed
06:43:37 [2020-09-26T10:43:37.341Z] Result of testMethod = 5
06:43:37 [2020-09-26T10:43:37.341Z] End of script
06:43:37 [2020-09-26T10:43:37.597Z] Start of script
06:43:37 [2020-09-26T10:43:37.597Z] include file start
06:43:37 [2020-09-26T10:43:37.597Z] include file processed
06:43:37 [2020-09-26T10:43:37.597Z] Result of testMethod = 5
06:43:37 [2020-09-26T10:43:37.597Z] Traceback (most recent call last):
06:43:37 [2020-09-26T10:43:37.597Z]   File "(none)", line 184, in run
06:43:37 [2020-09-26T10:43:37.597Z]   File "__ref_L/Debug Test/Main.py_xkdpsasygy", line 23, in <module>
06:43:37 [2020-09-26T10:43:37.597Z]   File "(none)", line 161, in trace_dispatch
06:43:37 [2020-09-26T10:43:37.597Z] org.eclipse.ease.ExitException: 
06:43:37 [2020-09-26T10:43:37.597Z] 
06:43:37 [2020-09-26T10:43:37.597Z] org.eclipse.ease.ExitException: org.eclipse.ease.ExitException: 
06:43:37 [2020-09-26T10:43:37.854Z] Start of script
06:43:37 [2020-09-26T10:43:37.854Z] include file start
06:43:37 [2020-09-26T10:43:37.854Z] include file processed
06:43:38 [2020-09-26T10:43:38.109Z] Result of testMethod = 5
06:43:38 [2020-09-26T10:43:38.109Z] End of script
06:43:38 [2020-09-26T10:43:38.109Z] Start of script
06:43:38 [2020-09-26T10:43:38.109Z] include file start
06:43:38 [2020-09-26T10:43:38.110Z] include file processed
06:43:38 [2020-09-26T10:43:38.110Z] Result of testMethod = 5
06:43:38 [2020-09-26T10:43:38.110Z] End of script
06:43:38 [2020-09-26T10:43:38.365Z] Start of script
06:43:38 [2020-09-26T10:43:38.365Z] include file start
06:43:38 [2020-09-26T10:43:38.365Z] include file processed
06:43:38 [2020-09-26T10:43:38.621Z] Traceback (most recent call last):
06:43:38 [2020-09-26T10:43:38.621Z]   File "(none)", line 184, in run
06:43:38 [2020-09-26T10:43:38.621Z]   File "__ref_L/Debug Test/Main.py_envwajqiya", line 22, in <module>
06:43:38 [2020-09-26T10:43:38.621Z]   File "(none)", line 161, in trace_dispatch
06:43:38 [2020-09-26T10:43:38.621Z] org.eclipse.ease.ExitException: 
06:43:38 [2020-09-26T10:43:38.621Z] 
06:43:38 [2020-09-26T10:43:38.621Z] org.eclipse.ease.ExitException: org.eclipse.ease.ExitException: 
06:43:38 [2020-09-26T10:43:38.876Z] Start of script
06:43:38 [2020-09-26T10:43:38.876Z] include file start
06:43:38 [2020-09-26T10:43:38.876Z] include file processed
06:43:38 [2020-09-26T10:43:38.876Z] Result of testMethod = 5
06:43:38 [2020-09-26T10:43:38.876Z] End of script
06:43:39 [2020-09-26T10:43:39.132Z] Start of script
06:43:39 [2020-09-26T10:43:39.132Z] include file start
06:43:39 [2020-09-26T10:43:39.132Z] include file processed
06:43:39 [2020-09-26T10:43:39.132Z] Result of testMethod = 5
06:43:39 [2020-09-26T10:43:39.132Z] End of script
06:43:39 [2020-09-26T10:43:39.388Z] Traceback (most recent call last):
06:43:39 [2020-09-26T10:43:39.388Z]   File "(none)", line 184, in run
06:43:39 [2020-09-26T10:43:39.388Z]   File "__ref_L/Debug Test/Main.py_skpdklomsk", line 1, in <module>
06:43:39 [2020-09-26T10:43:39.388Z]   File "(none)", line 161, in trace_dispatch
06:43:39 [2020-09-26T10:43:39.388Z] org.eclipse.ease.ExitException: 
06:43:39 [2020-09-26T10:43:39.388Z] 
06:43:39 [2020-09-26T10:43:39.388Z] org.eclipse.ease.ExitException: org.eclipse.ease.ExitException: 
06:43:39 [2020-09-26T10:43:39.644Z] Start of script
06:43:39 [2020-09-26T10:43:39.644Z] include file start
06:43:39 [2020-09-26T10:43:39.644Z] include file processed
06:43:39 [2020-09-26T10:43:39.644Z] Result of testMethod = 5
06:43:39 [2020-09-26T10:43:39.644Z] End of script
06:43:39 [2020-09-26T10:43:39.899Z] Start of script
06:43:39 [2020-09-26T10:43:39.899Z] include file start
06:43:39 [2020-09-26T10:43:39.899Z] include file processed
06:43:39 [2020-09-26T10:43:39.899Z] Result of testMethod = 5
06:43:39 [2020-09-26T10:43:39.899Z] End of script
06:43:40 [2020-09-26T10:43:40.156Z] Start of script
06:43:40 [2020-09-26T10:43:40.156Z] include file start
06:43:40 [2020-09-26T10:43:40.156Z] include file processed
06:43:40 [2020-09-26T10:43:40.156Z] Result of testMethod = 5
06:43:40 [2020-09-26T10:43:40.413Z] Traceback (most recent call last):
06:43:40 [2020-09-26T10:43:40.413Z]   File "(none)", line 184, in run
06:43:40 [2020-09-26T10:43:40.413Z]   File "__ref_L/Debug Test/Main.py_kytgdvnkde", line 23, in <module>
06:43:40 [2020-09-26T10:43:40.413Z]   File "(none)", line 161, in trace_dispatch
06:43:40 [2020-09-26T10:43:40.413Z] org.eclipse.ease.ExitException: 
06:43:40 [2020-09-26T10:43:40.413Z] 
06:43:40 [2020-09-26T10:43:40.413Z] org.eclipse.ease.ExitException: org.eclipse.ease.ExitException: 
06:43:40 [2020-09-26T10:43:40.413Z] Start of script
06:43:40 [2020-09-26T10:43:40.413Z] include file start
06:43:40 [2020-09-26T10:43:40.413Z] include file processed
06:43:40 [2020-09-26T10:43:40.668Z] Result of testMethod = 5
06:43:40 [2020-09-26T10:43:40.668Z] End of script
06:43:40 [2020-09-26T10:43:40.925Z] Traceback (most recent call last):
06:43:40 [2020-09-26T10:43:40.925Z]   File "(none)", line 184, in run
06:43:40 [2020-09-26T10:43:40.925Z]   File "__ref_L/Debug Test/Main.py_agcpnttrvf", line 1, in <module>
06:43:40 [2020-09-26T10:43:40.925Z]   File "(none)", line 161, in trace_dispatch
06:43:40 [2020-09-26T10:43:40.925Z] org.eclipse.ease.ExitException: 
06:43:40 [2020-09-26T10:43:40.925Z] 
06:43:40 [2020-09-26T10:43:40.925Z] org.eclipse.ease.ExitException: org.eclipse.ease.ExitException: 
06:43:40 [2020-09-26T10:43:40.925Z] Start of script
06:43:40 [2020-09-26T10:43:40.925Z] include file start
06:43:40 [2020-09-26T10:43:40.925Z] include file processed
06:43:40 [2020-09-26T10:43:40.925Z] Result of testMethod = 5
06:43:40 [2020-09-26T10:43:40.925Z] End of script
06:43:41 [2020-09-26T10:43:41.181Z] Start of script
06:43:41 [2020-09-26T10:43:41.181Z] include file start
06:43:41 [2020-09-26T10:43:41.181Z] include file processed
06:43:41 [2020-09-26T10:43:41.440Z] Result of testMethod = 5
06:43:41 [2020-09-26T10:43:41.440Z] End of script
06:43:41 [2020-09-26T10:43:41.440Z] Traceback (most recent call last):
06:43:41 [2020-09-26T10:43:41.440Z]   File "(none)", line 184, in run
06:43:41 [2020-09-26T10:43:41.440Z]   File "__ref_L/Debug Test/Main.py_vtfyfrwcvq", line 1, in <module>
06:43:41 [2020-09-26T10:43:41.440Z]   File "(none)", line 161, in trace_dispatch
06:43:41 [2020-09-26T10:43:41.440Z] org.eclipse.ease.ExitException: 
06:43:41 [2020-09-26T10:43:41.440Z] 
06:43:41 [2020-09-26T10:43:41.440Z] org.eclipse.ease.ExitException: org.eclipse.ease.ExitException: 
06:43:41 [2020-09-26T10:43:41.697Z] Start of script
06:43:41 [2020-09-26T10:43:41.697Z] include file start
06:43:41 [2020-09-26T10:43:41.697Z] include file processed
06:43:41 [2020-09-26T10:43:41.952Z] Result of testMethod = 5
06:43:41 [2020-09-26T10:43:41.952Z] End of script
06:43:41 [2020-09-26T10:43:41.952Z] Start of script
06:43:41 [2020-09-26T10:43:41.952Z] include file start
06:43:41 [2020-09-26T10:43:41.952Z] include file processed
06:43:41 [2020-09-26T10:43:41.952Z] Result of testMethod = 5
06:43:42 [2020-09-26T10:43:42.208Z] Traceback (most recent call last):
06:43:42 [2020-09-26T10:43:42.208Z]   File "(none)", line 184, in run
06:43:42 [2020-09-26T10:43:42.208Z]   File "__ref_L/Debug Test/Main.py_waahjecewy", line 23, in <module>
06:43:42 [2020-09-26T10:43:42.208Z]   File "(none)", line 161, in trace_dispatch
06:43:42 [2020-09-26T10:43:42.208Z] org.eclipse.ease.ExitException: 
06:43:42 [2020-09-26T10:43:42.208Z] 
06:43:42 [2020-09-26T10:43:42.208Z] org.eclipse.ease.ExitException: org.eclipse.ease.ExitException: 
06:43:42 [2020-09-26T10:43:42.463Z] Start of script
06:43:42 [2020-09-26T10:43:42.463Z] include file start
06:43:42 [2020-09-26T10:43:42.463Z] include file processed
06:43:42 [2020-09-26T10:43:42.463Z] Result of testMethod = 5
06:43:42 [2020-09-26T10:43:42.463Z] End of script
06:43:42 [2020-09-26T10:43:42.463Z] Start of script
06:43:42 [2020-09-26T10:43:42.463Z] include file start
06:43:42 [2020-09-26T10:43:42.463Z] include file processed
06:43:42 [2020-09-26T10:43:42.718Z] Result of testMethod = 5
06:43:42 [2020-09-26T10:43:42.718Z] End of script
06:43:42 [2020-09-26T10:43:42.718Z] Start of script
06:43:42 [2020-09-26T10:43:42.718Z] include file start
06:43:42 [2020-09-26T10:43:42.718Z] include file processed
06:43:42 [2020-09-26T10:43:42.718Z] Result of testMethod = 5
06:43:42 [2020-09-26T10:43:42.718Z] End of script
06:43:42 [2020-09-26T10:43:42.975Z] Start of script
06:43:42 [2020-09-26T10:43:42.975Z] include file start
06:43:42 [2020-09-26T10:43:42.975Z] include file processed
06:43:42 [2020-09-26T10:43:42.975Z] Result of testMethod = 5
06:43:42 [2020-09-26T10:43:42.975Z] End of script
06:43:43 [2020-09-26T10:43:43.232Z] Start of script
06:43:43 [2020-09-26T10:43:43.232Z] include file start
06:43:43 [2020-09-26T10:43:43.232Z] include file processed
06:43:43 [2020-09-26T10:43:43.488Z] Traceback (most recent call last):
06:43:43 [2020-09-26T10:43:43.488Z]   File "(none)", line 184, in run
06:43:43 [2020-09-26T10:43:43.489Z]   File "__ref_L/Debug Test/Main.py_fabdghkwxa", line 21, in <module>
06:43:43 [2020-09-26T10:43:43.489Z]   File "__ref_L/Debug Test/Main.py_fabdghkwxa", line 18, in testMethod
06:43:43 [2020-09-26T10:43:43.489Z]   File "(none)", line 161, in trace_dispatch
06:43:43 [2020-09-26T10:43:43.489Z] org.eclipse.ease.ExitException: 
06:43:43 [2020-09-26T10:43:43.489Z] 
06:43:43 [2020-09-26T10:43:43.489Z] org.eclipse.ease.ExitException: org.eclipse.ease.ExitException: 
06:43:43 [2020-09-26T10:43:43.489Z] Start of script
06:43:43 [2020-09-26T10:43:43.744Z] include file start
06:43:43 [2020-09-26T10:43:43.744Z] include file processed
06:43:43 [2020-09-26T10:43:43.744Z] Result of testMethod = 5
06:43:43 [2020-09-26T10:43:43.744Z] End of script
06:43:43 [2020-09-26T10:43:43.744Z] Start of script
06:43:43 [2020-09-26T10:43:43.744Z] include file start
06:43:43 [2020-09-26T10:43:43.744Z] include file processed
06:43:43 [2020-09-26T10:43:43.744Z] Result of testMethod = 5
06:43:44 [2020-09-26T10:43:44.000Z] Traceback (most recent call last):
06:43:44 [2020-09-26T10:43:44.000Z]   File "(none)", line 184, in run
06:43:44 [2020-09-26T10:43:44.000Z]   File "__ref_L/Debug Test/Main.py_vsjdqnrlef", line 23, in <module>
06:43:44 [2020-09-26T10:43:44.000Z]   File "(none)", line 161, in trace_dispatch
06:43:44 [2020-09-26T10:43:44.000Z] org.eclipse.ease.ExitException: 
06:43:44 [2020-09-26T10:43:44.000Z] 
06:43:44 [2020-09-26T10:43:44.000Z] org.eclipse.ease.ExitException: org.eclipse.ease.ExitException: 
06:43:44 [2020-09-26T10:43:44.000Z] Start of script
06:43:44 [2020-09-26T10:43:44.000Z] include file start
06:43:44 [2020-09-26T10:43:44.000Z] include file processed
06:43:44 [2020-09-26T10:43:44.000Z] Result of testMethod = 5
06:43:44 [2020-09-26T10:43:44.256Z] End of script
06:43:44 [2020-09-26T10:43:44.256Z] Start of script
06:43:44 [2020-09-26T10:43:44.256Z] include file start
06:43:44 [2020-09-26T10:43:44.256Z] include file processed
06:43:44 [2020-09-26T10:43:44.511Z] Result of testMethod = 5
06:43:44 [2020-09-26T10:43:44.511Z] End of script
06:43:44 [2020-09-26T10:43:44.511Z] Start of script
06:43:44 [2020-09-26T10:43:44.511Z] include file start
06:43:44 [2020-09-26T10:43:44.511Z] include file processed
06:43:44 [2020-09-26T10:43:44.767Z] Result of testMethod = 5
06:43:44 [2020-09-26T10:43:44.767Z] End of script
06:43:45 [2020-09-26T10:43:45.023Z] Start of script
06:43:45 [2020-09-26T10:43:45.023Z] include file start
06:43:45 [2020-09-26T10:43:45.023Z] include file processed
06:43:45 [2020-09-26T10:43:45.023Z] Result of testMethod = 5
06:43:45 [2020-09-26T10:43:45.023Z] End of script
06:43:45 [2020-09-26T10:43:45.023Z] Start of script
06:43:45 [2020-09-26T10:43:45.023Z] include file start
06:43:45 [2020-09-26T10:43:45.023Z] include file processed
06:43:45 [2020-09-26T10:43:45.023Z] Result of testMethod = 5
06:43:45 [2020-09-26T10:43:45.280Z] Traceback (most recent call last):
06:43:45 [2020-09-26T10:43:45.280Z]   File "(none)", line 184, in run
06:43:45 [2020-09-26T10:43:45.280Z]   File "__ref_L/Debug Test/Main.py_dabtwbkeas", line 23, in <module>
06:43:45 [2020-09-26T10:43:45.280Z]   File "(none)", line 161, in trace_dispatch
06:43:45 [2020-09-26T10:43:45.280Z] org.eclipse.ease.ExitException: 
06:43:45 [2020-09-26T10:43:45.280Z] 
06:43:45 [2020-09-26T10:43:45.280Z] org.eclipse.ease.ExitException: org.eclipse.ease.ExitException: 
06:43:45 [2020-09-26T10:43:45.536Z] Start of script
06:43:45 [2020-09-26T10:43:45.536Z] include file start
06:43:45 [2020-09-26T10:43:45.536Z] include file processed
06:43:45 [2020-09-26T10:43:45.536Z] Result of testMethod = 5
06:43:45 [2020-09-26T10:43:45.536Z] End of script
06:43:45 [2020-09-26T10:43:45.536Z] Start of script
06:43:45 [2020-09-26T10:43:45.536Z] include file start
06:43:45 [2020-09-26T10:43:45.536Z] include file processed
06:43:45 [2020-09-26T10:43:45.536Z] Result of testMethod = 5
06:43:45 [2020-09-26T10:43:45.793Z] Traceback (most recent call last):
06:43:45 [2020-09-26T10:43:45.793Z]   File "(none)", line 184, in run
06:43:45 [2020-09-26T10:43:45.793Z]   File "__ref_L/Debug Test/Main.py_tahopbagly", line 23, in <module>
06:43:45 [2020-09-26T10:43:45.793Z]   File "(none)", line 161, in trace_dispatch
06:43:45 [2020-09-26T10:43:45.793Z] org.eclipse.ease.ExitException: 
06:43:45 [2020-09-26T10:43:45.793Z] 
06:43:45 [2020-09-26T10:43:45.793Z] org.eclipse.ease.ExitException: org.eclipse.ease.ExitException: 
06:43:46 [2020-09-26T10:43:46.059Z] Traceback (most recent call last):
06:43:46 [2020-09-26T10:43:46.059Z]   File "(none)", line 184, in run
06:43:46 [2020-09-26T10:43:46.059Z]   File "__ref_L/Debug Test/Main.py_abdoggkfnb", line 1, in <module>
06:43:46 [2020-09-26T10:43:46.059Z]   File "(none)", line 161, in trace_dispatch
06:43:46 [2020-09-26T10:43:46.059Z] org.eclipse.ease.ExitException: 
06:43:46 [2020-09-26T10:43:46.059Z] 
06:43:46 [2020-09-26T10:43:46.059Z] org.eclipse.ease.ExitException: org.eclipse.ease.ExitException: 
06:43:46 [2020-09-26T10:43:46.314Z] Start of script
06:43:46 [2020-09-26T10:43:46.314Z] include file start
06:43:46 [2020-09-26T10:43:46.314Z] include file processed
06:43:46 [2020-09-26T10:43:46.314Z] Result of testMethod = 5
06:43:46 [2020-09-26T10:43:46.314Z] End of script
06:43:46 [2020-09-26T10:43:46.314Z] Start of script
06:43:46 [2020-09-26T10:43:46.314Z] include file start
06:43:46 [2020-09-26T10:43:46.314Z] include file processed
06:43:46 [2020-09-26T10:43:46.570Z] Result of testMethod = 5
06:43:46 [2020-09-26T10:43:46.570Z] End of script
06:43:46 [2020-09-26T10:43:46.570Z] Start of script
06:43:46 [2020-09-26T10:43:46.570Z] include file start
06:43:46 [2020-09-26T10:43:46.570Z] include file processed
06:43:46 [2020-09-26T10:43:46.570Z] Result of testMethod = 5
06:43:46 [2020-09-26T10:43:46.826Z] End of script
06:43:46 [2020-09-26T10:43:46.826Z] Tests run: 42, Failures: 0, Errors: 0, Skipped: 0, Time elapsed: 12.403 s - in org.eclipse.ease.lang.python.jython.debugger.JythonDebugTest
06:43:46 [2020-09-26T10:43:46.826Z] disconnectProcessInSuspendedState(org.eclipse.ease.lang.python.jython.debugger.JythonDebugTest)  Time elapsed: 1.565 s
06:43:46 [2020-09-26T10:43:46.826Z] stepReturnIncludeCommand(org.eclipse.ease.lang.python.jython.debugger.JythonDebugTest)  Time elapsed: 0.213 s
06:43:46 [2020-09-26T10:43:46.826Z] arrayVariableSorting(org.eclipse.ease.lang.python.jython.debugger.JythonDebugTest)  Time elapsed: 0.31 s
06:43:46 [2020-09-26T10:43:46.826Z] stepOverOnDebugTarget(org.eclipse.ease.lang.python.jython.debugger.JythonDebugTest)  Time elapsed: 0.312 s
06:43:46 [2020-09-26T10:43:46.826Z] hasDebugTarget(org.eclipse.ease.lang.python.jython.debugger.JythonDebugTest)  Time elapsed: 0.107 s
06:43:46 [2020-09-26T10:43:46.826Z] disconnectThreadInSuspendedState(org.eclipse.ease.lang.python.jython.debugger.JythonDebugTest)  Time elapsed: 0.209 s
06:43:46 [2020-09-26T10:43:46.826Z] stepReturnOnDebugTarget(org.eclipse.ease.lang.python.jython.debugger.JythonDebugTest)  Time elapsed: 0.311 s
06:43:46 [2020-09-26T10:43:46.826Z] nullVariable(org.eclipse.ease.lang.python.jython.debugger.JythonDebugTest)  Time elapsed: 0.309 s
06:43:46 [2020-09-26T10:43:46.826Z] stepOverOnStackFrame(org.eclipse.ease.lang.python.jython.debugger.JythonDebugTest)  Time elapsed: 0.309 s
06:43:46 [2020-09-26T10:43:46.826Z] resumeOnDebugTarget(org.eclipse.ease.lang.python.jython.debugger.JythonDebugTest)  Time elapsed: 0.208 s
06:43:46 [2020-09-26T10:43:46.826Z] modifyVariableKeepingType(org.eclipse.ease.lang.python.jython.debugger.JythonDebugTest)  Time elapsed: 0.508 s
06:43:46 [2020-09-26T10:43:46.826Z] resumeOnLastIncludeLine(org.eclipse.ease.lang.python.jython.debugger.JythonDebugTest)  Time elapsed: 0.209 s
06:43:46 [2020-09-26T10:43:46.826Z] stepReturnOnStackFrame(org.eclipse.ease.lang.python.jython.debugger.JythonDebugTest)  Time elapsed: 0.309 s
06:43:46 [2020-09-26T10:43:46.826Z] terminateStackFrameInSuspendedState(org.eclipse.ease.lang.python.jython.debugger.JythonDebugTest)  Time elapsed: 0.208 s
06:43:46 [2020-09-26T10:43:46.826Z] breakpointLocation(org.eclipse.ease.lang.python.jython.debugger.JythonDebugTest)  Time elapsed: 0.208 s
06:43:46 [2020-09-26T10:43:46.826Z] stepReturnOnThread(org.eclipse.ease.lang.python.jython.debugger.JythonDebugTest)  Time elapsed: 0.311 s
06:43:46 [2020-09-26T10:43:46.826Z] javaClassVariable(org.eclipse.ease.lang.python.jython.debugger.JythonDebugTest)  Time elapsed: 0.31 s
06:43:46 [2020-09-26T10:43:46.826Z] stepIntoOnThread(org.eclipse.ease.lang.python.jython.debugger.JythonDebugTest)  Time elapsed: 0.308 s
06:43:46 [2020-09-26T10:43:46.826Z] terminateThreadInSuspendedState(org.eclipse.ease.lang.python.jython.debugger.JythonDebugTest)  Time elapsed: 0.207 s
06:43:46 [2020-09-26T10:43:46.826Z] resumeOnThread(org.eclipse.ease.lang.python.jython.debugger.JythonDebugTest)  Time elapsed: 0.207 s
06:43:46 [2020-09-26T10:43:46.826Z] stepIntoOnStackFrame(org.eclipse.ease.lang.python.jython.debugger.JythonDebugTest)  Time elapsed: 0.307 s
06:43:46 [2020-09-26T10:43:46.826Z] terminateProcessInSuspendedState(org.eclipse.ease.lang.python.jython.debugger.JythonDebugTest)  Time elapsed: 0.207 s
06:43:46 [2020-09-26T10:43:46.826Z] stepOverOnProcess(org.eclipse.ease.lang.python.jython.debugger.JythonDebugTest)  Time elapsed: 0.309 s
06:43:46 [2020-09-26T10:43:46.826Z] nativeArrayVariable(org.eclipse.ease.lang.python.jython.debugger.JythonDebugTest)  Time elapsed: 0.307 s
06:43:46 [2020-09-26T10:43:46.826Z] disconnectDebugTargetInSuspendedState(org.eclipse.ease.lang.python.jython.debugger.JythonDebugTest)  Time elapsed: 0.206 s
06:43:46 [2020-09-26T10:43:46.826Z] stepIntoOnProcess(org.eclipse.ease.lang.python.jython.debugger.JythonDebugTest)  Time elapsed: 0.307 s
06:43:46 [2020-09-26T10:43:46.826Z] terminatedState(org.eclipse.ease.lang.python.jython.debugger.JythonDebugTest)  Time elapsed: 0.105 s
06:43:46 [2020-09-26T10:43:46.826Z] stepOverIncludeCommand(org.eclipse.ease.lang.python.jython.debugger.JythonDebugTest)  Time elapsed: 0.305 s
06:43:46 [2020-09-26T10:43:46.826Z] innerScopeVariableBeforeOuterScopeVariable(org.eclipse.ease.lang.python.jython.debugger.JythonDebugTest)  Time elapsed: 0.305 s
06:43:46 [2020-09-26T10:43:46.826Z] stepIntoIncludeCommand(org.eclipse.ease.lang.python.jython.debugger.JythonDebugTest)  Time elapsed: 0.305 s
06:43:46 [2020-09-26T10:43:46.826Z] primitiveStringVariable(org.eclipse.ease.lang.python.jython.debugger.JythonDebugTest)  Time elapsed: 0.306 s
06:43:46 [2020-09-26T10:43:46.826Z] resumeOnProcess(org.eclipse.ease.lang.python.jython.debugger.JythonDebugTest)  Time elapsed: 0.205 s
06:43:46 [2020-09-26T10:43:46.826Z] stepIntoOnDebugTarget(org.eclipse.ease.lang.python.jython.debugger.JythonDebugTest)  Time elapsed: 0.306 s
06:43:46 [2020-09-26T10:43:46.826Z] stepOverOnThread(org.eclipse.ease.lang.python.jython.debugger.JythonDebugTest)  Time elapsed: 0.306 s
06:43:46 [2020-09-26T10:43:46.826Z] suspendedState(org.eclipse.ease.lang.python.jython.debugger.JythonDebugTest)  Time elapsed: 0.206 s
06:43:46 [2020-09-26T10:43:46.826Z] primitiveDoubleVariable(org.eclipse.ease.lang.python.jython.debugger.JythonDebugTest)  Time elapsed: 0.312 s
06:43:46 [2020-09-26T10:43:46.826Z] resumeOnStackFrame(org.eclipse.ease.lang.python.jython.debugger.JythonDebugTest)  Time elapsed: 0.205 s
06:43:46 [2020-09-26T10:43:46.826Z] nativeObjectVariable(org.eclipse.ease.lang.python.jython.debugger.JythonDebugTest)  Time elapsed: 0.306 s
06:43:46 [2020-09-26T10:43:46.826Z] terminateDebugTargetInSuspendedState(org.eclipse.ease.lang.python.jython.debugger.JythonDebugTest)  Time elapsed: 0.206 s
06:43:46 [2020-09-26T10:43:46.826Z] disconnectStackFrameInSuspendedState(org.eclipse.ease.lang.python.jython.debugger.JythonDebugTest)  Time elapsed: 0.206 s
06:43:46 [2020-09-26T10:43:46.826Z] stepReturnOnProcess(org.eclipse.ease.lang.python.jython.debugger.JythonDebugTest)  Time elapsed: 0.306 s
06:43:46 [2020-09-26T10:43:46.826Z] evaluateWatchExpression(org.eclipse.ease.lang.python.jython.debugger.JythonDebugTest)  Time elapsed: 0.208 s
06:43:46 [2020-09-26T10:43:46.827Z] 
06:43:46 [2020-09-26T10:43:46.827Z] Results:
06:43:46 [2020-09-26T10:43:46.827Z] 
06:43:46 [2020-09-26T10:43:46.827Z] Tests run: 42, Failures: 0, Errors: 0, Skipped: 0
06:43:46 [2020-09-26T10:43:46.827Z] 
06:43:47 [2020-09-26T10:43:47.388Z] [INFO] All tests passed!
06:43:47 [2020-09-26T10:43:47.388Z] [INFO] 
06:43:47 [2020-09-26T10:43:47.388Z] [INFO] --- maven-install-plugin:2.3.1:install (default-install) @ org.eclipse.ease.lang.python.jython.test ---
06:43:47 [2020-09-26T10:43:47.388Z] [INFO] Installing /home/jenkins/agent/workspace/ease.verify.core.target.2019-12/tests/org.eclipse.ease.lang.python.jython.test/target/org.eclipse.ease.lang.python.jython.test-0.8.0-SNAPSHOT.jar to /home/jenkins/.m2/repository/org/eclipse/ease/org.eclipse.ease.lang.python.jython.test/0.8.0-SNAPSHOT/org.eclipse.ease.lang.python.jython.test-0.8.0-SNAPSHOT.jar
06:43:47 [2020-09-26T10:43:47.388Z] [INFO] Installing /home/jenkins/agent/workspace/ease.verify.core.target.2019-12/tests/org.eclipse.ease.lang.python.jython.test/pom.xml to /home/jenkins/.m2/repository/org/eclipse/ease/org.eclipse.ease.lang.python.jython.test/0.8.0-SNAPSHOT/org.eclipse.ease.lang.python.jython.test-0.8.0-SNAPSHOT.pom
06:43:47 [2020-09-26T10:43:47.388Z] [INFO] Installing /home/jenkins/agent/workspace/ease.verify.core.target.2019-12/tests/org.eclipse.ease.lang.python.jython.test/target/org.eclipse.ease.lang.python.jython.test-0.8.0-SNAPSHOT-sources.jar to /home/jenkins/.m2/repository/org/eclipse/ease/org.eclipse.ease.lang.python.jython.test/0.8.0-SNAPSHOT/org.eclipse.ease.lang.python.jython.test-0.8.0-SNAPSHOT-sources.jar
06:43:47 [2020-09-26T10:43:47.388Z] [INFO] Installing /home/jenkins/agent/workspace/ease.verify.core.target.2019-12/tests/org.eclipse.ease.lang.python.jython.test/target/p2content.xml to /home/jenkins/.m2/repository/org/eclipse/ease/org.eclipse.ease.lang.python.jython.test/0.8.0-SNAPSHOT/org.eclipse.ease.lang.python.jython.test-0.8.0-SNAPSHOT-p2metadata.xml
06:43:47 [2020-09-26T10:43:47.388Z] [INFO] Installing /home/jenkins/agent/workspace/ease.verify.core.target.2019-12/tests/org.eclipse.ease.lang.python.jython.test/target/p2artifacts.xml to /home/jenkins/.m2/repository/org/eclipse/ease/org.eclipse.ease.lang.python.jython.test/0.8.0-SNAPSHOT/org.eclipse.ease.lang.python.jython.test-0.8.0-SNAPSHOT-p2artifacts.xml
06:43:47 [2020-09-26T10:43:47.388Z] [INFO] Installing /home/jenkins/agent/workspace/ease.verify.core.target.2019-12/tests/org.eclipse.ease.lang.python.jython.test/target/p2content.xml to /home/jenkins/.m2/repository/org/eclipse/ease/org.eclipse.ease.lang.python.jython.test/0.8.0-SNAPSHOT/org.eclipse.ease.lang.python.jython.test-0.8.0-SNAPSHOT-p2metadata.xml
06:43:47 [2020-09-26T10:43:47.388Z] [INFO] Installing /home/jenkins/agent/workspace/ease.verify.core.target.2019-12/tests/org.eclipse.ease.lang.python.jython.test/target/p2artifacts.xml to /home/jenkins/.m2/repository/org/eclipse/ease/org.eclipse.ease.lang.python.jython.test/0.8.0-SNAPSHOT/org.eclipse.ease.lang.python.jython.test-0.8.0-SNAPSHOT-p2artifacts.xml
06:43:47 [2020-09-26T10:43:47.388Z] [INFO] 
06:43:47 [2020-09-26T10:43:47.388Z] [INFO] --- tycho-p2-plugin:1.5.0:update-local-index (default-update-local-index) @ org.eclipse.ease.lang.python.jython.test ---
06:43:47 [2020-09-26T10:43:47.388Z] [INFO] 
06:43:47 [2020-09-26T10:43:47.388Z] [INFO] -----< org.eclipse.ease:org.eclipse.ease.lang.scriptarchive.test >------
06:43:47 [2020-09-26T10:43:47.388Z] [INFO] Building org.eclipse.ease.lang.scriptarchive.test 0.8.0-SNAPSHOT [44/48]
06:43:47 [2020-09-26T10:43:47.388Z] [INFO] ------------------------[ eclipse-test-plugin ]-------------------------
06:43:47 [2020-09-26T10:43:47.388Z] [INFO] 
06:43:47 [2020-09-26T10:43:47.388Z] [INFO] --- maven-clean-plugin:2.5:clean (default-clean) @ org.eclipse.ease.lang.scriptarchive.test ---
06:43:47 [2020-09-26T10:43:47.388Z] [INFO] 
06:43:47 [2020-09-26T10:43:47.388Z] [INFO] --- tycho-packaging-plugin:1.5.0:build-qualifier (default-build-qualifier) @ org.eclipse.ease.lang.scriptarchive.test ---
06:43:47 [2020-09-26T10:43:47.388Z] [INFO] The project's OSGi version is 0.8.0.I201910171213
06:43:47 [2020-09-26T10:43:47.388Z] [INFO] 
06:43:47 [2020-09-26T10:43:47.388Z] [INFO] --- tycho-packaging-plugin:1.5.0:validate-id (default-validate-id) @ org.eclipse.ease.lang.scriptarchive.test ---
06:43:47 [2020-09-26T10:43:47.388Z] [INFO] 
06:43:47 [2020-09-26T10:43:47.388Z] [INFO] --- tycho-packaging-plugin:1.5.0:validate-version (default-validate-version) @ org.eclipse.ease.lang.scriptarchive.test ---
06:43:47 [2020-09-26T10:43:47.388Z] [INFO] 
06:43:47 [2020-09-26T10:43:47.388Z] [INFO] >>> maven-javadoc-plugin:2.9.1:javadoc (build-docs) > generate-sources @ org.eclipse.ease.lang.scriptarchive.test >>>
06:43:47 [2020-09-26T10:43:47.388Z] [INFO] 
06:43:47 [2020-09-26T10:43:47.388Z] [INFO] --- tycho-packaging-plugin:1.5.0:build-qualifier (default-build-qualifier) @ org.eclipse.ease.lang.scriptarchive.test ---
06:43:47 [2020-09-26T10:43:47.389Z] [INFO] The project's OSGi version is 0.8.0.I201910171213
06:43:47 [2020-09-26T10:43:47.389Z] [INFO] 
06:43:47 [2020-09-26T10:43:47.389Z] [INFO] --- tycho-packaging-plugin:1.5.0:validate-id (default-validate-id) @ org.eclipse.ease.lang.scriptarchive.test ---
06:43:47 [2020-09-26T10:43:47.389Z] [INFO] 
06:43:47 [2020-09-26T10:43:47.389Z] [INFO] --- tycho-packaging-plugin:1.5.0:validate-version (default-validate-version) @ org.eclipse.ease.lang.scriptarchive.test ---
06:43:47 [2020-09-26T10:43:47.389Z] [INFO] 
06:43:47 [2020-09-26T10:43:47.389Z] [INFO] <<< maven-javadoc-plugin:2.9.1:javadoc (build-docs) < generate-sources @ org.eclipse.ease.lang.scriptarchive.test <<<
06:43:47 [2020-09-26T10:43:47.389Z] [INFO] 
06:43:47 [2020-09-26T10:43:47.389Z] [INFO] 
06:43:47 [2020-09-26T10:43:47.389Z] [INFO] --- maven-javadoc-plugin:2.9.1:javadoc (build-docs) @ org.eclipse.ease.lang.scriptarchive.test ---
06:43:47 [2020-09-26T10:43:47.644Z] [ERROR] Error fetching link: http://help.eclipse.org/oxygen/topic/org.eclipse.platform.doc.isv/reference/api/package-list. Ignored it.
06:43:47 [2020-09-26T10:43:47.644Z] [ERROR] Error fetching link: https://ci.eclipse.org/ease/job/ease.build.core/JavaDoc/package-list. Ignored it.
06:43:48 [2020-09-26T10:43:48.571Z] [INFO] 
06:43:48 [2020-09-26T10:43:48.571Z] Loading source files for package org.eclipse.ease.lang.scriptarchive...
06:43:48 [2020-09-26T10:43:48.571Z] Constructing Javadoc information...
06:43:48 [2020-09-26T10:43:48.571Z] WARNING: Cannot open location "/home/jenkins/agent/workspace/ease.verify.core.target.2019-12/tests/org.eclipse.ease.lang.scriptarchive.test/target/javadoc-bundle-options/package-list"
06:43:48 [2020-09-26T10:43:48.571Z] No plugin definition found, skipping
06:43:48 [2020-09-26T10:43:48.571Z] No plugin definition found, skipping
06:43:48 [2020-09-26T10:43:48.571Z] [WARNING] Javadoc Warnings
06:43:48 [2020-09-26T10:43:48.571Z] [WARNING] Picked up JAVA_TOOL_OPTIONS: -Dmaven.ext.class.path="/home/jenkins/agent/workspace/ease.verify.core.target.2019-12@tmp/withMaven3ef2ca9c/pipeline-maven-spy.jar" -Dorg.jenkinsci.plugins.pipeline.maven.reportsFolder="/home/jenkins/agent/workspace/ease.verify.core.target.2019-12@tmp/withMaven3ef2ca9c"
06:43:48 [2020-09-26T10:43:48.571Z] [WARNING] javadoc: warning - The old Doclet and Taglet APIs in the packages
06:43:48 [2020-09-26T10:43:48.571Z] [WARNING] com.sun.javadoc, com.sun.tools.doclets and their implementations
06:43:48 [2020-09-26T10:43:48.571Z] [WARNING] are planned to be removed in a future JDK release. These
06:43:48 [2020-09-26T10:43:48.571Z] [WARNING] components have been superseded by the new APIs in jdk.javadoc.doclet.
06:43:48 [2020-09-26T10:43:48.571Z] [WARNING] Users are strongly recommended to migrate to the new APIs.
06:43:48 [2020-09-26T10:43:48.571Z] [INFO] 
06:43:48 [2020-09-26T10:43:48.571Z] [INFO] --- build-helper-maven-plugin:1.9.1:add-resource (add_help) @ org.eclipse.ease.lang.scriptarchive.test ---
06:43:48 [2020-09-26T10:43:48.571Z] [INFO] 
06:43:48 [2020-09-26T10:43:48.571Z] [INFO] --- maven-resources-plugin:2.4.3:resources (default-resources) @ org.eclipse.ease.lang.scriptarchive.test ---
06:43:48 [2020-09-26T10:43:48.571Z] [INFO] Using 'UTF-8' encoding to copy filtered resources.
06:43:48 [2020-09-26T10:43:48.571Z] [INFO] skip non existing resourceDirectory /home/jenkins/agent/workspace/ease.verify.core.target.2019-12/tests/org.eclipse.ease.lang.scriptarchive.test/src/main/resources
06:43:48 [2020-09-26T10:43:48.571Z] [INFO] skip non existing resourceDirectory /home/jenkins/agent/workspace/ease.verify.core.target.2019-12/tests/org.eclipse.ease.lang.scriptarchive.test/help
06:43:48 [2020-09-26T10:43:48.571Z] [INFO] 
06:43:48 [2020-09-26T10:43:48.571Z] [INFO] --- tycho-compiler-plugin:1.5.0:compile (default-compile) @ org.eclipse.ease.lang.scriptarchive.test ---
06:43:48 [2020-09-26T10:43:48.571Z] [INFO] Compiling 1 source file to /home/jenkins/agent/workspace/ease.verify.core.target.2019-12/tests/org.eclipse.ease.lang.scriptarchive.test/target/classes
06:43:48 [2020-09-26T10:43:48.826Z] [INFO] 
06:43:48 [2020-09-26T10:43:48.826Z] [INFO] --- maven-resources-plugin:2.4.3:testResources (default-testResources) @ org.eclipse.ease.lang.scriptarchive.test ---
06:43:48 [2020-09-26T10:43:48.826Z] [INFO] Using 'UTF-8' encoding to copy filtered resources.
06:43:48 [2020-09-26T10:43:48.826Z] [INFO] skip non existing resourceDirectory /home/jenkins/agent/workspace/ease.verify.core.target.2019-12/tests/org.eclipse.ease.lang.scriptarchive.test/src/test/resources
06:43:48 [2020-09-26T10:43:48.826Z] [INFO] 
06:43:48 [2020-09-26T10:43:48.826Z] [INFO] --- tycho-source-plugin:1.5.0:plugin-source (plugin-source) @ org.eclipse.ease.lang.scriptarchive.test ---
06:43:48 [2020-09-26T10:43:48.826Z] [INFO] Building jar: /home/jenkins/agent/workspace/ease.verify.core.target.2019-12/tests/org.eclipse.ease.lang.scriptarchive.test/target/org.eclipse.ease.lang.scriptarchive.test-0.8.0-SNAPSHOT-sources.jar
06:43:48 [2020-09-26T10:43:48.826Z] [INFO] 
06:43:48 [2020-09-26T10:43:48.826Z] [INFO] --- target-platform-configuration:1.5.0:target-platform (default-target-platform) @ org.eclipse.ease.lang.scriptarchive.test ---
06:43:48 [2020-09-26T10:43:48.826Z] [INFO] 
06:43:48 [2020-09-26T10:43:48.827Z] [INFO] --- tycho-packaging-plugin:1.5.0:package-plugin (default-package-plugin) @ org.eclipse.ease.lang.scriptarchive.test ---
06:43:48 [2020-09-26T10:43:48.827Z] [INFO] Building jar: /home/jenkins/agent/workspace/ease.verify.core.target.2019-12/tests/org.eclipse.ease.lang.scriptarchive.test/target/org.eclipse.ease.lang.scriptarchive.test-0.8.0-SNAPSHOT.jar
06:43:48 [2020-09-26T10:43:48.827Z] [INFO] 
06:43:48 [2020-09-26T10:43:48.827Z] [INFO] --- tycho-p2-plugin:1.5.0:p2-metadata-default (default-p2-metadata-default) @ org.eclipse.ease.lang.scriptarchive.test ---
06:43:48 [2020-09-26T10:43:48.827Z] [INFO] 
06:43:48 [2020-09-26T10:43:48.827Z] [INFO] --- tycho-source-feature-plugin:1.5.0:source-feature (source-feature) @ org.eclipse.ease.lang.scriptarchive.test ---
06:43:48 [2020-09-26T10:43:48.827Z] [INFO] 
06:43:48 [2020-09-26T10:43:48.827Z] [INFO] --- tycho-p2-plugin:1.5.0:p2-metadata (attached-p2-metadata) @ org.eclipse.ease.lang.scriptarchive.test ---
06:43:48 [2020-09-26T10:43:48.827Z] [INFO] 
06:43:48 [2020-09-26T10:43:48.827Z] [INFO] --- tycho-surefire-plugin:1.5.0:test (default-test) @ org.eclipse.ease.lang.scriptarchive.test ---
06:43:48 [2020-09-26T10:43:48.827Z] [INFO] Expected eclipse log file: /home/jenkins/agent/workspace/ease.verify.core.target.2019-12/tests/org.eclipse.ease.lang.scriptarchive.test/target/work/data/.metadata/.log
06:43:48 [2020-09-26T10:43:48.827Z] [INFO] Command line:
06:43:48 [2020-09-26T10:43:48.827Z] 	[/opt/tools/java/openjdk/jdk-11/11.0.2+9/bin/java, -Dosgi.noShutdown=false, -Dosgi.os=linux, -Dosgi.ws=gtk, -Dosgi.arch=x86_64, -Dosgi.clean=true, -jar, /home/jenkins/.m2/repository/p2/osgi/bundle/org.eclipse.equinox.launcher/1.5.800.v20200727-1323/org.eclipse.equinox.launcher-1.5.800.v20200727-1323.jar, -data, /home/jenkins/agent/workspace/ease.verify.core.target.2019-12/tests/org.eclipse.ease.lang.scriptarchive.test/target/work/data, -install, /home/jenkins/agent/workspace/ease.verify.core.target.2019-12/tests/org.eclipse.ease.lang.scriptarchive.test/target/work, -configuration, /home/jenkins/agent/workspace/ease.verify.core.target.2019-12/tests/org.eclipse.ease.lang.scriptarchive.test/target/work/configuration, -application, org.eclipse.tycho.surefire.osgibooter.headlesstest, -testproperties, /home/jenkins/agent/workspace/ease.verify.core.target.2019-12/tests/org.eclipse.ease.lang.scriptarchive.test/target/surefire.properties]
06:43:48 [2020-09-26T10:43:48.827Z] Picked up JAVA_TOOL_OPTIONS: -Dmaven.ext.class.path="/home/jenkins/agent/workspace/ease.verify.core.target.2019-12@tmp/withMaven3ef2ca9c/pipeline-maven-spy.jar" -Dorg.jenkinsci.plugins.pipeline.maven.reportsFolder="/home/jenkins/agent/workspace/ease.verify.core.target.2019-12@tmp/withMaven3ef2ca9c" 
06:43:50 [2020-09-26T10:43:50.747Z] Running org.eclipse.ease.lang.scriptarchive.ArchiveEngineTest
06:43:50 [2020-09-26T10:43:50.747Z] We are running from a zip file!
06:43:51 [2020-09-26T10:43:51.003Z] org.eclipse.ease.ScriptExecutionException: SyntaxError: missing ; before statement (workspace://__EASE_ScriptArchive_1/scripts/Master.js#3)
06:43:51 [2020-09-26T10:43:51.003Z] this is an error
06:43:51 [2020-09-26T10:43:51.003Z]        ^
06:43:51 [2020-09-26T10:43:51.003Z] 	at Master.js,workspace://__EASE_ScriptArchive_1/scripts/Master.js
06:43:51 [2020-09-26T10:43:51.003Z] org.eclipse.ease.ScriptExecutionException: SyntaxError: missing ; before statement (workspace://__EASE_ScriptArchive_1/scripts/Master.js#3)
06:43:51 [2020-09-26T10:43:51.003Z] this is an error
06:43:51 [2020-09-26T10:43:51.003Z]        ^
06:43:51 [2020-09-26T10:43:51.003Z] 	at Master.js,workspace://__EASE_ScriptArchive_1/scripts/Master.js
06:43:51 [2020-09-26T10:43:51.003Z] Tests run: 7, Failures: 0, Errors: 0, Skipped: 0, Time elapsed: 0.46 s - in org.eclipse.ease.lang.scriptarchive.ArchiveEngineTest
06:43:51 [2020-09-26T10:43:51.003Z] executeWithManifest(org.eclipse.ease.lang.scriptarchive.ArchiveEngineTest)  Time elapsed: 0.292 s
06:43:51 [2020-09-26T10:43:51.003Z] zipFileRegistration(org.eclipse.ease.lang.scriptarchive.ArchiveEngineTest)  Time elapsed: 0.007 s
06:43:51 [2020-09-26T10:43:51.003Z] engineIdRegistration(org.eclipse.ease.lang.scriptarchive.ArchiveEngineTest)  Time elapsed: 0 s
06:43:51 [2020-09-26T10:43:51.003Z] jarFileRegistration(org.eclipse.ease.lang.scriptarchive.ArchiveEngineTest)  Time elapsed: 0 s
06:43:51 [2020-09-26T10:43:51.003Z] sarFileRegistration(org.eclipse.ease.lang.scriptarchive.ArchiveEngineTest)  Time elapsed: 0.001 s
06:43:51 [2020-09-26T10:43:51.003Z] executeWithErrors(org.eclipse.ease.lang.scriptarchive.ArchiveEngineTest)  Time elapsed: 0.07 s
06:43:51 [2020-09-26T10:43:51.003Z] executeWithIncludes(org.eclipse.ease.lang.scriptarchive.ArchiveEngineTest)  Time elapsed: 0.067 s
06:43:51 [2020-09-26T10:43:51.003Z] 
06:43:51 [2020-09-26T10:43:51.003Z] Results:
06:43:51 [2020-09-26T10:43:51.003Z] 
06:43:51 [2020-09-26T10:43:51.003Z] Tests run: 7, Failures: 0, Errors: 0, Skipped: 0
06:43:51 [2020-09-26T10:43:51.003Z] 
06:43:51 [2020-09-26T10:43:51.564Z] [INFO] All tests passed!
06:43:51 [2020-09-26T10:43:51.564Z] [INFO] 
06:43:51 [2020-09-26T10:43:51.564Z] [INFO] --- maven-install-plugin:2.3.1:install (default-install) @ org.eclipse.ease.lang.scriptarchive.test ---
06:43:51 [2020-09-26T10:43:51.564Z] [INFO] Installing /home/jenkins/agent/workspace/ease.verify.core.target.2019-12/tests/org.eclipse.ease.lang.scriptarchive.test/target/org.eclipse.ease.lang.scriptarchive.test-0.8.0-SNAPSHOT.jar to /home/jenkins/.m2/repository/org/eclipse/ease/org.eclipse.ease.lang.scriptarchive.test/0.8.0-SNAPSHOT/org.eclipse.ease.lang.scriptarchive.test-0.8.0-SNAPSHOT.jar
06:43:51 [2020-09-26T10:43:51.564Z] [INFO] Installing /home/jenkins/agent/workspace/ease.verify.core.target.2019-12/tests/org.eclipse.ease.lang.scriptarchive.test/pom.xml to /home/jenkins/.m2/repository/org/eclipse/ease/org.eclipse.ease.lang.scriptarchive.test/0.8.0-SNAPSHOT/org.eclipse.ease.lang.scriptarchive.test-0.8.0-SNAPSHOT.pom
06:43:51 [2020-09-26T10:43:51.564Z] [INFO] Installing /home/jenkins/agent/workspace/ease.verify.core.target.2019-12/tests/org.eclipse.ease.lang.scriptarchive.test/target/org.eclipse.ease.lang.scriptarchive.test-0.8.0-SNAPSHOT-sources.jar to /home/jenkins/.m2/repository/org/eclipse/ease/org.eclipse.ease.lang.scriptarchive.test/0.8.0-SNAPSHOT/org.eclipse.ease.lang.scriptarchive.test-0.8.0-SNAPSHOT-sources.jar
06:43:51 [2020-09-26T10:43:51.564Z] [INFO] Installing /home/jenkins/agent/workspace/ease.verify.core.target.2019-12/tests/org.eclipse.ease.lang.scriptarchive.test/target/p2content.xml to /home/jenkins/.m2/repository/org/eclipse/ease/org.eclipse.ease.lang.scriptarchive.test/0.8.0-SNAPSHOT/org.eclipse.ease.lang.scriptarchive.test-0.8.0-SNAPSHOT-p2metadata.xml
06:43:51 [2020-09-26T10:43:51.564Z] [INFO] Installing /home/jenkins/agent/workspace/ease.verify.core.target.2019-12/tests/org.eclipse.ease.lang.scriptarchive.test/target/p2artifacts.xml to /home/jenkins/.m2/repository/org/eclipse/ease/org.eclipse.ease.lang.scriptarchive.test/0.8.0-SNAPSHOT/org.eclipse.ease.lang.scriptarchive.test-0.8.0-SNAPSHOT-p2artifacts.xml
06:43:51 [2020-09-26T10:43:51.564Z] [INFO] Installing /home/jenkins/agent/workspace/ease.verify.core.target.2019-12/tests/org.eclipse.ease.lang.scriptarchive.test/target/p2content.xml to /home/jenkins/.m2/repository/org/eclipse/ease/org.eclipse.ease.lang.scriptarchive.test/0.8.0-SNAPSHOT/org.eclipse.ease.lang.scriptarchive.test-0.8.0-SNAPSHOT-p2metadata.xml
06:43:51 [2020-09-26T10:43:51.564Z] [INFO] Installing /home/jenkins/agent/workspace/ease.verify.core.target.2019-12/tests/org.eclipse.ease.lang.scriptarchive.test/target/p2artifacts.xml to /home/jenkins/.m2/repository/org/eclipse/ease/org.eclipse.ease.lang.scriptarchive.test/0.8.0-SNAPSHOT/org.eclipse.ease.lang.scriptarchive.test-0.8.0-SNAPSHOT-p2artifacts.xml
06:43:51 [2020-09-26T10:43:51.564Z] [INFO] 
06:43:51 [2020-09-26T10:43:51.564Z] [INFO] --- tycho-p2-plugin:1.5.0:update-local-index (default-update-local-index) @ org.eclipse.ease.lang.scriptarchive.test ---
06:43:51 [2020-09-26T10:43:51.564Z] [INFO] 
06:43:51 [2020-09-26T10:43:51.564Z] [INFO] --------< org.eclipse.ease:org.eclipse.ease.lang.unittest.test >--------
06:43:51 [2020-09-26T10:43:51.564Z] [INFO] Building org.eclipse.ease.lang.unittest.test 0.8.0-SNAPSHOT      [45/48]
06:43:51 [2020-09-26T10:43:51.564Z] [INFO] ------------------------[ eclipse-test-plugin ]-------------------------
06:43:51 [2020-09-26T10:43:51.564Z] [INFO] 
06:43:51 [2020-09-26T10:43:51.564Z] [INFO] --- maven-clean-plugin:2.5:clean (default-clean) @ org.eclipse.ease.lang.unittest.test ---
06:43:51 [2020-09-26T10:43:51.564Z] [INFO] 
06:43:51 [2020-09-26T10:43:51.564Z] [INFO] --- tycho-packaging-plugin:1.5.0:build-qualifier (default-build-qualifier) @ org.eclipse.ease.lang.unittest.test ---
06:43:51 [2020-09-26T10:43:51.564Z] [INFO] The project's OSGi version is 0.8.0.I202009240747
06:43:51 [2020-09-26T10:43:51.564Z] [INFO] 
06:43:51 [2020-09-26T10:43:51.564Z] [INFO] --- tycho-packaging-plugin:1.5.0:validate-id (default-validate-id) @ org.eclipse.ease.lang.unittest.test ---
06:43:51 [2020-09-26T10:43:51.564Z] [INFO] 
06:43:51 [2020-09-26T10:43:51.564Z] [INFO] --- tycho-packaging-plugin:1.5.0:validate-version (default-validate-version) @ org.eclipse.ease.lang.unittest.test ---
06:43:51 [2020-09-26T10:43:51.564Z] [INFO] 
06:43:51 [2020-09-26T10:43:51.564Z] [INFO] >>> maven-javadoc-plugin:2.9.1:javadoc (build-docs) > generate-sources @ org.eclipse.ease.lang.unittest.test >>>
06:43:51 [2020-09-26T10:43:51.564Z] [INFO] 
06:43:51 [2020-09-26T10:43:51.565Z] [INFO] --- tycho-packaging-plugin:1.5.0:build-qualifier (default-build-qualifier) @ org.eclipse.ease.lang.unittest.test ---
06:43:51 [2020-09-26T10:43:51.565Z] [INFO] The project's OSGi version is 0.8.0.I202009240747
06:43:51 [2020-09-26T10:43:51.565Z] [INFO] 
06:43:51 [2020-09-26T10:43:51.565Z] [INFO] --- tycho-packaging-plugin:1.5.0:validate-id (default-validate-id) @ org.eclipse.ease.lang.unittest.test ---
06:43:51 [2020-09-26T10:43:51.565Z] [INFO] 
06:43:51 [2020-09-26T10:43:51.565Z] [INFO] --- tycho-packaging-plugin:1.5.0:validate-version (default-validate-version) @ org.eclipse.ease.lang.unittest.test ---
06:43:51 [2020-09-26T10:43:51.565Z] [INFO] 
06:43:51 [2020-09-26T10:43:51.565Z] [INFO] <<< maven-javadoc-plugin:2.9.1:javadoc (build-docs) < generate-sources @ org.eclipse.ease.lang.unittest.test <<<
06:43:51 [2020-09-26T10:43:51.565Z] [INFO] 
06:43:51 [2020-09-26T10:43:51.565Z] [INFO] 
06:43:51 [2020-09-26T10:43:51.565Z] [INFO] --- maven-javadoc-plugin:2.9.1:javadoc (build-docs) @ org.eclipse.ease.lang.unittest.test ---
06:43:51 [2020-09-26T10:43:51.820Z] [ERROR] Error fetching link: http://help.eclipse.org/oxygen/topic/org.eclipse.platform.doc.isv/reference/api/package-list. Ignored it.
06:43:51 [2020-09-26T10:43:51.820Z] [ERROR] Error fetching link: https://ci.eclipse.org/ease/job/ease.build.core/JavaDoc/package-list. Ignored it.
06:43:52 [2020-09-26T10:43:52.763Z] [INFO] 
06:43:52 [2020-09-26T10:43:52.763Z] Loading source files for package org.eclipse.ease.lang.unittest...
06:43:52 [2020-09-26T10:43:52.763Z] Constructing Javadoc information...
06:43:52 [2020-09-26T10:43:52.763Z] WARNING: Cannot open location "/home/jenkins/agent/workspace/ease.verify.core.target.2019-12/tests/org.eclipse.ease.lang.unittest.test/target/javadoc-bundle-options/package-list"
06:43:52 [2020-09-26T10:43:52.763Z] No plugin definition found, skipping
06:43:52 [2020-09-26T10:43:52.763Z] No plugin definition found, skipping
06:43:52 [2020-09-26T10:43:52.763Z] [WARNING] Javadoc Warnings
06:43:52 [2020-09-26T10:43:52.763Z] [WARNING] Picked up JAVA_TOOL_OPTIONS: -Dmaven.ext.class.path="/home/jenkins/agent/workspace/ease.verify.core.target.2019-12@tmp/withMaven3ef2ca9c/pipeline-maven-spy.jar" -Dorg.jenkinsci.plugins.pipeline.maven.reportsFolder="/home/jenkins/agent/workspace/ease.verify.core.target.2019-12@tmp/withMaven3ef2ca9c"
06:43:52 [2020-09-26T10:43:52.764Z] [WARNING] javadoc: warning - The old Doclet and Taglet APIs in the packages
06:43:52 [2020-09-26T10:43:52.764Z] [WARNING] com.sun.javadoc, com.sun.tools.doclets and their implementations
06:43:52 [2020-09-26T10:43:52.764Z] [WARNING] are planned to be removed in a future JDK release. These
06:43:52 [2020-09-26T10:43:52.764Z] [WARNING] components have been superseded by the new APIs in jdk.javadoc.doclet.
06:43:52 [2020-09-26T10:43:52.764Z] [WARNING] Users are strongly recommended to migrate to the new APIs.
06:43:52 [2020-09-26T10:43:52.764Z] [INFO] 
06:43:52 [2020-09-26T10:43:52.764Z] [INFO] --- build-helper-maven-plugin:1.9.1:add-resource (add_help) @ org.eclipse.ease.lang.unittest.test ---
06:43:52 [2020-09-26T10:43:52.764Z] [INFO] 
06:43:52 [2020-09-26T10:43:52.764Z] [INFO] --- maven-resources-plugin:2.4.3:resources (default-resources) @ org.eclipse.ease.lang.unittest.test ---
06:43:52 [2020-09-26T10:43:52.764Z] [INFO] Using 'UTF-8' encoding to copy filtered resources.
06:43:52 [2020-09-26T10:43:52.764Z] [INFO] skip non existing resourceDirectory /home/jenkins/agent/workspace/ease.verify.core.target.2019-12/tests/org.eclipse.ease.lang.unittest.test/src/main/resources
06:43:52 [2020-09-26T10:43:52.764Z] [INFO] skip non existing resourceDirectory /home/jenkins/agent/workspace/ease.verify.core.target.2019-12/tests/org.eclipse.ease.lang.unittest.test/help
06:43:52 [2020-09-26T10:43:52.764Z] [INFO] 
06:43:52 [2020-09-26T10:43:52.764Z] [INFO] --- tycho-compiler-plugin:1.5.0:compile (default-compile) @ org.eclipse.ease.lang.unittest.test ---
06:43:52 [2020-09-26T10:43:52.764Z] [INFO] Compiling 3 source files to /home/jenkins/agent/workspace/ease.verify.core.target.2019-12/tests/org.eclipse.ease.lang.unittest.test/target/classes
06:43:53 [2020-09-26T10:43:53.019Z] [INFO] 
06:43:53 [2020-09-26T10:43:53.019Z] [INFO] --- maven-resources-plugin:2.4.3:testResources (default-testResources) @ org.eclipse.ease.lang.unittest.test ---
06:43:53 [2020-09-26T10:43:53.019Z] [INFO] Using 'UTF-8' encoding to copy filtered resources.
06:43:53 [2020-09-26T10:43:53.019Z] [INFO] skip non existing resourceDirectory /home/jenkins/agent/workspace/ease.verify.core.target.2019-12/tests/org.eclipse.ease.lang.unittest.test/src/test/resources
06:43:53 [2020-09-26T10:43:53.019Z] [INFO] 
06:43:53 [2020-09-26T10:43:53.019Z] [INFO] --- tycho-source-plugin:1.5.0:plugin-source (plugin-source) @ org.eclipse.ease.lang.unittest.test ---
06:43:53 [2020-09-26T10:43:53.020Z] [WARNING] Bundle-Name header not found in /home/jenkins/agent/workspace/ease.verify.core.target.2019-12/tests/org.eclipse.ease.lang.unittest.test/META-INF/MANIFEST.MF, fallback to Bundle-SymbolicName for source bundle
06:43:53 [2020-09-26T10:43:53.020Z] [WARNING] Bundle-Vendor header not found in /home/jenkins/agent/workspace/ease.verify.core.target.2019-12/tests/org.eclipse.ease.lang.unittest.test/META-INF/MANIFEST.MF, fallback to 'unknown' for source bundle
06:43:53 [2020-09-26T10:43:53.020Z] [INFO] Building jar: /home/jenkins/agent/workspace/ease.verify.core.target.2019-12/tests/org.eclipse.ease.lang.unittest.test/target/org.eclipse.ease.lang.unittest.test-0.8.0-SNAPSHOT-sources.jar
06:43:53 [2020-09-26T10:43:53.020Z] [INFO] 
06:43:53 [2020-09-26T10:43:53.020Z] [INFO] --- target-platform-configuration:1.5.0:target-platform (default-target-platform) @ org.eclipse.ease.lang.unittest.test ---
06:43:53 [2020-09-26T10:43:53.020Z] [INFO] 
06:43:53 [2020-09-26T10:43:53.020Z] [INFO] --- tycho-packaging-plugin:1.5.0:package-plugin (default-package-plugin) @ org.eclipse.ease.lang.unittest.test ---
06:43:53 [2020-09-26T10:43:53.020Z] [INFO] Building jar: /home/jenkins/agent/workspace/ease.verify.core.target.2019-12/tests/org.eclipse.ease.lang.unittest.test/target/org.eclipse.ease.lang.unittest.test-0.8.0-SNAPSHOT.jar
06:43:53 [2020-09-26T10:43:53.020Z] [INFO] 
06:43:53 [2020-09-26T10:43:53.020Z] [INFO] --- tycho-p2-plugin:1.5.0:p2-metadata-default (default-p2-metadata-default) @ org.eclipse.ease.lang.unittest.test ---
06:43:53 [2020-09-26T10:43:53.020Z] [INFO] 
06:43:53 [2020-09-26T10:43:53.020Z] [INFO] --- tycho-source-feature-plugin:1.5.0:source-feature (source-feature) @ org.eclipse.ease.lang.unittest.test ---
06:43:53 [2020-09-26T10:43:53.020Z] [INFO] 
06:43:53 [2020-09-26T10:43:53.020Z] [INFO] --- tycho-p2-plugin:1.5.0:p2-metadata (attached-p2-metadata) @ org.eclipse.ease.lang.unittest.test ---
06:43:53 [2020-09-26T10:43:53.020Z] [INFO] 
06:43:53 [2020-09-26T10:43:53.020Z] [INFO] --- tycho-surefire-plugin:1.5.0:test (default-test) @ org.eclipse.ease.lang.unittest.test ---
06:43:53 [2020-09-26T10:43:53.288Z] [INFO] Expected eclipse log file: /home/jenkins/agent/workspace/ease.verify.core.target.2019-12/tests/org.eclipse.ease.lang.unittest.test/target/work/data/.metadata/.log
06:43:53 [2020-09-26T10:43:53.288Z] [INFO] Command line:
06:43:53 [2020-09-26T10:43:53.288Z] 	[/opt/tools/java/openjdk/jdk-11/11.0.2+9/bin/java, -Dosgi.noShutdown=false, -Dosgi.os=linux, -Dosgi.ws=gtk, -Dosgi.arch=x86_64, -Dosgi.clean=true, -jar, /home/jenkins/.m2/repository/p2/osgi/bundle/org.eclipse.equinox.launcher/1.5.800.v20200727-1323/org.eclipse.equinox.launcher-1.5.800.v20200727-1323.jar, -data, /home/jenkins/agent/workspace/ease.verify.core.target.2019-12/tests/org.eclipse.ease.lang.unittest.test/target/work/data, -install, /home/jenkins/agent/workspace/ease.verify.core.target.2019-12/tests/org.eclipse.ease.lang.unittest.test/target/work, -configuration, /home/jenkins/agent/workspace/ease.verify.core.target.2019-12/tests/org.eclipse.ease.lang.unittest.test/target/work/configuration, -application, org.eclipse.tycho.surefire.osgibooter.headlesstest, -testproperties, /home/jenkins/agent/workspace/ease.verify.core.target.2019-12/tests/org.eclipse.ease.lang.unittest.test/target/surefire.properties]
06:43:53 [2020-09-26T10:43:53.288Z] Picked up JAVA_TOOL_OPTIONS: -Dmaven.ext.class.path="/home/jenkins/agent/workspace/ease.verify.core.target.2019-12@tmp/withMaven3ef2ca9c/pipeline-maven-spy.jar" -Dorg.jenkinsci.plugins.pipeline.maven.reportsFolder="/home/jenkins/agent/workspace/ease.verify.core.target.2019-12@tmp/withMaven3ef2ca9c" 
06:43:55 [2020-09-26T10:43:55.185Z] Running org.eclipse.ease.lang.unittest.ModernJavaScriptTest
06:43:56 [2020-09-26T10:43:56.551Z] Tests run: 8, Failures: 0, Errors: 0, Skipped: 0, Time elapsed: 1.656 s - in org.eclipse.ease.lang.unittest.ModernJavaScriptTest
06:43:56 [2020-09-26T10:43:56.551Z] folderStatus(org.eclipse.ease.lang.unittest.ModernJavaScriptTest)  Time elapsed: 0.653 s
06:43:56 [2020-09-26T10:43:56.551Z] verifyOutput(org.eclipse.ease.lang.unittest.ModernJavaScriptTest)  Time elapsed: 0.189 s
06:43:56 [2020-09-26T10:43:56.551Z] suiteStatus(org.eclipse.ease.lang.unittest.ModernJavaScriptTest)  Time elapsed: 0.151 s
06:43:56 [2020-09-26T10:43:56.551Z] ignoreTestStatus(org.eclipse.ease.lang.unittest.ModernJavaScriptTest)  Time elapsed: 0.171 s
06:43:56 [2020-09-26T10:43:56.551Z] ignoreTestClassStatus(org.eclipse.ease.lang.unittest.ModernJavaScriptTest)  Time elapsed: 0.11 s
06:43:56 [2020-09-26T10:43:56.551Z] failureTestClassStatus(org.eclipse.ease.lang.unittest.ModernJavaScriptTest)  Time elapsed: 0.107 s
06:43:56 [2020-09-26T10:43:56.551Z] errorTestClassStatus(org.eclipse.ease.lang.unittest.ModernJavaScriptTest)  Time elapsed: 0.1 s
06:43:56 [2020-09-26T10:43:56.551Z] passTestClassStatus(org.eclipse.ease.lang.unittest.ModernJavaScriptTest)  Time elapsed: 0.095 s
06:43:56 [2020-09-26T10:43:56.551Z] Running org.eclipse.ease.lang.unittest.ClassicJavaScriptTest
06:43:57 [2020-09-26T10:43:57.112Z] Tests run: 7, Failures: 0, Errors: 0, Skipped: 0, Time elapsed: 0.514 s - in org.eclipse.ease.lang.unittest.ClassicJavaScriptTest
06:43:57 [2020-09-26T10:43:57.112Z] folderStatus(org.eclipse.ease.lang.unittest.ClassicJavaScriptTest)  Time elapsed: 0.084 s
06:43:57 [2020-09-26T10:43:57.112Z] errorTestStatus(org.eclipse.ease.lang.unittest.ClassicJavaScriptTest)  Time elapsed: 0.087 s
06:43:57 [2020-09-26T10:43:57.112Z] failureTestStatus(org.eclipse.ease.lang.unittest.ClassicJavaScriptTest)  Time elapsed: 0.082 s
06:43:57 [2020-09-26T10:43:57.112Z] verifyOutput(org.eclipse.ease.lang.unittest.ClassicJavaScriptTest)  Time elapsed: 0.056 s
06:43:57 [2020-09-26T10:43:57.112Z] suiteStatus(org.eclipse.ease.lang.unittest.ClassicJavaScriptTest)  Time elapsed: 0.077 s
06:43:57 [2020-09-26T10:43:57.112Z] ignoreTestStatus(org.eclipse.ease.lang.unittest.ClassicJavaScriptTest)  Time elapsed: 0.07 s
06:43:57 [2020-09-26T10:43:57.112Z] passTestStatus(org.eclipse.ease.lang.unittest.ClassicJavaScriptTest)  Time elapsed: 0.057 s
06:43:57 [2020-09-26T10:43:57.112Z] 
06:43:57 [2020-09-26T10:43:57.112Z] Results:
06:43:57 [2020-09-26T10:43:57.112Z] 
06:43:57 [2020-09-26T10:43:57.112Z] Tests run: 15, Failures: 0, Errors: 0, Skipped: 0
06:43:57 [2020-09-26T10:43:57.112Z] 
06:43:58 [2020-09-26T10:43:58.039Z] [INFO] All tests passed!
06:43:58 [2020-09-26T10:43:58.039Z] [INFO] 
06:43:58 [2020-09-26T10:43:58.039Z] [INFO] --- maven-install-plugin:2.3.1:install (default-install) @ org.eclipse.ease.lang.unittest.test ---
06:43:58 [2020-09-26T10:43:58.039Z] [INFO] Installing /home/jenkins/agent/workspace/ease.verify.core.target.2019-12/tests/org.eclipse.ease.lang.unittest.test/target/org.eclipse.ease.lang.unittest.test-0.8.0-SNAPSHOT.jar to /home/jenkins/.m2/repository/org/eclipse/ease/org.eclipse.ease.lang.unittest.test/0.8.0-SNAPSHOT/org.eclipse.ease.lang.unittest.test-0.8.0-SNAPSHOT.jar
06:43:58 [2020-09-26T10:43:58.039Z] [INFO] Installing /home/jenkins/agent/workspace/ease.verify.core.target.2019-12/tests/org.eclipse.ease.lang.unittest.test/pom.xml to /home/jenkins/.m2/repository/org/eclipse/ease/org.eclipse.ease.lang.unittest.test/0.8.0-SNAPSHOT/org.eclipse.ease.lang.unittest.test-0.8.0-SNAPSHOT.pom
06:43:58 [2020-09-26T10:43:58.039Z] [INFO] Installing /home/jenkins/agent/workspace/ease.verify.core.target.2019-12/tests/org.eclipse.ease.lang.unittest.test/target/org.eclipse.ease.lang.unittest.test-0.8.0-SNAPSHOT-sources.jar to /home/jenkins/.m2/repository/org/eclipse/ease/org.eclipse.ease.lang.unittest.test/0.8.0-SNAPSHOT/org.eclipse.ease.lang.unittest.test-0.8.0-SNAPSHOT-sources.jar
06:43:58 [2020-09-26T10:43:58.039Z] [INFO] Installing /home/jenkins/agent/workspace/ease.verify.core.target.2019-12/tests/org.eclipse.ease.lang.unittest.test/target/p2content.xml to /home/jenkins/.m2/repository/org/eclipse/ease/org.eclipse.ease.lang.unittest.test/0.8.0-SNAPSHOT/org.eclipse.ease.lang.unittest.test-0.8.0-SNAPSHOT-p2metadata.xml
06:43:58 [2020-09-26T10:43:58.039Z] [INFO] Installing /home/jenkins/agent/workspace/ease.verify.core.target.2019-12/tests/org.eclipse.ease.lang.unittest.test/target/p2artifacts.xml to /home/jenkins/.m2/repository/org/eclipse/ease/org.eclipse.ease.lang.unittest.test/0.8.0-SNAPSHOT/org.eclipse.ease.lang.unittest.test-0.8.0-SNAPSHOT-p2artifacts.xml
06:43:58 [2020-09-26T10:43:58.039Z] [INFO] Installing /home/jenkins/agent/workspace/ease.verify.core.target.2019-12/tests/org.eclipse.ease.lang.unittest.test/target/p2content.xml to /home/jenkins/.m2/repository/org/eclipse/ease/org.eclipse.ease.lang.unittest.test/0.8.0-SNAPSHOT/org.eclipse.ease.lang.unittest.test-0.8.0-SNAPSHOT-p2metadata.xml
06:43:58 [2020-09-26T10:43:58.039Z] [INFO] Installing /home/jenkins/agent/workspace/ease.verify.core.target.2019-12/tests/org.eclipse.ease.lang.unittest.test/target/p2artifacts.xml to /home/jenkins/.m2/repository/org/eclipse/ease/org.eclipse.ease.lang.unittest.test/0.8.0-SNAPSHOT/org.eclipse.ease.lang.unittest.test-0.8.0-SNAPSHOT-p2artifacts.xml
06:43:58 [2020-09-26T10:43:58.039Z] [INFO] 
06:43:58 [2020-09-26T10:43:58.039Z] [INFO] --- tycho-p2-plugin:1.5.0:update-local-index (default-update-local-index) @ org.eclipse.ease.lang.unittest.test ---
06:43:58 [2020-09-26T10:43:58.040Z] [INFO] 
06:43:58 [2020-09-26T10:43:58.040Z] [INFO] ---------< org.eclipse.ease:org.eclipse.ease.ui.scripts.test >----------
06:43:58 [2020-09-26T10:43:58.040Z] [INFO] Building org.eclipse.ease.ui.scripts.test 0.8.0-SNAPSHOT         [46/48]
06:43:58 [2020-09-26T10:43:58.040Z] [INFO] ------------------------[ eclipse-test-plugin ]-------------------------
06:43:58 [2020-09-26T10:43:58.040Z] [INFO] 
06:43:58 [2020-09-26T10:43:58.040Z] [INFO] --- maven-clean-plugin:2.5:clean (default-clean) @ org.eclipse.ease.ui.scripts.test ---
06:43:58 [2020-09-26T10:43:58.040Z] [INFO] 
06:43:58 [2020-09-26T10:43:58.040Z] [INFO] --- tycho-packaging-plugin:1.5.0:build-qualifier (default-build-qualifier) @ org.eclipse.ease.ui.scripts.test ---
06:43:58 [2020-09-26T10:43:58.040Z] [INFO] The project's OSGi version is 0.8.0.I202009240747
06:43:58 [2020-09-26T10:43:58.040Z] [INFO] 
06:43:58 [2020-09-26T10:43:58.040Z] [INFO] --- tycho-packaging-plugin:1.5.0:validate-id (default-validate-id) @ org.eclipse.ease.ui.scripts.test ---
06:43:58 [2020-09-26T10:43:58.040Z] [INFO] 
06:43:58 [2020-09-26T10:43:58.040Z] [INFO] --- tycho-packaging-plugin:1.5.0:validate-version (default-validate-version) @ org.eclipse.ease.ui.scripts.test ---
06:43:58 [2020-09-26T10:43:58.040Z] [INFO] 
06:43:58 [2020-09-26T10:43:58.040Z] [INFO] >>> maven-javadoc-plugin:2.9.1:javadoc (build-docs) > generate-sources @ org.eclipse.ease.ui.scripts.test >>>
06:43:58 [2020-09-26T10:43:58.040Z] [INFO] 
06:43:58 [2020-09-26T10:43:58.040Z] [INFO] --- tycho-packaging-plugin:1.5.0:build-qualifier (default-build-qualifier) @ org.eclipse.ease.ui.scripts.test ---
06:43:58 [2020-09-26T10:43:58.040Z] [INFO] The project's OSGi version is 0.8.0.I202009240747
06:43:58 [2020-09-26T10:43:58.040Z] [INFO] 
06:43:58 [2020-09-26T10:43:58.040Z] [INFO] --- tycho-packaging-plugin:1.5.0:validate-id (default-validate-id) @ org.eclipse.ease.ui.scripts.test ---
06:43:58 [2020-09-26T10:43:58.040Z] [INFO] 
06:43:58 [2020-09-26T10:43:58.040Z] [INFO] --- tycho-packaging-plugin:1.5.0:validate-version (default-validate-version) @ org.eclipse.ease.ui.scripts.test ---
06:43:58 [2020-09-26T10:43:58.040Z] [INFO] 
06:43:58 [2020-09-26T10:43:58.040Z] [INFO] <<< maven-javadoc-plugin:2.9.1:javadoc (build-docs) < generate-sources @ org.eclipse.ease.ui.scripts.test <<<
06:43:58 [2020-09-26T10:43:58.040Z] [INFO] 
06:43:58 [2020-09-26T10:43:58.040Z] [INFO] 
06:43:58 [2020-09-26T10:43:58.040Z] [INFO] --- maven-javadoc-plugin:2.9.1:javadoc (build-docs) @ org.eclipse.ease.ui.scripts.test ---
06:43:58 [2020-09-26T10:43:58.295Z] [ERROR] Error fetching link: http://help.eclipse.org/oxygen/topic/org.eclipse.platform.doc.isv/reference/api/package-list. Ignored it.
06:43:58 [2020-09-26T10:43:58.295Z] [ERROR] Error fetching link: https://ci.eclipse.org/ease/job/ease.build.core/JavaDoc/package-list. Ignored it.
06:43:59 [2020-09-26T10:43:59.221Z] [INFO] 
06:43:59 [2020-09-26T10:43:59.221Z] Loading source files for package org.eclipse.ease.ui.scripts.expressions.definitions...
06:43:59 [2020-09-26T10:43:59.221Z] Constructing Javadoc information...
06:43:59 [2020-09-26T10:43:59.221Z] WARNING: Cannot open location "/home/jenkins/agent/workspace/ease.verify.core.target.2019-12/tests/org.eclipse.ease.ui.scripts.test/target/javadoc-bundle-options/package-list"
06:43:59 [2020-09-26T10:43:59.221Z] No plugin definition found, skipping
06:43:59 [2020-09-26T10:43:59.221Z] No plugin definition found, skipping
06:43:59 [2020-09-26T10:43:59.221Z] [WARNING] Javadoc Warnings
06:43:59 [2020-09-26T10:43:59.221Z] [WARNING] Picked up JAVA_TOOL_OPTIONS: -Dmaven.ext.class.path="/home/jenkins/agent/workspace/ease.verify.core.target.2019-12@tmp/withMaven3ef2ca9c/pipeline-maven-spy.jar" -Dorg.jenkinsci.plugins.pipeline.maven.reportsFolder="/home/jenkins/agent/workspace/ease.verify.core.target.2019-12@tmp/withMaven3ef2ca9c"
06:43:59 [2020-09-26T10:43:59.221Z] [WARNING] javadoc: warning - The old Doclet and Taglet APIs in the packages
06:43:59 [2020-09-26T10:43:59.221Z] [WARNING] com.sun.javadoc, com.sun.tools.doclets and their implementations
06:43:59 [2020-09-26T10:43:59.221Z] [WARNING] are planned to be removed in a future JDK release. These
06:43:59 [2020-09-26T10:43:59.221Z] [WARNING] components have been superseded by the new APIs in jdk.javadoc.doclet.
06:43:59 [2020-09-26T10:43:59.221Z] [WARNING] Users are strongly recommended to migrate to the new APIs.
06:43:59 [2020-09-26T10:43:59.221Z] [INFO] 
06:43:59 [2020-09-26T10:43:59.221Z] [INFO] --- build-helper-maven-plugin:1.9.1:add-resource (add_help) @ org.eclipse.ease.ui.scripts.test ---
06:43:59 [2020-09-26T10:43:59.221Z] [INFO] 
06:43:59 [2020-09-26T10:43:59.221Z] [INFO] --- maven-resources-plugin:2.4.3:resources (default-resources) @ org.eclipse.ease.ui.scripts.test ---
06:43:59 [2020-09-26T10:43:59.221Z] [INFO] Using 'UTF-8' encoding to copy filtered resources.
06:43:59 [2020-09-26T10:43:59.221Z] [INFO] skip non existing resourceDirectory /home/jenkins/agent/workspace/ease.verify.core.target.2019-12/tests/org.eclipse.ease.ui.scripts.test/src/main/resources
06:43:59 [2020-09-26T10:43:59.221Z] [INFO] skip non existing resourceDirectory /home/jenkins/agent/workspace/ease.verify.core.target.2019-12/tests/org.eclipse.ease.ui.scripts.test/help
06:43:59 [2020-09-26T10:43:59.221Z] [INFO] 
06:43:59 [2020-09-26T10:43:59.221Z] [INFO] --- tycho-compiler-plugin:1.5.0:compile (default-compile) @ org.eclipse.ease.ui.scripts.test ---
06:43:59 [2020-09-26T10:43:59.221Z] [INFO] Compiling 1 source file to /home/jenkins/agent/workspace/ease.verify.core.target.2019-12/tests/org.eclipse.ease.ui.scripts.test/target/classes
06:43:59 [2020-09-26T10:43:59.221Z] [INFO] 
06:43:59 [2020-09-26T10:43:59.221Z] [INFO] --- maven-resources-plugin:2.4.3:testResources (default-testResources) @ org.eclipse.ease.ui.scripts.test ---
06:43:59 [2020-09-26T10:43:59.221Z] [INFO] Using 'UTF-8' encoding to copy filtered resources.
06:43:59 [2020-09-26T10:43:59.221Z] [INFO] skip non existing resourceDirectory /home/jenkins/agent/workspace/ease.verify.core.target.2019-12/tests/org.eclipse.ease.ui.scripts.test/src/test/resources
06:43:59 [2020-09-26T10:43:59.221Z] [INFO] 
06:43:59 [2020-09-26T10:43:59.221Z] [INFO] --- tycho-source-plugin:1.5.0:plugin-source (plugin-source) @ org.eclipse.ease.ui.scripts.test ---
06:43:59 [2020-09-26T10:43:59.221Z] [INFO] Building jar: /home/jenkins/agent/workspace/ease.verify.core.target.2019-12/tests/org.eclipse.ease.ui.scripts.test/target/org.eclipse.ease.ui.scripts.test-0.8.0-SNAPSHOT-sources.jar
06:43:59 [2020-09-26T10:43:59.221Z] [INFO] 
06:43:59 [2020-09-26T10:43:59.221Z] [INFO] --- target-platform-configuration:1.5.0:target-platform (default-target-platform) @ org.eclipse.ease.ui.scripts.test ---
06:43:59 [2020-09-26T10:43:59.221Z] [INFO] 
06:43:59 [2020-09-26T10:43:59.221Z] [INFO] --- tycho-packaging-plugin:1.5.0:package-plugin (default-package-plugin) @ org.eclipse.ease.ui.scripts.test ---
06:43:59 [2020-09-26T10:43:59.221Z] [INFO] Building jar: /home/jenkins/agent/workspace/ease.verify.core.target.2019-12/tests/org.eclipse.ease.ui.scripts.test/target/org.eclipse.ease.ui.scripts.test-0.8.0-SNAPSHOT.jar
06:43:59 [2020-09-26T10:43:59.221Z] [INFO] 
06:43:59 [2020-09-26T10:43:59.221Z] [INFO] --- tycho-p2-plugin:1.5.0:p2-metadata-default (default-p2-metadata-default) @ org.eclipse.ease.ui.scripts.test ---
06:43:59 [2020-09-26T10:43:59.222Z] [INFO] 
06:43:59 [2020-09-26T10:43:59.222Z] [INFO] --- tycho-source-feature-plugin:1.5.0:source-feature (source-feature) @ org.eclipse.ease.ui.scripts.test ---
06:43:59 [2020-09-26T10:43:59.222Z] [INFO] 
06:43:59 [2020-09-26T10:43:59.222Z] [INFO] --- tycho-p2-plugin:1.5.0:p2-metadata (attached-p2-metadata) @ org.eclipse.ease.ui.scripts.test ---
06:43:59 [2020-09-26T10:43:59.222Z] [INFO] 
06:43:59 [2020-09-26T10:43:59.222Z] [INFO] --- tycho-surefire-plugin:1.5.0:test (default-test) @ org.eclipse.ease.ui.scripts.test ---
06:43:59 [2020-09-26T10:43:59.488Z] [INFO] Expected eclipse log file: /home/jenkins/agent/workspace/ease.verify.core.target.2019-12/tests/org.eclipse.ease.ui.scripts.test/target/work/data/.metadata/.log
06:43:59 [2020-09-26T10:43:59.488Z] [INFO] Command line:
06:43:59 [2020-09-26T10:43:59.488Z] 	[/opt/tools/java/openjdk/jdk-11/11.0.2+9/bin/java, -Dosgi.noShutdown=false, -Dosgi.os=linux, -Dosgi.ws=gtk, -Dosgi.arch=x86_64, -Dosgi.clean=true, -jar, /home/jenkins/.m2/repository/p2/osgi/bundle/org.eclipse.equinox.launcher/1.5.800.v20200727-1323/org.eclipse.equinox.launcher-1.5.800.v20200727-1323.jar, -data, /home/jenkins/agent/workspace/ease.verify.core.target.2019-12/tests/org.eclipse.ease.ui.scripts.test/target/work/data, -install, /home/jenkins/agent/workspace/ease.verify.core.target.2019-12/tests/org.eclipse.ease.ui.scripts.test/target/work, -configuration, /home/jenkins/agent/workspace/ease.verify.core.target.2019-12/tests/org.eclipse.ease.ui.scripts.test/target/work/configuration, -application, org.eclipse.tycho.surefire.osgibooter.headlesstest, -testproperties, /home/jenkins/agent/workspace/ease.verify.core.target.2019-12/tests/org.eclipse.ease.ui.scripts.test/target/surefire.properties]
06:43:59 [2020-09-26T10:43:59.488Z] Picked up JAVA_TOOL_OPTIONS: -Dmaven.ext.class.path="/home/jenkins/agent/workspace/ease.verify.core.target.2019-12@tmp/withMaven3ef2ca9c/pipeline-maven-spy.jar" -Dorg.jenkinsci.plugins.pipeline.maven.reportsFolder="/home/jenkins/agent/workspace/ease.verify.core.target.2019-12@tmp/withMaven3ef2ca9c" 
06:44:01 [2020-09-26T10:44:01.376Z] Running org.eclipse.ease.ui.scripts.expressions.definitions.ExpressionFactoryTest
06:44:01 [2020-09-26T10:44:01.376Z] Tests run: 14, Failures: 0, Errors: 0, Skipped: 0, Time elapsed: 0.047 s - in org.eclipse.ease.ui.scripts.expressions.definitions.ExpressionFactoryTest
06:44:01 [2020-09-26T10:44:01.376Z] loadClassWithExpression  Time elapsed: 0.007 s
06:44:01 [2020-09-26T10:44:01.376Z] createWithExpression  Time elapsed: 0.001 s
06:44:01 [2020-09-26T10:44:01.376Z] createReferenceExpression  Time elapsed: 0.001 s
06:44:01 [2020-09-26T10:44:01.376Z] loadClassReferenceExpression  Time elapsed: 0 s
06:44:01 [2020-09-26T10:44:01.376Z] loadClassTestExpression  Time elapsed: 0 s
06:44:01 [2020-09-26T10:44:01.376Z] createEqualsExpression  Time elapsed: 0.001 s
06:44:01 [2020-09-26T10:44:01.376Z] loadClassCountExpression  Time elapsed: 0.001 s
06:44:01 [2020-09-26T10:44:01.376Z] loadClassOrExpression  Time elapsed: 0 s
06:44:01 [2020-09-26T10:44:01.376Z] createTestExpression  Time elapsed: 0.001 s
06:44:01 [2020-09-26T10:44:01.376Z] createOrExpression  Time elapsed: 0 s
06:44:01 [2020-09-26T10:44:01.376Z] loadClassAndExpression  Time elapsed: 0 s
06:44:01 [2020-09-26T10:44:01.376Z] createAndExpression  Time elapsed: 0.001 s
06:44:01 [2020-09-26T10:44:01.376Z] loadClassEqualsExpression  Time elapsed: 0 s
06:44:01 [2020-09-26T10:44:01.376Z] createCountExpression  Time elapsed: 0 s
06:44:01 [2020-09-26T10:44:01.376Z] 
06:44:01 [2020-09-26T10:44:01.376Z] Results:
06:44:01 [2020-09-26T10:44:01.376Z] 
06:44:01 [2020-09-26T10:44:01.376Z] Tests run: 14, Failures: 0, Errors: 0, Skipped: 0
06:44:01 [2020-09-26T10:44:01.376Z] 
06:44:01 [2020-09-26T10:44:01.937Z] [INFO] All tests passed!
06:44:01 [2020-09-26T10:44:01.937Z] [INFO] 
06:44:01 [2020-09-26T10:44:01.937Z] [INFO] --- maven-install-plugin:2.3.1:install (default-install) @ org.eclipse.ease.ui.scripts.test ---
06:44:01 [2020-09-26T10:44:01.937Z] [INFO] Installing /home/jenkins/agent/workspace/ease.verify.core.target.2019-12/tests/org.eclipse.ease.ui.scripts.test/target/org.eclipse.ease.ui.scripts.test-0.8.0-SNAPSHOT.jar to /home/jenkins/.m2/repository/org/eclipse/ease/org.eclipse.ease.ui.scripts.test/0.8.0-SNAPSHOT/org.eclipse.ease.ui.scripts.test-0.8.0-SNAPSHOT.jar
06:44:01 [2020-09-26T10:44:01.937Z] [INFO] Installing /home/jenkins/agent/workspace/ease.verify.core.target.2019-12/tests/org.eclipse.ease.ui.scripts.test/pom.xml to /home/jenkins/.m2/repository/org/eclipse/ease/org.eclipse.ease.ui.scripts.test/0.8.0-SNAPSHOT/org.eclipse.ease.ui.scripts.test-0.8.0-SNAPSHOT.pom
06:44:01 [2020-09-26T10:44:01.937Z] [INFO] Installing /home/jenkins/agent/workspace/ease.verify.core.target.2019-12/tests/org.eclipse.ease.ui.scripts.test/target/org.eclipse.ease.ui.scripts.test-0.8.0-SNAPSHOT-sources.jar to /home/jenkins/.m2/repository/org/eclipse/ease/org.eclipse.ease.ui.scripts.test/0.8.0-SNAPSHOT/org.eclipse.ease.ui.scripts.test-0.8.0-SNAPSHOT-sources.jar
06:44:01 [2020-09-26T10:44:01.937Z] [INFO] Installing /home/jenkins/agent/workspace/ease.verify.core.target.2019-12/tests/org.eclipse.ease.ui.scripts.test/target/p2content.xml to /home/jenkins/.m2/repository/org/eclipse/ease/org.eclipse.ease.ui.scripts.test/0.8.0-SNAPSHOT/org.eclipse.ease.ui.scripts.test-0.8.0-SNAPSHOT-p2metadata.xml
06:44:01 [2020-09-26T10:44:01.937Z] [INFO] Installing /home/jenkins/agent/workspace/ease.verify.core.target.2019-12/tests/org.eclipse.ease.ui.scripts.test/target/p2artifacts.xml to /home/jenkins/.m2/repository/org/eclipse/ease/org.eclipse.ease.ui.scripts.test/0.8.0-SNAPSHOT/org.eclipse.ease.ui.scripts.test-0.8.0-SNAPSHOT-p2artifacts.xml
06:44:01 [2020-09-26T10:44:01.937Z] [INFO] Installing /home/jenkins/agent/workspace/ease.verify.core.target.2019-12/tests/org.eclipse.ease.ui.scripts.test/target/p2content.xml to /home/jenkins/.m2/repository/org/eclipse/ease/org.eclipse.ease.ui.scripts.test/0.8.0-SNAPSHOT/org.eclipse.ease.ui.scripts.test-0.8.0-SNAPSHOT-p2metadata.xml
06:44:01 [2020-09-26T10:44:01.937Z] [INFO] Installing /home/jenkins/agent/workspace/ease.verify.core.target.2019-12/tests/org.eclipse.ease.ui.scripts.test/target/p2artifacts.xml to /home/jenkins/.m2/repository/org/eclipse/ease/org.eclipse.ease.ui.scripts.test/0.8.0-SNAPSHOT/org.eclipse.ease.ui.scripts.test-0.8.0-SNAPSHOT-p2artifacts.xml
06:44:01 [2020-09-26T10:44:01.937Z] [INFO] 
06:44:01 [2020-09-26T10:44:01.937Z] [INFO] --- tycho-p2-plugin:1.5.0:update-local-index (default-update-local-index) @ org.eclipse.ease.ui.scripts.test ---
06:44:01 [2020-09-26T10:44:01.937Z] [INFO] 
06:44:01 [2020-09-26T10:44:01.937Z] [INFO] -------------< org.eclipse.ease:org.eclipse.ease.ui.test >--------------
06:44:01 [2020-09-26T10:44:01.937Z] [INFO] Building org.eclipse.ease.ui.test 0.8.0-SNAPSHOT                 [47/48]
06:44:01 [2020-09-26T10:44:01.937Z] [INFO] ------------------------[ eclipse-test-plugin ]-------------------------
06:44:01 [2020-09-26T10:44:01.937Z] [INFO] 
06:44:01 [2020-09-26T10:44:01.937Z] [INFO] --- maven-clean-plugin:2.5:clean (default-clean) @ org.eclipse.ease.ui.test ---
06:44:01 [2020-09-26T10:44:01.937Z] [INFO] 
06:44:01 [2020-09-26T10:44:01.937Z] [INFO] --- tycho-packaging-plugin:1.5.0:build-qualifier (default-build-qualifier) @ org.eclipse.ease.ui.test ---
06:44:01 [2020-09-26T10:44:01.937Z] [INFO] The project's OSGi version is 0.8.0.I201910171213
06:44:01 [2020-09-26T10:44:01.937Z] [INFO] 
06:44:01 [2020-09-26T10:44:01.937Z] [INFO] --- tycho-packaging-plugin:1.5.0:validate-id (default-validate-id) @ org.eclipse.ease.ui.test ---
06:44:01 [2020-09-26T10:44:01.937Z] [INFO] 
06:44:01 [2020-09-26T10:44:01.937Z] [INFO] --- tycho-packaging-plugin:1.5.0:validate-version (default-validate-version) @ org.eclipse.ease.ui.test ---
06:44:01 [2020-09-26T10:44:01.937Z] [INFO] 
06:44:01 [2020-09-26T10:44:01.937Z] [INFO] >>> maven-javadoc-plugin:2.9.1:javadoc (build-docs) > generate-sources @ org.eclipse.ease.ui.test >>>
06:44:01 [2020-09-26T10:44:01.937Z] [INFO] 
06:44:01 [2020-09-26T10:44:01.937Z] [INFO] --- tycho-packaging-plugin:1.5.0:build-qualifier (default-build-qualifier) @ org.eclipse.ease.ui.test ---
06:44:01 [2020-09-26T10:44:01.937Z] [INFO] The project's OSGi version is 0.8.0.I201910171213
06:44:01 [2020-09-26T10:44:01.937Z] [INFO] 
06:44:01 [2020-09-26T10:44:01.937Z] [INFO] --- tycho-packaging-plugin:1.5.0:validate-id (default-validate-id) @ org.eclipse.ease.ui.test ---
06:44:01 [2020-09-26T10:44:01.937Z] [INFO] 
06:44:01 [2020-09-26T10:44:01.937Z] [INFO] --- tycho-packaging-plugin:1.5.0:validate-version (default-validate-version) @ org.eclipse.ease.ui.test ---
06:44:01 [2020-09-26T10:44:01.937Z] [INFO] 
06:44:01 [2020-09-26T10:44:01.937Z] [INFO] <<< maven-javadoc-plugin:2.9.1:javadoc (build-docs) < generate-sources @ org.eclipse.ease.ui.test <<<
06:44:01 [2020-09-26T10:44:01.937Z] [INFO] 
06:44:01 [2020-09-26T10:44:01.937Z] [INFO] 
06:44:01 [2020-09-26T10:44:01.937Z] [INFO] --- maven-javadoc-plugin:2.9.1:javadoc (build-docs) @ org.eclipse.ease.ui.test ---
06:44:02 [2020-09-26T10:44:02.193Z] [ERROR] Error fetching link: http://help.eclipse.org/oxygen/topic/org.eclipse.platform.doc.isv/reference/api/package-list. Ignored it.
06:44:02 [2020-09-26T10:44:02.193Z] [ERROR] Error fetching link: https://ci.eclipse.org/ease/job/ease.build.core/JavaDoc/package-list. Ignored it.
06:44:03 [2020-09-26T10:44:03.119Z] [INFO] 
06:44:03 [2020-09-26T10:44:03.119Z] Loading source files for package org.eclipse.ease.ui.completion...
06:44:03 [2020-09-26T10:44:03.119Z] Loading source files for package org.eclipse.ease.ui.completion.provider...
06:44:03 [2020-09-26T10:44:03.119Z] Loading source files for package org.eclipse.ease.ui.completions.java.provider...
06:44:03 [2020-09-26T10:44:03.119Z] Loading source files for package org.eclipse.ease.ui.help.hovers...
06:44:03 [2020-09-26T10:44:03.119Z] Constructing Javadoc information...
06:44:03 [2020-09-26T10:44:03.119Z] WARNING: Cannot open location "/home/jenkins/agent/workspace/ease.verify.core.target.2019-12/tests/org.eclipse.ease.ui.test/target/javadoc-bundle-options/package-list"
06:44:03 [2020-09-26T10:44:03.119Z] [WARNING] Javadoc Warnings
06:44:03 [2020-09-26T10:44:03.119Z] [WARNING] Picked up JAVA_TOOL_OPTIONS: -Dmaven.ext.class.path="/home/jenkins/agent/workspace/ease.verify.core.target.2019-12@tmp/withMaven3ef2ca9c/pipeline-maven-spy.jar" -Dorg.jenkinsci.plugins.pipeline.maven.reportsFolder="/home/jenkins/agent/workspace/ease.verify.core.target.2019-12@tmp/withMaven3ef2ca9c"
06:44:03 [2020-09-26T10:44:03.119Z] [WARNING] javadoc: warning - The old Doclet and Taglet APIs in the packages
06:44:03 [2020-09-26T10:44:03.119Z] [WARNING] com.sun.javadoc, com.sun.tools.doclets and their implementations
06:44:03 [2020-09-26T10:44:03.119Z] [WARNING] are planned to be removed in a future JDK release. These
06:44:03 [2020-09-26T10:44:03.119Z] [WARNING] components have been superseded by the new APIs in jdk.javadoc.doclet.
06:44:03 [2020-09-26T10:44:03.120Z] [WARNING] Users are strongly recommended to migrate to the new APIs.
06:44:03 [2020-09-26T10:44:03.120Z] [INFO] 
06:44:03 [2020-09-26T10:44:03.120Z] [INFO] --- build-helper-maven-plugin:1.9.1:add-resource (add_help) @ org.eclipse.ease.ui.test ---
06:44:03 [2020-09-26T10:44:03.120Z] [INFO] 
06:44:03 [2020-09-26T10:44:03.120Z] [INFO] --- maven-resources-plugin:2.4.3:resources (default-resources) @ org.eclipse.ease.ui.test ---
06:44:03 [2020-09-26T10:44:03.120Z] [INFO] Using 'UTF-8' encoding to copy filtered resources.
06:44:03 [2020-09-26T10:44:03.120Z] [INFO] skip non existing resourceDirectory /home/jenkins/agent/workspace/ease.verify.core.target.2019-12/tests/org.eclipse.ease.ui.test/src/main/resources
06:44:03 [2020-09-26T10:44:03.120Z] [INFO] Copying 2 resources to help
06:44:03 [2020-09-26T10:44:03.120Z] [INFO] 
06:44:03 [2020-09-26T10:44:03.120Z] [INFO] --- tycho-compiler-plugin:1.5.0:compile (default-compile) @ org.eclipse.ease.ui.test ---
06:44:03 [2020-09-26T10:44:03.120Z] [INFO] Compiling 6 source files to /home/jenkins/agent/workspace/ease.verify.core.target.2019-12/tests/org.eclipse.ease.ui.test/target/classes
06:44:03 [2020-09-26T10:44:03.388Z] [INFO] 
06:44:03 [2020-09-26T10:44:03.388Z] [INFO] --- maven-resources-plugin:2.4.3:testResources (default-testResources) @ org.eclipse.ease.ui.test ---
06:44:03 [2020-09-26T10:44:03.388Z] [INFO] Using 'UTF-8' encoding to copy filtered resources.
06:44:03 [2020-09-26T10:44:03.388Z] [INFO] skip non existing resourceDirectory /home/jenkins/agent/workspace/ease.verify.core.target.2019-12/tests/org.eclipse.ease.ui.test/src/test/resources
06:44:03 [2020-09-26T10:44:03.388Z] [INFO] 
06:44:03 [2020-09-26T10:44:03.389Z] [INFO] --- tycho-source-plugin:1.5.0:plugin-source (plugin-source) @ org.eclipse.ease.ui.test ---
06:44:03 [2020-09-26T10:44:03.389Z] [WARNING] Bundle-Vendor header not found in /home/jenkins/agent/workspace/ease.verify.core.target.2019-12/tests/org.eclipse.ease.ui.test/META-INF/MANIFEST.MF, fallback to 'unknown' for source bundle
06:44:03 [2020-09-26T10:44:03.389Z] [INFO] Building jar: /home/jenkins/agent/workspace/ease.verify.core.target.2019-12/tests/org.eclipse.ease.ui.test/target/org.eclipse.ease.ui.test-0.8.0-SNAPSHOT-sources.jar
06:44:03 [2020-09-26T10:44:03.389Z] [INFO] 
06:44:03 [2020-09-26T10:44:03.389Z] [INFO] --- target-platform-configuration:1.5.0:target-platform (default-target-platform) @ org.eclipse.ease.ui.test ---
06:44:03 [2020-09-26T10:44:03.389Z] [INFO] 
06:44:03 [2020-09-26T10:44:03.389Z] [INFO] --- tycho-packaging-plugin:1.5.0:package-plugin (default-package-plugin) @ org.eclipse.ease.ui.test ---
06:44:03 [2020-09-26T10:44:03.389Z] [INFO] Building jar: /home/jenkins/agent/workspace/ease.verify.core.target.2019-12/tests/org.eclipse.ease.ui.test/target/org.eclipse.ease.ui.test-0.8.0-SNAPSHOT.jar
06:44:03 [2020-09-26T10:44:03.389Z] [INFO] 
06:44:03 [2020-09-26T10:44:03.389Z] [INFO] --- tycho-p2-plugin:1.5.0:p2-metadata-default (default-p2-metadata-default) @ org.eclipse.ease.ui.test ---
06:44:03 [2020-09-26T10:44:03.389Z] [INFO] 
06:44:03 [2020-09-26T10:44:03.389Z] [INFO] --- tycho-source-feature-plugin:1.5.0:source-feature (source-feature) @ org.eclipse.ease.ui.test ---
06:44:03 [2020-09-26T10:44:03.389Z] [INFO] 
06:44:03 [2020-09-26T10:44:03.389Z] [INFO] --- tycho-p2-plugin:1.5.0:p2-metadata (attached-p2-metadata) @ org.eclipse.ease.ui.test ---
06:44:03 [2020-09-26T10:44:03.389Z] [INFO] 
06:44:03 [2020-09-26T10:44:03.389Z] [INFO] --- tycho-surefire-plugin:1.5.0:test (default-test) @ org.eclipse.ease.ui.test ---
06:44:03 [2020-09-26T10:44:03.389Z] [INFO] Expected eclipse log file: /home/jenkins/agent/workspace/ease.verify.core.target.2019-12/tests/org.eclipse.ease.ui.test/target/work/data/.metadata/.log
06:44:03 [2020-09-26T10:44:03.389Z] [INFO] Command line:
06:44:03 [2020-09-26T10:44:03.389Z] 	[/opt/tools/java/openjdk/jdk-11/11.0.2+9/bin/java, -Dosgi.noShutdown=false, -Dosgi.os=linux, -Dosgi.ws=gtk, -Dosgi.arch=x86_64, -Dosgi.clean=true, -jar, /home/jenkins/.m2/repository/p2/osgi/bundle/org.eclipse.equinox.launcher/1.5.800.v20200727-1323/org.eclipse.equinox.launcher-1.5.800.v20200727-1323.jar, -data, /home/jenkins/agent/workspace/ease.verify.core.target.2019-12/tests/org.eclipse.ease.ui.test/target/work/data, -install, /home/jenkins/agent/workspace/ease.verify.core.target.2019-12/tests/org.eclipse.ease.ui.test/target/work, -configuration, /home/jenkins/agent/workspace/ease.verify.core.target.2019-12/tests/org.eclipse.ease.ui.test/target/work/configuration, -application, org.eclipse.tycho.surefire.osgibooter.headlesstest, -testproperties, /home/jenkins/agent/workspace/ease.verify.core.target.2019-12/tests/org.eclipse.ease.ui.test/target/surefire.properties]
06:44:03 [2020-09-26T10:44:03.389Z] Picked up JAVA_TOOL_OPTIONS: -Dmaven.ext.class.path="/home/jenkins/agent/workspace/ease.verify.core.target.2019-12@tmp/withMaven3ef2ca9c/pipeline-maven-spy.jar" -Dorg.jenkinsci.plugins.pipeline.maven.reportsFolder="/home/jenkins/agent/workspace/ease.verify.core.target.2019-12@tmp/withMaven3ef2ca9c" 
06:44:05 [2020-09-26T10:44:05.312Z] Running org.eclipse.ease.ui.help.hovers.ModuleHelpTest
06:44:05 [2020-09-26T10:44:05.312Z] Tests run: 4, Failures: 0, Errors: 0, Skipped: 4, Time elapsed: 0.029 s - in org.eclipse.ease.ui.help.hovers.ModuleHelpTest
06:44:05 [2020-09-26T10:44:05.312Z] getModuleHelpLocation(org.eclipse.ease.ui.help.hovers.ModuleHelpTest) skipped
06:44:05 [2020-09-26T10:44:05.312Z] getModuleHelp(org.eclipse.ease.ui.help.hovers.ModuleHelpTest) skipped
06:44:05 [2020-09-26T10:44:05.312Z] getMethodHelp(org.eclipse.ease.ui.help.hovers.ModuleHelpTest) skipped
06:44:05 [2020-09-26T10:44:05.312Z] getConstantHelp(org.eclipse.ease.ui.help.hovers.ModuleHelpTest) skipped
06:44:05 [2020-09-26T10:44:05.312Z] Running org.eclipse.ease.ui.completions.java.provider.JavaClassCompletionsProviderTest
06:44:05 [2020-09-26T10:44:05.312Z] WARNING: An illegal reflective access operation has occurred
06:44:05 [2020-09-26T10:44:05.312Z] WARNING: Illegal reflective access by org.mockito.cglib.core.ReflectUtils$2 (file:/home/jenkins/.m2/repository/p2/osgi/bundle/org.mockito/1.9.5.v201605172210/org.mockito-1.9.5.v201605172210.jar) to method java.lang.ClassLoader.defineClass(java.lang.String,byte[],int,int,java.security.ProtectionDomain)
06:44:05 [2020-09-26T10:44:05.312Z] WARNING: Please consider reporting this to the maintainers of org.mockito.cglib.core.ReflectUtils$2
06:44:05 [2020-09-26T10:44:05.312Z] WARNING: Use --illegal-access=warn to enable warnings of further illegal reflective access operations
06:44:05 [2020-09-26T10:44:05.312Z] WARNING: All illegal access operations will be denied in a future release
06:44:11 [2020-09-26T10:44:11.850Z] Tests run: 6, Failures: 0, Errors: 0, Skipped: 0, Time elapsed: 6.022 s - in org.eclipse.ease.ui.completions.java.provider.JavaClassCompletionsProviderTest
06:44:11 [2020-09-26T10:44:11.850Z] containsPackageFileCompletion(org.eclipse.ease.ui.completions.java.provider.JavaClassCompletionsProviderTest)  Time elapsed: 0.089 s
06:44:11 [2020-09-26T10:44:11.850Z] containsGlobalFileCompletion(org.eclipse.ease.ui.completions.java.provider.JavaClassCompletionsProviderTest)  Time elapsed: 0.157 s
06:44:11 [2020-09-26T10:44:11.850Z] containsJavaLangPackageProposal(org.eclipse.ease.ui.completions.java.provider.JavaClassCompletionsProviderTest)  Time elapsed: 0.312 s
06:44:11 [2020-09-26T10:44:11.850Z] containsOrgRootPackageProposal(org.eclipse.ease.ui.completions.java.provider.JavaClassCompletionsProviderTest)  Time elapsed: 0.007 s
06:44:11 [2020-09-26T10:44:11.850Z] containsJavaRootPackageProposal(org.eclipse.ease.ui.completions.java.provider.JavaClassCompletionsProviderTest)  Time elapsed: 0.006 s
06:44:11 [2020-09-26T10:44:11.850Z] containsOrgEclipsePackageProposal(org.eclipse.ease.ui.completions.java.provider.JavaClassCompletionsProviderTest)  Time elapsed: 0.048 s
06:44:11 [2020-09-26T10:44:11.850Z] Running org.eclipse.ease.ui.completions.java.provider.JavaPackagesCompletionsProviderTest
06:44:17 [2020-09-26T10:44:17.093Z] Tests run: 4, Failures: 0, Errors: 0, Skipped: 0, Time elapsed: 5.112 s - in org.eclipse.ease.ui.completions.java.provider.JavaPackagesCompletionsProviderTest
06:44:17 [2020-09-26T10:44:17.093Z] containsJavaLangPackageProposal(org.eclipse.ease.ui.completions.java.provider.JavaPackagesCompletionsProviderTest)  Time elapsed: 0.049 s
06:44:17 [2020-09-26T10:44:17.093Z] containsOrgRootPackageProposal(org.eclipse.ease.ui.completions.java.provider.JavaPackagesCompletionsProviderTest)  Time elapsed: 0.006 s
06:44:17 [2020-09-26T10:44:17.093Z] containsJavaRootPackageProposal(org.eclipse.ease.ui.completions.java.provider.JavaPackagesCompletionsProviderTest)  Time elapsed: 0.005 s
06:44:17 [2020-09-26T10:44:17.093Z] containsOrgEclipsePackageProposal(org.eclipse.ease.ui.completions.java.provider.JavaPackagesCompletionsProviderTest)  Time elapsed: 0.046 s
06:44:17 [2020-09-26T10:44:17.093Z] Running org.eclipse.ease.ui.completion.CompletionContextTest
06:44:17 [2020-09-26T10:44:17.093Z] Tests run: 9, Failures: 0, Errors: 0, Skipped: 0, Time elapsed: 0.004 s - in org.eclipse.ease.ui.completion.CompletionContextTest
06:44:17 [2020-09-26T10:44:17.093Z] resolveStaticClass(org.eclipse.ease.ui.completion.CompletionContextTest)  Time elapsed: 0.002 s
06:44:17 [2020-09-26T10:44:17.093Z] resolveClassWithFilter(org.eclipse.ease.ui.completion.CompletionContextTest)  Time elapsed: 0 s
06:44:17 [2020-09-26T10:44:17.093Z] simplifyCalls(org.eclipse.ease.ui.completion.CompletionContextTest)  Time elapsed: 0 s
06:44:17 [2020-09-26T10:44:17.093Z] resolveClass(org.eclipse.ease.ui.completion.CompletionContextTest)  Time elapsed: 0.001 s
06:44:17 [2020-09-26T10:44:17.093Z] replaceEscapedStringLiterals(org.eclipse.ease.ui.completion.CompletionContextTest)  Time elapsed: 0 s
06:44:17 [2020-09-26T10:44:17.093Z] replaceSimpleStringLiterals(org.eclipse.ease.ui.completion.CompletionContextTest)  Time elapsed: 0 s
06:44:17 [2020-09-26T10:44:17.093Z] resolveStaticClassWithFilter(org.eclipse.ease.ui.completion.CompletionContextTest)  Time elapsed: 0 s
06:44:17 [2020-09-26T10:44:17.093Z] resolveClassWithParameters(org.eclipse.ease.ui.completion.CompletionContextTest)  Time elapsed: 0 s
06:44:17 [2020-09-26T10:44:17.093Z] replaceMultipleStringLiterals(org.eclipse.ease.ui.completion.CompletionContextTest)  Time elapsed: 0 s
06:44:17 [2020-09-26T10:44:17.093Z] Running org.eclipse.ease.ui.completion.provider.AbstractFileLocationCompletionProviderTest
06:44:17 [2020-09-26T10:44:17.093Z] Tests run: 8, Failures: 0, Errors: 0, Skipped: 8, Time elapsed: 0.002 s - in org.eclipse.ease.ui.completion.provider.AbstractFileLocationCompletionProviderTest
06:44:17 [2020-09-26T10:44:17.093Z] workspaceProjectProposals(org.eclipse.ease.ui.completion.provider.AbstractFileLocationCompletionProviderTest) skipped
06:44:17 [2020-09-26T10:44:17.093Z] checkOperatingSystem(org.eclipse.ease.ui.completion.provider.AbstractFileLocationCompletionProviderTest) skipped
06:44:17 [2020-09-26T10:44:17.093Z] absoluteRootWorkspaceProposals(org.eclipse.ease.ui.completion.provider.AbstractFileLocationCompletionProviderTest) skipped
06:44:17 [2020-09-26T10:44:17.093Z] workspaceFolderProposals(org.eclipse.ease.ui.completion.provider.AbstractFileLocationCompletionProviderTest) skipped
06:44:17 [2020-09-26T10:44:17.093Z] fileSystemFolderProposals(org.eclipse.ease.ui.completion.provider.AbstractFileLocationCompletionProviderTest) skipped
06:44:17 [2020-09-26T10:44:17.093Z] workspaceProposals(org.eclipse.ease.ui.completion.provider.AbstractFileLocationCompletionProviderTest) skipped
06:44:17 [2020-09-26T10:44:17.093Z] relativeRootWorkspaceProposals(org.eclipse.ease.ui.completion.provider.AbstractFileLocationCompletionProviderTest) skipped
06:44:17 [2020-09-26T10:44:17.093Z] fileSystemRootProposals(org.eclipse.ease.ui.completion.provider.AbstractFileLocationCompletionProviderTest) skipped
06:44:17 [2020-09-26T10:44:17.093Z] 
06:44:17 [2020-09-26T10:44:17.093Z] Results:
06:44:17 [2020-09-26T10:44:17.093Z] 
06:44:17 [2020-09-26T10:44:17.093Z] Tests run: 31, Failures: 0, Errors: 0, Skipped: 12
06:44:17 [2020-09-26T10:44:17.093Z] 
06:44:17 [2020-09-26T10:44:17.654Z] [INFO] All tests passed!
06:44:17 [2020-09-26T10:44:17.654Z] [INFO] 
06:44:17 [2020-09-26T10:44:17.654Z] [INFO] --- maven-install-plugin:2.3.1:install (default-install) @ org.eclipse.ease.ui.test ---
06:44:17 [2020-09-26T10:44:17.655Z] [INFO] Installing /home/jenkins/agent/workspace/ease.verify.core.target.2019-12/tests/org.eclipse.ease.ui.test/target/org.eclipse.ease.ui.test-0.8.0-SNAPSHOT.jar to /home/jenkins/.m2/repository/org/eclipse/ease/org.eclipse.ease.ui.test/0.8.0-SNAPSHOT/org.eclipse.ease.ui.test-0.8.0-SNAPSHOT.jar
06:44:17 [2020-09-26T10:44:17.655Z] [INFO] Installing /home/jenkins/agent/workspace/ease.verify.core.target.2019-12/tests/org.eclipse.ease.ui.test/pom.xml to /home/jenkins/.m2/repository/org/eclipse/ease/org.eclipse.ease.ui.test/0.8.0-SNAPSHOT/org.eclipse.ease.ui.test-0.8.0-SNAPSHOT.pom
06:44:17 [2020-09-26T10:44:17.655Z] [INFO] Installing /home/jenkins/agent/workspace/ease.verify.core.target.2019-12/tests/org.eclipse.ease.ui.test/target/org.eclipse.ease.ui.test-0.8.0-SNAPSHOT-sources.jar to /home/jenkins/.m2/repository/org/eclipse/ease/org.eclipse.ease.ui.test/0.8.0-SNAPSHOT/org.eclipse.ease.ui.test-0.8.0-SNAPSHOT-sources.jar
06:44:17 [2020-09-26T10:44:17.655Z] [INFO] Installing /home/jenkins/agent/workspace/ease.verify.core.target.2019-12/tests/org.eclipse.ease.ui.test/target/p2content.xml to /home/jenkins/.m2/repository/org/eclipse/ease/org.eclipse.ease.ui.test/0.8.0-SNAPSHOT/org.eclipse.ease.ui.test-0.8.0-SNAPSHOT-p2metadata.xml
06:44:17 [2020-09-26T10:44:17.655Z] [INFO] Installing /home/jenkins/agent/workspace/ease.verify.core.target.2019-12/tests/org.eclipse.ease.ui.test/target/p2artifacts.xml to /home/jenkins/.m2/repository/org/eclipse/ease/org.eclipse.ease.ui.test/0.8.0-SNAPSHOT/org.eclipse.ease.ui.test-0.8.0-SNAPSHOT-p2artifacts.xml
06:44:17 [2020-09-26T10:44:17.655Z] [INFO] Installing /home/jenkins/agent/workspace/ease.verify.core.target.2019-12/tests/org.eclipse.ease.ui.test/target/p2content.xml to /home/jenkins/.m2/repository/org/eclipse/ease/org.eclipse.ease.ui.test/0.8.0-SNAPSHOT/org.eclipse.ease.ui.test-0.8.0-SNAPSHOT-p2metadata.xml
06:44:17 [2020-09-26T10:44:17.655Z] [INFO] Installing /home/jenkins/agent/workspace/ease.verify.core.target.2019-12/tests/org.eclipse.ease.ui.test/target/p2artifacts.xml to /home/jenkins/.m2/repository/org/eclipse/ease/org.eclipse.ease.ui.test/0.8.0-SNAPSHOT/org.eclipse.ease.ui.test-0.8.0-SNAPSHOT-p2artifacts.xml
06:44:17 [2020-09-26T10:44:17.655Z] [INFO] 
06:44:17 [2020-09-26T10:44:17.655Z] [INFO] --- tycho-p2-plugin:1.5.0:update-local-index (default-update-local-index) @ org.eclipse.ease.ui.test ---
06:44:17 [2020-09-26T10:44:17.655Z] [INFO] 
06:44:17 [2020-09-26T10:44:17.655Z] [INFO] ---------------------< org.eclipse.ease:ease.core >---------------------
06:44:17 [2020-09-26T10:44:17.655Z] [INFO] Building EASE (Incubation) 0.4.0-SNAPSHOT                        [48/48]
06:44:17 [2020-09-26T10:44:17.655Z] [INFO] --------------------------------[ pom ]---------------------------------
06:44:17 [2020-09-26T10:44:17.910Z] [INFO] 
06:44:17 [2020-09-26T10:44:17.910Z] [INFO] --- maven-clean-plugin:2.5:clean (default-clean) @ ease.core ---
06:44:18 [2020-09-26T10:44:18.166Z] [INFO] 
06:44:18 [2020-09-26T10:44:18.166Z] [INFO] --- maven-install-plugin:2.4:install (default-install) @ ease.core ---
06:44:18 [2020-09-26T10:44:18.166Z] [INFO] Installing /home/jenkins/agent/workspace/ease.verify.core.target.2019-12/pom.xml to /home/jenkins/.m2/repository/org/eclipse/ease/ease.core/0.4.0-SNAPSHOT/ease.core-0.4.0-SNAPSHOT.pom
06:44:18 [2020-09-26T10:44:18.166Z] [INFO] ------------------------------------------------------------------------
06:44:18 [2020-09-26T10:44:18.166Z] [INFO] Reactor Summary:
06:44:18 [2020-09-26T10:44:18.166Z] [INFO] 
06:44:18 [2020-09-26T10:44:18.166Z] [INFO] org.eclipse.ease.releng 0.8.0-SNAPSHOT ............. SUCCESS [ 30.106 s]
06:44:18 [2020-09-26T10:44:18.166Z] [INFO] org.eclipse.ease.classloader 0.8.0-SNAPSHOT ........ SUCCESS [ 24.462 s]
06:44:18 [2020-09-26T10:44:18.166Z] [INFO] org.eclipse.ease 0.8.0-SNAPSHOT .................... SUCCESS [  3.339 s]
06:44:18 [2020-09-26T10:44:18.166Z] [INFO] org.eclipse.ease.ui 0.8.0-SNAPSHOT ................. SUCCESS [  2.986 s]
06:44:18 [2020-09-26T10:44:18.166Z] [INFO] org.eclipse.ease.ui.completions.java 0.8.0-SNAPSHOT  SUCCESS [  2.068 s]
06:44:18 [2020-09-26T10:44:18.166Z] [INFO] org.eclipse.ease.ui.scripts 0.8.0-SNAPSHOT ......... SUCCESS [  2.831 s]
06:44:18 [2020-09-26T10:44:18.166Z] [INFO] org.eclipse.ease.lang.javascript 0.8.0-SNAPSHOT .... SUCCESS [  1.489 s]
06:44:18 [2020-09-26T10:44:18.166Z] [INFO] org.eclipse.ease.lang.scriptarchive 0.8.0-SNAPSHOT . SUCCESS [  1.581 s]
06:44:18 [2020-09-26T10:44:18.166Z] [INFO] org.eclipse.ease.lang.python 0.8.0-SNAPSHOT ........ SUCCESS [  1.750 s]
06:44:18 [2020-09-26T10:44:18.166Z] [INFO] org.eclipse.ease.lang.python.py4j 0.8.0-SNAPSHOT ... SUCCESS [  1.898 s]
06:44:18 [2020-09-26T10:44:18.166Z] [INFO] org.eclipse.ease.lang.groovy 0.8.0-SNAPSHOT ........ SUCCESS [  1.501 s]
06:44:18 [2020-09-26T10:44:18.166Z] [INFO] org.eclipse.ease.lang.groovy.interpreter 0.8.0-SNAPSHOT SUCCESS [  1.767 s]
06:44:18 [2020-09-26T10:44:18.166Z] [INFO] org.eclipse.ease.lang.unittest 0.8.0-SNAPSHOT ...... SUCCESS [  2.099 s]
06:44:18 [2020-09-26T10:44:18.166Z] [INFO] org.eclipse.ease.lang.unittest.ui 0.8.0-SNAPSHOT ... SUCCESS [  2.007 s]
06:44:18 [2020-09-26T10:44:18.166Z] [INFO] org.eclipse.ease.lang.ruby 0.8.0-SNAPSHOT .......... SUCCESS [  1.331 s]
06:44:18 [2020-09-26T10:44:18.166Z] [INFO] org.eclipse.ease.lang.ruby.jruby 0.8.0-SNAPSHOT .... SUCCESS [  1.525 s]
06:44:18 [2020-09-26T10:44:18.166Z] [INFO] org.eclipse.ease.lang.javascript.nashorn 0.8.0-SNAPSHOT SUCCESS [  1.419 s]
06:44:18 [2020-09-26T10:44:18.166Z] [INFO] org.eclipse.ease.lang.javascript.rhino 0.8.0-SNAPSHOT SUCCESS [  1.819 s]
06:44:18 [2020-09-26T10:44:18.166Z] [INFO] org.eclipse.ease.lang.python.jython 0.8.0-SNAPSHOT . SUCCESS [  1.828 s]
06:44:18 [2020-09-26T10:44:18.166Z] [INFO] org.eclipse.ease.lang.javascript.ui 0.8.0-SNAPSHOT . SUCCESS [  1.482 s]
06:44:18 [2020-09-26T10:44:18.166Z] [INFO] org.eclipse.ease.lang.jvm.compiled 0.8.0-SNAPSHOT .. SUCCESS [  1.400 s]
06:44:18 [2020-09-26T10:44:18.166Z] [INFO] org.eclipse.ease.lang.scriptarchive.ui 0.8.0-SNAPSHOT SUCCESS [  1.601 s]
06:44:18 [2020-09-26T10:44:18.166Z] [INFO] org.eclipse.ease.help 0.8.0-SNAPSHOT ............... SUCCESS [  0.200 s]
06:44:18 [2020-09-26T10:44:18.166Z] [INFO] org.eclipse.ease.feature 0.8.0-SNAPSHOT ............ SUCCESS [  0.195 s]
06:44:18 [2020-09-26T10:44:18.166Z] [INFO] org.eclipse.ease.ui.feature 0.8.0-SNAPSHOT ......... SUCCESS [  0.189 s]
06:44:18 [2020-09-26T10:44:18.166Z] [INFO] org.eclipse.ease.lang.javascript.feature 0.8.0-SNAPSHOT SUCCESS [  0.108 s]
06:44:18 [2020-09-26T10:44:18.166Z] [INFO] org.eclipse.ease.lang.python.feature 0.8.0-SNAPSHOT  SUCCESS [  0.124 s]
06:44:18 [2020-09-26T10:44:18.166Z] [INFO] org.eclipse.ease.python.jython.feature 0.8.0-SNAPSHOT SUCCESS [  0.094 s]
06:44:18 [2020-09-26T10:44:18.166Z] [INFO] org.eclipse.ease.lang.python.py4j.feature 0.8.0-SNAPSHOT SUCCESS [  0.105 s]
06:44:18 [2020-09-26T10:44:18.166Z] [INFO] org.eclipse.ease.lang.jvm.feature 0.8.0-SNAPSHOT ... SUCCESS [  0.096 s]
06:44:18 [2020-09-26T10:44:18.166Z] [INFO] org.eclipse.ease.lang.groovy.feature 0.8.0-SNAPSHOT  SUCCESS [  0.166 s]
06:44:18 [2020-09-26T10:44:18.166Z] [INFO] org.eclipse.ease.lang.ruby.feature 0.8.0-SNAPSHOT .. SUCCESS [  0.104 s]
06:44:18 [2020-09-26T10:44:18.166Z] [INFO] org.eclipse.ease.lang.scriptarchive.feature 0.8.0-SNAPSHOT SUCCESS [  0.100 s]
06:44:18 [2020-09-26T10:44:18.166Z] [INFO] org.eclipse.ease.lang.unittest.feature 0.8.0-SNAPSHOT SUCCESS [  0.104 s]
06:44:18 [2020-09-26T10:44:18.166Z] [INFO] org.eclipse.ease.releng.target 0.8.0-SNAPSHOT ...... SUCCESS [  0.010 s]
06:44:18 [2020-09-26T10:44:18.166Z] [INFO] org.eclipse.ease.releng.p2 0.8.0-SNAPSHOT .......... SUCCESS [  3.307 s]
06:44:18 [2020-09-26T10:44:18.166Z] [INFO] org.eclipse.ease.testhelper 0.8.0-SNAPSHOT ......... SUCCESS [  1.604 s]
06:44:18 [2020-09-26T10:44:18.166Z] [INFO] org.eclipse.ease.test 0.8.0-SNAPSHOT ............... SUCCESS [ 18.437 s]
06:44:18 [2020-09-26T10:44:18.166Z] [INFO] org.eclipse.ease.lang.javascript.nashorn.test 0.8.0-SNAPSHOT SUCCESS [  4.897 s]
06:44:18 [2020-09-26T10:44:18.166Z] [INFO] org.eclipse.ease.lang.javascript.rhino.test 0.8.0-SNAPSHOT SUCCESS [ 15.854 s]
06:44:18 [2020-09-26T10:44:18.167Z] [INFO] org.eclipse.ease.lang.javascript.test 0.8.0-SNAPSHOT SUCCESS [  4.325 s]
06:44:18 [2020-09-26T10:44:18.167Z] [INFO] org.eclipse.ease.lang.python.test 0.8.0-SNAPSHOT ... SUCCESS [  3.559 s]
06:44:18 [2020-09-26T10:44:18.167Z] [INFO] org.eclipse.ease.lang.python.jython.test 0.8.0-SNAPSHOT SUCCESS [ 16.680 s]
06:44:18 [2020-09-26T10:44:18.167Z] [INFO] org.eclipse.ease.lang.scriptarchive.test 0.8.0-SNAPSHOT SUCCESS [  4.230 s]
06:44:18 [2020-09-26T10:44:18.167Z] [INFO] org.eclipse.ease.lang.unittest.test 0.8.0-SNAPSHOT . SUCCESS [  6.450 s]
06:44:18 [2020-09-26T10:44:18.167Z] [INFO] org.eclipse.ease.ui.scripts.test 0.8.0-SNAPSHOT .... SUCCESS [  3.818 s]
06:44:18 [2020-09-26T10:44:18.167Z] [INFO] org.eclipse.ease.ui.test 0.8.0-SNAPSHOT ............ SUCCESS [ 15.774 s]
06:44:18 [2020-09-26T10:44:18.167Z] [INFO] EASE (Incubation) 0.4.0-SNAPSHOT ................... SUCCESS [  0.573 s]
06:44:18 [2020-09-26T10:44:18.167Z] [INFO] ------------------------------------------------------------------------
06:44:18 [2020-09-26T10:44:18.167Z] [INFO] BUILD SUCCESS
06:44:18 [2020-09-26T10:44:18.167Z] [INFO] ------------------------------------------------------------------------
06:44:18 [2020-09-26T10:44:18.167Z] [INFO] Total time:  07:50 min
06:44:18 [2020-09-26T10:44:18.167Z] [INFO] Finished at: 2020-09-26T10:44:18Z
06:44:18 [2020-09-26T10:44:18.167Z] [INFO] ------------------------------------------------------------------------
06:44:18 [2020-09-26T10:44:18.167Z] [INFO] [jenkins-event-spy] Generated /home/jenkins/agent/workspace/ease.verify.core.target.2019-12@tmp/withMaven3ef2ca9c/maven-spy-20200926-103627-9617452188028194846606.log
[Pipeline] }
06:44:20 [2020-09-26T10:44:20.772Z] [withMaven] Publishers: Pipeline Graph Publisher: 31 ms, Invoker Publisher: 1 ms, Junit Publisher: 1 ms, Concordion Publisher: 1 ms, Dependencies Fingerprint Publisher: 943 ms, Findbugs Publisher: 1 ms, Jacoco Publisher: 1 ms
[Pipeline] // withMaven
[Pipeline] }
[Pipeline] // stage
[Pipeline] stage
[Pipeline] { (Test)
[Pipeline] sh
06:44:21 [2020-09-26T10:44:21.074Z] + cp 'releng/org.eclipse.ease.releng.target/previous targets/2019-12.target' releng/org.eclipse.ease.releng.target/org.eclipse.ease.releng.target.target
[Pipeline] withMaven
06:44:21 [2020-09-26T10:44:21.082Z] [withMaven] Options: [org.jenkinsci.plugins.pipeline.maven.publishers.GeneratedArtifactsPublisher[disabled=true], org.jenkinsci.plugins.pipeline.maven.publishers.FindbugsAnalysisPublisher[disabled='false', healthy='', unHealthy='', thresholdLimit='low'], org.jenkinsci.plugins.pipeline.maven.publishers.TasksScannerPublisher[disabled='true', healthy='', unHealthy='', thresholdLimit='low']]
06:44:21 [2020-09-26T10:44:21.082Z] [withMaven] Available options: 
06:44:21 [2020-09-26T10:44:21.082Z] [withMaven] using JDK installation openjdk-jdk11-latest
06:44:21 [2020-09-26T10:44:21.087Z] [withMaven] using Maven installation 'apache-maven-latest'
[Pipeline] {
[Pipeline] sh
06:44:21 [2020-09-26T10:44:21.385Z] + mvn integration-test -f releng/org.eclipse.ease.releng/target-tests-pom.xml
06:44:21 [2020-09-26T10:44:21.386Z] ----- withMaven Wrapper script -----
06:44:21 [2020-09-26T10:44:21.386Z] Picked up JAVA_TOOL_OPTIONS: -Dmaven.ext.class.path="/home/jenkins/agent/workspace/ease.verify.core.target.2019-12@tmp/withMaven9b023d06/pipeline-maven-spy.jar" -Dorg.jenkinsci.plugins.pipeline.maven.reportsFolder="/home/jenkins/agent/workspace/ease.verify.core.target.2019-12@tmp/withMaven9b023d06" 
06:44:21 [2020-09-26T10:44:21.386Z] Apache Maven 3.6.3 (cecedd343002696d0abb50b32b541b8a6ba2883f)
06:44:21 [2020-09-26T10:44:21.386Z] Maven home: /opt/tools/apache-maven/latest
06:44:21 [2020-09-26T10:44:21.386Z] Java version: 11.0.2, vendor: Oracle Corporation, runtime: /opt/tools/java/openjdk/jdk-11/11.0.2+9
06:44:21 [2020-09-26T10:44:21.386Z] Default locale: en_US, platform encoding: UTF-8
06:44:21 [2020-09-26T10:44:21.386Z] OS name: "linux", version: "3.10.0-1062.el7.x86_64", arch: "amd64", family: "unix"
06:44:21 [2020-09-26T10:44:21.947Z] [INFO] [jenkins-event-spy] Generate /home/jenkins/agent/workspace/ease.verify.core.target.2019-12@tmp/withMaven9b023d06/maven-spy-20200926-104421-9349441381253830890755.log.tmp ...
06:44:22 [2020-09-26T10:44:22.203Z] [INFO] Scanning for projects...
06:44:34 [2020-09-26T10:44:34.368Z] [ERROR] Several versions of tycho plugins are configured [1.3.0, 1.5.0]:
06:44:34 [2020-09-26T10:44:34.368Z] [ERROR] 1.3.0:
06:44:34 [2020-09-26T10:44:34.368Z] [ERROR] 	MavenProject: org.eclipse.ease:org.eclipse.ease.releng:0.8.0-SNAPSHOT @ /home/jenkins/agent/workspace/ease.verify.core.target.2019-12/releng/org.eclipse.ease.releng/target-tests-pom.xml
06:44:34 [2020-09-26T10:44:34.368Z] [ERROR] 1.5.0:
06:44:34 [2020-09-26T10:44:34.368Z] [ERROR] 	MavenProject: org.eclipse.ease:org.eclipse.ease.releng.target:0.8.0-SNAPSHOT @ /home/jenkins/agent/workspace/ease.verify.core.target.2019-12/releng/org.eclipse.ease.releng.target/pom.xml
06:44:34 [2020-09-26T10:44:34.368Z] [ERROR] 	MavenProject: org.eclipse.ease:org.eclipse.ease.test:0.8.0-SNAPSHOT @ /home/jenkins/agent/workspace/ease.verify.core.target.2019-12/tests/org.eclipse.ease.test/pom.xml
06:44:34 [2020-09-26T10:44:34.368Z] [ERROR] 	MavenProject: org.eclipse.ease:org.eclipse.ease.lang.javascript.nashorn.test:0.8.0-SNAPSHOT @ /home/jenkins/agent/workspace/ease.verify.core.target.2019-12/tests/org.eclipse.ease.lang.javascript.nashorn.test/pom.xml
06:44:34 [2020-09-26T10:44:34.368Z] [ERROR] 	MavenProject: org.eclipse.ease:org.eclipse.ease.lang.javascript.rhino.test:0.8.0-SNAPSHOT @ /home/jenkins/agent/workspace/ease.verify.core.target.2019-12/tests/org.eclipse.ease.lang.javascript.rhino.test/pom.xml
06:44:34 [2020-09-26T10:44:34.368Z] [ERROR] 	MavenProject: org.eclipse.ease:org.eclipse.ease.lang.javascript.test:0.8.0-SNAPSHOT @ /home/jenkins/agent/workspace/ease.verify.core.target.2019-12/tests/org.eclipse.ease.lang.javascript.test/pom.xml
06:44:34 [2020-09-26T10:44:34.368Z] [ERROR] 	MavenProject: org.eclipse.ease:org.eclipse.ease.lang.python.test:0.8.0-SNAPSHOT @ /home/jenkins/agent/workspace/ease.verify.core.target.2019-12/tests/org.eclipse.ease.lang.python.test/pom.xml
06:44:34 [2020-09-26T10:44:34.369Z] [ERROR] 	MavenProject: org.eclipse.ease:org.eclipse.ease.lang.python.jython.test:0.8.0-SNAPSHOT @ /home/jenkins/agent/workspace/ease.verify.core.target.2019-12/tests/org.eclipse.ease.lang.python.jython.test/pom.xml
06:44:34 [2020-09-26T10:44:34.369Z] [ERROR] 	MavenProject: org.eclipse.ease:org.eclipse.ease.lang.python.py4j.test:0.8.0-SNAPSHOT @ /home/jenkins/agent/workspace/ease.verify.core.target.2019-12/tests/org.eclipse.ease.lang.python.py4j.test/pom.xml
06:44:34 [2020-09-26T10:44:34.369Z] [ERROR] 	MavenProject: org.eclipse.ease:org.eclipse.ease.lang.scriptarchive.test:0.8.0-SNAPSHOT @ /home/jenkins/agent/workspace/ease.verify.core.target.2019-12/tests/org.eclipse.ease.lang.scriptarchive.test/pom.xml
06:44:34 [2020-09-26T10:44:34.369Z] [ERROR] 	MavenProject: org.eclipse.ease:org.eclipse.ease.ui.test:0.8.0-SNAPSHOT @ /home/jenkins/agent/workspace/ease.verify.core.target.2019-12/tests/org.eclipse.ease.ui.test/pom.xml
06:44:34 [2020-09-26T10:44:34.369Z] [INFO] [jenkins-event-spy] Generated /home/jenkins/agent/workspace/ease.verify.core.target.2019-12@tmp/withMaven9b023d06/maven-spy-20200926-104421-9349441381253830890755.log
06:44:34 [2020-09-26T10:44:34.369Z] [ERROR] All tycho plugins configured in one reactor must use the same version -> [Help 1]
06:44:34 [2020-09-26T10:44:34.369Z] [ERROR] 
06:44:34 [2020-09-26T10:44:34.369Z] [ERROR] To see the full stack trace of the errors, re-run Maven with the -e switch.
06:44:34 [2020-09-26T10:44:34.369Z] [ERROR] Re-run Maven using the -X switch to enable full debug logging.
06:44:34 [2020-09-26T10:44:34.369Z] [ERROR] 
06:44:34 [2020-09-26T10:44:34.369Z] [ERROR] For more information about the errors and possible solutions, please read the following articles:
06:44:34 [2020-09-26T10:44:34.369Z] [ERROR] [Help 1] http://cwiki.apache.org/confluence/display/MAVEN/MavenExecutionException
[Pipeline] }
06:44:34 [2020-09-26T10:44:34.393Z] [withMaven] Publishers: 
[Pipeline] // withMaven
[Pipeline] }
[Pipeline] // stage
[Pipeline] stage
[Pipeline] { (Declarative: Post Actions)
[Pipeline] archiveArtifacts
06:44:34 [2020-09-26T10:44:34.422Z] Archiving artifacts
[Pipeline] emailext
06:44:47 [2020-09-26T10:44:47.862Z] Sending email to: christian.pontesegger@web.de
[Pipeline] }
[Pipeline] // stage
[Pipeline] }
[Pipeline] // timeout
[Pipeline] }
[Pipeline] // timestamps
[Pipeline] }
[Pipeline] // node
[Pipeline] End of Pipeline
ERROR: script returned exit code 1
Finished: FAILURE