FailedConsole Output

Skipping 992 KB.. Full Log
 @ /home/jenkins/agent/workspace/ease.verify.core.target.2019-12/tests/org.eclipse.ease.lang.scriptarchive.test/pom.xml
06:42:37 [2020-09-12T10:42:37.572Z] [WARNING] The following locally built units have been used to resolve project dependencies:
06:42:37 [2020-09-12T10:42:37.572Z] [WARNING]   org.eclipse.ease.ui/0.8.0.I202007081155
06:42:37 [2020-09-12T10:42:37.572Z] [WARNING]   org.eclipse.ease.lang.javascript/0.8.0.I202007150818
06:42:37 [2020-09-12T10:42:37.572Z] [WARNING]   org.eclipse.ease.lang.javascript.rhino/0.8.0.I202008070902
06:42:37 [2020-09-12T10:42:37.572Z] [WARNING]   org.eclipse.ease.lang.scriptarchive/0.8.0.I201910171213
06:42:37 [2020-09-12T10:42:37.572Z] [WARNING]   org.eclipse.ease.classloader/0.8.0.I201910171213
06:42:37 [2020-09-12T10:42:37.572Z] [WARNING]   org.eclipse.ease/0.8.0.I202008181537
06:42:37 [2020-09-12T10:42:37.572Z] [INFO] Resolving class path of MavenProject: org.eclipse.ease:org.eclipse.ease.lang.scriptarchive.test:0.8.0-SNAPSHOT @ /home/jenkins/agent/workspace/ease.verify.core.target.2019-12/tests/org.eclipse.ease.lang.scriptarchive.test/pom.xml
06:42:37 [2020-09-12T10:42:37.828Z] [INFO] Computing target platform for MavenProject: org.eclipse.ease:org.eclipse.ease.ui.test:0.8.0-SNAPSHOT @ /home/jenkins/agent/workspace/ease.verify.core.target.2019-12/tests/org.eclipse.ease.ui.test/pom.xml
06:42:37 [2020-09-12T10:42:37.828Z] [INFO] Resolving dependencies of MavenProject: org.eclipse.ease:org.eclipse.ease.ui.test:0.8.0-SNAPSHOT @ /home/jenkins/agent/workspace/ease.verify.core.target.2019-12/tests/org.eclipse.ease.ui.test/pom.xml
06:42:37 [2020-09-12T10:42:37.828Z] [INFO] Fetching org.apache.lucene.analyzers-common_8.0.0.v20190404-1858.jar.pack.gz from http://download.eclipse.org/releases/2019-12/201912181000/plugins/ (687.76kB)
06:42:37 [2020-09-12T10:42:37.828Z] [INFO] Fetching org.apache.lucene.analyzers-common_8.0.0.v20190404-1858.jar.pack.gz from http://download.eclipse.org/releases/2019-12/201912181000/plugins/ (687.76kB)
06:42:38 [2020-09-12T10:42:38.388Z] [INFO] Fetching org.apache.lucene.core_8.0.0.v20190404-1858.jar.pack.gz from http://download.eclipse.org/releases/2019-12/201912181000/plugins/ (923.82kB)
06:42:38 [2020-09-12T10:42:38.388Z] [INFO] Fetching org.apache.lucene.core_8.0.0.v20190404-1858.jar.pack.gz from http://download.eclipse.org/releases/2019-12/201912181000/plugins/ (923.82kB)
06:42:38 [2020-09-12T10:42:38.949Z] [INFO] Fetching org.apache.lucene.analyzers-smartcn_8.0.0.v20190404-1858.jar.pack.gz from http://download.eclipse.org/releases/2019-12/201912181000/plugins/ (3.42MB)
06:42:38 [2020-09-12T10:42:38.949Z] [INFO] Fetching org.apache.lucene.analyzers-smartcn_8.0.0.v20190404-1858.jar.pack.gz from http://download.eclipse.org/releases/2019-12/201912181000/plugins/ (3.42MB)
06:42:39 [2020-09-12T10:42:39.875Z] [INFO] Fetching org.eclipse.jdt.ui_3.20.0.v20191203-1301.jar.pack.gz from http://download.eclipse.org/releases/2019-12/201912181000/plugins/ (3.9MB)
06:42:39 [2020-09-12T10:42:39.875Z] [INFO] Fetching org.eclipse.jdt.ui_3.20.0.v20191203-1301.jar.pack.gz from http://download.eclipse.org/releases/2019-12/201912181000/plugins/ (3.9MB)
06:42:42 [2020-09-12T10:42:42.387Z] [INFO] Fetching org.eclipse.jdt.core_3.20.0.v20191203-2131.jar from http://download.eclipse.org/releases/2019-12/201912181000/plugins/ (6.71MB)
06:42:42 [2020-09-12T10:42:42.388Z] [INFO] Fetching org.eclipse.jdt.core_3.20.0.v20191203-2131.jar from http://download.eclipse.org/releases/2019-12/201912181000/plugins/ (6.71MB)
06:42:42 [2020-09-12T10:42:42.644Z] [INFO] Fetching org.objectweb.asm_7.2.0.v20191010-1910.jar.pack.gz from http://download.eclipse.org/releases/2019-12/201912181000/plugins/ (58.83kB)
06:42:42 [2020-09-12T10:42:42.644Z] [INFO] Fetching org.objectweb.asm_7.2.0.v20191010-1910.jar.pack.gz from http://download.eclipse.org/releases/2019-12/201912181000/plugins/ (58.83kB)
06:42:42 [2020-09-12T10:42:42.644Z] [INFO] Fetching org.eclipse.help.ui_4.1.700.v20191123-0656.jar.pack.gz from http://download.eclipse.org/releases/2019-12/201912181000/plugins/ (204.92kB)
06:42:42 [2020-09-12T10:42:42.644Z] [INFO] Fetching org.eclipse.help.ui_4.1.700.v20191123-0656.jar.pack.gz from http://download.eclipse.org/releases/2019-12/201912181000/plugins/ (204.92kB)
06:42:42 [2020-09-12T10:42:42.899Z] [INFO] Fetching org.eclipse.help.webapp_3.9.700.v20191123-0656.jar.pack.gz from http://download.eclipse.org/releases/2019-12/201912181000/plugins/ (284.94kB)
06:42:42 [2020-09-12T10:42:42.899Z] [INFO] Fetching org.eclipse.help.webapp_3.9.700.v20191123-0656.jar.pack.gz from http://download.eclipse.org/releases/2019-12/201912181000/plugins/ (284.94kB)
06:42:43 [2020-09-12T10:42:43.154Z] [INFO] Fetching org.eclipse.equinox.http.jetty_3.7.300.v20191015-2006.jar.pack.gz from http://download.eclipse.org/releases/2019-12/201912181000/plugins/ (16.29kB)
06:42:43 [2020-09-12T10:42:43.154Z] [INFO] Fetching org.eclipse.equinox.http.jetty_3.7.300.v20191015-2006.jar.pack.gz from http://download.eclipse.org/releases/2019-12/201912181000/plugins/ (16.29kB)
06:42:43 [2020-09-12T10:42:43.154Z] [INFO] Fetching org.eclipse.ui.browser_3.6.600.v20191122-2109.jar.pack.gz from http://download.eclipse.org/releases/2019-12/201912181000/plugins/ (97.35kB)
06:42:43 [2020-09-12T10:42:43.154Z] [INFO] Fetching org.eclipse.ui.browser_3.6.600.v20191122-2109.jar.pack.gz from http://download.eclipse.org/releases/2019-12/201912181000/plugins/ (97.35kB)
06:42:43 [2020-09-12T10:42:43.409Z] [INFO] Fetching org.eclipse.equinox.http.servlet_1.6.300.v20191011-1612.jar.pack.gz from http://download.eclipse.org/releases/2019-12/201912181000/plugins/ (76.5kB)
06:42:43 [2020-09-12T10:42:43.409Z] [INFO] Fetching org.eclipse.equinox.http.servlet_1.6.300.v20191011-1612.jar.pack.gz from http://download.eclipse.org/releases/2019-12/201912181000/plugins/ (76.5kB)
06:42:43 [2020-09-12T10:42:43.409Z] [INFO] Fetching org.eclipse.jetty.http_9.4.24.v20191120.jar from http://download.eclipse.org/releases/2019-12/201912181000/plugins/ (219.72kB)
06:42:43 [2020-09-12T10:42:43.665Z] [INFO] Fetching org.eclipse.jetty.http_9.4.24.v20191120.jar from http://download.eclipse.org/releases/2019-12/201912181000/plugins/ (219.72kB)
06:42:43 [2020-09-12T10:42:43.665Z] [INFO] Fetching org.eclipse.jetty.server_9.4.24.v20191120.jar from http://download.eclipse.org/releases/2019-12/201912181000/plugins/ (691.08kB)
06:42:43 [2020-09-12T10:42:43.665Z] [INFO] Fetching org.eclipse.jetty.server_9.4.24.v20191120.jar from http://download.eclipse.org/releases/2019-12/201912181000/plugins/ (691.08kB)
06:42:43 [2020-09-12T10:42:43.665Z] [INFO] Fetching org.eclipse.jetty.servlet_9.4.24.v20191120.jar from http://download.eclipse.org/releases/2019-12/201912181000/plugins/ (139.05kB)
06:42:43 [2020-09-12T10:42:43.921Z] [INFO] Fetching org.eclipse.jetty.servlet_9.4.24.v20191120.jar from http://download.eclipse.org/releases/2019-12/201912181000/plugins/ (139.05kB)
06:42:43 [2020-09-12T10:42:43.921Z] [INFO] Fetching org.eclipse.jetty.util_9.4.24.v20191120.jar from http://download.eclipse.org/releases/2019-12/201912181000/plugins/ (571.31kB)
06:42:43 [2020-09-12T10:42:43.921Z] [INFO] Fetching org.eclipse.jetty.util_9.4.24.v20191120.jar from http://download.eclipse.org/releases/2019-12/201912181000/plugins/ (571.31kB)
06:42:43 [2020-09-12T10:42:43.921Z] [INFO] Fetching org.eclipse.equinox.http.registry_1.1.700.v20190214-1948.jar.pack.gz from http://download.eclipse.org/releases/2019-12/201912181000/plugins/ (18.49kB)
06:42:43 [2020-09-12T10:42:43.921Z] [INFO] Fetching org.eclipse.equinox.http.registry_1.1.700.v20190214-1948.jar.pack.gz from http://download.eclipse.org/releases/2019-12/201912181000/plugins/ (18.49kB)
06:42:44 [2020-09-12T10:42:44.177Z] [INFO] Fetching org.eclipse.equinox.jsp.jasper_1.1.300.v20190714-1850.jar.pack.gz from http://download.eclipse.org/releases/2019-12/201912181000/plugins/ (14.71kB)
06:42:44 [2020-09-12T10:42:44.177Z] [INFO] Fetching org.eclipse.equinox.jsp.jasper_1.1.300.v20190714-1850.jar.pack.gz from http://download.eclipse.org/releases/2019-12/201912181000/plugins/ (14.71kB)
06:42:44 [2020-09-12T10:42:44.177Z] [INFO] Fetching org.eclipse.equinox.jsp.jasper.registry_1.1.300.v20190714-1850.jar.pack.gz from http://download.eclipse.org/releases/2019-12/201912181000/plugins/ (8.71kB)
06:42:44 [2020-09-12T10:42:44.177Z] [INFO] Fetching org.eclipse.equinox.jsp.jasper.registry_1.1.300.v20190714-1850.jar.pack.gz from http://download.eclipse.org/releases/2019-12/201912181000/plugins/ (8.71kB)
06:42:44 [2020-09-12T10:42:44.433Z] [INFO] Fetching org.eclipse.help.base_4.2.800.v20191210-0610.jar.pack.gz from http://download.eclipse.org/releases/2019-12/201912181000/plugins/ (175.92kB)
06:42:44 [2020-09-12T10:42:44.433Z] [INFO] Fetching org.eclipse.help.base_4.2.800.v20191210-0610.jar.pack.gz from http://download.eclipse.org/releases/2019-12/201912181000/plugins/ (175.92kB)
06:42:44 [2020-09-12T10:42:44.433Z] [INFO] Fetching org.eclipse.jdt.core.manipulation_1.13.0.v20191203-0859.jar.pack.gz from http://download.eclipse.org/releases/2019-12/201912181000/plugins/ (485.06kB)
06:42:44 [2020-09-12T10:42:44.688Z] [INFO] Fetching org.eclipse.jdt.core.manipulation_1.13.0.v20191203-0859.jar.pack.gz from http://download.eclipse.org/releases/2019-12/201912181000/plugins/ (485.06kB)
06:42:44 [2020-09-12T10:42:44.944Z] [INFO] Fetching org.eclipse.jdt.launching_3.16.0.v20191108-0353.jar.pack.gz from http://download.eclipse.org/releases/2019-12/201912181000/plugins/ (273.76kB)
06:42:44 [2020-09-12T10:42:44.944Z] [INFO] Fetching org.eclipse.jdt.launching_3.16.0.v20191108-0353.jar.pack.gz from http://download.eclipse.org/releases/2019-12/201912181000/plugins/ (273.76kB)
06:42:45 [2020-09-12T10:42:45.200Z] [INFO] Fetching org.eclipse.jdt.debug_3.14.0.v20191105-0758.jar.pack.gz from http://download.eclipse.org/releases/2019-12/201912181000/plugins/ (937.08kB)
06:42:45 [2020-09-12T10:42:45.200Z] [INFO] Fetching org.eclipse.jdt.debug_3.14.0.v20191105-0758.jar.pack.gz from http://download.eclipse.org/releases/2019-12/201912181000/plugins/ (937.08kB)
06:42:45 [2020-09-12T10:42:45.201Z] [INFO] Fetching org.eclipse.jetty.io_9.4.24.v20191120.jar from http://download.eclipse.org/releases/2019-12/201912181000/plugins/ (170.14kB)
06:42:45 [2020-09-12T10:42:45.201Z] [INFO] Fetching org.eclipse.jetty.io_9.4.24.v20191120.jar from http://download.eclipse.org/releases/2019-12/201912181000/plugins/ (170.14kB)
06:42:45 [2020-09-12T10:42:45.456Z] [INFO] Fetching org.eclipse.jetty.security_9.4.24.v20191120.jar from http://download.eclipse.org/releases/2019-12/201912181000/plugins/ (126.39kB)
06:42:45 [2020-09-12T10:42:45.456Z] [INFO] Fetching org.eclipse.jetty.security_9.4.24.v20191120.jar from http://download.eclipse.org/releases/2019-12/201912181000/plugins/ (126.39kB)
06:42:45 [2020-09-12T10:42:45.456Z] [WARNING] The following locally built units have been used to resolve project dependencies:
06:42:45 [2020-09-12T10:42:45.456Z] [WARNING]   org.eclipse.ease.ui/0.8.0.I202007081155
06:42:45 [2020-09-12T10:42:45.456Z] [WARNING]   org.eclipse.ease.ui.completions.java/0.8.0.I202007080801
06:42:45 [2020-09-12T10:42:45.456Z] [WARNING]   org.eclipse.ease.classloader/0.8.0.I201910171213
06:42:45 [2020-09-12T10:42:45.456Z] [WARNING]   org.eclipse.ease/0.8.0.I202008181537
06:42:45 [2020-09-12T10:42:45.456Z] [INFO] Resolving class path of MavenProject: org.eclipse.ease:org.eclipse.ease.ui.test:0.8.0-SNAPSHOT @ /home/jenkins/agent/workspace/ease.verify.core.target.2019-12/tests/org.eclipse.ease.ui.test/pom.xml
06:42:45 [2020-09-12T10:42:45.712Z] [WARNING] The project org.eclipse.ease:org.eclipse.ease.releng:pom:0.8.0-SNAPSHOT uses prerequisites which is only intended for maven-plugin projects but not for non maven-plugin projects. For such purposes you should use the maven-enforcer-plugin. See https://maven.apache.org/enforcer/enforcer-rules/requireMavenVersion.html
06:42:45 [2020-09-12T10:42:45.713Z] [WARNING] [jenkins-event-spy] Unexpected Maven project file name 'target-tests-pom.xml', problems may occur
06:42:45 [2020-09-12T10:42:45.713Z] [INFO] ------------------------------------------------------------------------
06:42:45 [2020-09-12T10:42:45.713Z] [INFO] Reactor Build Order:
06:42:45 [2020-09-12T10:42:45.713Z] [INFO] 
06:42:45 [2020-09-12T10:42:45.713Z] [INFO] org.eclipse.ease.releng                                            [pom]
06:42:45 [2020-09-12T10:42:45.713Z] [INFO] org.eclipse.ease.releng.target               [eclipse-target-definition]
06:42:45 [2020-09-12T10:42:45.713Z] [INFO] org.eclipse.ease.test                              [eclipse-test-plugin]
06:42:45 [2020-09-12T10:42:45.713Z] [INFO] org.eclipse.ease.lang.javascript.nashorn.test      [eclipse-test-plugin]
06:42:45 [2020-09-12T10:42:45.713Z] [INFO] org.eclipse.ease.lang.javascript.rhino.test        [eclipse-test-plugin]
06:42:45 [2020-09-12T10:42:45.713Z] [INFO] org.eclipse.ease.lang.javascript.test              [eclipse-test-plugin]
06:42:45 [2020-09-12T10:42:45.713Z] [INFO] org.eclipse.ease.lang.python.test                  [eclipse-test-plugin]
06:42:45 [2020-09-12T10:42:45.713Z] [INFO] org.eclipse.ease.lang.python.jython.test           [eclipse-test-plugin]
06:42:45 [2020-09-12T10:42:45.713Z] [INFO] org.eclipse.ease.lang.python.py4j.test             [eclipse-test-plugin]
06:42:45 [2020-09-12T10:42:45.713Z] [INFO] org.eclipse.ease.lang.scriptarchive.test           [eclipse-test-plugin]
06:42:45 [2020-09-12T10:42:45.713Z] [INFO] org.eclipse.ease.ui.test                           [eclipse-test-plugin]
06:42:45 [2020-09-12T10:42:45.713Z] [WARNING] [jenkins-event-spy] Unexpected Maven project file name 'target-tests-pom.xml', problems may occur
06:42:45 [2020-09-12T10:42:45.713Z] [INFO] 
06:42:45 [2020-09-12T10:42:45.713Z] [INFO] --------------< org.eclipse.ease:org.eclipse.ease.releng >--------------
06:42:45 [2020-09-12T10:42:45.713Z] [INFO] Building org.eclipse.ease.releng 0.8.0-SNAPSHOT                   [1/11]
06:42:45 [2020-09-12T10:42:45.713Z] [INFO] --------------------------------[ pom ]---------------------------------
06:42:45 [2020-09-12T10:42:45.713Z] [WARNING] [jenkins-event-spy] Unexpected Maven project file name 'target-tests-pom.xml', problems may occur
06:42:45 [2020-09-12T10:42:45.713Z] [INFO] 
06:42:45 [2020-09-12T10:42:45.713Z] [INFO] ----------< org.eclipse.ease:org.eclipse.ease.releng.target >-----------
06:42:45 [2020-09-12T10:42:45.713Z] [INFO] Building org.eclipse.ease.releng.target 0.8.0-SNAPSHOT            [2/11]
06:42:45 [2020-09-12T10:42:45.713Z] [INFO] ---------------------[ eclipse-target-definition ]----------------------
06:42:45 [2020-09-12T10:42:45.713Z] [INFO] 
06:42:45 [2020-09-12T10:42:45.713Z] [INFO] --- tycho-source-plugin:1.3.0:plugin-source (plugin-source) @ org.eclipse.ease.releng.target ---
06:42:45 [2020-09-12T10:42:45.713Z] [INFO] 
06:42:45 [2020-09-12T10:42:45.713Z] [INFO] --- tycho-packaging-plugin:1.3.0:package-target-definition (default-package-target-definition) @ org.eclipse.ease.releng.target ---
06:42:45 [2020-09-12T10:42:45.713Z] [INFO] 
06:42:45 [2020-09-12T10:42:45.713Z] [INFO] --- tycho-source-feature-plugin:1.3.0:source-feature (source-feature) @ org.eclipse.ease.releng.target ---
06:42:45 [2020-09-12T10:42:45.713Z] [INFO] 
06:42:45 [2020-09-12T10:42:45.713Z] [INFO] --- tycho-p2-plugin:1.3.0:p2-metadata (attached-p2-metadata) @ org.eclipse.ease.releng.target ---
06:42:45 [2020-09-12T10:42:45.713Z] [INFO] 
06:42:45 [2020-09-12T10:42:45.713Z] [INFO] ---------------< org.eclipse.ease:org.eclipse.ease.test >---------------
06:42:45 [2020-09-12T10:42:45.713Z] [INFO] Building org.eclipse.ease.test 0.8.0-SNAPSHOT                     [3/11]
06:42:45 [2020-09-12T10:42:45.713Z] [INFO] ------------------------[ eclipse-test-plugin ]-------------------------
06:42:45 [2020-09-12T10:42:45.713Z] [INFO] 
06:42:45 [2020-09-12T10:42:45.713Z] [INFO] --- tycho-packaging-plugin:1.3.0:build-qualifier (default-build-qualifier) @ org.eclipse.ease.test ---
06:42:45 [2020-09-12T10:42:45.969Z] [INFO] The project's OSGi version is 0.8.0.I201910171213
06:42:45 [2020-09-12T10:42:45.969Z] [INFO] 
06:42:45 [2020-09-12T10:42:45.969Z] [INFO] --- tycho-packaging-plugin:1.3.0:validate-id (default-validate-id) @ org.eclipse.ease.test ---
06:42:45 [2020-09-12T10:42:45.969Z] [INFO] 
06:42:45 [2020-09-12T10:42:45.969Z] [INFO] --- tycho-packaging-plugin:1.3.0:validate-version (default-validate-version) @ org.eclipse.ease.test ---
06:42:45 [2020-09-12T10:42:45.969Z] [INFO] 
06:42:45 [2020-09-12T10:42:45.969Z] [INFO] --- maven-resources-plugin:2.4.3:resources (default-resources) @ org.eclipse.ease.test ---
06:42:45 [2020-09-12T10:42:45.969Z] [INFO] Using 'UTF-8' encoding to copy filtered resources.
06:42:45 [2020-09-12T10:42:45.969Z] [INFO] skip non existing resourceDirectory /home/jenkins/agent/workspace/ease.verify.core.target.2019-12/tests/org.eclipse.ease.test/src/main/resources
06:42:45 [2020-09-12T10:42:45.969Z] [INFO] 
06:42:45 [2020-09-12T10:42:45.969Z] [INFO] --- tycho-compiler-plugin:1.3.0:compile (default-compile) @ org.eclipse.ease.test ---
06:42:45 [2020-09-12T10:42:45.969Z] [INFO] Nothing to compile - all classes are up to date
06:42:45 [2020-09-12T10:42:45.969Z] [INFO] 
06:42:45 [2020-09-12T10:42:45.969Z] [INFO] --- maven-resources-plugin:2.4.3:testResources (default-testResources) @ org.eclipse.ease.test ---
06:42:45 [2020-09-12T10:42:45.969Z] [INFO] Using 'UTF-8' encoding to copy filtered resources.
06:42:45 [2020-09-12T10:42:45.969Z] [INFO] skip non existing resourceDirectory /home/jenkins/agent/workspace/ease.verify.core.target.2019-12/tests/org.eclipse.ease.test/src/test/resources
06:42:45 [2020-09-12T10:42:45.969Z] [INFO] 
06:42:45 [2020-09-12T10:42:45.969Z] [INFO] --- tycho-source-plugin:1.3.0:plugin-source (plugin-source) @ org.eclipse.ease.test ---
06:42:45 [2020-09-12T10:42:45.969Z] [INFO] Building jar: /home/jenkins/agent/workspace/ease.verify.core.target.2019-12/tests/org.eclipse.ease.test/target/org.eclipse.ease.test-0.8.0-SNAPSHOT-sources.jar
06:42:45 [2020-09-12T10:42:45.969Z] [INFO] 
06:42:45 [2020-09-12T10:42:45.969Z] [INFO] --- target-platform-configuration:1.3.0:target-platform (default-target-platform) @ org.eclipse.ease.test ---
06:42:46 [2020-09-12T10:42:46.224Z] [INFO] 
06:42:46 [2020-09-12T10:42:46.224Z] [INFO] --- tycho-packaging-plugin:1.3.0:package-plugin (default-package-plugin) @ org.eclipse.ease.test ---
06:42:46 [2020-09-12T10:42:46.224Z] [INFO] Building jar: /home/jenkins/agent/workspace/ease.verify.core.target.2019-12/tests/org.eclipse.ease.test/target/org.eclipse.ease.test-0.8.0-SNAPSHOT.jar
06:42:46 [2020-09-12T10:42:46.224Z] [INFO] 
06:42:46 [2020-09-12T10:42:46.224Z] [INFO] --- tycho-p2-plugin:1.3.0:p2-metadata-default (default-p2-metadata-default) @ org.eclipse.ease.test ---
06:42:46 [2020-09-12T10:42:46.224Z] [INFO] 
06:42:46 [2020-09-12T10:42:46.224Z] [INFO] --- tycho-source-feature-plugin:1.3.0:source-feature (source-feature) @ org.eclipse.ease.test ---
06:42:46 [2020-09-12T10:42:46.224Z] [INFO] 
06:42:46 [2020-09-12T10:42:46.224Z] [INFO] --- tycho-p2-plugin:1.3.0:p2-metadata (attached-p2-metadata) @ org.eclipse.ease.test ---
06:42:46 [2020-09-12T10:42:46.224Z] [INFO] 
06:42:46 [2020-09-12T10:42:46.224Z] [INFO] --- tycho-surefire-plugin:1.3.0:test (default-test) @ org.eclipse.ease.test ---
06:42:46 [2020-09-12T10:42:46.479Z] [INFO] Expected eclipse log file: /home/jenkins/agent/workspace/ease.verify.core.target.2019-12/tests/org.eclipse.ease.test/target/work/data/.metadata/.log
06:42:46 [2020-09-12T10:42:46.480Z] [INFO] Command line:
06:42:46 [2020-09-12T10:42:46.480Z] 	[/opt/tools/java/oracle/jdk-8/1.8.0_202/jre/bin/java, -Dosgi.noShutdown=false, -Dosgi.os=linux, -Dosgi.ws=gtk, -Dosgi.arch=x86_64, -Dosgi.clean=true, -jar, /home/jenkins/.m2/repository/p2/osgi/bundle/org.eclipse.equinox.launcher/1.5.600.v20191014-2022/org.eclipse.equinox.launcher-1.5.600.v20191014-2022.jar, -data, /home/jenkins/agent/workspace/ease.verify.core.target.2019-12/tests/org.eclipse.ease.test/target/work/data, -install, /home/jenkins/agent/workspace/ease.verify.core.target.2019-12/tests/org.eclipse.ease.test/target/work, -configuration, /home/jenkins/agent/workspace/ease.verify.core.target.2019-12/tests/org.eclipse.ease.test/target/work/configuration, -application, org.eclipse.tycho.surefire.osgibooter.headlesstest, -testproperties, /home/jenkins/agent/workspace/ease.verify.core.target.2019-12/tests/org.eclipse.ease.test/target/surefire.properties]
06:42:46 [2020-09-12T10:42:46.480Z] Picked up JAVA_TOOL_OPTIONS: -Dmaven.ext.class.path="/home/jenkins/agent/workspace/ease.verify.core.target.2019-12@tmp/withMaven013285c7/pipeline-maven-spy.jar" -Dorg.jenkinsci.plugins.pipeline.maven.reportsFolder="/home/jenkins/agent/workspace/ease.verify.core.target.2019-12@tmp/withMaven013285c7" 
06:42:47 [2020-09-12T10:42:47.843Z] Running org.eclipse.ease.AbstractScriptEngineTest
06:42:53 [2020-09-12T10:42:53.085Z] testorg.eclipse.ease.ScriptExecutionException: Engine got terminated
06:42:53 [2020-09-12T10:42:53.646Z] java.lang.RuntimeException: ERROR
06:42:53 [2020-09-12T10:42:53.646Z] 	at org.eclipse.ease.AbstractScriptEngineTest$MockedScriptEngine.execute(AbstractScriptEngineTest.java:73)
06:42:53 [2020-09-12T10:42:53.646Z] 	at org.eclipse.ease.AbstractScriptEngine.inject(AbstractScriptEngine.java:222)
06:42:53 [2020-09-12T10:42:53.646Z] 	at org.eclipse.ease.AbstractScriptEngine.run(AbstractScriptEngine.java:272)
06:42:53 [2020-09-12T10:42:53.646Z] 	at org.eclipse.core.internal.jobs.Worker.run(Worker.java:63)
06:42:53 [2020-09-12T10:42:53.646Z] 1Tests run: 17, Failures: 0, Errors: 0, Skipped: 0, Time elapsed: 6.035 s - in org.eclipse.ease.AbstractScriptEngineTest
06:42:53 [2020-09-12T10:42:53.646Z] extractEmptyArguments(org.eclipse.ease.AbstractScriptEngineTest)  Time elapsed: 0.002 s
06:42:53 [2020-09-12T10:42:53.646Z] setNotNullOutputStream(org.eclipse.ease.AbstractScriptEngineTest)  Time elapsed: 0 s
06:42:53 [2020-09-12T10:42:53.646Z] terminateViaMonitorCancellation(org.eclipse.ease.AbstractScriptEngineTest)  Time elapsed: 1.206 s
06:42:53 [2020-09-12T10:42:53.646Z] inject(org.eclipse.ease.AbstractScriptEngineTest)  Time elapsed: 0.001 s
06:42:53 [2020-09-12T10:42:53.646Z] extractArguments(org.eclipse.ease.AbstractScriptEngineTest)  Time elapsed: 0.001 s
06:42:53 [2020-09-12T10:42:53.646Z] executeSync(org.eclipse.ease.AbstractScriptEngineTest)  Time elapsed: 0 s
06:42:53 [2020-09-12T10:42:53.646Z] setNotNullErrorStream(org.eclipse.ease.AbstractScriptEngineTest)  Time elapsed: 0.001 s
06:42:53 [2020-09-12T10:42:53.646Z] setNullErrorStream(org.eclipse.ease.AbstractScriptEngineTest)  Time elapsed: 0 s
06:42:53 [2020-09-12T10:42:53.646Z] isJob(org.eclipse.ease.AbstractScriptEngineTest)  Time elapsed: 0 s
06:42:53 [2020-09-12T10:42:53.646Z] streamsAvailable(org.eclipse.ease.AbstractScriptEngineTest)  Time elapsed: 0 s
06:42:53 [2020-09-12T10:42:53.646Z] executeValidCodeAndTerminate(org.eclipse.ease.AbstractScriptEngineTest)  Time elapsed: 1 s
06:42:53 [2020-09-12T10:42:53.646Z] setNullOutputStream(org.eclipse.ease.AbstractScriptEngineTest)  Time elapsed: 0 s
06:42:53 [2020-09-12T10:42:53.646Z] terminateMultipleTimes(org.eclipse.ease.AbstractScriptEngineTest)  Time elapsed: 0.6 s
06:42:53 [2020-09-12T10:42:53.646Z] engineTerminatesWhenIdle(org.eclipse.ease.AbstractScriptEngineTest)  Time elapsed: 1 s
06:42:53 [2020-09-12T10:42:53.646Z] terminateViaTerminateMethod(org.eclipse.ease.AbstractScriptEngineTest)  Time elapsed: 1.202 s
06:42:53 [2020-09-12T10:42:53.646Z] terminateViaMethodCallback(org.eclipse.ease.AbstractScriptEngineTest)  Time elapsed: 1.002 s
06:42:53 [2020-09-12T10:42:53.646Z] executeErrorCodeAndTerminate(org.eclipse.ease.AbstractScriptEngineTest)  Time elapsed: 0.002 s
06:42:53 [2020-09-12T10:42:53.646Z] Running org.eclipse.ease.adapters.ScriptableAdapterTest
06:42:53 [2020-09-12T10:42:53.646Z] Tests run: 5, Failures: 0, Errors: 0, Skipped: 0, Time elapsed: 0.101 s - in org.eclipse.ease.adapters.ScriptableAdapterTest
06:42:53 [2020-09-12T10:42:53.646Z] adaptURI(org.eclipse.ease.adapters.ScriptableAdapterTest)  Time elapsed: 0.1 s
06:42:53 [2020-09-12T10:42:53.646Z] adaptURL(org.eclipse.ease.adapters.ScriptableAdapterTest)  Time elapsed: 0 s
06:42:53 [2020-09-12T10:42:53.646Z] adaptWorkspaceFile(org.eclipse.ease.adapters.ScriptableAdapterTest)  Time elapsed: 0 s
06:42:53 [2020-09-12T10:42:53.646Z] getAdapterList(org.eclipse.ease.adapters.ScriptableAdapterTest)  Time elapsed: 0.001 s
06:42:53 [2020-09-12T10:42:53.646Z] adaptFilesystemFile(org.eclipse.ease.adapters.ScriptableAdapterTest)  Time elapsed: 0 s
06:42:53 [2020-09-12T10:42:53.646Z] Running org.eclipse.ease.ScriptTest
06:42:53 [2020-09-12T10:42:53.646Z] Tests run: 13, Failures: 0, Errors: 0, Skipped: 0, Time elapsed: 0.011 s - in org.eclipse.ease.ScriptTest
06:42:53 [2020-09-12T10:42:53.646Z] codeFromScriptable(org.eclipse.ease.ScriptTest)  Time elapsed: 0.006 s
06:42:53 [2020-09-12T10:42:53.646Z] codeFromFilesystemFile(org.eclipse.ease.ScriptTest)  Time elapsed: 0.001 s
06:42:53 [2020-09-12T10:42:53.646Z] getCodeStream(org.eclipse.ease.ScriptTest)  Time elapsed: 0 s
06:42:53 [2020-09-12T10:42:53.646Z] getFile(org.eclipse.ease.ScriptTest)  Time elapsed: 0 s
06:42:53 [2020-09-12T10:42:53.646Z] codeFromStringBuilder(org.eclipse.ease.ScriptTest)  Time elapsed: 0.001 s
06:42:53 [2020-09-12T10:42:53.646Z] getResult(org.eclipse.ease.ScriptTest)  Time elapsed: 0 s
06:42:53 [2020-09-12T10:42:53.646Z] getException(org.eclipse.ease.ScriptTest)  Time elapsed: 0 s
06:42:53 [2020-09-12T10:42:53.646Z] codeFromWorkspaceFile(org.eclipse.ease.ScriptTest)  Time elapsed: 0 s
06:42:53 [2020-09-12T10:42:53.646Z] codeFromInputStream(org.eclipse.ease.ScriptTest)  Time elapsed: 0 s
06:42:53 [2020-09-12T10:42:53.646Z] getTitle(org.eclipse.ease.ScriptTest)  Time elapsed: 0 s
06:42:53 [2020-09-12T10:42:53.646Z] getCommand(org.eclipse.ease.ScriptTest)  Time elapsed: 0 s
06:42:53 [2020-09-12T10:42:53.646Z] codeFromReader(org.eclipse.ease.ScriptTest)  Time elapsed: 0 s
06:42:53 [2020-09-12T10:42:53.646Z] codeFromString(org.eclipse.ease.ScriptTest)  Time elapsed: 0 s
06:42:53 [2020-09-12T10:42:53.646Z] Running org.eclipse.ease.tools.RunnableWithResultTest
06:42:53 [2020-09-12T10:42:53.646Z] Tests run: 2, Failures: 0, Errors: 0, Skipped: 0, Time elapsed: 0.001 s - in org.eclipse.ease.tools.RunnableWithResultTest
06:42:53 [2020-09-12T10:42:53.646Z] testException(org.eclipse.ease.tools.RunnableWithResultTest)  Time elapsed: 0 s
06:42:53 [2020-09-12T10:42:53.646Z] testResult(org.eclipse.ease.tools.RunnableWithResultTest)  Time elapsed: 0 s
06:42:53 [2020-09-12T10:42:53.646Z] Running org.eclipse.ease.tools.StringToolsTest
06:42:53 [2020-09-12T10:42:53.646Z] Tests run: 8, Failures: 0, Errors: 0, Skipped: 0, Time elapsed: 0.003 s - in org.eclipse.ease.tools.StringToolsTest
06:42:53 [2020-09-12T10:42:53.646Z] parseArgumentsNull(org.eclipse.ease.tools.StringToolsTest)  Time elapsed: 0 s
06:42:53 [2020-09-12T10:42:53.646Z] parseArgumentsQuotedSingle(org.eclipse.ease.tools.StringToolsTest)  Time elapsed: 0.001 s
06:42:53 [2020-09-12T10:42:53.646Z] parseArgumentsEmpty(org.eclipse.ease.tools.StringToolsTest)  Time elapsed: 0 s
06:42:53 [2020-09-12T10:42:53.646Z] parseArgumentsMixedMultiple(org.eclipse.ease.tools.StringToolsTest)  Time elapsed: 0 s
06:42:53 [2020-09-12T10:42:53.646Z] parseArgumentsMixedMultipleLines(org.eclipse.ease.tools.StringToolsTest)  Time elapsed: 0 s
06:42:53 [2020-09-12T10:42:53.647Z] parseArgumentsNonQuotedMultiple(org.eclipse.ease.tools.StringToolsTest)  Time elapsed: 0.001 s
06:42:53 [2020-09-12T10:42:53.647Z] parseArgumentsNonQuotedSingle(org.eclipse.ease.tools.StringToolsTest)  Time elapsed: 0 s
06:42:53 [2020-09-12T10:42:53.647Z] parseArgumentsQuotedMultiple(org.eclipse.ease.tools.StringToolsTest)  Time elapsed: 0 s
06:42:53 [2020-09-12T10:42:53.647Z] Running org.eclipse.ease.tools.ResourceToolsTest
06:42:53 [2020-09-12T10:42:53.902Z] Tests run: 47, Failures: 0, Errors: 0, Skipped: 0, Time elapsed: 0.061 s - in org.eclipse.ease.tools.ResourceToolsTest
06:42:53 [2020-09-12T10:42:53.902Z] resolveScriptLocation(org.eclipse.ease.tools.ResourceToolsTest)  Time elapsed: 0.008 s
06:42:53 [2020-09-12T10:42:53.902Z] getWorkspaceInputStream(org.eclipse.ease.tools.ResourceToolsTest)  Time elapsed: 0 s
06:42:53 [2020-09-12T10:42:53.902Z] resolvePlatformURI(org.eclipse.ease.tools.ResourceToolsTest)  Time elapsed: 0.001 s
06:42:53 [2020-09-12T10:42:53.902Z] resolveScriptLocationWithSpacesInPath(org.eclipse.ease.tools.ResourceToolsTest)  Time elapsed: 0.001 s
06:42:53 [2020-09-12T10:42:53.902Z] resolveURL(org.eclipse.ease.tools.ResourceToolsTest)  Time elapsed: 0 s
06:42:53 [2020-09-12T10:42:53.902Z] invalidIsAbsolute(org.eclipse.ease.tools.ResourceToolsTest)  Time elapsed: 0 s
06:42:53 [2020-09-12T10:42:53.902Z] getFilesystemInputStream(org.eclipse.ease.tools.ResourceToolsTest)  Time elapsed: 0 s
06:42:53 [2020-09-12T10:42:53.903Z] toRelativeLocationInWorkspace(org.eclipse.ease.tools.ResourceToolsTest)  Time elapsed: 0.001 s
06:42:53 [2020-09-12T10:42:53.903Z] checkOperatingSystem(org.eclipse.ease.tools.ResourceToolsTest)  Time elapsed: 0 s
06:42:53 [2020-09-12T10:42:53.903Z] inputStreamToString(org.eclipse.ease.tools.ResourceToolsTest)  Time elapsed: 0 s
06:42:53 [2020-09-12T10:42:53.903Z] fileSystemToAbsoluteLocationOnLinux(org.eclipse.ease.tools.ResourceToolsTest)  Time elapsed: 0 s
06:42:53 [2020-09-12T10:42:53.903Z] exists(org.eclipse.ease.tools.ResourceToolsTest)  Time elapsed: 0 s
06:42:53 [2020-09-12T10:42:53.903Z] resolveRelativeInWorkspace(org.eclipse.ease.tools.ResourceToolsTest)  Time elapsed: 0.001 s
06:42:53 [2020-09-12T10:42:53.903Z] isFile(org.eclipse.ease.tools.ResourceToolsTest)  Time elapsed: 0 s
06:42:53 [2020-09-12T10:42:53.903Z] invalidToFile(org.eclipse.ease.tools.ResourceToolsTest)  Time elapsed: 0 s
06:42:53 [2020-09-12T10:42:53.903Z] resolveAbsoluteInFileSystem(org.eclipse.ease.tools.ResourceToolsTest)  Time elapsed: 0 s
06:42:53 [2020-09-12T10:42:53.903Z] resolveWindowsRoot(org.eclipse.ease.tools.ResourceToolsTest)  Time elapsed: 0 s
06:42:53 [2020-09-12T10:42:53.903Z] resolveRelativeInFileSystemOnWindows(org.eclipse.ease.tools.ResourceToolsTest)  Time elapsed: 0 s
06:42:53 [2020-09-12T10:42:53.903Z] isAbsoluteFileSystemPathOnWindows(org.eclipse.ease.tools.ResourceToolsTest)  Time elapsed: 0 s
06:42:53 [2020-09-12T10:42:53.903Z] readerToString(org.eclipse.ease.tools.ResourceToolsTest)  Time elapsed: 0 s
06:42:53 [2020-09-12T10:42:53.903Z] workspaceFileToString(org.eclipse.ease.tools.ResourceToolsTest)  Time elapsed: 0 s
06:42:53 [2020-09-12T10:42:53.903Z] toFile(org.eclipse.ease.tools.ResourceToolsTest)  Time elapsed: 0 s
06:42:53 [2020-09-12T10:42:53.903Z] toProjectRelativeLocation(org.eclipse.ease.tools.ResourceToolsTest)  Time elapsed: 0 s
06:42:53 [2020-09-12T10:42:53.903Z] getInvalidInputStream(org.eclipse.ease.tools.ResourceToolsTest)  Time elapsed: 0.003 s
06:42:53 [2020-09-12T10:42:53.903Z] resolveRelativeInFileSystemOnLinux(org.eclipse.ease.tools.ResourceToolsTest)  Time elapsed: 0 s
06:42:53 [2020-09-12T10:42:53.903Z] isFolder(org.eclipse.ease.tools.ResourceToolsTest)  Time elapsed: 0 s
06:42:53 [2020-09-12T10:42:53.903Z] fileSystemToAbsoluteLocationOnWindows(org.eclipse.ease.tools.ResourceToolsTest)  Time elapsed: 0 s
06:42:53 [2020-09-12T10:42:53.903Z] isAbsoluteWorkspacePath(org.eclipse.ease.tools.ResourceToolsTest)  Time elapsed: 0.001 s
06:42:53 [2020-09-12T10:42:53.903Z] isAbsoluteFileSystemPathOnLinux(org.eclipse.ease.tools.ResourceToolsTest)  Time elapsed: 0 s
06:42:53 [2020-09-12T10:42:53.903Z] resolveInvalid(org.eclipse.ease.tools.ResourceToolsTest)  Time elapsed: 0 s
06:42:53 [2020-09-12T10:42:53.903Z] resolveAbsoluteInFileSystemOnWindows(org.eclipse.ease.tools.ResourceToolsTest)  Time elapsed: 0 s
06:42:53 [2020-09-12T10:42:53.903Z] resolveScriptLocationWithSpacesInDomain(org.eclipse.ease.tools.ResourceToolsTest)  Time elapsed: 0 s
06:42:53 [2020-09-12T10:42:53.903Z] resolveRelativefromWorkspaceToFilesystem(org.eclipse.ease.tools.ResourceToolsTest)  Time elapsed: 0 s
06:42:53 [2020-09-12T10:42:53.903Z] resolveRelativeWithoutBaseFile(org.eclipse.ease.tools.ResourceToolsTest)  Time elapsed: 0 s
06:42:53 [2020-09-12T10:42:53.903Z] resolveInWorkspace(org.eclipse.ease.tools.ResourceToolsTest)  Time elapsed: 0 s
06:42:53 [2020-09-12T10:42:53.903Z] resolveScriptLocationWithSpecialCharactersInPath(org.eclipse.ease.tools.ResourceToolsTest)  Time elapsed: 0 s
06:42:53 [2020-09-12T10:42:53.903Z] filesystemFileToString(org.eclipse.ease.tools.ResourceToolsTest)  Time elapsed: 0 s
06:42:53 [2020-09-12T10:42:53.903Z] createURI(org.eclipse.ease.tools.ResourceToolsTest)  Time elapsed: 0 s
06:42:53 [2020-09-12T10:42:53.903Z] uriToAbsoluteLocation(org.eclipse.ease.tools.ResourceToolsTest)  Time elapsed: 0 s
06:42:53 [2020-09-12T10:42:53.903Z] createFolder(org.eclipse.ease.tools.ResourceToolsTest)  Time elapsed: 0.003 s
06:42:53 [2020-09-12T10:42:53.903Z] workspaceToAbsoluteLocation(org.eclipse.ease.tools.ResourceToolsTest)  Time elapsed: 0 s
06:42:53 [2020-09-12T10:42:53.903Z] resolveAbsoluteInFileSystemOnLinux(org.eclipse.ease.tools.ResourceToolsTest)  Time elapsed: 0 s
06:42:53 [2020-09-12T10:42:53.903Z] invalidToString(org.eclipse.ease.tools.ResourceToolsTest)  Time elapsed: 0 s
06:42:53 [2020-09-12T10:42:53.903Z] resolveRelativeURIs(org.eclipse.ease.tools.ResourceToolsTest)  Time elapsed: 0 s
06:42:53 [2020-09-12T10:42:53.903Z] resolveRelativeInFileSystem(org.eclipse.ease.tools.ResourceToolsTest)  Time elapsed: 0 s
06:42:53 [2020-09-12T10:42:53.903Z] resolveScriptLocationWithSpecialCharactersInDomain(org.eclipse.ease.tools.ResourceToolsTest)  Time elapsed: 0.003 s
06:42:53 [2020-09-12T10:42:53.903Z] isAbsoluteURL(org.eclipse.ease.tools.ResourceToolsTest)  Time elapsed: 0 s
06:42:53 [2020-09-12T10:42:53.903Z] Running org.eclipse.ease.AbstractCodeParserTest
06:42:53 [2020-09-12T10:42:53.903Z] Tests run: 5, Failures: 0, Errors: 0, Skipped: 0, Time elapsed: 0.003 s - in org.eclipse.ease.AbstractCodeParserTest
06:42:53 [2020-09-12T10:42:53.903Z] parseCode(org.eclipse.ease.AbstractCodeParserTest)  Time elapsed: 0.001 s
06:42:53 [2020-09-12T10:42:53.903Z] parseLineHeader(org.eclipse.ease.AbstractCodeParserTest)  Time elapsed: 0 s
06:42:53 [2020-09-12T10:42:53.903Z] parseBlockAfterWhitespace(org.eclipse.ease.AbstractCodeParserTest)  Time elapsed: 0 s
06:42:53 [2020-09-12T10:42:53.903Z] parseEmpty(org.eclipse.ease.AbstractCodeParserTest)  Time elapsed: 0 s
06:42:53 [2020-09-12T10:42:53.903Z] parseBlockHeader(org.eclipse.ease.AbstractCodeParserTest)  Time elapsed: 0 s
06:42:53 [2020-09-12T10:42:53.903Z] Running org.eclipse.ease.ScriptResultTest
06:42:53 [2020-09-12T10:42:53.903Z] Tests run: 4, Failures: 0, Errors: 0, Skipped: 0, Time elapsed: 0.001 s - in org.eclipse.ease.ScriptResultTest
06:42:53 [2020-09-12T10:42:53.903Z] hasException(org.eclipse.ease.ScriptResultTest)  Time elapsed: 0 s
06:42:53 [2020-09-12T10:42:53.903Z] getResult(org.eclipse.ease.ScriptResultTest)  Time elapsed: 0 s
06:42:53 [2020-09-12T10:42:53.903Z] getException(org.eclipse.ease.ScriptResultTest)  Time elapsed: 0 s
06:42:53 [2020-09-12T10:42:53.903Z] isReady(org.eclipse.ease.ScriptResultTest)  Time elapsed: 0 s
06:42:53 [2020-09-12T10:42:53.903Z] Running org.eclipse.ease.sign.SignatureHelperTest
06:42:53 [2020-09-12T10:42:53.903Z] Tests run: 1, Failures: 0, Errors: 0, Skipped: 0, Time elapsed: 0.006 s - in org.eclipse.ease.sign.SignatureHelperTest
06:42:53 [2020-09-12T10:42:53.903Z] certificateTest(org.eclipse.ease.sign.SignatureHelperTest)  Time elapsed: 0.006 s
06:42:53 [2020-09-12T10:42:53.903Z] Running org.eclipse.ease.sign.VerifySignatureTest
06:42:53 [2020-09-12T10:42:53.903Z] Tests run: 1, Failures: 0, Errors: 0, Skipped: 0, Time elapsed: 0.042 s - in org.eclipse.ease.sign.VerifySignatureTest
06:42:53 [2020-09-12T10:42:53.903Z] testWithNonCodeParserScriptType(org.eclipse.ease.sign.VerifySignatureTest)  Time elapsed: 0.042 s
06:42:53 [2020-09-12T10:42:53.903Z] Running org.eclipse.ease.AbstractCodeFactoryTest
06:42:53 [2020-09-12T10:42:53.903Z] Tests run: 1, Failures: 0, Errors: 0, Skipped: 0, Time elapsed: 0.013 s - in org.eclipse.ease.AbstractCodeFactoryTest
06:42:53 [2020-09-12T10:42:53.903Z] createNewKeywordHeader(org.eclipse.ease.AbstractCodeFactoryTest)  Time elapsed: 0.013 s
06:42:53 [2020-09-12T10:42:53.903Z] Running org.eclipse.ease.AbstractReplScriptEngineTest
06:42:59 [2020-09-12T10:42:59.155Z] testorg.eclipse.ease.ScriptExecutionException: Engine got terminated
06:42:59 [2020-09-12T10:42:59.155Z] java.lang.RuntimeException: ERROR
06:42:59 [2020-09-12T10:42:59.155Z] 	at org.eclipse.ease.AbstractReplScriptEngineTest$MockedScriptEngine.execute(AbstractReplScriptEngineTest.java:61)
06:42:59 [2020-09-12T10:42:59.155Z] 	at org.eclipse.ease.AbstractScriptEngine.inject(AbstractScriptEngine.java:222)
06:42:59 [2020-09-12T10:42:59.155Z] 	at org.eclipse.ease.AbstractScriptEngine.run(AbstractScriptEngine.java:272)
06:42:59 [2020-09-12T10:42:59.155Z] 	at org.eclipse.core.internal.jobs.Worker.run(Worker.java:63)
06:42:59 [2020-09-12T10:42:59.717Z] Hello worldHello world1Tests run: 20, Failures: 0, Errors: 0, Skipped: 0, Time elapsed: 5.657 s - in org.eclipse.ease.AbstractReplScriptEngineTest
06:42:59 [2020-09-12T10:42:59.717Z] terminateOnIdleAfterSchedule(org.eclipse.ease.AbstractReplScriptEngineTest)  Time elapsed: 0.02 s
06:42:59 [2020-09-12T10:42:59.717Z] terminateEngine(org.eclipse.ease.AbstractReplScriptEngineTest)  Time elapsed: 0.001 s
06:42:59 [2020-09-12T10:42:59.717Z] keepRunningOnIdle(org.eclipse.ease.AbstractReplScriptEngineTest)  Time elapsed: 1.001 s
06:42:59 [2020-09-12T10:42:59.717Z] extractEmptyArguments(org.eclipse.ease.AbstractReplScriptEngineTest)  Time elapsed: 0 s
06:42:59 [2020-09-12T10:42:59.717Z] setNotNullOutputStream(org.eclipse.ease.AbstractReplScriptEngineTest)  Time elapsed: 0 s
06:42:59 [2020-09-12T10:42:59.717Z] terminateViaMonitorCancellation(org.eclipse.ease.AbstractReplScriptEngineTest)  Time elapsed: 1.101 s
06:42:59 [2020-09-12T10:42:59.717Z] inject(org.eclipse.ease.AbstractReplScriptEngineTest)  Time elapsed: 0 s
06:42:59 [2020-09-12T10:42:59.717Z] extractArguments(org.eclipse.ease.AbstractReplScriptEngineTest)  Time elapsed: 0 s
06:42:59 [2020-09-12T10:42:59.717Z] executeSync(org.eclipse.ease.AbstractReplScriptEngineTest)  Time elapsed: 1.002 s
06:42:59 [2020-09-12T10:42:59.717Z] setNotNullErrorStream(org.eclipse.ease.AbstractReplScriptEngineTest)  Time elapsed: 0 s
06:42:59 [2020-09-12T10:42:59.717Z] setNullErrorStream(org.eclipse.ease.AbstractReplScriptEngineTest)  Time elapsed: 0 s
06:42:59 [2020-09-12T10:42:59.717Z] isJob(org.eclipse.ease.AbstractReplScriptEngineTest)  Time elapsed: 0 s
06:42:59 [2020-09-12T10:42:59.717Z] streamsAvailable(org.eclipse.ease.AbstractReplScriptEngineTest)  Time elapsed: 0 s
06:42:59 [2020-09-12T10:42:59.717Z] executeValidCodeAndTerminate(org.eclipse.ease.AbstractReplScriptEngineTest)  Time elapsed: 0 s
06:42:59 [2020-09-12T10:42:59.717Z] setNullOutputStream(org.eclipse.ease.AbstractReplScriptEngineTest)  Time elapsed: 0 s
06:42:59 [2020-09-12T10:42:59.717Z] terminateMultipleTimes(org.eclipse.ease.AbstractReplScriptEngineTest)  Time elapsed: 0.301 s
06:42:59 [2020-09-12T10:42:59.717Z] engineTerminatesWhenIdle(org.eclipse.ease.AbstractReplScriptEngineTest)  Time elapsed: 0.001 s
06:42:59 [2020-09-12T10:42:59.717Z] terminateViaTerminateMethod(org.eclipse.ease.AbstractReplScriptEngineTest)  Time elapsed: 1.201 s
06:42:59 [2020-09-12T10:42:59.717Z] terminateViaMethodCallback(org.eclipse.ease.AbstractReplScriptEngineTest)  Time elapsed: 0.001 s
06:42:59 [2020-09-12T10:42:59.717Z] executeErrorCodeAndTerminate(org.eclipse.ease.AbstractReplScriptEngineTest)  Time elapsed: 1.001 s
06:42:59 [2020-09-12T10:42:59.717Z] 
06:42:59 [2020-09-12T10:42:59.717Z] Results:
06:42:59 [2020-09-12T10:42:59.717Z] 
06:42:59 [2020-09-12T10:42:59.717Z] Tests run: 124, Failures: 0, Errors: 0, Skipped: 0
06:42:59 [2020-09-12T10:42:59.717Z] 
06:42:59 [2020-09-12T10:42:59.973Z] [INFO] All tests passed!
06:42:59 [2020-09-12T10:42:59.973Z] [INFO] 
06:42:59 [2020-09-12T10:42:59.973Z] [INFO] ---< org.eclipse.ease:org.eclipse.ease.lang.javascript.nashorn.test >---
06:42:59 [2020-09-12T10:42:59.973Z] [INFO] Building org.eclipse.ease.lang.javascript.nashorn.test 0.8.0-SNAPSHOT [4/11]
06:42:59 [2020-09-12T10:42:59.973Z] [INFO] ------------------------[ eclipse-test-plugin ]-------------------------
06:42:59 [2020-09-12T10:42:59.973Z] [INFO] 
06:42:59 [2020-09-12T10:42:59.973Z] [INFO] --- tycho-packaging-plugin:1.3.0:build-qualifier (default-build-qualifier) @ org.eclipse.ease.lang.javascript.nashorn.test ---
06:42:59 [2020-09-12T10:42:59.973Z] [INFO] The project's OSGi version is 0.8.0.I201910171213
06:42:59 [2020-09-12T10:42:59.973Z] [INFO] 
06:42:59 [2020-09-12T10:42:59.973Z] [INFO] --- tycho-packaging-plugin:1.3.0:validate-id (default-validate-id) @ org.eclipse.ease.lang.javascript.nashorn.test ---
06:42:59 [2020-09-12T10:42:59.973Z] [INFO] 
06:42:59 [2020-09-12T10:42:59.973Z] [INFO] --- tycho-packaging-plugin:1.3.0:validate-version (default-validate-version) @ org.eclipse.ease.lang.javascript.nashorn.test ---
06:42:59 [2020-09-12T10:42:59.973Z] [INFO] 
06:42:59 [2020-09-12T10:42:59.973Z] [INFO] --- maven-resources-plugin:2.4.3:resources (default-resources) @ org.eclipse.ease.lang.javascript.nashorn.test ---
06:42:59 [2020-09-12T10:42:59.973Z] [INFO] Using 'UTF-8' encoding to copy filtered resources.
06:42:59 [2020-09-12T10:42:59.973Z] [INFO] skip non existing resourceDirectory /home/jenkins/agent/workspace/ease.verify.core.target.2019-12/tests/org.eclipse.ease.lang.javascript.nashorn.test/src/main/resources
06:42:59 [2020-09-12T10:42:59.973Z] [INFO] 
06:42:59 [2020-09-12T10:42:59.973Z] [INFO] --- tycho-compiler-plugin:1.3.0:compile (default-compile) @ org.eclipse.ease.lang.javascript.nashorn.test ---
06:42:59 [2020-09-12T10:42:59.973Z] [INFO] Nothing to compile - all classes are up to date
06:42:59 [2020-09-12T10:42:59.973Z] [INFO] 
06:42:59 [2020-09-12T10:42:59.973Z] [INFO] --- maven-resources-plugin:2.4.3:testResources (default-testResources) @ org.eclipse.ease.lang.javascript.nashorn.test ---
06:42:59 [2020-09-12T10:42:59.973Z] [INFO] Using 'UTF-8' encoding to copy filtered resources.
06:42:59 [2020-09-12T10:42:59.973Z] [INFO] skip non existing resourceDirectory /home/jenkins/agent/workspace/ease.verify.core.target.2019-12/tests/org.eclipse.ease.lang.javascript.nashorn.test/src/test/resources
06:42:59 [2020-09-12T10:42:59.973Z] [INFO] 
06:42:59 [2020-09-12T10:42:59.973Z] [INFO] --- tycho-source-plugin:1.3.0:plugin-source (plugin-source) @ org.eclipse.ease.lang.javascript.nashorn.test ---
06:42:59 [2020-09-12T10:42:59.973Z] [WARNING] Bundle-Vendor header not found in /home/jenkins/agent/workspace/ease.verify.core.target.2019-12/tests/org.eclipse.ease.lang.javascript.nashorn.test/META-INF/MANIFEST.MF, fallback to 'unknown' for source bundle
06:42:59 [2020-09-12T10:42:59.974Z] [INFO] Building jar: /home/jenkins/agent/workspace/ease.verify.core.target.2019-12/tests/org.eclipse.ease.lang.javascript.nashorn.test/target/org.eclipse.ease.lang.javascript.nashorn.test-0.8.0-SNAPSHOT-sources.jar
06:42:59 [2020-09-12T10:42:59.974Z] [INFO] 
06:42:59 [2020-09-12T10:42:59.974Z] [INFO] --- target-platform-configuration:1.3.0:target-platform (default-target-platform) @ org.eclipse.ease.lang.javascript.nashorn.test ---
06:42:59 [2020-09-12T10:42:59.974Z] [INFO] 
06:42:59 [2020-09-12T10:42:59.974Z] [INFO] --- tycho-packaging-plugin:1.3.0:package-plugin (default-package-plugin) @ org.eclipse.ease.lang.javascript.nashorn.test ---
06:42:59 [2020-09-12T10:42:59.974Z] [INFO] Building jar: /home/jenkins/agent/workspace/ease.verify.core.target.2019-12/tests/org.eclipse.ease.lang.javascript.nashorn.test/target/org.eclipse.ease.lang.javascript.nashorn.test-0.8.0-SNAPSHOT.jar
06:42:59 [2020-09-12T10:42:59.974Z] [INFO] 
06:42:59 [2020-09-12T10:42:59.974Z] [INFO] --- tycho-p2-plugin:1.3.0:p2-metadata-default (default-p2-metadata-default) @ org.eclipse.ease.lang.javascript.nashorn.test ---
06:42:59 [2020-09-12T10:42:59.974Z] [INFO] 
06:42:59 [2020-09-12T10:42:59.974Z] [INFO] --- tycho-source-feature-plugin:1.3.0:source-feature (source-feature) @ org.eclipse.ease.lang.javascript.nashorn.test ---
06:42:59 [2020-09-12T10:42:59.974Z] [INFO] 
06:42:59 [2020-09-12T10:42:59.974Z] [INFO] --- tycho-p2-plugin:1.3.0:p2-metadata (attached-p2-metadata) @ org.eclipse.ease.lang.javascript.nashorn.test ---
06:42:59 [2020-09-12T10:42:59.974Z] [INFO] 
06:42:59 [2020-09-12T10:42:59.974Z] [INFO] --- tycho-surefire-plugin:1.3.0:test (default-test) @ org.eclipse.ease.lang.javascript.nashorn.test ---
06:43:00 [2020-09-12T10:43:00.229Z] [INFO] Expected eclipse log file: /home/jenkins/agent/workspace/ease.verify.core.target.2019-12/tests/org.eclipse.ease.lang.javascript.nashorn.test/target/work/data/.metadata/.log
06:43:00 [2020-09-12T10:43:00.229Z] [INFO] Command line:
06:43:00 [2020-09-12T10:43:00.229Z] 	[/opt/tools/java/oracle/jdk-8/1.8.0_202/jre/bin/java, -Dosgi.noShutdown=false, -Dosgi.os=linux, -Dosgi.ws=gtk, -Dosgi.arch=x86_64, -Dosgi.clean=true, -jar, /home/jenkins/.m2/repository/p2/osgi/bundle/org.eclipse.equinox.launcher/1.5.600.v20191014-2022/org.eclipse.equinox.launcher-1.5.600.v20191014-2022.jar, -data, /home/jenkins/agent/workspace/ease.verify.core.target.2019-12/tests/org.eclipse.ease.lang.javascript.nashorn.test/target/work/data, -install, /home/jenkins/agent/workspace/ease.verify.core.target.2019-12/tests/org.eclipse.ease.lang.javascript.nashorn.test/target/work, -configuration, /home/jenkins/agent/workspace/ease.verify.core.target.2019-12/tests/org.eclipse.ease.lang.javascript.nashorn.test/target/work/configuration, -application, org.eclipse.tycho.surefire.osgibooter.headlesstest, -testproperties, /home/jenkins/agent/workspace/ease.verify.core.target.2019-12/tests/org.eclipse.ease.lang.javascript.nashorn.test/target/surefire.properties]
06:43:00 [2020-09-12T10:43:00.229Z] Picked up JAVA_TOOL_OPTIONS: -Dmaven.ext.class.path="/home/jenkins/agent/workspace/ease.verify.core.target.2019-12@tmp/withMaven013285c7/pipeline-maven-spy.jar" -Dorg.jenkinsci.plugins.pipeline.maven.reportsFolder="/home/jenkins/agent/workspace/ease.verify.core.target.2019-12@tmp/withMaven013285c7" 
06:43:01 [2020-09-12T10:43:01.173Z] Running org.eclipse.ease.lang.javascript.nashorn.NashornEnvironmentTest
06:43:02 [2020-09-12T10:43:02.099Z] Tests run: 5, Failures: 0, Errors: 0, Skipped: 0, Time elapsed: 0.64 s - in org.eclipse.ease.lang.javascript.nashorn.NashornEnvironmentTest
06:43:02 [2020-09-12T10:43:02.099Z] reloadEnvironment(org.eclipse.ease.lang.javascript.nashorn.NashornEnvironmentTest)  Time elapsed: 0.418 s
06:43:02 [2020-09-12T10:43:02.099Z] bootstrappedEnvironment(org.eclipse.ease.lang.javascript.nashorn.NashornEnvironmentTest)  Time elapsed: 0.053 s
06:43:02 [2020-09-12T10:43:02.099Z] postMethodCallback(org.eclipse.ease.lang.javascript.nashorn.NashornEnvironmentTest)  Time elapsed: 0.098 s
06:43:02 [2020-09-12T10:43:02.099Z] preMethodCallback(org.eclipse.ease.lang.javascript.nashorn.NashornEnvironmentTest)  Time elapsed: 0.025 s
06:43:02 [2020-09-12T10:43:02.100Z] reloadFunctionDefinitions(org.eclipse.ease.lang.javascript.nashorn.NashornEnvironmentTest)  Time elapsed: 0.031 s
06:43:02 [2020-09-12T10:43:02.100Z] 
06:43:02 [2020-09-12T10:43:02.100Z] Results:
06:43:02 [2020-09-12T10:43:02.100Z] 
06:43:02 [2020-09-12T10:43:02.100Z] Tests run: 5, Failures: 0, Errors: 0, Skipped: 0
06:43:02 [2020-09-12T10:43:02.100Z] 
06:43:02 [2020-09-12T10:43:02.355Z] [INFO] All tests passed!
06:43:02 [2020-09-12T10:43:02.355Z] [INFO] 
06:43:02 [2020-09-12T10:43:02.355Z] [INFO] ----< org.eclipse.ease:org.eclipse.ease.lang.javascript.rhino.test >----
06:43:02 [2020-09-12T10:43:02.355Z] [INFO] Building org.eclipse.ease.lang.javascript.rhino.test 0.8.0-SNAPSHOT [5/11]
06:43:02 [2020-09-12T10:43:02.355Z] [INFO] ------------------------[ eclipse-test-plugin ]-------------------------
06:43:02 [2020-09-12T10:43:02.355Z] [INFO] 
06:43:02 [2020-09-12T10:43:02.355Z] [INFO] --- tycho-packaging-plugin:1.3.0:build-qualifier (default-build-qualifier) @ org.eclipse.ease.lang.javascript.rhino.test ---
06:43:02 [2020-09-12T10:43:02.355Z] [INFO] The project's OSGi version is 0.8.0.I201911291239
06:43:02 [2020-09-12T10:43:02.355Z] [INFO] 
06:43:02 [2020-09-12T10:43:02.355Z] [INFO] --- tycho-packaging-plugin:1.3.0:validate-id (default-validate-id) @ org.eclipse.ease.lang.javascript.rhino.test ---
06:43:02 [2020-09-12T10:43:02.355Z] [INFO] 
06:43:02 [2020-09-12T10:43:02.355Z] [INFO] --- tycho-packaging-plugin:1.3.0:validate-version (default-validate-version) @ org.eclipse.ease.lang.javascript.rhino.test ---
06:43:02 [2020-09-12T10:43:02.355Z] [INFO] 
06:43:02 [2020-09-12T10:43:02.355Z] [INFO] --- maven-resources-plugin:2.4.3:resources (default-resources) @ org.eclipse.ease.lang.javascript.rhino.test ---
06:43:02 [2020-09-12T10:43:02.355Z] [INFO] Using 'UTF-8' encoding to copy filtered resources.
06:43:02 [2020-09-12T10:43:02.355Z] [INFO] skip non existing resourceDirectory /home/jenkins/agent/workspace/ease.verify.core.target.2019-12/tests/org.eclipse.ease.lang.javascript.rhino.test/src/main/resources
06:43:02 [2020-09-12T10:43:02.355Z] [INFO] 
06:43:02 [2020-09-12T10:43:02.355Z] [INFO] --- tycho-compiler-plugin:1.3.0:compile (default-compile) @ org.eclipse.ease.lang.javascript.rhino.test ---
06:43:02 [2020-09-12T10:43:02.355Z] [INFO] Nothing to compile - all classes are up to date
06:43:02 [2020-09-12T10:43:02.355Z] [INFO] 
06:43:02 [2020-09-12T10:43:02.355Z] [INFO] --- maven-resources-plugin:2.4.3:testResources (default-testResources) @ org.eclipse.ease.lang.javascript.rhino.test ---
06:43:02 [2020-09-12T10:43:02.355Z] [INFO] Using 'UTF-8' encoding to copy filtered resources.
06:43:02 [2020-09-12T10:43:02.355Z] [INFO] skip non existing resourceDirectory /home/jenkins/agent/workspace/ease.verify.core.target.2019-12/tests/org.eclipse.ease.lang.javascript.rhino.test/src/test/resources
06:43:02 [2020-09-12T10:43:02.355Z] [INFO] 
06:43:02 [2020-09-12T10:43:02.355Z] [INFO] --- tycho-source-plugin:1.3.0:plugin-source (plugin-source) @ org.eclipse.ease.lang.javascript.rhino.test ---
06:43:02 [2020-09-12T10:43:02.356Z] [WARNING] Bundle-Vendor header not found in /home/jenkins/agent/workspace/ease.verify.core.target.2019-12/tests/org.eclipse.ease.lang.javascript.rhino.test/META-INF/MANIFEST.MF, fallback to 'unknown' for source bundle
06:43:02 [2020-09-12T10:43:02.356Z] [INFO] Building jar: /home/jenkins/agent/workspace/ease.verify.core.target.2019-12/tests/org.eclipse.ease.lang.javascript.rhino.test/target/org.eclipse.ease.lang.javascript.rhino.test-0.8.0-SNAPSHOT-sources.jar
06:43:02 [2020-09-12T10:43:02.356Z] [INFO] 
06:43:02 [2020-09-12T10:43:02.356Z] [INFO] --- target-platform-configuration:1.3.0:target-platform (default-target-platform) @ org.eclipse.ease.lang.javascript.rhino.test ---
06:43:02 [2020-09-12T10:43:02.356Z] [INFO] 
06:43:02 [2020-09-12T10:43:02.356Z] [INFO] --- tycho-packaging-plugin:1.3.0:package-plugin (default-package-plugin) @ org.eclipse.ease.lang.javascript.rhino.test ---
06:43:02 [2020-09-12T10:43:02.356Z] [INFO] Building jar: /home/jenkins/agent/workspace/ease.verify.core.target.2019-12/tests/org.eclipse.ease.lang.javascript.rhino.test/target/org.eclipse.ease.lang.javascript.rhino.test-0.8.0-SNAPSHOT.jar
06:43:02 [2020-09-12T10:43:02.356Z] [INFO] 
06:43:02 [2020-09-12T10:43:02.356Z] [INFO] --- tycho-p2-plugin:1.3.0:p2-metadata-default (default-p2-metadata-default) @ org.eclipse.ease.lang.javascript.rhino.test ---
06:43:02 [2020-09-12T10:43:02.356Z] [INFO] 
06:43:02 [2020-09-12T10:43:02.356Z] [INFO] --- tycho-source-feature-plugin:1.3.0:source-feature (source-feature) @ org.eclipse.ease.lang.javascript.rhino.test ---
06:43:02 [2020-09-12T10:43:02.356Z] [INFO] 
06:43:02 [2020-09-12T10:43:02.356Z] [INFO] --- tycho-p2-plugin:1.3.0:p2-metadata (attached-p2-metadata) @ org.eclipse.ease.lang.javascript.rhino.test ---
06:43:02 [2020-09-12T10:43:02.356Z] [INFO] 
06:43:02 [2020-09-12T10:43:02.356Z] [INFO] --- tycho-surefire-plugin:1.3.0:test (default-test) @ org.eclipse.ease.lang.javascript.rhino.test ---
06:43:02 [2020-09-12T10:43:02.611Z] [INFO] Expected eclipse log file: /home/jenkins/agent/workspace/ease.verify.core.target.2019-12/tests/org.eclipse.ease.lang.javascript.rhino.test/target/work/data/.metadata/.log
06:43:02 [2020-09-12T10:43:02.611Z] [INFO] Command line:
06:43:02 [2020-09-12T10:43:02.611Z] 	[/opt/tools/java/oracle/jdk-8/1.8.0_202/jre/bin/java, -Dosgi.noShutdown=false, -Dosgi.os=linux, -Dosgi.ws=gtk, -Dosgi.arch=x86_64, -Dosgi.clean=true, -jar, /home/jenkins/.m2/repository/p2/osgi/bundle/org.eclipse.equinox.launcher/1.5.600.v20191014-2022/org.eclipse.equinox.launcher-1.5.600.v20191014-2022.jar, -data, /home/jenkins/agent/workspace/ease.verify.core.target.2019-12/tests/org.eclipse.ease.lang.javascript.rhino.test/target/work/data, -install, /home/jenkins/agent/workspace/ease.verify.core.target.2019-12/tests/org.eclipse.ease.lang.javascript.rhino.test/target/work, -configuration, /home/jenkins/agent/workspace/ease.verify.core.target.2019-12/tests/org.eclipse.ease.lang.javascript.rhino.test/target/work/configuration, -application, org.eclipse.tycho.surefire.osgibooter.headlesstest, -testproperties, /home/jenkins/agent/workspace/ease.verify.core.target.2019-12/tests/org.eclipse.ease.lang.javascript.rhino.test/target/surefire.properties]
06:43:02 [2020-09-12T10:43:02.611Z] Picked up JAVA_TOOL_OPTIONS: -Dmaven.ext.class.path="/home/jenkins/agent/workspace/ease.verify.core.target.2019-12@tmp/withMaven013285c7/pipeline-maven-spy.jar" -Dorg.jenkinsci.plugins.pipeline.maven.reportsFolder="/home/jenkins/agent/workspace/ease.verify.core.target.2019-12@tmp/withMaven013285c7" 
06:43:04 [2020-09-12T10:43:04.003Z] Running org.eclipse.ease.lang.javascript.rhino.RhinoScriptEngineTest
06:43:04 [2020-09-12T10:43:04.259Z] org.eclipse.ease.ScriptExecutionException: JavaError: NotThere cannot be found by org.mozilla.javascript_1.7.10.v20190430-1943
06:43:04 [2020-09-12T10:43:04.259Z] 	at <unknown source>
06:43:04 [2020-09-12T10:43:04.259Z] 
06:43:04 [2020-09-12T10:43:04.259Z] Java Stacktrace:
06:43:04 [2020-09-12T10:43:04.259Z] java.lang.ClassNotFoundException: NotThere cannot be found by org.mozilla.javascript_1.7.10.v20190430-1943
06:43:04 [2020-09-12T10:43:04.259Z] 	at org.eclipse.osgi.internal.loader.BundleLoader.findClassInternal(BundleLoader.java:514)
06:43:04 [2020-09-12T10:43:04.259Z] 	at org.eclipse.osgi.internal.loader.BundleLoader.findClass(BundleLoader.java:425)
06:43:04 [2020-09-12T10:43:04.259Z] 	at org.eclipse.osgi.internal.loader.BundleLoader.findClass(BundleLoader.java:417)
06:43:04 [2020-09-12T10:43:04.259Z] 	at org.eclipse.osgi.internal.loader.ModuleClassLoader.loadClass(ModuleClassLoader.java:171)
06:43:04 [2020-09-12T10:43:04.259Z] 	at java.lang.ClassLoader.loadClass(ClassLoader.java:357)
06:43:04 [2020-09-12T10:43:04.259Z] 	at java.lang.Class.forName0(Native Method)
06:43:04 [2020-09-12T10:43:04.259Z] 	at java.lang.Class.forName(Class.java:264)
06:43:04 [2020-09-12T10:43:04.259Z] 	at sun.reflect.NativeMethodAccessorImpl.invoke0(Native Method)
06:43:04 [2020-09-12T10:43:04.259Z] 	at sun.reflect.NativeMethodAccessorImpl.invoke(NativeMethodAccessorImpl.java:62)
06:43:04 [2020-09-12T10:43:04.259Z] 	at sun.reflect.DelegatingMethodAccessorImpl.invoke(DelegatingMethodAccessorImpl.java:43)
06:43:04 [2020-09-12T10:43:04.259Z] 	at java.lang.reflect.Method.invoke(Method.java:498)
06:43:04 [2020-09-12T10:43:04.259Z] 	at org.mozilla.javascript.MemberBox.invoke(MemberBox.java:126)
06:43:04 [2020-09-12T10:43:04.259Z] 	at org.mozilla.javascript.NativeJavaMethod.call(NativeJavaMethod.java:225)
06:43:04 [2020-09-12T10:43:04.259Z] 	at org.mozilla.javascript.optimizer.OptRuntime.call1(OptRuntime.java:32)
06:43:04 [2020-09-12T10:43:04.259Z] 	at org.mozilla.javascript.gen.c_3._c_script_0(Unknown Source)
06:43:04 [2020-09-12T10:43:04.259Z] 	at org.mozilla.javascript.gen.c_3.call(Unknown Source)
06:43:04 [2020-09-12T10:43:04.259Z] 	at org.mozilla.javascript.ContextFactory.doTopCall(ContextFactory.java:405)
06:43:04 [2020-09-12T10:43:04.259Z] 	at org.mozilla.javascript.ScriptRuntime.doTopCall(ScriptRuntime.java:3508)
06:43:04 [2020-09-12T10:43:04.259Z] 	at org.mozilla.javascript.gen.c_3.call(Unknown Source)
06:43:04 [2020-09-12T10:43:04.259Z] 	at org.mozilla.javascript.gen.c_3.exec(Unknown Source)
06:43:04 [2020-09-12T10:43:04.259Z] 	at org.mozilla.javascript.Context.evaluateReader(Context.java:1293)
06:43:04 [2020-09-12T10:43:04.259Z] 	at org.eclipse.ease.lang.javascript.rhino.RhinoScriptEngine.internalExecute(RhinoScriptEngine.java:222)
06:43:04 [2020-09-12T10:43:04.259Z] 	at org.eclipse.ease.lang.javascript.rhino.RhinoScriptEngine.execute(RhinoScriptEngine.java:201)
06:43:04 [2020-09-12T10:43:04.259Z] 	at org.eclipse.ease.AbstractScriptEngine.inject(AbstractScriptEngine.java:222)
06:43:04 [2020-09-12T10:43:04.259Z] 	at org.eclipse.ease.AbstractScriptEngine.run(AbstractScriptEngine.java:272)
06:43:04 [2020-09-12T10:43:04.259Z] 	at org.eclipse.core.internal.jobs.Worker.run(Worker.java:63)
06:43:04 [2020-09-12T10:43:04.259Z] org.eclipse.ease.ScriptExecutionException: TypeError: Cannot call method "foobar" of undefined
06:43:04 [2020-09-12T10:43:04.259Z] 	at <unknown source>
06:43:04 [2020-09-12T10:43:04.259Z] org.eclipse.ease.ScriptExecutionException: ScriptException: test
06:43:04 [2020-09-12T10:43:04.259Z] 	at <unknown source>
06:43:04 [2020-09-12T10:43:04.259Z] org.eclipse.ease.ScriptExecutionException: JavaError: java.lang.Exception
06:43:04 [2020-09-12T10:43:04.259Z] 	at <unknown source>
06:43:04 [2020-09-12T10:43:04.259Z] 
06:43:04 [2020-09-12T10:43:04.259Z] Java Stacktrace:
06:43:04 [2020-09-12T10:43:04.259Z] java.lang.Exception
06:43:04 [2020-09-12T10:43:04.259Z] 	at sun.reflect.NativeConstructorAccessorImpl.newInstance0(Native Method)
06:43:04 [2020-09-12T10:43:04.259Z] 	at sun.reflect.NativeConstructorAccessorImpl.newInstance(NativeConstructorAccessorImpl.java:62)
06:43:04 [2020-09-12T10:43:04.259Z] 	at sun.reflect.DelegatingConstructorAccessorImpl.newInstance(DelegatingConstructorAccessorImpl.java:45)
06:43:04 [2020-09-12T10:43:04.259Z] 	at java.lang.reflect.Constructor.newInstance(Constructor.java:423)
06:43:04 [2020-09-12T10:43:04.259Z] 	at org.mozilla.javascript.MemberBox.newInstance(MemberBox.java:159)
06:43:04 [2020-09-12T10:43:04.259Z] 	at org.mozilla.javascript.NativeJavaClass.constructInternal(NativeJavaClass.java:266)
06:43:04 [2020-09-12T10:43:04.259Z] 	at org.mozilla.javascript.NativeJavaClass.constructSpecific(NativeJavaClass.java:205)
06:43:04 [2020-09-12T10:43:04.259Z] 	at org.mozilla.javascript.NativeJavaClass.construct(NativeJavaClass.java:166)
06:43:04 [2020-09-12T10:43:04.259Z] 	at org.mozilla.javascript.ScriptRuntime.newObject(ScriptRuntime.java:2655)
06:43:04 [2020-09-12T10:43:04.259Z] 	at org.mozilla.javascript.gen.c_21._c_script_0(Unknown Source)
06:43:04 [2020-09-12T10:43:04.259Z] 	at org.mozilla.javascript.gen.c_21.call(Unknown Source)
06:43:04 [2020-09-12T10:43:04.259Z] 	at org.mozilla.javascript.ContextFactory.doTopCall(ContextFactory.java:405)
06:43:04 [2020-09-12T10:43:04.259Z] 	at org.mozilla.javascript.ScriptRuntime.doTopCall(ScriptRuntime.java:3508)
06:43:04 [2020-09-12T10:43:04.259Z] 	at org.mozilla.javascript.gen.c_21.call(Unknown Source)
06:43:04 [2020-09-12T10:43:04.259Z] 	at org.mozilla.javascript.gen.c_21.exec(Unknown Source)
06:43:04 [2020-09-12T10:43:04.259Z] 	at org.mozilla.javascript.Context.evaluateReader(Context.java:1293)
06:43:04 [2020-09-12T10:43:04.259Z] 	at org.eclipse.ease.lang.javascript.rhino.RhinoScriptEngine.internalExecute(RhinoScriptEngine.java:222)
06:43:04 [2020-09-12T10:43:04.259Z] 	at org.eclipse.ease.lang.javascript.rhino.RhinoScriptEngine.execute(RhinoScriptEngine.java:201)
06:43:04 [2020-09-12T10:43:04.259Z] 	at org.eclipse.ease.AbstractScriptEngine.inject(AbstractScriptEngine.java:222)
06:43:04 [2020-09-12T10:43:04.259Z] 	at org.eclipse.ease.AbstractScriptEngine.run(AbstractScriptEngine.java:272)
06:43:04 [2020-09-12T10:43:04.259Z] 	at org.eclipse.core.internal.jobs.Worker.run(Worker.java:63)
06:43:04 [2020-09-12T10:43:04.259Z] org.eclipse.ease.ScriptExecutionException: ScriptException: JavaScript
06:43:04 [2020-09-12T10:43:04.259Z] 	at <unknown source>
06:43:04 [2020-09-12T10:43:04.259Z] org.eclipse.ease.ScriptExecutionException: SyntaxError: unterminated string literal (#1)
06:43:04 [2020-09-12T10:43:04.259Z] 'asdf
06:43:04 [2020-09-12T10:43:04.259Z]     ^
06:43:04 [2020-09-12T10:43:04.259Z] 	at <unknown source>
06:43:04 [2020-09-12T10:43:04.515Z] Tests run: 11, Failures: 0, Errors: 0, Skipped: 0, Time elapsed: 0.399 s - in org.eclipse.ease.lang.javascript.rhino.RhinoScriptEngineTest
06:43:04 [2020-09-12T10:43:04.515Z] causeWrappedException(org.eclipse.ease.lang.javascript.rhino.RhinoScriptEngineTest)  Time elapsed: 0.201 s
06:43:04 [2020-09-12T10:43:04.515Z] optionalModuleParameters(org.eclipse.ease.lang.javascript.rhino.RhinoScriptEngineTest)  Time elapsed: 0.039 s
06:43:04 [2020-09-12T10:43:04.515Z] simpleScriptCode(org.eclipse.ease.lang.javascript.rhino.RhinoScriptEngineTest)  Time elapsed: 0.015 s
06:43:04 [2020-09-12T10:43:04.515Z] causeRuntimeErrorException(org.eclipse.ease.lang.javascript.rhino.RhinoScriptEngineTest)  Time elapsed: 0.015 s
06:43:04 [2020-09-12T10:43:04.515Z] callModuleCode(org.eclipse.ease.lang.javascript.rhino.RhinoScriptEngineTest)  Time elapsed: 0.012 s
06:43:04 [2020-09-12T10:43:04.515Z] throwJavaClass(org.eclipse.ease.lang.javascript.rhino.RhinoScriptEngineTest)  Time elapsed: 0.05 s
06:43:04 [2020-09-12T10:43:04.515Z] throwJavaException(org.eclipse.ease.lang.javascript.rhino.RhinoScriptEngineTest)  Time elapsed: 0.012 s
06:43:04 [2020-09-12T10:43:04.515Z] accessJavaClasses(org.eclipse.ease.lang.javascript.rhino.RhinoScriptEngineTest)  Time elapsed: 0.01 s
06:43:04 [2020-09-12T10:43:04.515Z] accessEclipseClasses(org.eclipse.ease.lang.javascript.rhino.RhinoScriptEngineTest)  Time elapsed: 0.01 s
06:43:04 [2020-09-12T10:43:04.515Z] throwJavaScriptException(org.eclipse.ease.lang.javascript.rhino.RhinoScriptEngineTest)  Time elapsed: 0.009 s
06:43:04 [2020-09-12T10:43:04.515Z] causeSyntaxErrorException(org.eclipse.ease.lang.javascript.rhino.RhinoScriptEngineTest)  Time elapsed: 0.009 s
06:43:04 [2020-09-12T10:43:04.515Z] Running org.eclipse.ease.lang.javascript.rhino.RhinoEnvironmentTest
06:43:04 [2020-09-12T10:43:04.515Z] Tests run: 5, Failures: 0, Errors: 0, Skipped: 0, Time elapsed: 0.134 s - in org.eclipse.ease.lang.javascript.rhino.RhinoEnvironmentTest
06:43:04 [2020-09-12T10:43:04.515Z] reloadEnvironment(org.eclipse.ease.lang.javascript.rhino.RhinoEnvironmentTest)  Time elapsed: 0.017 s
06:43:04 [2020-09-12T10:43:04.515Z] bootstrappedEnvironment(org.eclipse.ease.lang.javascript.rhino.RhinoEnvironmentTest)  Time elapsed: 0.008 s
06:43:04 [2020-09-12T10:43:04.515Z] postMethodCallback(org.eclipse.ease.lang.javascript.rhino.RhinoEnvironmentTest)  Time elapsed: 0.078 s
06:43:04 [2020-09-12T10:43:04.515Z] preMethodCallback(org.eclipse.ease.lang.javascript.rhino.RhinoEnvironmentTest)  Time elapsed: 0.012 s
06:43:04 [2020-09-12T10:43:04.515Z] reloadFunctionDefinitions(org.eclipse.ease.lang.javascript.rhino.RhinoEnvironmentTest)  Time elapsed: 0.017 s
06:43:04 [2020-09-12T10:43:04.515Z] Running org.eclipse.ease.lang.javascript.rhino.RhinoDebuggerEngineTest
06:43:04 [2020-09-12T10:43:04.771Z] org.eclipse.ease.ScriptExecutionException: JavaError: NotThere cannot be found by org.mozilla.javascript_1.7.10.v20190430-1943
06:43:04 [2020-09-12T10:43:04.771Z] 
06:43:04 [2020-09-12T10:43:04.771Z] Java Stacktrace:
06:43:04 [2020-09-12T10:43:04.771Z] java.lang.ClassNotFoundException: NotThere cannot be found by org.mozilla.javascript_1.7.10.v20190430-1943
06:43:04 [2020-09-12T10:43:04.771Z] 	at org.eclipse.osgi.internal.loader.BundleLoader.findClassInternal(BundleLoader.java:514)
06:43:04 [2020-09-12T10:43:04.771Z] 	at org.eclipse.osgi.internal.loader.BundleLoader.findClass(BundleLoader.java:425)
06:43:04 [2020-09-12T10:43:04.771Z] 	at org.eclipse.osgi.internal.loader.BundleLoader.findClass(BundleLoader.java:417)
06:43:04 [2020-09-12T10:43:04.771Z] 	at org.eclipse.osgi.internal.loader.ModuleClassLoader.loadClass(ModuleClassLoader.java:171)
06:43:04 [2020-09-12T10:43:04.771Z] 	at java.lang.ClassLoader.loadClass(ClassLoader.java:357)
06:43:04 [2020-09-12T10:43:04.771Z] 	at java.lang.Class.forName0(Native Method)
06:43:04 [2020-09-12T10:43:04.771Z] 	at java.lang.Class.forName(Class.java:264)
06:43:04 [2020-09-12T10:43:04.771Z] 	at sun.reflect.NativeMethodAccessorImpl.invoke0(Native Method)
06:43:04 [2020-09-12T10:43:04.771Z] 	at sun.reflect.NativeMethodAccessorImpl.invoke(NativeMethodAccessorImpl.java:62)
06:43:04 [2020-09-12T10:43:04.771Z] 	at sun.reflect.DelegatingMethodAccessorImpl.invoke(DelegatingMethodAccessorImpl.java:43)
06:43:04 [2020-09-12T10:43:04.771Z] 	at java.lang.reflect.Method.invoke(Method.java:498)
06:43:04 [2020-09-12T10:43:04.771Z] 	at org.mozilla.javascript.MemberBox.invoke(MemberBox.java:126)
06:43:04 [2020-09-12T10:43:04.771Z] 	at org.mozilla.javascript.NativeJavaMethod.call(NativeJavaMethod.java:225)
06:43:04 [2020-09-12T10:43:04.771Z] 	at org.mozilla.javascript.Interpreter.interpretLoop(Interpreter.java:1573)
06:43:04 [2020-09-12T10:43:04.771Z] 	at org.mozilla.javascript.Interpreter.interpret(Interpreter.java:911)
06:43:04 [2020-09-12T10:43:04.771Z] 	at org.mozilla.javascript.InterpretedFunction.call(InterpretedFunction.java:109)
06:43:04 [2020-09-12T10:43:04.771Z] 	at org.mozilla.javascript.ContextFactory.doTopCall(ContextFactory.java:405)
06:43:04 [2020-09-12T10:43:04.771Z] 	at org.mozilla.javascript.ScriptRuntime.doTopCall(ScriptRuntime.java:3508)
06:43:04 [2020-09-12T10:43:04.771Z] 	at org.mozilla.javascript.InterpretedFunction.exec(InterpretedFunction.java:120)
06:43:04 [2020-09-12T10:43:04.771Z] 	at org.mozilla.javascript.Context.evaluateReader(Context.java:1293)
06:43:04 [2020-09-12T10:43:04.771Z] 	at org.eclipse.ease.lang.javascript.rhino.RhinoScriptEngine.internalExecute(RhinoScriptEngine.java:222)
06:43:04 [2020-09-12T10:43:04.771Z] 	at org.eclipse.ease.lang.javascript.rhino.RhinoScriptEngine.execute(RhinoScriptEngine.java:201)
06:43:04 [2020-09-12T10:43:04.771Z] 	at org.eclipse.ease.AbstractScriptEngine.inject(AbstractScriptEngine.java:222)
06:43:04 [2020-09-12T10:43:04.771Z] 	at org.eclipse.ease.AbstractScriptEngine.run(AbstractScriptEngine.java:272)
06:43:04 [2020-09-12T10:43:04.771Z] 	at org.eclipse.core.internal.jobs.Worker.run(Worker.java:63)
06:43:04 [2020-09-12T10:43:04.771Z] org.eclipse.ease.ScriptExecutionException: TypeError: Cannot call method "foobar" of undefined
06:43:04 [2020-09-12T10:43:04.771Z] org.eclipse.ease.ScriptExecutionException: ScriptException: test
06:43:04 [2020-09-12T10:43:04.771Z] org.eclipse.ease.ScriptExecutionException: JavaError: java.lang.Exception
06:43:04 [2020-09-12T10:43:04.771Z] 
06:43:04 [2020-09-12T10:43:04.771Z] Java Stacktrace:
06:43:04 [2020-09-12T10:43:04.771Z] java.lang.Exception
06:43:04 [2020-09-12T10:43:04.771Z] 	at sun.reflect.NativeConstructorAccessorImpl.newInstance0(Native Method)
06:43:04 [2020-09-12T10:43:04.771Z] 	at sun.reflect.NativeConstructorAccessorImpl.newInstance(NativeConstructorAccessorImpl.java:62)
06:43:04 [2020-09-12T10:43:04.771Z] 	at sun.reflect.DelegatingConstructorAccessorImpl.newInstance(DelegatingConstructorAccessorImpl.java:45)
06:43:04 [2020-09-12T10:43:04.771Z] 	at java.lang.reflect.Constructor.newInstance(Constructor.java:423)
06:43:04 [2020-09-12T10:43:04.771Z] 	at org.mozilla.javascript.MemberBox.newInstance(MemberBox.java:159)
06:43:04 [2020-09-12T10:43:04.771Z] 	at org.mozilla.javascript.NativeJavaClass.constructInternal(NativeJavaClass.java:266)
06:43:04 [2020-09-12T10:43:04.771Z] 	at org.mozilla.javascript.NativeJavaClass.constructSpecific(NativeJavaClass.java:205)
06:43:04 [2020-09-12T10:43:04.771Z] 	at org.mozilla.javascript.NativeJavaClass.construct(NativeJavaClass.java:166)
06:43:04 [2020-09-12T10:43:04.771Z] 	at org.mozilla.javascript.Interpreter.interpretLoop(Interpreter.java:1617)
06:43:04 [2020-09-12T10:43:04.771Z] 	at org.mozilla.javascript.Interpreter.interpret(Interpreter.java:911)
06:43:04 [2020-09-12T10:43:04.771Z] 	at org.mozilla.javascript.InterpretedFunction.call(InterpretedFunction.java:109)
06:43:04 [2020-09-12T10:43:04.771Z] 	at org.mozilla.javascript.ContextFactory.doTopCall(ContextFactory.java:405)
06:43:04 [2020-09-12T10:43:04.771Z] 	at org.mozilla.javascript.ScriptRuntime.doTopCall(ScriptRuntime.java:3508)
06:43:04 [2020-09-12T10:43:04.771Z] 	at org.mozilla.javascript.InterpretedFunction.exec(InterpretedFunction.java:120)
06:43:04 [2020-09-12T10:43:04.771Z] 	at org.mozilla.javascript.Context.evaluateReader(Context.java:1293)
06:43:04 [2020-09-12T10:43:04.771Z] 	at org.eclipse.ease.lang.javascript.rhino.RhinoScriptEngine.internalExecute(RhinoScriptEngine.java:222)
06:43:04 [2020-09-12T10:43:04.771Z] 	at org.eclipse.ease.lang.javascript.rhino.RhinoScriptEngine.execute(RhinoScriptEngine.java:201)
06:43:04 [2020-09-12T10:43:04.771Z] 	at org.eclipse.ease.AbstractScriptEngine.inject(AbstractScriptEngine.java:222)
06:43:04 [2020-09-12T10:43:04.771Z] 	at org.eclipse.ease.AbstractScriptEngine.run(AbstractScriptEngine.java:272)
06:43:04 [2020-09-12T10:43:04.771Z] 	at org.eclipse.core.internal.jobs.Worker.run(Worker.java:63)
06:43:04 [2020-09-12T10:43:04.771Z] org.eclipse.ease.ScriptExecutionException: ScriptException: JavaScript
06:43:04 [2020-09-12T10:43:04.771Z] org.eclipse.ease.ScriptExecutionException: SyntaxError: unterminated string literal (#1)
06:43:04 [2020-09-12T10:43:04.771Z] 'asdf
06:43:04 [2020-09-12T10:43:04.771Z]     ^
06:43:04 [2020-09-12T10:43:04.771Z] 	at <unknown source>:1
06:43:04 [2020-09-12T10:43:04.771Z] Tests run: 12, Failures: 0, Errors: 0, Skipped: 0, Time elapsed: 0.301 s - in org.eclipse.ease.lang.javascript.rhino.RhinoDebuggerEngineTest
06:43:04 [2020-09-12T10:43:04.771Z] getExceptionStackTrace(org.eclipse.ease.lang.javascript.rhino.RhinoDebuggerEngineTest)  Time elapsed: 0.088 s
06:43:04 [2020-09-12T10:43:04.771Z] causeWrappedException(org.eclipse.ease.lang.javascript.rhino.RhinoDebuggerEngineTest)  Time elapsed: 0.015 s
06:43:04 [2020-09-12T10:43:04.771Z] optionalModuleParameters(org.eclipse.ease.lang.javascript.rhino.RhinoDebuggerEngineTest)  Time elapsed: 0.015 s
06:43:04 [2020-09-12T10:43:04.771Z] simpleScriptCode(org.eclipse.ease.lang.javascript.rhino.RhinoDebuggerEngineTest)  Time elapsed: 0.043 s
06:43:04 [2020-09-12T10:43:04.771Z] causeRuntimeErrorException(org.eclipse.ease.lang.javascript.rhino.RhinoDebuggerEngineTest)  Time elapsed: 0.016 s
06:43:04 [2020-09-12T10:43:04.771Z] callModuleCode(org.eclipse.ease.lang.javascript.rhino.RhinoDebuggerEngineTest)  Time elapsed: 0.012 s
06:43:04 [2020-09-12T10:43:04.771Z] throwJavaClass(org.eclipse.ease.lang.javascript.rhino.RhinoDebuggerEngineTest)  Time elapsed: 0.018 s
06:43:04 [2020-09-12T10:43:04.771Z] throwJavaException(org.eclipse.ease.lang.javascript.rhino.RhinoDebuggerEngineTest)  Time elapsed: 0.048 s
06:43:04 [2020-09-12T10:43:04.771Z] accessJavaClasses(org.eclipse.ease.lang.javascript.rhino.RhinoDebuggerEngineTest)  Time elapsed: 0.012 s
06:43:04 [2020-09-12T10:43:04.771Z] accessEclipseClasses(org.eclipse.ease.lang.javascript.rhino.RhinoDebuggerEngineTest)  Time elapsed: 0.011 s
06:43:04 [2020-09-12T10:43:04.771Z] throwJavaScriptException(org.eclipse.ease.lang.javascript.rhino.RhinoDebuggerEngineTest)  Time elapsed: 0.011 s
06:43:04 [2020-09-12T10:43:04.771Z] causeSyntaxErrorException(org.eclipse.ease.lang.javascript.rhino.RhinoDebuggerEngineTest)  Time elapsed: 0.01 s
06:43:04 [2020-09-12T10:43:04.772Z] Running org.eclipse.ease.lang.javascript.rhino.RhinoDebugTest
06:43:05 [2020-09-12T10:43:05.057Z] Start of script
06:43:05 [2020-09-12T10:43:05.057Z] include file start
06:43:05 [2020-09-12T10:43:05.057Z] Include file processed
06:43:05 [2020-09-12T10:43:05.057Z] line after include file
06:43:05 [2020-09-12T10:43:05.057Z] Result of testMethod = 5
06:43:05 [2020-09-12T10:43:05.057Z] End of script
06:43:05 [2020-09-12T10:43:05.057Z] Start of script
06:43:05 [2020-09-12T10:43:05.312Z] include file start
06:43:05 [2020-09-12T10:43:05.312Z] Include file processed
06:43:05 [2020-09-12T10:43:05.312Z] line after include file
06:43:05 [2020-09-12T10:43:05.312Z] Result of testMethod = 5
06:43:05 [2020-09-12T10:43:05.313Z] End of script
06:43:05 [2020-09-12T10:43:05.313Z] Start of script
06:43:05 [2020-09-12T10:43:05.313Z] include file start
06:43:05 [2020-09-12T10:43:05.313Z] Include file processed
06:43:05 [2020-09-12T10:43:05.313Z] line after include file
06:43:05 [2020-09-12T10:43:05.313Z] Result of testMethod = 5
06:43:05 [2020-09-12T10:43:05.568Z] Start of script
06:43:05 [2020-09-12T10:43:05.568Z] include file start
06:43:05 [2020-09-12T10:43:05.568Z] Include file processed
06:43:05 [2020-09-12T10:43:05.568Z] line after include file
06:43:05 [2020-09-12T10:43:05.824Z] Result of testMethod = 5
06:43:05 [2020-09-12T10:43:05.824Z] End of script
06:43:06 [2020-09-12T10:43:06.080Z] Start of script
06:43:06 [2020-09-12T10:43:06.080Z] include file start
06:43:06 [2020-09-12T10:43:06.080Z] Include file processed
06:43:06 [2020-09-12T10:43:06.080Z] line after include file
06:43:06 [2020-09-12T10:43:06.080Z] Result of testMethod = 5
06:43:06 [2020-09-12T10:43:06.080Z] End of script
06:43:06 [2020-09-12T10:43:06.336Z] Start of script
06:43:06 [2020-09-12T10:43:06.336Z] include file start
06:43:06 [2020-09-12T10:43:06.336Z] Include file processed
06:43:06 [2020-09-12T10:43:06.336Z] line after include file
06:43:06 [2020-09-12T10:43:06.336Z] Result of testMethod = 5
06:43:06 [2020-09-12T10:43:06.336Z] End of script
06:43:06 [2020-09-12T10:43:06.591Z] Start of script
06:43:06 [2020-09-12T10:43:06.591Z] include file start
06:43:06 [2020-09-12T10:43:06.591Z] Include file processed
06:43:06 [2020-09-12T10:43:06.591Z] line after include file
06:43:06 [2020-09-12T10:43:06.591Z] Result of testMethod = 5
06:43:06 [2020-09-12T10:43:06.847Z] Start of script
06:43:06 [2020-09-12T10:43:06.847Z] include file start
06:43:06 [2020-09-12T10:43:06.847Z] Include file processed
06:43:06 [2020-09-12T10:43:06.847Z] line after include file
06:43:07 [2020-09-12T10:43:07.103Z] Result of testMethod = 5
06:43:07 [2020-09-12T10:43:07.103Z] End of script
06:43:07 [2020-09-12T10:43:07.103Z] Start of script
06:43:07 [2020-09-12T10:43:07.103Z] include file start
06:43:07 [2020-09-12T10:43:07.103Z] Include file processed
06:43:07 [2020-09-12T10:43:07.103Z] line after include file
06:43:07 [2020-09-12T10:43:07.103Z] Result of testMethod = 5
06:43:07 [2020-09-12T10:43:07.359Z] End of script
06:43:07 [2020-09-12T10:43:07.359Z] Start of script
06:43:07 [2020-09-12T10:43:07.359Z] include file start
06:43:07 [2020-09-12T10:43:07.359Z] Include file processed
06:43:07 [2020-09-12T10:43:07.359Z] line after include file
06:43:07 [2020-09-12T10:43:07.926Z] Start of script
06:43:07 [2020-09-12T10:43:07.926Z] include file start
06:43:07 [2020-09-12T10:43:07.926Z] Include file processed
06:43:07 [2020-09-12T10:43:07.926Z] line after include file
06:43:07 [2020-09-12T10:43:07.926Z] Result of testMethod = 5
06:43:07 [2020-09-12T10:43:07.926Z] End of script
06:43:07 [2020-09-12T10:43:07.926Z] Start of script
06:43:07 [2020-09-12T10:43:07.926Z] include file start
06:43:07 [2020-09-12T10:43:07.926Z] Include file processed
06:43:07 [2020-09-12T10:43:07.926Z] line after include file
06:43:08 [2020-09-12T10:43:08.182Z] Result of testMethod = 5
06:43:08 [2020-09-12T10:43:08.182Z] End of script
06:43:08 [2020-09-12T10:43:08.437Z] Start of script
06:43:08 [2020-09-12T10:43:08.693Z] include file start
06:43:08 [2020-09-12T10:43:08.693Z] Include file processed
06:43:08 [2020-09-12T10:43:08.693Z] line after include file
06:43:08 [2020-09-12T10:43:08.693Z] Result of testMethod = 5
06:43:08 [2020-09-12T10:43:08.693Z] End of script
06:43:08 [2020-09-12T10:43:08.693Z] Start of script
06:43:08 [2020-09-12T10:43:08.693Z] include file start
06:43:08 [2020-09-12T10:43:08.693Z] Include file processed
06:43:08 [2020-09-12T10:43:08.693Z] line after include file
06:43:08 [2020-09-12T10:43:08.949Z] Result of testMethod = 5
06:43:08 [2020-09-12T10:43:08.949Z] End of script
06:43:08 [2020-09-12T10:43:08.949Z] Start of script
06:43:08 [2020-09-12T10:43:08.949Z] include file start
06:43:08 [2020-09-12T10:43:08.949Z] Include file processed
06:43:08 [2020-09-12T10:43:08.949Z] line after include file
06:43:08 [2020-09-12T10:43:08.949Z] Result of testMethod = 5
06:43:09 [2020-09-12T10:43:09.204Z] Start of script
06:43:09 [2020-09-12T10:43:09.204Z] include file start
06:43:09 [2020-09-12T10:43:09.204Z] Include file processed
06:43:09 [2020-09-12T10:43:09.204Z] line after include file
06:43:09 [2020-09-12T10:43:09.460Z] Result of testMethod = 5
06:43:09 [2020-09-12T10:43:09.460Z] End of script
06:43:09 [2020-09-12T10:43:09.716Z] Start of script
06:43:09 [2020-09-12T10:43:09.716Z] include file start
06:43:09 [2020-09-12T10:43:09.716Z] Include file processed
06:43:09 [2020-09-12T10:43:09.716Z] line after include file
06:43:09 [2020-09-12T10:43:09.716Z] Result of testMethod = 5
06:43:09 [2020-09-12T10:43:09.972Z] End of script
06:43:09 [2020-09-12T10:43:09.972Z] Start of script
06:43:09 [2020-09-12T10:43:09.972Z] include file start
06:43:09 [2020-09-12T10:43:09.972Z] Include file processed
06:43:09 [2020-09-12T10:43:09.972Z] line after include file
06:43:10 [2020-09-12T10:43:10.227Z] Result of testMethod = 5
06:43:10 [2020-09-12T10:43:10.227Z] End of script
06:43:10 [2020-09-12T10:43:10.482Z] Start of script
06:43:10 [2020-09-12T10:43:10.482Z] include file start
06:43:10 [2020-09-12T10:43:10.482Z] Include file processed
06:43:10 [2020-09-12T10:43:10.482Z] line after include file
06:43:10 [2020-09-12T10:43:10.738Z] Result of testMethod = 5
06:43:10 [2020-09-12T10:43:10.738Z] End of script
06:43:10 [2020-09-12T10:43:10.738Z] Start of script
06:43:10 [2020-09-12T10:43:10.738Z] include file start
06:43:10 [2020-09-12T10:43:10.738Z] Include file processed
06:43:10 [2020-09-12T10:43:10.738Z] line after include file
06:43:10 [2020-09-12T10:43:10.738Z] Result of testMethod = 5
06:43:11 [2020-09-12T10:43:11.299Z] Start of script
06:43:11 [2020-09-12T10:43:11.299Z] include file start
06:43:11 [2020-09-12T10:43:11.299Z] Include file processed
06:43:11 [2020-09-12T10:43:11.299Z] line after include file
06:43:11 [2020-09-12T10:43:11.299Z] Result of testMethod = 5
06:43:11 [2020-09-12T10:43:11.299Z] End of script
06:43:11 [2020-09-12T10:43:11.299Z] Start of script
06:43:11 [2020-09-12T10:43:11.299Z] include file start
06:43:11 [2020-09-12T10:43:11.299Z] Include file processed
06:43:11 [2020-09-12T10:43:11.299Z] line after include file
06:43:11 [2020-09-12T10:43:11.554Z] Result of testMethod = 5
06:43:11 [2020-09-12T10:43:11.554Z] End of script
06:43:11 [2020-09-12T10:43:11.554Z] Start of script
06:43:11 [2020-09-12T10:43:11.554Z] include file start
06:43:11 [2020-09-12T10:43:11.554Z] Include file processed
06:43:11 [2020-09-12T10:43:11.554Z] line after include file
06:43:11 [2020-09-12T10:43:11.554Z] Result of testMethod = 5
06:43:11 [2020-09-12T10:43:11.554Z] End of script
06:43:11 [2020-09-12T10:43:11.810Z] Start of script
06:43:11 [2020-09-12T10:43:11.810Z] include file start
06:43:11 [2020-09-12T10:43:11.810Z] Include file processed
06:43:12 [2020-09-12T10:43:12.065Z] line after include file
06:43:12 [2020-09-12T10:43:12.065Z] Result of testMethod = 5
06:43:12 [2020-09-12T10:43:12.065Z] End of script
06:43:12 [2020-09-12T10:43:12.065Z] Start of script
06:43:12 [2020-09-12T10:43:12.065Z] include file start
06:43:12 [2020-09-12T10:43:12.065Z] Include file processed
06:43:12 [2020-09-12T10:43:12.065Z] line after include file
06:43:12 [2020-09-12T10:43:12.321Z] Start of script
06:43:12 [2020-09-12T10:43:12.578Z] include file start
06:43:12 [2020-09-12T10:43:12.578Z] Include file processed
06:43:12 [2020-09-12T10:43:12.578Z] line after include file
06:43:12 [2020-09-12T10:43:12.578Z] Result of testMethod = 5
06:43:12 [2020-09-12T10:43:12.578Z] End of script
06:43:12 [2020-09-12T10:43:12.578Z] Start of script
06:43:12 [2020-09-12T10:43:12.578Z] include file start
06:43:12 [2020-09-12T10:43:12.578Z] Include file processed
06:43:12 [2020-09-12T10:43:12.578Z] line after include file
06:43:12 [2020-09-12T10:43:12.578Z] Result of testMethod = 5
06:43:13 [2020-09-12T10:43:13.160Z] Start of script
06:43:13 [2020-09-12T10:43:13.160Z] include file start
06:43:13 [2020-09-12T10:43:13.160Z] Include file processed
06:43:13 [2020-09-12T10:43:13.160Z] line after include file
06:43:13 [2020-09-12T10:43:13.160Z] Result of testMethod = 5
06:43:13 [2020-09-12T10:43:13.160Z] End of script
06:43:13 [2020-09-12T10:43:13.160Z] Start of script
06:43:13 [2020-09-12T10:43:13.160Z] include file start
06:43:13 [2020-09-12T10:43:13.160Z] Include file processed
06:43:13 [2020-09-12T10:43:13.160Z] line after include file
06:43:13 [2020-09-12T10:43:13.416Z] Result of testMethod = 5
06:43:13 [2020-09-12T10:43:13.416Z] End of script
06:43:13 [2020-09-12T10:43:13.416Z] Start of script
06:43:13 [2020-09-12T10:43:13.416Z] include file start
06:43:13 [2020-09-12T10:43:13.416Z] Include file processed
06:43:13 [2020-09-12T10:43:13.416Z] line after include file
06:43:13 [2020-09-12T10:43:13.672Z] Result of testMethod = 5
06:43:13 [2020-09-12T10:43:13.672Z] End of script
06:43:13 [2020-09-12T10:43:13.928Z] Start of script
06:43:13 [2020-09-12T10:43:13.928Z] include file start
06:43:13 [2020-09-12T10:43:13.928Z] Include file processed
06:43:13 [2020-09-12T10:43:13.928Z] line after include file
06:43:13 [2020-09-12T10:43:13.928Z] Result of testMethod = 5
06:43:13 [2020-09-12T10:43:13.928Z] End of script
06:43:13 [2020-09-12T10:43:13.928Z] Start of script
06:43:13 [2020-09-12T10:43:13.928Z] include file start
06:43:13 [2020-09-12T10:43:13.928Z] Include file processed
06:43:13 [2020-09-12T10:43:13.928Z] line after include file
06:43:13 [2020-09-12T10:43:13.928Z] Result of testMethod = 5
06:43:14 [2020-09-12T10:43:14.488Z] Start of script
06:43:14 [2020-09-12T10:43:14.489Z] include file start
06:43:14 [2020-09-12T10:43:14.489Z] Include file processed
06:43:14 [2020-09-12T10:43:14.489Z] line after include file
06:43:14 [2020-09-12T10:43:14.489Z] Result of testMethod = 5
06:43:14 [2020-09-12T10:43:14.489Z] End of script
06:43:14 [2020-09-12T10:43:14.489Z] Start of script
06:43:14 [2020-09-12T10:43:14.489Z] include file start
06:43:14 [2020-09-12T10:43:14.489Z] Include file processed
06:43:14 [2020-09-12T10:43:14.489Z] line after include file
06:43:14 [2020-09-12T10:43:14.489Z] Result of testMethod = 5
06:43:15 [2020-09-12T10:43:15.049Z] Start of script
06:43:15 [2020-09-12T10:43:15.049Z] include file start
06:43:15 [2020-09-12T10:43:15.049Z] Include file processed
06:43:15 [2020-09-12T10:43:15.049Z] line after include file
06:43:15 [2020-09-12T10:43:15.049Z] Result of testMethod = 5
06:43:15 [2020-09-12T10:43:15.049Z] End of script
06:43:15 [2020-09-12T10:43:15.305Z] Start of script
06:43:15 [2020-09-12T10:43:15.305Z] include file start
06:43:15 [2020-09-12T10:43:15.305Z] Include file processed
06:43:15 [2020-09-12T10:43:15.305Z] line after include file
06:43:15 [2020-09-12T10:43:15.561Z] Result of testMethod = 5
06:43:15 [2020-09-12T10:43:15.561Z] End of script
06:43:15 [2020-09-12T10:43:15.561Z] Start of script
06:43:15 [2020-09-12T10:43:15.561Z] include file start
06:43:15 [2020-09-12T10:43:15.561Z] Include file processed
06:43:15 [2020-09-12T10:43:15.561Z] line after include file
06:43:15 [2020-09-12T10:43:15.561Z] Result of testMethod = 5
06:43:15 [2020-09-12T10:43:15.561Z] End of script
06:43:15 [2020-09-12T10:43:15.817Z] Tests run: 42, Failures: 0, Errors: 0, Skipped: 0, Time elapsed: 10.866 s - in org.eclipse.ease.lang.javascript.rhino.RhinoDebugTest
06:43:15 [2020-09-12T10:43:15.817Z] disconnectProcessInSuspendedState(org.eclipse.ease.lang.javascript.rhino.RhinoDebugTest)  Time elapsed: 0.219 s
06:43:15 [2020-09-12T10:43:15.817Z] stepReturnIncludeCommand(org.eclipse.ease.lang.javascript.rhino.RhinoDebugTest)  Time elapsed: 0.209 s
06:43:15 [2020-09-12T10:43:15.817Z] arrayVariableSorting(org.eclipse.ease.lang.javascript.rhino.RhinoDebugTest)  Time elapsed: 0.306 s
06:43:15 [2020-09-12T10:43:15.817Z] stepOverOnDebugTarget(org.eclipse.ease.lang.javascript.rhino.RhinoDebugTest)  Time elapsed: 0.308 s
06:43:15 [2020-09-12T10:43:15.817Z] hasDebugTarget(org.eclipse.ease.lang.javascript.rhino.RhinoDebugTest)  Time elapsed: 0.104 s
06:43:15 [2020-09-12T10:43:15.817Z] disconnectThreadInSuspendedState(org.eclipse.ease.lang.javascript.rhino.RhinoDebugTest)  Time elapsed: 0.206 s
06:43:15 [2020-09-12T10:43:15.817Z] stepReturnOnDebugTarget(org.eclipse.ease.lang.javascript.rhino.RhinoDebugTest)  Time elapsed: 0.306 s
06:43:15 [2020-09-12T10:43:15.817Z] nullVariable(org.eclipse.ease.lang.javascript.rhino.RhinoDebugTest)  Time elapsed: 0.305 s
06:43:15 [2020-09-12T10:43:15.817Z] stepOverOnStackFrame(org.eclipse.ease.lang.javascript.rhino.RhinoDebugTest)  Time elapsed: 0.308 s
06:43:15 [2020-09-12T10:43:15.817Z] resumeOnDebugTarget(org.eclipse.ease.lang.javascript.rhino.RhinoDebugTest)  Time elapsed: 0.206 s
06:43:15 [2020-09-12T10:43:15.817Z] modifyVariableKeepingType(org.eclipse.ease.lang.javascript.rhino.RhinoDebugTest)  Time elapsed: 0.406 s
06:43:15 [2020-09-12T10:43:15.817Z] resumeOnLastIncludeLine(org.eclipse.ease.lang.javascript.rhino.RhinoDebugTest)  Time elapsed: 0.206 s
06:43:15 [2020-09-12T10:43:15.817Z] stepReturnOnStackFrame(org.eclipse.ease.lang.javascript.rhino.RhinoDebugTest)  Time elapsed: 0.307 s
06:43:15 [2020-09-12T10:43:15.817Z] terminateStackFrameInSuspendedState(org.eclipse.ease.lang.javascript.rhino.RhinoDebugTest)  Time elapsed: 0.205 s
06:43:15 [2020-09-12T10:43:15.817Z] breakpointLocation(org.eclipse.ease.lang.javascript.rhino.RhinoDebugTest)  Time elapsed: 0.206 s
06:43:15 [2020-09-12T10:43:15.817Z] stepReturnOnThread(org.eclipse.ease.lang.javascript.rhino.RhinoDebugTest)  Time elapsed: 0.307 s
06:43:15 [2020-09-12T10:43:15.817Z] javaClassVariable(org.eclipse.ease.lang.javascript.rhino.RhinoDebugTest)  Time elapsed: 0.307 s
06:43:15 [2020-09-12T10:43:15.817Z] stepIntoOnThread(org.eclipse.ease.lang.javascript.rhino.RhinoDebugTest)  Time elapsed: 0.307 s
06:43:15 [2020-09-12T10:43:15.817Z] terminateThreadInSuspendedState(org.eclipse.ease.lang.javascript.rhino.RhinoDebugTest)  Time elapsed: 0.206 s
06:43:15 [2020-09-12T10:43:15.817Z] resumeOnThread(org.eclipse.ease.lang.javascript.rhino.RhinoDebugTest)  Time elapsed: 0.206 s
06:43:15 [2020-09-12T10:43:15.817Z] stepIntoOnStackFrame(org.eclipse.ease.lang.javascript.rhino.RhinoDebugTest)  Time elapsed: 0.306 s
06:43:15 [2020-09-12T10:43:15.817Z] terminateProcessInSuspendedState(org.eclipse.ease.lang.javascript.rhino.RhinoDebugTest)  Time elapsed: 0.206 s
06:43:15 [2020-09-12T10:43:15.817Z] stepOverOnProcess(org.eclipse.ease.lang.javascript.rhino.RhinoDebugTest)  Time elapsed: 0.312 s
06:43:15 [2020-09-12T10:43:15.817Z] nativeArrayVariable(org.eclipse.ease.lang.javascript.rhino.RhinoDebugTest)  Time elapsed: 0.305 s
06:43:15 [2020-09-12T10:43:15.817Z] disconnectDebugTargetInSuspendedState(org.eclipse.ease.lang.javascript.rhino.RhinoDebugTest)  Time elapsed: 0.205 s
06:43:15 [2020-09-12T10:43:15.817Z] stepIntoOnProcess(org.eclipse.ease.lang.javascript.rhino.RhinoDebugTest)  Time elapsed: 0.307 s
06:43:15 [2020-09-12T10:43:15.817Z] terminatedState(org.eclipse.ease.lang.javascript.rhino.RhinoDebugTest)  Time elapsed: 0.104 s
06:43:15 [2020-09-12T10:43:15.817Z] stepOverIncludeCommand(org.eclipse.ease.lang.javascript.rhino.RhinoDebugTest)  Time elapsed: 0.305 s
06:43:15 [2020-09-12T10:43:15.817Z] innerScopeVariableBeforeOuterScopeVariable(org.eclipse.ease.lang.javascript.rhino.RhinoDebugTest)  Time elapsed: 0.305 s
06:43:15 [2020-09-12T10:43:15.817Z] stepIntoIncludeCommand(org.eclipse.ease.lang.javascript.rhino.RhinoDebugTest)  Time elapsed: 0.304 s
06:43:15 [2020-09-12T10:43:15.817Z] primitiveStringVariable(org.eclipse.ease.lang.javascript.rhino.RhinoDebugTest)  Time elapsed: 0.306 s
06:43:15 [2020-09-12T10:43:15.817Z] resumeOnProcess(org.eclipse.ease.lang.javascript.rhino.RhinoDebugTest)  Time elapsed: 0.204 s
06:43:15 [2020-09-12T10:43:15.817Z] stepIntoOnDebugTarget(org.eclipse.ease.lang.javascript.rhino.RhinoDebugTest)  Time elapsed: 0.305 s
06:43:15 [2020-09-12T10:43:15.817Z] stepOverOnThread(org.eclipse.ease.lang.javascript.rhino.RhinoDebugTest)  Time elapsed: 0.306 s
06:43:15 [2020-09-12T10:43:15.817Z] suspendedState(org.eclipse.ease.lang.javascript.rhino.RhinoDebugTest)  Time elapsed: 0.205 s
06:43:15 [2020-09-12T10:43:15.817Z] primitiveDoubleVariable(org.eclipse.ease.lang.javascript.rhino.RhinoDebugTest)  Time elapsed: 0.305 s
06:43:15 [2020-09-12T10:43:15.818Z] resumeOnStackFrame(org.eclipse.ease.lang.javascript.rhino.RhinoDebugTest)  Time elapsed: 0.205 s
06:43:15 [2020-09-12T10:43:15.818Z] nativeObjectVariable(org.eclipse.ease.lang.javascript.rhino.RhinoDebugTest)  Time elapsed: 0.305 s
06:43:15 [2020-09-12T10:43:15.818Z] terminateDebugTargetInSuspendedState(org.eclipse.ease.lang.javascript.rhino.RhinoDebugTest)  Time elapsed: 0.205 s
06:43:15 [2020-09-12T10:43:15.818Z] disconnectStackFrameInSuspendedState(org.eclipse.ease.lang.javascript.rhino.RhinoDebugTest)  Time elapsed: 0.205 s
06:43:15 [2020-09-12T10:43:15.818Z] stepReturnOnProcess(org.eclipse.ease.lang.javascript.rhino.RhinoDebugTest)  Time elapsed: 0.305 s
06:43:15 [2020-09-12T10:43:15.818Z] evaluateWatchExpression(org.eclipse.ease.lang.javascript.rhino.RhinoDebugTest)  Time elapsed: 0.207 s
06:43:15 [2020-09-12T10:43:15.818Z] 
06:43:15 [2020-09-12T10:43:15.818Z] Results:
06:43:15 [2020-09-12T10:43:15.818Z] 
06:43:15 [2020-09-12T10:43:15.818Z] Tests run: 70, Failures: 0, Errors: 0, Skipped: 0
06:43:15 [2020-09-12T10:43:15.818Z] 
06:43:16 [2020-09-12T10:43:16.073Z] [INFO] All tests passed!
06:43:16 [2020-09-12T10:43:16.073Z] [INFO] 
06:43:16 [2020-09-12T10:43:16.073Z] [INFO] -------< org.eclipse.ease:org.eclipse.ease.lang.javascript.test >-------
06:43:16 [2020-09-12T10:43:16.073Z] [INFO] Building org.eclipse.ease.lang.javascript.test 0.8.0-SNAPSHOT     [6/11]
06:43:16 [2020-09-12T10:43:16.073Z] [INFO] ------------------------[ eclipse-test-plugin ]-------------------------
06:43:16 [2020-09-12T10:43:16.073Z] [INFO] 
06:43:16 [2020-09-12T10:43:16.073Z] [INFO] --- tycho-packaging-plugin:1.3.0:build-qualifier (default-build-qualifier) @ org.eclipse.ease.lang.javascript.test ---
06:43:16 [2020-09-12T10:43:16.073Z] [INFO] The project's OSGi version is 0.8.0.I201910171213
06:43:16 [2020-09-12T10:43:16.073Z] [INFO] 
06:43:16 [2020-09-12T10:43:16.073Z] [INFO] --- tycho-packaging-plugin:1.3.0:validate-id (default-validate-id) @ org.eclipse.ease.lang.javascript.test ---
06:43:16 [2020-09-12T10:43:16.073Z] [INFO] 
06:43:16 [2020-09-12T10:43:16.073Z] [INFO] --- tycho-packaging-plugin:1.3.0:validate-version (default-validate-version) @ org.eclipse.ease.lang.javascript.test ---
06:43:16 [2020-09-12T10:43:16.073Z] [INFO] 
06:43:16 [2020-09-12T10:43:16.073Z] [INFO] --- maven-resources-plugin:2.4.3:resources (default-resources) @ org.eclipse.ease.lang.javascript.test ---
06:43:16 [2020-09-12T10:43:16.073Z] [INFO] Using 'UTF-8' encoding to copy filtered resources.
06:43:16 [2020-09-12T10:43:16.073Z] [INFO] skip non existing resourceDirectory /home/jenkins/agent/workspace/ease.verify.core.target.2019-12/tests/org.eclipse.ease.lang.javascript.test/src/main/resources
06:43:16 [2020-09-12T10:43:16.073Z] [INFO] 
06:43:16 [2020-09-12T10:43:16.073Z] [INFO] --- tycho-compiler-plugin:1.3.0:compile (default-compile) @ org.eclipse.ease.lang.javascript.test ---
06:43:16 [2020-09-12T10:43:16.073Z] [INFO] Nothing to compile - all classes are up to date
06:43:16 [2020-09-12T10:43:16.073Z] [INFO] 
06:43:16 [2020-09-12T10:43:16.073Z] [INFO] --- maven-resources-plugin:2.4.3:testResources (default-testResources) @ org.eclipse.ease.lang.javascript.test ---
06:43:16 [2020-09-12T10:43:16.073Z] [INFO] Using 'UTF-8' encoding to copy filtered resources.
06:43:16 [2020-09-12T10:43:16.073Z] [INFO] skip non existing resourceDirectory /home/jenkins/agent/workspace/ease.verify.core.target.2019-12/tests/org.eclipse.ease.lang.javascript.test/src/test/resources
06:43:16 [2020-09-12T10:43:16.073Z] [INFO] 
06:43:16 [2020-09-12T10:43:16.073Z] [INFO] --- tycho-source-plugin:1.3.0:plugin-source (plugin-source) @ org.eclipse.ease.lang.javascript.test ---
06:43:16 [2020-09-12T10:43:16.073Z] [WARNING] Bundle-Vendor header not found in /home/jenkins/agent/workspace/ease.verify.core.target.2019-12/tests/org.eclipse.ease.lang.javascript.test/META-INF/MANIFEST.MF, fallback to 'unknown' for source bundle
06:43:16 [2020-09-12T10:43:16.073Z] [INFO] Building jar: /home/jenkins/agent/workspace/ease.verify.core.target.2019-12/tests/org.eclipse.ease.lang.javascript.test/target/org.eclipse.ease.lang.javascript.test-0.8.0-SNAPSHOT-sources.jar
06:43:16 [2020-09-12T10:43:16.073Z] [INFO] 
06:43:16 [2020-09-12T10:43:16.073Z] [INFO] --- target-platform-configuration:1.3.0:target-platform (default-target-platform) @ org.eclipse.ease.lang.javascript.test ---
06:43:16 [2020-09-12T10:43:16.073Z] [INFO] 
06:43:16 [2020-09-12T10:43:16.074Z] [INFO] --- tycho-packaging-plugin:1.3.0:package-plugin (default-package-plugin) @ org.eclipse.ease.lang.javascript.test ---
06:43:16 [2020-09-12T10:43:16.074Z] [INFO] Building jar: /home/jenkins/agent/workspace/ease.verify.core.target.2019-12/tests/org.eclipse.ease.lang.javascript.test/target/org.eclipse.ease.lang.javascript.test-0.8.0-SNAPSHOT.jar
06:43:16 [2020-09-12T10:43:16.074Z] [INFO] 
06:43:16 [2020-09-12T10:43:16.074Z] [INFO] --- tycho-p2-plugin:1.3.0:p2-metadata-default (default-p2-metadata-default) @ org.eclipse.ease.lang.javascript.test ---
06:43:16 [2020-09-12T10:43:16.074Z] [INFO] 
06:43:16 [2020-09-12T10:43:16.074Z] [INFO] --- tycho-source-feature-plugin:1.3.0:source-feature (source-feature) @ org.eclipse.ease.lang.javascript.test ---
06:43:16 [2020-09-12T10:43:16.074Z] [INFO] 
06:43:16 [2020-09-12T10:43:16.074Z] [INFO] --- tycho-p2-plugin:1.3.0:p2-metadata (attached-p2-metadata) @ org.eclipse.ease.lang.javascript.test ---
06:43:16 [2020-09-12T10:43:16.074Z] [INFO] 
06:43:16 [2020-09-12T10:43:16.074Z] [INFO] --- tycho-surefire-plugin:1.3.0:test (default-test) @ org.eclipse.ease.lang.javascript.test ---
06:43:16 [2020-09-12T10:43:16.329Z] [INFO] Expected eclipse log file: /home/jenkins/agent/workspace/ease.verify.core.target.2019-12/tests/org.eclipse.ease.lang.javascript.test/target/work/data/.metadata/.log
06:43:16 [2020-09-12T10:43:16.329Z] [INFO] Command line:
06:43:16 [2020-09-12T10:43:16.329Z] 	[/opt/tools/java/oracle/jdk-8/1.8.0_202/jre/bin/java, -Dosgi.noShutdown=false, -Dosgi.os=linux, -Dosgi.ws=gtk, -Dosgi.arch=x86_64, -Dosgi.clean=true, -jar, /home/jenkins/.m2/repository/p2/osgi/bundle/org.eclipse.equinox.launcher/1.5.600.v20191014-2022/org.eclipse.equinox.launcher-1.5.600.v20191014-2022.jar, -data, /home/jenkins/agent/workspace/ease.verify.core.target.2019-12/tests/org.eclipse.ease.lang.javascript.test/target/work/data, -install, /home/jenkins/agent/workspace/ease.verify.core.target.2019-12/tests/org.eclipse.ease.lang.javascript.test/target/work, -configuration, /home/jenkins/agent/workspace/ease.verify.core.target.2019-12/tests/org.eclipse.ease.lang.javascript.test/target/work/configuration, -application, org.eclipse.tycho.surefire.osgibooter.headlesstest, -testproperties, /home/jenkins/agent/workspace/ease.verify.core.target.2019-12/tests/org.eclipse.ease.lang.javascript.test/target/surefire.properties]
06:43:16 [2020-09-12T10:43:16.329Z] Picked up JAVA_TOOL_OPTIONS: -Dmaven.ext.class.path="/home/jenkins/agent/workspace/ease.verify.core.target.2019-12@tmp/withMaven013285c7/pipeline-maven-spy.jar" -Dorg.jenkinsci.plugins.pipeline.maven.reportsFolder="/home/jenkins/agent/workspace/ease.verify.core.target.2019-12@tmp/withMaven013285c7" 
06:43:17 [2020-09-12T10:43:17.742Z] Running org.eclipse.ease.lang.javascript.JavaScriptCodeFactoryTest
06:43:17 [2020-09-12T10:43:17.742Z] Tests run: 1, Failures: 0, Errors: 0, Skipped: 0, Time elapsed: 0.065 s - in org.eclipse.ease.lang.javascript.JavaScriptCodeFactoryTest
06:43:17 [2020-09-12T10:43:17.742Z] testCommentCreator(org.eclipse.ease.lang.javascript.JavaScriptCodeFactoryTest)  Time elapsed: 0.005 s
06:43:17 [2020-09-12T10:43:17.743Z] Running org.eclipse.ease.lang.javascript.JavaScriptCompletionContextTest
06:43:17 [2020-09-12T10:43:17.743Z] Tests run: 8, Failures: 0, Errors: 0, Skipped: 0, Time elapsed: 0.172 s - in org.eclipse.ease.lang.javascript.JavaScriptCompletionContextTest
06:43:17 [2020-09-12T10:43:17.743Z] verifyStaticClassTypes(org.eclipse.ease.lang.javascript.JavaScriptCompletionContextTest)  Time elapsed: 0.004 s
06:43:17 [2020-09-12T10:43:17.743Z] verifyClassInstanceTypes(org.eclipse.ease.lang.javascript.JavaScriptCompletionContextTest)  Time elapsed: 0.005 s
06:43:17 [2020-09-12T10:43:17.743Z] verifyTypesForScriptEngine(org.eclipse.ease.lang.javascript.JavaScriptCompletionContextTest)  Time elapsed: 0.159 s
06:43:17 [2020-09-12T10:43:17.743Z] verifyPackageTypes(org.eclipse.ease.lang.javascript.JavaScriptCompletionContextTest)  Time elapsed: 0.001 s
06:43:17 [2020-09-12T10:43:17.743Z] definedVariableTypes(org.eclipse.ease.lang.javascript.JavaScriptCompletionContextTest)  Time elapsed: 0 s
06:43:17 [2020-09-12T10:43:17.743Z] verifyStringLiteralTypes(org.eclipse.ease.lang.javascript.JavaScriptCompletionContextTest)  Time elapsed: 0 s
06:43:17 [2020-09-12T10:43:17.743Z] verifyUnknownTypes(org.eclipse.ease.lang.javascript.JavaScriptCompletionContextTest)  Time elapsed: 0 s
06:43:17 [2020-09-12T10:43:17.743Z] verifyNoneTypes(org.eclipse.ease.lang.javascript.JavaScriptCompletionContextTest)  Time elapsed: 0 s
06:43:17 [2020-09-12T10:43:17.743Z] 
06:43:17 [2020-09-12T10:43:17.743Z] Results:
06:43:17 [2020-09-12T10:43:17.743Z] 
06:43:17 [2020-09-12T10:43:17.743Z] Tests run: 9, Failures: 0, Errors: 0, Skipped: 0
06:43:17 [2020-09-12T10:43:17.743Z] 
06:43:18 [2020-09-12T10:43:18.303Z] [INFO] All tests passed!
06:43:18 [2020-09-12T10:43:18.303Z] [INFO] 
06:43:18 [2020-09-12T10:43:18.303Z] [INFO] ---------< org.eclipse.ease:org.eclipse.ease.lang.python.test >---------
06:43:18 [2020-09-12T10:43:18.303Z] [INFO] Building org.eclipse.ease.lang.python.test 0.8.0-SNAPSHOT         [7/11]
06:43:18 [2020-09-12T10:43:18.303Z] [INFO] ------------------------[ eclipse-test-plugin ]-------------------------
06:43:18 [2020-09-12T10:43:18.303Z] [INFO] 
06:43:18 [2020-09-12T10:43:18.303Z] [INFO] --- tycho-packaging-plugin:1.3.0:build-qualifier (default-build-qualifier) @ org.eclipse.ease.lang.python.test ---
06:43:18 [2020-09-12T10:43:18.303Z] [INFO] The project's OSGi version is 0.8.0.I201910171213
06:43:18 [2020-09-12T10:43:18.303Z] [INFO] 
06:43:18 [2020-09-12T10:43:18.303Z] [INFO] --- tycho-packaging-plugin:1.3.0:validate-id (default-validate-id) @ org.eclipse.ease.lang.python.test ---
06:43:18 [2020-09-12T10:43:18.303Z] [INFO] 
06:43:18 [2020-09-12T10:43:18.303Z] [INFO] --- tycho-packaging-plugin:1.3.0:validate-version (default-validate-version) @ org.eclipse.ease.lang.python.test ---
06:43:18 [2020-09-12T10:43:18.303Z] [INFO] 
06:43:18 [2020-09-12T10:43:18.303Z] [INFO] --- maven-resources-plugin:2.4.3:resources (default-resources) @ org.eclipse.ease.lang.python.test ---
06:43:18 [2020-09-12T10:43:18.303Z] [INFO] Using 'UTF-8' encoding to copy filtered resources.
06:43:18 [2020-09-12T10:43:18.303Z] [INFO] skip non existing resourceDirectory /home/jenkins/agent/workspace/ease.verify.core.target.2019-12/tests/org.eclipse.ease.lang.python.test/src/main/resources
06:43:18 [2020-09-12T10:43:18.303Z] [INFO] 
06:43:18 [2020-09-12T10:43:18.304Z] [INFO] --- tycho-compiler-plugin:1.3.0:compile (default-compile) @ org.eclipse.ease.lang.python.test ---
06:43:18 [2020-09-12T10:43:18.304Z] [INFO] Nothing to compile - all classes are up to date
06:43:18 [2020-09-12T10:43:18.304Z] [INFO] 
06:43:18 [2020-09-12T10:43:18.304Z] [INFO] --- maven-resources-plugin:2.4.3:testResources (default-testResources) @ org.eclipse.ease.lang.python.test ---
06:43:18 [2020-09-12T10:43:18.304Z] [INFO] Using 'UTF-8' encoding to copy filtered resources.
06:43:18 [2020-09-12T10:43:18.304Z] [INFO] skip non existing resourceDirectory /home/jenkins/agent/workspace/ease.verify.core.target.2019-12/tests/org.eclipse.ease.lang.python.test/src/test/resources
06:43:18 [2020-09-12T10:43:18.304Z] [INFO] 
06:43:18 [2020-09-12T10:43:18.304Z] [INFO] --- tycho-source-plugin:1.3.0:plugin-source (plugin-source) @ org.eclipse.ease.lang.python.test ---
06:43:18 [2020-09-12T10:43:18.304Z] [WARNING] Bundle-Vendor header not found in /home/jenkins/agent/workspace/ease.verify.core.target.2019-12/tests/org.eclipse.ease.lang.python.test/META-INF/MANIFEST.MF, fallback to 'unknown' for source bundle
06:43:18 [2020-09-12T10:43:18.304Z] [INFO] Building jar: /home/jenkins/agent/workspace/ease.verify.core.target.2019-12/tests/org.eclipse.ease.lang.python.test/target/org.eclipse.ease.lang.python.test-0.8.0-SNAPSHOT-sources.jar
06:43:18 [2020-09-12T10:43:18.304Z] [INFO] 
06:43:18 [2020-09-12T10:43:18.304Z] [INFO] --- target-platform-configuration:1.3.0:target-platform (default-target-platform) @ org.eclipse.ease.lang.python.test ---
06:43:18 [2020-09-12T10:43:18.304Z] [INFO] 
06:43:18 [2020-09-12T10:43:18.304Z] [INFO] --- tycho-packaging-plugin:1.3.0:package-plugin (default-package-plugin) @ org.eclipse.ease.lang.python.test ---
06:43:18 [2020-09-12T10:43:18.304Z] [INFO] Building jar: /home/jenkins/agent/workspace/ease.verify.core.target.2019-12/tests/org.eclipse.ease.lang.python.test/target/org.eclipse.ease.lang.python.test-0.8.0-SNAPSHOT.jar
06:43:18 [2020-09-12T10:43:18.304Z] [INFO] 
06:43:18 [2020-09-12T10:43:18.304Z] [INFO] --- tycho-p2-plugin:1.3.0:p2-metadata-default (default-p2-metadata-default) @ org.eclipse.ease.lang.python.test ---
06:43:18 [2020-09-12T10:43:18.304Z] [INFO] 
06:43:18 [2020-09-12T10:43:18.304Z] [INFO] --- tycho-source-feature-plugin:1.3.0:source-feature (source-feature) @ org.eclipse.ease.lang.python.test ---
06:43:18 [2020-09-12T10:43:18.304Z] [INFO] 
06:43:18 [2020-09-12T10:43:18.304Z] [INFO] --- tycho-p2-plugin:1.3.0:p2-metadata (attached-p2-metadata) @ org.eclipse.ease.lang.python.test ---
06:43:18 [2020-09-12T10:43:18.304Z] [INFO] 
06:43:18 [2020-09-12T10:43:18.304Z] [INFO] --- tycho-surefire-plugin:1.3.0:test (default-test) @ org.eclipse.ease.lang.python.test ---
06:43:18 [2020-09-12T10:43:18.304Z] [INFO] Expected eclipse log file: /home/jenkins/agent/workspace/ease.verify.core.target.2019-12/tests/org.eclipse.ease.lang.python.test/target/work/data/.metadata/.log
06:43:18 [2020-09-12T10:43:18.304Z] [INFO] Command line:
06:43:18 [2020-09-12T10:43:18.304Z] 	[/opt/tools/java/oracle/jdk-8/1.8.0_202/jre/bin/java, -Dosgi.noShutdown=false, -Dosgi.os=linux, -Dosgi.ws=gtk, -Dosgi.arch=x86_64, -Dosgi.clean=true, -jar, /home/jenkins/.m2/repository/p2/osgi/bundle/org.eclipse.equinox.launcher/1.5.600.v20191014-2022/org.eclipse.equinox.launcher-1.5.600.v20191014-2022.jar, -data, /home/jenkins/agent/workspace/ease.verify.core.target.2019-12/tests/org.eclipse.ease.lang.python.test/target/work/data, -install, /home/jenkins/agent/workspace/ease.verify.core.target.2019-12/tests/org.eclipse.ease.lang.python.test/target/work, -configuration, /home/jenkins/agent/workspace/ease.verify.core.target.2019-12/tests/org.eclipse.ease.lang.python.test/target/work/configuration, -application, org.eclipse.tycho.surefire.osgibooter.headlesstest, -testproperties, /home/jenkins/agent/workspace/ease.verify.core.target.2019-12/tests/org.eclipse.ease.lang.python.test/target/surefire.properties]
06:43:18 [2020-09-12T10:43:18.304Z] Picked up JAVA_TOOL_OPTIONS: -Dmaven.ext.class.path="/home/jenkins/agent/workspace/ease.verify.core.target.2019-12@tmp/withMaven013285c7/pipeline-maven-spy.jar" -Dorg.jenkinsci.plugins.pipeline.maven.reportsFolder="/home/jenkins/agent/workspace/ease.verify.core.target.2019-12@tmp/withMaven013285c7" 
06:43:19 [2020-09-12T10:43:19.669Z] Running org.eclipse.ease.lang.python.PythonCodeFactoryTest
06:43:19 [2020-09-12T10:43:19.669Z] Tests run: 1, Failures: 0, Errors: 0, Skipped: 0, Time elapsed: 0.021 s - in org.eclipse.ease.lang.python.PythonCodeFactoryTest
06:43:19 [2020-09-12T10:43:19.669Z] testCommentCreator(org.eclipse.ease.lang.python.PythonCodeFactoryTest)  Time elapsed: 0.004 s
06:43:19 [2020-09-12T10:43:19.669Z] 
06:43:19 [2020-09-12T10:43:19.669Z] Results:
06:43:19 [2020-09-12T10:43:19.669Z] 
06:43:19 [2020-09-12T10:43:19.669Z] Tests run: 1, Failures: 0, Errors: 0, Skipped: 0
06:43:19 [2020-09-12T10:43:19.669Z] 
06:43:19 [2020-09-12T10:43:19.924Z] [INFO] All tests passed!
06:43:19 [2020-09-12T10:43:19.924Z] [INFO] 
06:43:19 [2020-09-12T10:43:19.924Z] [INFO] -----< org.eclipse.ease:org.eclipse.ease.lang.python.jython.test >------
06:43:19 [2020-09-12T10:43:19.924Z] [INFO] Building org.eclipse.ease.lang.python.jython.test 0.8.0-SNAPSHOT  [8/11]
06:43:19 [2020-09-12T10:43:19.924Z] [INFO] ------------------------[ eclipse-test-plugin ]-------------------------
06:43:19 [2020-09-12T10:43:19.924Z] [INFO] 
06:43:19 [2020-09-12T10:43:19.924Z] [INFO] --- tycho-packaging-plugin:1.3.0:build-qualifier (default-build-qualifier) @ org.eclipse.ease.lang.python.jython.test ---
06:43:19 [2020-09-12T10:43:19.924Z] [INFO] The project's OSGi version is 0.8.0.I201911291239
06:43:19 [2020-09-12T10:43:19.924Z] [INFO] 
06:43:19 [2020-09-12T10:43:19.924Z] [INFO] --- tycho-packaging-plugin:1.3.0:validate-id (default-validate-id) @ org.eclipse.ease.lang.python.jython.test ---
06:43:19 [2020-09-12T10:43:19.924Z] [INFO] 
06:43:19 [2020-09-12T10:43:19.924Z] [INFO] --- tycho-packaging-plugin:1.3.0:validate-version (default-validate-version) @ org.eclipse.ease.lang.python.jython.test ---
06:43:19 [2020-09-12T10:43:19.924Z] [INFO] 
06:43:19 [2020-09-12T10:43:19.924Z] [INFO] --- maven-resources-plugin:2.4.3:resources (default-resources) @ org.eclipse.ease.lang.python.jython.test ---
06:43:19 [2020-09-12T10:43:19.924Z] [INFO] Using 'UTF-8' encoding to copy filtered resources.
06:43:19 [2020-09-12T10:43:19.924Z] [INFO] skip non existing resourceDirectory /home/jenkins/agent/workspace/ease.verify.core.target.2019-12/tests/org.eclipse.ease.lang.python.jython.test/src/main/resources
06:43:19 [2020-09-12T10:43:19.924Z] [INFO] 
06:43:19 [2020-09-12T10:43:19.924Z] [INFO] --- tycho-compiler-plugin:1.3.0:compile (default-compile) @ org.eclipse.ease.lang.python.jython.test ---
06:43:19 [2020-09-12T10:43:19.924Z] [INFO] Nothing to compile - all classes are up to date
06:43:19 [2020-09-12T10:43:19.924Z] [INFO] 
06:43:19 [2020-09-12T10:43:19.924Z] [INFO] --- maven-resources-plugin:2.4.3:testResources (default-testResources) @ org.eclipse.ease.lang.python.jython.test ---
06:43:19 [2020-09-12T10:43:19.924Z] [INFO] Using 'UTF-8' encoding to copy filtered resources.
06:43:19 [2020-09-12T10:43:19.924Z] [INFO] skip non existing resourceDirectory /home/jenkins/agent/workspace/ease.verify.core.target.2019-12/tests/org.eclipse.ease.lang.python.jython.test/src/test/resources
06:43:19 [2020-09-12T10:43:19.924Z] [INFO] 
06:43:19 [2020-09-12T10:43:19.924Z] [INFO] --- tycho-source-plugin:1.3.0:plugin-source (plugin-source) @ org.eclipse.ease.lang.python.jython.test ---
06:43:19 [2020-09-12T10:43:19.924Z] [WARNING] Bundle-Vendor header not found in /home/jenkins/agent/workspace/ease.verify.core.target.2019-12/tests/org.eclipse.ease.lang.python.jython.test/META-INF/MANIFEST.MF, fallback to 'unknown' for source bundle
06:43:19 [2020-09-12T10:43:19.924Z] [INFO] Building jar: /home/jenkins/agent/workspace/ease.verify.core.target.2019-12/tests/org.eclipse.ease.lang.python.jython.test/target/org.eclipse.ease.lang.python.jython.test-0.8.0-SNAPSHOT-sources.jar
06:43:19 [2020-09-12T10:43:19.924Z] [INFO] 
06:43:19 [2020-09-12T10:43:19.924Z] [INFO] --- target-platform-configuration:1.3.0:target-platform (default-target-platform) @ org.eclipse.ease.lang.python.jython.test ---
06:43:19 [2020-09-12T10:43:19.924Z] [INFO] 
06:43:19 [2020-09-12T10:43:19.924Z] [INFO] --- tycho-packaging-plugin:1.3.0:package-plugin (default-package-plugin) @ org.eclipse.ease.lang.python.jython.test ---
06:43:19 [2020-09-12T10:43:19.924Z] [INFO] Building jar: /home/jenkins/agent/workspace/ease.verify.core.target.2019-12/tests/org.eclipse.ease.lang.python.jython.test/target/org.eclipse.ease.lang.python.jython.test-0.8.0-SNAPSHOT.jar
06:43:19 [2020-09-12T10:43:19.924Z] [INFO] 
06:43:19 [2020-09-12T10:43:19.924Z] [INFO] --- tycho-p2-plugin:1.3.0:p2-metadata-default (default-p2-metadata-default) @ org.eclipse.ease.lang.python.jython.test ---
06:43:19 [2020-09-12T10:43:19.924Z] [INFO] 
06:43:19 [2020-09-12T10:43:19.924Z] [INFO] --- tycho-source-feature-plugin:1.3.0:source-feature (source-feature) @ org.eclipse.ease.lang.python.jython.test ---
06:43:19 [2020-09-12T10:43:19.924Z] [INFO] 
06:43:19 [2020-09-12T10:43:19.925Z] [INFO] --- tycho-p2-plugin:1.3.0:p2-metadata (attached-p2-metadata) @ org.eclipse.ease.lang.python.jython.test ---
06:43:19 [2020-09-12T10:43:19.925Z] [INFO] 
06:43:19 [2020-09-12T10:43:19.925Z] [INFO] --- tycho-surefire-plugin:1.3.0:test (default-test) @ org.eclipse.ease.lang.python.jython.test ---
06:43:20 [2020-09-12T10:43:20.485Z] [INFO] Expected eclipse log file: /home/jenkins/agent/workspace/ease.verify.core.target.2019-12/tests/org.eclipse.ease.lang.python.jython.test/target/work/data/.metadata/.log
06:43:20 [2020-09-12T10:43:20.485Z] [INFO] Command line:
06:43:20 [2020-09-12T10:43:20.485Z] 	[/opt/tools/java/oracle/jdk-8/1.8.0_202/jre/bin/java, -Dosgi.noShutdown=false, -Dosgi.os=linux, -Dosgi.ws=gtk, -Dosgi.arch=x86_64, -Dosgi.clean=true, -jar, /home/jenkins/.m2/repository/p2/osgi/bundle/org.eclipse.equinox.launcher/1.5.600.v20191014-2022/org.eclipse.equinox.launcher-1.5.600.v20191014-2022.jar, -data, /home/jenkins/agent/workspace/ease.verify.core.target.2019-12/tests/org.eclipse.ease.lang.python.jython.test/target/work/data, -install, /home/jenkins/agent/workspace/ease.verify.core.target.2019-12/tests/org.eclipse.ease.lang.python.jython.test/target/work, -configuration, /home/jenkins/agent/workspace/ease.verify.core.target.2019-12/tests/org.eclipse.ease.lang.python.jython.test/target/work/configuration, -application, org.eclipse.tycho.surefire.osgibooter.headlesstest, -testproperties, /home/jenkins/agent/workspace/ease.verify.core.target.2019-12/tests/org.eclipse.ease.lang.python.jython.test/target/surefire.properties]
06:43:20 [2020-09-12T10:43:20.485Z] Picked up JAVA_TOOL_OPTIONS: -Dmaven.ext.class.path="/home/jenkins/agent/workspace/ease.verify.core.target.2019-12@tmp/withMaven013285c7/pipeline-maven-spy.jar" -Dorg.jenkinsci.plugins.pipeline.maven.reportsFolder="/home/jenkins/agent/workspace/ease.verify.core.target.2019-12@tmp/withMaven013285c7" 
06:43:22 [2020-09-12T10:43:22.428Z] Running org.eclipse.ease.lang.python.jython.debugger.JythonDebugTest
06:43:23 [2020-09-12T10:43:23.375Z] Start of script
06:43:23 [2020-09-12T10:43:23.375Z] include file start
06:43:23 [2020-09-12T10:43:23.375Z] include file processed
06:43:23 [2020-09-12T10:43:23.375Z] Result of testMethod = 5
06:43:23 [2020-09-12T10:43:23.375Z] End of script
06:43:23 [2020-09-12T10:43:23.630Z] Start of script
06:43:23 [2020-09-12T10:43:23.630Z] include file start
06:43:23 [2020-09-12T10:43:23.630Z] include file processed
06:43:23 [2020-09-12T10:43:23.630Z] Result of testMethod = 5
06:43:23 [2020-09-12T10:43:23.630Z] End of script
06:43:23 [2020-09-12T10:43:23.630Z] Start of script
06:43:23 [2020-09-12T10:43:23.630Z] include file start
06:43:23 [2020-09-12T10:43:23.630Z] include file processed
06:43:23 [2020-09-12T10:43:23.631Z] Result of testMethod = 5
06:43:23 [2020-09-12T10:43:23.886Z] Traceback (most recent call last):
06:43:23 [2020-09-12T10:43:23.886Z]   File "(none)", line 184, in run
06:43:23 [2020-09-12T10:43:23.886Z]   File "__ref_L/Debug Test/Main.py_nrnkgvlxej", line 23, in <module>
06:43:23 [2020-09-12T10:43:23.886Z]   File "(none)", line 161, in trace_dispatch
06:43:23 [2020-09-12T10:43:23.886Z] org.eclipse.ease.ExitException: 
06:43:23 [2020-09-12T10:43:23.886Z] 
06:43:23 [2020-09-12T10:43:23.886Z] org.eclipse.ease.ExitException: org.eclipse.ease.ExitException: 
06:43:24 [2020-09-12T10:43:24.141Z] Start of script
06:43:24 [2020-09-12T10:43:24.141Z] include file start
06:43:24 [2020-09-12T10:43:24.141Z] include file processed
06:43:24 [2020-09-12T10:43:24.141Z] Result of testMethod = 5
06:43:24 [2020-09-12T10:43:24.141Z] End of script
06:43:24 [2020-09-12T10:43:24.701Z] Start of script
06:43:24 [2020-09-12T10:43:24.701Z] include file start
06:43:24 [2020-09-12T10:43:24.701Z] include file processed
06:43:24 [2020-09-12T10:43:24.701Z] Result of testMethod = 5
06:43:24 [2020-09-12T10:43:24.701Z] End of script
06:43:24 [2020-09-12T10:43:24.701Z] Start of script
06:43:24 [2020-09-12T10:43:24.701Z] include file start
06:43:24 [2020-09-12T10:43:24.701Z] include file processed
06:43:24 [2020-09-12T10:43:24.956Z] Result of testMethod = 5
06:43:24 [2020-09-12T10:43:24.956Z] End of script
06:43:24 [2020-09-12T10:43:24.956Z] Start of script
06:43:24 [2020-09-12T10:43:24.956Z] include file start
06:43:24 [2020-09-12T10:43:24.956Z] include file processed
06:43:24 [2020-09-12T10:43:24.956Z] Result of testMethod = 5
06:43:25 [2020-09-12T10:43:25.212Z] Traceback (most recent call last):
06:43:25 [2020-09-12T10:43:25.212Z]   File "(none)", line 184, in run
06:43:25 [2020-09-12T10:43:25.212Z]   File "__ref_L/Debug Test/Main.py_edmikwadwa", line 23, in <module>
06:43:25 [2020-09-12T10:43:25.212Z]   File "(none)", line 161, in trace_dispatch
06:43:25 [2020-09-12T10:43:25.212Z] org.eclipse.ease.ExitException: 
06:43:25 [2020-09-12T10:43:25.212Z] 
06:43:25 [2020-09-12T10:43:25.212Z] org.eclipse.ease.ExitException: org.eclipse.ease.ExitException: 
06:43:25 [2020-09-12T10:43:25.212Z] Start of script
06:43:25 [2020-09-12T10:43:25.212Z] include file start
06:43:25 [2020-09-12T10:43:25.212Z] include file processed
06:43:25 [2020-09-12T10:43:25.468Z] Result of testMethod = 5
06:43:25 [2020-09-12T10:43:25.468Z] End of script
06:43:25 [2020-09-12T10:43:25.468Z] Start of script
06:43:25 [2020-09-12T10:43:25.468Z] include file start
06:43:25 [2020-09-12T10:43:25.468Z] include file processed
06:43:25 [2020-09-12T10:43:25.468Z] Result of testMethod = 5
06:43:25 [2020-09-12T10:43:25.723Z] End of script
06:43:25 [2020-09-12T10:43:25.723Z] Start of script
06:43:25 [2020-09-12T10:43:25.723Z] include file start
06:43:25 [2020-09-12T10:43:25.723Z] include file processed
06:43:26 [2020-09-12T10:43:26.284Z] Traceback (most recent call last):
06:43:26 [2020-09-12T10:43:26.285Z]   File "(none)", line 184, in run
06:43:26 [2020-09-12T10:43:26.285Z]   File "__ref_L/Debug Test/Main.py_ezrbkevyao", line 22, in <module>
06:43:26 [2020-09-12T10:43:26.285Z]   File "(none)", line 161, in trace_dispatch
06:43:26 [2020-09-12T10:43:26.285Z] org.eclipse.ease.ExitException: 
06:43:26 [2020-09-12T10:43:26.285Z] 
06:43:26 [2020-09-12T10:43:26.285Z] org.eclipse.ease.ExitException: org.eclipse.ease.ExitException: 
06:43:26 [2020-09-12T10:43:26.285Z] Start of script
06:43:26 [2020-09-12T10:43:26.285Z] include file start
06:43:26 [2020-09-12T10:43:26.285Z] include file processed
06:43:26 [2020-09-12T10:43:26.285Z] Result of testMethod = 5
06:43:26 [2020-09-12T10:43:26.285Z] End of script
06:43:26 [2020-09-12T10:43:26.540Z] Start of script
06:43:26 [2020-09-12T10:43:26.540Z] include file start
06:43:26 [2020-09-12T10:43:26.540Z] include file processed
06:43:26 [2020-09-12T10:43:26.798Z] Result of testMethod = 5
06:43:26 [2020-09-12T10:43:26.798Z] End of script
06:43:26 [2020-09-12T10:43:26.798Z] Traceback (most recent call last):
06:43:26 [2020-09-12T10:43:26.798Z]   File "(none)", line 184, in run
06:43:26 [2020-09-12T10:43:26.798Z]   File "__ref_L/Debug Test/Main.py_pmeclkvobh", line 1, in <module>
06:43:26 [2020-09-12T10:43:26.798Z]   File "(none)", line 161, in trace_dispatch
06:43:26 [2020-09-12T10:43:26.798Z] org.eclipse.ease.ExitException: 
06:43:26 [2020-09-12T10:43:26.798Z] 
06:43:26 [2020-09-12T10:43:26.798Z] org.eclipse.ease.ExitException: org.eclipse.ease.ExitException: 
06:43:27 [2020-09-12T10:43:27.055Z] Start of script
06:43:27 [2020-09-12T10:43:27.055Z] include file start
06:43:27 [2020-09-12T10:43:27.055Z] include file processed
06:43:27 [2020-09-12T10:43:27.055Z] Result of testMethod = 5
06:43:27 [2020-09-12T10:43:27.055Z] End of script
06:43:27 [2020-09-12T10:43:27.310Z] Start of script
06:43:27 [2020-09-12T10:43:27.310Z] include file start
06:43:27 [2020-09-12T10:43:27.310Z] include file processed
06:43:27 [2020-09-12T10:43:27.310Z] Result of testMethod = 5
06:43:27 [2020-09-12T10:43:27.310Z] End of script
06:43:27 [2020-09-12T10:43:27.566Z] Start of script
06:43:27 [2020-09-12T10:43:27.566Z] include file start
06:43:27 [2020-09-12T10:43:27.566Z] include file processed
06:43:27 [2020-09-12T10:43:27.566Z] Result of testMethod = 5
06:43:27 [2020-09-12T10:43:27.823Z] Traceback (most recent call last):
06:43:27 [2020-09-12T10:43:27.823Z]   File "(none)", line 184, in run
06:43:27 [2020-09-12T10:43:27.823Z]   File "__ref_L/Debug Test/Main.py_noaimuzmgp", line 23, in <module>
06:43:27 [2020-09-12T10:43:27.823Z]   File "(none)", line 161, in trace_dispatch
06:43:27 [2020-09-12T10:43:27.823Z] org.eclipse.ease.ExitException: 
06:43:27 [2020-09-12T10:43:27.823Z] 
06:43:27 [2020-09-12T10:43:27.823Z] org.eclipse.ease.ExitException: org.eclipse.ease.ExitException: 
06:43:27 [2020-09-12T10:43:27.823Z] Start of script
06:43:27 [2020-09-12T10:43:27.823Z] include file start
06:43:27 [2020-09-12T10:43:27.823Z] include file processed
06:43:28 [2020-09-12T10:43:28.077Z] Result of testMethod = 5
06:43:28 [2020-09-12T10:43:28.077Z] End of script
06:43:28 [2020-09-12T10:43:28.333Z] Traceback (most recent call last):
06:43:28 [2020-09-12T10:43:28.333Z]   File "(none)", line 184, in run
06:43:28 [2020-09-12T10:43:28.333Z]   File "__ref_L/Debug Test/Main.py_vncihefdcv", line 1, in <module>
06:43:28 [2020-09-12T10:43:28.333Z]   File "(none)", line 161, in trace_dispatch
06:43:28 [2020-09-12T10:43:28.333Z] org.eclipse.ease.ExitException: 
06:43:28 [2020-09-12T10:43:28.333Z] 
06:43:28 [2020-09-12T10:43:28.333Z] org.eclipse.ease.ExitException: org.eclipse.ease.ExitException: 
06:43:28 [2020-09-12T10:43:28.333Z] Start of script
06:43:28 [2020-09-12T10:43:28.333Z] include file start
06:43:28 [2020-09-12T10:43:28.333Z] include file processed
06:43:28 [2020-09-12T10:43:28.333Z] Result of testMethod = 5
06:43:28 [2020-09-12T10:43:28.333Z] End of script
06:43:28 [2020-09-12T10:43:28.589Z] Start of script
06:43:28 [2020-09-12T10:43:28.589Z] include file start
06:43:28 [2020-09-12T10:43:28.589Z] include file processed
06:43:28 [2020-09-12T10:43:28.845Z] Result of testMethod = 5
06:43:28 [2020-09-12T10:43:28.845Z] End of script
06:43:28 [2020-09-12T10:43:28.845Z] Traceback (most recent call last):
06:43:28 [2020-09-12T10:43:28.845Z]   File "(none)", line 184, in run
06:43:28 [2020-09-12T10:43:28.845Z]   File "__ref_L/Debug Test/Main.py_crepzfjnqi", line 1, in <module>
06:43:28 [2020-09-12T10:43:28.845Z]   File "(none)", line 161, in trace_dispatch
06:43:28 [2020-09-12T10:43:28.845Z] org.eclipse.ease.ExitException: 
06:43:28 [2020-09-12T10:43:28.845Z] 
06:43:28 [2020-09-12T10:43:28.845Z] org.eclipse.ease.ExitException: org.eclipse.ease.ExitException: 
06:43:29 [2020-09-12T10:43:29.101Z] Start of script
06:43:29 [2020-09-12T10:43:29.101Z] include file start
06:43:29 [2020-09-12T10:43:29.101Z] include file processed
06:43:29 [2020-09-12T10:43:29.356Z] Result of testMethod = 5
06:43:29 [2020-09-12T10:43:29.356Z] End of script
06:43:29 [2020-09-12T10:43:29.356Z] Start of script
06:43:29 [2020-09-12T10:43:29.356Z] include file start
06:43:29 [2020-09-12T10:43:29.356Z] include file processed
06:43:29 [2020-09-12T10:43:29.356Z] Result of testMethod = 5
06:43:29 [2020-09-12T10:43:29.612Z] Traceback (most recent call last):
06:43:29 [2020-09-12T10:43:29.612Z]   File "(none)", line 184, in run
06:43:29 [2020-09-12T10:43:29.612Z]   File "__ref_L/Debug Test/Main.py_rwotkngrnj", line 23, in <module>
06:43:29 [2020-09-12T10:43:29.612Z]   File "(none)", line 161, in trace_dispatch
06:43:29 [2020-09-12T10:43:29.612Z] org.eclipse.ease.ExitException: 
06:43:29 [2020-09-12T10:43:29.612Z] 
06:43:29 [2020-09-12T10:43:29.612Z] org.eclipse.ease.ExitException: org.eclipse.ease.ExitException: 
06:43:29 [2020-09-12T10:43:29.868Z] Start of script
06:43:29 [2020-09-12T10:43:29.868Z] include file start
06:43:29 [2020-09-12T10:43:29.868Z] include file processed
06:43:29 [2020-09-12T10:43:29.868Z] Result of testMethod = 5
06:43:29 [2020-09-12T10:43:29.868Z] End of script
06:43:29 [2020-09-12T10:43:29.868Z] Start of script
06:43:29 [2020-09-12T10:43:29.868Z] include file start
06:43:29 [2020-09-12T10:43:29.868Z] include file processed
06:43:30 [2020-09-12T10:43:30.123Z] Result of testMethod = 5
06:43:30 [2020-09-12T10:43:30.123Z] End of script
06:43:30 [2020-09-12T10:43:30.123Z] Start of script
06:43:30 [2020-09-12T10:43:30.123Z] include file start
06:43:30 [2020-09-12T10:43:30.123Z] include file processed
06:43:30 [2020-09-12T10:43:30.123Z] Result of testMethod = 5
06:43:30 [2020-09-12T10:43:30.123Z] End of script
06:43:30 [2020-09-12T10:43:30.378Z] Start of script
06:43:30 [2020-09-12T10:43:30.378Z] include file start
06:43:30 [2020-09-12T10:43:30.378Z] include file processed
06:43:30 [2020-09-12T10:43:30.378Z] Result of testMethod = 5
06:43:30 [2020-09-12T10:43:30.379Z] End of script
06:43:30 [2020-09-12T10:43:30.634Z] Start of script
06:43:30 [2020-09-12T10:43:30.634Z] include file start
06:43:30 [2020-09-12T10:43:30.634Z] include file processed
06:43:30 [2020-09-12T10:43:30.889Z] Traceback (most recent call last):
06:43:30 [2020-09-12T10:43:30.889Z]   File "(none)", line 184, in run
06:43:30 [2020-09-12T10:43:30.889Z]   File "__ref_L/Debug Test/Main.py_zpstihesit", line 21, in <module>
06:43:30 [2020-09-12T10:43:30.889Z]   File "__ref_L/Debug Test/Main.py_zpstihesit", line 18, in testMethod
06:43:30 [2020-09-12T10:43:30.889Z]   File "(none)", line 161, in trace_dispatch
06:43:30 [2020-09-12T10:43:30.889Z] org.eclipse.ease.ExitException: 
06:43:30 [2020-09-12T10:43:30.889Z] 
06:43:30 [2020-09-12T10:43:30.889Z] org.eclipse.ease.ExitException: org.eclipse.ease.ExitException: 
06:43:30 [2020-09-12T10:43:30.889Z] Start of script
06:43:31 [2020-09-12T10:43:31.144Z] include file start
06:43:31 [2020-09-12T10:43:31.144Z] include file processed
06:43:31 [2020-09-12T10:43:31.144Z] Result of testMethod = 5
06:43:31 [2020-09-12T10:43:31.144Z] End of script
06:43:31 [2020-09-12T10:43:31.144Z] Start of script
06:43:31 [2020-09-12T10:43:31.144Z] include file start
06:43:31 [2020-09-12T10:43:31.144Z] include file processed
06:43:31 [2020-09-12T10:43:31.144Z] Result of testMethod = 5
06:43:31 [2020-09-12T10:43:31.400Z] Traceback (most recent call last):
06:43:31 [2020-09-12T10:43:31.400Z]   File "(none)", line 184, in run
06:43:31 [2020-09-12T10:43:31.400Z]   File "__ref_L/Debug Test/Main.py_hqnekkcvvw", line 23, in <module>
06:43:31 [2020-09-12T10:43:31.400Z]   File "(none)", line 161, in trace_dispatch
06:43:31 [2020-09-12T10:43:31.400Z] org.eclipse.ease.ExitException: 
06:43:31 [2020-09-12T10:43:31.400Z] 
06:43:31 [2020-09-12T10:43:31.400Z] org.eclipse.ease.ExitException: org.eclipse.ease.ExitException: 
06:43:31 [2020-09-12T10:43:31.400Z] Start of script
06:43:31 [2020-09-12T10:43:31.400Z] include file start
06:43:31 [2020-09-12T10:43:31.400Z] include file processed
06:43:31 [2020-09-12T10:43:31.400Z] Result of testMethod = 5
06:43:31 [2020-09-12T10:43:31.656Z] End of script
06:43:31 [2020-09-12T10:43:31.656Z] Start of script
06:43:31 [2020-09-12T10:43:31.656Z] include file start
06:43:31 [2020-09-12T10:43:31.656Z] include file processed
06:43:31 [2020-09-12T10:43:31.912Z] Result of testMethod = 5
06:43:31 [2020-09-12T10:43:31.912Z] End of script
06:43:31 [2020-09-12T10:43:31.912Z] Start of script
06:43:31 [2020-09-12T10:43:31.912Z] include file start
06:43:31 [2020-09-12T10:43:31.912Z] include file processed
06:43:32 [2020-09-12T10:43:32.168Z] Result of testMethod = 5
06:43:32 [2020-09-12T10:43:32.168Z] End of script
06:43:32 [2020-09-12T10:43:32.423Z] Start of script
06:43:32 [2020-09-12T10:43:32.423Z] include file start
06:43:32 [2020-09-12T10:43:32.423Z] include file processed
06:43:32 [2020-09-12T10:43:32.423Z] Result of testMethod = 5
06:43:32 [2020-09-12T10:43:32.423Z] End of script
06:43:32 [2020-09-12T10:43:32.423Z] Start of script
06:43:32 [2020-09-12T10:43:32.679Z] include file start
06:43:32 [2020-09-12T10:43:32.679Z] include file processed
06:43:32 [2020-09-12T10:43:32.679Z] Result of testMethod = 5
06:43:32 [2020-09-12T10:43:32.679Z] Traceback (most recent call last):
06:43:32 [2020-09-12T10:43:32.679Z]   File "(none)", line 184, in run
06:43:32 [2020-09-12T10:43:32.679Z]   File "__ref_L/Debug Test/Main.py_fflirtqlhk", line 23, in <module>
06:43:32 [2020-09-12T10:43:32.679Z]   File "(none)", line 161, in trace_dispatch
06:43:32 [2020-09-12T10:43:32.679Z] org.eclipse.ease.ExitException: 
06:43:32 [2020-09-12T10:43:32.679Z] 
06:43:32 [2020-09-12T10:43:32.679Z] org.eclipse.ease.ExitException: org.eclipse.ease.ExitException: 
06:43:32 [2020-09-12T10:43:32.935Z] Start of script
06:43:32 [2020-09-12T10:43:32.935Z] include file start
06:43:32 [2020-09-12T10:43:32.935Z] include file processed
06:43:32 [2020-09-12T10:43:32.935Z] Result of testMethod = 5
06:43:32 [2020-09-12T10:43:32.935Z] End of script
06:43:32 [2020-09-12T10:43:32.935Z] Start of script
06:43:32 [2020-09-12T10:43:32.935Z] include file start
06:43:32 [2020-09-12T10:43:32.935Z] include file processed
06:43:32 [2020-09-12T10:43:32.935Z] Result of testMethod = 5
06:43:33 [2020-09-12T10:43:33.190Z] Traceback (most recent call last):
06:43:33 [2020-09-12T10:43:33.190Z]   File "(none)", line 184, in run
06:43:33 [2020-09-12T10:43:33.190Z]   File "__ref_L/Debug Test/Main.py_gasyapeiwz", line 23, in <module>
06:43:33 [2020-09-12T10:43:33.190Z]   File "(none)", line 161, in trace_dispatch
06:43:33 [2020-09-12T10:43:33.190Z] org.eclipse.ease.ExitException: 
06:43:33 [2020-09-12T10:43:33.190Z] 
06:43:33 [2020-09-12T10:43:33.190Z] org.eclipse.ease.ExitException: org.eclipse.ease.ExitException: 
06:43:33 [2020-09-12T10:43:33.445Z] Traceback (most recent call last):
06:43:33 [2020-09-12T10:43:33.445Z]   File "(none)", line 184, in run
06:43:33 [2020-09-12T10:43:33.445Z]   File "__ref_L/Debug Test/Main.py_tkplmamezu", line 1, in <module>
06:43:33 [2020-09-12T10:43:33.445Z]   File "(none)", line 161, in trace_dispatch
06:43:33 [2020-09-12T10:43:33.445Z] org.eclipse.ease.ExitException: 
06:43:33 [2020-09-12T10:43:33.445Z] 
06:43:33 [2020-09-12T10:43:33.445Z] org.eclipse.ease.ExitException: org.eclipse.ease.ExitException: 
06:43:33 [2020-09-12T10:43:33.701Z] Start of script
06:43:33 [2020-09-12T10:43:33.701Z] include file start
06:43:33 [2020-09-12T10:43:33.701Z] include file processed
06:43:33 [2020-09-12T10:43:33.701Z] Result of testMethod = 5
06:43:33 [2020-09-12T10:43:33.701Z] End of script
06:43:33 [2020-09-12T10:43:33.701Z] Start of script
06:43:33 [2020-09-12T10:43:33.701Z] include file start
06:43:33 [2020-09-12T10:43:33.701Z] include file processed
06:43:33 [2020-09-12T10:43:33.957Z] Result of testMethod = 5
06:43:33 [2020-09-12T10:43:33.957Z] End of script
06:43:33 [2020-09-12T10:43:33.957Z] Start of script
06:43:33 [2020-09-12T10:43:33.957Z] include file start
06:43:33 [2020-09-12T10:43:33.957Z] include file processed
06:43:33 [2020-09-12T10:43:33.957Z] Result of testMethod = 5
06:43:34 [2020-09-12T10:43:34.213Z] End of script
06:43:34 [2020-09-12T10:43:34.213Z] Tests run: 42, Failures: 1, Errors: 0, Skipped: 0, Time elapsed: 12.112 s <<< FAILURE! - in org.eclipse.ease.lang.python.jython.debugger.JythonDebugTest
06:43:34 [2020-09-12T10:43:34.213Z] disconnectProcessInSuspendedState(org.eclipse.ease.lang.python.jython.debugger.JythonDebugTest)  Time elapsed: 1.34 s  <<< FAILURE!
06:43:34 [2020-09-12T10:43:34.213Z] java.lang.AssertionError: expected:<1> but was:<0>
06:43:34 [2020-09-12T10:43:34.213Z] 
06:43:34 [2020-09-12T10:43:34.213Z] stepReturnIncludeCommand(org.eclipse.ease.lang.python.jython.debugger.JythonDebugTest)  Time elapsed: 0.209 s
06:43:34 [2020-09-12T10:43:34.213Z] arrayVariableSorting(org.eclipse.ease.lang.python.jython.debugger.JythonDebugTest)  Time elapsed: 0.307 s
06:43:34 [2020-09-12T10:43:34.213Z] stepOverOnDebugTarget(org.eclipse.ease.lang.python.jython.debugger.JythonDebugTest)  Time elapsed: 0.307 s
06:43:34 [2020-09-12T10:43:34.213Z] hasDebugTarget(org.eclipse.ease.lang.python.jython.debugger.JythonDebugTest)  Time elapsed: 0.104 s
06:43:34 [2020-09-12T10:43:34.213Z] disconnectThreadInSuspendedState(org.eclipse.ease.lang.python.jython.debugger.JythonDebugTest)  Time elapsed: 0.206 s
06:43:34 [2020-09-12T10:43:34.213Z] stepReturnOnDebugTarget(org.eclipse.ease.lang.python.jython.debugger.JythonDebugTest)  Time elapsed: 0.307 s
06:43:34 [2020-09-12T10:43:34.213Z] nullVariable(org.eclipse.ease.lang.python.jython.debugger.JythonDebugTest)  Time elapsed: 0.307 s
06:43:34 [2020-09-12T10:43:34.213Z] stepOverOnStackFrame(org.eclipse.ease.lang.python.jython.debugger.JythonDebugTest)  Time elapsed: 0.306 s
06:43:34 [2020-09-12T10:43:34.213Z] resumeOnDebugTarget(org.eclipse.ease.lang.python.jython.debugger.JythonDebugTest)  Time elapsed: 0.207 s
06:43:34 [2020-09-12T10:43:34.213Z] modifyVariableKeepingType(org.eclipse.ease.lang.python.jython.debugger.JythonDebugTest)  Time elapsed: 0.505 s
06:43:34 [2020-09-12T10:43:34.213Z] resumeOnLastIncludeLine(org.eclipse.ease.lang.python.jython.debugger.JythonDebugTest)  Time elapsed: 0.206 s
06:43:34 [2020-09-12T10:43:34.213Z] stepReturnOnStackFrame(org.eclipse.ease.lang.python.jython.debugger.JythonDebugTest)  Time elapsed: 0.306 s
06:43:34 [2020-09-12T10:43:34.213Z] terminateStackFrameInSuspendedState(org.eclipse.ease.lang.python.jython.debugger.JythonDebugTest)  Time elapsed: 0.207 s
06:43:34 [2020-09-12T10:43:34.213Z] breakpointLocation(org.eclipse.ease.lang.python.jython.debugger.JythonDebugTest)  Time elapsed: 0.207 s
06:43:34 [2020-09-12T10:43:34.213Z] stepReturnOnThread(org.eclipse.ease.lang.python.jython.debugger.JythonDebugTest)  Time elapsed: 0.307 s
06:43:34 [2020-09-12T10:43:34.213Z] javaClassVariable(org.eclipse.ease.lang.python.jython.debugger.JythonDebugTest)  Time elapsed: 0.309 s
06:43:34 [2020-09-12T10:43:34.213Z] stepIntoOnThread(org.eclipse.ease.lang.python.jython.debugger.JythonDebugTest)  Time elapsed: 0.307 s
06:43:34 [2020-09-12T10:43:34.213Z] terminateThreadInSuspendedState(org.eclipse.ease.lang.python.jython.debugger.JythonDebugTest)  Time elapsed: 0.206 s
06:43:34 [2020-09-12T10:43:34.213Z] resumeOnThread(org.eclipse.ease.lang.python.jython.debugger.JythonDebugTest)  Time elapsed: 0.206 s
06:43:34 [2020-09-12T10:43:34.213Z] stepIntoOnStackFrame(org.eclipse.ease.lang.python.jython.debugger.JythonDebugTest)  Time elapsed: 0.306 s
06:43:34 [2020-09-12T10:43:34.213Z] terminateProcessInSuspendedState(org.eclipse.ease.lang.python.jython.debugger.JythonDebugTest)  Time elapsed: 0.205 s
06:43:34 [2020-09-12T10:43:34.213Z] stepOverOnProcess(org.eclipse.ease.lang.python.jython.debugger.JythonDebugTest)  Time elapsed: 0.307 s
06:43:34 [2020-09-12T10:43:34.213Z] nativeArrayVariable(org.eclipse.ease.lang.python.jython.debugger.JythonDebugTest)  Time elapsed: 0.306 s
06:43:34 [2020-09-12T10:43:34.213Z] disconnectDebugTargetInSuspendedState(org.eclipse.ease.lang.python.jython.debugger.JythonDebugTest)  Time elapsed: 0.205 s
06:43:34 [2020-09-12T10:43:34.213Z] stepIntoOnProcess(org.eclipse.ease.lang.python.jython.debugger.JythonDebugTest)  Time elapsed: 0.307 s
06:43:34 [2020-09-12T10:43:34.213Z] terminatedState(org.eclipse.ease.lang.python.jython.debugger.JythonDebugTest)  Time elapsed: 0.104 s
06:43:34 [2020-09-12T10:43:34.213Z] stepOverIncludeCommand(org.eclipse.ease.lang.python.jython.debugger.JythonDebugTest)  Time elapsed: 0.305 s
06:43:34 [2020-09-12T10:43:34.213Z] innerScopeVariableBeforeOuterScopeVariable(org.eclipse.ease.lang.python.jython.debugger.JythonDebugTest)  Time elapsed: 0.306 s
06:43:34 [2020-09-12T10:43:34.213Z] stepIntoIncludeCommand(org.eclipse.ease.lang.python.jython.debugger.JythonDebugTest)  Time elapsed: 0.305 s
06:43:34 [2020-09-12T10:43:34.213Z] primitiveStringVariable(org.eclipse.ease.lang.python.jython.debugger.JythonDebugTest)  Time elapsed: 0.305 s
06:43:34 [2020-09-12T10:43:34.213Z] resumeOnProcess(org.eclipse.ease.lang.python.jython.debugger.JythonDebugTest)  Time elapsed: 0.206 s
06:43:34 [2020-09-12T10:43:34.213Z] stepIntoOnDebugTarget(org.eclipse.ease.lang.python.jython.debugger.JythonDebugTest)  Time elapsed: 0.306 s
06:43:34 [2020-09-12T10:43:34.213Z] stepOverOnThread(org.eclipse.ease.lang.python.jython.debugger.JythonDebugTest)  Time elapsed: 0.306 s
06:43:34 [2020-09-12T10:43:34.213Z] suspendedState(org.eclipse.ease.lang.python.jython.debugger.JythonDebugTest)  Time elapsed: 0.205 s
06:43:34 [2020-09-12T10:43:34.213Z] primitiveDoubleVariable(org.eclipse.ease.lang.python.jython.debugger.JythonDebugTest)  Time elapsed: 0.305 s
06:43:34 [2020-09-12T10:43:34.213Z] resumeOnStackFrame(org.eclipse.ease.lang.python.jython.debugger.JythonDebugTest)  Time elapsed: 0.205 s
06:43:34 [2020-09-12T10:43:34.213Z] nativeObjectVariable(org.eclipse.ease.lang.python.jython.debugger.JythonDebugTest)  Time elapsed: 0.306 s
06:43:34 [2020-09-12T10:43:34.213Z] terminateDebugTargetInSuspendedState(org.eclipse.ease.lang.python.jython.debugger.JythonDebugTest)  Time elapsed: 0.205 s
06:43:34 [2020-09-12T10:43:34.213Z] disconnectStackFrameInSuspendedState(org.eclipse.ease.lang.python.jython.debugger.JythonDebugTest)  Time elapsed: 0.206 s
06:43:34 [2020-09-12T10:43:34.213Z] stepReturnOnProcess(org.eclipse.ease.lang.python.jython.debugger.JythonDebugTest)  Time elapsed: 0.307 s
06:43:34 [2020-09-12T10:43:34.213Z] evaluateWatchExpression(org.eclipse.ease.lang.python.jython.debugger.JythonDebugTest)  Time elapsed: 0.207 s
06:43:34 [2020-09-12T10:43:34.213Z] 
06:43:34 [2020-09-12T10:43:34.213Z] Results:
06:43:34 [2020-09-12T10:43:34.213Z] 
06:43:34 [2020-09-12T10:43:34.213Z] Failures: 
06:43:34 [2020-09-12T10:43:34.213Z]   JythonDebugTest>AbstractDebugTest.disconnectProcessInSuspendedState:523->AbstractDebugTest.disconnectTestTemplate:513 expected:<1> but was:<0>
06:43:34 [2020-09-12T10:43:34.213Z] 
06:43:34 [2020-09-12T10:43:34.213Z] Tests run: 42, Failures: 1, Errors: 0, Skipped: 0
06:43:34 [2020-09-12T10:43:34.213Z] 
06:43:34 [2020-09-12T10:43:34.776Z] [INFO] ------------------------------------------------------------------------
06:43:34 [2020-09-12T10:43:34.776Z] [INFO] Reactor Summary for org.eclipse.ease.releng 0.8.0-SNAPSHOT:
06:43:34 [2020-09-12T10:43:34.776Z] [INFO] 
06:43:34 [2020-09-12T10:43:34.776Z] [INFO] org.eclipse.ease.releng ............................ SUCCESS [  0.002 s]
06:43:34 [2020-09-12T10:43:34.776Z] [INFO] org.eclipse.ease.releng.target ..................... SUCCESS [  0.118 s]
06:43:34 [2020-09-12T10:43:34.776Z] [INFO] org.eclipse.ease.test .............................. SUCCESS [ 14.165 s]
06:43:34 [2020-09-12T10:43:34.776Z] [INFO] org.eclipse.ease.lang.javascript.nashorn.test ...... SUCCESS [  2.426 s]
06:43:34 [2020-09-12T10:43:34.776Z] [INFO] org.eclipse.ease.lang.javascript.rhino.test ........ SUCCESS [ 13.778 s]
06:43:34 [2020-09-12T10:43:34.776Z] [INFO] org.eclipse.ease.lang.javascript.test .............. SUCCESS [  2.039 s]
06:43:34 [2020-09-12T10:43:34.776Z] [INFO] org.eclipse.ease.lang.python.test .................. SUCCESS [  1.680 s]
06:43:34 [2020-09-12T10:43:34.776Z] [INFO] org.eclipse.ease.lang.python.jython.test ........... FAILURE [ 14.768 s]
06:43:34 [2020-09-12T10:43:34.776Z] [INFO] org.eclipse.ease.lang.python.py4j.test ............. SKIPPED
06:43:34 [2020-09-12T10:43:34.776Z] [INFO] org.eclipse.ease.lang.scriptarchive.test ........... SKIPPED
06:43:34 [2020-09-12T10:43:34.776Z] [INFO] org.eclipse.ease.ui.test ........................... SKIPPED
06:43:34 [2020-09-12T10:43:34.776Z] [INFO] ------------------------------------------------------------------------
06:43:34 [2020-09-12T10:43:34.776Z] [INFO] BUILD FAILURE
06:43:34 [2020-09-12T10:43:34.776Z] [INFO] ------------------------------------------------------------------------
06:43:34 [2020-09-12T10:43:34.776Z] [INFO] Total time:  01:29 min
06:43:34 [2020-09-12T10:43:34.776Z] [INFO] Finished at: 2020-09-12T10:43:34Z
06:43:34 [2020-09-12T10:43:34.776Z] [INFO] ------------------------------------------------------------------------
06:43:34 [2020-09-12T10:43:34.776Z] [WARNING] [jenkins-event-spy] Unexpected Maven project file name 'target-tests-pom.xml', problems may occur
06:43:34 [2020-09-12T10:43:34.776Z] [INFO] [jenkins-event-spy] Generated /home/jenkins/agent/workspace/ease.verify.core.target.2019-12@tmp/withMaven013285c7/maven-spy-20200912-104205-1157227735848162410702.log
06:43:34 [2020-09-12T10:43:34.776Z] [ERROR] Failed to execute goal org.eclipse.tycho:tycho-surefire-plugin:1.3.0:test (default-test) on project org.eclipse.ease.lang.python.jython.test: There are test failures.
06:43:34 [2020-09-12T10:43:34.776Z] [ERROR] 
06:43:34 [2020-09-12T10:43:34.776Z] [ERROR] Please refer to /home/jenkins/agent/workspace/ease.verify.core.target.2019-12/tests/org.eclipse.ease.lang.python.jython.test/target/surefire-reports for the individual test results.
06:43:34 [2020-09-12T10:43:34.776Z] [ERROR] -> [Help 1]
06:43:34 [2020-09-12T10:43:34.776Z] [ERROR] 
06:43:34 [2020-09-12T10:43:34.776Z] [ERROR] To see the full stack trace of the errors, re-run Maven with the -e switch.
06:43:34 [2020-09-12T10:43:34.776Z] [ERROR] Re-run Maven using the -X switch to enable full debug logging.
06:43:34 [2020-09-12T10:43:34.776Z] [ERROR] 
06:43:34 [2020-09-12T10:43:34.776Z] [ERROR] For more information about the errors and possible solutions, please read the following articles:
06:43:34 [2020-09-12T10:43:34.776Z] [ERROR] [Help 1] http://cwiki.apache.org/confluence/display/MAVEN/MojoFailureException
06:43:34 [2020-09-12T10:43:34.776Z] [ERROR] 
06:43:34 [2020-09-12T10:43:34.776Z] [ERROR] After correcting the problems, you can resume the build with the command
06:43:34 [2020-09-12T10:43:34.776Z] [ERROR]   mvn <args> -rf :org.eclipse.ease.lang.python.jython.test
[Pipeline] }
06:43:35 [2020-09-12T10:43:35.066Z] [withMaven] Publishers: Pipeline Graph Publisher: 3 ms
[Pipeline] // withMaven
[Pipeline] }
[Pipeline] // stage
[Pipeline] stage
[Pipeline] { (Declarative: Post Actions)
[Pipeline] archiveArtifacts
06:43:35 [2020-09-12T10:43:35.095Z] Archiving artifacts
[Pipeline] emailext
06:43:48 [2020-09-12T10:43:48.182Z] Sending email to: christian.pontesegger@web.de
[Pipeline] }
[Pipeline] // stage
[Pipeline] }
[Pipeline] // timeout
[Pipeline] }
[Pipeline] // timestamps
[Pipeline] }
[Pipeline] // node
[Pipeline] End of Pipeline
ERROR: script returned exit code 1
Finished: FAILURE