FailedConsole Output

Skipping 605 KB.. Full Log
.417Z] Results:
06:39:54 [2020-08-22T10:39:54.417Z] 
06:39:54 [2020-08-22T10:39:54.418Z] Tests run: 124, Failures: 0, Errors: 0, Skipped: 0
06:39:54 [2020-08-22T10:39:54.418Z] 
06:39:54 [2020-08-22T10:39:54.673Z] [INFO] All tests passed!
06:39:54 [2020-08-22T10:39:54.673Z] [INFO] 
06:39:54 [2020-08-22T10:39:54.673Z] [INFO] --- maven-install-plugin:2.3.1:install (default-install) @ org.eclipse.ease.test ---
06:39:54 [2020-08-22T10:39:54.673Z] [INFO] Installing /home/jenkins/agent/workspace/ease.verify.core.target.2019-12/tests/org.eclipse.ease.test/target/org.eclipse.ease.test-0.8.0-SNAPSHOT.jar to /home/jenkins/.m2/repository/org/eclipse/ease/org.eclipse.ease.test/0.8.0-SNAPSHOT/org.eclipse.ease.test-0.8.0-SNAPSHOT.jar
06:39:54 [2020-08-22T10:39:54.673Z] [INFO] Installing /home/jenkins/agent/workspace/ease.verify.core.target.2019-12/tests/org.eclipse.ease.test/pom.xml to /home/jenkins/.m2/repository/org/eclipse/ease/org.eclipse.ease.test/0.8.0-SNAPSHOT/org.eclipse.ease.test-0.8.0-SNAPSHOT.pom
06:39:54 [2020-08-22T10:39:54.673Z] [INFO] Installing /home/jenkins/agent/workspace/ease.verify.core.target.2019-12/tests/org.eclipse.ease.test/target/org.eclipse.ease.test-0.8.0-SNAPSHOT-sources.jar to /home/jenkins/.m2/repository/org/eclipse/ease/org.eclipse.ease.test/0.8.0-SNAPSHOT/org.eclipse.ease.test-0.8.0-SNAPSHOT-sources.jar
06:39:54 [2020-08-22T10:39:54.673Z] [INFO] Installing /home/jenkins/agent/workspace/ease.verify.core.target.2019-12/tests/org.eclipse.ease.test/target/p2content.xml to /home/jenkins/.m2/repository/org/eclipse/ease/org.eclipse.ease.test/0.8.0-SNAPSHOT/org.eclipse.ease.test-0.8.0-SNAPSHOT-p2metadata.xml
06:39:54 [2020-08-22T10:39:54.673Z] [INFO] Installing /home/jenkins/agent/workspace/ease.verify.core.target.2019-12/tests/org.eclipse.ease.test/target/p2artifacts.xml to /home/jenkins/.m2/repository/org/eclipse/ease/org.eclipse.ease.test/0.8.0-SNAPSHOT/org.eclipse.ease.test-0.8.0-SNAPSHOT-p2artifacts.xml
06:39:54 [2020-08-22T10:39:54.673Z] [INFO] Installing /home/jenkins/agent/workspace/ease.verify.core.target.2019-12/tests/org.eclipse.ease.test/target/p2content.xml to /home/jenkins/.m2/repository/org/eclipse/ease/org.eclipse.ease.test/0.8.0-SNAPSHOT/org.eclipse.ease.test-0.8.0-SNAPSHOT-p2metadata.xml
06:39:54 [2020-08-22T10:39:54.673Z] [INFO] Installing /home/jenkins/agent/workspace/ease.verify.core.target.2019-12/tests/org.eclipse.ease.test/target/p2artifacts.xml to /home/jenkins/.m2/repository/org/eclipse/ease/org.eclipse.ease.test/0.8.0-SNAPSHOT/org.eclipse.ease.test-0.8.0-SNAPSHOT-p2artifacts.xml
06:39:54 [2020-08-22T10:39:54.673Z] [INFO] 
06:39:54 [2020-08-22T10:39:54.673Z] [INFO] --- tycho-p2-plugin:1.3.0:update-local-index (default-update-local-index) @ org.eclipse.ease.test ---
06:39:54 [2020-08-22T10:39:54.673Z] [INFO] 
06:39:54 [2020-08-22T10:39:54.673Z] [INFO] ---< org.eclipse.ease:org.eclipse.ease.lang.javascript.nashorn.test >---
06:39:54 [2020-08-22T10:39:54.673Z] [INFO] Building org.eclipse.ease.lang.javascript.nashorn.test 0.8.0-SNAPSHOT [39/48]
06:39:54 [2020-08-22T10:39:54.673Z] [INFO] ------------------------[ eclipse-test-plugin ]-------------------------
06:39:54 [2020-08-22T10:39:54.673Z] [INFO] 
06:39:54 [2020-08-22T10:39:54.673Z] [INFO] --- maven-clean-plugin:2.5:clean (default-clean) @ org.eclipse.ease.lang.javascript.nashorn.test ---
06:39:54 [2020-08-22T10:39:54.673Z] [INFO] 
06:39:54 [2020-08-22T10:39:54.673Z] [INFO] --- tycho-packaging-plugin:1.3.0:build-qualifier (default-build-qualifier) @ org.eclipse.ease.lang.javascript.nashorn.test ---
06:39:54 [2020-08-22T10:39:54.673Z] [INFO] The project's OSGi version is 0.8.0.I201910171213
06:39:54 [2020-08-22T10:39:54.673Z] [INFO] 
06:39:54 [2020-08-22T10:39:54.673Z] [INFO] --- tycho-packaging-plugin:1.3.0:validate-id (default-validate-id) @ org.eclipse.ease.lang.javascript.nashorn.test ---
06:39:54 [2020-08-22T10:39:54.673Z] [INFO] 
06:39:54 [2020-08-22T10:39:54.674Z] [INFO] --- tycho-packaging-plugin:1.3.0:validate-version (default-validate-version) @ org.eclipse.ease.lang.javascript.nashorn.test ---
06:39:54 [2020-08-22T10:39:54.674Z] [INFO] 
06:39:54 [2020-08-22T10:39:54.674Z] [INFO] >>> maven-javadoc-plugin:2.9.1:javadoc (build-docs) > generate-sources @ org.eclipse.ease.lang.javascript.nashorn.test >>>
06:39:54 [2020-08-22T10:39:54.674Z] [INFO] 
06:39:54 [2020-08-22T10:39:54.674Z] [INFO] --- tycho-packaging-plugin:1.3.0:build-qualifier (default-build-qualifier) @ org.eclipse.ease.lang.javascript.nashorn.test ---
06:39:54 [2020-08-22T10:39:54.674Z] [INFO] The project's OSGi version is 0.8.0.I201910171213
06:39:54 [2020-08-22T10:39:54.674Z] [INFO] 
06:39:54 [2020-08-22T10:39:54.674Z] [INFO] --- tycho-packaging-plugin:1.3.0:validate-id (default-validate-id) @ org.eclipse.ease.lang.javascript.nashorn.test ---
06:39:54 [2020-08-22T10:39:54.674Z] [INFO] 
06:39:54 [2020-08-22T10:39:54.674Z] [INFO] --- tycho-packaging-plugin:1.3.0:validate-version (default-validate-version) @ org.eclipse.ease.lang.javascript.nashorn.test ---
06:39:54 [2020-08-22T10:39:54.674Z] [INFO] 
06:39:54 [2020-08-22T10:39:54.674Z] [INFO] <<< maven-javadoc-plugin:2.9.1:javadoc (build-docs) < generate-sources @ org.eclipse.ease.lang.javascript.nashorn.test <<<
06:39:54 [2020-08-22T10:39:54.674Z] [INFO] 
06:39:54 [2020-08-22T10:39:54.674Z] [INFO] 
06:39:54 [2020-08-22T10:39:54.674Z] [INFO] --- maven-javadoc-plugin:2.9.1:javadoc (build-docs) @ org.eclipse.ease.lang.javascript.nashorn.test ---
06:39:54 [2020-08-22T10:39:54.929Z] [ERROR] Error fetching link: http://help.eclipse.org/oxygen/topic/org.eclipse.platform.doc.isv/reference/api/package-list. Ignored it.
06:39:55 [2020-08-22T10:39:55.856Z] [INFO] 
06:39:55 [2020-08-22T10:39:55.856Z] Loading source files for package org.eclipse.ease.lang.javascript.nashorn...
06:39:55 [2020-08-22T10:39:55.856Z] Constructing Javadoc information...
06:39:55 [2020-08-22T10:39:55.856Z] WARNING: Cannot open location "/home/jenkins/agent/workspace/ease.verify.core.target.2019-12/tests/org.eclipse.ease.lang.javascript.nashorn.test/target/javadoc-bundle-options/package-list"
06:39:55 [2020-08-22T10:39:55.856Z] No plugin definition found, skipping
06:39:55 [2020-08-22T10:39:55.856Z] No plugin definition found, skipping
06:39:55 [2020-08-22T10:39:55.856Z] [WARNING] Javadoc Warnings
06:39:55 [2020-08-22T10:39:55.856Z] [WARNING] Picked up JAVA_TOOL_OPTIONS: -Dmaven.ext.class.path="/home/jenkins/agent/workspace/ease.verify.core.target.2019-12@tmp/withMavend43eb3e6/pipeline-maven-spy.jar" -Dorg.jenkinsci.plugins.pipeline.maven.reportsFolder="/home/jenkins/agent/workspace/ease.verify.core.target.2019-12@tmp/withMavend43eb3e6"
06:39:55 [2020-08-22T10:39:55.856Z] [INFO] 
06:39:55 [2020-08-22T10:39:55.856Z] [INFO] --- build-helper-maven-plugin:1.9.1:add-resource (add_help) @ org.eclipse.ease.lang.javascript.nashorn.test ---
06:39:55 [2020-08-22T10:39:55.856Z] [INFO] 
06:39:55 [2020-08-22T10:39:55.856Z] [INFO] --- maven-resources-plugin:2.4.3:resources (default-resources) @ org.eclipse.ease.lang.javascript.nashorn.test ---
06:39:55 [2020-08-22T10:39:55.856Z] [INFO] Using 'UTF-8' encoding to copy filtered resources.
06:39:55 [2020-08-22T10:39:55.856Z] [INFO] skip non existing resourceDirectory /home/jenkins/agent/workspace/ease.verify.core.target.2019-12/tests/org.eclipse.ease.lang.javascript.nashorn.test/src/main/resources
06:39:55 [2020-08-22T10:39:55.856Z] [INFO] skip non existing resourceDirectory /home/jenkins/agent/workspace/ease.verify.core.target.2019-12/tests/org.eclipse.ease.lang.javascript.nashorn.test/help
06:39:55 [2020-08-22T10:39:55.856Z] [INFO] 
06:39:55 [2020-08-22T10:39:55.856Z] [INFO] --- tycho-compiler-plugin:1.3.0:compile (default-compile) @ org.eclipse.ease.lang.javascript.nashorn.test ---
06:39:55 [2020-08-22T10:39:55.856Z] [INFO] Compiling 1 source file to /home/jenkins/agent/workspace/ease.verify.core.target.2019-12/tests/org.eclipse.ease.lang.javascript.nashorn.test/target/classes
06:39:56 [2020-08-22T10:39:56.112Z] [INFO] 
06:39:56 [2020-08-22T10:39:56.112Z] [INFO] --- maven-resources-plugin:2.4.3:testResources (default-testResources) @ org.eclipse.ease.lang.javascript.nashorn.test ---
06:39:56 [2020-08-22T10:39:56.112Z] [INFO] Using 'UTF-8' encoding to copy filtered resources.
06:39:56 [2020-08-22T10:39:56.112Z] [INFO] skip non existing resourceDirectory /home/jenkins/agent/workspace/ease.verify.core.target.2019-12/tests/org.eclipse.ease.lang.javascript.nashorn.test/src/test/resources
06:39:56 [2020-08-22T10:39:56.112Z] [INFO] 
06:39:56 [2020-08-22T10:39:56.112Z] [INFO] --- tycho-source-plugin:1.3.0:plugin-source (plugin-source) @ org.eclipse.ease.lang.javascript.nashorn.test ---
06:39:56 [2020-08-22T10:39:56.112Z] [WARNING] Bundle-Vendor header not found in /home/jenkins/agent/workspace/ease.verify.core.target.2019-12/tests/org.eclipse.ease.lang.javascript.nashorn.test/META-INF/MANIFEST.MF, fallback to 'unknown' for source bundle
06:39:56 [2020-08-22T10:39:56.112Z] [INFO] Building jar: /home/jenkins/agent/workspace/ease.verify.core.target.2019-12/tests/org.eclipse.ease.lang.javascript.nashorn.test/target/org.eclipse.ease.lang.javascript.nashorn.test-0.8.0-SNAPSHOT-sources.jar
06:39:56 [2020-08-22T10:39:56.112Z] [INFO] 
06:39:56 [2020-08-22T10:39:56.112Z] [INFO] --- target-platform-configuration:1.3.0:target-platform (default-target-platform) @ org.eclipse.ease.lang.javascript.nashorn.test ---
06:39:56 [2020-08-22T10:39:56.112Z] [INFO] 
06:39:56 [2020-08-22T10:39:56.112Z] [INFO] --- tycho-packaging-plugin:1.3.0:package-plugin (default-package-plugin) @ org.eclipse.ease.lang.javascript.nashorn.test ---
06:39:56 [2020-08-22T10:39:56.112Z] [INFO] Building jar: /home/jenkins/agent/workspace/ease.verify.core.target.2019-12/tests/org.eclipse.ease.lang.javascript.nashorn.test/target/org.eclipse.ease.lang.javascript.nashorn.test-0.8.0-SNAPSHOT.jar
06:39:56 [2020-08-22T10:39:56.112Z] [INFO] 
06:39:56 [2020-08-22T10:39:56.112Z] [INFO] --- tycho-p2-plugin:1.3.0:p2-metadata-default (default-p2-metadata-default) @ org.eclipse.ease.lang.javascript.nashorn.test ---
06:39:56 [2020-08-22T10:39:56.112Z] [INFO] 
06:39:56 [2020-08-22T10:39:56.112Z] [INFO] --- tycho-source-feature-plugin:1.3.0:source-feature (source-feature) @ org.eclipse.ease.lang.javascript.nashorn.test ---
06:39:56 [2020-08-22T10:39:56.112Z] [INFO] 
06:39:56 [2020-08-22T10:39:56.112Z] [INFO] --- tycho-p2-plugin:1.3.0:p2-metadata (attached-p2-metadata) @ org.eclipse.ease.lang.javascript.nashorn.test ---
06:39:56 [2020-08-22T10:39:56.112Z] [INFO] 
06:39:56 [2020-08-22T10:39:56.112Z] [INFO] --- tycho-surefire-plugin:1.3.0:test (default-test) @ org.eclipse.ease.lang.javascript.nashorn.test ---
06:39:56 [2020-08-22T10:39:56.112Z] [INFO] Expected eclipse log file: /home/jenkins/agent/workspace/ease.verify.core.target.2019-12/tests/org.eclipse.ease.lang.javascript.nashorn.test/target/work/data/.metadata/.log
06:39:56 [2020-08-22T10:39:56.112Z] [INFO] Command line:
06:39:56 [2020-08-22T10:39:56.112Z] 	[/opt/tools/java/oracle/jdk-8/1.8.0_202/jre/bin/java, -Dosgi.noShutdown=false, -Dosgi.os=linux, -Dosgi.ws=gtk, -Dosgi.arch=x86_64, -Dosgi.clean=true, -jar, /home/jenkins/.m2/repository/p2/osgi/bundle/org.eclipse.equinox.launcher/1.5.700.v20200207-2156/org.eclipse.equinox.launcher-1.5.700.v20200207-2156.jar, -data, /home/jenkins/agent/workspace/ease.verify.core.target.2019-12/tests/org.eclipse.ease.lang.javascript.nashorn.test/target/work/data, -install, /home/jenkins/agent/workspace/ease.verify.core.target.2019-12/tests/org.eclipse.ease.lang.javascript.nashorn.test/target/work, -configuration, /home/jenkins/agent/workspace/ease.verify.core.target.2019-12/tests/org.eclipse.ease.lang.javascript.nashorn.test/target/work/configuration, -application, org.eclipse.tycho.surefire.osgibooter.headlesstest, -testproperties, /home/jenkins/agent/workspace/ease.verify.core.target.2019-12/tests/org.eclipse.ease.lang.javascript.nashorn.test/target/surefire.properties]
06:39:56 [2020-08-22T10:39:56.112Z] Picked up JAVA_TOOL_OPTIONS: -Dmaven.ext.class.path="/home/jenkins/agent/workspace/ease.verify.core.target.2019-12@tmp/withMavend43eb3e6/pipeline-maven-spy.jar" -Dorg.jenkinsci.plugins.pipeline.maven.reportsFolder="/home/jenkins/agent/workspace/ease.verify.core.target.2019-12@tmp/withMavend43eb3e6" 
06:39:57 [2020-08-22T10:39:57.491Z] Running org.eclipse.ease.lang.javascript.nashorn.NashornEnvironmentTest
06:39:57 [2020-08-22T10:39:57.779Z] Tests run: 5, Failures: 0, Errors: 0, Skipped: 0, Time elapsed: 0.635 s - in org.eclipse.ease.lang.javascript.nashorn.NashornEnvironmentTest
06:39:57 [2020-08-22T10:39:57.779Z] reloadEnvironment(org.eclipse.ease.lang.javascript.nashorn.NashornEnvironmentTest)  Time elapsed: 0.404 s
06:39:57 [2020-08-22T10:39:57.779Z] bootstrappedEnvironment(org.eclipse.ease.lang.javascript.nashorn.NashornEnvironmentTest)  Time elapsed: 0.024 s
06:39:57 [2020-08-22T10:39:57.779Z] postMethodCallback(org.eclipse.ease.lang.javascript.nashorn.NashornEnvironmentTest)  Time elapsed: 0.112 s
06:39:57 [2020-08-22T10:39:57.779Z] preMethodCallback(org.eclipse.ease.lang.javascript.nashorn.NashornEnvironmentTest)  Time elapsed: 0.047 s
06:39:57 [2020-08-22T10:39:57.779Z] reloadFunctionDefinitions(org.eclipse.ease.lang.javascript.nashorn.NashornEnvironmentTest)  Time elapsed: 0.032 s
06:39:57 [2020-08-22T10:39:57.779Z] 
06:39:57 [2020-08-22T10:39:57.779Z] Results:
06:39:57 [2020-08-22T10:39:57.779Z] 
06:39:57 [2020-08-22T10:39:57.779Z] Tests run: 5, Failures: 0, Errors: 0, Skipped: 0
06:39:57 [2020-08-22T10:39:57.779Z] 
06:39:58 [2020-08-22T10:39:58.707Z] [INFO] All tests passed!
06:39:58 [2020-08-22T10:39:58.707Z] [INFO] 
06:39:58 [2020-08-22T10:39:58.707Z] [INFO] --- maven-install-plugin:2.3.1:install (default-install) @ org.eclipse.ease.lang.javascript.nashorn.test ---
06:39:58 [2020-08-22T10:39:58.707Z] [INFO] Installing /home/jenkins/agent/workspace/ease.verify.core.target.2019-12/tests/org.eclipse.ease.lang.javascript.nashorn.test/target/org.eclipse.ease.lang.javascript.nashorn.test-0.8.0-SNAPSHOT.jar to /home/jenkins/.m2/repository/org/eclipse/ease/org.eclipse.ease.lang.javascript.nashorn.test/0.8.0-SNAPSHOT/org.eclipse.ease.lang.javascript.nashorn.test-0.8.0-SNAPSHOT.jar
06:39:58 [2020-08-22T10:39:58.707Z] [INFO] Installing /home/jenkins/agent/workspace/ease.verify.core.target.2019-12/tests/org.eclipse.ease.lang.javascript.nashorn.test/pom.xml to /home/jenkins/.m2/repository/org/eclipse/ease/org.eclipse.ease.lang.javascript.nashorn.test/0.8.0-SNAPSHOT/org.eclipse.ease.lang.javascript.nashorn.test-0.8.0-SNAPSHOT.pom
06:39:58 [2020-08-22T10:39:58.707Z] [INFO] Installing /home/jenkins/agent/workspace/ease.verify.core.target.2019-12/tests/org.eclipse.ease.lang.javascript.nashorn.test/target/org.eclipse.ease.lang.javascript.nashorn.test-0.8.0-SNAPSHOT-sources.jar to /home/jenkins/.m2/repository/org/eclipse/ease/org.eclipse.ease.lang.javascript.nashorn.test/0.8.0-SNAPSHOT/org.eclipse.ease.lang.javascript.nashorn.test-0.8.0-SNAPSHOT-sources.jar
06:39:58 [2020-08-22T10:39:58.707Z] [INFO] Installing /home/jenkins/agent/workspace/ease.verify.core.target.2019-12/tests/org.eclipse.ease.lang.javascript.nashorn.test/target/p2content.xml to /home/jenkins/.m2/repository/org/eclipse/ease/org.eclipse.ease.lang.javascript.nashorn.test/0.8.0-SNAPSHOT/org.eclipse.ease.lang.javascript.nashorn.test-0.8.0-SNAPSHOT-p2metadata.xml
06:39:58 [2020-08-22T10:39:58.707Z] [INFO] Installing /home/jenkins/agent/workspace/ease.verify.core.target.2019-12/tests/org.eclipse.ease.lang.javascript.nashorn.test/target/p2artifacts.xml to /home/jenkins/.m2/repository/org/eclipse/ease/org.eclipse.ease.lang.javascript.nashorn.test/0.8.0-SNAPSHOT/org.eclipse.ease.lang.javascript.nashorn.test-0.8.0-SNAPSHOT-p2artifacts.xml
06:39:58 [2020-08-22T10:39:58.707Z] [INFO] Installing /home/jenkins/agent/workspace/ease.verify.core.target.2019-12/tests/org.eclipse.ease.lang.javascript.nashorn.test/target/p2content.xml to /home/jenkins/.m2/repository/org/eclipse/ease/org.eclipse.ease.lang.javascript.nashorn.test/0.8.0-SNAPSHOT/org.eclipse.ease.lang.javascript.nashorn.test-0.8.0-SNAPSHOT-p2metadata.xml
06:39:58 [2020-08-22T10:39:58.707Z] [INFO] Installing /home/jenkins/agent/workspace/ease.verify.core.target.2019-12/tests/org.eclipse.ease.lang.javascript.nashorn.test/target/p2artifacts.xml to /home/jenkins/.m2/repository/org/eclipse/ease/org.eclipse.ease.lang.javascript.nashorn.test/0.8.0-SNAPSHOT/org.eclipse.ease.lang.javascript.nashorn.test-0.8.0-SNAPSHOT-p2artifacts.xml
06:39:58 [2020-08-22T10:39:58.707Z] [INFO] 
06:39:58 [2020-08-22T10:39:58.707Z] [INFO] --- tycho-p2-plugin:1.3.0:update-local-index (default-update-local-index) @ org.eclipse.ease.lang.javascript.nashorn.test ---
06:39:58 [2020-08-22T10:39:58.707Z] [INFO] 
06:39:58 [2020-08-22T10:39:58.707Z] [INFO] ----< org.eclipse.ease:org.eclipse.ease.lang.javascript.rhino.test >----
06:39:58 [2020-08-22T10:39:58.707Z] [INFO] Building org.eclipse.ease.lang.javascript.rhino.test 0.8.0-SNAPSHOT [40/48]
06:39:58 [2020-08-22T10:39:58.707Z] [INFO] ------------------------[ eclipse-test-plugin ]-------------------------
06:39:58 [2020-08-22T10:39:58.707Z] [INFO] 
06:39:58 [2020-08-22T10:39:58.707Z] [INFO] --- maven-clean-plugin:2.5:clean (default-clean) @ org.eclipse.ease.lang.javascript.rhino.test ---
06:39:58 [2020-08-22T10:39:58.707Z] [INFO] 
06:39:58 [2020-08-22T10:39:58.707Z] [INFO] --- tycho-packaging-plugin:1.3.0:build-qualifier (default-build-qualifier) @ org.eclipse.ease.lang.javascript.rhino.test ---
06:39:58 [2020-08-22T10:39:58.707Z] [INFO] The project's OSGi version is 0.8.0.I201911291239
06:39:58 [2020-08-22T10:39:58.707Z] [INFO] 
06:39:58 [2020-08-22T10:39:58.707Z] [INFO] --- tycho-packaging-plugin:1.3.0:validate-id (default-validate-id) @ org.eclipse.ease.lang.javascript.rhino.test ---
06:39:58 [2020-08-22T10:39:58.707Z] [INFO] 
06:39:58 [2020-08-22T10:39:58.707Z] [INFO] --- tycho-packaging-plugin:1.3.0:validate-version (default-validate-version) @ org.eclipse.ease.lang.javascript.rhino.test ---
06:39:58 [2020-08-22T10:39:58.707Z] [INFO] 
06:39:58 [2020-08-22T10:39:58.707Z] [INFO] >>> maven-javadoc-plugin:2.9.1:javadoc (build-docs) > generate-sources @ org.eclipse.ease.lang.javascript.rhino.test >>>
06:39:58 [2020-08-22T10:39:58.707Z] [INFO] 
06:39:58 [2020-08-22T10:39:58.707Z] [INFO] --- tycho-packaging-plugin:1.3.0:build-qualifier (default-build-qualifier) @ org.eclipse.ease.lang.javascript.rhino.test ---
06:39:58 [2020-08-22T10:39:58.707Z] [INFO] The project's OSGi version is 0.8.0.I201911291239
06:39:58 [2020-08-22T10:39:58.707Z] [INFO] 
06:39:58 [2020-08-22T10:39:58.707Z] [INFO] --- tycho-packaging-plugin:1.3.0:validate-id (default-validate-id) @ org.eclipse.ease.lang.javascript.rhino.test ---
06:39:58 [2020-08-22T10:39:58.707Z] [INFO] 
06:39:58 [2020-08-22T10:39:58.707Z] [INFO] --- tycho-packaging-plugin:1.3.0:validate-version (default-validate-version) @ org.eclipse.ease.lang.javascript.rhino.test ---
06:39:58 [2020-08-22T10:39:58.707Z] [INFO] 
06:39:58 [2020-08-22T10:39:58.707Z] [INFO] <<< maven-javadoc-plugin:2.9.1:javadoc (build-docs) < generate-sources @ org.eclipse.ease.lang.javascript.rhino.test <<<
06:39:58 [2020-08-22T10:39:58.707Z] [INFO] 
06:39:58 [2020-08-22T10:39:58.707Z] [INFO] 
06:39:58 [2020-08-22T10:39:58.707Z] [INFO] --- maven-javadoc-plugin:2.9.1:javadoc (build-docs) @ org.eclipse.ease.lang.javascript.rhino.test ---
06:39:58 [2020-08-22T10:39:58.707Z] [ERROR] Error fetching link: http://help.eclipse.org/oxygen/topic/org.eclipse.platform.doc.isv/reference/api/package-list. Ignored it.
06:40:00 [2020-08-22T10:40:00.084Z] [INFO] 
06:40:00 [2020-08-22T10:40:00.084Z] Loading source files for package org.eclipse.ease.lang.javascript.rhino...
06:40:00 [2020-08-22T10:40:00.084Z] Constructing Javadoc information...
06:40:00 [2020-08-22T10:40:00.084Z] WARNING: Cannot open location "/home/jenkins/agent/workspace/ease.verify.core.target.2019-12/tests/org.eclipse.ease.lang.javascript.rhino.test/target/javadoc-bundle-options/package-list"
06:40:00 [2020-08-22T10:40:00.084Z] No plugin definition found, skipping
06:40:00 [2020-08-22T10:40:00.084Z] No plugin definition found, skipping
06:40:00 [2020-08-22T10:40:00.084Z] [WARNING] Javadoc Warnings
06:40:00 [2020-08-22T10:40:00.084Z] [WARNING] Picked up JAVA_TOOL_OPTIONS: -Dmaven.ext.class.path="/home/jenkins/agent/workspace/ease.verify.core.target.2019-12@tmp/withMavend43eb3e6/pipeline-maven-spy.jar" -Dorg.jenkinsci.plugins.pipeline.maven.reportsFolder="/home/jenkins/agent/workspace/ease.verify.core.target.2019-12@tmp/withMavend43eb3e6"
06:40:00 [2020-08-22T10:40:00.084Z] [INFO] 
06:40:00 [2020-08-22T10:40:00.084Z] [INFO] --- build-helper-maven-plugin:1.9.1:add-resource (add_help) @ org.eclipse.ease.lang.javascript.rhino.test ---
06:40:00 [2020-08-22T10:40:00.084Z] [INFO] 
06:40:00 [2020-08-22T10:40:00.084Z] [INFO] --- maven-resources-plugin:2.4.3:resources (default-resources) @ org.eclipse.ease.lang.javascript.rhino.test ---
06:40:00 [2020-08-22T10:40:00.084Z] [INFO] Using 'UTF-8' encoding to copy filtered resources.
06:40:00 [2020-08-22T10:40:00.084Z] [INFO] skip non existing resourceDirectory /home/jenkins/agent/workspace/ease.verify.core.target.2019-12/tests/org.eclipse.ease.lang.javascript.rhino.test/src/main/resources
06:40:00 [2020-08-22T10:40:00.084Z] [INFO] skip non existing resourceDirectory /home/jenkins/agent/workspace/ease.verify.core.target.2019-12/tests/org.eclipse.ease.lang.javascript.rhino.test/help
06:40:00 [2020-08-22T10:40:00.084Z] [INFO] 
06:40:00 [2020-08-22T10:40:00.084Z] [INFO] --- tycho-compiler-plugin:1.3.0:compile (default-compile) @ org.eclipse.ease.lang.javascript.rhino.test ---
06:40:00 [2020-08-22T10:40:00.084Z] [INFO] Compiling 4 source files to /home/jenkins/agent/workspace/ease.verify.core.target.2019-12/tests/org.eclipse.ease.lang.javascript.rhino.test/target/classes
06:40:00 [2020-08-22T10:40:00.084Z] [INFO] 
06:40:00 [2020-08-22T10:40:00.084Z] [INFO] --- maven-resources-plugin:2.4.3:testResources (default-testResources) @ org.eclipse.ease.lang.javascript.rhino.test ---
06:40:00 [2020-08-22T10:40:00.084Z] [INFO] Using 'UTF-8' encoding to copy filtered resources.
06:40:00 [2020-08-22T10:40:00.084Z] [INFO] skip non existing resourceDirectory /home/jenkins/agent/workspace/ease.verify.core.target.2019-12/tests/org.eclipse.ease.lang.javascript.rhino.test/src/test/resources
06:40:00 [2020-08-22T10:40:00.084Z] [INFO] 
06:40:00 [2020-08-22T10:40:00.084Z] [INFO] --- tycho-source-plugin:1.3.0:plugin-source (plugin-source) @ org.eclipse.ease.lang.javascript.rhino.test ---
06:40:00 [2020-08-22T10:40:00.084Z] [WARNING] Bundle-Vendor header not found in /home/jenkins/agent/workspace/ease.verify.core.target.2019-12/tests/org.eclipse.ease.lang.javascript.rhino.test/META-INF/MANIFEST.MF, fallback to 'unknown' for source bundle
06:40:00 [2020-08-22T10:40:00.084Z] [INFO] Building jar: /home/jenkins/agent/workspace/ease.verify.core.target.2019-12/tests/org.eclipse.ease.lang.javascript.rhino.test/target/org.eclipse.ease.lang.javascript.rhino.test-0.8.0-SNAPSHOT-sources.jar
06:40:00 [2020-08-22T10:40:00.084Z] [INFO] 
06:40:00 [2020-08-22T10:40:00.084Z] [INFO] --- target-platform-configuration:1.3.0:target-platform (default-target-platform) @ org.eclipse.ease.lang.javascript.rhino.test ---
06:40:00 [2020-08-22T10:40:00.084Z] [INFO] 
06:40:00 [2020-08-22T10:40:00.084Z] [INFO] --- tycho-packaging-plugin:1.3.0:package-plugin (default-package-plugin) @ org.eclipse.ease.lang.javascript.rhino.test ---
06:40:00 [2020-08-22T10:40:00.084Z] [INFO] Building jar: /home/jenkins/agent/workspace/ease.verify.core.target.2019-12/tests/org.eclipse.ease.lang.javascript.rhino.test/target/org.eclipse.ease.lang.javascript.rhino.test-0.8.0-SNAPSHOT.jar
06:40:00 [2020-08-22T10:40:00.084Z] [INFO] 
06:40:00 [2020-08-22T10:40:00.084Z] [INFO] --- tycho-p2-plugin:1.3.0:p2-metadata-default (default-p2-metadata-default) @ org.eclipse.ease.lang.javascript.rhino.test ---
06:40:00 [2020-08-22T10:40:00.084Z] [INFO] 
06:40:00 [2020-08-22T10:40:00.084Z] [INFO] --- tycho-source-feature-plugin:1.3.0:source-feature (source-feature) @ org.eclipse.ease.lang.javascript.rhino.test ---
06:40:00 [2020-08-22T10:40:00.084Z] [INFO] 
06:40:00 [2020-08-22T10:40:00.084Z] [INFO] --- tycho-p2-plugin:1.3.0:p2-metadata (attached-p2-metadata) @ org.eclipse.ease.lang.javascript.rhino.test ---
06:40:00 [2020-08-22T10:40:00.084Z] [INFO] 
06:40:00 [2020-08-22T10:40:00.084Z] [INFO] --- tycho-surefire-plugin:1.3.0:test (default-test) @ org.eclipse.ease.lang.javascript.rhino.test ---
06:40:00 [2020-08-22T10:40:00.084Z] [INFO] Expected eclipse log file: /home/jenkins/agent/workspace/ease.verify.core.target.2019-12/tests/org.eclipse.ease.lang.javascript.rhino.test/target/work/data/.metadata/.log
06:40:00 [2020-08-22T10:40:00.084Z] [INFO] Command line:
06:40:00 [2020-08-22T10:40:00.085Z] 	[/opt/tools/java/oracle/jdk-8/1.8.0_202/jre/bin/java, -Dosgi.noShutdown=false, -Dosgi.os=linux, -Dosgi.ws=gtk, -Dosgi.arch=x86_64, -Dosgi.clean=true, -jar, /home/jenkins/.m2/repository/p2/osgi/bundle/org.eclipse.equinox.launcher/1.5.700.v20200207-2156/org.eclipse.equinox.launcher-1.5.700.v20200207-2156.jar, -data, /home/jenkins/agent/workspace/ease.verify.core.target.2019-12/tests/org.eclipse.ease.lang.javascript.rhino.test/target/work/data, -install, /home/jenkins/agent/workspace/ease.verify.core.target.2019-12/tests/org.eclipse.ease.lang.javascript.rhino.test/target/work, -configuration, /home/jenkins/agent/workspace/ease.verify.core.target.2019-12/tests/org.eclipse.ease.lang.javascript.rhino.test/target/work/configuration, -application, org.eclipse.tycho.surefire.osgibooter.headlesstest, -testproperties, /home/jenkins/agent/workspace/ease.verify.core.target.2019-12/tests/org.eclipse.ease.lang.javascript.rhino.test/target/surefire.properties]
06:40:00 [2020-08-22T10:40:00.085Z] Picked up JAVA_TOOL_OPTIONS: -Dmaven.ext.class.path="/home/jenkins/agent/workspace/ease.verify.core.target.2019-12@tmp/withMavend43eb3e6/pipeline-maven-spy.jar" -Dorg.jenkinsci.plugins.pipeline.maven.reportsFolder="/home/jenkins/agent/workspace/ease.verify.core.target.2019-12@tmp/withMavend43eb3e6" 
06:40:01 [2020-08-22T10:40:01.479Z] Running org.eclipse.ease.lang.javascript.rhino.RhinoScriptEngineTest
06:40:01 [2020-08-22T10:40:01.479Z] org.eclipse.ease.ScriptExecutionException: JavaError: NotThere cannot be found by org.mozilla.javascript_1.7.10.v20190430-1943
06:40:01 [2020-08-22T10:40:01.479Z] 	at <unknown source>
06:40:01 [2020-08-22T10:40:01.479Z] 
06:40:01 [2020-08-22T10:40:01.479Z] Java Stacktrace:
06:40:01 [2020-08-22T10:40:01.479Z] java.lang.ClassNotFoundException: NotThere cannot be found by org.mozilla.javascript_1.7.10.v20190430-1943
06:40:01 [2020-08-22T10:40:01.479Z] 	at org.eclipse.osgi.internal.loader.BundleLoader.findClass(BundleLoader.java:516)
06:40:01 [2020-08-22T10:40:01.479Z] 	at org.eclipse.osgi.internal.loader.ModuleClassLoader.loadClass(ModuleClassLoader.java:171)
06:40:01 [2020-08-22T10:40:01.479Z] 	at java.lang.ClassLoader.loadClass(ClassLoader.java:357)
06:40:01 [2020-08-22T10:40:01.479Z] 	at java.lang.Class.forName0(Native Method)
06:40:01 [2020-08-22T10:40:01.479Z] 	at java.lang.Class.forName(Class.java:264)
06:40:01 [2020-08-22T10:40:01.479Z] 	at sun.reflect.NativeMethodAccessorImpl.invoke0(Native Method)
06:40:01 [2020-08-22T10:40:01.479Z] 	at sun.reflect.NativeMethodAccessorImpl.invoke(NativeMethodAccessorImpl.java:62)
06:40:01 [2020-08-22T10:40:01.479Z] 	at sun.reflect.DelegatingMethodAccessorImpl.invoke(DelegatingMethodAccessorImpl.java:43)
06:40:01 [2020-08-22T10:40:01.479Z] 	at java.lang.reflect.Method.invoke(Method.java:498)
06:40:01 [2020-08-22T10:40:01.479Z] 	at org.mozilla.javascript.MemberBox.invoke(MemberBox.java:126)
06:40:01 [2020-08-22T10:40:01.479Z] 	at org.mozilla.javascript.NativeJavaMethod.call(NativeJavaMethod.java:225)
06:40:01 [2020-08-22T10:40:01.479Z] 	at org.mozilla.javascript.optimizer.OptRuntime.call1(OptRuntime.java:32)
06:40:01 [2020-08-22T10:40:01.479Z] 	at org.mozilla.javascript.gen.c_3._c_script_0(Unknown Source)
06:40:01 [2020-08-22T10:40:01.479Z] 	at org.mozilla.javascript.gen.c_3.call(Unknown Source)
06:40:01 [2020-08-22T10:40:01.479Z] 	at org.mozilla.javascript.ContextFactory.doTopCall(ContextFactory.java:405)
06:40:01 [2020-08-22T10:40:01.479Z] 	at org.mozilla.javascript.ScriptRuntime.doTopCall(ScriptRuntime.java:3508)
06:40:01 [2020-08-22T10:40:01.479Z] 	at org.mozilla.javascript.gen.c_3.call(Unknown Source)
06:40:01 [2020-08-22T10:40:01.479Z] 	at org.mozilla.javascript.gen.c_3.exec(Unknown Source)
06:40:01 [2020-08-22T10:40:01.479Z] 	at org.mozilla.javascript.Context.evaluateReader(Context.java:1293)
06:40:01 [2020-08-22T10:40:01.479Z] 	at org.eclipse.ease.lang.javascript.rhino.RhinoScriptEngine.internalExecute(RhinoScriptEngine.java:222)
06:40:01 [2020-08-22T10:40:01.479Z] 	at org.eclipse.ease.lang.javascript.rhino.RhinoScriptEngine.execute(RhinoScriptEngine.java:201)
06:40:01 [2020-08-22T10:40:01.479Z] 	at org.eclipse.ease.AbstractScriptEngine.inject(AbstractScriptEngine.java:222)
06:40:01 [2020-08-22T10:40:01.479Z] 	at org.eclipse.ease.AbstractScriptEngine.run(AbstractScriptEngine.java:272)
06:40:01 [2020-08-22T10:40:01.479Z] 	at org.eclipse.core.internal.jobs.Worker.run(Worker.java:63)
06:40:01 [2020-08-22T10:40:01.479Z] org.eclipse.ease.ScriptExecutionException: TypeError: Cannot call method "foobar" of undefined
06:40:01 [2020-08-22T10:40:01.479Z] 	at <unknown source>
06:40:01 [2020-08-22T10:40:01.479Z] org.eclipse.ease.ScriptExecutionException: ScriptException: test
06:40:01 [2020-08-22T10:40:01.479Z] 	at <unknown source>
06:40:01 [2020-08-22T10:40:01.734Z] org.eclipse.ease.ScriptExecutionException: JavaError: java.lang.Exception
06:40:01 [2020-08-22T10:40:01.734Z] 	at <unknown source>
06:40:01 [2020-08-22T10:40:01.734Z] 
06:40:01 [2020-08-22T10:40:01.734Z] Java Stacktrace:
06:40:01 [2020-08-22T10:40:01.734Z] java.lang.Exception
06:40:01 [2020-08-22T10:40:01.734Z] 	at sun.reflect.NativeConstructorAccessorImpl.newInstance0(Native Method)
06:40:01 [2020-08-22T10:40:01.734Z] 	at sun.reflect.NativeConstructorAccessorImpl.newInstance(NativeConstructorAccessorImpl.java:62)
06:40:01 [2020-08-22T10:40:01.734Z] 	at sun.reflect.DelegatingConstructorAccessorImpl.newInstance(DelegatingConstructorAccessorImpl.java:45)
06:40:01 [2020-08-22T10:40:01.734Z] 	at java.lang.reflect.Constructor.newInstance(Constructor.java:423)
06:40:01 [2020-08-22T10:40:01.734Z] 	at org.mozilla.javascript.MemberBox.newInstance(MemberBox.java:159)
06:40:01 [2020-08-22T10:40:01.734Z] 	at org.mozilla.javascript.NativeJavaClass.constructInternal(NativeJavaClass.java:266)
06:40:01 [2020-08-22T10:40:01.734Z] 	at org.mozilla.javascript.NativeJavaClass.constructSpecific(NativeJavaClass.java:205)
06:40:01 [2020-08-22T10:40:01.734Z] 	at org.mozilla.javascript.NativeJavaClass.construct(NativeJavaClass.java:166)
06:40:01 [2020-08-22T10:40:01.734Z] 	at org.mozilla.javascript.ScriptRuntime.newObject(ScriptRuntime.java:2655)
06:40:01 [2020-08-22T10:40:01.734Z] 	at org.mozilla.javascript.gen.c_21._c_script_0(Unknown Source)
06:40:01 [2020-08-22T10:40:01.734Z] 	at org.mozilla.javascript.gen.c_21.call(Unknown Source)
06:40:01 [2020-08-22T10:40:01.734Z] 	at org.mozilla.javascript.ContextFactory.doTopCall(ContextFactory.java:405)
06:40:01 [2020-08-22T10:40:01.734Z] 	at org.mozilla.javascript.ScriptRuntime.doTopCall(ScriptRuntime.java:3508)
06:40:01 [2020-08-22T10:40:01.734Z] 	at org.mozilla.javascript.gen.c_21.call(Unknown Source)
06:40:01 [2020-08-22T10:40:01.734Z] 	at org.mozilla.javascript.gen.c_21.exec(Unknown Source)
06:40:01 [2020-08-22T10:40:01.734Z] 	at org.mozilla.javascript.Context.evaluateReader(Context.java:1293)
06:40:01 [2020-08-22T10:40:01.734Z] 	at org.eclipse.ease.lang.javascript.rhino.RhinoScriptEngine.internalExecute(RhinoScriptEngine.java:222)
06:40:01 [2020-08-22T10:40:01.734Z] 	at org.eclipse.ease.lang.javascript.rhino.RhinoScriptEngine.execute(RhinoScriptEngine.java:201)
06:40:01 [2020-08-22T10:40:01.735Z] 	at org.eclipse.ease.AbstractScriptEngine.inject(AbstractScriptEngine.java:222)
06:40:01 [2020-08-22T10:40:01.735Z] 	at org.eclipse.ease.AbstractScriptEngine.run(AbstractScriptEngine.java:272)
06:40:01 [2020-08-22T10:40:01.735Z] 	at org.eclipse.core.internal.jobs.Worker.run(Worker.java:63)
06:40:01 [2020-08-22T10:40:01.735Z] org.eclipse.ease.ScriptExecutionException: ScriptException: JavaScript
06:40:01 [2020-08-22T10:40:01.735Z] 	at <unknown source>
06:40:01 [2020-08-22T10:40:01.735Z] org.eclipse.ease.ScriptExecutionException: SyntaxError: unterminated string literal (#1)
06:40:01 [2020-08-22T10:40:01.735Z] 'asdf
06:40:01 [2020-08-22T10:40:01.735Z]     ^
06:40:01 [2020-08-22T10:40:01.735Z] 	at <unknown source>
06:40:01 [2020-08-22T10:40:01.735Z] Tests run: 11, Failures: 0, Errors: 0, Skipped: 0, Time elapsed: 0.393 s - in org.eclipse.ease.lang.javascript.rhino.RhinoScriptEngineTest
06:40:01 [2020-08-22T10:40:01.735Z] causeWrappedException(org.eclipse.ease.lang.javascript.rhino.RhinoScriptEngineTest)  Time elapsed: 0.168 s
06:40:01 [2020-08-22T10:40:01.735Z] optionalModuleParameters(org.eclipse.ease.lang.javascript.rhino.RhinoScriptEngineTest)  Time elapsed: 0.019 s
06:40:01 [2020-08-22T10:40:01.735Z] simpleScriptCode(org.eclipse.ease.lang.javascript.rhino.RhinoScriptEngineTest)  Time elapsed: 0.049 s
06:40:01 [2020-08-22T10:40:01.735Z] causeRuntimeErrorException(org.eclipse.ease.lang.javascript.rhino.RhinoScriptEngineTest)  Time elapsed: 0.014 s
06:40:01 [2020-08-22T10:40:01.735Z] callModuleCode(org.eclipse.ease.lang.javascript.rhino.RhinoScriptEngineTest)  Time elapsed: 0.019 s
06:40:01 [2020-08-22T10:40:01.735Z] throwJavaClass(org.eclipse.ease.lang.javascript.rhino.RhinoScriptEngineTest)  Time elapsed: 0.012 s
06:40:01 [2020-08-22T10:40:01.735Z] throwJavaException(org.eclipse.ease.lang.javascript.rhino.RhinoScriptEngineTest)  Time elapsed: 0.05 s
06:40:01 [2020-08-22T10:40:01.735Z] accessJavaClasses(org.eclipse.ease.lang.javascript.rhino.RhinoScriptEngineTest)  Time elapsed: 0.01 s
06:40:01 [2020-08-22T10:40:01.735Z] accessEclipseClasses(org.eclipse.ease.lang.javascript.rhino.RhinoScriptEngineTest)  Time elapsed: 0.014 s
06:40:01 [2020-08-22T10:40:01.735Z] throwJavaScriptException(org.eclipse.ease.lang.javascript.rhino.RhinoScriptEngineTest)  Time elapsed: 0.009 s
06:40:01 [2020-08-22T10:40:01.735Z] causeSyntaxErrorException(org.eclipse.ease.lang.javascript.rhino.RhinoScriptEngineTest)  Time elapsed: 0.012 s
06:40:01 [2020-08-22T10:40:01.735Z] Running org.eclipse.ease.lang.javascript.rhino.RhinoEnvironmentTest
06:40:01 [2020-08-22T10:40:01.735Z] Tests run: 5, Failures: 0, Errors: 0, Skipped: 0, Time elapsed: 0.181 s - in org.eclipse.ease.lang.javascript.rhino.RhinoEnvironmentTest
06:40:01 [2020-08-22T10:40:01.735Z] reloadEnvironment(org.eclipse.ease.lang.javascript.rhino.RhinoEnvironmentTest)  Time elapsed: 0.057 s
06:40:01 [2020-08-22T10:40:01.735Z] bootstrappedEnvironment(org.eclipse.ease.lang.javascript.rhino.RhinoEnvironmentTest)  Time elapsed: 0.009 s
06:40:01 [2020-08-22T10:40:01.735Z] postMethodCallback(org.eclipse.ease.lang.javascript.rhino.RhinoEnvironmentTest)  Time elapsed: 0.08 s
06:40:01 [2020-08-22T10:40:01.735Z] preMethodCallback(org.eclipse.ease.lang.javascript.rhino.RhinoEnvironmentTest)  Time elapsed: 0.012 s
06:40:01 [2020-08-22T10:40:01.735Z] reloadFunctionDefinitions(org.eclipse.ease.lang.javascript.rhino.RhinoEnvironmentTest)  Time elapsed: 0.022 s
06:40:01 [2020-08-22T10:40:01.735Z] Running org.eclipse.ease.lang.javascript.rhino.RhinoDebuggerEngineTest
06:40:01 [2020-08-22T10:40:01.991Z] org.eclipse.ease.ScriptExecutionException: JavaError: NotThere cannot be found by org.mozilla.javascript_1.7.10.v20190430-1943
06:40:01 [2020-08-22T10:40:01.991Z] 
06:40:01 [2020-08-22T10:40:01.991Z] Java Stacktrace:
06:40:01 [2020-08-22T10:40:01.991Z] java.lang.ClassNotFoundException: NotThere cannot be found by org.mozilla.javascript_1.7.10.v20190430-1943
06:40:01 [2020-08-22T10:40:01.991Z] 	at org.eclipse.osgi.internal.loader.BundleLoader.findClass(BundleLoader.java:516)
06:40:01 [2020-08-22T10:40:01.991Z] 	at org.eclipse.osgi.internal.loader.ModuleClassLoader.loadClass(ModuleClassLoader.java:171)
06:40:01 [2020-08-22T10:40:01.991Z] 	at java.lang.ClassLoader.loadClass(ClassLoader.java:357)
06:40:01 [2020-08-22T10:40:01.991Z] 	at java.lang.Class.forName0(Native Method)
06:40:01 [2020-08-22T10:40:01.991Z] 	at java.lang.Class.forName(Class.java:264)
06:40:02 [2020-08-22T10:40:02.000Z] 	at sun.reflect.NativeMethodAccessorImpl.invoke0(Native Method)
06:40:02 [2020-08-22T10:40:02.000Z] 	at sun.reflect.NativeMethodAccessorImpl.invoke(NativeMethodAccessorImpl.java:62)
06:40:02 [2020-08-22T10:40:02.000Z] 	at sun.reflect.DelegatingMethodAccessorImpl.invoke(DelegatingMethodAccessorImpl.java:43)
06:40:02 [2020-08-22T10:40:02.000Z] 	at java.lang.reflect.Method.invoke(Method.java:498)
06:40:02 [2020-08-22T10:40:02.000Z] 	at org.mozilla.javascript.MemberBox.invoke(MemberBox.java:126)
06:40:02 [2020-08-22T10:40:02.000Z] 	at org.mozilla.javascript.NativeJavaMethod.call(NativeJavaMethod.java:225)
06:40:02 [2020-08-22T10:40:02.000Z] 	at org.mozilla.javascript.Interpreter.interpretLoop(Interpreter.java:1573)
06:40:02 [2020-08-22T10:40:02.000Z] 	at org.mozilla.javascript.Interpreter.interpret(Interpreter.java:911)
06:40:02 [2020-08-22T10:40:02.000Z] 	at org.mozilla.javascript.InterpretedFunction.call(InterpretedFunction.java:109)
06:40:02 [2020-08-22T10:40:02.000Z] 	at org.mozilla.javascript.ContextFactory.doTopCall(ContextFactory.java:405)
06:40:02 [2020-08-22T10:40:02.000Z] 	at org.mozilla.javascript.ScriptRuntime.doTopCall(ScriptRuntime.java:3508)
06:40:02 [2020-08-22T10:40:02.000Z] 	at org.mozilla.javascript.InterpretedFunction.exec(InterpretedFunction.java:120)
06:40:02 [2020-08-22T10:40:02.000Z] 	at org.mozilla.javascript.Context.evaluateReader(Context.java:1293)
06:40:02 [2020-08-22T10:40:02.000Z] 	at org.eclipse.ease.lang.javascript.rhino.RhinoScriptEngine.internalExecute(RhinoScriptEngine.java:222)
06:40:02 [2020-08-22T10:40:02.000Z] 	at org.eclipse.ease.lang.javascript.rhino.RhinoScriptEngine.execute(RhinoScriptEngine.java:201)
06:40:02 [2020-08-22T10:40:02.000Z] 	at org.eclipse.ease.AbstractScriptEngine.inject(AbstractScriptEngine.java:222)
06:40:02 [2020-08-22T10:40:02.000Z] 	at org.eclipse.ease.AbstractScriptEngine.run(AbstractScriptEngine.java:272)
06:40:02 [2020-08-22T10:40:02.000Z] 	at org.eclipse.core.internal.jobs.Worker.run(Worker.java:63)
06:40:02 [2020-08-22T10:40:02.000Z] org.eclipse.ease.ScriptExecutionException: TypeError: Cannot call method "foobar" of undefined
06:40:02 [2020-08-22T10:40:02.000Z] org.eclipse.ease.ScriptExecutionException: ScriptException: test
06:40:02 [2020-08-22T10:40:02.000Z] org.eclipse.ease.ScriptExecutionException: JavaError: java.lang.Exception
06:40:02 [2020-08-22T10:40:02.000Z] 
06:40:02 [2020-08-22T10:40:02.000Z] Java Stacktrace:
06:40:02 [2020-08-22T10:40:02.000Z] java.lang.Exception
06:40:02 [2020-08-22T10:40:02.000Z] 	at sun.reflect.NativeConstructorAccessorImpl.newInstance0(Native Method)
06:40:02 [2020-08-22T10:40:02.000Z] 	at sun.reflect.NativeConstructorAccessorImpl.newInstance(NativeConstructorAccessorImpl.java:62)
06:40:02 [2020-08-22T10:40:02.000Z] 	at sun.reflect.DelegatingConstructorAccessorImpl.newInstance(DelegatingConstructorAccessorImpl.java:45)
06:40:02 [2020-08-22T10:40:02.000Z] 	at java.lang.reflect.Constructor.newInstance(Constructor.java:423)
06:40:02 [2020-08-22T10:40:02.000Z] 	at org.mozilla.javascript.MemberBox.newInstance(MemberBox.java:159)
06:40:02 [2020-08-22T10:40:02.000Z] 	at org.mozilla.javascript.NativeJavaClass.constructInternal(NativeJavaClass.java:266)
06:40:02 [2020-08-22T10:40:02.000Z] 	at org.mozilla.javascript.NativeJavaClass.constructSpecific(NativeJavaClass.java:205)
06:40:02 [2020-08-22T10:40:02.000Z] 	at org.mozilla.javascript.NativeJavaClass.construct(NativeJavaClass.java:166)
06:40:02 [2020-08-22T10:40:02.000Z] 	at org.mozilla.javascript.Interpreter.interpretLoop(Interpreter.java:1617)
06:40:02 [2020-08-22T10:40:02.000Z] 	at org.mozilla.javascript.Interpreter.interpret(Interpreter.java:911)
06:40:02 [2020-08-22T10:40:02.000Z] 	at org.mozilla.javascript.InterpretedFunction.call(InterpretedFunction.java:109)
06:40:02 [2020-08-22T10:40:02.000Z] 	at org.mozilla.javascript.ContextFactory.doTopCall(ContextFactory.java:405)
06:40:02 [2020-08-22T10:40:02.000Z] 	at org.mozilla.javascript.ScriptRuntime.doTopCall(ScriptRuntime.java:3508)
06:40:02 [2020-08-22T10:40:02.000Z] 	at org.mozilla.javascript.InterpretedFunction.exec(InterpretedFunction.java:120)
06:40:02 [2020-08-22T10:40:02.000Z] 	at org.mozilla.javascript.Context.evaluateReader(Context.java:1293)
06:40:02 [2020-08-22T10:40:02.000Z] 	at org.eclipse.ease.lang.javascript.rhino.RhinoScriptEngine.internalExecute(RhinoScriptEngine.java:222)
06:40:02 [2020-08-22T10:40:02.000Z] 	at org.eclipse.ease.lang.javascript.rhino.RhinoScriptEngine.execute(RhinoScriptEngine.java:201)
06:40:02 [2020-08-22T10:40:02.000Z] 	at org.eclipse.ease.AbstractScriptEngine.inject(AbstractScriptEngine.java:222)
06:40:02 [2020-08-22T10:40:02.000Z] 	at org.eclipse.ease.AbstractScriptEngine.run(AbstractScriptEngine.java:272)
06:40:02 [2020-08-22T10:40:02.000Z] 	at org.eclipse.core.internal.jobs.Worker.run(Worker.java:63)
06:40:02 [2020-08-22T10:40:02.256Z] org.eclipse.ease.ScriptExecutionException: ScriptException: JavaScript
06:40:02 [2020-08-22T10:40:02.256Z] org.eclipse.ease.ScriptExecutionException: SyntaxError: unterminated string literal (#1)
06:40:02 [2020-08-22T10:40:02.256Z] 'asdf
06:40:02 [2020-08-22T10:40:02.256Z]     ^
06:40:02 [2020-08-22T10:40:02.256Z] 	at <unknown source>:1
06:40:02 [2020-08-22T10:40:02.256Z] Tests run: 12, Failures: 0, Errors: 0, Skipped: 0, Time elapsed: 0.272 s - in org.eclipse.ease.lang.javascript.rhino.RhinoDebuggerEngineTest
06:40:02 [2020-08-22T10:40:02.256Z] getExceptionStackTrace(org.eclipse.ease.lang.javascript.rhino.RhinoDebuggerEngineTest)  Time elapsed: 0.093 s
06:40:02 [2020-08-22T10:40:02.256Z] causeWrappedException(org.eclipse.ease.lang.javascript.rhino.RhinoDebuggerEngineTest)  Time elapsed: 0.012 s
06:40:02 [2020-08-22T10:40:02.256Z] optionalModuleParameters(org.eclipse.ease.lang.javascript.rhino.RhinoDebuggerEngineTest)  Time elapsed: 0.011 s
06:40:02 [2020-08-22T10:40:02.256Z] simpleScriptCode(org.eclipse.ease.lang.javascript.rhino.RhinoDebuggerEngineTest)  Time elapsed: 0.039 s
06:40:02 [2020-08-22T10:40:02.256Z] causeRuntimeErrorException(org.eclipse.ease.lang.javascript.rhino.RhinoDebuggerEngineTest)  Time elapsed: 0.01 s
06:40:02 [2020-08-22T10:40:02.256Z] callModuleCode(org.eclipse.ease.lang.javascript.rhino.RhinoDebuggerEngineTest)  Time elapsed: 0.012 s
06:40:02 [2020-08-22T10:40:02.256Z] throwJavaClass(org.eclipse.ease.lang.javascript.rhino.RhinoDebuggerEngineTest)  Time elapsed: 0.015 s
06:40:02 [2020-08-22T10:40:02.256Z] throwJavaException(org.eclipse.ease.lang.javascript.rhino.RhinoDebuggerEngineTest)  Time elapsed: 0.01 s
06:40:02 [2020-08-22T10:40:02.256Z] accessJavaClasses(org.eclipse.ease.lang.javascript.rhino.RhinoDebuggerEngineTest)  Time elapsed: 0.009 s
06:40:02 [2020-08-22T10:40:02.256Z] accessEclipseClasses(org.eclipse.ease.lang.javascript.rhino.RhinoDebuggerEngineTest)  Time elapsed: 0.041 s
06:40:02 [2020-08-22T10:40:02.256Z] throwJavaScriptException(org.eclipse.ease.lang.javascript.rhino.RhinoDebuggerEngineTest)  Time elapsed: 0.009 s
06:40:02 [2020-08-22T10:40:02.256Z] causeSyntaxErrorException(org.eclipse.ease.lang.javascript.rhino.RhinoDebuggerEngineTest)  Time elapsed: 0.009 s
06:40:02 [2020-08-22T10:40:02.256Z] Running org.eclipse.ease.lang.javascript.rhino.RhinoDebugTest
06:40:02 [2020-08-22T10:40:02.256Z] Start of script
06:40:02 [2020-08-22T10:40:02.256Z] include file start
06:40:02 [2020-08-22T10:40:02.256Z] Include file processed
06:40:02 [2020-08-22T10:40:02.256Z] line after include file
06:40:02 [2020-08-22T10:40:02.256Z] Result of testMethod = 5
06:40:02 [2020-08-22T10:40:02.256Z] End of script
06:40:02 [2020-08-22T10:40:02.256Z] Start of script
06:40:02 [2020-08-22T10:40:02.511Z] include file start
06:40:02 [2020-08-22T10:40:02.511Z] Include file processed
06:40:02 [2020-08-22T10:40:02.511Z] line after include file
06:40:02 [2020-08-22T10:40:02.511Z] Result of testMethod = 5
06:40:02 [2020-08-22T10:40:02.511Z] End of script
06:40:02 [2020-08-22T10:40:02.511Z] Start of script
06:40:02 [2020-08-22T10:40:02.511Z] include file start
06:40:02 [2020-08-22T10:40:02.511Z] Include file processed
06:40:02 [2020-08-22T10:40:02.511Z] line after include file
06:40:02 [2020-08-22T10:40:02.511Z] Result of testMethod = 5
06:40:02 [2020-08-22T10:40:02.767Z] Start of script
06:40:02 [2020-08-22T10:40:02.767Z] include file start
06:40:02 [2020-08-22T10:40:02.767Z] Include file processed
06:40:02 [2020-08-22T10:40:02.767Z] line after include file
06:40:03 [2020-08-22T10:40:03.022Z] Result of testMethod = 5
06:40:03 [2020-08-22T10:40:03.022Z] End of script
06:40:03 [2020-08-22T10:40:03.278Z] Start of script
06:40:03 [2020-08-22T10:40:03.278Z] include file start
06:40:03 [2020-08-22T10:40:03.278Z] Include file processed
06:40:03 [2020-08-22T10:40:03.278Z] line after include file
06:40:03 [2020-08-22T10:40:03.278Z] Result of testMethod = 5
06:40:03 [2020-08-22T10:40:03.278Z] End of script
06:40:03 [2020-08-22T10:40:03.534Z] Start of script
06:40:03 [2020-08-22T10:40:03.534Z] include file start
06:40:03 [2020-08-22T10:40:03.534Z] Include file processed
06:40:03 [2020-08-22T10:40:03.534Z] line after include file
06:40:03 [2020-08-22T10:40:03.790Z] Result of testMethod = 5
06:40:03 [2020-08-22T10:40:03.790Z] End of script
06:40:03 [2020-08-22T10:40:03.790Z] Start of script
06:40:03 [2020-08-22T10:40:03.790Z] include file start
06:40:03 [2020-08-22T10:40:03.790Z] Include file processed
06:40:03 [2020-08-22T10:40:03.790Z] line after include file
06:40:03 [2020-08-22T10:40:03.790Z] Result of testMethod = 5
06:40:04 [2020-08-22T10:40:04.045Z] Start of script
06:40:04 [2020-08-22T10:40:04.045Z] include file start
06:40:04 [2020-08-22T10:40:04.045Z] Include file processed
06:40:04 [2020-08-22T10:40:04.045Z] line after include file
06:40:04 [2020-08-22T10:40:04.301Z] Result of testMethod = 5
06:40:04 [2020-08-22T10:40:04.301Z] End of script
06:40:04 [2020-08-22T10:40:04.301Z] Start of script
06:40:04 [2020-08-22T10:40:04.301Z] include file start
06:40:04 [2020-08-22T10:40:04.301Z] Include file processed
06:40:04 [2020-08-22T10:40:04.301Z] line after include file
06:40:04 [2020-08-22T10:40:04.301Z] Result of testMethod = 5
06:40:04 [2020-08-22T10:40:04.556Z] End of script
06:40:04 [2020-08-22T10:40:04.556Z] Start of script
06:40:04 [2020-08-22T10:40:04.556Z] include file start
06:40:04 [2020-08-22T10:40:04.556Z] Include file processed
06:40:04 [2020-08-22T10:40:04.556Z] line after include file
06:40:05 [2020-08-22T10:40:05.117Z] Start of script
06:40:05 [2020-08-22T10:40:05.117Z] include file start
06:40:05 [2020-08-22T10:40:05.117Z] Include file processed
06:40:05 [2020-08-22T10:40:05.117Z] line after include file
06:40:05 [2020-08-22T10:40:05.117Z] Result of testMethod = 5
06:40:05 [2020-08-22T10:40:05.117Z] End of script
06:40:05 [2020-08-22T10:40:05.117Z] Start of script
06:40:05 [2020-08-22T10:40:05.117Z] include file start
06:40:05 [2020-08-22T10:40:05.117Z] Include file processed
06:40:05 [2020-08-22T10:40:05.117Z] line after include file
06:40:05 [2020-08-22T10:40:05.373Z] Result of testMethod = 5
06:40:05 [2020-08-22T10:40:05.373Z] End of script
06:40:05 [2020-08-22T10:40:05.629Z] Start of script
06:40:05 [2020-08-22T10:40:05.885Z] include file start
06:40:05 [2020-08-22T10:40:05.885Z] Include file processed
06:40:05 [2020-08-22T10:40:05.885Z] line after include file
06:40:05 [2020-08-22T10:40:05.885Z] Result of testMethod = 5
06:40:05 [2020-08-22T10:40:05.885Z] End of script
06:40:05 [2020-08-22T10:40:05.885Z] Start of script
06:40:05 [2020-08-22T10:40:05.885Z] include file start
06:40:05 [2020-08-22T10:40:05.885Z] Include file processed
06:40:05 [2020-08-22T10:40:05.885Z] line after include file
06:40:06 [2020-08-22T10:40:06.140Z] Result of testMethod = 5
06:40:06 [2020-08-22T10:40:06.140Z] End of script
06:40:06 [2020-08-22T10:40:06.140Z] Start of script
06:40:06 [2020-08-22T10:40:06.140Z] include file start
06:40:06 [2020-08-22T10:40:06.140Z] Include file processed
06:40:06 [2020-08-22T10:40:06.140Z] line after include file
06:40:06 [2020-08-22T10:40:06.140Z] Result of testMethod = 5
06:40:06 [2020-08-22T10:40:06.701Z] Start of script
06:40:06 [2020-08-22T10:40:06.701Z] include file start
06:40:06 [2020-08-22T10:40:06.701Z] Include file processed
06:40:06 [2020-08-22T10:40:06.701Z] line after include file
06:40:06 [2020-08-22T10:40:06.701Z] Result of testMethod = 5
06:40:06 [2020-08-22T10:40:06.701Z] End of script
06:40:07 [2020-08-22T10:40:07.009Z] Start of script
06:40:07 [2020-08-22T10:40:07.009Z] include file start
06:40:07 [2020-08-22T10:40:07.009Z] Include file processed
06:40:07 [2020-08-22T10:40:07.009Z] line after include file
06:40:07 [2020-08-22T10:40:07.009Z] Result of testMethod = 5
06:40:07 [2020-08-22T10:40:07.264Z] End of script
06:40:07 [2020-08-22T10:40:07.264Z] Start of script
06:40:07 [2020-08-22T10:40:07.264Z] include file start
06:40:07 [2020-08-22T10:40:07.264Z] Include file processed
06:40:07 [2020-08-22T10:40:07.264Z] line after include file
06:40:07 [2020-08-22T10:40:07.520Z] Result of testMethod = 5
06:40:07 [2020-08-22T10:40:07.520Z] End of script
06:40:07 [2020-08-22T10:40:07.776Z] Start of script
06:40:07 [2020-08-22T10:40:07.776Z] include file start
06:40:07 [2020-08-22T10:40:07.776Z] Include file processed
06:40:07 [2020-08-22T10:40:07.776Z] line after include file
06:40:08 [2020-08-22T10:40:08.031Z] Result of testMethod = 5
06:40:08 [2020-08-22T10:40:08.031Z] End of script
06:40:08 [2020-08-22T10:40:08.031Z] Start of script
06:40:08 [2020-08-22T10:40:08.031Z] include file start
06:40:08 [2020-08-22T10:40:08.031Z] Include file processed
06:40:08 [2020-08-22T10:40:08.031Z] line after include file
06:40:08 [2020-08-22T10:40:08.031Z] Result of testMethod = 5
06:40:08 [2020-08-22T10:40:08.598Z] Start of script
06:40:08 [2020-08-22T10:40:08.598Z] include file start
06:40:08 [2020-08-22T10:40:08.598Z] Include file processed
06:40:08 [2020-08-22T10:40:08.598Z] line after include file
06:40:08 [2020-08-22T10:40:08.598Z] Result of testMethod = 5
06:40:08 [2020-08-22T10:40:08.598Z] End of script
06:40:08 [2020-08-22T10:40:08.598Z] Start of script
06:40:08 [2020-08-22T10:40:08.598Z] include file start
06:40:08 [2020-08-22T10:40:08.598Z] Include file processed
06:40:08 [2020-08-22T10:40:08.598Z] line after include file
06:40:08 [2020-08-22T10:40:08.853Z] Result of testMethod = 5
06:40:08 [2020-08-22T10:40:08.853Z] End of script
06:40:08 [2020-08-22T10:40:08.853Z] Start of script
06:40:08 [2020-08-22T10:40:08.853Z] include file start
06:40:08 [2020-08-22T10:40:08.853Z] Include file processed
06:40:08 [2020-08-22T10:40:08.853Z] line after include file
06:40:08 [2020-08-22T10:40:08.853Z] Result of testMethod = 5
06:40:08 [2020-08-22T10:40:08.853Z] End of script
06:40:09 [2020-08-22T10:40:09.109Z] Start of script
06:40:09 [2020-08-22T10:40:09.109Z] include file start
06:40:09 [2020-08-22T10:40:09.109Z] Include file processed
06:40:09 [2020-08-22T10:40:09.109Z] line after include file
06:40:09 [2020-08-22T10:40:09.109Z] Result of testMethod = 5
06:40:09 [2020-08-22T10:40:09.109Z] End of script
06:40:09 [2020-08-22T10:40:09.365Z] Start of script
06:40:09 [2020-08-22T10:40:09.365Z] include file start
06:40:09 [2020-08-22T10:40:09.365Z] Include file processed
06:40:09 [2020-08-22T10:40:09.365Z] line after include file
06:40:09 [2020-08-22T10:40:09.620Z] Start of script
06:40:09 [2020-08-22T10:40:09.876Z] include file start
06:40:09 [2020-08-22T10:40:09.876Z] Include file processed
06:40:09 [2020-08-22T10:40:09.876Z] line after include file
06:40:09 [2020-08-22T10:40:09.876Z] Result of testMethod = 5
06:40:09 [2020-08-22T10:40:09.876Z] End of script
06:40:09 [2020-08-22T10:40:09.876Z] Start of script
06:40:09 [2020-08-22T10:40:09.876Z] include file start
06:40:09 [2020-08-22T10:40:09.876Z] Include file processed
06:40:09 [2020-08-22T10:40:09.876Z] line after include file
06:40:09 [2020-08-22T10:40:09.876Z] Result of testMethod = 5
06:40:10 [2020-08-22T10:40:10.132Z] Start of script
06:40:10 [2020-08-22T10:40:10.132Z] include file start
06:40:10 [2020-08-22T10:40:10.132Z] Include file processed
06:40:10 [2020-08-22T10:40:10.132Z] line after include file
06:40:10 [2020-08-22T10:40:10.132Z] Result of testMethod = 5
06:40:10 [2020-08-22T10:40:10.387Z] End of script
06:40:10 [2020-08-22T10:40:10.387Z] Start of script
06:40:10 [2020-08-22T10:40:10.387Z] include file start
06:40:10 [2020-08-22T10:40:10.387Z] Include file processed
06:40:10 [2020-08-22T10:40:10.387Z] line after include file
06:40:10 [2020-08-22T10:40:10.642Z] Result of testMethod = 5
06:40:10 [2020-08-22T10:40:10.642Z] End of script
06:40:10 [2020-08-22T10:40:10.642Z] Start of script
06:40:10 [2020-08-22T10:40:10.642Z] include file start
06:40:10 [2020-08-22T10:40:10.642Z] Include file processed
06:40:10 [2020-08-22T10:40:10.642Z] line after include file
06:40:10 [2020-08-22T10:40:10.898Z] Result of testMethod = 5
06:40:10 [2020-08-22T10:40:10.898Z] End of script
06:40:11 [2020-08-22T10:40:11.154Z] Start of script
06:40:11 [2020-08-22T10:40:11.154Z] include file start
06:40:11 [2020-08-22T10:40:11.154Z] Include file processed
06:40:11 [2020-08-22T10:40:11.154Z] line after include file
06:40:11 [2020-08-22T10:40:11.154Z] Result of testMethod = 5
06:40:11 [2020-08-22T10:40:11.154Z] End of script
06:40:11 [2020-08-22T10:40:11.154Z] Start of script
06:40:11 [2020-08-22T10:40:11.154Z] include file start
06:40:11 [2020-08-22T10:40:11.154Z] Include file processed
06:40:11 [2020-08-22T10:40:11.154Z] line after include file
06:40:11 [2020-08-22T10:40:11.154Z] Result of testMethod = 5
06:40:11 [2020-08-22T10:40:11.716Z] Start of script
06:40:11 [2020-08-22T10:40:11.716Z] include file start
06:40:11 [2020-08-22T10:40:11.716Z] Include file processed
06:40:11 [2020-08-22T10:40:11.716Z] line after include file
06:40:11 [2020-08-22T10:40:11.716Z] Result of testMethod = 5
06:40:11 [2020-08-22T10:40:11.716Z] End of script
06:40:11 [2020-08-22T10:40:11.716Z] Start of script
06:40:11 [2020-08-22T10:40:11.716Z] include file start
06:40:11 [2020-08-22T10:40:11.716Z] Include file processed
06:40:11 [2020-08-22T10:40:11.716Z] line after include file
06:40:11 [2020-08-22T10:40:11.716Z] Result of testMethod = 5
06:40:12 [2020-08-22T10:40:12.277Z] Start of script
06:40:12 [2020-08-22T10:40:12.277Z] include file start
06:40:12 [2020-08-22T10:40:12.277Z] Include file processed
06:40:12 [2020-08-22T10:40:12.277Z] line after include file
06:40:12 [2020-08-22T10:40:12.277Z] Result of testMethod = 5
06:40:12 [2020-08-22T10:40:12.277Z] End of script
06:40:12 [2020-08-22T10:40:12.533Z] Start of script
06:40:12 [2020-08-22T10:40:12.533Z] include file start
06:40:12 [2020-08-22T10:40:12.533Z] Include file processed
06:40:12 [2020-08-22T10:40:12.533Z] line after include file
06:40:12 [2020-08-22T10:40:12.789Z] Result of testMethod = 5
06:40:12 [2020-08-22T10:40:12.789Z] End of script
06:40:12 [2020-08-22T10:40:12.789Z] Start of script
06:40:12 [2020-08-22T10:40:12.789Z] include file start
06:40:12 [2020-08-22T10:40:12.789Z] Include file processed
06:40:12 [2020-08-22T10:40:12.789Z] line after include file
06:40:12 [2020-08-22T10:40:12.789Z] Result of testMethod = 5
06:40:12 [2020-08-22T10:40:12.789Z] End of script
06:40:13 [2020-08-22T10:40:13.045Z] Tests run: 42, Failures: 0, Errors: 0, Skipped: 0, Time elapsed: 10.865 s - in org.eclipse.ease.lang.javascript.rhino.RhinoDebugTest
06:40:13 [2020-08-22T10:40:13.045Z] disconnectProcessInSuspendedState(org.eclipse.ease.lang.javascript.rhino.RhinoDebugTest)  Time elapsed: 0.219 s
06:40:13 [2020-08-22T10:40:13.045Z] stepReturnIncludeCommand(org.eclipse.ease.lang.javascript.rhino.RhinoDebugTest)  Time elapsed: 0.209 s
06:40:13 [2020-08-22T10:40:13.045Z] arrayVariableSorting(org.eclipse.ease.lang.javascript.rhino.RhinoDebugTest)  Time elapsed: 0.307 s
06:40:13 [2020-08-22T10:40:13.045Z] stepOverOnDebugTarget(org.eclipse.ease.lang.javascript.rhino.RhinoDebugTest)  Time elapsed: 0.307 s
06:40:13 [2020-08-22T10:40:13.045Z] hasDebugTarget(org.eclipse.ease.lang.javascript.rhino.RhinoDebugTest)  Time elapsed: 0.104 s
06:40:13 [2020-08-22T10:40:13.045Z] disconnectThreadInSuspendedState(org.eclipse.ease.lang.javascript.rhino.RhinoDebugTest)  Time elapsed: 0.206 s
06:40:13 [2020-08-22T10:40:13.045Z] stepReturnOnDebugTarget(org.eclipse.ease.lang.javascript.rhino.RhinoDebugTest)  Time elapsed: 0.306 s
06:40:13 [2020-08-22T10:40:13.045Z] nullVariable(org.eclipse.ease.lang.javascript.rhino.RhinoDebugTest)  Time elapsed: 0.305 s
06:40:13 [2020-08-22T10:40:13.045Z] stepOverOnStackFrame(org.eclipse.ease.lang.javascript.rhino.RhinoDebugTest)  Time elapsed: 0.308 s
06:40:13 [2020-08-22T10:40:13.045Z] resumeOnDebugTarget(org.eclipse.ease.lang.javascript.rhino.RhinoDebugTest)  Time elapsed: 0.205 s
06:40:13 [2020-08-22T10:40:13.045Z] modifyVariableKeepingType(org.eclipse.ease.lang.javascript.rhino.RhinoDebugTest)  Time elapsed: 0.405 s
06:40:13 [2020-08-22T10:40:13.045Z] resumeOnLastIncludeLine(org.eclipse.ease.lang.javascript.rhino.RhinoDebugTest)  Time elapsed: 0.206 s
06:40:13 [2020-08-22T10:40:13.045Z] stepReturnOnStackFrame(org.eclipse.ease.lang.javascript.rhino.RhinoDebugTest)  Time elapsed: 0.306 s
06:40:13 [2020-08-22T10:40:13.045Z] terminateStackFrameInSuspendedState(org.eclipse.ease.lang.javascript.rhino.RhinoDebugTest)  Time elapsed: 0.207 s
06:40:13 [2020-08-22T10:40:13.045Z] breakpointLocation(org.eclipse.ease.lang.javascript.rhino.RhinoDebugTest)  Time elapsed: 0.205 s
06:40:13 [2020-08-22T10:40:13.045Z] stepReturnOnThread(org.eclipse.ease.lang.javascript.rhino.RhinoDebugTest)  Time elapsed: 0.307 s
06:40:13 [2020-08-22T10:40:13.045Z] javaClassVariable(org.eclipse.ease.lang.javascript.rhino.RhinoDebugTest)  Time elapsed: 0.307 s
06:40:13 [2020-08-22T10:40:13.045Z] stepIntoOnThread(org.eclipse.ease.lang.javascript.rhino.RhinoDebugTest)  Time elapsed: 0.306 s
06:40:13 [2020-08-22T10:40:13.045Z] terminateThreadInSuspendedState(org.eclipse.ease.lang.javascript.rhino.RhinoDebugTest)  Time elapsed: 0.205 s
06:40:13 [2020-08-22T10:40:13.045Z] resumeOnThread(org.eclipse.ease.lang.javascript.rhino.RhinoDebugTest)  Time elapsed: 0.206 s
06:40:13 [2020-08-22T10:40:13.045Z] stepIntoOnStackFrame(org.eclipse.ease.lang.javascript.rhino.RhinoDebugTest)  Time elapsed: 0.306 s
06:40:13 [2020-08-22T10:40:13.045Z] terminateProcessInSuspendedState(org.eclipse.ease.lang.javascript.rhino.RhinoDebugTest)  Time elapsed: 0.205 s
06:40:13 [2020-08-22T10:40:13.045Z] stepOverOnProcess(org.eclipse.ease.lang.javascript.rhino.RhinoDebugTest)  Time elapsed: 0.307 s
06:40:13 [2020-08-22T10:40:13.045Z] nativeArrayVariable(org.eclipse.ease.lang.javascript.rhino.RhinoDebugTest)  Time elapsed: 0.305 s
06:40:13 [2020-08-22T10:40:13.045Z] disconnectDebugTargetInSuspendedState(org.eclipse.ease.lang.javascript.rhino.RhinoDebugTest)  Time elapsed: 0.206 s
06:40:13 [2020-08-22T10:40:13.045Z] stepIntoOnProcess(org.eclipse.ease.lang.javascript.rhino.RhinoDebugTest)  Time elapsed: 0.306 s
06:40:13 [2020-08-22T10:40:13.045Z] terminatedState(org.eclipse.ease.lang.javascript.rhino.RhinoDebugTest)  Time elapsed: 0.105 s
06:40:13 [2020-08-22T10:40:13.045Z] stepOverIncludeCommand(org.eclipse.ease.lang.javascript.rhino.RhinoDebugTest)  Time elapsed: 0.305 s
06:40:13 [2020-08-22T10:40:13.045Z] innerScopeVariableBeforeOuterScopeVariable(org.eclipse.ease.lang.javascript.rhino.RhinoDebugTest)  Time elapsed: 0.305 s
06:40:13 [2020-08-22T10:40:13.045Z] stepIntoIncludeCommand(org.eclipse.ease.lang.javascript.rhino.RhinoDebugTest)  Time elapsed: 0.304 s
06:40:13 [2020-08-22T10:40:13.045Z] primitiveStringVariable(org.eclipse.ease.lang.javascript.rhino.RhinoDebugTest)  Time elapsed: 0.306 s
06:40:13 [2020-08-22T10:40:13.045Z] resumeOnProcess(org.eclipse.ease.lang.javascript.rhino.RhinoDebugTest)  Time elapsed: 0.205 s
06:40:13 [2020-08-22T10:40:13.045Z] stepIntoOnDebugTarget(org.eclipse.ease.lang.javascript.rhino.RhinoDebugTest)  Time elapsed: 0.305 s
06:40:13 [2020-08-22T10:40:13.045Z] stepOverOnThread(org.eclipse.ease.lang.javascript.rhino.RhinoDebugTest)  Time elapsed: 0.312 s
06:40:13 [2020-08-22T10:40:13.045Z] suspendedState(org.eclipse.ease.lang.javascript.rhino.RhinoDebugTest)  Time elapsed: 0.205 s
06:40:13 [2020-08-22T10:40:13.045Z] primitiveDoubleVariable(org.eclipse.ease.lang.javascript.rhino.RhinoDebugTest)  Time elapsed: 0.305 s
06:40:13 [2020-08-22T10:40:13.045Z] resumeOnStackFrame(org.eclipse.ease.lang.javascript.rhino.RhinoDebugTest)  Time elapsed: 0.206 s
06:40:13 [2020-08-22T10:40:13.045Z] nativeObjectVariable(org.eclipse.ease.lang.javascript.rhino.RhinoDebugTest)  Time elapsed: 0.305 s
06:40:13 [2020-08-22T10:40:13.045Z] terminateDebugTargetInSuspendedState(org.eclipse.ease.lang.javascript.rhino.RhinoDebugTest)  Time elapsed: 0.205 s
06:40:13 [2020-08-22T10:40:13.045Z] disconnectStackFrameInSuspendedState(org.eclipse.ease.lang.javascript.rhino.RhinoDebugTest)  Time elapsed: 0.205 s
06:40:13 [2020-08-22T10:40:13.046Z] stepReturnOnProcess(org.eclipse.ease.lang.javascript.rhino.RhinoDebugTest)  Time elapsed: 0.306 s
06:40:13 [2020-08-22T10:40:13.046Z] evaluateWatchExpression(org.eclipse.ease.lang.javascript.rhino.RhinoDebugTest)  Time elapsed: 0.206 s
06:40:13 [2020-08-22T10:40:13.046Z] 
06:40:13 [2020-08-22T10:40:13.046Z] Results:
06:40:13 [2020-08-22T10:40:13.046Z] 
06:40:13 [2020-08-22T10:40:13.046Z] Tests run: 70, Failures: 0, Errors: 0, Skipped: 0
06:40:13 [2020-08-22T10:40:13.046Z] 
06:40:13 [2020-08-22T10:40:13.607Z] [INFO] All tests passed!
06:40:13 [2020-08-22T10:40:13.607Z] [INFO] 
06:40:13 [2020-08-22T10:40:13.607Z] [INFO] --- maven-install-plugin:2.3.1:install (default-install) @ org.eclipse.ease.lang.javascript.rhino.test ---
06:40:13 [2020-08-22T10:40:13.607Z] [INFO] Installing /home/jenkins/agent/workspace/ease.verify.core.target.2019-12/tests/org.eclipse.ease.lang.javascript.rhino.test/target/org.eclipse.ease.lang.javascript.rhino.test-0.8.0-SNAPSHOT.jar to /home/jenkins/.m2/repository/org/eclipse/ease/org.eclipse.ease.lang.javascript.rhino.test/0.8.0-SNAPSHOT/org.eclipse.ease.lang.javascript.rhino.test-0.8.0-SNAPSHOT.jar
06:40:13 [2020-08-22T10:40:13.607Z] [INFO] Installing /home/jenkins/agent/workspace/ease.verify.core.target.2019-12/tests/org.eclipse.ease.lang.javascript.rhino.test/pom.xml to /home/jenkins/.m2/repository/org/eclipse/ease/org.eclipse.ease.lang.javascript.rhino.test/0.8.0-SNAPSHOT/org.eclipse.ease.lang.javascript.rhino.test-0.8.0-SNAPSHOT.pom
06:40:13 [2020-08-22T10:40:13.607Z] [INFO] Installing /home/jenkins/agent/workspace/ease.verify.core.target.2019-12/tests/org.eclipse.ease.lang.javascript.rhino.test/target/org.eclipse.ease.lang.javascript.rhino.test-0.8.0-SNAPSHOT-sources.jar to /home/jenkins/.m2/repository/org/eclipse/ease/org.eclipse.ease.lang.javascript.rhino.test/0.8.0-SNAPSHOT/org.eclipse.ease.lang.javascript.rhino.test-0.8.0-SNAPSHOT-sources.jar
06:40:13 [2020-08-22T10:40:13.607Z] [INFO] Installing /home/jenkins/agent/workspace/ease.verify.core.target.2019-12/tests/org.eclipse.ease.lang.javascript.rhino.test/target/p2content.xml to /home/jenkins/.m2/repository/org/eclipse/ease/org.eclipse.ease.lang.javascript.rhino.test/0.8.0-SNAPSHOT/org.eclipse.ease.lang.javascript.rhino.test-0.8.0-SNAPSHOT-p2metadata.xml
06:40:13 [2020-08-22T10:40:13.607Z] [INFO] Installing /home/jenkins/agent/workspace/ease.verify.core.target.2019-12/tests/org.eclipse.ease.lang.javascript.rhino.test/target/p2artifacts.xml to /home/jenkins/.m2/repository/org/eclipse/ease/org.eclipse.ease.lang.javascript.rhino.test/0.8.0-SNAPSHOT/org.eclipse.ease.lang.javascript.rhino.test-0.8.0-SNAPSHOT-p2artifacts.xml
06:40:13 [2020-08-22T10:40:13.607Z] [INFO] Installing /home/jenkins/agent/workspace/ease.verify.core.target.2019-12/tests/org.eclipse.ease.lang.javascript.rhino.test/target/p2content.xml to /home/jenkins/.m2/repository/org/eclipse/ease/org.eclipse.ease.lang.javascript.rhino.test/0.8.0-SNAPSHOT/org.eclipse.ease.lang.javascript.rhino.test-0.8.0-SNAPSHOT-p2metadata.xml
06:40:13 [2020-08-22T10:40:13.607Z] [INFO] Installing /home/jenkins/agent/workspace/ease.verify.core.target.2019-12/tests/org.eclipse.ease.lang.javascript.rhino.test/target/p2artifacts.xml to /home/jenkins/.m2/repository/org/eclipse/ease/org.eclipse.ease.lang.javascript.rhino.test/0.8.0-SNAPSHOT/org.eclipse.ease.lang.javascript.rhino.test-0.8.0-SNAPSHOT-p2artifacts.xml
06:40:13 [2020-08-22T10:40:13.607Z] [INFO] 
06:40:13 [2020-08-22T10:40:13.607Z] [INFO] --- tycho-p2-plugin:1.3.0:update-local-index (default-update-local-index) @ org.eclipse.ease.lang.javascript.rhino.test ---
06:40:13 [2020-08-22T10:40:13.607Z] [INFO] 
06:40:13 [2020-08-22T10:40:13.607Z] [INFO] -------< org.eclipse.ease:org.eclipse.ease.lang.javascript.test >-------
06:40:13 [2020-08-22T10:40:13.607Z] [INFO] Building org.eclipse.ease.lang.javascript.test 0.8.0-SNAPSHOT    [41/48]
06:40:13 [2020-08-22T10:40:13.607Z] [INFO] ------------------------[ eclipse-test-plugin ]-------------------------
06:40:13 [2020-08-22T10:40:13.607Z] [INFO] 
06:40:13 [2020-08-22T10:40:13.607Z] [INFO] --- maven-clean-plugin:2.5:clean (default-clean) @ org.eclipse.ease.lang.javascript.test ---
06:40:13 [2020-08-22T10:40:13.607Z] [INFO] 
06:40:13 [2020-08-22T10:40:13.607Z] [INFO] --- tycho-packaging-plugin:1.3.0:build-qualifier (default-build-qualifier) @ org.eclipse.ease.lang.javascript.test ---
06:40:13 [2020-08-22T10:40:13.607Z] [INFO] The project's OSGi version is 0.8.0.I201910171213
06:40:13 [2020-08-22T10:40:13.607Z] [INFO] 
06:40:13 [2020-08-22T10:40:13.607Z] [INFO] --- tycho-packaging-plugin:1.3.0:validate-id (default-validate-id) @ org.eclipse.ease.lang.javascript.test ---
06:40:13 [2020-08-22T10:40:13.607Z] [INFO] 
06:40:13 [2020-08-22T10:40:13.607Z] [INFO] --- tycho-packaging-plugin:1.3.0:validate-version (default-validate-version) @ org.eclipse.ease.lang.javascript.test ---
06:40:13 [2020-08-22T10:40:13.607Z] [INFO] 
06:40:13 [2020-08-22T10:40:13.607Z] [INFO] >>> maven-javadoc-plugin:2.9.1:javadoc (build-docs) > generate-sources @ org.eclipse.ease.lang.javascript.test >>>
06:40:13 [2020-08-22T10:40:13.607Z] [INFO] 
06:40:13 [2020-08-22T10:40:13.607Z] [INFO] --- tycho-packaging-plugin:1.3.0:build-qualifier (default-build-qualifier) @ org.eclipse.ease.lang.javascript.test ---
06:40:13 [2020-08-22T10:40:13.607Z] [INFO] The project's OSGi version is 0.8.0.I201910171213
06:40:13 [2020-08-22T10:40:13.607Z] [INFO] 
06:40:13 [2020-08-22T10:40:13.607Z] [INFO] --- tycho-packaging-plugin:1.3.0:validate-id (default-validate-id) @ org.eclipse.ease.lang.javascript.test ---
06:40:13 [2020-08-22T10:40:13.607Z] [INFO] 
06:40:13 [2020-08-22T10:40:13.607Z] [INFO] --- tycho-packaging-plugin:1.3.0:validate-version (default-validate-version) @ org.eclipse.ease.lang.javascript.test ---
06:40:13 [2020-08-22T10:40:13.607Z] [INFO] 
06:40:13 [2020-08-22T10:40:13.607Z] [INFO] <<< maven-javadoc-plugin:2.9.1:javadoc (build-docs) < generate-sources @ org.eclipse.ease.lang.javascript.test <<<
06:40:13 [2020-08-22T10:40:13.607Z] [INFO] 
06:40:13 [2020-08-22T10:40:13.607Z] [INFO] 
06:40:13 [2020-08-22T10:40:13.607Z] [INFO] --- maven-javadoc-plugin:2.9.1:javadoc (build-docs) @ org.eclipse.ease.lang.javascript.test ---
06:40:13 [2020-08-22T10:40:13.862Z] [ERROR] Error fetching link: http://help.eclipse.org/oxygen/topic/org.eclipse.platform.doc.isv/reference/api/package-list. Ignored it.
06:40:14 [2020-08-22T10:40:14.789Z] [INFO] 
06:40:14 [2020-08-22T10:40:14.789Z] Loading source files for package org.eclipse.ease.lang.javascript...
06:40:14 [2020-08-22T10:40:14.789Z] Constructing Javadoc information...
06:40:14 [2020-08-22T10:40:14.789Z] WARNING: Cannot open location "/home/jenkins/agent/workspace/ease.verify.core.target.2019-12/tests/org.eclipse.ease.lang.javascript.test/target/javadoc-bundle-options/package-list"
06:40:14 [2020-08-22T10:40:14.789Z] No plugin definition found, skipping
06:40:14 [2020-08-22T10:40:14.789Z] No plugin definition found, skipping
06:40:14 [2020-08-22T10:40:14.789Z] [WARNING] Javadoc Warnings
06:40:14 [2020-08-22T10:40:14.789Z] [WARNING] Picked up JAVA_TOOL_OPTIONS: -Dmaven.ext.class.path="/home/jenkins/agent/workspace/ease.verify.core.target.2019-12@tmp/withMavend43eb3e6/pipeline-maven-spy.jar" -Dorg.jenkinsci.plugins.pipeline.maven.reportsFolder="/home/jenkins/agent/workspace/ease.verify.core.target.2019-12@tmp/withMavend43eb3e6"
06:40:14 [2020-08-22T10:40:14.789Z] [INFO] 
06:40:14 [2020-08-22T10:40:14.789Z] [INFO] --- build-helper-maven-plugin:1.9.1:add-resource (add_help) @ org.eclipse.ease.lang.javascript.test ---
06:40:14 [2020-08-22T10:40:14.789Z] [INFO] 
06:40:14 [2020-08-22T10:40:14.789Z] [INFO] --- maven-resources-plugin:2.4.3:resources (default-resources) @ org.eclipse.ease.lang.javascript.test ---
06:40:14 [2020-08-22T10:40:14.789Z] [INFO] Using 'UTF-8' encoding to copy filtered resources.
06:40:14 [2020-08-22T10:40:14.789Z] [INFO] skip non existing resourceDirectory /home/jenkins/agent/workspace/ease.verify.core.target.2019-12/tests/org.eclipse.ease.lang.javascript.test/src/main/resources
06:40:14 [2020-08-22T10:40:14.789Z] [INFO] skip non existing resourceDirectory /home/jenkins/agent/workspace/ease.verify.core.target.2019-12/tests/org.eclipse.ease.lang.javascript.test/help
06:40:14 [2020-08-22T10:40:14.789Z] [INFO] 
06:40:14 [2020-08-22T10:40:14.789Z] [INFO] --- tycho-compiler-plugin:1.3.0:compile (default-compile) @ org.eclipse.ease.lang.javascript.test ---
06:40:14 [2020-08-22T10:40:14.789Z] [INFO] Compiling 2 source files to /home/jenkins/agent/workspace/ease.verify.core.target.2019-12/tests/org.eclipse.ease.lang.javascript.test/target/classes
06:40:15 [2020-08-22T10:40:15.044Z] [INFO] 
06:40:15 [2020-08-22T10:40:15.044Z] [INFO] --- maven-resources-plugin:2.4.3:testResources (default-testResources) @ org.eclipse.ease.lang.javascript.test ---
06:40:15 [2020-08-22T10:40:15.044Z] [INFO] Using 'UTF-8' encoding to copy filtered resources.
06:40:15 [2020-08-22T10:40:15.044Z] [INFO] skip non existing resourceDirectory /home/jenkins/agent/workspace/ease.verify.core.target.2019-12/tests/org.eclipse.ease.lang.javascript.test/src/test/resources
06:40:15 [2020-08-22T10:40:15.044Z] [INFO] 
06:40:15 [2020-08-22T10:40:15.044Z] [INFO] --- tycho-source-plugin:1.3.0:plugin-source (plugin-source) @ org.eclipse.ease.lang.javascript.test ---
06:40:15 [2020-08-22T10:40:15.044Z] [WARNING] Bundle-Vendor header not found in /home/jenkins/agent/workspace/ease.verify.core.target.2019-12/tests/org.eclipse.ease.lang.javascript.test/META-INF/MANIFEST.MF, fallback to 'unknown' for source bundle
06:40:15 [2020-08-22T10:40:15.044Z] [INFO] Building jar: /home/jenkins/agent/workspace/ease.verify.core.target.2019-12/tests/org.eclipse.ease.lang.javascript.test/target/org.eclipse.ease.lang.javascript.test-0.8.0-SNAPSHOT-sources.jar
06:40:15 [2020-08-22T10:40:15.044Z] [INFO] 
06:40:15 [2020-08-22T10:40:15.044Z] [INFO] --- target-platform-configuration:1.3.0:target-platform (default-target-platform) @ org.eclipse.ease.lang.javascript.test ---
06:40:15 [2020-08-22T10:40:15.044Z] [INFO] 
06:40:15 [2020-08-22T10:40:15.044Z] [INFO] --- tycho-packaging-plugin:1.3.0:package-plugin (default-package-plugin) @ org.eclipse.ease.lang.javascript.test ---
06:40:15 [2020-08-22T10:40:15.044Z] [INFO] Building jar: /home/jenkins/agent/workspace/ease.verify.core.target.2019-12/tests/org.eclipse.ease.lang.javascript.test/target/org.eclipse.ease.lang.javascript.test-0.8.0-SNAPSHOT.jar
06:40:15 [2020-08-22T10:40:15.044Z] [INFO] 
06:40:15 [2020-08-22T10:40:15.044Z] [INFO] --- tycho-p2-plugin:1.3.0:p2-metadata-default (default-p2-metadata-default) @ org.eclipse.ease.lang.javascript.test ---
06:40:15 [2020-08-22T10:40:15.044Z] [INFO] 
06:40:15 [2020-08-22T10:40:15.045Z] [INFO] --- tycho-source-feature-plugin:1.3.0:source-feature (source-feature) @ org.eclipse.ease.lang.javascript.test ---
06:40:15 [2020-08-22T10:40:15.045Z] [INFO] 
06:40:15 [2020-08-22T10:40:15.045Z] [INFO] --- tycho-p2-plugin:1.3.0:p2-metadata (attached-p2-metadata) @ org.eclipse.ease.lang.javascript.test ---
06:40:15 [2020-08-22T10:40:15.045Z] [INFO] 
06:40:15 [2020-08-22T10:40:15.045Z] [INFO] --- tycho-surefire-plugin:1.3.0:test (default-test) @ org.eclipse.ease.lang.javascript.test ---
06:40:15 [2020-08-22T10:40:15.045Z] [INFO] Expected eclipse log file: /home/jenkins/agent/workspace/ease.verify.core.target.2019-12/tests/org.eclipse.ease.lang.javascript.test/target/work/data/.metadata/.log
06:40:15 [2020-08-22T10:40:15.045Z] [INFO] Command line:
06:40:15 [2020-08-22T10:40:15.045Z] 	[/opt/tools/java/oracle/jdk-8/1.8.0_202/jre/bin/java, -Dosgi.noShutdown=false, -Dosgi.os=linux, -Dosgi.ws=gtk, -Dosgi.arch=x86_64, -Dosgi.clean=true, -jar, /home/jenkins/.m2/repository/p2/osgi/bundle/org.eclipse.equinox.launcher/1.5.700.v20200207-2156/org.eclipse.equinox.launcher-1.5.700.v20200207-2156.jar, -data, /home/jenkins/agent/workspace/ease.verify.core.target.2019-12/tests/org.eclipse.ease.lang.javascript.test/target/work/data, -install, /home/jenkins/agent/workspace/ease.verify.core.target.2019-12/tests/org.eclipse.ease.lang.javascript.test/target/work, -configuration, /home/jenkins/agent/workspace/ease.verify.core.target.2019-12/tests/org.eclipse.ease.lang.javascript.test/target/work/configuration, -application, org.eclipse.tycho.surefire.osgibooter.headlesstest, -testproperties, /home/jenkins/agent/workspace/ease.verify.core.target.2019-12/tests/org.eclipse.ease.lang.javascript.test/target/surefire.properties]
06:40:15 [2020-08-22T10:40:15.045Z] Picked up JAVA_TOOL_OPTIONS: -Dmaven.ext.class.path="/home/jenkins/agent/workspace/ease.verify.core.target.2019-12@tmp/withMavend43eb3e6/pipeline-maven-spy.jar" -Dorg.jenkinsci.plugins.pipeline.maven.reportsFolder="/home/jenkins/agent/workspace/ease.verify.core.target.2019-12@tmp/withMavend43eb3e6" 
06:40:16 [2020-08-22T10:40:16.417Z] Running org.eclipse.ease.lang.javascript.JavaScriptCodeFactoryTest
06:40:16 [2020-08-22T10:40:16.417Z] Tests run: 1, Failures: 0, Errors: 0, Skipped: 0, Time elapsed: 0.092 s - in org.eclipse.ease.lang.javascript.JavaScriptCodeFactoryTest
06:40:16 [2020-08-22T10:40:16.417Z] testCommentCreator(org.eclipse.ease.lang.javascript.JavaScriptCodeFactoryTest)  Time elapsed: 0.005 s
06:40:16 [2020-08-22T10:40:16.417Z] Running org.eclipse.ease.lang.javascript.JavaScriptCompletionContextTest
06:40:16 [2020-08-22T10:40:16.417Z] Tests run: 8, Failures: 0, Errors: 0, Skipped: 0, Time elapsed: 0.181 s - in org.eclipse.ease.lang.javascript.JavaScriptCompletionContextTest
06:40:16 [2020-08-22T10:40:16.417Z] verifyStaticClassTypes(org.eclipse.ease.lang.javascript.JavaScriptCompletionContextTest)  Time elapsed: 0.003 s
06:40:16 [2020-08-22T10:40:16.417Z] verifyClassInstanceTypes(org.eclipse.ease.lang.javascript.JavaScriptCompletionContextTest)  Time elapsed: 0.005 s
06:40:16 [2020-08-22T10:40:16.417Z] verifyTypesForScriptEngine(org.eclipse.ease.lang.javascript.JavaScriptCompletionContextTest)  Time elapsed: 0.169 s
06:40:16 [2020-08-22T10:40:16.417Z] verifyPackageTypes(org.eclipse.ease.lang.javascript.JavaScriptCompletionContextTest)  Time elapsed: 0 s
06:40:16 [2020-08-22T10:40:16.417Z] definedVariableTypes(org.eclipse.ease.lang.javascript.JavaScriptCompletionContextTest)  Time elapsed: 0.001 s
06:40:16 [2020-08-22T10:40:16.417Z] verifyStringLiteralTypes(org.eclipse.ease.lang.javascript.JavaScriptCompletionContextTest)  Time elapsed: 0 s
06:40:16 [2020-08-22T10:40:16.417Z] verifyUnknownTypes(org.eclipse.ease.lang.javascript.JavaScriptCompletionContextTest)  Time elapsed: 0 s
06:40:16 [2020-08-22T10:40:16.417Z] verifyNoneTypes(org.eclipse.ease.lang.javascript.JavaScriptCompletionContextTest)  Time elapsed: 0 s
06:40:16 [2020-08-22T10:40:16.417Z] 
06:40:16 [2020-08-22T10:40:16.417Z] Results:
06:40:16 [2020-08-22T10:40:16.417Z] 
06:40:16 [2020-08-22T10:40:16.417Z] Tests run: 9, Failures: 0, Errors: 0, Skipped: 0
06:40:16 [2020-08-22T10:40:16.417Z] 
06:40:16 [2020-08-22T10:40:16.979Z] [INFO] All tests passed!
06:40:16 [2020-08-22T10:40:16.979Z] [INFO] 
06:40:16 [2020-08-22T10:40:16.979Z] [INFO] --- maven-install-plugin:2.3.1:install (default-install) @ org.eclipse.ease.lang.javascript.test ---
06:40:16 [2020-08-22T10:40:16.979Z] [INFO] Installing /home/jenkins/agent/workspace/ease.verify.core.target.2019-12/tests/org.eclipse.ease.lang.javascript.test/target/org.eclipse.ease.lang.javascript.test-0.8.0-SNAPSHOT.jar to /home/jenkins/.m2/repository/org/eclipse/ease/org.eclipse.ease.lang.javascript.test/0.8.0-SNAPSHOT/org.eclipse.ease.lang.javascript.test-0.8.0-SNAPSHOT.jar
06:40:16 [2020-08-22T10:40:16.979Z] [INFO] Installing /home/jenkins/agent/workspace/ease.verify.core.target.2019-12/tests/org.eclipse.ease.lang.javascript.test/pom.xml to /home/jenkins/.m2/repository/org/eclipse/ease/org.eclipse.ease.lang.javascript.test/0.8.0-SNAPSHOT/org.eclipse.ease.lang.javascript.test-0.8.0-SNAPSHOT.pom
06:40:16 [2020-08-22T10:40:16.979Z] [INFO] Installing /home/jenkins/agent/workspace/ease.verify.core.target.2019-12/tests/org.eclipse.ease.lang.javascript.test/target/org.eclipse.ease.lang.javascript.test-0.8.0-SNAPSHOT-sources.jar to /home/jenkins/.m2/repository/org/eclipse/ease/org.eclipse.ease.lang.javascript.test/0.8.0-SNAPSHOT/org.eclipse.ease.lang.javascript.test-0.8.0-SNAPSHOT-sources.jar
06:40:16 [2020-08-22T10:40:16.979Z] [INFO] Installing /home/jenkins/agent/workspace/ease.verify.core.target.2019-12/tests/org.eclipse.ease.lang.javascript.test/target/p2content.xml to /home/jenkins/.m2/repository/org/eclipse/ease/org.eclipse.ease.lang.javascript.test/0.8.0-SNAPSHOT/org.eclipse.ease.lang.javascript.test-0.8.0-SNAPSHOT-p2metadata.xml
06:40:16 [2020-08-22T10:40:16.979Z] [INFO] Installing /home/jenkins/agent/workspace/ease.verify.core.target.2019-12/tests/org.eclipse.ease.lang.javascript.test/target/p2artifacts.xml to /home/jenkins/.m2/repository/org/eclipse/ease/org.eclipse.ease.lang.javascript.test/0.8.0-SNAPSHOT/org.eclipse.ease.lang.javascript.test-0.8.0-SNAPSHOT-p2artifacts.xml
06:40:16 [2020-08-22T10:40:16.979Z] [INFO] Installing /home/jenkins/agent/workspace/ease.verify.core.target.2019-12/tests/org.eclipse.ease.lang.javascript.test/target/p2content.xml to /home/jenkins/.m2/repository/org/eclipse/ease/org.eclipse.ease.lang.javascript.test/0.8.0-SNAPSHOT/org.eclipse.ease.lang.javascript.test-0.8.0-SNAPSHOT-p2metadata.xml
06:40:16 [2020-08-22T10:40:16.979Z] [INFO] Installing /home/jenkins/agent/workspace/ease.verify.core.target.2019-12/tests/org.eclipse.ease.lang.javascript.test/target/p2artifacts.xml to /home/jenkins/.m2/repository/org/eclipse/ease/org.eclipse.ease.lang.javascript.test/0.8.0-SNAPSHOT/org.eclipse.ease.lang.javascript.test-0.8.0-SNAPSHOT-p2artifacts.xml
06:40:16 [2020-08-22T10:40:16.979Z] [INFO] 
06:40:16 [2020-08-22T10:40:16.979Z] [INFO] --- tycho-p2-plugin:1.3.0:update-local-index (default-update-local-index) @ org.eclipse.ease.lang.javascript.test ---
06:40:16 [2020-08-22T10:40:16.979Z] [INFO] 
06:40:16 [2020-08-22T10:40:16.979Z] [INFO] ---------< org.eclipse.ease:org.eclipse.ease.lang.python.test >---------
06:40:16 [2020-08-22T10:40:16.979Z] [INFO] Building org.eclipse.ease.lang.python.test 0.8.0-SNAPSHOT        [42/48]
06:40:16 [2020-08-22T10:40:16.979Z] [INFO] ------------------------[ eclipse-test-plugin ]-------------------------
06:40:16 [2020-08-22T10:40:16.979Z] [INFO] 
06:40:16 [2020-08-22T10:40:16.979Z] [INFO] --- maven-clean-plugin:2.5:clean (default-clean) @ org.eclipse.ease.lang.python.test ---
06:40:16 [2020-08-22T10:40:16.979Z] [INFO] 
06:40:16 [2020-08-22T10:40:16.979Z] [INFO] --- tycho-packaging-plugin:1.3.0:build-qualifier (default-build-qualifier) @ org.eclipse.ease.lang.python.test ---
06:40:16 [2020-08-22T10:40:16.979Z] [INFO] The project's OSGi version is 0.8.0.I201910171213
06:40:16 [2020-08-22T10:40:16.979Z] [INFO] 
06:40:16 [2020-08-22T10:40:16.979Z] [INFO] --- tycho-packaging-plugin:1.3.0:validate-id (default-validate-id) @ org.eclipse.ease.lang.python.test ---
06:40:16 [2020-08-22T10:40:16.979Z] [INFO] 
06:40:16 [2020-08-22T10:40:16.979Z] [INFO] --- tycho-packaging-plugin:1.3.0:validate-version (default-validate-version) @ org.eclipse.ease.lang.python.test ---
06:40:16 [2020-08-22T10:40:16.979Z] [INFO] 
06:40:16 [2020-08-22T10:40:16.979Z] [INFO] >>> maven-javadoc-plugin:2.9.1:javadoc (build-docs) > generate-sources @ org.eclipse.ease.lang.python.test >>>
06:40:16 [2020-08-22T10:40:16.979Z] [INFO] 
06:40:16 [2020-08-22T10:40:16.979Z] [INFO] --- tycho-packaging-plugin:1.3.0:build-qualifier (default-build-qualifier) @ org.eclipse.ease.lang.python.test ---
06:40:16 [2020-08-22T10:40:16.979Z] [INFO] The project's OSGi version is 0.8.0.I201910171213
06:40:16 [2020-08-22T10:40:16.979Z] [INFO] 
06:40:16 [2020-08-22T10:40:16.979Z] [INFO] --- tycho-packaging-plugin:1.3.0:validate-id (default-validate-id) @ org.eclipse.ease.lang.python.test ---
06:40:16 [2020-08-22T10:40:16.979Z] [INFO] 
06:40:16 [2020-08-22T10:40:16.979Z] [INFO] --- tycho-packaging-plugin:1.3.0:validate-version (default-validate-version) @ org.eclipse.ease.lang.python.test ---
06:40:16 [2020-08-22T10:40:16.979Z] [INFO] 
06:40:16 [2020-08-22T10:40:16.979Z] [INFO] <<< maven-javadoc-plugin:2.9.1:javadoc (build-docs) < generate-sources @ org.eclipse.ease.lang.python.test <<<
06:40:16 [2020-08-22T10:40:16.979Z] [INFO] 
06:40:16 [2020-08-22T10:40:16.979Z] [INFO] 
06:40:16 [2020-08-22T10:40:16.979Z] [INFO] --- maven-javadoc-plugin:2.9.1:javadoc (build-docs) @ org.eclipse.ease.lang.python.test ---
06:40:17 [2020-08-22T10:40:17.235Z] [ERROR] Error fetching link: http://help.eclipse.org/oxygen/topic/org.eclipse.platform.doc.isv/reference/api/package-list. Ignored it.
06:40:18 [2020-08-22T10:40:18.161Z] [INFO] 
06:40:18 [2020-08-22T10:40:18.161Z] Loading source files for package org.eclipse.ease.lang.python...
06:40:18 [2020-08-22T10:40:18.161Z] Constructing Javadoc information...
06:40:18 [2020-08-22T10:40:18.161Z] WARNING: Cannot open location "/home/jenkins/agent/workspace/ease.verify.core.target.2019-12/tests/org.eclipse.ease.lang.python.test/target/javadoc-bundle-options/package-list"
06:40:18 [2020-08-22T10:40:18.161Z] No plugin definition found, skipping
06:40:18 [2020-08-22T10:40:18.161Z] No plugin definition found, skipping
06:40:18 [2020-08-22T10:40:18.161Z] [WARNING] Javadoc Warnings
06:40:18 [2020-08-22T10:40:18.161Z] [WARNING] Picked up JAVA_TOOL_OPTIONS: -Dmaven.ext.class.path="/home/jenkins/agent/workspace/ease.verify.core.target.2019-12@tmp/withMavend43eb3e6/pipeline-maven-spy.jar" -Dorg.jenkinsci.plugins.pipeline.maven.reportsFolder="/home/jenkins/agent/workspace/ease.verify.core.target.2019-12@tmp/withMavend43eb3e6"
06:40:18 [2020-08-22T10:40:18.161Z] [INFO] 
06:40:18 [2020-08-22T10:40:18.161Z] [INFO] --- build-helper-maven-plugin:1.9.1:add-resource (add_help) @ org.eclipse.ease.lang.python.test ---
06:40:18 [2020-08-22T10:40:18.161Z] [INFO] 
06:40:18 [2020-08-22T10:40:18.161Z] [INFO] --- maven-resources-plugin:2.4.3:resources (default-resources) @ org.eclipse.ease.lang.python.test ---
06:40:18 [2020-08-22T10:40:18.161Z] [INFO] Using 'UTF-8' encoding to copy filtered resources.
06:40:18 [2020-08-22T10:40:18.161Z] [INFO] skip non existing resourceDirectory /home/jenkins/agent/workspace/ease.verify.core.target.2019-12/tests/org.eclipse.ease.lang.python.test/src/main/resources
06:40:18 [2020-08-22T10:40:18.161Z] [INFO] skip non existing resourceDirectory /home/jenkins/agent/workspace/ease.verify.core.target.2019-12/tests/org.eclipse.ease.lang.python.test/help
06:40:18 [2020-08-22T10:40:18.161Z] [INFO] 
06:40:18 [2020-08-22T10:40:18.161Z] [INFO] --- tycho-compiler-plugin:1.3.0:compile (default-compile) @ org.eclipse.ease.lang.python.test ---
06:40:18 [2020-08-22T10:40:18.161Z] [INFO] Compiling 1 source file to /home/jenkins/agent/workspace/ease.verify.core.target.2019-12/tests/org.eclipse.ease.lang.python.test/target/classes
06:40:18 [2020-08-22T10:40:18.161Z] [INFO] 
06:40:18 [2020-08-22T10:40:18.161Z] [INFO] --- maven-resources-plugin:2.4.3:testResources (default-testResources) @ org.eclipse.ease.lang.python.test ---
06:40:18 [2020-08-22T10:40:18.161Z] [INFO] Using 'UTF-8' encoding to copy filtered resources.
06:40:18 [2020-08-22T10:40:18.161Z] [INFO] skip non existing resourceDirectory /home/jenkins/agent/workspace/ease.verify.core.target.2019-12/tests/org.eclipse.ease.lang.python.test/src/test/resources
06:40:18 [2020-08-22T10:40:18.161Z] [INFO] 
06:40:18 [2020-08-22T10:40:18.161Z] [INFO] --- tycho-source-plugin:1.3.0:plugin-source (plugin-source) @ org.eclipse.ease.lang.python.test ---
06:40:18 [2020-08-22T10:40:18.161Z] [WARNING] Bundle-Vendor header not found in /home/jenkins/agent/workspace/ease.verify.core.target.2019-12/tests/org.eclipse.ease.lang.python.test/META-INF/MANIFEST.MF, fallback to 'unknown' for source bundle
06:40:18 [2020-08-22T10:40:18.161Z] [INFO] Building jar: /home/jenkins/agent/workspace/ease.verify.core.target.2019-12/tests/org.eclipse.ease.lang.python.test/target/org.eclipse.ease.lang.python.test-0.8.0-SNAPSHOT-sources.jar
06:40:18 [2020-08-22T10:40:18.161Z] [INFO] 
06:40:18 [2020-08-22T10:40:18.161Z] [INFO] --- target-platform-configuration:1.3.0:target-platform (default-target-platform) @ org.eclipse.ease.lang.python.test ---
06:40:18 [2020-08-22T10:40:18.161Z] [INFO] 
06:40:18 [2020-08-22T10:40:18.161Z] [INFO] --- tycho-packaging-plugin:1.3.0:package-plugin (default-package-plugin) @ org.eclipse.ease.lang.python.test ---
06:40:18 [2020-08-22T10:40:18.161Z] [INFO] Building jar: /home/jenkins/agent/workspace/ease.verify.core.target.2019-12/tests/org.eclipse.ease.lang.python.test/target/org.eclipse.ease.lang.python.test-0.8.0-SNAPSHOT.jar
06:40:18 [2020-08-22T10:40:18.161Z] [INFO] 
06:40:18 [2020-08-22T10:40:18.161Z] [INFO] --- tycho-p2-plugin:1.3.0:p2-metadata-default (default-p2-metadata-default) @ org.eclipse.ease.lang.python.test ---
06:40:18 [2020-08-22T10:40:18.161Z] [INFO] 
06:40:18 [2020-08-22T10:40:18.161Z] [INFO] --- tycho-source-feature-plugin:1.3.0:source-feature (source-feature) @ org.eclipse.ease.lang.python.test ---
06:40:18 [2020-08-22T10:40:18.161Z] [INFO] 
06:40:18 [2020-08-22T10:40:18.161Z] [INFO] --- tycho-p2-plugin:1.3.0:p2-metadata (attached-p2-metadata) @ org.eclipse.ease.lang.python.test ---
06:40:18 [2020-08-22T10:40:18.161Z] [INFO] 
06:40:18 [2020-08-22T10:40:18.161Z] [INFO] --- tycho-surefire-plugin:1.3.0:test (default-test) @ org.eclipse.ease.lang.python.test ---
06:40:18 [2020-08-22T10:40:18.416Z] [INFO] Expected eclipse log file: /home/jenkins/agent/workspace/ease.verify.core.target.2019-12/tests/org.eclipse.ease.lang.python.test/target/work/data/.metadata/.log
06:40:18 [2020-08-22T10:40:18.416Z] [INFO] Command line:
06:40:18 [2020-08-22T10:40:18.416Z] 	[/opt/tools/java/oracle/jdk-8/1.8.0_202/jre/bin/java, -Dosgi.noShutdown=false, -Dosgi.os=linux, -Dosgi.ws=gtk, -Dosgi.arch=x86_64, -Dosgi.clean=true, -jar, /home/jenkins/.m2/repository/p2/osgi/bundle/org.eclipse.equinox.launcher/1.5.700.v20200207-2156/org.eclipse.equinox.launcher-1.5.700.v20200207-2156.jar, -data, /home/jenkins/agent/workspace/ease.verify.core.target.2019-12/tests/org.eclipse.ease.lang.python.test/target/work/data, -install, /home/jenkins/agent/workspace/ease.verify.core.target.2019-12/tests/org.eclipse.ease.lang.python.test/target/work, -configuration, /home/jenkins/agent/workspace/ease.verify.core.target.2019-12/tests/org.eclipse.ease.lang.python.test/target/work/configuration, -application, org.eclipse.tycho.surefire.osgibooter.headlesstest, -testproperties, /home/jenkins/agent/workspace/ease.verify.core.target.2019-12/tests/org.eclipse.ease.lang.python.test/target/surefire.properties]
06:40:18 [2020-08-22T10:40:18.416Z] Picked up JAVA_TOOL_OPTIONS: -Dmaven.ext.class.path="/home/jenkins/agent/workspace/ease.verify.core.target.2019-12@tmp/withMavend43eb3e6/pipeline-maven-spy.jar" -Dorg.jenkinsci.plugins.pipeline.maven.reportsFolder="/home/jenkins/agent/workspace/ease.verify.core.target.2019-12@tmp/withMavend43eb3e6" 
06:40:19 [2020-08-22T10:40:19.820Z] Running org.eclipse.ease.lang.python.PythonCodeFactoryTest
06:40:19 [2020-08-22T10:40:19.820Z] Tests run: 1, Failures: 0, Errors: 0, Skipped: 0, Time elapsed: 0.033 s - in org.eclipse.ease.lang.python.PythonCodeFactoryTest
06:40:19 [2020-08-22T10:40:19.820Z] testCommentCreator(org.eclipse.ease.lang.python.PythonCodeFactoryTest)  Time elapsed: 0.004 s
06:40:19 [2020-08-22T10:40:19.820Z] 
06:40:19 [2020-08-22T10:40:19.820Z] Results:
06:40:19 [2020-08-22T10:40:19.820Z] 
06:40:19 [2020-08-22T10:40:19.820Z] Tests run: 1, Failures: 0, Errors: 0, Skipped: 0
06:40:19 [2020-08-22T10:40:19.820Z] 
06:40:20 [2020-08-22T10:40:20.381Z] [INFO] All tests passed!
06:40:20 [2020-08-22T10:40:20.382Z] [INFO] 
06:40:20 [2020-08-22T10:40:20.382Z] [INFO] --- maven-install-plugin:2.3.1:install (default-install) @ org.eclipse.ease.lang.python.test ---
06:40:20 [2020-08-22T10:40:20.382Z] [INFO] Installing /home/jenkins/agent/workspace/ease.verify.core.target.2019-12/tests/org.eclipse.ease.lang.python.test/target/org.eclipse.ease.lang.python.test-0.8.0-SNAPSHOT.jar to /home/jenkins/.m2/repository/org/eclipse/ease/org.eclipse.ease.lang.python.test/0.8.0-SNAPSHOT/org.eclipse.ease.lang.python.test-0.8.0-SNAPSHOT.jar
06:40:20 [2020-08-22T10:40:20.382Z] [INFO] Installing /home/jenkins/agent/workspace/ease.verify.core.target.2019-12/tests/org.eclipse.ease.lang.python.test/pom.xml to /home/jenkins/.m2/repository/org/eclipse/ease/org.eclipse.ease.lang.python.test/0.8.0-SNAPSHOT/org.eclipse.ease.lang.python.test-0.8.0-SNAPSHOT.pom
06:40:20 [2020-08-22T10:40:20.382Z] [INFO] Installing /home/jenkins/agent/workspace/ease.verify.core.target.2019-12/tests/org.eclipse.ease.lang.python.test/target/org.eclipse.ease.lang.python.test-0.8.0-SNAPSHOT-sources.jar to /home/jenkins/.m2/repository/org/eclipse/ease/org.eclipse.ease.lang.python.test/0.8.0-SNAPSHOT/org.eclipse.ease.lang.python.test-0.8.0-SNAPSHOT-sources.jar
06:40:20 [2020-08-22T10:40:20.382Z] [INFO] Installing /home/jenkins/agent/workspace/ease.verify.core.target.2019-12/tests/org.eclipse.ease.lang.python.test/target/p2content.xml to /home/jenkins/.m2/repository/org/eclipse/ease/org.eclipse.ease.lang.python.test/0.8.0-SNAPSHOT/org.eclipse.ease.lang.python.test-0.8.0-SNAPSHOT-p2metadata.xml
06:40:20 [2020-08-22T10:40:20.382Z] [INFO] Installing /home/jenkins/agent/workspace/ease.verify.core.target.2019-12/tests/org.eclipse.ease.lang.python.test/target/p2artifacts.xml to /home/jenkins/.m2/repository/org/eclipse/ease/org.eclipse.ease.lang.python.test/0.8.0-SNAPSHOT/org.eclipse.ease.lang.python.test-0.8.0-SNAPSHOT-p2artifacts.xml
06:40:20 [2020-08-22T10:40:20.382Z] [INFO] Installing /home/jenkins/agent/workspace/ease.verify.core.target.2019-12/tests/org.eclipse.ease.lang.python.test/target/p2content.xml to /home/jenkins/.m2/repository/org/eclipse/ease/org.eclipse.ease.lang.python.test/0.8.0-SNAPSHOT/org.eclipse.ease.lang.python.test-0.8.0-SNAPSHOT-p2metadata.xml
06:40:20 [2020-08-22T10:40:20.382Z] [INFO] Installing /home/jenkins/agent/workspace/ease.verify.core.target.2019-12/tests/org.eclipse.ease.lang.python.test/target/p2artifacts.xml to /home/jenkins/.m2/repository/org/eclipse/ease/org.eclipse.ease.lang.python.test/0.8.0-SNAPSHOT/org.eclipse.ease.lang.python.test-0.8.0-SNAPSHOT-p2artifacts.xml
06:40:20 [2020-08-22T10:40:20.382Z] [INFO] 
06:40:20 [2020-08-22T10:40:20.382Z] [INFO] --- tycho-p2-plugin:1.3.0:update-local-index (default-update-local-index) @ org.eclipse.ease.lang.python.test ---
06:40:20 [2020-08-22T10:40:20.382Z] [INFO] 
06:40:20 [2020-08-22T10:40:20.382Z] [INFO] -----< org.eclipse.ease:org.eclipse.ease.lang.python.jython.test >------
06:40:20 [2020-08-22T10:40:20.382Z] [INFO] Building org.eclipse.ease.lang.python.jython.test 0.8.0-SNAPSHOT [43/48]
06:40:20 [2020-08-22T10:40:20.382Z] [INFO] ------------------------[ eclipse-test-plugin ]-------------------------
06:40:20 [2020-08-22T10:40:20.382Z] [INFO] 
06:40:20 [2020-08-22T10:40:20.382Z] [INFO] --- maven-clean-plugin:2.5:clean (default-clean) @ org.eclipse.ease.lang.python.jython.test ---
06:40:20 [2020-08-22T10:40:20.382Z] [INFO] 
06:40:20 [2020-08-22T10:40:20.382Z] [INFO] --- tycho-packaging-plugin:1.3.0:build-qualifier (default-build-qualifier) @ org.eclipse.ease.lang.python.jython.test ---
06:40:20 [2020-08-22T10:40:20.382Z] [INFO] The project's OSGi version is 0.8.0.I201911291239
06:40:20 [2020-08-22T10:40:20.382Z] [INFO] 
06:40:20 [2020-08-22T10:40:20.382Z] [INFO] --- tycho-packaging-plugin:1.3.0:validate-id (default-validate-id) @ org.eclipse.ease.lang.python.jython.test ---
06:40:20 [2020-08-22T10:40:20.382Z] [INFO] 
06:40:20 [2020-08-22T10:40:20.382Z] [INFO] --- tycho-packaging-plugin:1.3.0:validate-version (default-validate-version) @ org.eclipse.ease.lang.python.jython.test ---
06:40:20 [2020-08-22T10:40:20.382Z] [INFO] 
06:40:20 [2020-08-22T10:40:20.382Z] [INFO] >>> maven-javadoc-plugin:2.9.1:javadoc (build-docs) > generate-sources @ org.eclipse.ease.lang.python.jython.test >>>
06:40:20 [2020-08-22T10:40:20.382Z] [INFO] 
06:40:20 [2020-08-22T10:40:20.382Z] [INFO] --- tycho-packaging-plugin:1.3.0:build-qualifier (default-build-qualifier) @ org.eclipse.ease.lang.python.jython.test ---
06:40:20 [2020-08-22T10:40:20.382Z] [INFO] The project's OSGi version is 0.8.0.I201911291239
06:40:20 [2020-08-22T10:40:20.382Z] [INFO] 
06:40:20 [2020-08-22T10:40:20.382Z] [INFO] --- tycho-packaging-plugin:1.3.0:validate-id (default-validate-id) @ org.eclipse.ease.lang.python.jython.test ---
06:40:20 [2020-08-22T10:40:20.382Z] [INFO] 
06:40:20 [2020-08-22T10:40:20.382Z] [INFO] --- tycho-packaging-plugin:1.3.0:validate-version (default-validate-version) @ org.eclipse.ease.lang.python.jython.test ---
06:40:20 [2020-08-22T10:40:20.382Z] [INFO] 
06:40:20 [2020-08-22T10:40:20.382Z] [INFO] <<< maven-javadoc-plugin:2.9.1:javadoc (build-docs) < generate-sources @ org.eclipse.ease.lang.python.jython.test <<<
06:40:20 [2020-08-22T10:40:20.382Z] [INFO] 
06:40:20 [2020-08-22T10:40:20.382Z] [INFO] 
06:40:20 [2020-08-22T10:40:20.382Z] [INFO] --- maven-javadoc-plugin:2.9.1:javadoc (build-docs) @ org.eclipse.ease.lang.python.jython.test ---
06:40:20 [2020-08-22T10:40:20.382Z] [ERROR] Error fetching link: http://help.eclipse.org/oxygen/topic/org.eclipse.platform.doc.isv/reference/api/package-list. Ignored it.
06:40:21 [2020-08-22T10:40:21.308Z] [INFO] 
06:40:21 [2020-08-22T10:40:21.308Z] Loading source files for package org.eclipse.ease.lang.python.jython.debugger...
06:40:21 [2020-08-22T10:40:21.308Z] Constructing Javadoc information...
06:40:21 [2020-08-22T10:40:21.308Z] WARNING: Cannot open location "/home/jenkins/agent/workspace/ease.verify.core.target.2019-12/tests/org.eclipse.ease.lang.python.jython.test/target/javadoc-bundle-options/package-list"
06:40:21 [2020-08-22T10:40:21.308Z] No plugin definition found, skipping
06:40:21 [2020-08-22T10:40:21.308Z] No plugin definition found, skipping
06:40:21 [2020-08-22T10:40:21.308Z] [WARNING] Javadoc Warnings
06:40:21 [2020-08-22T10:40:21.308Z] [WARNING] Picked up JAVA_TOOL_OPTIONS: -Dmaven.ext.class.path="/home/jenkins/agent/workspace/ease.verify.core.target.2019-12@tmp/withMavend43eb3e6/pipeline-maven-spy.jar" -Dorg.jenkinsci.plugins.pipeline.maven.reportsFolder="/home/jenkins/agent/workspace/ease.verify.core.target.2019-12@tmp/withMavend43eb3e6"
06:40:21 [2020-08-22T10:40:21.308Z] [INFO] 
06:40:21 [2020-08-22T10:40:21.308Z] [INFO] --- build-helper-maven-plugin:1.9.1:add-resource (add_help) @ org.eclipse.ease.lang.python.jython.test ---
06:40:21 [2020-08-22T10:40:21.308Z] [INFO] 
06:40:21 [2020-08-22T10:40:21.308Z] [INFO] --- maven-resources-plugin:2.4.3:resources (default-resources) @ org.eclipse.ease.lang.python.jython.test ---
06:40:21 [2020-08-22T10:40:21.308Z] [INFO] Using 'UTF-8' encoding to copy filtered resources.
06:40:21 [2020-08-22T10:40:21.308Z] [INFO] skip non existing resourceDirectory /home/jenkins/agent/workspace/ease.verify.core.target.2019-12/tests/org.eclipse.ease.lang.python.jython.test/src/main/resources
06:40:21 [2020-08-22T10:40:21.308Z] [INFO] skip non existing resourceDirectory /home/jenkins/agent/workspace/ease.verify.core.target.2019-12/tests/org.eclipse.ease.lang.python.jython.test/help
06:40:21 [2020-08-22T10:40:21.308Z] [INFO] 
06:40:21 [2020-08-22T10:40:21.308Z] [INFO] --- tycho-compiler-plugin:1.3.0:compile (default-compile) @ org.eclipse.ease.lang.python.jython.test ---
06:40:21 [2020-08-22T10:40:21.308Z] [INFO] Compiling 1 source file to /home/jenkins/agent/workspace/ease.verify.core.target.2019-12/tests/org.eclipse.ease.lang.python.jython.test/target/classes
06:40:21 [2020-08-22T10:40:21.564Z] [INFO] 
06:40:21 [2020-08-22T10:40:21.564Z] [INFO] --- maven-resources-plugin:2.4.3:testResources (default-testResources) @ org.eclipse.ease.lang.python.jython.test ---
06:40:21 [2020-08-22T10:40:21.564Z] [INFO] Using 'UTF-8' encoding to copy filtered resources.
06:40:21 [2020-08-22T10:40:21.564Z] [INFO] skip non existing resourceDirectory /home/jenkins/agent/workspace/ease.verify.core.target.2019-12/tests/org.eclipse.ease.lang.python.jython.test/src/test/resources
06:40:21 [2020-08-22T10:40:21.564Z] [INFO] 
06:40:21 [2020-08-22T10:40:21.564Z] [INFO] --- tycho-source-plugin:1.3.0:plugin-source (plugin-source) @ org.eclipse.ease.lang.python.jython.test ---
06:40:21 [2020-08-22T10:40:21.564Z] [WARNING] Bundle-Vendor header not found in /home/jenkins/agent/workspace/ease.verify.core.target.2019-12/tests/org.eclipse.ease.lang.python.jython.test/META-INF/MANIFEST.MF, fallback to 'unknown' for source bundle
06:40:21 [2020-08-22T10:40:21.564Z] [INFO] Building jar: /home/jenkins/agent/workspace/ease.verify.core.target.2019-12/tests/org.eclipse.ease.lang.python.jython.test/target/org.eclipse.ease.lang.python.jython.test-0.8.0-SNAPSHOT-sources.jar
06:40:21 [2020-08-22T10:40:21.564Z] [INFO] 
06:40:21 [2020-08-22T10:40:21.564Z] [INFO] --- target-platform-configuration:1.3.0:target-platform (default-target-platform) @ org.eclipse.ease.lang.python.jython.test ---
06:40:21 [2020-08-22T10:40:21.564Z] [INFO] 
06:40:21 [2020-08-22T10:40:21.564Z] [INFO] --- tycho-packaging-plugin:1.3.0:package-plugin (default-package-plugin) @ org.eclipse.ease.lang.python.jython.test ---
06:40:21 [2020-08-22T10:40:21.564Z] [INFO] Building jar: /home/jenkins/agent/workspace/ease.verify.core.target.2019-12/tests/org.eclipse.ease.lang.python.jython.test/target/org.eclipse.ease.lang.python.jython.test-0.8.0-SNAPSHOT.jar
06:40:21 [2020-08-22T10:40:21.564Z] [INFO] 
06:40:21 [2020-08-22T10:40:21.564Z] [INFO] --- tycho-p2-plugin:1.3.0:p2-metadata-default (default-p2-metadata-default) @ org.eclipse.ease.lang.python.jython.test ---
06:40:21 [2020-08-22T10:40:21.564Z] [INFO] 
06:40:21 [2020-08-22T10:40:21.564Z] [INFO] --- tycho-source-feature-plugin:1.3.0:source-feature (source-feature) @ org.eclipse.ease.lang.python.jython.test ---
06:40:21 [2020-08-22T10:40:21.564Z] [INFO] 
06:40:21 [2020-08-22T10:40:21.564Z] [INFO] --- tycho-p2-plugin:1.3.0:p2-metadata (attached-p2-metadata) @ org.eclipse.ease.lang.python.jython.test ---
06:40:21 [2020-08-22T10:40:21.564Z] [INFO] 
06:40:21 [2020-08-22T10:40:21.564Z] [INFO] --- tycho-surefire-plugin:1.3.0:test (default-test) @ org.eclipse.ease.lang.python.jython.test ---
06:40:22 [2020-08-22T10:40:22.125Z] [INFO] Expected eclipse log file: /home/jenkins/agent/workspace/ease.verify.core.target.2019-12/tests/org.eclipse.ease.lang.python.jython.test/target/work/data/.metadata/.log
06:40:22 [2020-08-22T10:40:22.125Z] [INFO] Command line:
06:40:22 [2020-08-22T10:40:22.125Z] 	[/opt/tools/java/oracle/jdk-8/1.8.0_202/jre/bin/java, -Dosgi.noShutdown=false, -Dosgi.os=linux, -Dosgi.ws=gtk, -Dosgi.arch=x86_64, -Dosgi.clean=true, -jar, /home/jenkins/.m2/repository/p2/osgi/bundle/org.eclipse.equinox.launcher/1.5.700.v20200207-2156/org.eclipse.equinox.launcher-1.5.700.v20200207-2156.jar, -data, /home/jenkins/agent/workspace/ease.verify.core.target.2019-12/tests/org.eclipse.ease.lang.python.jython.test/target/work/data, -install, /home/jenkins/agent/workspace/ease.verify.core.target.2019-12/tests/org.eclipse.ease.lang.python.jython.test/target/work, -configuration, /home/jenkins/agent/workspace/ease.verify.core.target.2019-12/tests/org.eclipse.ease.lang.python.jython.test/target/work/configuration, -application, org.eclipse.tycho.surefire.osgibooter.headlesstest, -testproperties, /home/jenkins/agent/workspace/ease.verify.core.target.2019-12/tests/org.eclipse.ease.lang.python.jython.test/target/surefire.properties]
06:40:22 [2020-08-22T10:40:22.125Z] Picked up JAVA_TOOL_OPTIONS: -Dmaven.ext.class.path="/home/jenkins/agent/workspace/ease.verify.core.target.2019-12@tmp/withMavend43eb3e6/pipeline-maven-spy.jar" -Dorg.jenkinsci.plugins.pipeline.maven.reportsFolder="/home/jenkins/agent/workspace/ease.verify.core.target.2019-12@tmp/withMavend43eb3e6" 
06:40:24 [2020-08-22T10:40:24.639Z] Running org.eclipse.ease.lang.python.jython.debugger.JythonDebugTest
06:40:25 [2020-08-22T10:40:25.564Z] Start of script
06:40:25 [2020-08-22T10:40:25.564Z] include file start
06:40:25 [2020-08-22T10:40:25.564Z] include file processed
06:40:25 [2020-08-22T10:40:25.564Z] Result of testMethod = 5
06:40:25 [2020-08-22T10:40:25.564Z] End of script
06:40:25 [2020-08-22T10:40:25.819Z] Start of script
06:40:25 [2020-08-22T10:40:25.819Z] include file start
06:40:25 [2020-08-22T10:40:25.819Z] include file processed
06:40:25 [2020-08-22T10:40:25.819Z] Result of testMethod = 5
06:40:25 [2020-08-22T10:40:25.819Z] End of script
06:40:26 [2020-08-22T10:40:26.074Z] Start of script
06:40:26 [2020-08-22T10:40:26.074Z] include file start
06:40:26 [2020-08-22T10:40:26.074Z] include file processed
06:40:26 [2020-08-22T10:40:26.074Z] Result of testMethod = 5
06:40:26 [2020-08-22T10:40:26.074Z] Traceback (most recent call last):
06:40:26 [2020-08-22T10:40:26.074Z]   File "(none)", line 184, in run
06:40:26 [2020-08-22T10:40:26.074Z]   File "__ref_L/Debug Test/Main.py_zkobvpfspv", line 23, in <module>
06:40:26 [2020-08-22T10:40:26.074Z]   File "(none)", line 161, in trace_dispatch
06:40:26 [2020-08-22T10:40:26.074Z] org.eclipse.ease.ExitException: 
06:40:26 [2020-08-22T10:40:26.074Z] 
06:40:26 [2020-08-22T10:40:26.074Z] org.eclipse.ease.ExitException: org.eclipse.ease.ExitException: 
06:40:26 [2020-08-22T10:40:26.330Z] Start of script
06:40:26 [2020-08-22T10:40:26.330Z] include file start
06:40:26 [2020-08-22T10:40:26.330Z] include file processed
06:40:26 [2020-08-22T10:40:26.585Z] Result of testMethod = 5
06:40:26 [2020-08-22T10:40:26.585Z] End of script
06:40:26 [2020-08-22T10:40:26.841Z] Start of script
06:40:26 [2020-08-22T10:40:26.841Z] include file start
06:40:26 [2020-08-22T10:40:26.841Z] include file processed
06:40:26 [2020-08-22T10:40:26.841Z] Result of testMethod = 5
06:40:26 [2020-08-22T10:40:26.841Z] End of script
06:40:26 [2020-08-22T10:40:26.841Z] Start of script
06:40:26 [2020-08-22T10:40:26.841Z] include file start
06:40:26 [2020-08-22T10:40:26.841Z] include file processed
06:40:27 [2020-08-22T10:40:27.096Z] Result of testMethod = 5
06:40:27 [2020-08-22T10:40:27.096Z] End of script
06:40:27 [2020-08-22T10:40:27.352Z] Start of script
06:40:27 [2020-08-22T10:40:27.352Z] include file start
06:40:27 [2020-08-22T10:40:27.352Z] include file processed
06:40:27 [2020-08-22T10:40:27.352Z] Result of testMethod = 5
06:40:27 [2020-08-22T10:40:27.352Z] Traceback (most recent call last):
06:40:27 [2020-08-22T10:40:27.352Z]   File "(none)", line 184, in run
06:40:27 [2020-08-22T10:40:27.352Z]   File "__ref_L/Debug Test/Main.py_ggemkgltgo", line 23, in <module>
06:40:27 [2020-08-22T10:40:27.352Z]   File "(none)", line 161, in trace_dispatch
06:40:27 [2020-08-22T10:40:27.352Z] org.eclipse.ease.ExitException: 
06:40:27 [2020-08-22T10:40:27.352Z] 
06:40:27 [2020-08-22T10:40:27.352Z] org.eclipse.ease.ExitException: org.eclipse.ease.ExitException: 
06:40:27 [2020-08-22T10:40:27.607Z] Start of script
06:40:27 [2020-08-22T10:40:27.607Z] include file start
06:40:27 [2020-08-22T10:40:27.607Z] include file processed
06:40:27 [2020-08-22T10:40:27.607Z] Result of testMethod = 5
06:40:27 [2020-08-22T10:40:27.607Z] End of script
06:40:27 [2020-08-22T10:40:27.862Z] Start of script
06:40:27 [2020-08-22T10:40:27.862Z] include file start
06:40:27 [2020-08-22T10:40:27.862Z] include file processed
06:40:27 [2020-08-22T10:40:27.862Z] Result of testMethod = 5
06:40:27 [2020-08-22T10:40:27.862Z] End of script
06:40:28 [2020-08-22T10:40:28.118Z] Start of script
06:40:28 [2020-08-22T10:40:28.118Z] include file start
06:40:28 [2020-08-22T10:40:28.118Z] include file processed
06:40:28 [2020-08-22T10:40:28.373Z] Traceback (most recent call last):
06:40:28 [2020-08-22T10:40:28.373Z]   File "(none)", line 184, in run
06:40:28 [2020-08-22T10:40:28.373Z]   File "__ref_L/Debug Test/Main.py_yxutpwprwl", line 22, in <module>
06:40:28 [2020-08-22T10:40:28.373Z]   File "(none)", line 161, in trace_dispatch
06:40:28 [2020-08-22T10:40:28.373Z] org.eclipse.ease.ExitException: 
06:40:28 [2020-08-22T10:40:28.373Z] 
06:40:28 [2020-08-22T10:40:28.373Z] org.eclipse.ease.ExitException: org.eclipse.ease.ExitException: 
06:40:28 [2020-08-22T10:40:28.629Z] Start of script
06:40:28 [2020-08-22T10:40:28.629Z] include file start
06:40:28 [2020-08-22T10:40:28.629Z] include file processed
06:40:28 [2020-08-22T10:40:28.629Z] Result of testMethod = 5
06:40:28 [2020-08-22T10:40:28.629Z] End of script
06:40:28 [2020-08-22T10:40:28.884Z] Start of script
06:40:28 [2020-08-22T10:40:28.884Z] include file start
06:40:28 [2020-08-22T10:40:28.884Z] include file processed
06:40:28 [2020-08-22T10:40:28.884Z] Result of testMethod = 5
06:40:28 [2020-08-22T10:40:28.884Z] End of script
06:40:29 [2020-08-22T10:40:29.140Z] Traceback (most recent call last):
06:40:29 [2020-08-22T10:40:29.140Z]   File "(none)", line 184, in run
06:40:29 [2020-08-22T10:40:29.140Z]   File "__ref_L/Debug Test/Main.py_gvzajkvokf", line 1, in <module>
06:40:29 [2020-08-22T10:40:29.140Z]   File "(none)", line 161, in trace_dispatch
06:40:29 [2020-08-22T10:40:29.140Z] org.eclipse.ease.ExitException: 
06:40:29 [2020-08-22T10:40:29.140Z] 
06:40:29 [2020-08-22T10:40:29.140Z] org.eclipse.ease.ExitException: org.eclipse.ease.ExitException: 
06:40:29 [2020-08-22T10:40:29.395Z] Start of script
06:40:29 [2020-08-22T10:40:29.395Z] include file start
06:40:29 [2020-08-22T10:40:29.395Z] include file processed
06:40:29 [2020-08-22T10:40:29.395Z] Result of testMethod = 5
06:40:29 [2020-08-22T10:40:29.395Z] End of script
06:40:29 [2020-08-22T10:40:29.395Z] Start of script
06:40:29 [2020-08-22T10:40:29.395Z] include file start
06:40:29 [2020-08-22T10:40:29.395Z] include file processed
06:40:29 [2020-08-22T10:40:29.650Z] Result of testMethod = 5
06:40:29 [2020-08-22T10:40:29.650Z] End of script
06:40:29 [2020-08-22T10:40:29.906Z] Start of script
06:40:29 [2020-08-22T10:40:29.906Z] include file start
06:40:29 [2020-08-22T10:40:29.906Z] include file processed
06:40:29 [2020-08-22T10:40:29.906Z] Result of testMethod = 5
06:40:29 [2020-08-22T10:40:29.906Z] End of script
06:40:29 [2020-08-22T10:40:29.906Z] Start of script
06:40:29 [2020-08-22T10:40:29.906Z] include file start
06:40:29 [2020-08-22T10:40:29.906Z] include file processed
06:40:30 [2020-08-22T10:40:30.161Z] Result of testMethod = 5
06:40:30 [2020-08-22T10:40:30.161Z] End of script
06:40:30 [2020-08-22T10:40:30.161Z] Traceback (most recent call last):
06:40:30 [2020-08-22T10:40:30.161Z]   File "(none)", line 184, in run
06:40:30 [2020-08-22T10:40:30.161Z]   File "__ref_L/Debug Test/Main.py_digtunscga", line 1, in <module>
06:40:30 [2020-08-22T10:40:30.161Z]   File "(none)", line 161, in trace_dispatch
06:40:30 [2020-08-22T10:40:30.161Z] org.eclipse.ease.ExitException: 
06:40:30 [2020-08-22T10:40:30.161Z] 
06:40:30 [2020-08-22T10:40:30.161Z] org.eclipse.ease.ExitException: org.eclipse.ease.ExitException: 
06:40:30 [2020-08-22T10:40:30.416Z] Start of script
06:40:30 [2020-08-22T10:40:30.416Z] include file start
06:40:30 [2020-08-22T10:40:30.416Z] include file processed
06:40:30 [2020-08-22T10:40:30.416Z] Result of testMethod = 5
06:40:30 [2020-08-22T10:40:30.416Z] End of script
06:40:30 [2020-08-22T10:40:30.671Z] Start of script
06:40:30 [2020-08-22T10:40:30.671Z] include file start
06:40:30 [2020-08-22T10:40:30.671Z] include file processed
06:40:30 [2020-08-22T10:40:30.671Z] Result of testMethod = 5
06:40:30 [2020-08-22T10:40:30.671Z] End of script
06:40:30 [2020-08-22T10:40:30.927Z] Traceback (most recent call last):
06:40:30 [2020-08-22T10:40:30.927Z]   File "(none)", line 184, in run
06:40:30 [2020-08-22T10:40:30.927Z]   File "__ref_L/Debug Test/Main.py_ojjirkjqbf", line 1, in <module>
06:40:30 [2020-08-22T10:40:30.927Z]   File "(none)", line 161, in trace_dispatch
06:40:30 [2020-08-22T10:40:30.927Z] org.eclipse.ease.ExitException: 
06:40:30 [2020-08-22T10:40:30.927Z] 
06:40:30 [2020-08-22T10:40:30.927Z] org.eclipse.ease.ExitException: org.eclipse.ease.ExitException: 
06:40:31 [2020-08-22T10:40:31.182Z] Start of script
06:40:31 [2020-08-22T10:40:31.182Z] include file start
06:40:31 [2020-08-22T10:40:31.182Z] include file processed
06:40:31 [2020-08-22T10:40:31.182Z] Result of testMethod = 5
06:40:31 [2020-08-22T10:40:31.182Z] End of script
06:40:31 [2020-08-22T10:40:31.437Z] Start of script
06:40:31 [2020-08-22T10:40:31.437Z] include file start
06:40:31 [2020-08-22T10:40:31.437Z] include file processed
06:40:31 [2020-08-22T10:40:31.437Z] Result of testMethod = 5
06:40:31 [2020-08-22T10:40:31.693Z] Traceback (most recent call last):
06:40:31 [2020-08-22T10:40:31.693Z]   File "(none)", line 184, in run
06:40:31 [2020-08-22T10:40:31.693Z]   File "__ref_L/Debug Test/Main.py_uuhycubyoz", line 23, in <module>
06:40:31 [2020-08-22T10:40:31.693Z]   File "(none)", line 161, in trace_dispatch
06:40:31 [2020-08-22T10:40:31.693Z] org.eclipse.ease.ExitException: 
06:40:31 [2020-08-22T10:40:31.693Z] 
06:40:31 [2020-08-22T10:40:31.693Z] org.eclipse.ease.ExitException: org.eclipse.ease.ExitException: 
06:40:31 [2020-08-22T10:40:31.693Z] Start of script
06:40:31 [2020-08-22T10:40:31.948Z] include file start
06:40:31 [2020-08-22T10:40:31.948Z] include file processed
06:40:31 [2020-08-22T10:40:31.948Z] Result of testMethod = 5
06:40:31 [2020-08-22T10:40:31.948Z] End of script
06:40:31 [2020-08-22T10:40:31.948Z] Start of script
06:40:31 [2020-08-22T10:40:31.948Z] include file start
06:40:31 [2020-08-22T10:40:31.948Z] include file processed
06:40:32 [2020-08-22T10:40:32.204Z] Result of testMethod = 5
06:40:32 [2020-08-22T10:40:32.204Z] End of script
06:40:32 [2020-08-22T10:40:32.204Z] Start of script
06:40:32 [2020-08-22T10:40:32.204Z] include file start
06:40:32 [2020-08-22T10:40:32.204Z] include file processed
06:40:32 [2020-08-22T10:40:32.204Z] Result of testMethod = 5
06:40:32 [2020-08-22T10:40:32.204Z] End of script
06:40:32 [2020-08-22T10:40:32.460Z] Start of script
06:40:32 [2020-08-22T10:40:32.460Z] include file start
06:40:32 [2020-08-22T10:40:32.460Z] include file processed
06:40:32 [2020-08-22T10:40:32.460Z] Result of testMethod = 5
06:40:32 [2020-08-22T10:40:32.460Z] End of script
06:40:32 [2020-08-22T10:40:32.716Z] Start of script
06:40:32 [2020-08-22T10:40:32.716Z] include file start
06:40:32 [2020-08-22T10:40:32.716Z] include file processed
06:40:32 [2020-08-22T10:40:32.716Z] Traceback (most recent call last):
06:40:32 [2020-08-22T10:40:32.716Z]   File "(none)", line 184, in run
06:40:32 [2020-08-22T10:40:32.716Z]   File "__ref_L/Debug Test/Main.py_zrdhylgayk", line 21, in <module>
06:40:32 [2020-08-22T10:40:32.716Z]   File "__ref_L/Debug Test/Main.py_zrdhylgayk", line 18, in testMethod
06:40:32 [2020-08-22T10:40:32.716Z]   File "(none)", line 161, in trace_dispatch
06:40:32 [2020-08-22T10:40:32.716Z] org.eclipse.ease.ExitException: 
06:40:32 [2020-08-22T10:40:32.716Z] 
06:40:32 [2020-08-22T10:40:32.716Z] org.eclipse.ease.ExitException: org.eclipse.ease.ExitException: 
06:40:32 [2020-08-22T10:40:32.972Z] Start of script
06:40:33 [2020-08-22T10:40:33.228Z] include file start
06:40:33 [2020-08-22T10:40:33.228Z] include file processed
06:40:33 [2020-08-22T10:40:33.228Z] Result of testMethod = 5
06:40:33 [2020-08-22T10:40:33.228Z] End of script
06:40:33 [2020-08-22T10:40:33.228Z] Start of script
06:40:33 [2020-08-22T10:40:33.228Z] include file start
06:40:33 [2020-08-22T10:40:33.228Z] include file processed
06:40:33 [2020-08-22T10:40:33.228Z] Result of testMethod = 5
06:40:33 [2020-08-22T10:40:33.485Z] Traceback (most recent call last):
06:40:33 [2020-08-22T10:40:33.485Z]   File "(none)", line 184, in run
06:40:33 [2020-08-22T10:40:33.485Z]   File "__ref_L/Debug Test/Main.py_zcvsdzocbj", line 23, in <module>
06:40:33 [2020-08-22T10:40:33.485Z]   File "(none)", line 161, in trace_dispatch
06:40:33 [2020-08-22T10:40:33.485Z] org.eclipse.ease.ExitException: 
06:40:33 [2020-08-22T10:40:33.485Z] 
06:40:33 [2020-08-22T10:40:33.485Z] org.eclipse.ease.ExitException: org.eclipse.ease.ExitException: 
06:40:33 [2020-08-22T10:40:33.485Z] Start of script
06:40:33 [2020-08-22T10:40:33.485Z] include file start
06:40:33 [2020-08-22T10:40:33.485Z] include file processed
06:40:33 [2020-08-22T10:40:33.485Z] Result of testMethod = 5
06:40:33 [2020-08-22T10:40:33.740Z] End of script
06:40:33 [2020-08-22T10:40:33.740Z] Start of script
06:40:33 [2020-08-22T10:40:33.740Z] include file start
06:40:33 [2020-08-22T10:40:33.740Z] include file processed
06:40:33 [2020-08-22T10:40:33.996Z] Result of testMethod = 5
06:40:33 [2020-08-22T10:40:33.996Z] End of script
06:40:33 [2020-08-22T10:40:33.996Z] Start of script
06:40:33 [2020-08-22T10:40:33.996Z] include file start
06:40:33 [2020-08-22T10:40:33.996Z] include file processed
06:40:34 [2020-08-22T10:40:34.252Z] Result of testMethod = 5
06:40:34 [2020-08-22T10:40:34.252Z] End of script
06:40:34 [2020-08-22T10:40:34.507Z] Start of script
06:40:34 [2020-08-22T10:40:34.507Z] include file start
06:40:34 [2020-08-22T10:40:34.507Z] include file processed
06:40:34 [2020-08-22T10:40:34.507Z] Result of testMethod = 5
06:40:34 [2020-08-22T10:40:34.507Z] End of script
06:40:34 [2020-08-22T10:40:34.507Z] Start of script
06:40:34 [2020-08-22T10:40:34.507Z] include file start
06:40:34 [2020-08-22T10:40:34.507Z] include file processed
06:40:34 [2020-08-22T10:40:34.507Z] Result of testMethod = 5
06:40:34 [2020-08-22T10:40:34.763Z] Traceback (most recent call last):
06:40:34 [2020-08-22T10:40:34.763Z]   File "(none)", line 184, in run
06:40:34 [2020-08-22T10:40:34.763Z]   File "__ref_L/Debug Test/Main.py_ceienqiqli", line 23, in <module>
06:40:34 [2020-08-22T10:40:34.763Z]   File "(none)", line 161, in trace_dispatch
06:40:34 [2020-08-22T10:40:34.763Z] org.eclipse.ease.ExitException: 
06:40:34 [2020-08-22T10:40:34.763Z] 
06:40:34 [2020-08-22T10:40:34.763Z] org.eclipse.ease.ExitException: org.eclipse.ease.ExitException: 
06:40:35 [2020-08-22T10:40:35.018Z] Start of script
06:40:35 [2020-08-22T10:40:35.018Z] include file start
06:40:35 [2020-08-22T10:40:35.018Z] include file processed
06:40:35 [2020-08-22T10:40:35.018Z] Result of testMethod = 5
06:40:35 [2020-08-22T10:40:35.018Z] End of script
06:40:35 [2020-08-22T10:40:35.018Z] Start of script
06:40:35 [2020-08-22T10:40:35.018Z] include file start
06:40:35 [2020-08-22T10:40:35.018Z] include file processed
06:40:35 [2020-08-22T10:40:35.018Z] Result of testMethod = 5
06:40:35 [2020-08-22T10:40:35.274Z] Traceback (most recent call last):
06:40:35 [2020-08-22T10:40:35.274Z]   File "(none)", line 184, in run
06:40:35 [2020-08-22T10:40:35.274Z]   File "__ref_L/Debug Test/Main.py_gftfpuawph", line 23, in <module>
06:40:35 [2020-08-22T10:40:35.274Z]   File "(none)", line 161, in trace_dispatch
06:40:35 [2020-08-22T10:40:35.274Z] org.eclipse.ease.ExitException: 
06:40:35 [2020-08-22T10:40:35.274Z] 
06:40:35 [2020-08-22T10:40:35.274Z] org.eclipse.ease.ExitException: org.eclipse.ease.ExitException: 
06:40:35 [2020-08-22T10:40:35.531Z] Traceback (most recent call last):
06:40:35 [2020-08-22T10:40:35.531Z]   File "(none)", line 184, in run
06:40:35 [2020-08-22T10:40:35.531Z]   File "__ref_L/Debug Test/Main.py_ocqgmxxbxs", line 1, in <module>
06:40:35 [2020-08-22T10:40:35.531Z]   File "(none)", line 161, in trace_dispatch
06:40:35 [2020-08-22T10:40:35.531Z] org.eclipse.ease.ExitException: 
06:40:35 [2020-08-22T10:40:35.531Z] 
06:40:35 [2020-08-22T10:40:35.531Z] org.eclipse.ease.ExitException: org.eclipse.ease.ExitException: 
06:40:35 [2020-08-22T10:40:35.787Z] Start of script
06:40:35 [2020-08-22T10:40:35.787Z] include file start
06:40:35 [2020-08-22T10:40:35.787Z] include file processed
06:40:35 [2020-08-22T10:40:35.787Z] Result of testMethod = 5
06:40:35 [2020-08-22T10:40:35.787Z] End of script
06:40:35 [2020-08-22T10:40:35.787Z] Start of script
06:40:35 [2020-08-22T10:40:35.787Z] include file start
06:40:35 [2020-08-22T10:40:35.787Z] include file processed
06:40:36 [2020-08-22T10:40:36.043Z] Result of testMethod = 5
06:40:36 [2020-08-22T10:40:36.043Z] End of script
06:40:36 [2020-08-22T10:40:36.043Z] Start of script
06:40:36 [2020-08-22T10:40:36.043Z] include file start
06:40:36 [2020-08-22T10:40:36.043Z] include file processed
06:40:36 [2020-08-22T10:40:36.043Z] Result of testMethod = 5
06:40:36 [2020-08-22T10:40:36.298Z] End of script
06:40:36 [2020-08-22T10:40:36.298Z] Tests run: 42, Failures: 1, Errors: 0, Skipped: 0, Time elapsed: 12.152 s <<< FAILURE! - in org.eclipse.ease.lang.python.jython.debugger.JythonDebugTest
06:40:36 [2020-08-22T10:40:36.298Z] disconnectProcessInSuspendedState(org.eclipse.ease.lang.python.jython.debugger.JythonDebugTest)  Time elapsed: 1.564 s
06:40:36 [2020-08-22T10:40:36.298Z] stepReturnIncludeCommand(org.eclipse.ease.lang.python.jython.debugger.JythonDebugTest)  Time elapsed: 0.21 s
06:40:36 [2020-08-22T10:40:36.298Z] arrayVariableSorting(org.eclipse.ease.lang.python.jython.debugger.JythonDebugTest)  Time elapsed: 0.307 s
06:40:36 [2020-08-22T10:40:36.298Z] stepOverOnDebugTarget(org.eclipse.ease.lang.python.jython.debugger.JythonDebugTest)  Time elapsed: 0.308 s
06:40:36 [2020-08-22T10:40:36.298Z] hasDebugTarget(org.eclipse.ease.lang.python.jython.debugger.JythonDebugTest)  Time elapsed: 0.105 s
06:40:36 [2020-08-22T10:40:36.298Z] disconnectThreadInSuspendedState(org.eclipse.ease.lang.python.jython.debugger.JythonDebugTest)  Time elapsed: 0.206 s
06:40:36 [2020-08-22T10:40:36.298Z] stepReturnOnDebugTarget(org.eclipse.ease.lang.python.jython.debugger.JythonDebugTest)  Time elapsed: 0.308 s
06:40:36 [2020-08-22T10:40:36.298Z] nullVariable(org.eclipse.ease.lang.python.jython.debugger.JythonDebugTest)  Time elapsed: 0.307 s
06:40:36 [2020-08-22T10:40:36.298Z] stepOverOnStackFrame(org.eclipse.ease.lang.python.jython.debugger.JythonDebugTest)  Time elapsed: 0.306 s
06:40:36 [2020-08-22T10:40:36.298Z] resumeOnDebugTarget(org.eclipse.ease.lang.python.jython.debugger.JythonDebugTest)  Time elapsed: 0.206 s
06:40:36 [2020-08-22T10:40:36.298Z] modifyVariableKeepingType(org.eclipse.ease.lang.python.jython.debugger.JythonDebugTest)  Time elapsed: 0.505 s
06:40:36 [2020-08-22T10:40:36.298Z] resumeOnLastIncludeLine(org.eclipse.ease.lang.python.jython.debugger.JythonDebugTest)  Time elapsed: 0.206 s
06:40:36 [2020-08-22T10:40:36.298Z] stepReturnOnStackFrame(org.eclipse.ease.lang.python.jython.debugger.JythonDebugTest)  Time elapsed: 0.306 s
06:40:36 [2020-08-22T10:40:36.298Z] terminateStackFrameInSuspendedState(org.eclipse.ease.lang.python.jython.debugger.JythonDebugTest)  Time elapsed: 0.207 s
06:40:36 [2020-08-22T10:40:36.298Z] breakpointLocation(org.eclipse.ease.lang.python.jython.debugger.JythonDebugTest)  Time elapsed: 0.206 s
06:40:36 [2020-08-22T10:40:36.298Z] stepReturnOnThread(org.eclipse.ease.lang.python.jython.debugger.JythonDebugTest)  Time elapsed: 0.308 s
06:40:36 [2020-08-22T10:40:36.298Z] javaClassVariable(org.eclipse.ease.lang.python.jython.debugger.JythonDebugTest)  Time elapsed: 0.107 s  <<< FAILURE!
06:40:36 [2020-08-22T10:40:36.298Z] java.lang.AssertionError: expected:<1> but was:<0>
06:40:36 [2020-08-22T10:40:36.298Z] 
06:40:36 [2020-08-22T10:40:36.298Z] stepIntoOnThread(org.eclipse.ease.lang.python.jython.debugger.JythonDebugTest)  Time elapsed: 0.306 s
06:40:36 [2020-08-22T10:40:36.298Z] terminateThreadInSuspendedState(org.eclipse.ease.lang.python.jython.debugger.JythonDebugTest)  Time elapsed: 0.206 s
06:40:36 [2020-08-22T10:40:36.298Z] resumeOnThread(org.eclipse.ease.lang.python.jython.debugger.JythonDebugTest)  Time elapsed: 0.205 s
06:40:36 [2020-08-22T10:40:36.298Z] stepIntoOnStackFrame(org.eclipse.ease.lang.python.jython.debugger.JythonDebugTest)  Time elapsed: 0.306 s
06:40:36 [2020-08-22T10:40:36.298Z] terminateProcessInSuspendedState(org.eclipse.ease.lang.python.jython.debugger.JythonDebugTest)  Time elapsed: 0.205 s
06:40:36 [2020-08-22T10:40:36.298Z] stepOverOnProcess(org.eclipse.ease.lang.python.jython.debugger.JythonDebugTest)  Time elapsed: 0.307 s
06:40:36 [2020-08-22T10:40:36.298Z] nativeArrayVariable(org.eclipse.ease.lang.python.jython.debugger.JythonDebugTest)  Time elapsed: 0.307 s
06:40:36 [2020-08-22T10:40:36.298Z] disconnectDebugTargetInSuspendedState(org.eclipse.ease.lang.python.jython.debugger.JythonDebugTest)  Time elapsed: 0.205 s
06:40:36 [2020-08-22T10:40:36.298Z] stepIntoOnProcess(org.eclipse.ease.lang.python.jython.debugger.JythonDebugTest)  Time elapsed: 0.307 s
06:40:36 [2020-08-22T10:40:36.298Z] terminatedState(org.eclipse.ease.lang.python.jython.debugger.JythonDebugTest)  Time elapsed: 0.104 s
06:40:36 [2020-08-22T10:40:36.298Z] stepOverIncludeCommand(org.eclipse.ease.lang.python.jython.debugger.JythonDebugTest)  Time elapsed: 0.305 s
06:40:36 [2020-08-22T10:40:36.298Z] innerScopeVariableBeforeOuterScopeVariable(org.eclipse.ease.lang.python.jython.debugger.JythonDebugTest)  Time elapsed: 0.306 s
06:40:36 [2020-08-22T10:40:36.298Z] stepIntoIncludeCommand(org.eclipse.ease.lang.python.jython.debugger.JythonDebugTest)  Time elapsed: 0.305 s
06:40:36 [2020-08-22T10:40:36.298Z] primitiveStringVariable(org.eclipse.ease.lang.python.jython.debugger.JythonDebugTest)  Time elapsed: 0.306 s
06:40:36 [2020-08-22T10:40:36.298Z] resumeOnProcess(org.eclipse.ease.lang.python.jython.debugger.JythonDebugTest)  Time elapsed: 0.205 s
06:40:36 [2020-08-22T10:40:36.298Z] stepIntoOnDebugTarget(org.eclipse.ease.lang.python.jython.debugger.JythonDebugTest)  Time elapsed: 0.306 s
06:40:36 [2020-08-22T10:40:36.298Z] stepOverOnThread(org.eclipse.ease.lang.python.jython.debugger.JythonDebugTest)  Time elapsed: 0.307 s
06:40:36 [2020-08-22T10:40:36.298Z] suspendedState(org.eclipse.ease.lang.python.jython.debugger.JythonDebugTest)  Time elapsed: 0.204 s
06:40:36 [2020-08-22T10:40:36.299Z] primitiveDoubleVariable(org.eclipse.ease.lang.python.jython.debugger.JythonDebugTest)  Time elapsed: 0.304 s
06:40:36 [2020-08-22T10:40:36.299Z] resumeOnStackFrame(org.eclipse.ease.lang.python.jython.debugger.JythonDebugTest)  Time elapsed: 0.206 s
06:40:36 [2020-08-22T10:40:36.299Z] nativeObjectVariable(org.eclipse.ease.lang.python.jython.debugger.JythonDebugTest)  Time elapsed: 0.323 s
06:40:36 [2020-08-22T10:40:36.299Z] terminateDebugTargetInSuspendedState(org.eclipse.ease.lang.python.jython.debugger.JythonDebugTest)  Time elapsed: 0.206 s
06:40:36 [2020-08-22T10:40:36.299Z] disconnectStackFrameInSuspendedState(org.eclipse.ease.lang.python.jython.debugger.JythonDebugTest)  Time elapsed: 0.205 s
06:40:36 [2020-08-22T10:40:36.299Z] stepReturnOnProcess(org.eclipse.ease.lang.python.jython.debugger.JythonDebugTest)  Time elapsed: 0.306 s
06:40:36 [2020-08-22T10:40:36.299Z] evaluateWatchExpression(org.eclipse.ease.lang.python.jython.debugger.JythonDebugTest)  Time elapsed: 0.208 s
06:40:36 [2020-08-22T10:40:36.299Z] 
06:40:36 [2020-08-22T10:40:36.299Z] Results:
06:40:36 [2020-08-22T10:40:36.299Z] 
06:40:36 [2020-08-22T10:40:36.299Z] Failures: 
06:40:36 [2020-08-22T10:40:36.299Z]   JythonDebugTest>AbstractDebugTest.javaClassVariable:963 expected:<1> but was:<0>
06:40:36 [2020-08-22T10:40:36.299Z] 
06:40:36 [2020-08-22T10:40:36.299Z] Tests run: 42, Failures: 1, Errors: 0, Skipped: 0
06:40:36 [2020-08-22T10:40:36.299Z] 
06:40:37 [2020-08-22T10:40:37.227Z] [INFO] ------------------------------------------------------------------------
06:40:37 [2020-08-22T10:40:37.227Z] [INFO] Reactor Summary:
06:40:37 [2020-08-22T10:40:37.227Z] [INFO] 
06:40:37 [2020-08-22T10:40:37.227Z] [INFO] org.eclipse.ease.releng 0.8.0-SNAPSHOT ............. SUCCESS [  6.120 s]
06:40:37 [2020-08-22T10:40:37.227Z] [INFO] org.eclipse.ease.classloader 0.8.0-SNAPSHOT ........ SUCCESS [  4.171 s]
06:40:37 [2020-08-22T10:40:37.227Z] [INFO] org.eclipse.ease 0.8.0-SNAPSHOT .................... SUCCESS [  2.536 s]
06:40:37 [2020-08-22T10:40:37.227Z] [INFO] org.eclipse.ease.ui 0.8.0-SNAPSHOT ................. SUCCESS [  2.476 s]
06:40:37 [2020-08-22T10:40:37.227Z] [INFO] org.eclipse.ease.ui.completions.java 0.8.0-SNAPSHOT  SUCCESS [  1.738 s]
06:40:37 [2020-08-22T10:40:37.227Z] [INFO] org.eclipse.ease.ui.scripts 0.8.0-SNAPSHOT ......... SUCCESS [  2.095 s]
06:40:37 [2020-08-22T10:40:37.227Z] [INFO] org.eclipse.ease.lang.javascript 0.8.0-SNAPSHOT .... SUCCESS [  1.408 s]
06:40:37 [2020-08-22T10:40:37.227Z] [INFO] org.eclipse.ease.lang.scriptarchive 0.8.0-SNAPSHOT . SUCCESS [  1.391 s]
06:40:37 [2020-08-22T10:40:37.227Z] [INFO] org.eclipse.ease.lang.python 0.8.0-SNAPSHOT ........ SUCCESS [  1.550 s]
06:40:37 [2020-08-22T10:40:37.227Z] [INFO] org.eclipse.ease.lang.python.py4j 0.8.0-SNAPSHOT ... SUCCESS [  1.450 s]
06:40:37 [2020-08-22T10:40:37.227Z] [INFO] org.eclipse.ease.lang.groovy 0.8.0-SNAPSHOT ........ SUCCESS [  1.545 s]
06:40:37 [2020-08-22T10:40:37.227Z] [INFO] org.eclipse.ease.lang.groovy.interpreter 0.8.0-SNAPSHOT SUCCESS [  1.479 s]
06:40:37 [2020-08-22T10:40:37.227Z] [INFO] org.eclipse.ease.lang.unittest 0.8.0-SNAPSHOT ...... SUCCESS [  1.883 s]
06:40:37 [2020-08-22T10:40:37.227Z] [INFO] org.eclipse.ease.lang.unittest.ui 0.8.0-SNAPSHOT ... SUCCESS [  1.763 s]
06:40:37 [2020-08-22T10:40:37.227Z] [INFO] org.eclipse.ease.lang.ruby 0.8.0-SNAPSHOT .......... SUCCESS [  1.289 s]
06:40:37 [2020-08-22T10:40:37.227Z] [INFO] org.eclipse.ease.lang.ruby.jruby 0.8.0-SNAPSHOT .... SUCCESS [  1.501 s]
06:40:37 [2020-08-22T10:40:37.227Z] [INFO] org.eclipse.ease.lang.javascript.nashorn 0.8.0-SNAPSHOT SUCCESS [  1.431 s]
06:40:37 [2020-08-22T10:40:37.227Z] [INFO] org.eclipse.ease.lang.javascript.rhino 0.8.0-SNAPSHOT SUCCESS [  1.694 s]
06:40:37 [2020-08-22T10:40:37.227Z] [INFO] org.eclipse.ease.lang.python.jython 0.8.0-SNAPSHOT . SUCCESS [  1.516 s]
06:40:37 [2020-08-22T10:40:37.227Z] [INFO] org.eclipse.ease.lang.javascript.ui 0.8.0-SNAPSHOT . SUCCESS [  1.496 s]
06:40:37 [2020-08-22T10:40:37.227Z] [INFO] org.eclipse.ease.lang.jvm.compiled 0.8.0-SNAPSHOT .. SUCCESS [  1.347 s]
06:40:37 [2020-08-22T10:40:37.227Z] [INFO] org.eclipse.ease.lang.scriptarchive.ui 0.8.0-SNAPSHOT SUCCESS [  1.517 s]
06:40:37 [2020-08-22T10:40:37.227Z] [INFO] org.eclipse.ease.help 0.8.0-SNAPSHOT ............... SUCCESS [  0.091 s]
06:40:37 [2020-08-22T10:40:37.227Z] [INFO] org.eclipse.ease.feature 0.8.0-SNAPSHOT ............ SUCCESS [  0.118 s]
06:40:37 [2020-08-22T10:40:37.227Z] [INFO] org.eclipse.ease.ui.feature 0.8.0-SNAPSHOT ......... SUCCESS [  0.392 s]
06:40:37 [2020-08-22T10:40:37.227Z] [INFO] org.eclipse.ease.lang.javascript.feature 0.8.0-SNAPSHOT SUCCESS [  0.078 s]
06:40:37 [2020-08-22T10:40:37.227Z] [INFO] org.eclipse.ease.lang.python.feature 0.8.0-SNAPSHOT  SUCCESS [  0.092 s]
06:40:37 [2020-08-22T10:40:37.227Z] [INFO] org.eclipse.ease.python.jython.feature 0.8.0-SNAPSHOT SUCCESS [  0.073 s]
06:40:37 [2020-08-22T10:40:37.227Z] [INFO] org.eclipse.ease.lang.python.py4j.feature 0.8.0-SNAPSHOT SUCCESS [  0.082 s]
06:40:37 [2020-08-22T10:40:37.227Z] [INFO] org.eclipse.ease.lang.jvm.feature 0.8.0-SNAPSHOT ... SUCCESS [  0.089 s]
06:40:37 [2020-08-22T10:40:37.227Z] [INFO] org.eclipse.ease.lang.groovy.feature 0.8.0-SNAPSHOT  SUCCESS [  0.082 s]
06:40:37 [2020-08-22T10:40:37.227Z] [INFO] org.eclipse.ease.lang.ruby.feature 0.8.0-SNAPSHOT .. SUCCESS [  0.094 s]
06:40:37 [2020-08-22T10:40:37.227Z] [INFO] org.eclipse.ease.lang.scriptarchive.feature 0.8.0-SNAPSHOT SUCCESS [  0.084 s]
06:40:37 [2020-08-22T10:40:37.227Z] [INFO] org.eclipse.ease.lang.unittest.feature 0.8.0-SNAPSHOT SUCCESS [  0.073 s]
06:40:37 [2020-08-22T10:40:37.227Z] [INFO] org.eclipse.ease.releng.target 0.8.0-SNAPSHOT ...... SUCCESS [  0.008 s]
06:40:37 [2020-08-22T10:40:37.227Z] [INFO] org.eclipse.ease.releng.p2 0.8.0-SNAPSHOT .......... SUCCESS [  2.592 s]
06:40:37 [2020-08-22T10:40:37.227Z] [INFO] org.eclipse.ease.testhelper 0.8.0-SNAPSHOT ......... SUCCESS [  1.372 s]
06:40:37 [2020-08-22T10:40:37.227Z] [INFO] org.eclipse.ease.test 0.8.0-SNAPSHOT ............... SUCCESS [ 13.376 s]
06:40:37 [2020-08-22T10:40:37.227Z] [INFO] org.eclipse.ease.lang.javascript.nashorn.test 0.8.0-SNAPSHOT SUCCESS [  3.782 s]
06:40:37 [2020-08-22T10:40:37.227Z] [INFO] org.eclipse.ease.lang.javascript.rhino.test 0.8.0-SNAPSHOT SUCCESS [ 15.095 s]
06:40:37 [2020-08-22T10:40:37.227Z] [INFO] org.eclipse.ease.lang.javascript.test 0.8.0-SNAPSHOT SUCCESS [  3.448 s]
06:40:37 [2020-08-22T10:40:37.227Z] [INFO] org.eclipse.ease.lang.python.test 0.8.0-SNAPSHOT ... SUCCESS [  3.151 s]
06:40:37 [2020-08-22T10:40:37.227Z] [INFO] org.eclipse.ease.lang.python.jython.test 0.8.0-SNAPSHOT FAILURE [ 16.806 s]
06:40:37 [2020-08-22T10:40:37.227Z] [INFO] org.eclipse.ease.lang.python.py4j.test 0.8.0-SNAPSHOT SKIPPED
06:40:37 [2020-08-22T10:40:37.227Z] [INFO] org.eclipse.ease.lang.scriptarchive.test 0.8.0-SNAPSHOT SKIPPED
06:40:37 [2020-08-22T10:40:37.227Z] [INFO] org.eclipse.ease.lang.unittest.test 0.8.0-SNAPSHOT . SKIPPED
06:40:37 [2020-08-22T10:40:37.227Z] [INFO] org.eclipse.ease.ui.test 0.8.0-SNAPSHOT ............ SKIPPED
06:40:37 [2020-08-22T10:40:37.227Z] [INFO] EASE (Incubation) 0.4.0-SNAPSHOT ................... SKIPPED
06:40:37 [2020-08-22T10:40:37.227Z] [INFO] ------------------------------------------------------------------------
06:40:37 [2020-08-22T10:40:37.227Z] [INFO] BUILD FAILURE
06:40:37 [2020-08-22T10:40:37.227Z] [INFO] ------------------------------------------------------------------------
06:40:37 [2020-08-22T10:40:37.227Z] [INFO] Total time:  04:10 min
06:40:37 [2020-08-22T10:40:37.227Z] [INFO] Finished at: 2020-08-22T10:40:36Z
06:40:37 [2020-08-22T10:40:37.227Z] [INFO] ------------------------------------------------------------------------
06:40:37 [2020-08-22T10:40:37.227Z] [INFO] [jenkins-event-spy] Generated /home/jenkins/agent/workspace/ease.verify.core.target.2019-12@tmp/withMavend43eb3e6/maven-spy-20200822-103626-4496892238950385764071.log
06:40:37 [2020-08-22T10:40:37.227Z] [ERROR] Failed to execute goal org.eclipse.tycho:tycho-surefire-plugin:1.3.0:test (default-test) on project org.eclipse.ease.lang.python.jython.test: There are test failures.
06:40:37 [2020-08-22T10:40:37.227Z] [ERROR] 
06:40:37 [2020-08-22T10:40:37.228Z] [ERROR] Please refer to /home/jenkins/agent/workspace/ease.verify.core.target.2019-12/tests/org.eclipse.ease.lang.python.jython.test/target/surefire-reports for the individual test results.
06:40:37 [2020-08-22T10:40:37.228Z] [ERROR] -> [Help 1]
06:40:37 [2020-08-22T10:40:37.228Z] [ERROR] 
06:40:37 [2020-08-22T10:40:37.228Z] [ERROR] To see the full stack trace of the errors, re-run Maven with the -e switch.
06:40:37 [2020-08-22T10:40:37.228Z] [ERROR] Re-run Maven using the -X switch to enable full debug logging.
06:40:37 [2020-08-22T10:40:37.228Z] [ERROR] 
06:40:37 [2020-08-22T10:40:37.228Z] [ERROR] For more information about the errors and possible solutions, please read the following articles:
06:40:37 [2020-08-22T10:40:37.228Z] [ERROR] [Help 1] http://cwiki.apache.org/confluence/display/MAVEN/MojoFailureException
06:40:37 [2020-08-22T10:40:37.228Z] [ERROR] 
06:40:37 [2020-08-22T10:40:37.228Z] [ERROR] After correcting the problems, you can resume the build with the command
06:40:37 [2020-08-22T10:40:37.228Z] [ERROR]   mvn <args> -rf :org.eclipse.ease.lang.python.jython.test
[Pipeline] }
06:40:39 [2020-08-22T10:40:39.241Z] [withMaven] Publishers: Pipeline Graph Publisher: 34 ms, Invoker Publisher: 1 ms, Junit Publisher: 1 ms, Dependencies Fingerprint Publisher: 809 ms, Findbugs Publisher: 1 ms
[Pipeline] // withMaven
[Pipeline] }
[Pipeline] // stage
[Pipeline] stage
[Pipeline] { (Test)
Stage "Test" skipped due to earlier failure(s)
[Pipeline] }
[Pipeline] // stage
[Pipeline] stage
[Pipeline] { (Declarative: Post Actions)
[Pipeline] archiveArtifacts
06:40:39 [2020-08-22T10:40:39.287Z] Archiving artifacts
[Pipeline] emailext
06:40:50 [2020-08-22T10:40:50.680Z] Sending email to: christian.pontesegger@web.de
[Pipeline] }
[Pipeline] // stage
[Pipeline] }
[Pipeline] // timeout
[Pipeline] }
[Pipeline] // timestamps
[Pipeline] }
[Pipeline] // node
[Pipeline] End of Pipeline
ERROR: script returned exit code 1
Finished: FAILURE