FailedConsole Output

Skipping 993 KB.. Full Log
e/jenkins/agent/workspace/ease.verify.core.target.2019-12/tests/org.eclipse.ease.lang.scriptarchive.test/pom.xml
06:42:06 [2020-08-08T10:42:06.903Z] [WARNING] The following locally built units have been used to resolve project dependencies:
06:42:06 [2020-08-08T10:42:06.903Z] [WARNING]   org.eclipse.ease.ui/0.8.0.I202007081155
06:42:06 [2020-08-08T10:42:06.903Z] [WARNING]   org.eclipse.ease.lang.javascript.rhino/0.8.0.I202003021730
06:42:06 [2020-08-08T10:42:06.903Z] [WARNING]   org.eclipse.ease.lang.javascript/0.8.0.I202007150818
06:42:06 [2020-08-08T10:42:06.903Z] [WARNING]   org.eclipse.ease.lang.scriptarchive/0.8.0.I201910171213
06:42:06 [2020-08-08T10:42:06.903Z] [WARNING]   org.eclipse.ease.classloader/0.8.0.I201910171213
06:42:06 [2020-08-08T10:42:06.903Z] [WARNING]   org.eclipse.ease/0.8.0.I202007081054
06:42:06 [2020-08-08T10:42:06.903Z] [INFO] Resolving class path of MavenProject: org.eclipse.ease:org.eclipse.ease.lang.scriptarchive.test:0.8.0-SNAPSHOT @ /home/jenkins/agent/workspace/ease.verify.core.target.2019-12/tests/org.eclipse.ease.lang.scriptarchive.test/pom.xml
06:42:07 [2020-08-08T10:42:07.158Z] [INFO] Computing target platform for MavenProject: org.eclipse.ease:org.eclipse.ease.ui.test:0.8.0-SNAPSHOT @ /home/jenkins/agent/workspace/ease.verify.core.target.2019-12/tests/org.eclipse.ease.ui.test/pom.xml
06:42:07 [2020-08-08T10:42:07.158Z] [INFO] Resolving dependencies of MavenProject: org.eclipse.ease:org.eclipse.ease.ui.test:0.8.0-SNAPSHOT @ /home/jenkins/agent/workspace/ease.verify.core.target.2019-12/tests/org.eclipse.ease.ui.test/pom.xml
06:42:07 [2020-08-08T10:42:07.159Z] [INFO] Fetching org.apache.lucene.analyzers-common_8.0.0.v20190404-1858.jar.pack.gz from http://download.eclipse.org/releases/2019-12/201912181000/plugins/ (687.76kB)
06:42:07 [2020-08-08T10:42:07.159Z] [INFO] Fetching org.apache.lucene.analyzers-common_8.0.0.v20190404-1858.jar.pack.gz from http://download.eclipse.org/releases/2019-12/201912181000/plugins/ (687.76kB)
06:42:07 [2020-08-08T10:42:07.719Z] [INFO] Fetching org.apache.lucene.core_8.0.0.v20190404-1858.jar.pack.gz from http://download.eclipse.org/releases/2019-12/201912181000/plugins/ (923.82kB)
06:42:07 [2020-08-08T10:42:07.719Z] [INFO] Fetching org.apache.lucene.core_8.0.0.v20190404-1858.jar.pack.gz from http://download.eclipse.org/releases/2019-12/201912181000/plugins/ (923.82kB)
06:42:08 [2020-08-08T10:42:08.645Z] [INFO] Fetching org.apache.lucene.analyzers-smartcn_8.0.0.v20190404-1858.jar.pack.gz from http://download.eclipse.org/releases/2019-12/201912181000/plugins/ (3.42MB)
06:42:08 [2020-08-08T10:42:08.645Z] [INFO] Fetching org.apache.lucene.analyzers-smartcn_8.0.0.v20190404-1858.jar.pack.gz from http://download.eclipse.org/releases/2019-12/201912181000/plugins/ (3.42MB)
06:42:09 [2020-08-08T10:42:09.206Z] [INFO] Fetching org.eclipse.jdt.ui_3.20.0.v20191203-1301.jar.pack.gz from http://download.eclipse.org/releases/2019-12/201912181000/plugins/ (3.9MB)
06:42:09 [2020-08-08T10:42:09.207Z] [INFO] Fetching org.eclipse.jdt.ui_3.20.0.v20191203-1301.jar.pack.gz from http://download.eclipse.org/releases/2019-12/201912181000/plugins/ (3.9MB)
06:42:11 [2020-08-08T10:42:11.721Z] [INFO] Fetching org.eclipse.jdt.core_3.20.0.v20191203-2131.jar from http://download.eclipse.org/releases/2019-12/201912181000/plugins/ (6.71MB)
06:42:11 [2020-08-08T10:42:11.721Z] [INFO] Fetching org.eclipse.jdt.core_3.20.0.v20191203-2131.jar from http://download.eclipse.org/releases/2019-12/201912181000/plugins/ (6.71MB)
06:42:12 [2020-08-08T10:42:12.649Z] [INFO] Fetching org.objectweb.asm_7.2.0.v20191010-1910.jar.pack.gz from http://download.eclipse.org/releases/2019-12/201912181000/plugins/ (58.83kB)
06:42:12 [2020-08-08T10:42:12.649Z] [INFO] Fetching org.objectweb.asm_7.2.0.v20191010-1910.jar.pack.gz from http://download.eclipse.org/releases/2019-12/201912181000/plugins/ (58.83kB)
06:42:12 [2020-08-08T10:42:12.649Z] [INFO] Fetching org.eclipse.help.ui_4.1.700.v20191123-0656.jar.pack.gz from http://download.eclipse.org/releases/2019-12/201912181000/plugins/ (204.92kB)
06:42:12 [2020-08-08T10:42:12.649Z] [INFO] Fetching org.eclipse.help.ui_4.1.700.v20191123-0656.jar.pack.gz from http://download.eclipse.org/releases/2019-12/201912181000/plugins/ (204.92kB)
06:42:12 [2020-08-08T10:42:12.906Z] [INFO] Fetching org.eclipse.help.webapp_3.9.700.v20191123-0656.jar.pack.gz from http://download.eclipse.org/releases/2019-12/201912181000/plugins/ (284.94kB)
06:42:12 [2020-08-08T10:42:12.906Z] [INFO] Fetching org.eclipse.help.webapp_3.9.700.v20191123-0656.jar.pack.gz from http://download.eclipse.org/releases/2019-12/201912181000/plugins/ (284.94kB)
06:42:13 [2020-08-08T10:42:13.161Z] [INFO] Fetching org.eclipse.equinox.http.jetty_3.7.300.v20191015-2006.jar.pack.gz from http://download.eclipse.org/releases/2019-12/201912181000/plugins/ (16.29kB)
06:42:13 [2020-08-08T10:42:13.161Z] [INFO] Fetching org.eclipse.equinox.http.jetty_3.7.300.v20191015-2006.jar.pack.gz from http://download.eclipse.org/releases/2019-12/201912181000/plugins/ (16.29kB)
06:42:13 [2020-08-08T10:42:13.161Z] [INFO] Fetching org.eclipse.ui.browser_3.6.600.v20191122-2109.jar.pack.gz from http://download.eclipse.org/releases/2019-12/201912181000/plugins/ (97.35kB)
06:42:13 [2020-08-08T10:42:13.161Z] [INFO] Fetching org.eclipse.ui.browser_3.6.600.v20191122-2109.jar.pack.gz from http://download.eclipse.org/releases/2019-12/201912181000/plugins/ (97.35kB)
06:42:13 [2020-08-08T10:42:13.418Z] [INFO] Fetching org.eclipse.equinox.http.servlet_1.6.300.v20191011-1612.jar.pack.gz from http://download.eclipse.org/releases/2019-12/201912181000/plugins/ (76.5kB)
06:42:13 [2020-08-08T10:42:13.418Z] [INFO] Fetching org.eclipse.equinox.http.servlet_1.6.300.v20191011-1612.jar.pack.gz from http://download.eclipse.org/releases/2019-12/201912181000/plugins/ (76.5kB)
06:42:13 [2020-08-08T10:42:13.418Z] [INFO] Fetching org.eclipse.jetty.http_9.4.24.v20191120.jar from http://download.eclipse.org/releases/2019-12/201912181000/plugins/ (219.72kB)
06:42:13 [2020-08-08T10:42:13.418Z] [INFO] Fetching org.eclipse.jetty.http_9.4.24.v20191120.jar from http://download.eclipse.org/releases/2019-12/201912181000/plugins/ (219.72kB)
06:42:13 [2020-08-08T10:42:13.673Z] [INFO] Fetching org.eclipse.jetty.server_9.4.24.v20191120.jar from http://download.eclipse.org/releases/2019-12/201912181000/plugins/ (691.08kB)
06:42:13 [2020-08-08T10:42:13.673Z] [INFO] Fetching org.eclipse.jetty.server_9.4.24.v20191120.jar from http://download.eclipse.org/releases/2019-12/201912181000/plugins/ (691.08kB)
06:42:13 [2020-08-08T10:42:13.673Z] [INFO] Fetching org.eclipse.jetty.servlet_9.4.24.v20191120.jar from http://download.eclipse.org/releases/2019-12/201912181000/plugins/ (139.05kB)
06:42:13 [2020-08-08T10:42:13.674Z] [INFO] Fetching org.eclipse.jetty.servlet_9.4.24.v20191120.jar from http://download.eclipse.org/releases/2019-12/201912181000/plugins/ (139.05kB)
06:42:13 [2020-08-08T10:42:13.929Z] [INFO] Fetching org.eclipse.jetty.util_9.4.24.v20191120.jar from http://download.eclipse.org/releases/2019-12/201912181000/plugins/ (571.31kB)
06:42:13 [2020-08-08T10:42:13.929Z] [INFO] Fetching org.eclipse.jetty.util_9.4.24.v20191120.jar from http://download.eclipse.org/releases/2019-12/201912181000/plugins/ (571.31kB)
06:42:13 [2020-08-08T10:42:13.929Z] [INFO] Fetching org.eclipse.equinox.http.registry_1.1.700.v20190214-1948.jar.pack.gz from http://download.eclipse.org/releases/2019-12/201912181000/plugins/ (18.49kB)
06:42:13 [2020-08-08T10:42:13.929Z] [INFO] Fetching org.eclipse.equinox.http.registry_1.1.700.v20190214-1948.jar.pack.gz from http://download.eclipse.org/releases/2019-12/201912181000/plugins/ (18.49kB)
06:42:13 [2020-08-08T10:42:13.929Z] [INFO] Fetching org.eclipse.equinox.jsp.jasper_1.1.300.v20190714-1850.jar.pack.gz from http://download.eclipse.org/releases/2019-12/201912181000/plugins/ (14.71kB)
06:42:14 [2020-08-08T10:42:14.184Z] [INFO] Fetching org.eclipse.equinox.jsp.jasper_1.1.300.v20190714-1850.jar.pack.gz from http://download.eclipse.org/releases/2019-12/201912181000/plugins/ (14.71kB)
06:42:14 [2020-08-08T10:42:14.184Z] [INFO] Fetching org.eclipse.equinox.jsp.jasper.registry_1.1.300.v20190714-1850.jar.pack.gz from http://download.eclipse.org/releases/2019-12/201912181000/plugins/ (8.71kB)
06:42:14 [2020-08-08T10:42:14.184Z] [INFO] Fetching org.eclipse.equinox.jsp.jasper.registry_1.1.300.v20190714-1850.jar.pack.gz from http://download.eclipse.org/releases/2019-12/201912181000/plugins/ (8.71kB)
06:42:14 [2020-08-08T10:42:14.184Z] [INFO] Fetching org.eclipse.help.base_4.2.800.v20191210-0610.jar.pack.gz from http://download.eclipse.org/releases/2019-12/201912181000/plugins/ (175.92kB)
06:42:14 [2020-08-08T10:42:14.185Z] [INFO] Fetching org.eclipse.help.base_4.2.800.v20191210-0610.jar.pack.gz from http://download.eclipse.org/releases/2019-12/201912181000/plugins/ (175.92kB)
06:42:14 [2020-08-08T10:42:14.440Z] [INFO] Fetching org.eclipse.jdt.core.manipulation_1.13.0.v20191203-0859.jar.pack.gz from http://download.eclipse.org/releases/2019-12/201912181000/plugins/ (485.06kB)
06:42:14 [2020-08-08T10:42:14.440Z] [INFO] Fetching org.eclipse.jdt.core.manipulation_1.13.0.v20191203-0859.jar.pack.gz from http://download.eclipse.org/releases/2019-12/201912181000/plugins/ (485.06kB)
06:42:15 [2020-08-08T10:42:15.000Z] [INFO] Fetching org.eclipse.jdt.launching_3.16.0.v20191108-0353.jar.pack.gz from http://download.eclipse.org/releases/2019-12/201912181000/plugins/ (273.76kB)
06:42:15 [2020-08-08T10:42:15.000Z] [INFO] Fetching org.eclipse.jdt.launching_3.16.0.v20191108-0353.jar.pack.gz from http://download.eclipse.org/releases/2019-12/201912181000/plugins/ (273.76kB)
06:42:15 [2020-08-08T10:42:15.000Z] [INFO] Fetching org.eclipse.jdt.debug_3.14.0.v20191105-0758.jar.pack.gz from http://download.eclipse.org/releases/2019-12/201912181000/plugins/ (937.08kB)
06:42:15 [2020-08-08T10:42:15.000Z] [INFO] Fetching org.eclipse.jdt.debug_3.14.0.v20191105-0758.jar.pack.gz from http://download.eclipse.org/releases/2019-12/201912181000/plugins/ (937.08kB)
06:42:15 [2020-08-08T10:42:15.256Z] [INFO] Fetching org.eclipse.jetty.io_9.4.24.v20191120.jar from http://download.eclipse.org/releases/2019-12/201912181000/plugins/ (170.14kB)
06:42:15 [2020-08-08T10:42:15.256Z] [INFO] Fetching org.eclipse.jetty.io_9.4.24.v20191120.jar from http://download.eclipse.org/releases/2019-12/201912181000/plugins/ (170.14kB)
06:42:15 [2020-08-08T10:42:15.256Z] [INFO] Fetching org.eclipse.jetty.security_9.4.24.v20191120.jar from http://download.eclipse.org/releases/2019-12/201912181000/plugins/ (126.39kB)
06:42:15 [2020-08-08T10:42:15.256Z] [INFO] Fetching org.eclipse.jetty.security_9.4.24.v20191120.jar from http://download.eclipse.org/releases/2019-12/201912181000/plugins/ (126.39kB)
06:42:15 [2020-08-08T10:42:15.512Z] [WARNING] The following locally built units have been used to resolve project dependencies:
06:42:15 [2020-08-08T10:42:15.512Z] [WARNING]   org.eclipse.ease.ui/0.8.0.I202007081155
06:42:15 [2020-08-08T10:42:15.512Z] [WARNING]   org.eclipse.ease.ui.completions.java/0.8.0.I202007080801
06:42:15 [2020-08-08T10:42:15.512Z] [WARNING]   org.eclipse.ease.classloader/0.8.0.I201910171213
06:42:15 [2020-08-08T10:42:15.512Z] [WARNING]   org.eclipse.ease/0.8.0.I202007081054
06:42:15 [2020-08-08T10:42:15.512Z] [INFO] Resolving class path of MavenProject: org.eclipse.ease:org.eclipse.ease.ui.test:0.8.0-SNAPSHOT @ /home/jenkins/agent/workspace/ease.verify.core.target.2019-12/tests/org.eclipse.ease.ui.test/pom.xml
06:42:15 [2020-08-08T10:42:15.512Z] [WARNING] The project org.eclipse.ease:org.eclipse.ease.releng:pom:0.8.0-SNAPSHOT uses prerequisites which is only intended for maven-plugin projects but not for non maven-plugin projects. For such purposes you should use the maven-enforcer-plugin. See https://maven.apache.org/enforcer/enforcer-rules/requireMavenVersion.html
06:42:15 [2020-08-08T10:42:15.512Z] [WARNING] [jenkins-event-spy] Unexpected Maven project file name 'target-tests-pom.xml', problems may occur
06:42:15 [2020-08-08T10:42:15.512Z] [INFO] ------------------------------------------------------------------------
06:42:15 [2020-08-08T10:42:15.512Z] [INFO] Reactor Build Order:
06:42:15 [2020-08-08T10:42:15.512Z] [INFO] 
06:42:15 [2020-08-08T10:42:15.512Z] [INFO] org.eclipse.ease.releng                                            [pom]
06:42:15 [2020-08-08T10:42:15.512Z] [INFO] org.eclipse.ease.releng.target               [eclipse-target-definition]
06:42:15 [2020-08-08T10:42:15.512Z] [INFO] org.eclipse.ease.test                              [eclipse-test-plugin]
06:42:15 [2020-08-08T10:42:15.512Z] [INFO] org.eclipse.ease.lang.javascript.nashorn.test      [eclipse-test-plugin]
06:42:15 [2020-08-08T10:42:15.512Z] [INFO] org.eclipse.ease.lang.javascript.rhino.test        [eclipse-test-plugin]
06:42:15 [2020-08-08T10:42:15.512Z] [INFO] org.eclipse.ease.lang.javascript.test              [eclipse-test-plugin]
06:42:15 [2020-08-08T10:42:15.512Z] [INFO] org.eclipse.ease.lang.python.test                  [eclipse-test-plugin]
06:42:15 [2020-08-08T10:42:15.512Z] [INFO] org.eclipse.ease.lang.python.jython.test           [eclipse-test-plugin]
06:42:15 [2020-08-08T10:42:15.512Z] [INFO] org.eclipse.ease.lang.python.py4j.test             [eclipse-test-plugin]
06:42:15 [2020-08-08T10:42:15.512Z] [INFO] org.eclipse.ease.lang.scriptarchive.test           [eclipse-test-plugin]
06:42:15 [2020-08-08T10:42:15.512Z] [INFO] org.eclipse.ease.ui.test                           [eclipse-test-plugin]
06:42:15 [2020-08-08T10:42:15.512Z] [WARNING] [jenkins-event-spy] Unexpected Maven project file name 'target-tests-pom.xml', problems may occur
06:42:15 [2020-08-08T10:42:15.512Z] [INFO] 
06:42:15 [2020-08-08T10:42:15.512Z] [INFO] --------------< org.eclipse.ease:org.eclipse.ease.releng >--------------
06:42:15 [2020-08-08T10:42:15.512Z] [INFO] Building org.eclipse.ease.releng 0.8.0-SNAPSHOT                   [1/11]
06:42:15 [2020-08-08T10:42:15.512Z] [INFO] --------------------------------[ pom ]---------------------------------
06:42:15 [2020-08-08T10:42:15.512Z] [WARNING] [jenkins-event-spy] Unexpected Maven project file name 'target-tests-pom.xml', problems may occur
06:42:15 [2020-08-08T10:42:15.512Z] [INFO] 
06:42:15 [2020-08-08T10:42:15.512Z] [INFO] ----------< org.eclipse.ease:org.eclipse.ease.releng.target >-----------
06:42:15 [2020-08-08T10:42:15.512Z] [INFO] Building org.eclipse.ease.releng.target 0.8.0-SNAPSHOT            [2/11]
06:42:15 [2020-08-08T10:42:15.512Z] [INFO] ---------------------[ eclipse-target-definition ]----------------------
06:42:15 [2020-08-08T10:42:15.512Z] [INFO] 
06:42:15 [2020-08-08T10:42:15.512Z] [INFO] --- tycho-source-plugin:1.3.0:plugin-source (plugin-source) @ org.eclipse.ease.releng.target ---
06:42:15 [2020-08-08T10:42:15.512Z] [INFO] 
06:42:15 [2020-08-08T10:42:15.513Z] [INFO] --- tycho-packaging-plugin:1.3.0:package-target-definition (default-package-target-definition) @ org.eclipse.ease.releng.target ---
06:42:15 [2020-08-08T10:42:15.790Z] [INFO] 
06:42:15 [2020-08-08T10:42:15.790Z] [INFO] --- tycho-source-feature-plugin:1.3.0:source-feature (source-feature) @ org.eclipse.ease.releng.target ---
06:42:15 [2020-08-08T10:42:15.790Z] [INFO] 
06:42:15 [2020-08-08T10:42:15.790Z] [INFO] --- tycho-p2-plugin:1.3.0:p2-metadata (attached-p2-metadata) @ org.eclipse.ease.releng.target ---
06:42:15 [2020-08-08T10:42:15.790Z] [INFO] 
06:42:15 [2020-08-08T10:42:15.790Z] [INFO] ---------------< org.eclipse.ease:org.eclipse.ease.test >---------------
06:42:15 [2020-08-08T10:42:15.790Z] [INFO] Building org.eclipse.ease.test 0.8.0-SNAPSHOT                     [3/11]
06:42:15 [2020-08-08T10:42:15.790Z] [INFO] ------------------------[ eclipse-test-plugin ]-------------------------
06:42:15 [2020-08-08T10:42:15.790Z] [INFO] 
06:42:15 [2020-08-08T10:42:15.790Z] [INFO] --- tycho-packaging-plugin:1.3.0:build-qualifier (default-build-qualifier) @ org.eclipse.ease.test ---
06:42:15 [2020-08-08T10:42:15.790Z] [INFO] The project's OSGi version is 0.8.0.I201910171213
06:42:15 [2020-08-08T10:42:15.790Z] [INFO] 
06:42:15 [2020-08-08T10:42:15.790Z] [INFO] --- tycho-packaging-plugin:1.3.0:validate-id (default-validate-id) @ org.eclipse.ease.test ---
06:42:15 [2020-08-08T10:42:15.790Z] [INFO] 
06:42:15 [2020-08-08T10:42:15.790Z] [INFO] --- tycho-packaging-plugin:1.3.0:validate-version (default-validate-version) @ org.eclipse.ease.test ---
06:42:15 [2020-08-08T10:42:15.790Z] [INFO] 
06:42:15 [2020-08-08T10:42:15.790Z] [INFO] --- maven-resources-plugin:2.4.3:resources (default-resources) @ org.eclipse.ease.test ---
06:42:15 [2020-08-08T10:42:15.790Z] [INFO] Using 'UTF-8' encoding to copy filtered resources.
06:42:15 [2020-08-08T10:42:15.790Z] [INFO] skip non existing resourceDirectory /home/jenkins/agent/workspace/ease.verify.core.target.2019-12/tests/org.eclipse.ease.test/src/main/resources
06:42:15 [2020-08-08T10:42:15.790Z] [INFO] 
06:42:15 [2020-08-08T10:42:15.790Z] [INFO] --- tycho-compiler-plugin:1.3.0:compile (default-compile) @ org.eclipse.ease.test ---
06:42:16 [2020-08-08T10:42:16.045Z] [INFO] Nothing to compile - all classes are up to date
06:42:16 [2020-08-08T10:42:16.045Z] [INFO] 
06:42:16 [2020-08-08T10:42:16.045Z] [INFO] --- maven-resources-plugin:2.4.3:testResources (default-testResources) @ org.eclipse.ease.test ---
06:42:16 [2020-08-08T10:42:16.045Z] [INFO] Using 'UTF-8' encoding to copy filtered resources.
06:42:16 [2020-08-08T10:42:16.045Z] [INFO] skip non existing resourceDirectory /home/jenkins/agent/workspace/ease.verify.core.target.2019-12/tests/org.eclipse.ease.test/src/test/resources
06:42:16 [2020-08-08T10:42:16.045Z] [INFO] 
06:42:16 [2020-08-08T10:42:16.045Z] [INFO] --- tycho-source-plugin:1.3.0:plugin-source (plugin-source) @ org.eclipse.ease.test ---
06:42:16 [2020-08-08T10:42:16.045Z] [INFO] Building jar: /home/jenkins/agent/workspace/ease.verify.core.target.2019-12/tests/org.eclipse.ease.test/target/org.eclipse.ease.test-0.8.0-SNAPSHOT-sources.jar
06:42:16 [2020-08-08T10:42:16.045Z] [INFO] 
06:42:16 [2020-08-08T10:42:16.045Z] [INFO] --- target-platform-configuration:1.3.0:target-platform (default-target-platform) @ org.eclipse.ease.test ---
06:42:16 [2020-08-08T10:42:16.045Z] [INFO] 
06:42:16 [2020-08-08T10:42:16.045Z] [INFO] --- tycho-packaging-plugin:1.3.0:package-plugin (default-package-plugin) @ org.eclipse.ease.test ---
06:42:16 [2020-08-08T10:42:16.045Z] [INFO] Building jar: /home/jenkins/agent/workspace/ease.verify.core.target.2019-12/tests/org.eclipse.ease.test/target/org.eclipse.ease.test-0.8.0-SNAPSHOT.jar
06:42:16 [2020-08-08T10:42:16.045Z] [INFO] 
06:42:16 [2020-08-08T10:42:16.045Z] [INFO] --- tycho-p2-plugin:1.3.0:p2-metadata-default (default-p2-metadata-default) @ org.eclipse.ease.test ---
06:42:16 [2020-08-08T10:42:16.045Z] [INFO] 
06:42:16 [2020-08-08T10:42:16.045Z] [INFO] --- tycho-source-feature-plugin:1.3.0:source-feature (source-feature) @ org.eclipse.ease.test ---
06:42:16 [2020-08-08T10:42:16.045Z] [INFO] 
06:42:16 [2020-08-08T10:42:16.045Z] [INFO] --- tycho-p2-plugin:1.3.0:p2-metadata (attached-p2-metadata) @ org.eclipse.ease.test ---
06:42:16 [2020-08-08T10:42:16.045Z] [INFO] 
06:42:16 [2020-08-08T10:42:16.045Z] [INFO] --- tycho-surefire-plugin:1.3.0:test (default-test) @ org.eclipse.ease.test ---
06:42:16 [2020-08-08T10:42:16.302Z] [INFO] Expected eclipse log file: /home/jenkins/agent/workspace/ease.verify.core.target.2019-12/tests/org.eclipse.ease.test/target/work/data/.metadata/.log
06:42:16 [2020-08-08T10:42:16.302Z] [INFO] Command line:
06:42:16 [2020-08-08T10:42:16.302Z] 	[/opt/tools/java/oracle/jdk-8/1.8.0_202/jre/bin/java, -Dosgi.noShutdown=false, -Dosgi.os=linux, -Dosgi.ws=gtk, -Dosgi.arch=x86_64, -Dosgi.clean=true, -jar, /home/jenkins/.m2/repository/p2/osgi/bundle/org.eclipse.equinox.launcher/1.5.600.v20191014-2022/org.eclipse.equinox.launcher-1.5.600.v20191014-2022.jar, -data, /home/jenkins/agent/workspace/ease.verify.core.target.2019-12/tests/org.eclipse.ease.test/target/work/data, -install, /home/jenkins/agent/workspace/ease.verify.core.target.2019-12/tests/org.eclipse.ease.test/target/work, -configuration, /home/jenkins/agent/workspace/ease.verify.core.target.2019-12/tests/org.eclipse.ease.test/target/work/configuration, -application, org.eclipse.tycho.surefire.osgibooter.headlesstest, -testproperties, /home/jenkins/agent/workspace/ease.verify.core.target.2019-12/tests/org.eclipse.ease.test/target/surefire.properties]
06:42:16 [2020-08-08T10:42:16.302Z] Picked up JAVA_TOOL_OPTIONS: -Dmaven.ext.class.path="/home/jenkins/agent/workspace/ease.verify.core.target.2019-12@tmp/withMaven2f46464d/pipeline-maven-spy.jar" -Dorg.jenkinsci.plugins.pipeline.maven.reportsFolder="/home/jenkins/agent/workspace/ease.verify.core.target.2019-12@tmp/withMaven2f46464d" 
06:42:17 [2020-08-08T10:42:17.694Z] Running org.eclipse.ease.AbstractScriptEngineTest
06:42:21 [2020-08-08T10:42:21.860Z] testorg.eclipse.ease.ScriptExecutionException: Engine got terminated
06:42:22 [2020-08-08T10:42:22.791Z] java.lang.RuntimeException: ERROR
06:42:22 [2020-08-08T10:42:22.791Z] 	at org.eclipse.ease.AbstractScriptEngineTest$MockedScriptEngine.execute(AbstractScriptEngineTest.java:73)
06:42:22 [2020-08-08T10:42:22.791Z] 	at org.eclipse.ease.AbstractScriptEngine.inject(AbstractScriptEngine.java:222)
06:42:22 [2020-08-08T10:42:22.791Z] 	at org.eclipse.ease.AbstractScriptEngine.run(AbstractScriptEngine.java:272)
06:42:22 [2020-08-08T10:42:22.791Z] 	at org.eclipse.core.internal.jobs.Worker.run(Worker.java:63)
06:42:22 [2020-08-08T10:42:22.791Z] 1Tests run: 17, Failures: 0, Errors: 0, Skipped: 0, Time elapsed: 5.036 s - in org.eclipse.ease.AbstractScriptEngineTest
06:42:22 [2020-08-08T10:42:22.791Z] extractEmptyArguments(org.eclipse.ease.AbstractScriptEngineTest)  Time elapsed: 0.002 s
06:42:22 [2020-08-08T10:42:22.791Z] setNotNullOutputStream(org.eclipse.ease.AbstractScriptEngineTest)  Time elapsed: 0.001 s
06:42:22 [2020-08-08T10:42:22.791Z] terminateViaMonitorCancellation(org.eclipse.ease.AbstractScriptEngineTest)  Time elapsed: 0.205 s
06:42:22 [2020-08-08T10:42:22.791Z] inject(org.eclipse.ease.AbstractScriptEngineTest)  Time elapsed: 0.001 s
06:42:22 [2020-08-08T10:42:22.791Z] extractArguments(org.eclipse.ease.AbstractScriptEngineTest)  Time elapsed: 0.001 s
06:42:22 [2020-08-08T10:42:22.791Z] executeSync(org.eclipse.ease.AbstractScriptEngineTest)  Time elapsed: 1 s
06:42:22 [2020-08-08T10:42:22.791Z] setNotNullErrorStream(org.eclipse.ease.AbstractScriptEngineTest)  Time elapsed: 0 s
06:42:22 [2020-08-08T10:42:22.791Z] setNullErrorStream(org.eclipse.ease.AbstractScriptEngineTest)  Time elapsed: 0 s
06:42:22 [2020-08-08T10:42:22.791Z] isJob(org.eclipse.ease.AbstractScriptEngineTest)  Time elapsed: 0 s
06:42:22 [2020-08-08T10:42:22.791Z] streamsAvailable(org.eclipse.ease.AbstractScriptEngineTest)  Time elapsed: 0 s
06:42:22 [2020-08-08T10:42:22.791Z] executeValidCodeAndTerminate(org.eclipse.ease.AbstractScriptEngineTest)  Time elapsed: 0.001 s
06:42:22 [2020-08-08T10:42:22.791Z] setNullOutputStream(org.eclipse.ease.AbstractScriptEngineTest)  Time elapsed: 0 s
06:42:22 [2020-08-08T10:42:22.791Z] terminateMultipleTimes(org.eclipse.ease.AbstractScriptEngineTest)  Time elapsed: 0.6 s
06:42:22 [2020-08-08T10:42:22.791Z] engineTerminatesWhenIdle(org.eclipse.ease.AbstractScriptEngineTest)  Time elapsed: 1 s
06:42:22 [2020-08-08T10:42:22.791Z] terminateViaTerminateMethod(org.eclipse.ease.AbstractScriptEngineTest)  Time elapsed: 1.203 s
06:42:22 [2020-08-08T10:42:22.791Z] terminateViaMethodCallback(org.eclipse.ease.AbstractScriptEngineTest)  Time elapsed: 1.002 s
06:42:22 [2020-08-08T10:42:22.791Z] executeErrorCodeAndTerminate(org.eclipse.ease.AbstractScriptEngineTest)  Time elapsed: 0.002 s
06:42:22 [2020-08-08T10:42:22.791Z] Running org.eclipse.ease.adapters.ScriptableAdapterTest
06:42:22 [2020-08-08T10:42:22.791Z] Tests run: 5, Failures: 0, Errors: 0, Skipped: 0, Time elapsed: 0.097 s - in org.eclipse.ease.adapters.ScriptableAdapterTest
06:42:22 [2020-08-08T10:42:22.791Z] adaptURI(org.eclipse.ease.adapters.ScriptableAdapterTest)  Time elapsed: 0.095 s
06:42:22 [2020-08-08T10:42:22.791Z] adaptURL(org.eclipse.ease.adapters.ScriptableAdapterTest)  Time elapsed: 0 s
06:42:22 [2020-08-08T10:42:22.791Z] adaptWorkspaceFile(org.eclipse.ease.adapters.ScriptableAdapterTest)  Time elapsed: 0.001 s
06:42:22 [2020-08-08T10:42:22.791Z] getAdapterList(org.eclipse.ease.adapters.ScriptableAdapterTest)  Time elapsed: 0 s
06:42:22 [2020-08-08T10:42:22.791Z] adaptFilesystemFile(org.eclipse.ease.adapters.ScriptableAdapterTest)  Time elapsed: 0 s
06:42:22 [2020-08-08T10:42:22.791Z] Running org.eclipse.ease.ScriptTest
06:42:22 [2020-08-08T10:42:22.791Z] Tests run: 13, Failures: 0, Errors: 0, Skipped: 0, Time elapsed: 0.012 s - in org.eclipse.ease.ScriptTest
06:42:22 [2020-08-08T10:42:22.791Z] codeFromScriptable(org.eclipse.ease.ScriptTest)  Time elapsed: 0.007 s
06:42:22 [2020-08-08T10:42:22.791Z] codeFromFilesystemFile(org.eclipse.ease.ScriptTest)  Time elapsed: 0.001 s
06:42:22 [2020-08-08T10:42:22.792Z] getCodeStream(org.eclipse.ease.ScriptTest)  Time elapsed: 0 s
06:42:22 [2020-08-08T10:42:22.792Z] getFile(org.eclipse.ease.ScriptTest)  Time elapsed: 0 s
06:42:22 [2020-08-08T10:42:22.792Z] codeFromStringBuilder(org.eclipse.ease.ScriptTest)  Time elapsed: 0 s
06:42:22 [2020-08-08T10:42:22.792Z] getResult(org.eclipse.ease.ScriptTest)  Time elapsed: 0 s
06:42:22 [2020-08-08T10:42:22.792Z] getException(org.eclipse.ease.ScriptTest)  Time elapsed: 0 s
06:42:22 [2020-08-08T10:42:22.792Z] codeFromWorkspaceFile(org.eclipse.ease.ScriptTest)  Time elapsed: 0 s
06:42:22 [2020-08-08T10:42:22.792Z] codeFromInputStream(org.eclipse.ease.ScriptTest)  Time elapsed: 0 s
06:42:22 [2020-08-08T10:42:22.792Z] getTitle(org.eclipse.ease.ScriptTest)  Time elapsed: 0 s
06:42:22 [2020-08-08T10:42:22.792Z] getCommand(org.eclipse.ease.ScriptTest)  Time elapsed: 0 s
06:42:22 [2020-08-08T10:42:22.792Z] codeFromReader(org.eclipse.ease.ScriptTest)  Time elapsed: 0 s
06:42:22 [2020-08-08T10:42:22.792Z] codeFromString(org.eclipse.ease.ScriptTest)  Time elapsed: 0 s
06:42:22 [2020-08-08T10:42:22.792Z] Running org.eclipse.ease.tools.RunnableWithResultTest
06:42:22 [2020-08-08T10:42:22.792Z] Tests run: 2, Failures: 0, Errors: 0, Skipped: 0, Time elapsed: 0.001 s - in org.eclipse.ease.tools.RunnableWithResultTest
06:42:22 [2020-08-08T10:42:22.792Z] testException(org.eclipse.ease.tools.RunnableWithResultTest)  Time elapsed: 0 s
06:42:22 [2020-08-08T10:42:22.792Z] testResult(org.eclipse.ease.tools.RunnableWithResultTest)  Time elapsed: 0 s
06:42:22 [2020-08-08T10:42:22.792Z] Running org.eclipse.ease.tools.StringToolsTest
06:42:22 [2020-08-08T10:42:22.792Z] Tests run: 8, Failures: 0, Errors: 0, Skipped: 0, Time elapsed: 0.003 s - in org.eclipse.ease.tools.StringToolsTest
06:42:22 [2020-08-08T10:42:22.792Z] parseArgumentsNull(org.eclipse.ease.tools.StringToolsTest)  Time elapsed: 0 s
06:42:22 [2020-08-08T10:42:22.792Z] parseArgumentsQuotedSingle(org.eclipse.ease.tools.StringToolsTest)  Time elapsed: 0 s
06:42:22 [2020-08-08T10:42:22.792Z] parseArgumentsEmpty(org.eclipse.ease.tools.StringToolsTest)  Time elapsed: 0 s
06:42:22 [2020-08-08T10:42:22.792Z] parseArgumentsMixedMultiple(org.eclipse.ease.tools.StringToolsTest)  Time elapsed: 0 s
06:42:22 [2020-08-08T10:42:22.792Z] parseArgumentsMixedMultipleLines(org.eclipse.ease.tools.StringToolsTest)  Time elapsed: 0.001 s
06:42:22 [2020-08-08T10:42:22.792Z] parseArgumentsNonQuotedMultiple(org.eclipse.ease.tools.StringToolsTest)  Time elapsed: 0 s
06:42:22 [2020-08-08T10:42:22.792Z] parseArgumentsNonQuotedSingle(org.eclipse.ease.tools.StringToolsTest)  Time elapsed: 0 s
06:42:22 [2020-08-08T10:42:22.792Z] parseArgumentsQuotedMultiple(org.eclipse.ease.tools.StringToolsTest)  Time elapsed: 0 s
06:42:22 [2020-08-08T10:42:22.792Z] Running org.eclipse.ease.tools.ResourceToolsTest
06:42:22 [2020-08-08T10:42:22.792Z] Tests run: 47, Failures: 0, Errors: 0, Skipped: 0, Time elapsed: 0.038 s - in org.eclipse.ease.tools.ResourceToolsTest
06:42:22 [2020-08-08T10:42:22.792Z] resolveScriptLocation(org.eclipse.ease.tools.ResourceToolsTest)  Time elapsed: 0.007 s
06:42:22 [2020-08-08T10:42:22.792Z] getWorkspaceInputStream(org.eclipse.ease.tools.ResourceToolsTest)  Time elapsed: 0.001 s
06:42:22 [2020-08-08T10:42:22.792Z] resolvePlatformURI(org.eclipse.ease.tools.ResourceToolsTest)  Time elapsed: 0 s
06:42:22 [2020-08-08T10:42:22.792Z] resolveScriptLocationWithSpacesInPath(org.eclipse.ease.tools.ResourceToolsTest)  Time elapsed: 0.002 s
06:42:22 [2020-08-08T10:42:22.792Z] resolveURL(org.eclipse.ease.tools.ResourceToolsTest)  Time elapsed: 0 s
06:42:22 [2020-08-08T10:42:22.792Z] invalidIsAbsolute(org.eclipse.ease.tools.ResourceToolsTest)  Time elapsed: 0 s
06:42:22 [2020-08-08T10:42:22.792Z] getFilesystemInputStream(org.eclipse.ease.tools.ResourceToolsTest)  Time elapsed: 0.001 s
06:42:22 [2020-08-08T10:42:22.792Z] toRelativeLocationInWorkspace(org.eclipse.ease.tools.ResourceToolsTest)  Time elapsed: 0 s
06:42:22 [2020-08-08T10:42:22.792Z] checkOperatingSystem(org.eclipse.ease.tools.ResourceToolsTest)  Time elapsed: 0 s
06:42:22 [2020-08-08T10:42:22.792Z] inputStreamToString(org.eclipse.ease.tools.ResourceToolsTest)  Time elapsed: 0 s
06:42:22 [2020-08-08T10:42:22.792Z] fileSystemToAbsoluteLocationOnLinux(org.eclipse.ease.tools.ResourceToolsTest)  Time elapsed: 0 s
06:42:22 [2020-08-08T10:42:22.792Z] exists(org.eclipse.ease.tools.ResourceToolsTest)  Time elapsed: 0 s
06:42:22 [2020-08-08T10:42:22.792Z] resolveRelativeInWorkspace(org.eclipse.ease.tools.ResourceToolsTest)  Time elapsed: 0.001 s
06:42:22 [2020-08-08T10:42:22.792Z] isFile(org.eclipse.ease.tools.ResourceToolsTest)  Time elapsed: 0 s
06:42:22 [2020-08-08T10:42:22.792Z] invalidToFile(org.eclipse.ease.tools.ResourceToolsTest)  Time elapsed: 0 s
06:42:22 [2020-08-08T10:42:22.792Z] resolveAbsoluteInFileSystem(org.eclipse.ease.tools.ResourceToolsTest)  Time elapsed: 0 s
06:42:22 [2020-08-08T10:42:22.792Z] resolveWindowsRoot(org.eclipse.ease.tools.ResourceToolsTest)  Time elapsed: 0.001 s
06:42:22 [2020-08-08T10:42:22.792Z] resolveRelativeInFileSystemOnWindows(org.eclipse.ease.tools.ResourceToolsTest)  Time elapsed: 0 s
06:42:22 [2020-08-08T10:42:22.792Z] isAbsoluteFileSystemPathOnWindows(org.eclipse.ease.tools.ResourceToolsTest)  Time elapsed: 0 s
06:42:22 [2020-08-08T10:42:22.792Z] readerToString(org.eclipse.ease.tools.ResourceToolsTest)  Time elapsed: 0 s
06:42:22 [2020-08-08T10:42:22.792Z] workspaceFileToString(org.eclipse.ease.tools.ResourceToolsTest)  Time elapsed: 0 s
06:42:22 [2020-08-08T10:42:22.792Z] toFile(org.eclipse.ease.tools.ResourceToolsTest)  Time elapsed: 0 s
06:42:22 [2020-08-08T10:42:22.792Z] toProjectRelativeLocation(org.eclipse.ease.tools.ResourceToolsTest)  Time elapsed: 0 s
06:42:22 [2020-08-08T10:42:22.792Z] getInvalidInputStream(org.eclipse.ease.tools.ResourceToolsTest)  Time elapsed: 0.003 s
06:42:22 [2020-08-08T10:42:22.792Z] resolveRelativeInFileSystemOnLinux(org.eclipse.ease.tools.ResourceToolsTest)  Time elapsed: 0 s
06:42:22 [2020-08-08T10:42:22.792Z] isFolder(org.eclipse.ease.tools.ResourceToolsTest)  Time elapsed: 0 s
06:42:22 [2020-08-08T10:42:22.792Z] fileSystemToAbsoluteLocationOnWindows(org.eclipse.ease.tools.ResourceToolsTest)  Time elapsed: 0 s
06:42:22 [2020-08-08T10:42:22.792Z] isAbsoluteWorkspacePath(org.eclipse.ease.tools.ResourceToolsTest)  Time elapsed: 0 s
06:42:22 [2020-08-08T10:42:22.792Z] isAbsoluteFileSystemPathOnLinux(org.eclipse.ease.tools.ResourceToolsTest)  Time elapsed: 0 s
06:42:22 [2020-08-08T10:42:22.792Z] resolveInvalid(org.eclipse.ease.tools.ResourceToolsTest)  Time elapsed: 0 s
06:42:22 [2020-08-08T10:42:22.792Z] resolveAbsoluteInFileSystemOnWindows(org.eclipse.ease.tools.ResourceToolsTest)  Time elapsed: 0 s
06:42:22 [2020-08-08T10:42:22.792Z] resolveScriptLocationWithSpacesInDomain(org.eclipse.ease.tools.ResourceToolsTest)  Time elapsed: 0 s
06:42:22 [2020-08-08T10:42:22.792Z] resolveRelativefromWorkspaceToFilesystem(org.eclipse.ease.tools.ResourceToolsTest)  Time elapsed: 0.001 s
06:42:22 [2020-08-08T10:42:22.792Z] resolveRelativeWithoutBaseFile(org.eclipse.ease.tools.ResourceToolsTest)  Time elapsed: 0 s
06:42:22 [2020-08-08T10:42:22.792Z] resolveInWorkspace(org.eclipse.ease.tools.ResourceToolsTest)  Time elapsed: 0 s
06:42:22 [2020-08-08T10:42:22.792Z] resolveScriptLocationWithSpecialCharactersInPath(org.eclipse.ease.tools.ResourceToolsTest)  Time elapsed: 0 s
06:42:22 [2020-08-08T10:42:22.792Z] filesystemFileToString(org.eclipse.ease.tools.ResourceToolsTest)  Time elapsed: 0 s
06:42:22 [2020-08-08T10:42:22.792Z] createURI(org.eclipse.ease.tools.ResourceToolsTest)  Time elapsed: 0 s
06:42:22 [2020-08-08T10:42:22.792Z] uriToAbsoluteLocation(org.eclipse.ease.tools.ResourceToolsTest)  Time elapsed: 0 s
06:42:22 [2020-08-08T10:42:22.792Z] createFolder(org.eclipse.ease.tools.ResourceToolsTest)  Time elapsed: 0.003 s
06:42:22 [2020-08-08T10:42:22.792Z] workspaceToAbsoluteLocation(org.eclipse.ease.tools.ResourceToolsTest)  Time elapsed: 0 s
06:42:22 [2020-08-08T10:42:22.792Z] resolveAbsoluteInFileSystemOnLinux(org.eclipse.ease.tools.ResourceToolsTest)  Time elapsed: 0 s
06:42:22 [2020-08-08T10:42:22.792Z] invalidToString(org.eclipse.ease.tools.ResourceToolsTest)  Time elapsed: 0 s
06:42:22 [2020-08-08T10:42:22.792Z] resolveRelativeURIs(org.eclipse.ease.tools.ResourceToolsTest)  Time elapsed: 0 s
06:42:22 [2020-08-08T10:42:22.792Z] resolveRelativeInFileSystem(org.eclipse.ease.tools.ResourceToolsTest)  Time elapsed: 0.001 s
06:42:22 [2020-08-08T10:42:22.792Z] resolveScriptLocationWithSpecialCharactersInDomain(org.eclipse.ease.tools.ResourceToolsTest)  Time elapsed: 0.002 s
06:42:22 [2020-08-08T10:42:22.792Z] isAbsoluteURL(org.eclipse.ease.tools.ResourceToolsTest)  Time elapsed: 0 s
06:42:22 [2020-08-08T10:42:22.792Z] Running org.eclipse.ease.AbstractCodeParserTest
06:42:22 [2020-08-08T10:42:22.792Z] Tests run: 5, Failures: 0, Errors: 0, Skipped: 0, Time elapsed: 0.003 s - in org.eclipse.ease.AbstractCodeParserTest
06:42:22 [2020-08-08T10:42:22.792Z] parseCode(org.eclipse.ease.AbstractCodeParserTest)  Time elapsed: 0.002 s
06:42:22 [2020-08-08T10:42:22.792Z] parseLineHeader(org.eclipse.ease.AbstractCodeParserTest)  Time elapsed: 0 s
06:42:22 [2020-08-08T10:42:22.792Z] parseBlockAfterWhitespace(org.eclipse.ease.AbstractCodeParserTest)  Time elapsed: 0 s
06:42:22 [2020-08-08T10:42:22.792Z] parseEmpty(org.eclipse.ease.AbstractCodeParserTest)  Time elapsed: 0 s
06:42:22 [2020-08-08T10:42:22.792Z] parseBlockHeader(org.eclipse.ease.AbstractCodeParserTest)  Time elapsed: 0 s
06:42:22 [2020-08-08T10:42:22.792Z] Running org.eclipse.ease.ScriptResultTest
06:42:22 [2020-08-08T10:42:22.792Z] Tests run: 4, Failures: 0, Errors: 0, Skipped: 0, Time elapsed: 0 s - in org.eclipse.ease.ScriptResultTest
06:42:22 [2020-08-08T10:42:22.792Z] hasException(org.eclipse.ease.ScriptResultTest)  Time elapsed: 0 s
06:42:22 [2020-08-08T10:42:22.792Z] getResult(org.eclipse.ease.ScriptResultTest)  Time elapsed: 0 s
06:42:22 [2020-08-08T10:42:22.792Z] getException(org.eclipse.ease.ScriptResultTest)  Time elapsed: 0 s
06:42:22 [2020-08-08T10:42:22.792Z] isReady(org.eclipse.ease.ScriptResultTest)  Time elapsed: 0 s
06:42:22 [2020-08-08T10:42:22.792Z] Running org.eclipse.ease.sign.SignatureHelperTest
06:42:22 [2020-08-08T10:42:22.792Z] Tests run: 1, Failures: 0, Errors: 0, Skipped: 0, Time elapsed: 0.006 s - in org.eclipse.ease.sign.SignatureHelperTest
06:42:22 [2020-08-08T10:42:22.793Z] certificateTest(org.eclipse.ease.sign.SignatureHelperTest)  Time elapsed: 0.005 s
06:42:22 [2020-08-08T10:42:22.793Z] Running org.eclipse.ease.sign.VerifySignatureTest
06:42:22 [2020-08-08T10:42:22.793Z] Tests run: 1, Failures: 0, Errors: 0, Skipped: 0, Time elapsed: 0.043 s - in org.eclipse.ease.sign.VerifySignatureTest
06:42:22 [2020-08-08T10:42:22.793Z] testWithNonCodeParserScriptType(org.eclipse.ease.sign.VerifySignatureTest)  Time elapsed: 0.042 s
06:42:22 [2020-08-08T10:42:22.793Z] Running org.eclipse.ease.AbstractCodeFactoryTest
06:42:22 [2020-08-08T10:42:22.793Z] Tests run: 1, Failures: 0, Errors: 0, Skipped: 0, Time elapsed: 0.013 s - in org.eclipse.ease.AbstractCodeFactoryTest
06:42:22 [2020-08-08T10:42:22.793Z] createNewKeywordHeader(org.eclipse.ease.AbstractCodeFactoryTest)  Time elapsed: 0.013 s
06:42:22 [2020-08-08T10:42:22.793Z] Running org.eclipse.ease.AbstractReplScriptEngineTest
06:42:26 [2020-08-08T10:42:26.959Z] testorg.eclipse.ease.ScriptExecutionException: Engine got terminated
06:42:27 [2020-08-08T10:42:27.521Z] java.lang.RuntimeException: ERROR
06:42:27 [2020-08-08T10:42:27.521Z] 	at org.eclipse.ease.AbstractReplScriptEngineTest$MockedScriptEngine.execute(AbstractReplScriptEngineTest.java:61)
06:42:27 [2020-08-08T10:42:27.522Z] 	at org.eclipse.ease.AbstractScriptEngine.inject(AbstractScriptEngine.java:222)
06:42:27 [2020-08-08T10:42:27.522Z] 	at org.eclipse.ease.AbstractScriptEngine.run(AbstractScriptEngine.java:272)
06:42:27 [2020-08-08T10:42:27.522Z] 	at org.eclipse.core.internal.jobs.Worker.run(Worker.java:63)
06:42:28 [2020-08-08T10:42:28.448Z] Hello worldHello world1Tests run: 20, Failures: 0, Errors: 0, Skipped: 0, Time elapsed: 5.659 s - in org.eclipse.ease.AbstractReplScriptEngineTest
06:42:28 [2020-08-08T10:42:28.448Z] terminateOnIdleAfterSchedule(org.eclipse.ease.AbstractReplScriptEngineTest)  Time elapsed: 0.021 s
06:42:28 [2020-08-08T10:42:28.448Z] terminateEngine(org.eclipse.ease.AbstractReplScriptEngineTest)  Time elapsed: 1.001 s
06:42:28 [2020-08-08T10:42:28.448Z] keepRunningOnIdle(org.eclipse.ease.AbstractReplScriptEngineTest)  Time elapsed: 1.002 s
06:42:28 [2020-08-08T10:42:28.448Z] extractEmptyArguments(org.eclipse.ease.AbstractReplScriptEngineTest)  Time elapsed: 0 s
06:42:28 [2020-08-08T10:42:28.448Z] setNotNullOutputStream(org.eclipse.ease.AbstractReplScriptEngineTest)  Time elapsed: 0 s
06:42:28 [2020-08-08T10:42:28.448Z] terminateViaMonitorCancellation(org.eclipse.ease.AbstractReplScriptEngineTest)  Time elapsed: 0.102 s
06:42:28 [2020-08-08T10:42:28.448Z] inject(org.eclipse.ease.AbstractReplScriptEngineTest)  Time elapsed: 0.001 s
06:42:28 [2020-08-08T10:42:28.448Z] extractArguments(org.eclipse.ease.AbstractReplScriptEngineTest)  Time elapsed: 0 s
06:42:28 [2020-08-08T10:42:28.448Z] executeSync(org.eclipse.ease.AbstractReplScriptEngineTest)  Time elapsed: 0.001 s
06:42:28 [2020-08-08T10:42:28.448Z] setNotNullErrorStream(org.eclipse.ease.AbstractReplScriptEngineTest)  Time elapsed: 0 s
06:42:28 [2020-08-08T10:42:28.448Z] setNullErrorStream(org.eclipse.ease.AbstractReplScriptEngineTest)  Time elapsed: 0 s
06:42:28 [2020-08-08T10:42:28.448Z] isJob(org.eclipse.ease.AbstractReplScriptEngineTest)  Time elapsed: 0 s
06:42:28 [2020-08-08T10:42:28.448Z] streamsAvailable(org.eclipse.ease.AbstractReplScriptEngineTest)  Time elapsed: 0 s
06:42:28 [2020-08-08T10:42:28.448Z] executeValidCodeAndTerminate(org.eclipse.ease.AbstractReplScriptEngineTest)  Time elapsed: 0.001 s
06:42:28 [2020-08-08T10:42:28.448Z] setNullOutputStream(org.eclipse.ease.AbstractReplScriptEngineTest)  Time elapsed: 0 s
06:42:28 [2020-08-08T10:42:28.448Z] terminateMultipleTimes(org.eclipse.ease.AbstractReplScriptEngineTest)  Time elapsed: 0.301 s
06:42:28 [2020-08-08T10:42:28.448Z] engineTerminatesWhenIdle(org.eclipse.ease.AbstractReplScriptEngineTest)  Time elapsed: 0.001 s
06:42:28 [2020-08-08T10:42:28.448Z] terminateViaTerminateMethod(org.eclipse.ease.AbstractReplScriptEngineTest)  Time elapsed: 1.201 s
06:42:28 [2020-08-08T10:42:28.448Z] terminateViaMethodCallback(org.eclipse.ease.AbstractReplScriptEngineTest)  Time elapsed: 1.001 s
06:42:28 [2020-08-08T10:42:28.448Z] executeErrorCodeAndTerminate(org.eclipse.ease.AbstractReplScriptEngineTest)  Time elapsed: 1.001 s
06:42:28 [2020-08-08T10:42:28.448Z] 
06:42:28 [2020-08-08T10:42:28.448Z] Results:
06:42:28 [2020-08-08T10:42:28.448Z] 
06:42:28 [2020-08-08T10:42:28.448Z] Tests run: 124, Failures: 0, Errors: 0, Skipped: 0
06:42:28 [2020-08-08T10:42:28.448Z] 
06:42:29 [2020-08-08T10:42:29.009Z] [INFO] All tests passed!
06:42:29 [2020-08-08T10:42:29.009Z] [INFO] 
06:42:29 [2020-08-08T10:42:29.009Z] [INFO] ---< org.eclipse.ease:org.eclipse.ease.lang.javascript.nashorn.test >---
06:42:29 [2020-08-08T10:42:29.009Z] [INFO] Building org.eclipse.ease.lang.javascript.nashorn.test 0.8.0-SNAPSHOT [4/11]
06:42:29 [2020-08-08T10:42:29.009Z] [INFO] ------------------------[ eclipse-test-plugin ]-------------------------
06:42:29 [2020-08-08T10:42:29.009Z] [INFO] 
06:42:29 [2020-08-08T10:42:29.009Z] [INFO] --- tycho-packaging-plugin:1.3.0:build-qualifier (default-build-qualifier) @ org.eclipse.ease.lang.javascript.nashorn.test ---
06:42:29 [2020-08-08T10:42:29.009Z] [INFO] The project's OSGi version is 0.8.0.I201910171213
06:42:29 [2020-08-08T10:42:29.009Z] [INFO] 
06:42:29 [2020-08-08T10:42:29.009Z] [INFO] --- tycho-packaging-plugin:1.3.0:validate-id (default-validate-id) @ org.eclipse.ease.lang.javascript.nashorn.test ---
06:42:29 [2020-08-08T10:42:29.009Z] [INFO] 
06:42:29 [2020-08-08T10:42:29.010Z] [INFO] --- tycho-packaging-plugin:1.3.0:validate-version (default-validate-version) @ org.eclipse.ease.lang.javascript.nashorn.test ---
06:42:29 [2020-08-08T10:42:29.010Z] [INFO] 
06:42:29 [2020-08-08T10:42:29.010Z] [INFO] --- maven-resources-plugin:2.4.3:resources (default-resources) @ org.eclipse.ease.lang.javascript.nashorn.test ---
06:42:29 [2020-08-08T10:42:29.010Z] [INFO] Using 'UTF-8' encoding to copy filtered resources.
06:42:29 [2020-08-08T10:42:29.010Z] [INFO] skip non existing resourceDirectory /home/jenkins/agent/workspace/ease.verify.core.target.2019-12/tests/org.eclipse.ease.lang.javascript.nashorn.test/src/main/resources
06:42:29 [2020-08-08T10:42:29.010Z] [INFO] 
06:42:29 [2020-08-08T10:42:29.010Z] [INFO] --- tycho-compiler-plugin:1.3.0:compile (default-compile) @ org.eclipse.ease.lang.javascript.nashorn.test ---
06:42:29 [2020-08-08T10:42:29.010Z] [INFO] Nothing to compile - all classes are up to date
06:42:29 [2020-08-08T10:42:29.010Z] [INFO] 
06:42:29 [2020-08-08T10:42:29.010Z] [INFO] --- maven-resources-plugin:2.4.3:testResources (default-testResources) @ org.eclipse.ease.lang.javascript.nashorn.test ---
06:42:29 [2020-08-08T10:42:29.010Z] [INFO] Using 'UTF-8' encoding to copy filtered resources.
06:42:29 [2020-08-08T10:42:29.010Z] [INFO] skip non existing resourceDirectory /home/jenkins/agent/workspace/ease.verify.core.target.2019-12/tests/org.eclipse.ease.lang.javascript.nashorn.test/src/test/resources
06:42:29 [2020-08-08T10:42:29.010Z] [INFO] 
06:42:29 [2020-08-08T10:42:29.010Z] [INFO] --- tycho-source-plugin:1.3.0:plugin-source (plugin-source) @ org.eclipse.ease.lang.javascript.nashorn.test ---
06:42:29 [2020-08-08T10:42:29.010Z] [WARNING] Bundle-Vendor header not found in /home/jenkins/agent/workspace/ease.verify.core.target.2019-12/tests/org.eclipse.ease.lang.javascript.nashorn.test/META-INF/MANIFEST.MF, fallback to 'unknown' for source bundle
06:42:29 [2020-08-08T10:42:29.010Z] [INFO] Building jar: /home/jenkins/agent/workspace/ease.verify.core.target.2019-12/tests/org.eclipse.ease.lang.javascript.nashorn.test/target/org.eclipse.ease.lang.javascript.nashorn.test-0.8.0-SNAPSHOT-sources.jar
06:42:29 [2020-08-08T10:42:29.010Z] [INFO] 
06:42:29 [2020-08-08T10:42:29.010Z] [INFO] --- target-platform-configuration:1.3.0:target-platform (default-target-platform) @ org.eclipse.ease.lang.javascript.nashorn.test ---
06:42:29 [2020-08-08T10:42:29.010Z] [INFO] 
06:42:29 [2020-08-08T10:42:29.010Z] [INFO] --- tycho-packaging-plugin:1.3.0:package-plugin (default-package-plugin) @ org.eclipse.ease.lang.javascript.nashorn.test ---
06:42:29 [2020-08-08T10:42:29.010Z] [INFO] Building jar: /home/jenkins/agent/workspace/ease.verify.core.target.2019-12/tests/org.eclipse.ease.lang.javascript.nashorn.test/target/org.eclipse.ease.lang.javascript.nashorn.test-0.8.0-SNAPSHOT.jar
06:42:29 [2020-08-08T10:42:29.010Z] [INFO] 
06:42:29 [2020-08-08T10:42:29.010Z] [INFO] --- tycho-p2-plugin:1.3.0:p2-metadata-default (default-p2-metadata-default) @ org.eclipse.ease.lang.javascript.nashorn.test ---
06:42:29 [2020-08-08T10:42:29.010Z] [INFO] 
06:42:29 [2020-08-08T10:42:29.010Z] [INFO] --- tycho-source-feature-plugin:1.3.0:source-feature (source-feature) @ org.eclipse.ease.lang.javascript.nashorn.test ---
06:42:29 [2020-08-08T10:42:29.010Z] [INFO] 
06:42:29 [2020-08-08T10:42:29.010Z] [INFO] --- tycho-p2-plugin:1.3.0:p2-metadata (attached-p2-metadata) @ org.eclipse.ease.lang.javascript.nashorn.test ---
06:42:29 [2020-08-08T10:42:29.010Z] [INFO] 
06:42:29 [2020-08-08T10:42:29.010Z] [INFO] --- tycho-surefire-plugin:1.3.0:test (default-test) @ org.eclipse.ease.lang.javascript.nashorn.test ---
06:42:29 [2020-08-08T10:42:29.010Z] [INFO] Expected eclipse log file: /home/jenkins/agent/workspace/ease.verify.core.target.2019-12/tests/org.eclipse.ease.lang.javascript.nashorn.test/target/work/data/.metadata/.log
06:42:29 [2020-08-08T10:42:29.010Z] [INFO] Command line:
06:42:29 [2020-08-08T10:42:29.010Z] 	[/opt/tools/java/oracle/jdk-8/1.8.0_202/jre/bin/java, -Dosgi.noShutdown=false, -Dosgi.os=linux, -Dosgi.ws=gtk, -Dosgi.arch=x86_64, -Dosgi.clean=true, -jar, /home/jenkins/.m2/repository/p2/osgi/bundle/org.eclipse.equinox.launcher/1.5.600.v20191014-2022/org.eclipse.equinox.launcher-1.5.600.v20191014-2022.jar, -data, /home/jenkins/agent/workspace/ease.verify.core.target.2019-12/tests/org.eclipse.ease.lang.javascript.nashorn.test/target/work/data, -install, /home/jenkins/agent/workspace/ease.verify.core.target.2019-12/tests/org.eclipse.ease.lang.javascript.nashorn.test/target/work, -configuration, /home/jenkins/agent/workspace/ease.verify.core.target.2019-12/tests/org.eclipse.ease.lang.javascript.nashorn.test/target/work/configuration, -application, org.eclipse.tycho.surefire.osgibooter.headlesstest, -testproperties, /home/jenkins/agent/workspace/ease.verify.core.target.2019-12/tests/org.eclipse.ease.lang.javascript.nashorn.test/target/surefire.properties]
06:42:29 [2020-08-08T10:42:29.010Z] Picked up JAVA_TOOL_OPTIONS: -Dmaven.ext.class.path="/home/jenkins/agent/workspace/ease.verify.core.target.2019-12@tmp/withMaven2f46464d/pipeline-maven-spy.jar" -Dorg.jenkinsci.plugins.pipeline.maven.reportsFolder="/home/jenkins/agent/workspace/ease.verify.core.target.2019-12@tmp/withMaven2f46464d" 
06:42:30 [2020-08-08T10:42:30.397Z] Running org.eclipse.ease.lang.javascript.nashorn.NashornEnvironmentTest
06:42:30 [2020-08-08T10:42:30.959Z] Tests run: 5, Failures: 0, Errors: 0, Skipped: 0, Time elapsed: 0.701 s - in org.eclipse.ease.lang.javascript.nashorn.NashornEnvironmentTest
06:42:30 [2020-08-08T10:42:30.959Z] reloadEnvironment(org.eclipse.ease.lang.javascript.nashorn.NashornEnvironmentTest)  Time elapsed: 0.478 s
06:42:30 [2020-08-08T10:42:30.959Z] bootstrappedEnvironment(org.eclipse.ease.lang.javascript.nashorn.NashornEnvironmentTest)  Time elapsed: 0.023 s
06:42:30 [2020-08-08T10:42:30.959Z] postMethodCallback(org.eclipse.ease.lang.javascript.nashorn.NashornEnvironmentTest)  Time elapsed: 0.11 s
06:42:30 [2020-08-08T10:42:30.959Z] preMethodCallback(org.eclipse.ease.lang.javascript.nashorn.NashornEnvironmentTest)  Time elapsed: 0.044 s
06:42:30 [2020-08-08T10:42:30.959Z] reloadFunctionDefinitions(org.eclipse.ease.lang.javascript.nashorn.NashornEnvironmentTest)  Time elapsed: 0.032 s
06:42:30 [2020-08-08T10:42:30.959Z] 
06:42:30 [2020-08-08T10:42:30.959Z] Results:
06:42:30 [2020-08-08T10:42:30.959Z] 
06:42:30 [2020-08-08T10:42:30.959Z] Tests run: 5, Failures: 0, Errors: 0, Skipped: 0
06:42:30 [2020-08-08T10:42:30.959Z] 
06:42:31 [2020-08-08T10:42:31.521Z] [INFO] All tests passed!
06:42:31 [2020-08-08T10:42:31.521Z] [INFO] 
06:42:31 [2020-08-08T10:42:31.521Z] [INFO] ----< org.eclipse.ease:org.eclipse.ease.lang.javascript.rhino.test >----
06:42:31 [2020-08-08T10:42:31.521Z] [INFO] Building org.eclipse.ease.lang.javascript.rhino.test 0.8.0-SNAPSHOT [5/11]
06:42:31 [2020-08-08T10:42:31.521Z] [INFO] ------------------------[ eclipse-test-plugin ]-------------------------
06:42:31 [2020-08-08T10:42:31.521Z] [INFO] 
06:42:31 [2020-08-08T10:42:31.521Z] [INFO] --- tycho-packaging-plugin:1.3.0:build-qualifier (default-build-qualifier) @ org.eclipse.ease.lang.javascript.rhino.test ---
06:42:31 [2020-08-08T10:42:31.521Z] [INFO] The project's OSGi version is 0.8.0.I201911291239
06:42:31 [2020-08-08T10:42:31.521Z] [INFO] 
06:42:31 [2020-08-08T10:42:31.521Z] [INFO] --- tycho-packaging-plugin:1.3.0:validate-id (default-validate-id) @ org.eclipse.ease.lang.javascript.rhino.test ---
06:42:31 [2020-08-08T10:42:31.521Z] [INFO] 
06:42:31 [2020-08-08T10:42:31.521Z] [INFO] --- tycho-packaging-plugin:1.3.0:validate-version (default-validate-version) @ org.eclipse.ease.lang.javascript.rhino.test ---
06:42:31 [2020-08-08T10:42:31.521Z] [INFO] 
06:42:31 [2020-08-08T10:42:31.521Z] [INFO] --- maven-resources-plugin:2.4.3:resources (default-resources) @ org.eclipse.ease.lang.javascript.rhino.test ---
06:42:31 [2020-08-08T10:42:31.521Z] [INFO] Using 'UTF-8' encoding to copy filtered resources.
06:42:31 [2020-08-08T10:42:31.521Z] [INFO] skip non existing resourceDirectory /home/jenkins/agent/workspace/ease.verify.core.target.2019-12/tests/org.eclipse.ease.lang.javascript.rhino.test/src/main/resources
06:42:31 [2020-08-08T10:42:31.521Z] [INFO] 
06:42:31 [2020-08-08T10:42:31.521Z] [INFO] --- tycho-compiler-plugin:1.3.0:compile (default-compile) @ org.eclipse.ease.lang.javascript.rhino.test ---
06:42:31 [2020-08-08T10:42:31.521Z] [INFO] Nothing to compile - all classes are up to date
06:42:31 [2020-08-08T10:42:31.521Z] [INFO] 
06:42:31 [2020-08-08T10:42:31.521Z] [INFO] --- maven-resources-plugin:2.4.3:testResources (default-testResources) @ org.eclipse.ease.lang.javascript.rhino.test ---
06:42:31 [2020-08-08T10:42:31.521Z] [INFO] Using 'UTF-8' encoding to copy filtered resources.
06:42:31 [2020-08-08T10:42:31.521Z] [INFO] skip non existing resourceDirectory /home/jenkins/agent/workspace/ease.verify.core.target.2019-12/tests/org.eclipse.ease.lang.javascript.rhino.test/src/test/resources
06:42:31 [2020-08-08T10:42:31.521Z] [INFO] 
06:42:31 [2020-08-08T10:42:31.522Z] [INFO] --- tycho-source-plugin:1.3.0:plugin-source (plugin-source) @ org.eclipse.ease.lang.javascript.rhino.test ---
06:42:31 [2020-08-08T10:42:31.522Z] [WARNING] Bundle-Vendor header not found in /home/jenkins/agent/workspace/ease.verify.core.target.2019-12/tests/org.eclipse.ease.lang.javascript.rhino.test/META-INF/MANIFEST.MF, fallback to 'unknown' for source bundle
06:42:31 [2020-08-08T10:42:31.522Z] [INFO] Building jar: /home/jenkins/agent/workspace/ease.verify.core.target.2019-12/tests/org.eclipse.ease.lang.javascript.rhino.test/target/org.eclipse.ease.lang.javascript.rhino.test-0.8.0-SNAPSHOT-sources.jar
06:42:31 [2020-08-08T10:42:31.522Z] [INFO] 
06:42:31 [2020-08-08T10:42:31.522Z] [INFO] --- target-platform-configuration:1.3.0:target-platform (default-target-platform) @ org.eclipse.ease.lang.javascript.rhino.test ---
06:42:31 [2020-08-08T10:42:31.522Z] [INFO] 
06:42:31 [2020-08-08T10:42:31.522Z] [INFO] --- tycho-packaging-plugin:1.3.0:package-plugin (default-package-plugin) @ org.eclipse.ease.lang.javascript.rhino.test ---
06:42:31 [2020-08-08T10:42:31.522Z] [INFO] Building jar: /home/jenkins/agent/workspace/ease.verify.core.target.2019-12/tests/org.eclipse.ease.lang.javascript.rhino.test/target/org.eclipse.ease.lang.javascript.rhino.test-0.8.0-SNAPSHOT.jar
06:42:31 [2020-08-08T10:42:31.522Z] [INFO] 
06:42:31 [2020-08-08T10:42:31.522Z] [INFO] --- tycho-p2-plugin:1.3.0:p2-metadata-default (default-p2-metadata-default) @ org.eclipse.ease.lang.javascript.rhino.test ---
06:42:31 [2020-08-08T10:42:31.522Z] [INFO] 
06:42:31 [2020-08-08T10:42:31.522Z] [INFO] --- tycho-source-feature-plugin:1.3.0:source-feature (source-feature) @ org.eclipse.ease.lang.javascript.rhino.test ---
06:42:31 [2020-08-08T10:42:31.522Z] [INFO] 
06:42:31 [2020-08-08T10:42:31.522Z] [INFO] --- tycho-p2-plugin:1.3.0:p2-metadata (attached-p2-metadata) @ org.eclipse.ease.lang.javascript.rhino.test ---
06:42:31 [2020-08-08T10:42:31.522Z] [INFO] 
06:42:31 [2020-08-08T10:42:31.522Z] [INFO] --- tycho-surefire-plugin:1.3.0:test (default-test) @ org.eclipse.ease.lang.javascript.rhino.test ---
06:42:31 [2020-08-08T10:42:31.522Z] [INFO] Expected eclipse log file: /home/jenkins/agent/workspace/ease.verify.core.target.2019-12/tests/org.eclipse.ease.lang.javascript.rhino.test/target/work/data/.metadata/.log
06:42:31 [2020-08-08T10:42:31.522Z] [INFO] Command line:
06:42:31 [2020-08-08T10:42:31.522Z] 	[/opt/tools/java/oracle/jdk-8/1.8.0_202/jre/bin/java, -Dosgi.noShutdown=false, -Dosgi.os=linux, -Dosgi.ws=gtk, -Dosgi.arch=x86_64, -Dosgi.clean=true, -jar, /home/jenkins/.m2/repository/p2/osgi/bundle/org.eclipse.equinox.launcher/1.5.600.v20191014-2022/org.eclipse.equinox.launcher-1.5.600.v20191014-2022.jar, -data, /home/jenkins/agent/workspace/ease.verify.core.target.2019-12/tests/org.eclipse.ease.lang.javascript.rhino.test/target/work/data, -install, /home/jenkins/agent/workspace/ease.verify.core.target.2019-12/tests/org.eclipse.ease.lang.javascript.rhino.test/target/work, -configuration, /home/jenkins/agent/workspace/ease.verify.core.target.2019-12/tests/org.eclipse.ease.lang.javascript.rhino.test/target/work/configuration, -application, org.eclipse.tycho.surefire.osgibooter.headlesstest, -testproperties, /home/jenkins/agent/workspace/ease.verify.core.target.2019-12/tests/org.eclipse.ease.lang.javascript.rhino.test/target/surefire.properties]
06:42:31 [2020-08-08T10:42:31.522Z] Picked up JAVA_TOOL_OPTIONS: -Dmaven.ext.class.path="/home/jenkins/agent/workspace/ease.verify.core.target.2019-12@tmp/withMaven2f46464d/pipeline-maven-spy.jar" -Dorg.jenkinsci.plugins.pipeline.maven.reportsFolder="/home/jenkins/agent/workspace/ease.verify.core.target.2019-12@tmp/withMaven2f46464d" 
06:42:32 [2020-08-08T10:42:32.929Z] Running org.eclipse.ease.lang.javascript.rhino.RhinoScriptEngineTest
06:42:33 [2020-08-08T10:42:33.195Z] org.eclipse.ease.ScriptExecutionException: JavaError: NotThere cannot be found by org.mozilla.javascript_1.7.10.v20190430-1943
06:42:33 [2020-08-08T10:42:33.195Z] 	at <unknown source>
06:42:33 [2020-08-08T10:42:33.195Z] 
06:42:33 [2020-08-08T10:42:33.195Z] Java Stacktrace:
06:42:33 [2020-08-08T10:42:33.195Z] java.lang.ClassNotFoundException: NotThere cannot be found by org.mozilla.javascript_1.7.10.v20190430-1943
06:42:33 [2020-08-08T10:42:33.195Z] 	at org.eclipse.osgi.internal.loader.BundleLoader.findClassInternal(BundleLoader.java:514)
06:42:33 [2020-08-08T10:42:33.195Z] 	at org.eclipse.osgi.internal.loader.BundleLoader.findClass(BundleLoader.java:425)
06:42:33 [2020-08-08T10:42:33.195Z] 	at org.eclipse.osgi.internal.loader.BundleLoader.findClass(BundleLoader.java:417)
06:42:33 [2020-08-08T10:42:33.195Z] 	at org.eclipse.osgi.internal.loader.ModuleClassLoader.loadClass(ModuleClassLoader.java:171)
06:42:33 [2020-08-08T10:42:33.195Z] 	at java.lang.ClassLoader.loadClass(ClassLoader.java:357)
06:42:33 [2020-08-08T10:42:33.195Z] 	at java.lang.Class.forName0(Native Method)
06:42:33 [2020-08-08T10:42:33.195Z] 	at java.lang.Class.forName(Class.java:264)
06:42:33 [2020-08-08T10:42:33.195Z] 	at sun.reflect.NativeMethodAccessorImpl.invoke0(Native Method)
06:42:33 [2020-08-08T10:42:33.195Z] 	at sun.reflect.NativeMethodAccessorImpl.invoke(NativeMethodAccessorImpl.java:62)
06:42:33 [2020-08-08T10:42:33.195Z] 	at sun.reflect.DelegatingMethodAccessorImpl.invoke(DelegatingMethodAccessorImpl.java:43)
06:42:33 [2020-08-08T10:42:33.195Z] 	at java.lang.reflect.Method.invoke(Method.java:498)
06:42:33 [2020-08-08T10:42:33.195Z] 	at org.mozilla.javascript.MemberBox.invoke(MemberBox.java:126)
06:42:33 [2020-08-08T10:42:33.195Z] 	at org.mozilla.javascript.NativeJavaMethod.call(NativeJavaMethod.java:225)
06:42:33 [2020-08-08T10:42:33.195Z] 	at org.mozilla.javascript.optimizer.OptRuntime.call1(OptRuntime.java:32)
06:42:33 [2020-08-08T10:42:33.195Z] 	at org.mozilla.javascript.gen.c_3._c_script_0(Unknown Source)
06:42:33 [2020-08-08T10:42:33.195Z] 	at org.mozilla.javascript.gen.c_3.call(Unknown Source)
06:42:33 [2020-08-08T10:42:33.195Z] 	at org.mozilla.javascript.ContextFactory.doTopCall(ContextFactory.java:405)
06:42:33 [2020-08-08T10:42:33.195Z] 	at org.mozilla.javascript.ScriptRuntime.doTopCall(ScriptRuntime.java:3508)
06:42:33 [2020-08-08T10:42:33.195Z] 	at org.mozilla.javascript.gen.c_3.call(Unknown Source)
06:42:33 [2020-08-08T10:42:33.195Z] 	at org.mozilla.javascript.gen.c_3.exec(Unknown Source)
06:42:33 [2020-08-08T10:42:33.195Z] 	at org.mozilla.javascript.Context.evaluateReader(Context.java:1293)
06:42:33 [2020-08-08T10:42:33.195Z] 	at org.eclipse.ease.lang.javascript.rhino.RhinoScriptEngine.internalExecute(RhinoScriptEngine.java:222)
06:42:33 [2020-08-08T10:42:33.195Z] 	at org.eclipse.ease.lang.javascript.rhino.RhinoScriptEngine.execute(RhinoScriptEngine.java:201)
06:42:33 [2020-08-08T10:42:33.195Z] 	at org.eclipse.ease.AbstractScriptEngine.inject(AbstractScriptEngine.java:222)
06:42:33 [2020-08-08T10:42:33.195Z] 	at org.eclipse.ease.AbstractScriptEngine.run(AbstractScriptEngine.java:272)
06:42:33 [2020-08-08T10:42:33.195Z] 	at org.eclipse.core.internal.jobs.Worker.run(Worker.java:63)
06:42:33 [2020-08-08T10:42:33.195Z] org.eclipse.ease.ScriptExecutionException: TypeError: Cannot call method "foobar" of undefined
06:42:33 [2020-08-08T10:42:33.195Z] 	at <unknown source>
06:42:33 [2020-08-08T10:42:33.195Z] org.eclipse.ease.ScriptExecutionException: ScriptException: test
06:42:33 [2020-08-08T10:42:33.195Z] 	at <unknown source>
06:42:33 [2020-08-08T10:42:33.195Z] org.eclipse.ease.ScriptExecutionException: JavaError: java.lang.Exception
06:42:33 [2020-08-08T10:42:33.195Z] 	at <unknown source>
06:42:33 [2020-08-08T10:42:33.195Z] 
06:42:33 [2020-08-08T10:42:33.195Z] Java Stacktrace:
06:42:33 [2020-08-08T10:42:33.195Z] java.lang.Exception
06:42:33 [2020-08-08T10:42:33.195Z] 	at sun.reflect.NativeConstructorAccessorImpl.newInstance0(Native Method)
06:42:33 [2020-08-08T10:42:33.195Z] 	at sun.reflect.NativeConstructorAccessorImpl.newInstance(NativeConstructorAccessorImpl.java:62)
06:42:33 [2020-08-08T10:42:33.195Z] 	at sun.reflect.DelegatingConstructorAccessorImpl.newInstance(DelegatingConstructorAccessorImpl.java:45)
06:42:33 [2020-08-08T10:42:33.195Z] 	at java.lang.reflect.Constructor.newInstance(Constructor.java:423)
06:42:33 [2020-08-08T10:42:33.195Z] 	at org.mozilla.javascript.MemberBox.newInstance(MemberBox.java:159)
06:42:33 [2020-08-08T10:42:33.195Z] 	at org.mozilla.javascript.NativeJavaClass.constructInternal(NativeJavaClass.java:266)
06:42:33 [2020-08-08T10:42:33.195Z] 	at org.mozilla.javascript.NativeJavaClass.constructSpecific(NativeJavaClass.java:205)
06:42:33 [2020-08-08T10:42:33.195Z] 	at org.mozilla.javascript.NativeJavaClass.construct(NativeJavaClass.java:166)
06:42:33 [2020-08-08T10:42:33.195Z] 	at org.mozilla.javascript.ScriptRuntime.newObject(ScriptRuntime.java:2655)
06:42:33 [2020-08-08T10:42:33.195Z] 	at org.mozilla.javascript.gen.c_21._c_script_0(Unknown Source)
06:42:33 [2020-08-08T10:42:33.195Z] 	at org.mozilla.javascript.gen.c_21.call(Unknown Source)
06:42:33 [2020-08-08T10:42:33.195Z] 	at org.mozilla.javascript.ContextFactory.doTopCall(ContextFactory.java:405)
06:42:33 [2020-08-08T10:42:33.195Z] 	at org.mozilla.javascript.ScriptRuntime.doTopCall(ScriptRuntime.java:3508)
06:42:33 [2020-08-08T10:42:33.195Z] 	at org.mozilla.javascript.gen.c_21.call(Unknown Source)
06:42:33 [2020-08-08T10:42:33.195Z] 	at org.mozilla.javascript.gen.c_21.exec(Unknown Source)
06:42:33 [2020-08-08T10:42:33.195Z] 	at org.mozilla.javascript.Context.evaluateReader(Context.java:1293)
06:42:33 [2020-08-08T10:42:33.195Z] 	at org.eclipse.ease.lang.javascript.rhino.RhinoScriptEngine.internalExecute(RhinoScriptEngine.java:222)
06:42:33 [2020-08-08T10:42:33.195Z] 	at org.eclipse.ease.lang.javascript.rhino.RhinoScriptEngine.execute(RhinoScriptEngine.java:201)
06:42:33 [2020-08-08T10:42:33.195Z] 	at org.eclipse.ease.AbstractScriptEngine.inject(AbstractScriptEngine.java:222)
06:42:33 [2020-08-08T10:42:33.195Z] 	at org.eclipse.ease.AbstractScriptEngine.run(AbstractScriptEngine.java:272)
06:42:33 [2020-08-08T10:42:33.195Z] 	at org.eclipse.core.internal.jobs.Worker.run(Worker.java:63)
06:42:33 [2020-08-08T10:42:33.195Z] org.eclipse.ease.ScriptExecutionException: ScriptException: JavaScript
06:42:33 [2020-08-08T10:42:33.195Z] 	at <unknown source>
06:42:33 [2020-08-08T10:42:33.195Z] org.eclipse.ease.ScriptExecutionException: SyntaxError: unterminated string literal (#1)
06:42:33 [2020-08-08T10:42:33.195Z] 'asdf
06:42:33 [2020-08-08T10:42:33.195Z]     ^
06:42:33 [2020-08-08T10:42:33.195Z] 	at <unknown source>
06:42:33 [2020-08-08T10:42:33.451Z] Tests run: 11, Failures: 0, Errors: 0, Skipped: 0, Time elapsed: 0.423 s - in org.eclipse.ease.lang.javascript.rhino.RhinoScriptEngineTest
06:42:33 [2020-08-08T10:42:33.451Z] causeWrappedException(org.eclipse.ease.lang.javascript.rhino.RhinoScriptEngineTest)  Time elapsed: 0.167 s
06:42:33 [2020-08-08T10:42:33.451Z] optionalModuleParameters(org.eclipse.ease.lang.javascript.rhino.RhinoScriptEngineTest)  Time elapsed: 0.045 s
06:42:33 [2020-08-08T10:42:33.451Z] simpleScriptCode(org.eclipse.ease.lang.javascript.rhino.RhinoScriptEngineTest)  Time elapsed: 0.016 s
06:42:33 [2020-08-08T10:42:33.451Z] causeRuntimeErrorException(org.eclipse.ease.lang.javascript.rhino.RhinoScriptEngineTest)  Time elapsed: 0.023 s
06:42:33 [2020-08-08T10:42:33.451Z] callModuleCode(org.eclipse.ease.lang.javascript.rhino.RhinoScriptEngineTest)  Time elapsed: 0.047 s
06:42:33 [2020-08-08T10:42:33.451Z] throwJavaClass(org.eclipse.ease.lang.javascript.rhino.RhinoScriptEngineTest)  Time elapsed: 0.013 s
06:42:33 [2020-08-08T10:42:33.451Z] throwJavaException(org.eclipse.ease.lang.javascript.rhino.RhinoScriptEngineTest)  Time elapsed: 0.012 s
06:42:33 [2020-08-08T10:42:33.451Z] accessJavaClasses(org.eclipse.ease.lang.javascript.rhino.RhinoScriptEngineTest)  Time elapsed: 0.011 s
06:42:33 [2020-08-08T10:42:33.451Z] accessEclipseClasses(org.eclipse.ease.lang.javascript.rhino.RhinoScriptEngineTest)  Time elapsed: 0.01 s
06:42:33 [2020-08-08T10:42:33.451Z] throwJavaScriptException(org.eclipse.ease.lang.javascript.rhino.RhinoScriptEngineTest)  Time elapsed: 0.01 s
06:42:33 [2020-08-08T10:42:33.451Z] causeSyntaxErrorException(org.eclipse.ease.lang.javascript.rhino.RhinoScriptEngineTest)  Time elapsed: 0.043 s
06:42:33 [2020-08-08T10:42:33.451Z] Running org.eclipse.ease.lang.javascript.rhino.RhinoEnvironmentTest
06:42:33 [2020-08-08T10:42:33.451Z] Tests run: 5, Failures: 0, Errors: 0, Skipped: 0, Time elapsed: 0.145 s - in org.eclipse.ease.lang.javascript.rhino.RhinoEnvironmentTest
06:42:33 [2020-08-08T10:42:33.451Z] reloadEnvironment(org.eclipse.ease.lang.javascript.rhino.RhinoEnvironmentTest)  Time elapsed: 0.018 s
06:42:33 [2020-08-08T10:42:33.451Z] bootstrappedEnvironment(org.eclipse.ease.lang.javascript.rhino.RhinoEnvironmentTest)  Time elapsed: 0.009 s
06:42:33 [2020-08-08T10:42:33.451Z] postMethodCallback(org.eclipse.ease.lang.javascript.rhino.RhinoEnvironmentTest)  Time elapsed: 0.088 s
06:42:33 [2020-08-08T10:42:33.451Z] preMethodCallback(org.eclipse.ease.lang.javascript.rhino.RhinoEnvironmentTest)  Time elapsed: 0.012 s
06:42:33 [2020-08-08T10:42:33.451Z] reloadFunctionDefinitions(org.eclipse.ease.lang.javascript.rhino.RhinoEnvironmentTest)  Time elapsed: 0.017 s
06:42:33 [2020-08-08T10:42:33.451Z] Running org.eclipse.ease.lang.javascript.rhino.RhinoDebuggerEngineTest
06:42:33 [2020-08-08T10:42:33.708Z] org.eclipse.ease.ScriptExecutionException: JavaError: NotThere cannot be found by org.mozilla.javascript_1.7.10.v20190430-1943
06:42:33 [2020-08-08T10:42:33.708Z] 
06:42:33 [2020-08-08T10:42:33.708Z] Java Stacktrace:
06:42:33 [2020-08-08T10:42:33.708Z] java.lang.ClassNotFoundException: NotThere cannot be found by org.mozilla.javascript_1.7.10.v20190430-1943
06:42:33 [2020-08-08T10:42:33.708Z] 	at org.eclipse.osgi.internal.loader.BundleLoader.findClassInternal(BundleLoader.java:514)
06:42:33 [2020-08-08T10:42:33.708Z] 	at org.eclipse.osgi.internal.loader.BundleLoader.findClass(BundleLoader.java:425)
06:42:33 [2020-08-08T10:42:33.708Z] 	at org.eclipse.osgi.internal.loader.BundleLoader.findClass(BundleLoader.java:417)
06:42:33 [2020-08-08T10:42:33.708Z] 	at org.eclipse.osgi.internal.loader.ModuleClassLoader.loadClass(ModuleClassLoader.java:171)
06:42:33 [2020-08-08T10:42:33.708Z] 	at java.lang.ClassLoader.loadClass(ClassLoader.java:357)
06:42:33 [2020-08-08T10:42:33.708Z] 	at java.lang.Class.forName0(Native Method)
06:42:33 [2020-08-08T10:42:33.708Z] 	at java.lang.Class.forName(Class.java:264)
06:42:33 [2020-08-08T10:42:33.708Z] 	at sun.reflect.NativeMethodAccessorImpl.invoke0(Native Method)
06:42:33 [2020-08-08T10:42:33.708Z] 	at sun.reflect.NativeMethodAccessorImpl.invoke(NativeMethodAccessorImpl.java:62)
06:42:33 [2020-08-08T10:42:33.708Z] 	at sun.reflect.DelegatingMethodAccessorImpl.invoke(DelegatingMethodAccessorImpl.java:43)
06:42:33 [2020-08-08T10:42:33.708Z] 	at java.lang.reflect.Method.invoke(Method.java:498)
06:42:33 [2020-08-08T10:42:33.708Z] 	at org.mozilla.javascript.MemberBox.invoke(MemberBox.java:126)
06:42:33 [2020-08-08T10:42:33.708Z] 	at org.mozilla.javascript.NativeJavaMethod.call(NativeJavaMethod.java:225)
06:42:33 [2020-08-08T10:42:33.708Z] 	at org.mozilla.javascript.Interpreter.interpretLoop(Interpreter.java:1573)
06:42:33 [2020-08-08T10:42:33.708Z] 	at org.mozilla.javascript.Interpreter.interpret(Interpreter.java:911)
06:42:33 [2020-08-08T10:42:33.708Z] 	at org.mozilla.javascript.InterpretedFunction.call(InterpretedFunction.java:109)
06:42:33 [2020-08-08T10:42:33.708Z] 	at org.mozilla.javascript.ContextFactory.doTopCall(ContextFactory.java:405)
06:42:33 [2020-08-08T10:42:33.708Z] 	at org.mozilla.javascript.ScriptRuntime.doTopCall(ScriptRuntime.java:3508)
06:42:33 [2020-08-08T10:42:33.708Z] 	at org.mozilla.javascript.InterpretedFunction.exec(InterpretedFunction.java:120)
06:42:33 [2020-08-08T10:42:33.708Z] 	at org.mozilla.javascript.Context.evaluateReader(Context.java:1293)
06:42:33 [2020-08-08T10:42:33.708Z] 	at org.eclipse.ease.lang.javascript.rhino.RhinoScriptEngine.internalExecute(RhinoScriptEngine.java:222)
06:42:33 [2020-08-08T10:42:33.708Z] 	at org.eclipse.ease.lang.javascript.rhino.RhinoScriptEngine.execute(RhinoScriptEngine.java:201)
06:42:33 [2020-08-08T10:42:33.708Z] 	at org.eclipse.ease.AbstractScriptEngine.inject(AbstractScriptEngine.java:222)
06:42:33 [2020-08-08T10:42:33.708Z] 	at org.eclipse.ease.AbstractScriptEngine.run(AbstractScriptEngine.java:272)
06:42:33 [2020-08-08T10:42:33.708Z] 	at org.eclipse.core.internal.jobs.Worker.run(Worker.java:63)
06:42:33 [2020-08-08T10:42:33.708Z] org.eclipse.ease.ScriptExecutionException: TypeError: Cannot call method "foobar" of undefined
06:42:33 [2020-08-08T10:42:33.708Z] org.eclipse.ease.ScriptExecutionException: ScriptException: test
06:42:33 [2020-08-08T10:42:33.708Z] org.eclipse.ease.ScriptExecutionException: JavaError: java.lang.Exception
06:42:33 [2020-08-08T10:42:33.708Z] 
06:42:33 [2020-08-08T10:42:33.708Z] Java Stacktrace:
06:42:33 [2020-08-08T10:42:33.708Z] java.lang.Exception
06:42:33 [2020-08-08T10:42:33.708Z] 	at sun.reflect.NativeConstructorAccessorImpl.newInstance0(Native Method)
06:42:33 [2020-08-08T10:42:33.708Z] 	at sun.reflect.NativeConstructorAccessorImpl.newInstance(NativeConstructorAccessorImpl.java:62)
06:42:33 [2020-08-08T10:42:33.708Z] 	at sun.reflect.DelegatingConstructorAccessorImpl.newInstance(DelegatingConstructorAccessorImpl.java:45)
06:42:33 [2020-08-08T10:42:33.708Z] 	at java.lang.reflect.Constructor.newInstance(Constructor.java:423)
06:42:33 [2020-08-08T10:42:33.708Z] 	at org.mozilla.javascript.MemberBox.newInstance(MemberBox.java:159)
06:42:33 [2020-08-08T10:42:33.708Z] 	at org.mozilla.javascript.NativeJavaClass.constructInternal(NativeJavaClass.java:266)
06:42:33 [2020-08-08T10:42:33.708Z] 	at org.mozilla.javascript.NativeJavaClass.constructSpecific(NativeJavaClass.java:205)
06:42:33 [2020-08-08T10:42:33.708Z] 	at org.mozilla.javascript.NativeJavaClass.construct(NativeJavaClass.java:166)
06:42:33 [2020-08-08T10:42:33.708Z] 	at org.mozilla.javascript.Interpreter.interpretLoop(Interpreter.java:1617)
06:42:33 [2020-08-08T10:42:33.708Z] 	at org.mozilla.javascript.Interpreter.interpret(Interpreter.java:911)
06:42:33 [2020-08-08T10:42:33.708Z] 	at org.mozilla.javascript.InterpretedFunction.call(InterpretedFunction.java:109)
06:42:33 [2020-08-08T10:42:33.708Z] 	at org.mozilla.javascript.ContextFactory.doTopCall(ContextFactory.java:405)
06:42:33 [2020-08-08T10:42:33.708Z] 	at org.mozilla.javascript.ScriptRuntime.doTopCall(ScriptRuntime.java:3508)
06:42:33 [2020-08-08T10:42:33.708Z] 	at org.mozilla.javascript.InterpretedFunction.exec(InterpretedFunction.java:120)
06:42:33 [2020-08-08T10:42:33.708Z] 	at org.mozilla.javascript.Context.evaluateReader(Context.java:1293)
06:42:33 [2020-08-08T10:42:33.708Z] 	at org.eclipse.ease.lang.javascript.rhino.RhinoScriptEngine.internalExecute(RhinoScriptEngine.java:222)
06:42:33 [2020-08-08T10:42:33.708Z] 	at org.eclipse.ease.lang.javascript.rhino.RhinoScriptEngine.execute(RhinoScriptEngine.java:201)
06:42:33 [2020-08-08T10:42:33.708Z] 	at org.eclipse.ease.AbstractScriptEngine.inject(AbstractScriptEngine.java:222)
06:42:33 [2020-08-08T10:42:33.708Z] 	at org.eclipse.ease.AbstractScriptEngine.run(AbstractScriptEngine.java:272)
06:42:33 [2020-08-08T10:42:33.708Z] 	at org.eclipse.core.internal.jobs.Worker.run(Worker.java:63)
06:42:33 [2020-08-08T10:42:33.708Z] org.eclipse.ease.ScriptExecutionException: ScriptException: JavaScript
06:42:33 [2020-08-08T10:42:33.708Z] org.eclipse.ease.ScriptExecutionException: SyntaxError: unterminated string literal (#1)
06:42:33 [2020-08-08T10:42:33.708Z] 'asdf
06:42:33 [2020-08-08T10:42:33.708Z]     ^
06:42:33 [2020-08-08T10:42:33.708Z] 	at <unknown source>:1
06:42:33 [2020-08-08T10:42:33.708Z] Tests run: 12, Failures: 0, Errors: 0, Skipped: 0, Time elapsed: 0.272 s - in org.eclipse.ease.lang.javascript.rhino.RhinoDebuggerEngineTest
06:42:33 [2020-08-08T10:42:33.708Z] getExceptionStackTrace(org.eclipse.ease.lang.javascript.rhino.RhinoDebuggerEngineTest)  Time elapsed: 0.083 s
06:42:33 [2020-08-08T10:42:33.708Z] causeWrappedException(org.eclipse.ease.lang.javascript.rhino.RhinoDebuggerEngineTest)  Time elapsed: 0.021 s
06:42:33 [2020-08-08T10:42:33.708Z] optionalModuleParameters(org.eclipse.ease.lang.javascript.rhino.RhinoDebuggerEngineTest)  Time elapsed: 0.036 s
06:42:33 [2020-08-08T10:42:33.708Z] simpleScriptCode(org.eclipse.ease.lang.javascript.rhino.RhinoDebuggerEngineTest)  Time elapsed: 0.011 s
06:42:33 [2020-08-08T10:42:33.708Z] causeRuntimeErrorException(org.eclipse.ease.lang.javascript.rhino.RhinoDebuggerEngineTest)  Time elapsed: 0.012 s
06:42:33 [2020-08-08T10:42:33.708Z] callModuleCode(org.eclipse.ease.lang.javascript.rhino.RhinoDebuggerEngineTest)  Time elapsed: 0.01 s
06:42:33 [2020-08-08T10:42:33.708Z] throwJavaClass(org.eclipse.ease.lang.javascript.rhino.RhinoDebuggerEngineTest)  Time elapsed: 0.016 s
06:42:33 [2020-08-08T10:42:33.708Z] throwJavaException(org.eclipse.ease.lang.javascript.rhino.RhinoDebuggerEngineTest)  Time elapsed: 0.041 s
06:42:33 [2020-08-08T10:42:33.708Z] accessJavaClasses(org.eclipse.ease.lang.javascript.rhino.RhinoDebuggerEngineTest)  Time elapsed: 0.011 s
06:42:33 [2020-08-08T10:42:33.708Z] accessEclipseClasses(org.eclipse.ease.lang.javascript.rhino.RhinoDebuggerEngineTest)  Time elapsed: 0.009 s
06:42:33 [2020-08-08T10:42:33.708Z] throwJavaScriptException(org.eclipse.ease.lang.javascript.rhino.RhinoDebuggerEngineTest)  Time elapsed: 0.01 s
06:42:33 [2020-08-08T10:42:33.708Z] causeSyntaxErrorException(org.eclipse.ease.lang.javascript.rhino.RhinoDebuggerEngineTest)  Time elapsed: 0.01 s
06:42:33 [2020-08-08T10:42:33.708Z] Running org.eclipse.ease.lang.javascript.rhino.RhinoDebugTest
06:42:33 [2020-08-08T10:42:33.971Z] Start of script
06:42:33 [2020-08-08T10:42:33.971Z] include file start
06:42:33 [2020-08-08T10:42:33.971Z] Include file processed
06:42:33 [2020-08-08T10:42:33.971Z] line after include file
06:42:33 [2020-08-08T10:42:33.971Z] Result of testMethod = 5
06:42:33 [2020-08-08T10:42:33.971Z] End of script
06:42:33 [2020-08-08T10:42:33.971Z] Start of script
06:42:33 [2020-08-08T10:42:33.971Z] include file start
06:42:33 [2020-08-08T10:42:33.971Z] Include file processed
06:42:33 [2020-08-08T10:42:33.971Z] line after include file
06:42:33 [2020-08-08T10:42:33.971Z] Result of testMethod = 5
06:42:33 [2020-08-08T10:42:33.971Z] End of script
06:42:34 [2020-08-08T10:42:34.231Z] Start of script
06:42:34 [2020-08-08T10:42:34.231Z] include file start
06:42:34 [2020-08-08T10:42:34.231Z] Include file processed
06:42:34 [2020-08-08T10:42:34.231Z] line after include file
06:42:34 [2020-08-08T10:42:34.231Z] Result of testMethod = 5
06:42:34 [2020-08-08T10:42:34.486Z] Start of script
06:42:34 [2020-08-08T10:42:34.486Z] include file start
06:42:34 [2020-08-08T10:42:34.486Z] Include file processed
06:42:34 [2020-08-08T10:42:34.486Z] line after include file
06:42:34 [2020-08-08T10:42:34.742Z] Result of testMethod = 5
06:42:34 [2020-08-08T10:42:34.742Z] End of script
06:42:34 [2020-08-08T10:42:34.998Z] Start of script
06:42:34 [2020-08-08T10:42:34.998Z] include file start
06:42:34 [2020-08-08T10:42:34.998Z] Include file processed
06:42:34 [2020-08-08T10:42:34.998Z] line after include file
06:42:34 [2020-08-08T10:42:34.998Z] Result of testMethod = 5
06:42:34 [2020-08-08T10:42:34.998Z] End of script
06:42:34 [2020-08-08T10:42:34.998Z] Start of script
06:42:35 [2020-08-08T10:42:35.254Z] include file start
06:42:35 [2020-08-08T10:42:35.254Z] Include file processed
06:42:35 [2020-08-08T10:42:35.254Z] line after include file
06:42:35 [2020-08-08T10:42:35.254Z] Result of testMethod = 5
06:42:35 [2020-08-08T10:42:35.254Z] End of script
06:42:35 [2020-08-08T10:42:35.510Z] Start of script
06:42:35 [2020-08-08T10:42:35.510Z] include file start
06:42:35 [2020-08-08T10:42:35.510Z] Include file processed
06:42:35 [2020-08-08T10:42:35.510Z] line after include file
06:42:35 [2020-08-08T10:42:35.510Z] Result of testMethod = 5
06:42:35 [2020-08-08T10:42:35.766Z] Start of script
06:42:35 [2020-08-08T10:42:35.766Z] include file start
06:42:35 [2020-08-08T10:42:35.766Z] Include file processed
06:42:35 [2020-08-08T10:42:35.766Z] line after include file
06:42:36 [2020-08-08T10:42:36.021Z] Result of testMethod = 5
06:42:36 [2020-08-08T10:42:36.021Z] End of script
06:42:36 [2020-08-08T10:42:36.021Z] Start of script
06:42:36 [2020-08-08T10:42:36.021Z] include file start
06:42:36 [2020-08-08T10:42:36.021Z] Include file processed
06:42:36 [2020-08-08T10:42:36.021Z] line after include file
06:42:36 [2020-08-08T10:42:36.021Z] Result of testMethod = 5
06:42:36 [2020-08-08T10:42:36.021Z] End of script
06:42:36 [2020-08-08T10:42:36.277Z] Start of script
06:42:36 [2020-08-08T10:42:36.277Z] include file start
06:42:36 [2020-08-08T10:42:36.277Z] Include file processed
06:42:36 [2020-08-08T10:42:36.277Z] line after include file
06:42:36 [2020-08-08T10:42:36.532Z] Start of script
06:42:36 [2020-08-08T10:42:36.532Z] include file start
06:42:36 [2020-08-08T10:42:36.788Z] Include file processed
06:42:36 [2020-08-08T10:42:36.788Z] line after include file
06:42:36 [2020-08-08T10:42:36.788Z] Result of testMethod = 5
06:42:36 [2020-08-08T10:42:36.788Z] End of script
06:42:36 [2020-08-08T10:42:36.788Z] Start of script
06:42:36 [2020-08-08T10:42:36.788Z] include file start
06:42:36 [2020-08-08T10:42:36.788Z] Include file processed
06:42:36 [2020-08-08T10:42:36.788Z] line after include file
06:42:37 [2020-08-08T10:42:37.043Z] Result of testMethod = 5
06:42:37 [2020-08-08T10:42:37.043Z] End of script
06:42:37 [2020-08-08T10:42:37.298Z] Start of script
06:42:37 [2020-08-08T10:42:37.553Z] include file start
06:42:37 [2020-08-08T10:42:37.553Z] Include file processed
06:42:37 [2020-08-08T10:42:37.554Z] line after include file
06:42:37 [2020-08-08T10:42:37.554Z] Result of testMethod = 5
06:42:37 [2020-08-08T10:42:37.554Z] End of script
06:42:37 [2020-08-08T10:42:37.554Z] Start of script
06:42:37 [2020-08-08T10:42:37.554Z] include file start
06:42:37 [2020-08-08T10:42:37.554Z] Include file processed
06:42:37 [2020-08-08T10:42:37.554Z] line after include file
06:42:37 [2020-08-08T10:42:37.809Z] Result of testMethod = 5
06:42:37 [2020-08-08T10:42:37.809Z] End of script
06:42:37 [2020-08-08T10:42:37.809Z] Start of script
06:42:37 [2020-08-08T10:42:37.809Z] include file start
06:42:37 [2020-08-08T10:42:37.809Z] Include file processed
06:42:37 [2020-08-08T10:42:37.809Z] line after include file
06:42:37 [2020-08-08T10:42:37.809Z] Result of testMethod = 5
06:42:38 [2020-08-08T10:42:38.370Z] Start of script
06:42:38 [2020-08-08T10:42:38.370Z] include file start
06:42:38 [2020-08-08T10:42:38.370Z] Include file processed
06:42:38 [2020-08-08T10:42:38.370Z] line after include file
06:42:38 [2020-08-08T10:42:38.370Z] Result of testMethod = 5
06:42:38 [2020-08-08T10:42:38.370Z] End of script
06:42:38 [2020-08-08T10:42:38.625Z] Start of script
06:42:38 [2020-08-08T10:42:38.625Z] include file start
06:42:38 [2020-08-08T10:42:38.625Z] Include file processed
06:42:38 [2020-08-08T10:42:38.625Z] line after include file
06:42:38 [2020-08-08T10:42:38.625Z] Result of testMethod = 5
06:42:38 [2020-08-08T10:42:38.880Z] End of script
06:42:38 [2020-08-08T10:42:38.880Z] Start of script
06:42:38 [2020-08-08T10:42:38.880Z] include file start
06:42:38 [2020-08-08T10:42:38.880Z] Include file processed
06:42:38 [2020-08-08T10:42:38.880Z] line after include file
06:42:39 [2020-08-08T10:42:39.135Z] Result of testMethod = 5
06:42:39 [2020-08-08T10:42:39.135Z] End of script
06:42:39 [2020-08-08T10:42:39.391Z] Start of script
06:42:39 [2020-08-08T10:42:39.391Z] include file start
06:42:39 [2020-08-08T10:42:39.391Z] Include file processed
06:42:39 [2020-08-08T10:42:39.391Z] line after include file
06:42:39 [2020-08-08T10:42:39.646Z] Result of testMethod = 5
06:42:39 [2020-08-08T10:42:39.646Z] End of script
06:42:39 [2020-08-08T10:42:39.646Z] Start of script
06:42:39 [2020-08-08T10:42:39.646Z] include file start
06:42:39 [2020-08-08T10:42:39.646Z] Include file processed
06:42:39 [2020-08-08T10:42:39.646Z] line after include file
06:42:39 [2020-08-08T10:42:39.646Z] Result of testMethod = 5
06:42:40 [2020-08-08T10:42:40.208Z] Start of script
06:42:40 [2020-08-08T10:42:40.208Z] include file start
06:42:40 [2020-08-08T10:42:40.208Z] Include file processed
06:42:40 [2020-08-08T10:42:40.208Z] line after include file
06:42:40 [2020-08-08T10:42:40.208Z] Result of testMethod = 5
06:42:40 [2020-08-08T10:42:40.208Z] End of script
06:42:40 [2020-08-08T10:42:40.208Z] Start of script
06:42:40 [2020-08-08T10:42:40.208Z] include file start
06:42:40 [2020-08-08T10:42:40.208Z] Include file processed
06:42:40 [2020-08-08T10:42:40.208Z] line after include file
06:42:40 [2020-08-08T10:42:40.464Z] Result of testMethod = 5
06:42:40 [2020-08-08T10:42:40.464Z] End of script
06:42:40 [2020-08-08T10:42:40.464Z] Start of script
06:42:40 [2020-08-08T10:42:40.464Z] include file start
06:42:40 [2020-08-08T10:42:40.464Z] Include file processed
06:42:40 [2020-08-08T10:42:40.464Z] line after include file
06:42:40 [2020-08-08T10:42:40.464Z] Result of testMethod = 5
06:42:40 [2020-08-08T10:42:40.464Z] End of script
06:42:40 [2020-08-08T10:42:40.720Z] Start of script
06:42:40 [2020-08-08T10:42:40.720Z] include file start
06:42:40 [2020-08-08T10:42:40.720Z] Include file processed
06:42:40 [2020-08-08T10:42:40.976Z] line after include file
06:42:40 [2020-08-08T10:42:40.977Z] Result of testMethod = 5
06:42:40 [2020-08-08T10:42:40.977Z] End of script
06:42:40 [2020-08-08T10:42:40.977Z] Start of script
06:42:40 [2020-08-08T10:42:40.977Z] include file start
06:42:40 [2020-08-08T10:42:40.977Z] Include file processed
06:42:40 [2020-08-08T10:42:40.977Z] line after include file
06:42:41 [2020-08-08T10:42:41.233Z] Start of script
06:42:41 [2020-08-08T10:42:41.489Z] include file start
06:42:41 [2020-08-08T10:42:41.489Z] Include file processed
06:42:41 [2020-08-08T10:42:41.489Z] line after include file
06:42:41 [2020-08-08T10:42:41.489Z] Result of testMethod = 5
06:42:41 [2020-08-08T10:42:41.489Z] End of script
06:42:41 [2020-08-08T10:42:41.489Z] Start of script
06:42:41 [2020-08-08T10:42:41.489Z] include file start
06:42:41 [2020-08-08T10:42:41.489Z] Include file processed
06:42:41 [2020-08-08T10:42:41.489Z] line after include file
06:42:41 [2020-08-08T10:42:41.489Z] Result of testMethod = 5
06:42:42 [2020-08-08T10:42:42.050Z] Start of script
06:42:42 [2020-08-08T10:42:42.050Z] include file start
06:42:42 [2020-08-08T10:42:42.050Z] Include file processed
06:42:42 [2020-08-08T10:42:42.050Z] line after include file
06:42:42 [2020-08-08T10:42:42.050Z] Result of testMethod = 5
06:42:42 [2020-08-08T10:42:42.050Z] End of script
06:42:42 [2020-08-08T10:42:42.050Z] Start of script
06:42:42 [2020-08-08T10:42:42.050Z] include file start
06:42:42 [2020-08-08T10:42:42.050Z] Include file processed
06:42:42 [2020-08-08T10:42:42.050Z] line after include file
06:42:42 [2020-08-08T10:42:42.306Z] Result of testMethod = 5
06:42:42 [2020-08-08T10:42:42.306Z] End of script
06:42:42 [2020-08-08T10:42:42.306Z] Start of script
06:42:42 [2020-08-08T10:42:42.306Z] include file start
06:42:42 [2020-08-08T10:42:42.306Z] Include file processed
06:42:42 [2020-08-08T10:42:42.306Z] line after include file
06:42:42 [2020-08-08T10:42:42.562Z] Result of testMethod = 5
06:42:42 [2020-08-08T10:42:42.562Z] End of script
06:42:42 [2020-08-08T10:42:42.818Z] Start of script
06:42:42 [2020-08-08T10:42:42.818Z] include file start
06:42:42 [2020-08-08T10:42:42.818Z] Include file processed
06:42:42 [2020-08-08T10:42:42.818Z] line after include file
06:42:42 [2020-08-08T10:42:42.818Z] Result of testMethod = 5
06:42:42 [2020-08-08T10:42:42.818Z] End of script
06:42:42 [2020-08-08T10:42:42.818Z] Start of script
06:42:42 [2020-08-08T10:42:42.818Z] include file start
06:42:42 [2020-08-08T10:42:42.818Z] Include file processed
06:42:42 [2020-08-08T10:42:42.818Z] line after include file
06:42:42 [2020-08-08T10:42:42.818Z] Result of testMethod = 5
06:42:43 [2020-08-08T10:42:43.380Z] Start of script
06:42:43 [2020-08-08T10:42:43.380Z] include file start
06:42:43 [2020-08-08T10:42:43.380Z] Include file processed
06:42:43 [2020-08-08T10:42:43.380Z] line after include file
06:42:43 [2020-08-08T10:42:43.380Z] Result of testMethod = 5
06:42:43 [2020-08-08T10:42:43.380Z] End of script
06:42:43 [2020-08-08T10:42:43.380Z] Start of script
06:42:43 [2020-08-08T10:42:43.380Z] include file start
06:42:43 [2020-08-08T10:42:43.380Z] Include file processed
06:42:43 [2020-08-08T10:42:43.380Z] line after include file
06:42:43 [2020-08-08T10:42:43.380Z] Result of testMethod = 5
06:42:43 [2020-08-08T10:42:43.941Z] Start of script
06:42:43 [2020-08-08T10:42:43.941Z] include file start
06:42:43 [2020-08-08T10:42:43.941Z] Include file processed
06:42:43 [2020-08-08T10:42:43.941Z] line after include file
06:42:43 [2020-08-08T10:42:43.941Z] Result of testMethod = 5
06:42:43 [2020-08-08T10:42:43.941Z] End of script
06:42:44 [2020-08-08T10:42:44.197Z] Start of script
06:42:44 [2020-08-08T10:42:44.197Z] include file start
06:42:44 [2020-08-08T10:42:44.197Z] Include file processed
06:42:44 [2020-08-08T10:42:44.197Z] line after include file
06:42:44 [2020-08-08T10:42:44.197Z] Result of testMethod = 5
06:42:44 [2020-08-08T10:42:44.197Z] End of script
06:42:44 [2020-08-08T10:42:44.452Z] Start of script
06:42:44 [2020-08-08T10:42:44.452Z] include file start
06:42:44 [2020-08-08T10:42:44.452Z] Include file processed
06:42:44 [2020-08-08T10:42:44.452Z] line after include file
06:42:44 [2020-08-08T10:42:44.452Z] Result of testMethod = 5
06:42:44 [2020-08-08T10:42:44.452Z] End of script
06:42:44 [2020-08-08T10:42:44.709Z] Tests run: 42, Failures: 0, Errors: 0, Skipped: 0, Time elapsed: 10.867 s - in org.eclipse.ease.lang.javascript.rhino.RhinoDebugTest
06:42:44 [2020-08-08T10:42:44.709Z] disconnectProcessInSuspendedState(org.eclipse.ease.lang.javascript.rhino.RhinoDebugTest)  Time elapsed: 0.219 s
06:42:44 [2020-08-08T10:42:44.709Z] stepReturnIncludeCommand(org.eclipse.ease.lang.javascript.rhino.RhinoDebugTest)  Time elapsed: 0.207 s
06:42:44 [2020-08-08T10:42:44.709Z] arrayVariableSorting(org.eclipse.ease.lang.javascript.rhino.RhinoDebugTest)  Time elapsed: 0.308 s
06:42:44 [2020-08-08T10:42:44.709Z] stepOverOnDebugTarget(org.eclipse.ease.lang.javascript.rhino.RhinoDebugTest)  Time elapsed: 0.306 s
06:42:44 [2020-08-08T10:42:44.709Z] hasDebugTarget(org.eclipse.ease.lang.javascript.rhino.RhinoDebugTest)  Time elapsed: 0.104 s
06:42:44 [2020-08-08T10:42:44.709Z] disconnectThreadInSuspendedState(org.eclipse.ease.lang.javascript.rhino.RhinoDebugTest)  Time elapsed: 0.206 s
06:42:44 [2020-08-08T10:42:44.709Z] stepReturnOnDebugTarget(org.eclipse.ease.lang.javascript.rhino.RhinoDebugTest)  Time elapsed: 0.307 s
06:42:44 [2020-08-08T10:42:44.709Z] nullVariable(org.eclipse.ease.lang.javascript.rhino.RhinoDebugTest)  Time elapsed: 0.305 s
06:42:44 [2020-08-08T10:42:44.709Z] stepOverOnStackFrame(org.eclipse.ease.lang.javascript.rhino.RhinoDebugTest)  Time elapsed: 0.307 s
06:42:44 [2020-08-08T10:42:44.709Z] resumeOnDebugTarget(org.eclipse.ease.lang.javascript.rhino.RhinoDebugTest)  Time elapsed: 0.207 s
06:42:44 [2020-08-08T10:42:44.709Z] modifyVariableKeepingType(org.eclipse.ease.lang.javascript.rhino.RhinoDebugTest)  Time elapsed: 0.405 s
06:42:44 [2020-08-08T10:42:44.709Z] resumeOnLastIncludeLine(org.eclipse.ease.lang.javascript.rhino.RhinoDebugTest)  Time elapsed: 0.206 s
06:42:44 [2020-08-08T10:42:44.709Z] stepReturnOnStackFrame(org.eclipse.ease.lang.javascript.rhino.RhinoDebugTest)  Time elapsed: 0.307 s
06:42:44 [2020-08-08T10:42:44.709Z] terminateStackFrameInSuspendedState(org.eclipse.ease.lang.javascript.rhino.RhinoDebugTest)  Time elapsed: 0.207 s
06:42:44 [2020-08-08T10:42:44.709Z] breakpointLocation(org.eclipse.ease.lang.javascript.rhino.RhinoDebugTest)  Time elapsed: 0.206 s
06:42:44 [2020-08-08T10:42:44.709Z] stepReturnOnThread(org.eclipse.ease.lang.javascript.rhino.RhinoDebugTest)  Time elapsed: 0.307 s
06:42:44 [2020-08-08T10:42:44.709Z] javaClassVariable(org.eclipse.ease.lang.javascript.rhino.RhinoDebugTest)  Time elapsed: 0.308 s
06:42:44 [2020-08-08T10:42:44.709Z] stepIntoOnThread(org.eclipse.ease.lang.javascript.rhino.RhinoDebugTest)  Time elapsed: 0.307 s
06:42:44 [2020-08-08T10:42:44.709Z] terminateThreadInSuspendedState(org.eclipse.ease.lang.javascript.rhino.RhinoDebugTest)  Time elapsed: 0.205 s
06:42:44 [2020-08-08T10:42:44.709Z] resumeOnThread(org.eclipse.ease.lang.javascript.rhino.RhinoDebugTest)  Time elapsed: 0.205 s
06:42:44 [2020-08-08T10:42:44.709Z] stepIntoOnStackFrame(org.eclipse.ease.lang.javascript.rhino.RhinoDebugTest)  Time elapsed: 0.306 s
06:42:44 [2020-08-08T10:42:44.709Z] terminateProcessInSuspendedState(org.eclipse.ease.lang.javascript.rhino.RhinoDebugTest)  Time elapsed: 0.206 s
06:42:44 [2020-08-08T10:42:44.709Z] stepOverOnProcess(org.eclipse.ease.lang.javascript.rhino.RhinoDebugTest)  Time elapsed: 0.311 s
06:42:44 [2020-08-08T10:42:44.709Z] nativeArrayVariable(org.eclipse.ease.lang.javascript.rhino.RhinoDebugTest)  Time elapsed: 0.305 s
06:42:44 [2020-08-08T10:42:44.709Z] disconnectDebugTargetInSuspendedState(org.eclipse.ease.lang.javascript.rhino.RhinoDebugTest)  Time elapsed: 0.205 s
06:42:44 [2020-08-08T10:42:44.709Z] stepIntoOnProcess(org.eclipse.ease.lang.javascript.rhino.RhinoDebugTest)  Time elapsed: 0.306 s
06:42:44 [2020-08-08T10:42:44.709Z] terminatedState(org.eclipse.ease.lang.javascript.rhino.RhinoDebugTest)  Time elapsed: 0.104 s
06:42:44 [2020-08-08T10:42:44.709Z] stepOverIncludeCommand(org.eclipse.ease.lang.javascript.rhino.RhinoDebugTest)  Time elapsed: 0.304 s
06:42:44 [2020-08-08T10:42:44.710Z] innerScopeVariableBeforeOuterScopeVariable(org.eclipse.ease.lang.javascript.rhino.RhinoDebugTest)  Time elapsed: 0.305 s
06:42:44 [2020-08-08T10:42:44.710Z] stepIntoIncludeCommand(org.eclipse.ease.lang.javascript.rhino.RhinoDebugTest)  Time elapsed: 0.304 s
06:42:44 [2020-08-08T10:42:44.710Z] primitiveStringVariable(org.eclipse.ease.lang.javascript.rhino.RhinoDebugTest)  Time elapsed: 0.306 s
06:42:44 [2020-08-08T10:42:44.710Z] resumeOnProcess(org.eclipse.ease.lang.javascript.rhino.RhinoDebugTest)  Time elapsed: 0.205 s
06:42:44 [2020-08-08T10:42:44.710Z] stepIntoOnDebugTarget(org.eclipse.ease.lang.javascript.rhino.RhinoDebugTest)  Time elapsed: 0.305 s
06:42:44 [2020-08-08T10:42:44.710Z] stepOverOnThread(org.eclipse.ease.lang.javascript.rhino.RhinoDebugTest)  Time elapsed: 0.305 s
06:42:44 [2020-08-08T10:42:44.710Z] suspendedState(org.eclipse.ease.lang.javascript.rhino.RhinoDebugTest)  Time elapsed: 0.205 s
06:42:44 [2020-08-08T10:42:44.710Z] primitiveDoubleVariable(org.eclipse.ease.lang.javascript.rhino.RhinoDebugTest)  Time elapsed: 0.305 s
06:42:44 [2020-08-08T10:42:44.710Z] resumeOnStackFrame(org.eclipse.ease.lang.javascript.rhino.RhinoDebugTest)  Time elapsed: 0.204 s
06:42:44 [2020-08-08T10:42:44.710Z] nativeObjectVariable(org.eclipse.ease.lang.javascript.rhino.RhinoDebugTest)  Time elapsed: 0.306 s
06:42:44 [2020-08-08T10:42:44.710Z] terminateDebugTargetInSuspendedState(org.eclipse.ease.lang.javascript.rhino.RhinoDebugTest)  Time elapsed: 0.205 s
06:42:44 [2020-08-08T10:42:44.710Z] disconnectStackFrameInSuspendedState(org.eclipse.ease.lang.javascript.rhino.RhinoDebugTest)  Time elapsed: 0.205 s
06:42:44 [2020-08-08T10:42:44.710Z] stepReturnOnProcess(org.eclipse.ease.lang.javascript.rhino.RhinoDebugTest)  Time elapsed: 0.306 s
06:42:44 [2020-08-08T10:42:44.710Z] evaluateWatchExpression(org.eclipse.ease.lang.javascript.rhino.RhinoDebugTest)  Time elapsed: 0.207 s
06:42:44 [2020-08-08T10:42:44.710Z] 
06:42:44 [2020-08-08T10:42:44.710Z] Results:
06:42:44 [2020-08-08T10:42:44.710Z] 
06:42:44 [2020-08-08T10:42:44.710Z] Tests run: 70, Failures: 0, Errors: 0, Skipped: 0
06:42:44 [2020-08-08T10:42:44.710Z] 
06:42:44 [2020-08-08T10:42:44.967Z] [INFO] All tests passed!
06:42:44 [2020-08-08T10:42:44.967Z] [INFO] 
06:42:44 [2020-08-08T10:42:44.967Z] [INFO] -------< org.eclipse.ease:org.eclipse.ease.lang.javascript.test >-------
06:42:44 [2020-08-08T10:42:44.967Z] [INFO] Building org.eclipse.ease.lang.javascript.test 0.8.0-SNAPSHOT     [6/11]
06:42:44 [2020-08-08T10:42:44.967Z] [INFO] ------------------------[ eclipse-test-plugin ]-------------------------
06:42:44 [2020-08-08T10:42:44.967Z] [INFO] 
06:42:44 [2020-08-08T10:42:44.967Z] [INFO] --- tycho-packaging-plugin:1.3.0:build-qualifier (default-build-qualifier) @ org.eclipse.ease.lang.javascript.test ---
06:42:44 [2020-08-08T10:42:44.967Z] [INFO] The project's OSGi version is 0.8.0.I201910171213
06:42:44 [2020-08-08T10:42:44.967Z] [INFO] 
06:42:44 [2020-08-08T10:42:44.967Z] [INFO] --- tycho-packaging-plugin:1.3.0:validate-id (default-validate-id) @ org.eclipse.ease.lang.javascript.test ---
06:42:44 [2020-08-08T10:42:44.967Z] [INFO] 
06:42:44 [2020-08-08T10:42:44.967Z] [INFO] --- tycho-packaging-plugin:1.3.0:validate-version (default-validate-version) @ org.eclipse.ease.lang.javascript.test ---
06:42:44 [2020-08-08T10:42:44.967Z] [INFO] 
06:42:44 [2020-08-08T10:42:44.967Z] [INFO] --- maven-resources-plugin:2.4.3:resources (default-resources) @ org.eclipse.ease.lang.javascript.test ---
06:42:44 [2020-08-08T10:42:44.967Z] [INFO] Using 'UTF-8' encoding to copy filtered resources.
06:42:44 [2020-08-08T10:42:44.967Z] [INFO] skip non existing resourceDirectory /home/jenkins/agent/workspace/ease.verify.core.target.2019-12/tests/org.eclipse.ease.lang.javascript.test/src/main/resources
06:42:44 [2020-08-08T10:42:44.967Z] [INFO] 
06:42:44 [2020-08-08T10:42:44.967Z] [INFO] --- tycho-compiler-plugin:1.3.0:compile (default-compile) @ org.eclipse.ease.lang.javascript.test ---
06:42:44 [2020-08-08T10:42:44.967Z] [INFO] Nothing to compile - all classes are up to date
06:42:44 [2020-08-08T10:42:44.967Z] [INFO] 
06:42:44 [2020-08-08T10:42:44.967Z] [INFO] --- maven-resources-plugin:2.4.3:testResources (default-testResources) @ org.eclipse.ease.lang.javascript.test ---
06:42:44 [2020-08-08T10:42:44.967Z] [INFO] Using 'UTF-8' encoding to copy filtered resources.
06:42:44 [2020-08-08T10:42:44.967Z] [INFO] skip non existing resourceDirectory /home/jenkins/agent/workspace/ease.verify.core.target.2019-12/tests/org.eclipse.ease.lang.javascript.test/src/test/resources
06:42:44 [2020-08-08T10:42:44.967Z] [INFO] 
06:42:44 [2020-08-08T10:42:44.967Z] [INFO] --- tycho-source-plugin:1.3.0:plugin-source (plugin-source) @ org.eclipse.ease.lang.javascript.test ---
06:42:44 [2020-08-08T10:42:44.967Z] [WARNING] Bundle-Vendor header not found in /home/jenkins/agent/workspace/ease.verify.core.target.2019-12/tests/org.eclipse.ease.lang.javascript.test/META-INF/MANIFEST.MF, fallback to 'unknown' for source bundle
06:42:44 [2020-08-08T10:42:44.967Z] [INFO] Building jar: /home/jenkins/agent/workspace/ease.verify.core.target.2019-12/tests/org.eclipse.ease.lang.javascript.test/target/org.eclipse.ease.lang.javascript.test-0.8.0-SNAPSHOT-sources.jar
06:42:44 [2020-08-08T10:42:44.967Z] [INFO] 
06:42:44 [2020-08-08T10:42:44.967Z] [INFO] --- target-platform-configuration:1.3.0:target-platform (default-target-platform) @ org.eclipse.ease.lang.javascript.test ---
06:42:44 [2020-08-08T10:42:44.967Z] [INFO] 
06:42:44 [2020-08-08T10:42:44.967Z] [INFO] --- tycho-packaging-plugin:1.3.0:package-plugin (default-package-plugin) @ org.eclipse.ease.lang.javascript.test ---
06:42:44 [2020-08-08T10:42:44.967Z] [INFO] Building jar: /home/jenkins/agent/workspace/ease.verify.core.target.2019-12/tests/org.eclipse.ease.lang.javascript.test/target/org.eclipse.ease.lang.javascript.test-0.8.0-SNAPSHOT.jar
06:42:44 [2020-08-08T10:42:44.967Z] [INFO] 
06:42:44 [2020-08-08T10:42:44.967Z] [INFO] --- tycho-p2-plugin:1.3.0:p2-metadata-default (default-p2-metadata-default) @ org.eclipse.ease.lang.javascript.test ---
06:42:44 [2020-08-08T10:42:44.967Z] [INFO] 
06:42:44 [2020-08-08T10:42:44.967Z] [INFO] --- tycho-source-feature-plugin:1.3.0:source-feature (source-feature) @ org.eclipse.ease.lang.javascript.test ---
06:42:44 [2020-08-08T10:42:44.967Z] [INFO] 
06:42:44 [2020-08-08T10:42:44.967Z] [INFO] --- tycho-p2-plugin:1.3.0:p2-metadata (attached-p2-metadata) @ org.eclipse.ease.lang.javascript.test ---
06:42:44 [2020-08-08T10:42:44.967Z] [INFO] 
06:42:44 [2020-08-08T10:42:44.967Z] [INFO] --- tycho-surefire-plugin:1.3.0:test (default-test) @ org.eclipse.ease.lang.javascript.test ---
06:42:45 [2020-08-08T10:42:45.224Z] [INFO] Expected eclipse log file: /home/jenkins/agent/workspace/ease.verify.core.target.2019-12/tests/org.eclipse.ease.lang.javascript.test/target/work/data/.metadata/.log
06:42:45 [2020-08-08T10:42:45.224Z] [INFO] Command line:
06:42:45 [2020-08-08T10:42:45.224Z] 	[/opt/tools/java/oracle/jdk-8/1.8.0_202/jre/bin/java, -Dosgi.noShutdown=false, -Dosgi.os=linux, -Dosgi.ws=gtk, -Dosgi.arch=x86_64, -Dosgi.clean=true, -jar, /home/jenkins/.m2/repository/p2/osgi/bundle/org.eclipse.equinox.launcher/1.5.600.v20191014-2022/org.eclipse.equinox.launcher-1.5.600.v20191014-2022.jar, -data, /home/jenkins/agent/workspace/ease.verify.core.target.2019-12/tests/org.eclipse.ease.lang.javascript.test/target/work/data, -install, /home/jenkins/agent/workspace/ease.verify.core.target.2019-12/tests/org.eclipse.ease.lang.javascript.test/target/work, -configuration, /home/jenkins/agent/workspace/ease.verify.core.target.2019-12/tests/org.eclipse.ease.lang.javascript.test/target/work/configuration, -application, org.eclipse.tycho.surefire.osgibooter.headlesstest, -testproperties, /home/jenkins/agent/workspace/ease.verify.core.target.2019-12/tests/org.eclipse.ease.lang.javascript.test/target/surefire.properties]
06:42:45 [2020-08-08T10:42:45.224Z] Picked up JAVA_TOOL_OPTIONS: -Dmaven.ext.class.path="/home/jenkins/agent/workspace/ease.verify.core.target.2019-12@tmp/withMaven2f46464d/pipeline-maven-spy.jar" -Dorg.jenkinsci.plugins.pipeline.maven.reportsFolder="/home/jenkins/agent/workspace/ease.verify.core.target.2019-12@tmp/withMaven2f46464d" 
06:42:46 [2020-08-08T10:42:46.162Z] Running org.eclipse.ease.lang.javascript.JavaScriptCodeFactoryTest
06:42:46 [2020-08-08T10:42:46.417Z] Tests run: 1, Failures: 0, Errors: 0, Skipped: 0, Time elapsed: 0.095 s - in org.eclipse.ease.lang.javascript.JavaScriptCodeFactoryTest
06:42:46 [2020-08-08T10:42:46.417Z] testCommentCreator(org.eclipse.ease.lang.javascript.JavaScriptCodeFactoryTest)  Time elapsed: 0.005 s
06:42:46 [2020-08-08T10:42:46.417Z] Running org.eclipse.ease.lang.javascript.JavaScriptCompletionContextTest
06:42:46 [2020-08-08T10:42:46.417Z] Tests run: 8, Failures: 0, Errors: 0, Skipped: 0, Time elapsed: 0.157 s - in org.eclipse.ease.lang.javascript.JavaScriptCompletionContextTest
06:42:46 [2020-08-08T10:42:46.417Z] verifyStaticClassTypes(org.eclipse.ease.lang.javascript.JavaScriptCompletionContextTest)  Time elapsed: 0.004 s
06:42:46 [2020-08-08T10:42:46.417Z] verifyClassInstanceTypes(org.eclipse.ease.lang.javascript.JavaScriptCompletionContextTest)  Time elapsed: 0.005 s
06:42:46 [2020-08-08T10:42:46.417Z] verifyTypesForScriptEngine(org.eclipse.ease.lang.javascript.JavaScriptCompletionContextTest)  Time elapsed: 0.145 s
06:42:46 [2020-08-08T10:42:46.417Z] verifyPackageTypes(org.eclipse.ease.lang.javascript.JavaScriptCompletionContextTest)  Time elapsed: 0 s
06:42:46 [2020-08-08T10:42:46.417Z] definedVariableTypes(org.eclipse.ease.lang.javascript.JavaScriptCompletionContextTest)  Time elapsed: 0 s
06:42:46 [2020-08-08T10:42:46.417Z] verifyStringLiteralTypes(org.eclipse.ease.lang.javascript.JavaScriptCompletionContextTest)  Time elapsed: 0 s
06:42:46 [2020-08-08T10:42:46.417Z] verifyUnknownTypes(org.eclipse.ease.lang.javascript.JavaScriptCompletionContextTest)  Time elapsed: 0 s
06:42:46 [2020-08-08T10:42:46.417Z] verifyNoneTypes(org.eclipse.ease.lang.javascript.JavaScriptCompletionContextTest)  Time elapsed: 0 s
06:42:46 [2020-08-08T10:42:46.417Z] 
06:42:46 [2020-08-08T10:42:46.417Z] Results:
06:42:46 [2020-08-08T10:42:46.417Z] 
06:42:46 [2020-08-08T10:42:46.417Z] Tests run: 9, Failures: 0, Errors: 0, Skipped: 0
06:42:46 [2020-08-08T10:42:46.417Z] 
06:42:47 [2020-08-08T10:42:47.343Z] [INFO] All tests passed!
06:42:47 [2020-08-08T10:42:47.343Z] [INFO] 
06:42:47 [2020-08-08T10:42:47.343Z] [INFO] ---------< org.eclipse.ease:org.eclipse.ease.lang.python.test >---------
06:42:47 [2020-08-08T10:42:47.343Z] [INFO] Building org.eclipse.ease.lang.python.test 0.8.0-SNAPSHOT         [7/11]
06:42:47 [2020-08-08T10:42:47.344Z] [INFO] ------------------------[ eclipse-test-plugin ]-------------------------
06:42:47 [2020-08-08T10:42:47.344Z] [INFO] 
06:42:47 [2020-08-08T10:42:47.344Z] [INFO] --- tycho-packaging-plugin:1.3.0:build-qualifier (default-build-qualifier) @ org.eclipse.ease.lang.python.test ---
06:42:47 [2020-08-08T10:42:47.344Z] [INFO] The project's OSGi version is 0.8.0.I201910171213
06:42:47 [2020-08-08T10:42:47.344Z] [INFO] 
06:42:47 [2020-08-08T10:42:47.344Z] [INFO] --- tycho-packaging-plugin:1.3.0:validate-id (default-validate-id) @ org.eclipse.ease.lang.python.test ---
06:42:47 [2020-08-08T10:42:47.344Z] [INFO] 
06:42:47 [2020-08-08T10:42:47.344Z] [INFO] --- tycho-packaging-plugin:1.3.0:validate-version (default-validate-version) @ org.eclipse.ease.lang.python.test ---
06:42:47 [2020-08-08T10:42:47.344Z] [INFO] 
06:42:47 [2020-08-08T10:42:47.344Z] [INFO] --- maven-resources-plugin:2.4.3:resources (default-resources) @ org.eclipse.ease.lang.python.test ---
06:42:47 [2020-08-08T10:42:47.344Z] [INFO] Using 'UTF-8' encoding to copy filtered resources.
06:42:47 [2020-08-08T10:42:47.344Z] [INFO] skip non existing resourceDirectory /home/jenkins/agent/workspace/ease.verify.core.target.2019-12/tests/org.eclipse.ease.lang.python.test/src/main/resources
06:42:47 [2020-08-08T10:42:47.344Z] [INFO] 
06:42:47 [2020-08-08T10:42:47.344Z] [INFO] --- tycho-compiler-plugin:1.3.0:compile (default-compile) @ org.eclipse.ease.lang.python.test ---
06:42:47 [2020-08-08T10:42:47.344Z] [INFO] Nothing to compile - all classes are up to date
06:42:47 [2020-08-08T10:42:47.344Z] [INFO] 
06:42:47 [2020-08-08T10:42:47.344Z] [INFO] --- maven-resources-plugin:2.4.3:testResources (default-testResources) @ org.eclipse.ease.lang.python.test ---
06:42:47 [2020-08-08T10:42:47.344Z] [INFO] Using 'UTF-8' encoding to copy filtered resources.
06:42:47 [2020-08-08T10:42:47.344Z] [INFO] skip non existing resourceDirectory /home/jenkins/agent/workspace/ease.verify.core.target.2019-12/tests/org.eclipse.ease.lang.python.test/src/test/resources
06:42:47 [2020-08-08T10:42:47.344Z] [INFO] 
06:42:47 [2020-08-08T10:42:47.344Z] [INFO] --- tycho-source-plugin:1.3.0:plugin-source (plugin-source) @ org.eclipse.ease.lang.python.test ---
06:42:47 [2020-08-08T10:42:47.344Z] [WARNING] Bundle-Vendor header not found in /home/jenkins/agent/workspace/ease.verify.core.target.2019-12/tests/org.eclipse.ease.lang.python.test/META-INF/MANIFEST.MF, fallback to 'unknown' for source bundle
06:42:47 [2020-08-08T10:42:47.344Z] [INFO] Building jar: /home/jenkins/agent/workspace/ease.verify.core.target.2019-12/tests/org.eclipse.ease.lang.python.test/target/org.eclipse.ease.lang.python.test-0.8.0-SNAPSHOT-sources.jar
06:42:47 [2020-08-08T10:42:47.344Z] [INFO] 
06:42:47 [2020-08-08T10:42:47.344Z] [INFO] --- target-platform-configuration:1.3.0:target-platform (default-target-platform) @ org.eclipse.ease.lang.python.test ---
06:42:47 [2020-08-08T10:42:47.344Z] [INFO] 
06:42:47 [2020-08-08T10:42:47.344Z] [INFO] --- tycho-packaging-plugin:1.3.0:package-plugin (default-package-plugin) @ org.eclipse.ease.lang.python.test ---
06:42:47 [2020-08-08T10:42:47.344Z] [INFO] Building jar: /home/jenkins/agent/workspace/ease.verify.core.target.2019-12/tests/org.eclipse.ease.lang.python.test/target/org.eclipse.ease.lang.python.test-0.8.0-SNAPSHOT.jar
06:42:47 [2020-08-08T10:42:47.344Z] [INFO] 
06:42:47 [2020-08-08T10:42:47.344Z] [INFO] --- tycho-p2-plugin:1.3.0:p2-metadata-default (default-p2-metadata-default) @ org.eclipse.ease.lang.python.test ---
06:42:47 [2020-08-08T10:42:47.344Z] [INFO] 
06:42:47 [2020-08-08T10:42:47.344Z] [INFO] --- tycho-source-feature-plugin:1.3.0:source-feature (source-feature) @ org.eclipse.ease.lang.python.test ---
06:42:47 [2020-08-08T10:42:47.344Z] [INFO] 
06:42:47 [2020-08-08T10:42:47.344Z] [INFO] --- tycho-p2-plugin:1.3.0:p2-metadata (attached-p2-metadata) @ org.eclipse.ease.lang.python.test ---
06:42:47 [2020-08-08T10:42:47.344Z] [INFO] 
06:42:47 [2020-08-08T10:42:47.344Z] [INFO] --- tycho-surefire-plugin:1.3.0:test (default-test) @ org.eclipse.ease.lang.python.test ---
06:42:47 [2020-08-08T10:42:47.344Z] [INFO] Expected eclipse log file: /home/jenkins/agent/workspace/ease.verify.core.target.2019-12/tests/org.eclipse.ease.lang.python.test/target/work/data/.metadata/.log
06:42:47 [2020-08-08T10:42:47.344Z] [INFO] Command line:
06:42:47 [2020-08-08T10:42:47.344Z] 	[/opt/tools/java/oracle/jdk-8/1.8.0_202/jre/bin/java, -Dosgi.noShutdown=false, -Dosgi.os=linux, -Dosgi.ws=gtk, -Dosgi.arch=x86_64, -Dosgi.clean=true, -jar, /home/jenkins/.m2/repository/p2/osgi/bundle/org.eclipse.equinox.launcher/1.5.600.v20191014-2022/org.eclipse.equinox.launcher-1.5.600.v20191014-2022.jar, -data, /home/jenkins/agent/workspace/ease.verify.core.target.2019-12/tests/org.eclipse.ease.lang.python.test/target/work/data, -install, /home/jenkins/agent/workspace/ease.verify.core.target.2019-12/tests/org.eclipse.ease.lang.python.test/target/work, -configuration, /home/jenkins/agent/workspace/ease.verify.core.target.2019-12/tests/org.eclipse.ease.lang.python.test/target/work/configuration, -application, org.eclipse.tycho.surefire.osgibooter.headlesstest, -testproperties, /home/jenkins/agent/workspace/ease.verify.core.target.2019-12/tests/org.eclipse.ease.lang.python.test/target/surefire.properties]
06:42:47 [2020-08-08T10:42:47.344Z] Picked up JAVA_TOOL_OPTIONS: -Dmaven.ext.class.path="/home/jenkins/agent/workspace/ease.verify.core.target.2019-12@tmp/withMaven2f46464d/pipeline-maven-spy.jar" -Dorg.jenkinsci.plugins.pipeline.maven.reportsFolder="/home/jenkins/agent/workspace/ease.verify.core.target.2019-12@tmp/withMaven2f46464d" 
06:42:48 [2020-08-08T10:42:48.291Z] Running org.eclipse.ease.lang.python.PythonCodeFactoryTest
06:42:48 [2020-08-08T10:42:48.291Z] Tests run: 1, Failures: 0, Errors: 0, Skipped: 0, Time elapsed: 0.021 s - in org.eclipse.ease.lang.python.PythonCodeFactoryTest
06:42:48 [2020-08-08T10:42:48.291Z] testCommentCreator(org.eclipse.ease.lang.python.PythonCodeFactoryTest)  Time elapsed: 0.004 s
06:42:48 [2020-08-08T10:42:48.291Z] 
06:42:48 [2020-08-08T10:42:48.291Z] Results:
06:42:48 [2020-08-08T10:42:48.291Z] 
06:42:48 [2020-08-08T10:42:48.291Z] Tests run: 1, Failures: 0, Errors: 0, Skipped: 0
06:42:48 [2020-08-08T10:42:48.291Z] 
06:42:48 [2020-08-08T10:42:48.853Z] [INFO] All tests passed!
06:42:48 [2020-08-08T10:42:48.853Z] [INFO] 
06:42:48 [2020-08-08T10:42:48.853Z] [INFO] -----< org.eclipse.ease:org.eclipse.ease.lang.python.jython.test >------
06:42:48 [2020-08-08T10:42:48.853Z] [INFO] Building org.eclipse.ease.lang.python.jython.test 0.8.0-SNAPSHOT  [8/11]
06:42:48 [2020-08-08T10:42:48.853Z] [INFO] ------------------------[ eclipse-test-plugin ]-------------------------
06:42:48 [2020-08-08T10:42:48.853Z] [INFO] 
06:42:48 [2020-08-08T10:42:48.853Z] [INFO] --- tycho-packaging-plugin:1.3.0:build-qualifier (default-build-qualifier) @ org.eclipse.ease.lang.python.jython.test ---
06:42:48 [2020-08-08T10:42:48.853Z] [INFO] The project's OSGi version is 0.8.0.I201911291239
06:42:48 [2020-08-08T10:42:48.853Z] [INFO] 
06:42:48 [2020-08-08T10:42:48.853Z] [INFO] --- tycho-packaging-plugin:1.3.0:validate-id (default-validate-id) @ org.eclipse.ease.lang.python.jython.test ---
06:42:48 [2020-08-08T10:42:48.853Z] [INFO] 
06:42:48 [2020-08-08T10:42:48.853Z] [INFO] --- tycho-packaging-plugin:1.3.0:validate-version (default-validate-version) @ org.eclipse.ease.lang.python.jython.test ---
06:42:48 [2020-08-08T10:42:48.853Z] [INFO] 
06:42:48 [2020-08-08T10:42:48.853Z] [INFO] --- maven-resources-plugin:2.4.3:resources (default-resources) @ org.eclipse.ease.lang.python.jython.test ---
06:42:48 [2020-08-08T10:42:48.853Z] [INFO] Using 'UTF-8' encoding to copy filtered resources.
06:42:48 [2020-08-08T10:42:48.853Z] [INFO] skip non existing resourceDirectory /home/jenkins/agent/workspace/ease.verify.core.target.2019-12/tests/org.eclipse.ease.lang.python.jython.test/src/main/resources
06:42:48 [2020-08-08T10:42:48.853Z] [INFO] 
06:42:48 [2020-08-08T10:42:48.853Z] [INFO] --- tycho-compiler-plugin:1.3.0:compile (default-compile) @ org.eclipse.ease.lang.python.jython.test ---
06:42:48 [2020-08-08T10:42:48.853Z] [INFO] Nothing to compile - all classes are up to date
06:42:48 [2020-08-08T10:42:48.853Z] [INFO] 
06:42:48 [2020-08-08T10:42:48.853Z] [INFO] --- maven-resources-plugin:2.4.3:testResources (default-testResources) @ org.eclipse.ease.lang.python.jython.test ---
06:42:48 [2020-08-08T10:42:48.853Z] [INFO] Using 'UTF-8' encoding to copy filtered resources.
06:42:48 [2020-08-08T10:42:48.854Z] [INFO] skip non existing resourceDirectory /home/jenkins/agent/workspace/ease.verify.core.target.2019-12/tests/org.eclipse.ease.lang.python.jython.test/src/test/resources
06:42:48 [2020-08-08T10:42:48.854Z] [INFO] 
06:42:48 [2020-08-08T10:42:48.854Z] [INFO] --- tycho-source-plugin:1.3.0:plugin-source (plugin-source) @ org.eclipse.ease.lang.python.jython.test ---
06:42:48 [2020-08-08T10:42:48.854Z] [WARNING] Bundle-Vendor header not found in /home/jenkins/agent/workspace/ease.verify.core.target.2019-12/tests/org.eclipse.ease.lang.python.jython.test/META-INF/MANIFEST.MF, fallback to 'unknown' for source bundle
06:42:48 [2020-08-08T10:42:48.854Z] [INFO] Building jar: /home/jenkins/agent/workspace/ease.verify.core.target.2019-12/tests/org.eclipse.ease.lang.python.jython.test/target/org.eclipse.ease.lang.python.jython.test-0.8.0-SNAPSHOT-sources.jar
06:42:48 [2020-08-08T10:42:48.854Z] [INFO] 
06:42:48 [2020-08-08T10:42:48.854Z] [INFO] --- target-platform-configuration:1.3.0:target-platform (default-target-platform) @ org.eclipse.ease.lang.python.jython.test ---
06:42:48 [2020-08-08T10:42:48.854Z] [INFO] 
06:42:48 [2020-08-08T10:42:48.854Z] [INFO] --- tycho-packaging-plugin:1.3.0:package-plugin (default-package-plugin) @ org.eclipse.ease.lang.python.jython.test ---
06:42:48 [2020-08-08T10:42:48.854Z] [INFO] Building jar: /home/jenkins/agent/workspace/ease.verify.core.target.2019-12/tests/org.eclipse.ease.lang.python.jython.test/target/org.eclipse.ease.lang.python.jython.test-0.8.0-SNAPSHOT.jar
06:42:48 [2020-08-08T10:42:48.854Z] [INFO] 
06:42:48 [2020-08-08T10:42:48.854Z] [INFO] --- tycho-p2-plugin:1.3.0:p2-metadata-default (default-p2-metadata-default) @ org.eclipse.ease.lang.python.jython.test ---
06:42:48 [2020-08-08T10:42:48.854Z] [INFO] 
06:42:48 [2020-08-08T10:42:48.854Z] [INFO] --- tycho-source-feature-plugin:1.3.0:source-feature (source-feature) @ org.eclipse.ease.lang.python.jython.test ---
06:42:48 [2020-08-08T10:42:48.854Z] [INFO] 
06:42:48 [2020-08-08T10:42:48.854Z] [INFO] --- tycho-p2-plugin:1.3.0:p2-metadata (attached-p2-metadata) @ org.eclipse.ease.lang.python.jython.test ---
06:42:48 [2020-08-08T10:42:48.854Z] [INFO] 
06:42:48 [2020-08-08T10:42:48.854Z] [INFO] --- tycho-surefire-plugin:1.3.0:test (default-test) @ org.eclipse.ease.lang.python.jython.test ---
06:42:49 [2020-08-08T10:42:49.414Z] [INFO] Expected eclipse log file: /home/jenkins/agent/workspace/ease.verify.core.target.2019-12/tests/org.eclipse.ease.lang.python.jython.test/target/work/data/.metadata/.log
06:42:49 [2020-08-08T10:42:49.414Z] [INFO] Command line:
06:42:49 [2020-08-08T10:42:49.414Z] 	[/opt/tools/java/oracle/jdk-8/1.8.0_202/jre/bin/java, -Dosgi.noShutdown=false, -Dosgi.os=linux, -Dosgi.ws=gtk, -Dosgi.arch=x86_64, -Dosgi.clean=true, -jar, /home/jenkins/.m2/repository/p2/osgi/bundle/org.eclipse.equinox.launcher/1.5.600.v20191014-2022/org.eclipse.equinox.launcher-1.5.600.v20191014-2022.jar, -data, /home/jenkins/agent/workspace/ease.verify.core.target.2019-12/tests/org.eclipse.ease.lang.python.jython.test/target/work/data, -install, /home/jenkins/agent/workspace/ease.verify.core.target.2019-12/tests/org.eclipse.ease.lang.python.jython.test/target/work, -configuration, /home/jenkins/agent/workspace/ease.verify.core.target.2019-12/tests/org.eclipse.ease.lang.python.jython.test/target/work/configuration, -application, org.eclipse.tycho.surefire.osgibooter.headlesstest, -testproperties, /home/jenkins/agent/workspace/ease.verify.core.target.2019-12/tests/org.eclipse.ease.lang.python.jython.test/target/surefire.properties]
06:42:49 [2020-08-08T10:42:49.414Z] Picked up JAVA_TOOL_OPTIONS: -Dmaven.ext.class.path="/home/jenkins/agent/workspace/ease.verify.core.target.2019-12@tmp/withMaven2f46464d/pipeline-maven-spy.jar" -Dorg.jenkinsci.plugins.pipeline.maven.reportsFolder="/home/jenkins/agent/workspace/ease.verify.core.target.2019-12@tmp/withMaven2f46464d" 
06:42:50 [2020-08-08T10:42:50.826Z] Running org.eclipse.ease.lang.python.jython.debugger.JythonDebugTest
06:42:52 [2020-08-08T10:42:52.201Z] Start of script
06:42:52 [2020-08-08T10:42:52.201Z] include file start
06:42:52 [2020-08-08T10:42:52.201Z] include file processed
06:42:52 [2020-08-08T10:42:52.201Z] Result of testMethod = 5
06:42:52 [2020-08-08T10:42:52.201Z] End of script
06:42:52 [2020-08-08T10:42:52.201Z] Start of script
06:42:52 [2020-08-08T10:42:52.457Z] include file start
06:42:52 [2020-08-08T10:42:52.457Z] include file processed
06:42:52 [2020-08-08T10:42:52.457Z] Result of testMethod = 5
06:42:52 [2020-08-08T10:42:52.457Z] End of script
06:42:52 [2020-08-08T10:42:52.457Z] Start of script
06:42:52 [2020-08-08T10:42:52.457Z] include file start
06:42:52 [2020-08-08T10:42:52.457Z] include file processed
06:42:52 [2020-08-08T10:42:52.457Z] Result of testMethod = 5
06:42:52 [2020-08-08T10:42:52.712Z] Traceback (most recent call last):
06:42:52 [2020-08-08T10:42:52.712Z]   File "(none)", line 184, in run
06:42:52 [2020-08-08T10:42:52.712Z]   File "__ref_L/Debug Test/Main.py_opnycakmmc", line 23, in <module>
06:42:52 [2020-08-08T10:42:52.712Z]   File "(none)", line 161, in trace_dispatch
06:42:52 [2020-08-08T10:42:52.712Z] org.eclipse.ease.ExitException: 
06:42:52 [2020-08-08T10:42:52.712Z] 
06:42:52 [2020-08-08T10:42:52.712Z] org.eclipse.ease.ExitException: org.eclipse.ease.ExitException: 
06:42:52 [2020-08-08T10:42:52.712Z] Start of script
06:42:52 [2020-08-08T10:42:52.712Z] include file start
06:42:52 [2020-08-08T10:42:52.712Z] include file processed
06:42:52 [2020-08-08T10:42:52.967Z] Result of testMethod = 5
06:42:52 [2020-08-08T10:42:52.967Z] End of script
06:42:53 [2020-08-08T10:42:53.223Z] Start of script
06:42:53 [2020-08-08T10:42:53.223Z] include file start
06:42:53 [2020-08-08T10:42:53.223Z] include file processed
06:42:53 [2020-08-08T10:42:53.223Z] Result of testMethod = 5
06:42:53 [2020-08-08T10:42:53.223Z] End of script
06:42:53 [2020-08-08T10:42:53.478Z] Start of script
06:42:53 [2020-08-08T10:42:53.479Z] include file start
06:42:53 [2020-08-08T10:42:53.479Z] include file processed
06:42:53 [2020-08-08T10:42:53.479Z] Result of testMethod = 5
06:42:53 [2020-08-08T10:42:53.479Z] End of script
06:42:53 [2020-08-08T10:42:53.734Z] Start of script
06:42:53 [2020-08-08T10:42:53.734Z] include file start
06:42:53 [2020-08-08T10:42:53.734Z] include file processed
06:42:53 [2020-08-08T10:42:53.734Z] Result of testMethod = 5
06:42:53 [2020-08-08T10:42:53.990Z] Traceback (most recent call last):
06:42:53 [2020-08-08T10:42:53.990Z]   File "(none)", line 184, in run
06:42:53 [2020-08-08T10:42:53.990Z]   File "__ref_L/Debug Test/Main.py_sfbajhlbam", line 23, in <module>
06:42:53 [2020-08-08T10:42:53.990Z]   File "(none)", line 161, in trace_dispatch
06:42:53 [2020-08-08T10:42:53.990Z] org.eclipse.ease.ExitException: 
06:42:53 [2020-08-08T10:42:53.990Z] 
06:42:53 [2020-08-08T10:42:53.990Z] org.eclipse.ease.ExitException: org.eclipse.ease.ExitException: 
06:42:53 [2020-08-08T10:42:53.990Z] Start of script
06:42:53 [2020-08-08T10:42:53.990Z] include file start
06:42:53 [2020-08-08T10:42:53.990Z] include file processed
06:42:54 [2020-08-08T10:42:54.245Z] Result of testMethod = 5
06:42:54 [2020-08-08T10:42:54.245Z] End of script
06:42:54 [2020-08-08T10:42:54.245Z] Start of script
06:42:54 [2020-08-08T10:42:54.245Z] include file start
06:42:54 [2020-08-08T10:42:54.245Z] include file processed
06:42:54 [2020-08-08T10:42:54.245Z] Result of testMethod = 5
06:42:54 [2020-08-08T10:42:54.501Z] End of script
06:42:54 [2020-08-08T10:42:54.501Z] Start of script
06:42:54 [2020-08-08T10:42:54.501Z] include file start
06:42:54 [2020-08-08T10:42:54.501Z] include file processed
06:42:55 [2020-08-08T10:42:55.062Z] Traceback (most recent call last):
06:42:55 [2020-08-08T10:42:55.062Z]   File "(none)", line 184, in run
06:42:55 [2020-08-08T10:42:55.062Z]   File "__ref_L/Debug Test/Main.py_qjqccndrcm", line 22, in <module>
06:42:55 [2020-08-08T10:42:55.062Z]   File "(none)", line 161, in trace_dispatch
06:42:55 [2020-08-08T10:42:55.062Z] org.eclipse.ease.ExitException: 
06:42:55 [2020-08-08T10:42:55.062Z] 
06:42:55 [2020-08-08T10:42:55.062Z] org.eclipse.ease.ExitException: org.eclipse.ease.ExitException: 
06:42:55 [2020-08-08T10:42:55.062Z] Start of script
06:42:55 [2020-08-08T10:42:55.062Z] include file start
06:42:55 [2020-08-08T10:42:55.062Z] include file processed
06:42:55 [2020-08-08T10:42:55.062Z] Result of testMethod = 5
06:42:55 [2020-08-08T10:42:55.062Z] End of script
06:42:55 [2020-08-08T10:42:55.318Z] Start of script
06:42:55 [2020-08-08T10:42:55.318Z] include file start
06:42:55 [2020-08-08T10:42:55.318Z] include file processed
06:42:55 [2020-08-08T10:42:55.318Z] Result of testMethod = 5
06:42:55 [2020-08-08T10:42:55.318Z] End of script
06:42:55 [2020-08-08T10:42:55.573Z] Traceback (most recent call last):
06:42:55 [2020-08-08T10:42:55.573Z]   File "(none)", line 184, in run
06:42:55 [2020-08-08T10:42:55.573Z]   File "__ref_L/Debug Test/Main.py_eibxputykk", line 1, in <module>
06:42:55 [2020-08-08T10:42:55.573Z]   File "(none)", line 161, in trace_dispatch
06:42:55 [2020-08-08T10:42:55.573Z] org.eclipse.ease.ExitException: 
06:42:55 [2020-08-08T10:42:55.573Z] 
06:42:55 [2020-08-08T10:42:55.573Z] org.eclipse.ease.ExitException: org.eclipse.ease.ExitException: 
06:42:55 [2020-08-08T10:42:55.829Z] Start of script
06:42:55 [2020-08-08T10:42:55.829Z] include file start
06:42:55 [2020-08-08T10:42:55.829Z] include file processed
06:42:55 [2020-08-08T10:42:55.829Z] Result of testMethod = 5
06:42:55 [2020-08-08T10:42:55.829Z] End of script
06:42:55 [2020-08-08T10:42:55.829Z] Start of script
06:42:55 [2020-08-08T10:42:55.829Z] include file start
06:42:55 [2020-08-08T10:42:55.829Z] include file processed
06:42:56 [2020-08-08T10:42:56.085Z] Result of testMethod = 5
06:42:56 [2020-08-08T10:42:56.085Z] End of script
06:42:56 [2020-08-08T10:42:56.341Z] Start of script
06:42:56 [2020-08-08T10:42:56.341Z] include file start
06:42:56 [2020-08-08T10:42:56.341Z] include file processed
06:42:56 [2020-08-08T10:42:56.341Z] Result of testMethod = 5
06:42:56 [2020-08-08T10:42:56.341Z] Traceback (most recent call last):
06:42:56 [2020-08-08T10:42:56.341Z]   File "(none)", line 184, in run
06:42:56 [2020-08-08T10:42:56.341Z]   File "__ref_L/Debug Test/Main.py_iffdweyzsz", line 23, in <module>
06:42:56 [2020-08-08T10:42:56.341Z]   File "(none)", line 161, in trace_dispatch
06:42:56 [2020-08-08T10:42:56.341Z] org.eclipse.ease.ExitException: 
06:42:56 [2020-08-08T10:42:56.341Z] 
06:42:56 [2020-08-08T10:42:56.341Z] org.eclipse.ease.ExitException: org.eclipse.ease.ExitException: 
06:42:56 [2020-08-08T10:42:56.596Z] Start of script
06:42:56 [2020-08-08T10:42:56.596Z] include file start
06:42:56 [2020-08-08T10:42:56.596Z] include file processed
06:42:56 [2020-08-08T10:42:56.852Z] Result of testMethod = 5
06:42:56 [2020-08-08T10:42:56.852Z] End of script
06:42:56 [2020-08-08T10:42:56.852Z] Traceback (most recent call last):
06:42:56 [2020-08-08T10:42:56.852Z]   File "(none)", line 184, in run
06:42:56 [2020-08-08T10:42:56.852Z]   File "__ref_L/Debug Test/Main.py_wptpyatklt", line 1, in <module>
06:42:56 [2020-08-08T10:42:56.852Z]   File "(none)", line 161, in trace_dispatch
06:42:56 [2020-08-08T10:42:56.852Z] org.eclipse.ease.ExitException: 
06:42:56 [2020-08-08T10:42:56.852Z] 
06:42:56 [2020-08-08T10:42:56.852Z] org.eclipse.ease.ExitException: org.eclipse.ease.ExitException: 
06:42:57 [2020-08-08T10:42:57.107Z] Start of script
06:42:57 [2020-08-08T10:42:57.107Z] include file start
06:42:57 [2020-08-08T10:42:57.107Z] include file processed
06:42:57 [2020-08-08T10:42:57.107Z] Result of testMethod = 5
06:42:57 [2020-08-08T10:42:57.107Z] End of script
06:42:57 [2020-08-08T10:42:57.366Z] Start of script
06:42:57 [2020-08-08T10:42:57.366Z] include file start
06:42:57 [2020-08-08T10:42:57.366Z] include file processed
06:42:57 [2020-08-08T10:42:57.366Z] Result of testMethod = 5
06:42:57 [2020-08-08T10:42:57.366Z] End of script
06:42:57 [2020-08-08T10:42:57.620Z] Traceback (most recent call last):
06:42:57 [2020-08-08T10:42:57.620Z]   File "(none)", line 184, in run
06:42:57 [2020-08-08T10:42:57.620Z]   File "__ref_L/Debug Test/Main.py_bvkkvhecrw", line 1, in <module>
06:42:57 [2020-08-08T10:42:57.620Z]   File "(none)", line 161, in trace_dispatch
06:42:57 [2020-08-08T10:42:57.620Z] org.eclipse.ease.ExitException: 
06:42:57 [2020-08-08T10:42:57.620Z] 
06:42:57 [2020-08-08T10:42:57.620Z] org.eclipse.ease.ExitException: org.eclipse.ease.ExitException: 
06:42:57 [2020-08-08T10:42:57.875Z] Start of script
06:42:57 [2020-08-08T10:42:57.875Z] include file start
06:42:57 [2020-08-08T10:42:57.876Z] include file processed
06:42:57 [2020-08-08T10:42:57.876Z] Result of testMethod = 5
06:42:57 [2020-08-08T10:42:57.876Z] End of script
06:42:58 [2020-08-08T10:42:58.131Z] Start of script
06:42:58 [2020-08-08T10:42:58.131Z] include file start
06:42:58 [2020-08-08T10:42:58.131Z] include file processed
06:42:58 [2020-08-08T10:42:58.131Z] Result of testMethod = 5
06:42:58 [2020-08-08T10:42:58.387Z] Traceback (most recent call last):
06:42:58 [2020-08-08T10:42:58.387Z]   File "(none)", line 184, in run
06:42:58 [2020-08-08T10:42:58.387Z]   File "__ref_L/Debug Test/Main.py_yiwisgvsbc", line 23, in <module>
06:42:58 [2020-08-08T10:42:58.387Z]   File "(none)", line 161, in trace_dispatch
06:42:58 [2020-08-08T10:42:58.387Z] org.eclipse.ease.ExitException: 
06:42:58 [2020-08-08T10:42:58.387Z] 
06:42:58 [2020-08-08T10:42:58.387Z] org.eclipse.ease.ExitException: org.eclipse.ease.ExitException: 
06:42:58 [2020-08-08T10:42:58.387Z] Start of script
06:42:58 [2020-08-08T10:42:58.387Z] include file start
06:42:58 [2020-08-08T10:42:58.387Z] include file processed
06:42:58 [2020-08-08T10:42:58.387Z] Result of testMethod = 5
06:42:58 [2020-08-08T10:42:58.387Z] End of script
06:42:58 [2020-08-08T10:42:58.643Z] Start of script
06:42:58 [2020-08-08T10:42:58.643Z] include file start
06:42:58 [2020-08-08T10:42:58.643Z] include file processed
06:42:58 [2020-08-08T10:42:58.899Z] Result of testMethod = 5
06:42:58 [2020-08-08T10:42:58.899Z] End of script
06:42:58 [2020-08-08T10:42:58.899Z] Start of script
06:42:58 [2020-08-08T10:42:58.899Z] include file start
06:42:58 [2020-08-08T10:42:58.899Z] include file processed
06:42:58 [2020-08-08T10:42:58.899Z] Result of testMethod = 5
06:42:58 [2020-08-08T10:42:58.899Z] End of script
06:42:58 [2020-08-08T10:42:58.899Z] Start of script
06:42:59 [2020-08-08T10:42:59.155Z] include file start
06:42:59 [2020-08-08T10:42:59.155Z] include file processed
06:42:59 [2020-08-08T10:42:59.155Z] Result of testMethod = 5
06:42:59 [2020-08-08T10:42:59.155Z] End of script
06:42:59 [2020-08-08T10:42:59.410Z] Start of script
06:42:59 [2020-08-08T10:42:59.410Z] include file start
06:42:59 [2020-08-08T10:42:59.410Z] include file processed
06:42:59 [2020-08-08T10:42:59.410Z] Traceback (most recent call last):
06:42:59 [2020-08-08T10:42:59.410Z]   File "(none)", line 184, in run
06:42:59 [2020-08-08T10:42:59.410Z]   File "__ref_L/Debug Test/Main.py_ihloyjllsm", line 21, in <module>
06:42:59 [2020-08-08T10:42:59.410Z]   File "__ref_L/Debug Test/Main.py_ihloyjllsm", line 18, in testMethod
06:42:59 [2020-08-08T10:42:59.410Z]   File "(none)", line 161, in trace_dispatch
06:42:59 [2020-08-08T10:42:59.410Z] org.eclipse.ease.ExitException: 
06:42:59 [2020-08-08T10:42:59.410Z] 
06:42:59 [2020-08-08T10:42:59.410Z] org.eclipse.ease.ExitException: org.eclipse.ease.ExitException: 
06:42:59 [2020-08-08T10:42:59.666Z] Start of script
06:42:59 [2020-08-08T10:42:59.922Z] include file start
06:42:59 [2020-08-08T10:42:59.922Z] include file processed
06:42:59 [2020-08-08T10:42:59.922Z] Result of testMethod = 5
06:42:59 [2020-08-08T10:42:59.922Z] End of script
06:42:59 [2020-08-08T10:42:59.922Z] Start of script
06:42:59 [2020-08-08T10:42:59.922Z] include file start
06:42:59 [2020-08-08T10:42:59.922Z] include file processed
06:42:59 [2020-08-08T10:42:59.922Z] Result of testMethod = 5
06:43:00 [2020-08-08T10:43:00.178Z] Traceback (most recent call last):
06:43:00 [2020-08-08T10:43:00.178Z]   File "(none)", line 184, in run
06:43:00 [2020-08-08T10:43:00.178Z]   File "__ref_L/Debug Test/Main.py_merqjhxynt", line 23, in <module>
06:43:00 [2020-08-08T10:43:00.178Z]   File "(none)", line 161, in trace_dispatch
06:43:00 [2020-08-08T10:43:00.178Z] org.eclipse.ease.ExitException: 
06:43:00 [2020-08-08T10:43:00.178Z] 
06:43:00 [2020-08-08T10:43:00.178Z] org.eclipse.ease.ExitException: org.eclipse.ease.ExitException: 
06:43:00 [2020-08-08T10:43:00.178Z] Start of script
06:43:00 [2020-08-08T10:43:00.178Z] include file start
06:43:00 [2020-08-08T10:43:00.178Z] include file processed
06:43:00 [2020-08-08T10:43:00.178Z] Result of testMethod = 5
06:43:00 [2020-08-08T10:43:00.434Z] End of script
06:43:00 [2020-08-08T10:43:00.434Z] Start of script
06:43:00 [2020-08-08T10:43:00.434Z] include file start
06:43:00 [2020-08-08T10:43:00.434Z] include file processed
06:43:00 [2020-08-08T10:43:00.690Z] Result of testMethod = 5
06:43:00 [2020-08-08T10:43:00.690Z] End of script
06:43:00 [2020-08-08T10:43:00.690Z] Start of script
06:43:00 [2020-08-08T10:43:00.690Z] include file start
06:43:00 [2020-08-08T10:43:00.690Z] include file processed
06:43:00 [2020-08-08T10:43:00.947Z] Result of testMethod = 5
06:43:00 [2020-08-08T10:43:00.947Z] End of script
06:43:00 [2020-08-08T10:43:00.947Z] Start of script
06:43:00 [2020-08-08T10:43:00.947Z] include file start
06:43:00 [2020-08-08T10:43:00.947Z] include file processed
06:43:00 [2020-08-08T10:43:00.947Z] Result of testMethod = 5
06:43:01 [2020-08-08T10:43:01.203Z] End of script
06:43:01 [2020-08-08T10:43:01.203Z] Start of script
06:43:01 [2020-08-08T10:43:01.203Z] include file start
06:43:01 [2020-08-08T10:43:01.203Z] include file processed
06:43:01 [2020-08-08T10:43:01.203Z] Result of testMethod = 5
06:43:01 [2020-08-08T10:43:01.459Z] Traceback (most recent call last):
06:43:01 [2020-08-08T10:43:01.459Z]   File "(none)", line 184, in run
06:43:01 [2020-08-08T10:43:01.459Z]   File "__ref_L/Debug Test/Main.py_sfhccqwscr", line 23, in <module>
06:43:01 [2020-08-08T10:43:01.459Z]   File "(none)", line 161, in trace_dispatch
06:43:01 [2020-08-08T10:43:01.459Z] org.eclipse.ease.ExitException: 
06:43:01 [2020-08-08T10:43:01.459Z] 
06:43:01 [2020-08-08T10:43:01.459Z] org.eclipse.ease.ExitException: org.eclipse.ease.ExitException: 
06:43:01 [2020-08-08T10:43:01.459Z] Start of script
06:43:01 [2020-08-08T10:43:01.459Z] include file start
06:43:01 [2020-08-08T10:43:01.459Z] include file processed
06:43:01 [2020-08-08T10:43:01.459Z] Result of testMethod = 5
06:43:01 [2020-08-08T10:43:01.714Z] End of script
06:43:01 [2020-08-08T10:43:01.714Z] Start of script
06:43:01 [2020-08-08T10:43:01.714Z] include file start
06:43:01 [2020-08-08T10:43:01.714Z] include file processed
06:43:01 [2020-08-08T10:43:01.714Z] Result of testMethod = 5
06:43:01 [2020-08-08T10:43:01.970Z] Traceback (most recent call last):
06:43:01 [2020-08-08T10:43:01.971Z]   File "(none)", line 184, in run
06:43:01 [2020-08-08T10:43:01.971Z]   File "__ref_L/Debug Test/Main.py_kzvgpmfodh", line 23, in <module>
06:43:01 [2020-08-08T10:43:01.971Z]   File "(none)", line 161, in trace_dispatch
06:43:01 [2020-08-08T10:43:01.971Z] org.eclipse.ease.ExitException: 
06:43:01 [2020-08-08T10:43:01.971Z] 
06:43:01 [2020-08-08T10:43:01.971Z] org.eclipse.ease.ExitException: org.eclipse.ease.ExitException: 
06:43:02 [2020-08-08T10:43:02.226Z] Traceback (most recent call last):
06:43:02 [2020-08-08T10:43:02.226Z]   File "(none)", line 184, in run
06:43:02 [2020-08-08T10:43:02.226Z]   File "__ref_L/Debug Test/Main.py_estjqixwxm", line 1, in <module>
06:43:02 [2020-08-08T10:43:02.226Z]   File "(none)", line 161, in trace_dispatch
06:43:02 [2020-08-08T10:43:02.226Z] org.eclipse.ease.ExitException: 
06:43:02 [2020-08-08T10:43:02.226Z] 
06:43:02 [2020-08-08T10:43:02.226Z] org.eclipse.ease.ExitException: org.eclipse.ease.ExitException: 
06:43:02 [2020-08-08T10:43:02.481Z] Start of script
06:43:02 [2020-08-08T10:43:02.481Z] include file start
06:43:02 [2020-08-08T10:43:02.481Z] include file processed
06:43:02 [2020-08-08T10:43:02.481Z] Result of testMethod = 5
06:43:02 [2020-08-08T10:43:02.481Z] End of script
06:43:02 [2020-08-08T10:43:02.481Z] Start of script
06:43:02 [2020-08-08T10:43:02.481Z] include file start
06:43:02 [2020-08-08T10:43:02.482Z] include file processed
06:43:02 [2020-08-08T10:43:02.737Z] Result of testMethod = 5
06:43:02 [2020-08-08T10:43:02.737Z] End of script
06:43:02 [2020-08-08T10:43:02.737Z] Start of script
06:43:02 [2020-08-08T10:43:02.737Z] include file start
06:43:02 [2020-08-08T10:43:02.737Z] include file processed
06:43:02 [2020-08-08T10:43:02.737Z] Result of testMethod = 5
06:43:02 [2020-08-08T10:43:02.993Z] End of script
06:43:02 [2020-08-08T10:43:02.993Z] Tests run: 42, Failures: 1, Errors: 0, Skipped: 0, Time elapsed: 12.148 s <<< FAILURE! - in org.eclipse.ease.lang.python.jython.debugger.JythonDebugTest
06:43:02 [2020-08-08T10:43:02.993Z] disconnectProcessInSuspendedState(org.eclipse.ease.lang.python.jython.debugger.JythonDebugTest)  Time elapsed: 1.379 s  <<< FAILURE!
06:43:02 [2020-08-08T10:43:02.993Z] java.lang.AssertionError: expected:<1> but was:<0>
06:43:02 [2020-08-08T10:43:02.993Z] 
06:43:02 [2020-08-08T10:43:02.993Z] stepReturnIncludeCommand(org.eclipse.ease.lang.python.jython.debugger.JythonDebugTest)  Time elapsed: 0.211 s
06:43:02 [2020-08-08T10:43:02.993Z] arrayVariableSorting(org.eclipse.ease.lang.python.jython.debugger.JythonDebugTest)  Time elapsed: 0.307 s
06:43:02 [2020-08-08T10:43:02.993Z] stepOverOnDebugTarget(org.eclipse.ease.lang.python.jython.debugger.JythonDebugTest)  Time elapsed: 0.308 s
06:43:02 [2020-08-08T10:43:02.993Z] hasDebugTarget(org.eclipse.ease.lang.python.jython.debugger.JythonDebugTest)  Time elapsed: 0.105 s
06:43:02 [2020-08-08T10:43:02.993Z] disconnectThreadInSuspendedState(org.eclipse.ease.lang.python.jython.debugger.JythonDebugTest)  Time elapsed: 0.206 s
06:43:02 [2020-08-08T10:43:02.993Z] stepReturnOnDebugTarget(org.eclipse.ease.lang.python.jython.debugger.JythonDebugTest)  Time elapsed: 0.307 s
06:43:02 [2020-08-08T10:43:02.993Z] nullVariable(org.eclipse.ease.lang.python.jython.debugger.JythonDebugTest)  Time elapsed: 0.306 s
06:43:02 [2020-08-08T10:43:02.993Z] stepOverOnStackFrame(org.eclipse.ease.lang.python.jython.debugger.JythonDebugTest)  Time elapsed: 0.307 s
06:43:02 [2020-08-08T10:43:02.993Z] resumeOnDebugTarget(org.eclipse.ease.lang.python.jython.debugger.JythonDebugTest)  Time elapsed: 0.206 s
06:43:02 [2020-08-08T10:43:02.993Z] modifyVariableKeepingType(org.eclipse.ease.lang.python.jython.debugger.JythonDebugTest)  Time elapsed: 0.506 s
06:43:02 [2020-08-08T10:43:02.993Z] resumeOnLastIncludeLine(org.eclipse.ease.lang.python.jython.debugger.JythonDebugTest)  Time elapsed: 0.206 s
06:43:02 [2020-08-08T10:43:02.993Z] stepReturnOnStackFrame(org.eclipse.ease.lang.python.jython.debugger.JythonDebugTest)  Time elapsed: 0.306 s
06:43:02 [2020-08-08T10:43:02.993Z] terminateStackFrameInSuspendedState(org.eclipse.ease.lang.python.jython.debugger.JythonDebugTest)  Time elapsed: 0.206 s
06:43:02 [2020-08-08T10:43:02.993Z] breakpointLocation(org.eclipse.ease.lang.python.jython.debugger.JythonDebugTest)  Time elapsed: 0.206 s
06:43:02 [2020-08-08T10:43:02.993Z] stepReturnOnThread(org.eclipse.ease.lang.python.jython.debugger.JythonDebugTest)  Time elapsed: 0.307 s
06:43:02 [2020-08-08T10:43:02.993Z] javaClassVariable(org.eclipse.ease.lang.python.jython.debugger.JythonDebugTest)  Time elapsed: 0.309 s
06:43:02 [2020-08-08T10:43:02.993Z] stepIntoOnThread(org.eclipse.ease.lang.python.jython.debugger.JythonDebugTest)  Time elapsed: 0.306 s
06:43:02 [2020-08-08T10:43:02.993Z] terminateThreadInSuspendedState(org.eclipse.ease.lang.python.jython.debugger.JythonDebugTest)  Time elapsed: 0.206 s
06:43:02 [2020-08-08T10:43:02.993Z] resumeOnThread(org.eclipse.ease.lang.python.jython.debugger.JythonDebugTest)  Time elapsed: 0.206 s
06:43:02 [2020-08-08T10:43:02.993Z] stepIntoOnStackFrame(org.eclipse.ease.lang.python.jython.debugger.JythonDebugTest)  Time elapsed: 0.306 s
06:43:02 [2020-08-08T10:43:02.993Z] terminateProcessInSuspendedState(org.eclipse.ease.lang.python.jython.debugger.JythonDebugTest)  Time elapsed: 0.207 s
06:43:02 [2020-08-08T10:43:02.994Z] stepOverOnProcess(org.eclipse.ease.lang.python.jython.debugger.JythonDebugTest)  Time elapsed: 0.306 s
06:43:02 [2020-08-08T10:43:02.994Z] nativeArrayVariable(org.eclipse.ease.lang.python.jython.debugger.JythonDebugTest)  Time elapsed: 0.306 s
06:43:02 [2020-08-08T10:43:02.994Z] disconnectDebugTargetInSuspendedState(org.eclipse.ease.lang.python.jython.debugger.JythonDebugTest)  Time elapsed: 0.206 s
06:43:02 [2020-08-08T10:43:02.994Z] stepIntoOnProcess(org.eclipse.ease.lang.python.jython.debugger.JythonDebugTest)  Time elapsed: 0.306 s
06:43:02 [2020-08-08T10:43:02.994Z] terminatedState(org.eclipse.ease.lang.python.jython.debugger.JythonDebugTest)  Time elapsed: 0.106 s
06:43:02 [2020-08-08T10:43:02.994Z] stepOverIncludeCommand(org.eclipse.ease.lang.python.jython.debugger.JythonDebugTest)  Time elapsed: 0.304 s
06:43:02 [2020-08-08T10:43:02.994Z] innerScopeVariableBeforeOuterScopeVariable(org.eclipse.ease.lang.python.jython.debugger.JythonDebugTest)  Time elapsed: 0.304 s
06:43:02 [2020-08-08T10:43:02.994Z] stepIntoIncludeCommand(org.eclipse.ease.lang.python.jython.debugger.JythonDebugTest)  Time elapsed: 0.304 s
06:43:02 [2020-08-08T10:43:02.994Z] primitiveStringVariable(org.eclipse.ease.lang.python.jython.debugger.JythonDebugTest)  Time elapsed: 0.305 s
06:43:02 [2020-08-08T10:43:02.994Z] resumeOnProcess(org.eclipse.ease.lang.python.jython.debugger.JythonDebugTest)  Time elapsed: 0.206 s
06:43:02 [2020-08-08T10:43:02.994Z] stepIntoOnDebugTarget(org.eclipse.ease.lang.python.jython.debugger.JythonDebugTest)  Time elapsed: 0.306 s
06:43:02 [2020-08-08T10:43:02.994Z] stepOverOnThread(org.eclipse.ease.lang.python.jython.debugger.JythonDebugTest)  Time elapsed: 0.306 s
06:43:02 [2020-08-08T10:43:02.994Z] suspendedState(org.eclipse.ease.lang.python.jython.debugger.JythonDebugTest)  Time elapsed: 0.205 s
06:43:02 [2020-08-08T10:43:02.994Z] primitiveDoubleVariable(org.eclipse.ease.lang.python.jython.debugger.JythonDebugTest)  Time elapsed: 0.305 s
06:43:02 [2020-08-08T10:43:02.994Z] resumeOnStackFrame(org.eclipse.ease.lang.python.jython.debugger.JythonDebugTest)  Time elapsed: 0.204 s
06:43:02 [2020-08-08T10:43:02.994Z] nativeObjectVariable(org.eclipse.ease.lang.python.jython.debugger.JythonDebugTest)  Time elapsed: 0.306 s
06:43:02 [2020-08-08T10:43:02.994Z] terminateDebugTargetInSuspendedState(org.eclipse.ease.lang.python.jython.debugger.JythonDebugTest)  Time elapsed: 0.205 s
06:43:02 [2020-08-08T10:43:02.994Z] disconnectStackFrameInSuspendedState(org.eclipse.ease.lang.python.jython.debugger.JythonDebugTest)  Time elapsed: 0.206 s
06:43:02 [2020-08-08T10:43:02.994Z] stepReturnOnProcess(org.eclipse.ease.lang.python.jython.debugger.JythonDebugTest)  Time elapsed: 0.305 s
06:43:02 [2020-08-08T10:43:02.994Z] evaluateWatchExpression(org.eclipse.ease.lang.python.jython.debugger.JythonDebugTest)  Time elapsed: 0.206 s
06:43:02 [2020-08-08T10:43:02.994Z] 
06:43:02 [2020-08-08T10:43:02.994Z] Results:
06:43:02 [2020-08-08T10:43:02.994Z] 
06:43:02 [2020-08-08T10:43:02.994Z] Failures: 
06:43:02 [2020-08-08T10:43:02.994Z]   JythonDebugTest>AbstractDebugTest.disconnectProcessInSuspendedState:523->AbstractDebugTest.disconnectTestTemplate:513 expected:<1> but was:<0>
06:43:02 [2020-08-08T10:43:02.994Z] 
06:43:02 [2020-08-08T10:43:02.994Z] Tests run: 42, Failures: 1, Errors: 0, Skipped: 0
06:43:02 [2020-08-08T10:43:02.994Z] 
06:43:03 [2020-08-08T10:43:03.922Z] [INFO] ------------------------------------------------------------------------
06:43:03 [2020-08-08T10:43:03.922Z] [INFO] Reactor Summary for org.eclipse.ease.releng 0.8.0-SNAPSHOT:
06:43:03 [2020-08-08T10:43:03.922Z] [INFO] 
06:43:03 [2020-08-08T10:43:03.922Z] [INFO] org.eclipse.ease.releng ............................ SUCCESS [  0.001 s]
06:43:03 [2020-08-08T10:43:03.922Z] [INFO] org.eclipse.ease.releng.target ..................... SUCCESS [  0.117 s]
06:43:03 [2020-08-08T10:43:03.922Z] [INFO] org.eclipse.ease.test .............................. SUCCESS [ 13.286 s]
06:43:03 [2020-08-08T10:43:03.922Z] [INFO] org.eclipse.ease.lang.javascript.nashorn.test ...... SUCCESS [  2.426 s]
06:43:03 [2020-08-08T10:43:03.922Z] [INFO] org.eclipse.ease.lang.javascript.rhino.test ........ SUCCESS [ 13.584 s]
06:43:03 [2020-08-08T10:43:03.922Z] [INFO] org.eclipse.ease.lang.javascript.test .............. SUCCESS [  2.137 s]
06:43:03 [2020-08-08T10:43:03.922Z] [INFO] org.eclipse.ease.lang.python.test .................. SUCCESS [  1.698 s]
06:43:03 [2020-08-08T10:43:03.922Z] [INFO] org.eclipse.ease.lang.python.jython.test ........... FAILURE [ 14.941 s]
06:43:03 [2020-08-08T10:43:03.922Z] [INFO] org.eclipse.ease.lang.python.py4j.test ............. SKIPPED
06:43:03 [2020-08-08T10:43:03.922Z] [INFO] org.eclipse.ease.lang.scriptarchive.test ........... SKIPPED
06:43:03 [2020-08-08T10:43:03.922Z] [INFO] org.eclipse.ease.ui.test ........................... SKIPPED
06:43:03 [2020-08-08T10:43:03.922Z] [INFO] ------------------------------------------------------------------------
06:43:03 [2020-08-08T10:43:03.922Z] [INFO] BUILD FAILURE
06:43:03 [2020-08-08T10:43:03.922Z] [INFO] ------------------------------------------------------------------------
06:43:03 [2020-08-08T10:43:03.922Z] [INFO] Total time:  01:29 min
06:43:03 [2020-08-08T10:43:03.922Z] [INFO] Finished at: 2020-08-08T10:43:03Z
06:43:03 [2020-08-08T10:43:03.922Z] [INFO] ------------------------------------------------------------------------
06:43:03 [2020-08-08T10:43:03.922Z] [WARNING] [jenkins-event-spy] Unexpected Maven project file name 'target-tests-pom.xml', problems may occur
06:43:03 [2020-08-08T10:43:03.922Z] [INFO] [jenkins-event-spy] Generated /home/jenkins/agent/workspace/ease.verify.core.target.2019-12@tmp/withMaven2f46464d/maven-spy-20200808-104134-3097713561467454468911.log
06:43:03 [2020-08-08T10:43:03.922Z] [ERROR] Failed to execute goal org.eclipse.tycho:tycho-surefire-plugin:1.3.0:test (default-test) on project org.eclipse.ease.lang.python.jython.test: There are test failures.
06:43:03 [2020-08-08T10:43:03.922Z] [ERROR] 
06:43:03 [2020-08-08T10:43:03.922Z] [ERROR] Please refer to /home/jenkins/agent/workspace/ease.verify.core.target.2019-12/tests/org.eclipse.ease.lang.python.jython.test/target/surefire-reports for the individual test results.
06:43:03 [2020-08-08T10:43:03.922Z] [ERROR] -> [Help 1]
06:43:03 [2020-08-08T10:43:03.922Z] [ERROR] 
06:43:03 [2020-08-08T10:43:03.922Z] [ERROR] To see the full stack trace of the errors, re-run Maven with the -e switch.
06:43:03 [2020-08-08T10:43:03.922Z] [ERROR] Re-run Maven using the -X switch to enable full debug logging.
06:43:03 [2020-08-08T10:43:03.922Z] [ERROR] 
06:43:03 [2020-08-08T10:43:03.922Z] [ERROR] For more information about the errors and possible solutions, please read the following articles:
06:43:03 [2020-08-08T10:43:03.922Z] [ERROR] [Help 1] http://cwiki.apache.org/confluence/display/MAVEN/MojoFailureException
06:43:03 [2020-08-08T10:43:03.922Z] [ERROR] 
06:43:03 [2020-08-08T10:43:03.922Z] [ERROR] After correcting the problems, you can resume the build with the command
06:43:03 [2020-08-08T10:43:03.922Z] [ERROR]   mvn <args> -rf :org.eclipse.ease.lang.python.jython.test
[Pipeline] }
06:43:04 [2020-08-08T10:43:04.228Z] [withMaven] Publishers: Pipeline Graph Publisher: 2 ms
[Pipeline] // withMaven
[Pipeline] }
[Pipeline] // stage
[Pipeline] stage
[Pipeline] { (Declarative: Post Actions)
[Pipeline] archiveArtifacts
06:43:04 [2020-08-08T10:43:04.257Z] Archiving artifacts
[Pipeline] emailext
06:43:16 [2020-08-08T10:43:16.457Z] Sending email to: christian.pontesegger@web.de
[Pipeline] }
[Pipeline] // stage
[Pipeline] }
[Pipeline] // timeout
[Pipeline] }
[Pipeline] // timestamps
[Pipeline] }
[Pipeline] // node
[Pipeline] End of Pipeline
ERROR: script returned exit code 1
Finished: FAILURE