FailedConsole Output

Skipping 836 KB.. Full Log
09:36:06 [2021-06-15T13:36:06.907Z] 	at org.mozilla.javascript.InterpretedFunction.call(InterpretedFunction.java:109)
09:36:06 [2021-06-15T13:36:06.907Z] 	at org.mozilla.javascript.ContextFactory.doTopCall(ContextFactory.java:405)
09:36:06 [2021-06-15T13:36:06.907Z] 	at org.mozilla.javascript.ScriptRuntime.doTopCall(ScriptRuntime.java:3508)
09:36:06 [2021-06-15T13:36:06.907Z] 	at org.mozilla.javascript.InterpretedFunction.exec(InterpretedFunction.java:120)
09:36:06 [2021-06-15T13:36:06.907Z] 	at org.mozilla.javascript.Context.evaluateReader(Context.java:1293)
09:36:06 [2021-06-15T13:36:06.907Z] 	at org.eclipse.ease.lang.javascript.rhino.RhinoScriptEngine.internalExecute(RhinoScriptEngine.java:226)
09:36:06 [2021-06-15T13:36:06.907Z] 	at org.eclipse.ease.lang.javascript.rhino.RhinoScriptEngine.execute(RhinoScriptEngine.java:205)
09:36:06 [2021-06-15T13:36:06.907Z] 	at org.eclipse.ease.AbstractScriptEngine.inject(AbstractScriptEngine.java:191)
09:36:06 [2021-06-15T13:36:06.907Z] 	at org.eclipse.ease.AbstractScriptEngine.run(AbstractScriptEngine.java:244)
09:36:06 [2021-06-15T13:36:06.907Z] 	at org.eclipse.core.internal.jobs.Worker.run(Worker.java:63)
09:36:06 [2021-06-15T13:36:06.907Z] Start of script
09:36:06 [2021-06-15T13:36:06.907Z] include file start
09:36:06 [2021-06-15T13:36:06.907Z] Include file processed
09:36:06 [2021-06-15T13:36:06.907Z] line after include file
09:36:07 [2021-06-15T13:36:07.163Z] Result of testMethod = 5
09:36:07 [2021-06-15T13:36:07.163Z] End of script
09:36:07 [2021-06-15T13:36:07.163Z] Start of script
09:36:07 [2021-06-15T13:36:07.163Z] include file start
09:36:07 [2021-06-15T13:36:07.164Z] Include file processed
09:36:07 [2021-06-15T13:36:07.164Z] line after include file
09:36:07 [2021-06-15T13:36:07.164Z] Result of testMethod = 5
09:36:07 [2021-06-15T13:36:07.420Z] End of script
09:36:07 [2021-06-15T13:36:07.420Z] Start of script
09:36:07 [2021-06-15T13:36:07.420Z] include file start
09:36:07 [2021-06-15T13:36:07.420Z] Include file processed
09:36:07 [2021-06-15T13:36:07.420Z] line after include file
09:36:07 [2021-06-15T13:36:07.676Z] org.eclipse.ease.ScriptEngineCancellationException: Terminated on user request
09:36:07 [2021-06-15T13:36:07.676Z] 	at org.eclipse.ease.debugging.AbstractEaseDebugger.handleEventsInSuspendedState(AbstractEaseDebugger.java:331)
09:36:07 [2021-06-15T13:36:07.676Z] 	at org.eclipse.ease.debugging.AbstractEaseDebugger.suspend(AbstractEaseDebugger.java:257)
09:36:07 [2021-06-15T13:36:07.676Z] 	at org.eclipse.ease.debugging.AbstractEaseDebugger.processLine(AbstractEaseDebugger.java:512)
09:36:07 [2021-06-15T13:36:07.676Z] 	at org.eclipse.ease.lang.javascript.rhino.debugger.RhinoDebugger.access$4(RhinoDebugger.java:1)
09:36:07 [2021-06-15T13:36:07.676Z] 	at org.eclipse.ease.lang.javascript.rhino.debugger.RhinoDebugger$RhinoDebugFrame.onLineChange(RhinoDebugger.java:124)
09:36:07 [2021-06-15T13:36:07.676Z] 	at org.mozilla.javascript.Interpreter.interpretLoop(Interpreter.java:1931)
09:36:07 [2021-06-15T13:36:07.676Z] 	at org.mozilla.javascript.Interpreter.interpret(Interpreter.java:911)
09:36:07 [2021-06-15T13:36:07.676Z] 	at org.mozilla.javascript.InterpretedFunction.call(InterpretedFunction.java:109)
09:36:07 [2021-06-15T13:36:07.676Z] 	at org.mozilla.javascript.ContextFactory.doTopCall(ContextFactory.java:405)
09:36:07 [2021-06-15T13:36:07.676Z] 	at org.mozilla.javascript.ScriptRuntime.doTopCall(ScriptRuntime.java:3508)
09:36:07 [2021-06-15T13:36:07.676Z] 	at org.mozilla.javascript.InterpretedFunction.exec(InterpretedFunction.java:120)
09:36:07 [2021-06-15T13:36:07.676Z] 	at org.mozilla.javascript.Context.evaluateReader(Context.java:1293)
09:36:07 [2021-06-15T13:36:07.676Z] 	at org.eclipse.ease.lang.javascript.rhino.RhinoScriptEngine.internalExecute(RhinoScriptEngine.java:226)
09:36:07 [2021-06-15T13:36:07.676Z] 	at org.eclipse.ease.lang.javascript.rhino.RhinoScriptEngine.execute(RhinoScriptEngine.java:205)
09:36:07 [2021-06-15T13:36:07.676Z] 	at org.eclipse.ease.AbstractScriptEngine.inject(AbstractScriptEngine.java:191)
09:36:07 [2021-06-15T13:36:07.676Z] 	at org.eclipse.ease.AbstractScriptEngine.run(AbstractScriptEngine.java:244)
09:36:07 [2021-06-15T13:36:07.676Z] 	at org.eclipse.core.internal.jobs.Worker.run(Worker.java:63)
09:36:07 [2021-06-15T13:36:07.933Z] Start of script
09:36:07 [2021-06-15T13:36:07.933Z] include file start
09:36:07 [2021-06-15T13:36:07.933Z] Include file processed
09:36:07 [2021-06-15T13:36:07.933Z] line after include file
09:36:07 [2021-06-15T13:36:07.933Z] Result of testMethod = 5
09:36:07 [2021-06-15T13:36:07.933Z] End of script
09:36:08 [2021-06-15T13:36:08.189Z] Start of script
09:36:08 [2021-06-15T13:36:08.189Z] include file start
09:36:08 [2021-06-15T13:36:08.189Z] Include file processed
09:36:08 [2021-06-15T13:36:08.189Z] line after include file
09:36:08 [2021-06-15T13:36:08.189Z] Result of testMethod = 5
09:36:08 [2021-06-15T13:36:08.189Z] End of script
09:36:08 [2021-06-15T13:36:08.445Z] org.eclipse.ease.ScriptEngineCancellationException: Terminated on user request
09:36:08 [2021-06-15T13:36:08.445Z] 	at org.eclipse.ease.debugging.AbstractEaseDebugger.handleEventsInSuspendedState(AbstractEaseDebugger.java:331)
09:36:08 [2021-06-15T13:36:08.445Z] 	at org.eclipse.ease.debugging.AbstractEaseDebugger.suspend(AbstractEaseDebugger.java:257)
09:36:08 [2021-06-15T13:36:08.445Z] 	at org.eclipse.ease.debugging.AbstractEaseDebugger.processLine(AbstractEaseDebugger.java:492)
09:36:08 [2021-06-15T13:36:08.445Z] 	at org.eclipse.ease.lang.javascript.rhino.debugger.RhinoDebugger.access$4(RhinoDebugger.java:1)
09:36:08 [2021-06-15T13:36:08.445Z] 	at org.eclipse.ease.lang.javascript.rhino.debugger.RhinoDebugger$RhinoDebugFrame.onLineChange(RhinoDebugger.java:124)
09:36:08 [2021-06-15T13:36:08.445Z] 	at org.mozilla.javascript.Interpreter.interpretLoop(Interpreter.java:1931)
09:36:08 [2021-06-15T13:36:08.445Z] 	at org.mozilla.javascript.Interpreter.interpret(Interpreter.java:911)
09:36:08 [2021-06-15T13:36:08.445Z] 	at org.mozilla.javascript.InterpretedFunction.call(InterpretedFunction.java:109)
09:36:08 [2021-06-15T13:36:08.445Z] 	at org.mozilla.javascript.ContextFactory.doTopCall(ContextFactory.java:405)
09:36:08 [2021-06-15T13:36:08.445Z] 	at org.mozilla.javascript.ScriptRuntime.doTopCall(ScriptRuntime.java:3508)
09:36:08 [2021-06-15T13:36:08.445Z] 	at org.mozilla.javascript.InterpretedFunction.exec(InterpretedFunction.java:120)
09:36:08 [2021-06-15T13:36:08.445Z] 	at org.mozilla.javascript.Context.evaluateReader(Context.java:1293)
09:36:08 [2021-06-15T13:36:08.445Z] 	at org.eclipse.ease.lang.javascript.rhino.RhinoScriptEngine.internalExecute(RhinoScriptEngine.java:226)
09:36:08 [2021-06-15T13:36:08.445Z] 	at org.eclipse.ease.lang.javascript.rhino.RhinoScriptEngine.execute(RhinoScriptEngine.java:205)
09:36:08 [2021-06-15T13:36:08.445Z] 	at org.eclipse.ease.AbstractScriptEngine.inject(AbstractScriptEngine.java:191)
09:36:08 [2021-06-15T13:36:08.445Z] 	at org.eclipse.ease.AbstractScriptEngine.run(AbstractScriptEngine.java:244)
09:36:08 [2021-06-15T13:36:08.445Z] 	at org.eclipse.core.internal.jobs.Worker.run(Worker.java:63)
09:36:08 [2021-06-15T13:36:08.701Z] Start of script
09:36:08 [2021-06-15T13:36:08.701Z] include file start
09:36:08 [2021-06-15T13:36:08.701Z] Include file processed
09:36:08 [2021-06-15T13:36:08.701Z] line after include file
09:36:08 [2021-06-15T13:36:08.701Z] Result of testMethod = 5
09:36:08 [2021-06-15T13:36:08.701Z] End of script
09:36:08 [2021-06-15T13:36:08.701Z] Start of script
09:36:08 [2021-06-15T13:36:08.701Z] include file start
09:36:08 [2021-06-15T13:36:08.701Z] Include file processed
09:36:08 [2021-06-15T13:36:08.701Z] line after include file
09:36:08 [2021-06-15T13:36:08.958Z] Result of testMethod = 5
09:36:08 [2021-06-15T13:36:08.958Z] End of script
09:36:09 [2021-06-15T13:36:09.213Z] Start of script
09:36:09 [2021-06-15T13:36:09.213Z] include file start
09:36:09 [2021-06-15T13:36:09.213Z] Include file processed
09:36:09 [2021-06-15T13:36:09.213Z] line after include file
09:36:09 [2021-06-15T13:36:09.213Z] Result of testMethod = 5
09:36:09 [2021-06-15T13:36:09.213Z] org.eclipse.ease.ScriptEngineCancellationException: Terminated on user request
09:36:09 [2021-06-15T13:36:09.213Z] 	at org.eclipse.ease.debugging.AbstractEaseDebugger.handleEventsInSuspendedState(AbstractEaseDebugger.java:331)
09:36:09 [2021-06-15T13:36:09.214Z] 	at org.eclipse.ease.debugging.AbstractEaseDebugger.suspend(AbstractEaseDebugger.java:257)
09:36:09 [2021-06-15T13:36:09.214Z] 	at org.eclipse.ease.debugging.AbstractEaseDebugger.processLine(AbstractEaseDebugger.java:492)
09:36:09 [2021-06-15T13:36:09.214Z] 	at org.eclipse.ease.lang.javascript.rhino.debugger.RhinoDebugger.access$4(RhinoDebugger.java:1)
09:36:09 [2021-06-15T13:36:09.214Z] 	at org.eclipse.ease.lang.javascript.rhino.debugger.RhinoDebugger$RhinoDebugFrame.onLineChange(RhinoDebugger.java:124)
09:36:09 [2021-06-15T13:36:09.214Z] 	at org.mozilla.javascript.Interpreter.interpretLoop(Interpreter.java:1931)
09:36:09 [2021-06-15T13:36:09.214Z] 	at org.mozilla.javascript.Interpreter.interpret(Interpreter.java:911)
09:36:09 [2021-06-15T13:36:09.214Z] 	at org.mozilla.javascript.InterpretedFunction.call(InterpretedFunction.java:109)
09:36:09 [2021-06-15T13:36:09.214Z] 	at org.mozilla.javascript.ContextFactory.doTopCall(ContextFactory.java:405)
09:36:09 [2021-06-15T13:36:09.214Z] 	at org.mozilla.javascript.ScriptRuntime.doTopCall(ScriptRuntime.java:3508)
09:36:09 [2021-06-15T13:36:09.214Z] 	at org.mozilla.javascript.InterpretedFunction.exec(InterpretedFunction.java:120)
09:36:09 [2021-06-15T13:36:09.214Z] 	at org.mozilla.javascript.Context.evaluateReader(Context.java:1293)
09:36:09 [2021-06-15T13:36:09.214Z] 	at org.eclipse.ease.lang.javascript.rhino.RhinoScriptEngine.internalExecute(RhinoScriptEngine.java:226)
09:36:09 [2021-06-15T13:36:09.214Z] 	at org.eclipse.ease.lang.javascript.rhino.RhinoScriptEngine.execute(RhinoScriptEngine.java:205)
09:36:09 [2021-06-15T13:36:09.214Z] 	at org.eclipse.ease.AbstractScriptEngine.inject(AbstractScriptEngine.java:191)
09:36:09 [2021-06-15T13:36:09.214Z] 	at org.eclipse.ease.AbstractScriptEngine.run(AbstractScriptEngine.java:244)
09:36:09 [2021-06-15T13:36:09.214Z] 	at org.eclipse.core.internal.jobs.Worker.run(Worker.java:63)
09:36:09 [2021-06-15T13:36:09.470Z] Start of script
09:36:09 [2021-06-15T13:36:09.470Z] include file start
09:36:09 [2021-06-15T13:36:09.470Z] Include file processed
09:36:09 [2021-06-15T13:36:09.470Z] line after include file
09:36:09 [2021-06-15T13:36:09.726Z] Result of testMethod = 5
09:36:09 [2021-06-15T13:36:09.726Z] End of script
09:36:09 [2021-06-15T13:36:09.982Z] org.eclipse.ease.ScriptEngineCancellationException: Terminated on user request
09:36:09 [2021-06-15T13:36:09.982Z] 	at org.eclipse.ease.debugging.AbstractEaseDebugger.handleEventsInSuspendedState(AbstractEaseDebugger.java:331)
09:36:09 [2021-06-15T13:36:09.982Z] 	at org.eclipse.ease.debugging.AbstractEaseDebugger.suspend(AbstractEaseDebugger.java:257)
09:36:09 [2021-06-15T13:36:09.982Z] 	at org.eclipse.ease.debugging.AbstractEaseDebugger.processLine(AbstractEaseDebugger.java:492)
09:36:09 [2021-06-15T13:36:09.982Z] 	at org.eclipse.ease.lang.javascript.rhino.debugger.RhinoDebugger.access$4(RhinoDebugger.java:1)
09:36:09 [2021-06-15T13:36:09.982Z] 	at org.eclipse.ease.lang.javascript.rhino.debugger.RhinoDebugger$RhinoDebugFrame.onLineChange(RhinoDebugger.java:124)
09:36:09 [2021-06-15T13:36:09.982Z] 	at org.mozilla.javascript.Interpreter.interpretLoop(Interpreter.java:1931)
09:36:09 [2021-06-15T13:36:09.982Z] 	at org.mozilla.javascript.Interpreter.interpret(Interpreter.java:911)
09:36:09 [2021-06-15T13:36:09.982Z] 	at org.mozilla.javascript.InterpretedFunction.call(InterpretedFunction.java:109)
09:36:09 [2021-06-15T13:36:09.982Z] 	at org.mozilla.javascript.ContextFactory.doTopCall(ContextFactory.java:405)
09:36:09 [2021-06-15T13:36:09.982Z] 	at org.mozilla.javascript.ScriptRuntime.doTopCall(ScriptRuntime.java:3508)
09:36:09 [2021-06-15T13:36:09.982Z] 	at org.mozilla.javascript.InterpretedFunction.exec(InterpretedFunction.java:120)
09:36:09 [2021-06-15T13:36:09.982Z] 	at org.mozilla.javascript.Context.evaluateReader(Context.java:1293)
09:36:09 [2021-06-15T13:36:09.982Z] 	at org.eclipse.ease.lang.javascript.rhino.RhinoScriptEngine.internalExecute(RhinoScriptEngine.java:226)
09:36:09 [2021-06-15T13:36:09.982Z] 	at org.eclipse.ease.lang.javascript.rhino.RhinoScriptEngine.execute(RhinoScriptEngine.java:205)
09:36:09 [2021-06-15T13:36:09.982Z] 	at org.eclipse.ease.AbstractScriptEngine.inject(AbstractScriptEngine.java:191)
09:36:09 [2021-06-15T13:36:09.982Z] 	at org.eclipse.ease.AbstractScriptEngine.run(AbstractScriptEngine.java:244)
09:36:09 [2021-06-15T13:36:09.982Z] 	at org.eclipse.core.internal.jobs.Worker.run(Worker.java:63)
09:36:09 [2021-06-15T13:36:09.982Z] Start of script
09:36:09 [2021-06-15T13:36:09.982Z] include file start
09:36:09 [2021-06-15T13:36:09.982Z] Include file processed
09:36:09 [2021-06-15T13:36:09.982Z] line after include file
09:36:09 [2021-06-15T13:36:09.982Z] Result of testMethod = 5
09:36:10 [2021-06-15T13:36:10.238Z] End of script
09:36:10 [2021-06-15T13:36:10.238Z] Start of script
09:36:10 [2021-06-15T13:36:10.238Z] include file start
09:36:10 [2021-06-15T13:36:10.238Z] Include file processed
09:36:10 [2021-06-15T13:36:10.238Z] line after include file
09:36:10 [2021-06-15T13:36:10.493Z] Result of testMethod = 5
09:36:10 [2021-06-15T13:36:10.493Z] End of script
09:36:10 [2021-06-15T13:36:10.749Z] org.eclipse.ease.ScriptEngineCancellationException: Terminated on user request
09:36:10 [2021-06-15T13:36:10.749Z] 	at org.eclipse.ease.debugging.AbstractEaseDebugger.handleEventsInSuspendedState(AbstractEaseDebugger.java:331)
09:36:10 [2021-06-15T13:36:10.749Z] 	at org.eclipse.ease.debugging.AbstractEaseDebugger.suspend(AbstractEaseDebugger.java:257)
09:36:10 [2021-06-15T13:36:10.749Z] 	at org.eclipse.ease.debugging.AbstractEaseDebugger.processLine(AbstractEaseDebugger.java:492)
09:36:10 [2021-06-15T13:36:10.749Z] 	at org.eclipse.ease.lang.javascript.rhino.debugger.RhinoDebugger.access$4(RhinoDebugger.java:1)
09:36:10 [2021-06-15T13:36:10.749Z] 	at org.eclipse.ease.lang.javascript.rhino.debugger.RhinoDebugger$RhinoDebugFrame.onLineChange(RhinoDebugger.java:124)
09:36:10 [2021-06-15T13:36:10.749Z] 	at org.mozilla.javascript.Interpreter.interpretLoop(Interpreter.java:1931)
09:36:10 [2021-06-15T13:36:10.749Z] 	at org.mozilla.javascript.Interpreter.interpret(Interpreter.java:911)
09:36:10 [2021-06-15T13:36:10.749Z] 	at org.mozilla.javascript.InterpretedFunction.call(InterpretedFunction.java:109)
09:36:10 [2021-06-15T13:36:10.749Z] 	at org.mozilla.javascript.ContextFactory.doTopCall(ContextFactory.java:405)
09:36:10 [2021-06-15T13:36:10.749Z] 	at org.mozilla.javascript.ScriptRuntime.doTopCall(ScriptRuntime.java:3508)
09:36:10 [2021-06-15T13:36:10.749Z] 	at org.mozilla.javascript.InterpretedFunction.exec(InterpretedFunction.java:120)
09:36:10 [2021-06-15T13:36:10.749Z] 	at org.mozilla.javascript.Context.evaluateReader(Context.java:1293)
09:36:10 [2021-06-15T13:36:10.749Z] 	at org.eclipse.ease.lang.javascript.rhino.RhinoScriptEngine.internalExecute(RhinoScriptEngine.java:226)
09:36:10 [2021-06-15T13:36:10.749Z] 	at org.eclipse.ease.lang.javascript.rhino.RhinoScriptEngine.execute(RhinoScriptEngine.java:205)
09:36:10 [2021-06-15T13:36:10.749Z] 	at org.eclipse.ease.AbstractScriptEngine.inject(AbstractScriptEngine.java:191)
09:36:10 [2021-06-15T13:36:10.749Z] 	at org.eclipse.ease.AbstractScriptEngine.run(AbstractScriptEngine.java:244)
09:36:10 [2021-06-15T13:36:10.749Z] 	at org.eclipse.core.internal.jobs.Worker.run(Worker.java:63)
09:36:10 [2021-06-15T13:36:10.749Z] Start of script
09:36:10 [2021-06-15T13:36:10.749Z] include file start
09:36:10 [2021-06-15T13:36:10.749Z] Include file processed
09:36:10 [2021-06-15T13:36:10.749Z] line after include file
09:36:11 [2021-06-15T13:36:11.005Z] Result of testMethod = 5
09:36:11 [2021-06-15T13:36:11.005Z] End of script
09:36:11 [2021-06-15T13:36:11.005Z] Start of script
09:36:11 [2021-06-15T13:36:11.005Z] include file start
09:36:11 [2021-06-15T13:36:11.005Z] Include file processed
09:36:11 [2021-06-15T13:36:11.005Z] line after include file
09:36:11 [2021-06-15T13:36:11.005Z] Result of testMethod = 5
09:36:11 [2021-06-15T13:36:11.261Z] WARNING: An illegal reflective access operation has occurred
09:36:11 [2021-06-15T13:36:11.261Z] WARNING: Illegal reflective access by org.eclipse.ease.debugging.model.EaseDebugValue (file:/home/jenkins/agent/workspace/ease.verify.core.target.2019-06/plugins/org.eclipse.ease/target/org.eclipse.ease-0.8.0-SNAPSHOT.jar) to field java.lang.String.hash
09:36:11 [2021-06-15T13:36:11.261Z] WARNING: Please consider reporting this to the maintainers of org.eclipse.ease.debugging.model.EaseDebugValue
09:36:11 [2021-06-15T13:36:11.261Z] WARNING: Use --illegal-access=warn to enable warnings of further illegal reflective access operations
09:36:11 [2021-06-15T13:36:11.261Z] WARNING: All illegal access operations will be denied in a future release
09:36:11 [2021-06-15T13:36:11.261Z] org.eclipse.ease.ScriptEngineCancellationException: Terminated on user request
09:36:11 [2021-06-15T13:36:11.261Z] 	at org.eclipse.ease.debugging.AbstractEaseDebugger.handleEventsInSuspendedState(AbstractEaseDebugger.java:331)
09:36:11 [2021-06-15T13:36:11.261Z] 	at org.eclipse.ease.debugging.AbstractEaseDebugger.suspend(AbstractEaseDebugger.java:257)
09:36:11 [2021-06-15T13:36:11.261Z] 	at org.eclipse.ease.debugging.AbstractEaseDebugger.processLine(AbstractEaseDebugger.java:492)
09:36:11 [2021-06-15T13:36:11.261Z] 	at org.eclipse.ease.lang.javascript.rhino.debugger.RhinoDebugger.access$4(RhinoDebugger.java:1)
09:36:11 [2021-06-15T13:36:11.261Z] 	at org.eclipse.ease.lang.javascript.rhino.debugger.RhinoDebugger$RhinoDebugFrame.onLineChange(RhinoDebugger.java:124)
09:36:11 [2021-06-15T13:36:11.261Z] 	at org.mozilla.javascript.Interpreter.interpretLoop(Interpreter.java:1931)
09:36:11 [2021-06-15T13:36:11.261Z] 	at org.mozilla.javascript.Interpreter.interpret(Interpreter.java:911)
09:36:11 [2021-06-15T13:36:11.261Z] 	at org.mozilla.javascript.InterpretedFunction.call(InterpretedFunction.java:109)
09:36:11 [2021-06-15T13:36:11.261Z] 	at org.mozilla.javascript.ContextFactory.doTopCall(ContextFactory.java:405)
09:36:11 [2021-06-15T13:36:11.261Z] 	at org.mozilla.javascript.ScriptRuntime.doTopCall(ScriptRuntime.java:3508)
09:36:11 [2021-06-15T13:36:11.261Z] 	at org.mozilla.javascript.InterpretedFunction.exec(InterpretedFunction.java:120)
09:36:11 [2021-06-15T13:36:11.261Z] 	at org.mozilla.javascript.Context.evaluateReader(Context.java:1293)
09:36:11 [2021-06-15T13:36:11.261Z] 	at org.eclipse.ease.lang.javascript.rhino.RhinoScriptEngine.internalExecute(RhinoScriptEngine.java:226)
09:36:11 [2021-06-15T13:36:11.261Z] 	at org.eclipse.ease.lang.javascript.rhino.RhinoScriptEngine.execute(RhinoScriptEngine.java:205)
09:36:11 [2021-06-15T13:36:11.261Z] 	at org.eclipse.ease.AbstractScriptEngine.inject(AbstractScriptEngine.java:191)
09:36:11 [2021-06-15T13:36:11.261Z] 	at org.eclipse.ease.AbstractScriptEngine.run(AbstractScriptEngine.java:244)
09:36:11 [2021-06-15T13:36:11.261Z] 	at org.eclipse.core.internal.jobs.Worker.run(Worker.java:63)
09:36:11 [2021-06-15T13:36:11.518Z] Start of script
09:36:11 [2021-06-15T13:36:11.518Z] include file start
09:36:11 [2021-06-15T13:36:11.518Z] Include file processed
09:36:11 [2021-06-15T13:36:11.518Z] line after include file
09:36:11 [2021-06-15T13:36:11.518Z] Result of testMethod = 5
09:36:11 [2021-06-15T13:36:11.518Z] End of script
09:36:12 [2021-06-15T13:36:12.079Z] Start of script
09:36:12 [2021-06-15T13:36:12.335Z] include file start
09:36:12 [2021-06-15T13:36:12.335Z] Include file processed
09:36:12 [2021-06-15T13:36:12.335Z] line after include file
09:36:12 [2021-06-15T13:36:12.335Z] Result of testMethod = 5
09:36:12 [2021-06-15T13:36:12.335Z] End of script
09:36:12 [2021-06-15T13:36:12.591Z] Start of script
09:36:12 [2021-06-15T13:36:12.591Z] include file start
09:36:12 [2021-06-15T13:36:12.591Z] Include file processed
09:36:12 [2021-06-15T13:36:12.591Z] line after include file
09:36:12 [2021-06-15T13:36:12.591Z] Result of testMethod = 5
09:36:12 [2021-06-15T13:36:12.591Z] End of script
09:36:12 [2021-06-15T13:36:12.591Z] Start of script
09:36:12 [2021-06-15T13:36:12.591Z] include file start
09:36:12 [2021-06-15T13:36:12.591Z] Include file processed
09:36:12 [2021-06-15T13:36:12.847Z] line after include file
09:36:12 [2021-06-15T13:36:12.847Z] Result of testMethod = 5
09:36:12 [2021-06-15T13:36:12.847Z] End of script
09:36:12 [2021-06-15T13:36:12.847Z] Start of script
09:36:12 [2021-06-15T13:36:12.847Z] include file start
09:36:12 [2021-06-15T13:36:12.847Z] Include file processed
09:36:12 [2021-06-15T13:36:12.847Z] line after include file
09:36:13 [2021-06-15T13:36:13.103Z] org.eclipse.ease.ScriptEngineCancellationException: Terminated on user request
09:36:13 [2021-06-15T13:36:13.103Z] 	at org.eclipse.ease.debugging.AbstractEaseDebugger.handleEventsInSuspendedState(AbstractEaseDebugger.java:331)
09:36:13 [2021-06-15T13:36:13.103Z] 	at org.eclipse.ease.debugging.AbstractEaseDebugger.suspend(AbstractEaseDebugger.java:257)
09:36:13 [2021-06-15T13:36:13.103Z] 	at org.eclipse.ease.debugging.AbstractEaseDebugger.processLine(AbstractEaseDebugger.java:492)
09:36:13 [2021-06-15T13:36:13.103Z] 	at org.eclipse.ease.lang.javascript.rhino.debugger.RhinoDebugger.access$4(RhinoDebugger.java:1)
09:36:13 [2021-06-15T13:36:13.103Z] 	at org.eclipse.ease.lang.javascript.rhino.debugger.RhinoDebugger$RhinoDebugFrame.onLineChange(RhinoDebugger.java:124)
09:36:13 [2021-06-15T13:36:13.103Z] 	at org.mozilla.javascript.Interpreter.interpretLoop(Interpreter.java:1931)
09:36:13 [2021-06-15T13:36:13.103Z] 	at org.mozilla.javascript.Interpreter.interpret(Interpreter.java:911)
09:36:13 [2021-06-15T13:36:13.103Z] 	at org.mozilla.javascript.InterpretedFunction.call(InterpretedFunction.java:109)
09:36:13 [2021-06-15T13:36:13.103Z] 	at org.mozilla.javascript.ContextFactory.doTopCall(ContextFactory.java:405)
09:36:13 [2021-06-15T13:36:13.103Z] 	at org.mozilla.javascript.ScriptRuntime.doTopCall(ScriptRuntime.java:3508)
09:36:13 [2021-06-15T13:36:13.103Z] 	at org.mozilla.javascript.InterpretedFunction.exec(InterpretedFunction.java:120)
09:36:13 [2021-06-15T13:36:13.103Z] 	at org.mozilla.javascript.Context.evaluateReader(Context.java:1293)
09:36:13 [2021-06-15T13:36:13.103Z] 	at org.eclipse.ease.lang.javascript.rhino.RhinoScriptEngine.internalExecute(RhinoScriptEngine.java:226)
09:36:13 [2021-06-15T13:36:13.103Z] 	at org.eclipse.ease.lang.javascript.rhino.RhinoScriptEngine.execute(RhinoScriptEngine.java:205)
09:36:13 [2021-06-15T13:36:13.103Z] 	at org.eclipse.ease.AbstractScriptEngine.inject(AbstractScriptEngine.java:191)
09:36:13 [2021-06-15T13:36:13.103Z] 	at org.eclipse.ease.AbstractScriptEngine.run(AbstractScriptEngine.java:244)
09:36:13 [2021-06-15T13:36:13.103Z] 	at org.eclipse.core.internal.jobs.Worker.run(Worker.java:63)
09:36:13 [2021-06-15T13:36:13.103Z] Start of script
09:36:13 [2021-06-15T13:36:13.359Z] include file start
09:36:13 [2021-06-15T13:36:13.359Z] Include file processed
09:36:13 [2021-06-15T13:36:13.359Z] line after include file
09:36:13 [2021-06-15T13:36:13.359Z] Result of testMethod = 5
09:36:13 [2021-06-15T13:36:13.359Z] End of script
09:36:13 [2021-06-15T13:36:13.615Z] Start of script
09:36:13 [2021-06-15T13:36:13.615Z] include file start
09:36:13 [2021-06-15T13:36:13.615Z] Include file processed
09:36:13 [2021-06-15T13:36:13.615Z] line after include file
09:36:13 [2021-06-15T13:36:13.615Z] Result of testMethod = 5
09:36:13 [2021-06-15T13:36:13.615Z] org.eclipse.ease.ScriptEngineCancellationException: Terminated on user request
09:36:13 [2021-06-15T13:36:13.615Z] 	at org.eclipse.ease.debugging.AbstractEaseDebugger.handleEventsInSuspendedState(AbstractEaseDebugger.java:331)
09:36:13 [2021-06-15T13:36:13.615Z] 	at org.eclipse.ease.debugging.AbstractEaseDebugger.suspend(AbstractEaseDebugger.java:257)
09:36:13 [2021-06-15T13:36:13.615Z] 	at org.eclipse.ease.debugging.AbstractEaseDebugger.processLine(AbstractEaseDebugger.java:492)
09:36:13 [2021-06-15T13:36:13.615Z] 	at org.eclipse.ease.lang.javascript.rhino.debugger.RhinoDebugger.access$4(RhinoDebugger.java:1)
09:36:13 [2021-06-15T13:36:13.615Z] 	at org.eclipse.ease.lang.javascript.rhino.debugger.RhinoDebugger$RhinoDebugFrame.onLineChange(RhinoDebugger.java:124)
09:36:13 [2021-06-15T13:36:13.615Z] 	at org.mozilla.javascript.Interpreter.interpretLoop(Interpreter.java:1931)
09:36:13 [2021-06-15T13:36:13.615Z] 	at org.mozilla.javascript.Interpreter.interpret(Interpreter.java:911)
09:36:13 [2021-06-15T13:36:13.615Z] 	at org.mozilla.javascript.InterpretedFunction.call(InterpretedFunction.java:109)
09:36:13 [2021-06-15T13:36:13.615Z] 	at org.mozilla.javascript.ContextFactory.doTopCall(ContextFactory.java:405)
09:36:13 [2021-06-15T13:36:13.615Z] 	at org.mozilla.javascript.ScriptRuntime.doTopCall(ScriptRuntime.java:3508)
09:36:13 [2021-06-15T13:36:13.615Z] 	at org.mozilla.javascript.InterpretedFunction.exec(InterpretedFunction.java:120)
09:36:13 [2021-06-15T13:36:13.615Z] 	at org.mozilla.javascript.Context.evaluateReader(Context.java:1293)
09:36:13 [2021-06-15T13:36:13.615Z] 	at org.eclipse.ease.lang.javascript.rhino.RhinoScriptEngine.internalExecute(RhinoScriptEngine.java:226)
09:36:13 [2021-06-15T13:36:13.615Z] 	at org.eclipse.ease.lang.javascript.rhino.RhinoScriptEngine.execute(RhinoScriptEngine.java:205)
09:36:13 [2021-06-15T13:36:13.615Z] 	at org.eclipse.ease.AbstractScriptEngine.inject(AbstractScriptEngine.java:191)
09:36:13 [2021-06-15T13:36:13.615Z] 	at org.eclipse.ease.AbstractScriptEngine.run(AbstractScriptEngine.java:244)
09:36:13 [2021-06-15T13:36:13.615Z] 	at org.eclipse.core.internal.jobs.Worker.run(Worker.java:63)
09:36:13 [2021-06-15T13:36:13.871Z] Start of script
09:36:13 [2021-06-15T13:36:13.871Z] include file start
09:36:13 [2021-06-15T13:36:13.871Z] Include file processed
09:36:13 [2021-06-15T13:36:13.871Z] line after include file
09:36:13 [2021-06-15T13:36:13.871Z] Result of testMethod = 5
09:36:13 [2021-06-15T13:36:13.871Z] End of script
09:36:14 [2021-06-15T13:36:14.127Z] Start of script
09:36:14 [2021-06-15T13:36:14.127Z] include file start
09:36:14 [2021-06-15T13:36:14.128Z] Include file processed
09:36:14 [2021-06-15T13:36:14.128Z] line after include file
09:36:14 [2021-06-15T13:36:14.128Z] Result of testMethod = 5
09:36:14 [2021-06-15T13:36:14.128Z] End of script
09:36:14 [2021-06-15T13:36:14.404Z] Start of script
09:36:14 [2021-06-15T13:36:14.404Z] include file start
09:36:14 [2021-06-15T13:36:14.404Z] Include file processed
09:36:14 [2021-06-15T13:36:14.404Z] line after include file
09:36:14 [2021-06-15T13:36:14.674Z] Result of testMethod = 5
09:36:14 [2021-06-15T13:36:14.674Z] End of script
09:36:14 [2021-06-15T13:36:14.674Z] Start of script
09:36:14 [2021-06-15T13:36:14.674Z] include file start
09:36:14 [2021-06-15T13:36:14.674Z] Include file processed
09:36:14 [2021-06-15T13:36:14.674Z] line after include file
09:36:14 [2021-06-15T13:36:14.674Z] Result of testMethod = 5
09:36:14 [2021-06-15T13:36:14.674Z] End of script
09:36:14 [2021-06-15T13:36:14.930Z] Start of script
09:36:14 [2021-06-15T13:36:14.930Z] include file start
09:36:14 [2021-06-15T13:36:14.930Z] Include file processed
09:36:14 [2021-06-15T13:36:14.930Z] line after include file
09:36:14 [2021-06-15T13:36:14.930Z] Result of testMethod = 5
09:36:14 [2021-06-15T13:36:14.930Z] org.eclipse.ease.ScriptEngineCancellationException: Terminated on user request
09:36:14 [2021-06-15T13:36:14.930Z] 	at org.eclipse.ease.debugging.AbstractEaseDebugger.handleEventsInSuspendedState(AbstractEaseDebugger.java:331)
09:36:14 [2021-06-15T13:36:14.930Z] 	at org.eclipse.ease.debugging.AbstractEaseDebugger.suspend(AbstractEaseDebugger.java:257)
09:36:14 [2021-06-15T13:36:14.930Z] 	at org.eclipse.ease.debugging.AbstractEaseDebugger.processLine(AbstractEaseDebugger.java:492)
09:36:14 [2021-06-15T13:36:14.930Z] 	at org.eclipse.ease.lang.javascript.rhino.debugger.RhinoDebugger.access$4(RhinoDebugger.java:1)
09:36:14 [2021-06-15T13:36:14.930Z] 	at org.eclipse.ease.lang.javascript.rhino.debugger.RhinoDebugger$RhinoDebugFrame.onLineChange(RhinoDebugger.java:124)
09:36:14 [2021-06-15T13:36:14.930Z] 	at org.mozilla.javascript.Interpreter.interpretLoop(Interpreter.java:1931)
09:36:14 [2021-06-15T13:36:14.930Z] 	at org.mozilla.javascript.Interpreter.interpret(Interpreter.java:911)
09:36:14 [2021-06-15T13:36:14.930Z] 	at org.mozilla.javascript.InterpretedFunction.call(InterpretedFunction.java:109)
09:36:14 [2021-06-15T13:36:14.930Z] 	at org.mozilla.javascript.ContextFactory.doTopCall(ContextFactory.java:405)
09:36:14 [2021-06-15T13:36:14.930Z] 	at org.mozilla.javascript.ScriptRuntime.doTopCall(ScriptRuntime.java:3508)
09:36:14 [2021-06-15T13:36:14.930Z] 	at org.mozilla.javascript.InterpretedFunction.exec(InterpretedFunction.java:120)
09:36:14 [2021-06-15T13:36:14.930Z] 	at org.mozilla.javascript.Context.evaluateReader(Context.java:1293)
09:36:14 [2021-06-15T13:36:14.930Z] 	at org.eclipse.ease.lang.javascript.rhino.RhinoScriptEngine.internalExecute(RhinoScriptEngine.java:226)
09:36:14 [2021-06-15T13:36:14.930Z] 	at org.eclipse.ease.lang.javascript.rhino.RhinoScriptEngine.execute(RhinoScriptEngine.java:205)
09:36:14 [2021-06-15T13:36:14.930Z] 	at org.eclipse.ease.AbstractScriptEngine.inject(AbstractScriptEngine.java:191)
09:36:14 [2021-06-15T13:36:14.930Z] 	at org.eclipse.ease.AbstractScriptEngine.run(AbstractScriptEngine.java:244)
09:36:14 [2021-06-15T13:36:14.930Z] 	at org.eclipse.core.internal.jobs.Worker.run(Worker.java:63)
09:36:15 [2021-06-15T13:36:15.187Z] Start of script
09:36:15 [2021-06-15T13:36:15.187Z] include file start
09:36:15 [2021-06-15T13:36:15.187Z] Include file processed
09:36:15 [2021-06-15T13:36:15.187Z] line after include file
09:36:15 [2021-06-15T13:36:15.187Z] Result of testMethod = 5
09:36:15 [2021-06-15T13:36:15.187Z] End of script
09:36:15 [2021-06-15T13:36:15.443Z] Start of script
09:36:15 [2021-06-15T13:36:15.443Z] include file start
09:36:15 [2021-06-15T13:36:15.443Z] Include file processed
09:36:15 [2021-06-15T13:36:15.443Z] line after include file
09:36:15 [2021-06-15T13:36:15.443Z] Result of testMethod = 5
09:36:15 [2021-06-15T13:36:15.443Z] org.eclipse.ease.ScriptEngineCancellationException: Terminated on user request
09:36:15 [2021-06-15T13:36:15.443Z] 	at org.eclipse.ease.debugging.AbstractEaseDebugger.handleEventsInSuspendedState(AbstractEaseDebugger.java:331)
09:36:15 [2021-06-15T13:36:15.443Z] 	at org.eclipse.ease.debugging.AbstractEaseDebugger.suspend(AbstractEaseDebugger.java:257)
09:36:15 [2021-06-15T13:36:15.444Z] 	at org.eclipse.ease.debugging.AbstractEaseDebugger.processLine(AbstractEaseDebugger.java:492)
09:36:15 [2021-06-15T13:36:15.444Z] 	at org.eclipse.ease.lang.javascript.rhino.debugger.RhinoDebugger.access$4(RhinoDebugger.java:1)
09:36:15 [2021-06-15T13:36:15.444Z] 	at org.eclipse.ease.lang.javascript.rhino.debugger.RhinoDebugger$RhinoDebugFrame.onLineChange(RhinoDebugger.java:124)
09:36:15 [2021-06-15T13:36:15.444Z] 	at org.mozilla.javascript.Interpreter.interpretLoop(Interpreter.java:1931)
09:36:15 [2021-06-15T13:36:15.444Z] 	at org.mozilla.javascript.Interpreter.interpret(Interpreter.java:911)
09:36:15 [2021-06-15T13:36:15.444Z] 	at org.mozilla.javascript.InterpretedFunction.call(InterpretedFunction.java:109)
09:36:15 [2021-06-15T13:36:15.444Z] 	at org.mozilla.javascript.ContextFactory.doTopCall(ContextFactory.java:405)
09:36:15 [2021-06-15T13:36:15.444Z] 	at org.mozilla.javascript.ScriptRuntime.doTopCall(ScriptRuntime.java:3508)
09:36:15 [2021-06-15T13:36:15.444Z] 	at org.mozilla.javascript.InterpretedFunction.exec(InterpretedFunction.java:120)
09:36:15 [2021-06-15T13:36:15.444Z] 	at org.mozilla.javascript.Context.evaluateReader(Context.java:1293)
09:36:15 [2021-06-15T13:36:15.444Z] 	at org.eclipse.ease.lang.javascript.rhino.RhinoScriptEngine.internalExecute(RhinoScriptEngine.java:226)
09:36:15 [2021-06-15T13:36:15.444Z] 	at org.eclipse.ease.lang.javascript.rhino.RhinoScriptEngine.execute(RhinoScriptEngine.java:205)
09:36:15 [2021-06-15T13:36:15.444Z] 	at org.eclipse.ease.AbstractScriptEngine.inject(AbstractScriptEngine.java:191)
09:36:15 [2021-06-15T13:36:15.444Z] 	at org.eclipse.ease.AbstractScriptEngine.run(AbstractScriptEngine.java:244)
09:36:15 [2021-06-15T13:36:15.444Z] 	at org.eclipse.core.internal.jobs.Worker.run(Worker.java:63)
09:36:15 [2021-06-15T13:36:15.701Z] org.eclipse.ease.ScriptEngineCancellationException: Terminated on user request
09:36:15 [2021-06-15T13:36:15.701Z] 	at org.eclipse.ease.debugging.AbstractEaseDebugger.handleEventsInSuspendedState(AbstractEaseDebugger.java:331)
09:36:15 [2021-06-15T13:36:15.701Z] 	at org.eclipse.ease.debugging.AbstractEaseDebugger.suspend(AbstractEaseDebugger.java:257)
09:36:15 [2021-06-15T13:36:15.701Z] 	at org.eclipse.ease.debugging.AbstractEaseDebugger.processLine(AbstractEaseDebugger.java:492)
09:36:15 [2021-06-15T13:36:15.701Z] 	at org.eclipse.ease.lang.javascript.rhino.debugger.RhinoDebugger.access$4(RhinoDebugger.java:1)
09:36:15 [2021-06-15T13:36:15.701Z] 	at org.eclipse.ease.lang.javascript.rhino.debugger.RhinoDebugger$RhinoDebugFrame.onLineChange(RhinoDebugger.java:124)
09:36:15 [2021-06-15T13:36:15.701Z] 	at org.mozilla.javascript.Interpreter.interpretLoop(Interpreter.java:1931)
09:36:15 [2021-06-15T13:36:15.701Z] 	at org.mozilla.javascript.Interpreter.interpret(Interpreter.java:911)
09:36:15 [2021-06-15T13:36:15.701Z] 	at org.mozilla.javascript.InterpretedFunction.call(InterpretedFunction.java:109)
09:36:15 [2021-06-15T13:36:15.701Z] 	at org.mozilla.javascript.ContextFactory.doTopCall(ContextFactory.java:405)
09:36:15 [2021-06-15T13:36:15.701Z] 	at org.mozilla.javascript.ScriptRuntime.doTopCall(ScriptRuntime.java:3508)
09:36:15 [2021-06-15T13:36:15.701Z] 	at org.mozilla.javascript.InterpretedFunction.exec(InterpretedFunction.java:120)
09:36:15 [2021-06-15T13:36:15.701Z] 	at org.mozilla.javascript.Context.evaluateReader(Context.java:1293)
09:36:15 [2021-06-15T13:36:15.701Z] 	at org.eclipse.ease.lang.javascript.rhino.RhinoScriptEngine.internalExecute(RhinoScriptEngine.java:226)
09:36:15 [2021-06-15T13:36:15.701Z] 	at org.eclipse.ease.lang.javascript.rhino.RhinoScriptEngine.execute(RhinoScriptEngine.java:205)
09:36:15 [2021-06-15T13:36:15.701Z] 	at org.eclipse.ease.AbstractScriptEngine.inject(AbstractScriptEngine.java:191)
09:36:15 [2021-06-15T13:36:15.701Z] 	at org.eclipse.ease.AbstractScriptEngine.run(AbstractScriptEngine.java:244)
09:36:15 [2021-06-15T13:36:15.701Z] 	at org.eclipse.core.internal.jobs.Worker.run(Worker.java:63)
09:36:15 [2021-06-15T13:36:15.957Z] Start of script
09:36:15 [2021-06-15T13:36:15.957Z] include file start
09:36:15 [2021-06-15T13:36:15.957Z] Include file processed
09:36:15 [2021-06-15T13:36:15.957Z] line after include file
09:36:15 [2021-06-15T13:36:15.957Z] Result of testMethod = 5
09:36:15 [2021-06-15T13:36:15.957Z] End of script
09:36:15 [2021-06-15T13:36:15.957Z] Start of script
09:36:15 [2021-06-15T13:36:15.957Z] include file start
09:36:15 [2021-06-15T13:36:15.957Z] Include file processed
09:36:15 [2021-06-15T13:36:15.957Z] line after include file
09:36:16 [2021-06-15T13:36:16.214Z] Result of testMethod = 5
09:36:16 [2021-06-15T13:36:16.214Z] End of script
09:36:16 [2021-06-15T13:36:16.476Z] Start of script
09:36:16 [2021-06-15T13:36:16.476Z] include file start
09:36:16 [2021-06-15T13:36:16.476Z] Include file processed
09:36:16 [2021-06-15T13:36:16.476Z] line after include file
09:36:16 [2021-06-15T13:36:16.476Z] Result of testMethod = 5
09:36:16 [2021-06-15T13:36:16.476Z] End of script
09:36:16 [2021-06-15T13:36:16.744Z] Tests run: 42, Failures: 0, Errors: 0, Skipped: 0, Time elapsed: 11.688 s - in org.eclipse.ease.lang.javascript.rhino.RhinoDebugTest
09:36:16 [2021-06-15T13:36:16.744Z] disconnectProcessInSuspendedState  Time elapsed: 0.286 s
09:36:16 [2021-06-15T13:36:16.744Z] stepReturnIncludeCommand  Time elapsed: 0.21 s
09:36:16 [2021-06-15T13:36:16.744Z] arrayVariableSorting  Time elapsed: 0.306 s
09:36:16 [2021-06-15T13:36:16.744Z] stepOverOnDebugTarget  Time elapsed: 0.307 s
09:36:16 [2021-06-15T13:36:16.744Z] hasDebugTarget  Time elapsed: 0.104 s
09:36:16 [2021-06-15T13:36:16.744Z] disconnectThreadInSuspendedState  Time elapsed: 0.207 s
09:36:16 [2021-06-15T13:36:16.744Z] stepReturnOnDebugTarget  Time elapsed: 0.307 s
09:36:16 [2021-06-15T13:36:16.744Z] nullVariable  Time elapsed: 0.306 s
09:36:16 [2021-06-15T13:36:16.744Z] stepOverOnStackFrame  Time elapsed: 0.306 s
09:36:16 [2021-06-15T13:36:16.744Z] resumeOnDebugTarget  Time elapsed: 0.205 s
09:36:16 [2021-06-15T13:36:16.744Z] modifyVariableKeepingType  Time elapsed: 0.406 s
09:36:16 [2021-06-15T13:36:16.744Z] resumeOnLastIncludeLine  Time elapsed: 0.205 s
09:36:16 [2021-06-15T13:36:16.744Z] stepReturnOnStackFrame  Time elapsed: 0.306 s
09:36:16 [2021-06-15T13:36:16.744Z] terminateStackFrameInSuspendedState  Time elapsed: 0.205 s
09:36:16 [2021-06-15T13:36:16.744Z] breakpointLocation  Time elapsed: 0.205 s
09:36:16 [2021-06-15T13:36:16.744Z] stepReturnOnThread  Time elapsed: 0.307 s
09:36:16 [2021-06-15T13:36:16.744Z] javaClassVariable  Time elapsed: 0.306 s
09:36:16 [2021-06-15T13:36:16.744Z] stepIntoOnThread  Time elapsed: 0.411 s
09:36:16 [2021-06-15T13:36:16.744Z] terminateThreadInSuspendedState  Time elapsed: 0.215 s
09:36:16 [2021-06-15T13:36:16.744Z] resumeOnThread  Time elapsed: 0.213 s
09:36:16 [2021-06-15T13:36:16.744Z] stepIntoOnStackFrame  Time elapsed: 0.31 s
09:36:16 [2021-06-15T13:36:16.744Z] terminateProcessInSuspendedState  Time elapsed: 0.209 s
09:36:16 [2021-06-15T13:36:16.744Z] stepOverOnProcess  Time elapsed: 0.312 s
09:36:16 [2021-06-15T13:36:16.744Z] nativeArrayVariable  Time elapsed: 0.308 s
09:36:16 [2021-06-15T13:36:16.744Z] disconnectDebugTargetInSuspendedState  Time elapsed: 0.204 s
09:36:16 [2021-06-15T13:36:16.744Z] stepIntoOnProcess  Time elapsed: 0.926 s
09:36:16 [2021-06-15T13:36:16.744Z] terminatedState  Time elapsed: 0.103 s
09:36:16 [2021-06-15T13:36:16.744Z] stepOverIncludeCommand  Time elapsed: 0.305 s
09:36:16 [2021-06-15T13:36:16.744Z] innerScopeVariableBeforeOuterScopeVariable  Time elapsed: 0.304 s
09:36:16 [2021-06-15T13:36:16.744Z] stepIntoIncludeCommand  Time elapsed: 0.305 s
09:36:16 [2021-06-15T13:36:16.744Z] primitiveStringVariable  Time elapsed: 0.305 s
09:36:16 [2021-06-15T13:36:16.744Z] resumeOnProcess  Time elapsed: 0.205 s
09:36:16 [2021-06-15T13:36:16.744Z] stepIntoOnDebugTarget  Time elapsed: 0.305 s
09:36:16 [2021-06-15T13:36:16.744Z] stepOverOnThread  Time elapsed: 0.305 s
09:36:16 [2021-06-15T13:36:16.744Z] suspendedState  Time elapsed: 0.205 s
09:36:16 [2021-06-15T13:36:16.744Z] primitiveDoubleVariable  Time elapsed: 0.306 s
09:36:16 [2021-06-15T13:36:16.744Z] resumeOnStackFrame  Time elapsed: 0.204 s
09:36:16 [2021-06-15T13:36:16.744Z] nativeObjectVariable  Time elapsed: 0.304 s
09:36:16 [2021-06-15T13:36:16.744Z] terminateDebugTargetInSuspendedState  Time elapsed: 0.204 s
09:36:16 [2021-06-15T13:36:16.744Z] disconnectStackFrameInSuspendedState  Time elapsed: 0.205 s
09:36:16 [2021-06-15T13:36:16.745Z] stepReturnOnProcess  Time elapsed: 0.304 s
09:36:16 [2021-06-15T13:36:16.745Z] evaluateWatchExpression  Time elapsed: 0.216 s
09:36:16 [2021-06-15T13:36:16.745Z] 
09:36:16 [2021-06-15T13:36:16.745Z] Results:
09:36:16 [2021-06-15T13:36:16.745Z] 
09:36:16 [2021-06-15T13:36:16.745Z] Tests run: 70, Failures: 0, Errors: 0, Skipped: 0
09:36:16 [2021-06-15T13:36:16.745Z] 
09:36:17 [2021-06-15T13:36:17.316Z] [INFO] All tests passed!
09:36:17 [2021-06-15T13:36:17.316Z] [INFO] 
09:36:17 [2021-06-15T13:36:17.316Z] [INFO] --- maven-pmd-plugin:3.14.0:pmd (pmd-integration) @ org.eclipse.ease.lang.javascript.rhino.test ---
09:36:17 [2021-06-15T13:36:17.878Z] [INFO] 
09:36:17 [2021-06-15T13:36:17.878Z] [INFO] --- maven-pmd-plugin:3.14.0:cpd (pmd-integration) @ org.eclipse.ease.lang.javascript.rhino.test ---
09:36:17 [2021-06-15T13:36:17.878Z] [INFO] 
09:36:17 [2021-06-15T13:36:17.878Z] [INFO] --- spotbugs-maven-plugin:4.1.4:spotbugs (spotbugs-integration) @ org.eclipse.ease.lang.javascript.rhino.test ---
09:36:17 [2021-06-15T13:36:17.878Z] [INFO] Fork Value is false
09:36:17 [2021-06-15T13:36:17.878Z]      [java] JVM args ignored when same JVM is used.
09:36:21 [2021-06-15T13:36:21.205Z] [INFO] Done SpotBugs Analysis....
09:36:21 [2021-06-15T13:36:21.205Z] [INFO] 
09:36:21 [2021-06-15T13:36:21.205Z] [INFO] --- maven-checkstyle-plugin:3.1.1:check (checkstyle-integration) @ org.eclipse.ease.lang.javascript.rhino.test ---
09:36:21 [2021-06-15T13:36:21.205Z] [INFO] You have 0 Checkstyle violations.
09:36:21 [2021-06-15T13:36:21.205Z] [INFO] 
09:36:21 [2021-06-15T13:36:21.205Z] [INFO] --- maven-install-plugin:2.3.1:install (default-install) @ org.eclipse.ease.lang.javascript.rhino.test ---
09:36:21 [2021-06-15T13:36:21.205Z] [INFO] Installing /home/jenkins/agent/workspace/ease.verify.core.target.2019-06/tests/org.eclipse.ease.lang.javascript.rhino.test/target/org.eclipse.ease.lang.javascript.rhino.test-0.8.0-SNAPSHOT.jar to /home/jenkins/.m2/repository/org/eclipse/ease/org.eclipse.ease.lang.javascript.rhino.test/0.8.0-SNAPSHOT/org.eclipse.ease.lang.javascript.rhino.test-0.8.0-SNAPSHOT.jar
09:36:21 [2021-06-15T13:36:21.205Z] [INFO] Installing /home/jenkins/agent/workspace/ease.verify.core.target.2019-06/tests/org.eclipse.ease.lang.javascript.rhino.test/pom.xml to /home/jenkins/.m2/repository/org/eclipse/ease/org.eclipse.ease.lang.javascript.rhino.test/0.8.0-SNAPSHOT/org.eclipse.ease.lang.javascript.rhino.test-0.8.0-SNAPSHOT.pom
09:36:21 [2021-06-15T13:36:21.205Z] [INFO] Installing /home/jenkins/agent/workspace/ease.verify.core.target.2019-06/tests/org.eclipse.ease.lang.javascript.rhino.test/target/p2content.xml to /home/jenkins/.m2/repository/org/eclipse/ease/org.eclipse.ease.lang.javascript.rhino.test/0.8.0-SNAPSHOT/org.eclipse.ease.lang.javascript.rhino.test-0.8.0-SNAPSHOT-p2metadata.xml
09:36:21 [2021-06-15T13:36:21.205Z] [INFO] Installing /home/jenkins/agent/workspace/ease.verify.core.target.2019-06/tests/org.eclipse.ease.lang.javascript.rhino.test/target/p2artifacts.xml to /home/jenkins/.m2/repository/org/eclipse/ease/org.eclipse.ease.lang.javascript.rhino.test/0.8.0-SNAPSHOT/org.eclipse.ease.lang.javascript.rhino.test-0.8.0-SNAPSHOT-p2artifacts.xml
09:36:21 [2021-06-15T13:36:21.205Z] [INFO] 
09:36:21 [2021-06-15T13:36:21.206Z] [INFO] --- tycho-p2-plugin:2.2.0:update-local-index (default-update-local-index) @ org.eclipse.ease.lang.javascript.rhino.test ---
09:36:21 [2021-06-15T13:36:21.206Z] [INFO] 
09:36:21 [2021-06-15T13:36:21.206Z] [INFO] -------< org.eclipse.ease:org.eclipse.ease.lang.javascript.test >-------
09:36:21 [2021-06-15T13:36:21.206Z] [INFO] Building org.eclipse.ease.lang.javascript.test 0.8.0-SNAPSHOT    [40/48]
09:36:21 [2021-06-15T13:36:21.206Z] [INFO] ------------------------[ eclipse-test-plugin ]-------------------------
09:36:21 [2021-06-15T13:36:21.206Z] [INFO] 
09:36:21 [2021-06-15T13:36:21.206Z] [INFO] --- maven-clean-plugin:2.5:clean (default-clean) @ org.eclipse.ease.lang.javascript.test ---
09:36:21 [2021-06-15T13:36:21.206Z] [INFO] 
09:36:21 [2021-06-15T13:36:21.206Z] [INFO] --- tycho-packaging-plugin:2.2.0:build-qualifier (default-build-qualifier) @ org.eclipse.ease.lang.javascript.test ---
09:36:21 [2021-06-15T13:36:21.206Z] [INFO] The project's OSGi version is 0.8.0.I202106150726
09:36:21 [2021-06-15T13:36:21.206Z] [INFO] 
09:36:21 [2021-06-15T13:36:21.206Z] [INFO] --- tycho-packaging-plugin:2.2.0:validate-id (default-validate-id) @ org.eclipse.ease.lang.javascript.test ---
09:36:21 [2021-06-15T13:36:21.206Z] [INFO] 
09:36:21 [2021-06-15T13:36:21.206Z] [INFO] --- tycho-packaging-plugin:2.2.0:validate-version (default-validate-version) @ org.eclipse.ease.lang.javascript.test ---
09:36:21 [2021-06-15T13:36:21.206Z] [INFO] 
09:36:21 [2021-06-15T13:36:21.206Z] [INFO] --- maven-resources-plugin:2.4.3:resources (default-resources) @ org.eclipse.ease.lang.javascript.test ---
09:36:21 [2021-06-15T13:36:21.206Z] [INFO] Using 'UTF-8' encoding to copy filtered resources.
09:36:21 [2021-06-15T13:36:21.206Z] [INFO] skip non existing resourceDirectory /home/jenkins/agent/workspace/ease.verify.core.target.2019-06/tests/org.eclipse.ease.lang.javascript.test/src/main/resources
09:36:21 [2021-06-15T13:36:21.206Z] [INFO] 
09:36:21 [2021-06-15T13:36:21.206Z] [INFO] --- tycho-compiler-plugin:2.2.0:compile (default-compile) @ org.eclipse.ease.lang.javascript.test ---
09:36:21 [2021-06-15T13:36:21.206Z] [INFO] Compiling 2 source files to /home/jenkins/agent/workspace/ease.verify.core.target.2019-06/tests/org.eclipse.ease.lang.javascript.test/target/classes
09:36:21 [2021-06-15T13:36:21.206Z] [INFO] 
09:36:21 [2021-06-15T13:36:21.206Z] [INFO] --- maven-resources-plugin:2.4.3:testResources (default-testResources) @ org.eclipse.ease.lang.javascript.test ---
09:36:21 [2021-06-15T13:36:21.206Z] [INFO] Using 'UTF-8' encoding to copy filtered resources.
09:36:21 [2021-06-15T13:36:21.206Z] [INFO] skip non existing resourceDirectory /home/jenkins/agent/workspace/ease.verify.core.target.2019-06/tests/org.eclipse.ease.lang.javascript.test/src/test/resources
09:36:21 [2021-06-15T13:36:21.206Z] [INFO] 
09:36:21 [2021-06-15T13:36:21.206Z] [INFO] --- target-platform-configuration:2.2.0:target-platform (default-target-platform) @ org.eclipse.ease.lang.javascript.test ---
09:36:21 [2021-06-15T13:36:21.206Z] [INFO] 
09:36:21 [2021-06-15T13:36:21.206Z] [INFO] --- tycho-packaging-plugin:2.2.0:package-plugin (default-package-plugin) @ org.eclipse.ease.lang.javascript.test ---
09:36:21 [2021-06-15T13:36:21.206Z] [INFO] Building jar: /home/jenkins/agent/workspace/ease.verify.core.target.2019-06/tests/org.eclipse.ease.lang.javascript.test/target/org.eclipse.ease.lang.javascript.test-0.8.0-SNAPSHOT.jar
09:36:21 [2021-06-15T13:36:21.206Z] [INFO] 
09:36:21 [2021-06-15T13:36:21.206Z] [INFO] --- tycho-p2-plugin:2.2.0:p2-metadata-default (default-p2-metadata-default) @ org.eclipse.ease.lang.javascript.test ---
09:36:21 [2021-06-15T13:36:21.206Z] [INFO] 
09:36:21 [2021-06-15T13:36:21.206Z] [INFO] --- jacoco-maven-plugin:0.8.6:prepare-agent (jacoco-initialize) @ org.eclipse.ease.lang.javascript.test ---
09:36:21 [2021-06-15T13:36:21.206Z] [INFO] tycho.testArgLine set to -javaagent:/home/jenkins/.m2/repository/org/jacoco/org.jacoco.agent/0.8.6/org.jacoco.agent-0.8.6-runtime.jar=destfile=/home/jenkins/agent/workspace/ease.verify.core.target.2019-06/tests/org.eclipse.ease.lang.javascript.test/target/jacoco.exec,output=file
09:36:21 [2021-06-15T13:36:21.206Z] [INFO] 
09:36:21 [2021-06-15T13:36:21.206Z] [INFO] --- tycho-surefire-plugin:2.2.0:test (default-test) @ org.eclipse.ease.lang.javascript.test ---
09:36:21 [2021-06-15T13:36:21.206Z] [INFO] Executing Test Runtime with timeout 0, logs (if any) will be placed at: /home/jenkins/agent/workspace/ease.verify.core.target.2019-06/tests/org.eclipse.ease.lang.javascript.test/target/work/data/.metadata/.log
09:36:21 [2021-06-15T13:36:21.206Z] [INFO] Command line:
09:36:21 [2021-06-15T13:36:21.206Z] 	[/opt/tools/java/openjdk/jdk-15/15.0.2+7/bin/java, -Dosgi.noShutdown=false, -Dosgi.os=linux, -Dosgi.ws=gtk, -Dosgi.arch=x86_64, -javaagent:/home/jenkins/.m2/repository/org/jacoco/org.jacoco.agent/0.8.6/org.jacoco.agent-0.8.6-runtime.jar=destfile=/home/jenkins/agent/workspace/ease.verify.core.target.2019-06/tests/org.eclipse.ease.lang.javascript.test/target/jacoco.exec,output=file, -Dosgi.clean=true, -jar, /home/jenkins/.m2/repository/p2/osgi/bundle/org.eclipse.equinox.launcher/1.6.0.v20200915-1508/org.eclipse.equinox.launcher-1.6.0.v20200915-1508.jar, -data, /home/jenkins/agent/workspace/ease.verify.core.target.2019-06/tests/org.eclipse.ease.lang.javascript.test/target/work/data, -install, /home/jenkins/agent/workspace/ease.verify.core.target.2019-06/tests/org.eclipse.ease.lang.javascript.test/target/work, -configuration, /home/jenkins/agent/workspace/ease.verify.core.target.2019-06/tests/org.eclipse.ease.lang.javascript.test/target/work/configuration, -application, org.eclipse.tycho.surefire.osgibooter.headlesstest, -testproperties, /home/jenkins/agent/workspace/ease.verify.core.target.2019-06/tests/org.eclipse.ease.lang.javascript.test/target/surefire.properties]
09:36:21 [2021-06-15T13:36:21.206Z] Picked up JAVA_TOOL_OPTIONS: -Dmaven.ext.class.path="/home/jenkins/agent/workspace/ease.verify.core.target.2019-06@tmp/withMavend6334c6d/pipeline-maven-spy.jar" -Dorg.jenkinsci.plugins.pipeline.maven.reportsFolder="/home/jenkins/agent/workspace/ease.verify.core.target.2019-06@tmp/withMavend6334c6d" 
09:36:23 [2021-06-15T13:36:23.822Z] Jun 15, 2021 1:36:23 PM org.junit.platform.launcher.core.DefaultLauncher handleThrowable
09:36:23 [2021-06-15T13:36:23.822Z] WARNING: TestEngine with ID 'junit-vintage' failed to discover tests
09:36:23 [2021-06-15T13:36:23.822Z] java.lang.NoClassDefFoundError: org/junit/runners/model/RunnerBuilder
09:36:23 [2021-06-15T13:36:23.822Z] 	at org.junit.vintage.engine.discovery.VintageDiscoverer.<init>(VintageDiscoverer.java:48)
09:36:23 [2021-06-15T13:36:23.822Z] 	at org.junit.vintage.engine.VintageTestEngine.discover(VintageTestEngine.java:65)
09:36:23 [2021-06-15T13:36:23.822Z] 	at org.junit.platform.launcher.core.DefaultLauncher.discoverEngineRoot(DefaultLauncher.java:130)
09:36:23 [2021-06-15T13:36:23.822Z] 	at org.junit.platform.launcher.core.DefaultLauncher.discoverRoot(DefaultLauncher.java:117)
09:36:23 [2021-06-15T13:36:23.822Z] 	at org.junit.platform.launcher.core.DefaultLauncher.discover(DefaultLauncher.java:82)
09:36:23 [2021-06-15T13:36:23.822Z] 	at org.apache.maven.surefire.junitplatform.TestPlanScannerFilter.accept(TestPlanScannerFilter.java:56)
09:36:23 [2021-06-15T13:36:23.822Z] 	at org.apache.maven.surefire.util.DefaultScanResult.applyFilter(DefaultScanResult.java:102)
09:36:23 [2021-06-15T13:36:23.822Z] 	at org.apache.maven.surefire.junitplatform.JUnitPlatformProvider.scanClasspath(JUnitPlatformProvider.java:143)
09:36:23 [2021-06-15T13:36:23.822Z] 	at org.apache.maven.surefire.junitplatform.JUnitPlatformProvider.invoke(JUnitPlatformProvider.java:124)
09:36:23 [2021-06-15T13:36:23.822Z] 	at java.base/jdk.internal.reflect.NativeMethodAccessorImpl.invoke0(Native Method)
09:36:23 [2021-06-15T13:36:23.822Z] 	at java.base/jdk.internal.reflect.NativeMethodAccessorImpl.invoke(NativeMethodAccessorImpl.java:64)
09:36:23 [2021-06-15T13:36:23.822Z] 	at java.base/jdk.internal.reflect.DelegatingMethodAccessorImpl.invoke(DelegatingMethodAccessorImpl.java:43)
09:36:23 [2021-06-15T13:36:23.822Z] 	at java.base/java.lang.reflect.Method.invoke(Method.java:564)
09:36:23 [2021-06-15T13:36:23.822Z] 	at org.apache.maven.surefire.util.ReflectionUtils.invokeMethodWithArray2(ReflectionUtils.java:206)
09:36:23 [2021-06-15T13:36:23.822Z] 	at org.apache.maven.surefire.booter.ProviderFactory$ProviderProxy.invoke(ProviderFactory.java:161)
09:36:23 [2021-06-15T13:36:23.822Z] 	at org.apache.maven.surefire.booter.ProviderFactory.invokeProvider(ProviderFactory.java:84)
09:36:23 [2021-06-15T13:36:23.822Z] 	at org.eclipse.tycho.surefire.osgibooter.OsgiSurefireBooter.run(OsgiSurefireBooter.java:116)
09:36:23 [2021-06-15T13:36:23.822Z] 	at org.eclipse.tycho.surefire.osgibooter.HeadlessTestApplication.start(HeadlessTestApplication.java:23)
09:36:23 [2021-06-15T13:36:23.822Z] 	at org.eclipse.equinox.internal.app.EclipseAppHandle.run(EclipseAppHandle.java:203)
09:36:23 [2021-06-15T13:36:23.822Z] 	at org.eclipse.core.runtime.internal.adaptor.EclipseAppLauncher.runApplication(EclipseAppLauncher.java:134)
09:36:23 [2021-06-15T13:36:23.822Z] 	at org.eclipse.core.runtime.internal.adaptor.EclipseAppLauncher.start(EclipseAppLauncher.java:104)
09:36:23 [2021-06-15T13:36:23.822Z] 	at org.eclipse.core.runtime.adaptor.EclipseStarter.run(EclipseStarter.java:401)
09:36:23 [2021-06-15T13:36:23.822Z] 	at org.eclipse.core.runtime.adaptor.EclipseStarter.run(EclipseStarter.java:255)
09:36:23 [2021-06-15T13:36:23.822Z] 	at java.base/jdk.internal.reflect.NativeMethodAccessorImpl.invoke0(Native Method)
09:36:23 [2021-06-15T13:36:23.822Z] 	at java.base/jdk.internal.reflect.NativeMethodAccessorImpl.invoke(NativeMethodAccessorImpl.java:64)
09:36:23 [2021-06-15T13:36:23.822Z] 	at java.base/jdk.internal.reflect.DelegatingMethodAccessorImpl.invoke(DelegatingMethodAccessorImpl.java:43)
09:36:23 [2021-06-15T13:36:23.822Z] 	at java.base/java.lang.reflect.Method.invoke(Method.java:564)
09:36:23 [2021-06-15T13:36:23.822Z] 	at org.eclipse.equinox.launcher.Main.invokeFramework(Main.java:653)
09:36:23 [2021-06-15T13:36:23.822Z] 	at org.eclipse.equinox.launcher.Main.basicRun(Main.java:590)
09:36:23 [2021-06-15T13:36:23.822Z] 	at org.eclipse.equinox.launcher.Main.run(Main.java:1461)
09:36:23 [2021-06-15T13:36:23.822Z] 	at org.eclipse.equinox.launcher.Main.main(Main.java:1434)
09:36:23 [2021-06-15T13:36:23.822Z] Caused by: java.lang.ClassNotFoundException: org.junit.runners.model.RunnerBuilder cannot be found by org.eclipse.tycho.surefire.osgibooter_2.2.0
09:36:23 [2021-06-15T13:36:23.822Z] 	at org.eclipse.osgi.internal.loader.BundleLoader.findClass(BundleLoader.java:516)
09:36:23 [2021-06-15T13:36:23.822Z] 	at org.eclipse.osgi.internal.loader.ModuleClassLoader.loadClass(ModuleClassLoader.java:171)
09:36:23 [2021-06-15T13:36:23.822Z] 	at java.base/java.lang.ClassLoader.loadClass(ClassLoader.java:522)
09:36:23 [2021-06-15T13:36:23.822Z] 	... 31 more
09:36:23 [2021-06-15T13:36:23.822Z] 
09:36:23 [2021-06-15T13:36:23.822Z] Jun 15, 2021 1:36:23 PM org.junit.platform.launcher.core.DefaultLauncher handleThrowable
09:36:23 [2021-06-15T13:36:23.822Z] WARNING: TestEngine with ID 'junit-vintage' failed to discover tests
09:36:23 [2021-06-15T13:36:23.822Z] java.lang.NoClassDefFoundError: org/junit/runners/model/RunnerBuilder
09:36:23 [2021-06-15T13:36:23.822Z] 	at org.junit.vintage.engine.discovery.VintageDiscoverer.<init>(VintageDiscoverer.java:48)
09:36:23 [2021-06-15T13:36:23.822Z] 	at org.junit.vintage.engine.VintageTestEngine.discover(VintageTestEngine.java:65)
09:36:23 [2021-06-15T13:36:23.822Z] 	at org.junit.platform.launcher.core.DefaultLauncher.discoverEngineRoot(DefaultLauncher.java:130)
09:36:23 [2021-06-15T13:36:23.822Z] 	at org.junit.platform.launcher.core.DefaultLauncher.discoverRoot(DefaultLauncher.java:117)
09:36:23 [2021-06-15T13:36:23.823Z] 	at org.junit.platform.launcher.core.DefaultLauncher.discover(DefaultLauncher.java:82)
09:36:23 [2021-06-15T13:36:23.823Z] 	at org.apache.maven.surefire.junitplatform.TestPlanScannerFilter.accept(TestPlanScannerFilter.java:56)
09:36:23 [2021-06-15T13:36:23.823Z] 	at org.apache.maven.surefire.util.DefaultScanResult.applyFilter(DefaultScanResult.java:102)
09:36:23 [2021-06-15T13:36:23.823Z] 	at org.apache.maven.surefire.junitplatform.JUnitPlatformProvider.scanClasspath(JUnitPlatformProvider.java:143)
09:36:23 [2021-06-15T13:36:23.823Z] 	at org.apache.maven.surefire.junitplatform.JUnitPlatformProvider.invoke(JUnitPlatformProvider.java:124)
09:36:23 [2021-06-15T13:36:23.823Z] 	at java.base/jdk.internal.reflect.NativeMethodAccessorImpl.invoke0(Native Method)
09:36:23 [2021-06-15T13:36:23.823Z] 	at java.base/jdk.internal.reflect.NativeMethodAccessorImpl.invoke(NativeMethodAccessorImpl.java:64)
09:36:23 [2021-06-15T13:36:23.823Z] 	at java.base/jdk.internal.reflect.DelegatingMethodAccessorImpl.invoke(DelegatingMethodAccessorImpl.java:43)
09:36:23 [2021-06-15T13:36:23.823Z] 	at java.base/java.lang.reflect.Method.invoke(Method.java:564)
09:36:23 [2021-06-15T13:36:23.823Z] 	at org.apache.maven.surefire.util.ReflectionUtils.invokeMethodWithArray2(ReflectionUtils.java:206)
09:36:23 [2021-06-15T13:36:23.823Z] 	at org.apache.maven.surefire.booter.ProviderFactory$ProviderProxy.invoke(ProviderFactory.java:161)
09:36:23 [2021-06-15T13:36:23.823Z] 	at org.apache.maven.surefire.booter.ProviderFactory.invokeProvider(ProviderFactory.java:84)
09:36:23 [2021-06-15T13:36:23.823Z] 	at org.eclipse.tycho.surefire.osgibooter.OsgiSurefireBooter.run(OsgiSurefireBooter.java:116)
09:36:23 [2021-06-15T13:36:23.823Z] 	at org.eclipse.tycho.surefire.osgibooter.HeadlessTestApplication.start(HeadlessTestApplication.java:23)
09:36:23 [2021-06-15T13:36:23.823Z] 	at org.eclipse.equinox.internal.app.EclipseAppHandle.run(EclipseAppHandle.java:203)
09:36:23 [2021-06-15T13:36:23.823Z] 	at org.eclipse.core.runtime.internal.adaptor.EclipseAppLauncher.runApplication(EclipseAppLauncher.java:134)
09:36:23 [2021-06-15T13:36:23.823Z] 	at org.eclipse.core.runtime.internal.adaptor.EclipseAppLauncher.start(EclipseAppLauncher.java:104)
09:36:23 [2021-06-15T13:36:23.823Z] 	at org.eclipse.core.runtime.adaptor.EclipseStarter.run(EclipseStarter.java:401)
09:36:23 [2021-06-15T13:36:23.823Z] 	at org.eclipse.core.runtime.adaptor.EclipseStarter.run(EclipseStarter.java:255)
09:36:23 [2021-06-15T13:36:23.823Z] 	at java.base/jdk.internal.reflect.NativeMethodAccessorImpl.invoke0(Native Method)
09:36:23 [2021-06-15T13:36:23.823Z] 	at java.base/jdk.internal.reflect.NativeMethodAccessorImpl.invoke(NativeMethodAccessorImpl.java:64)
09:36:23 [2021-06-15T13:36:23.823Z] 	at java.base/jdk.internal.reflect.DelegatingMethodAccessorImpl.invoke(DelegatingMethodAccessorImpl.java:43)
09:36:23 [2021-06-15T13:36:23.823Z] 	at java.base/java.lang.reflect.Method.invoke(Method.java:564)
09:36:23 [2021-06-15T13:36:23.823Z] 	at org.eclipse.equinox.launcher.Main.invokeFramework(Main.java:653)
09:36:23 [2021-06-15T13:36:23.823Z] 	at org.eclipse.equinox.launcher.Main.basicRun(Main.java:590)
09:36:23 [2021-06-15T13:36:23.823Z] 	at org.eclipse.equinox.launcher.Main.run(Main.java:1461)
09:36:23 [2021-06-15T13:36:23.823Z] 	at org.eclipse.equinox.launcher.Main.main(Main.java:1434)
09:36:23 [2021-06-15T13:36:23.823Z] Caused by: java.lang.ClassNotFoundException: org.junit.runners.model.RunnerBuilder cannot be found by org.eclipse.tycho.surefire.osgibooter_2.2.0
09:36:23 [2021-06-15T13:36:23.823Z] 	at org.eclipse.osgi.internal.loader.BundleLoader.findClass(BundleLoader.java:516)
09:36:23 [2021-06-15T13:36:23.823Z] 	at org.eclipse.osgi.internal.loader.ModuleClassLoader.loadClass(ModuleClassLoader.java:171)
09:36:23 [2021-06-15T13:36:23.823Z] 	at java.base/java.lang.ClassLoader.loadClass(ClassLoader.java:522)
09:36:23 [2021-06-15T13:36:23.823Z] 	... 31 more
09:36:23 [2021-06-15T13:36:23.823Z] 
09:36:23 [2021-06-15T13:36:23.823Z] Jun 15, 2021 1:36:23 PM org.junit.platform.launcher.core.DefaultLauncher handleThrowable
09:36:23 [2021-06-15T13:36:23.823Z] WARNING: TestEngine with ID 'junit-vintage' failed to discover tests
09:36:23 [2021-06-15T13:36:23.823Z] java.lang.NoClassDefFoundError: org/junit/runners/model/RunnerBuilder
09:36:23 [2021-06-15T13:36:23.823Z] 	at org.junit.vintage.engine.discovery.VintageDiscoverer.<init>(VintageDiscoverer.java:48)
09:36:23 [2021-06-15T13:36:23.823Z] 	at org.junit.vintage.engine.VintageTestEngine.discover(VintageTestEngine.java:65)
09:36:23 [2021-06-15T13:36:23.823Z] 	at org.junit.platform.launcher.core.DefaultLauncher.discoverEngineRoot(DefaultLauncher.java:130)
09:36:23 [2021-06-15T13:36:23.823Z] 	at org.junit.platform.launcher.core.DefaultLauncher.discoverRoot(DefaultLauncher.java:117)
09:36:23 [2021-06-15T13:36:23.823Z] 	at org.junit.platform.launcher.core.DefaultLauncher.execute(DefaultLauncher.java:90)
09:36:23 [2021-06-15T13:36:23.823Z] 	at org.apache.maven.surefire.junitplatform.JUnitPlatformProvider.invokeAllTests(JUnitPlatformProvider.java:150)
09:36:23 [2021-06-15T13:36:23.823Z] 	at org.apache.maven.surefire.junitplatform.JUnitPlatformProvider.invoke(JUnitPlatformProvider.java:124)
09:36:23 [2021-06-15T13:36:23.823Z] 	at java.base/jdk.internal.reflect.NativeMethodAccessorImpl.invoke0(Native Method)
09:36:23 [2021-06-15T13:36:23.823Z] 	at java.base/jdk.internal.reflect.NativeMethodAccessorImpl.invoke(NativeMethodAccessorImpl.java:64)
09:36:23 [2021-06-15T13:36:23.823Z] 	at java.base/jdk.internal.reflect.DelegatingMethodAccessorImpl.invoke(DelegatingMethodAccessorImpl.java:43)
09:36:23 [2021-06-15T13:36:23.823Z] 	at java.base/java.lang.reflect.Method.invoke(Method.java:564)
09:36:23 [2021-06-15T13:36:23.823Z] 	at org.apache.maven.surefire.util.ReflectionUtils.invokeMethodWithArray2(ReflectionUtils.java:206)
09:36:23 [2021-06-15T13:36:23.823Z] 	at org.apache.maven.surefire.booter.ProviderFactory$ProviderProxy.invoke(ProviderFactory.java:161)
09:36:23 [2021-06-15T13:36:23.823Z] 	at org.apache.maven.surefire.booter.ProviderFactory.invokeProvider(ProviderFactory.java:84)
09:36:23 [2021-06-15T13:36:23.823Z] 	at org.eclipse.tycho.surefire.osgibooter.OsgiSurefireBooter.run(OsgiSurefireBooter.java:116)
09:36:23 [2021-06-15T13:36:23.823Z] 	at org.eclipse.tycho.surefire.osgibooter.HeadlessTestApplication.start(HeadlessTestApplication.java:23)
09:36:23 [2021-06-15T13:36:23.823Z] 	at org.eclipse.equinox.internal.app.EclipseAppHandle.run(EclipseAppHandle.java:203)
09:36:23 [2021-06-15T13:36:23.823Z] 	at org.eclipse.core.runtime.internal.adaptor.EclipseAppLauncher.runApplication(EclipseAppLauncher.java:134)
09:36:23 [2021-06-15T13:36:23.823Z] 	at org.eclipse.core.runtime.internal.adaptor.EclipseAppLauncher.start(EclipseAppLauncher.java:104)
09:36:23 [2021-06-15T13:36:23.823Z] 	at org.eclipse.core.runtime.adaptor.EclipseStarter.run(EclipseStarter.java:401)
09:36:23 [2021-06-15T13:36:23.823Z] 	at org.eclipse.core.runtime.adaptor.EclipseStarter.run(EclipseStarter.java:255)
09:36:23 [2021-06-15T13:36:23.823Z] 	at java.base/jdk.internal.reflect.NativeMethodAccessorImpl.invoke0(Native Method)
09:36:23 [2021-06-15T13:36:23.823Z] 	at java.base/jdk.internal.reflect.NativeMethodAccessorImpl.invoke(NativeMethodAccessorImpl.java:64)
09:36:23 [2021-06-15T13:36:23.823Z] 	at java.base/jdk.internal.reflect.DelegatingMethodAccessorImpl.invoke(DelegatingMethodAccessorImpl.java:43)
09:36:23 [2021-06-15T13:36:23.823Z] 	at java.base/java.lang.reflect.Method.invoke(Method.java:564)
09:36:23 [2021-06-15T13:36:23.823Z] 	at org.eclipse.equinox.launcher.Main.invokeFramework(Main.java:653)
09:36:23 [2021-06-15T13:36:23.823Z] 	at org.eclipse.equinox.launcher.Main.basicRun(Main.java:590)
09:36:23 [2021-06-15T13:36:23.823Z] 	at org.eclipse.equinox.launcher.Main.run(Main.java:1461)
09:36:23 [2021-06-15T13:36:23.823Z] 	at org.eclipse.equinox.launcher.Main.main(Main.java:1434)
09:36:23 [2021-06-15T13:36:23.823Z] Caused by: java.lang.ClassNotFoundException: org.junit.runners.model.RunnerBuilder cannot be found by org.eclipse.tycho.surefire.osgibooter_2.2.0
09:36:23 [2021-06-15T13:36:23.823Z] 	at org.eclipse.osgi.internal.loader.BundleLoader.findClass(BundleLoader.java:516)
09:36:23 [2021-06-15T13:36:23.823Z] 	at org.eclipse.osgi.internal.loader.ModuleClassLoader.loadClass(ModuleClassLoader.java:171)
09:36:23 [2021-06-15T13:36:23.823Z] 	at java.base/java.lang.ClassLoader.loadClass(ClassLoader.java:522)
09:36:23 [2021-06-15T13:36:23.823Z] 	... 29 more
09:36:23 [2021-06-15T13:36:23.823Z] 
09:36:23 [2021-06-15T13:36:23.824Z] Running org.eclipse.ease.lang.javascript.JavaScriptCompletionContextTest
09:36:24 [2021-06-15T13:36:24.080Z] Tests run: 8, Failures: 0, Errors: 0, Skipped: 0, Time elapsed: 0.514 s - in org.eclipse.ease.lang.javascript.JavaScriptCompletionContextTest
09:36:24 [2021-06-15T13:36:24.080Z] verifyStaticClassTypes  Time elapsed: 0.137 s
09:36:24 [2021-06-15T13:36:24.080Z] verifyClassInstanceTypes  Time elapsed: 0.059 s
09:36:24 [2021-06-15T13:36:24.080Z] verifyTypesForScriptEngine  Time elapsed: 0.308 s
09:36:24 [2021-06-15T13:36:24.080Z] verifyPackageTypes  Time elapsed: 0.001 s
09:36:24 [2021-06-15T13:36:24.080Z] definedVariableTypes  Time elapsed: 0.001 s
09:36:24 [2021-06-15T13:36:24.080Z] verifyStringLiteralTypes  Time elapsed: 0 s
09:36:24 [2021-06-15T13:36:24.080Z] verifyUnknownTypes  Time elapsed: 0 s
09:36:24 [2021-06-15T13:36:24.080Z] verifyNoneTypes  Time elapsed: 0 s
09:36:24 [2021-06-15T13:36:24.080Z] Running org.eclipse.ease.lang.javascript.JavaScriptCodeFactoryTest
09:36:24 [2021-06-15T13:36:24.080Z] Tests run: 1, Failures: 0, Errors: 0, Skipped: 0, Time elapsed: 0.001 s - in org.eclipse.ease.lang.javascript.JavaScriptCodeFactoryTest
09:36:24 [2021-06-15T13:36:24.080Z] testCommentCreator  Time elapsed: 0.001 s
09:36:24 [2021-06-15T13:36:24.080Z] 
09:36:24 [2021-06-15T13:36:24.080Z] Results:
09:36:24 [2021-06-15T13:36:24.080Z] 
09:36:24 [2021-06-15T13:36:24.080Z] Tests run: 9, Failures: 0, Errors: 0, Skipped: 0
09:36:24 [2021-06-15T13:36:24.080Z] 
09:36:25 [2021-06-15T13:36:25.008Z] [INFO] All tests passed!
09:36:25 [2021-06-15T13:36:25.008Z] [INFO] 
09:36:25 [2021-06-15T13:36:25.008Z] [INFO] --- maven-pmd-plugin:3.14.0:pmd (pmd-integration) @ org.eclipse.ease.lang.javascript.test ---
09:36:25 [2021-06-15T13:36:25.008Z] [INFO] 
09:36:25 [2021-06-15T13:36:25.008Z] [INFO] --- maven-pmd-plugin:3.14.0:cpd (pmd-integration) @ org.eclipse.ease.lang.javascript.test ---
09:36:25 [2021-06-15T13:36:25.008Z] [INFO] 
09:36:25 [2021-06-15T13:36:25.008Z] [INFO] --- spotbugs-maven-plugin:4.1.4:spotbugs (spotbugs-integration) @ org.eclipse.ease.lang.javascript.test ---
09:36:25 [2021-06-15T13:36:25.008Z] [INFO] Fork Value is false
09:36:25 [2021-06-15T13:36:25.264Z]      [java] JVM args ignored when same JVM is used.
09:36:27 [2021-06-15T13:36:27.857Z] [INFO] Done SpotBugs Analysis....
09:36:27 [2021-06-15T13:36:27.857Z] [INFO] 
09:36:27 [2021-06-15T13:36:27.857Z] [INFO] --- maven-checkstyle-plugin:3.1.1:check (checkstyle-integration) @ org.eclipse.ease.lang.javascript.test ---
09:36:27 [2021-06-15T13:36:27.857Z] [INFO] You have 0 Checkstyle violations.
09:36:27 [2021-06-15T13:36:27.857Z] [INFO] 
09:36:27 [2021-06-15T13:36:27.857Z] [INFO] --- maven-install-plugin:2.3.1:install (default-install) @ org.eclipse.ease.lang.javascript.test ---
09:36:27 [2021-06-15T13:36:27.857Z] [INFO] Installing /home/jenkins/agent/workspace/ease.verify.core.target.2019-06/tests/org.eclipse.ease.lang.javascript.test/target/org.eclipse.ease.lang.javascript.test-0.8.0-SNAPSHOT.jar to /home/jenkins/.m2/repository/org/eclipse/ease/org.eclipse.ease.lang.javascript.test/0.8.0-SNAPSHOT/org.eclipse.ease.lang.javascript.test-0.8.0-SNAPSHOT.jar
09:36:27 [2021-06-15T13:36:27.857Z] [INFO] Installing /home/jenkins/agent/workspace/ease.verify.core.target.2019-06/tests/org.eclipse.ease.lang.javascript.test/pom.xml to /home/jenkins/.m2/repository/org/eclipse/ease/org.eclipse.ease.lang.javascript.test/0.8.0-SNAPSHOT/org.eclipse.ease.lang.javascript.test-0.8.0-SNAPSHOT.pom
09:36:27 [2021-06-15T13:36:27.857Z] [INFO] Installing /home/jenkins/agent/workspace/ease.verify.core.target.2019-06/tests/org.eclipse.ease.lang.javascript.test/target/p2content.xml to /home/jenkins/.m2/repository/org/eclipse/ease/org.eclipse.ease.lang.javascript.test/0.8.0-SNAPSHOT/org.eclipse.ease.lang.javascript.test-0.8.0-SNAPSHOT-p2metadata.xml
09:36:27 [2021-06-15T13:36:27.857Z] [INFO] Installing /home/jenkins/agent/workspace/ease.verify.core.target.2019-06/tests/org.eclipse.ease.lang.javascript.test/target/p2artifacts.xml to /home/jenkins/.m2/repository/org/eclipse/ease/org.eclipse.ease.lang.javascript.test/0.8.0-SNAPSHOT/org.eclipse.ease.lang.javascript.test-0.8.0-SNAPSHOT-p2artifacts.xml
09:36:27 [2021-06-15T13:36:27.857Z] [INFO] 
09:36:27 [2021-06-15T13:36:27.857Z] [INFO] --- tycho-p2-plugin:2.2.0:update-local-index (default-update-local-index) @ org.eclipse.ease.lang.javascript.test ---
09:36:27 [2021-06-15T13:36:27.857Z] [INFO] 
09:36:27 [2021-06-15T13:36:27.857Z] [INFO] ---------< org.eclipse.ease:org.eclipse.ease.lang.python.test >---------
09:36:27 [2021-06-15T13:36:27.857Z] [INFO] Building org.eclipse.ease.lang.python.test 0.8.0-SNAPSHOT        [41/48]
09:36:27 [2021-06-15T13:36:27.857Z] [INFO] ------------------------[ eclipse-test-plugin ]-------------------------
09:36:27 [2021-06-15T13:36:27.857Z] [INFO] 
09:36:27 [2021-06-15T13:36:27.857Z] [INFO] --- maven-clean-plugin:2.5:clean (default-clean) @ org.eclipse.ease.lang.python.test ---
09:36:27 [2021-06-15T13:36:27.857Z] [INFO] 
09:36:27 [2021-06-15T13:36:27.857Z] [INFO] --- tycho-packaging-plugin:2.2.0:build-qualifier (default-build-qualifier) @ org.eclipse.ease.lang.python.test ---
09:36:27 [2021-06-15T13:36:27.857Z] [INFO] The project's OSGi version is 0.8.0.I202106150726
09:36:27 [2021-06-15T13:36:27.857Z] [INFO] 
09:36:27 [2021-06-15T13:36:27.857Z] [INFO] --- tycho-packaging-plugin:2.2.0:validate-id (default-validate-id) @ org.eclipse.ease.lang.python.test ---
09:36:27 [2021-06-15T13:36:27.857Z] [INFO] 
09:36:27 [2021-06-15T13:36:27.857Z] [INFO] --- tycho-packaging-plugin:2.2.0:validate-version (default-validate-version) @ org.eclipse.ease.lang.python.test ---
09:36:27 [2021-06-15T13:36:27.858Z] [INFO] 
09:36:27 [2021-06-15T13:36:27.858Z] [INFO] --- maven-resources-plugin:2.4.3:resources (default-resources) @ org.eclipse.ease.lang.python.test ---
09:36:27 [2021-06-15T13:36:27.858Z] [INFO] Using 'UTF-8' encoding to copy filtered resources.
09:36:27 [2021-06-15T13:36:27.858Z] [INFO] skip non existing resourceDirectory /home/jenkins/agent/workspace/ease.verify.core.target.2019-06/tests/org.eclipse.ease.lang.python.test/src/main/resources
09:36:27 [2021-06-15T13:36:27.858Z] [INFO] 
09:36:27 [2021-06-15T13:36:27.858Z] [INFO] --- tycho-compiler-plugin:2.2.0:compile (default-compile) @ org.eclipse.ease.lang.python.test ---
09:36:27 [2021-06-15T13:36:27.858Z] [INFO] Compiling 1 source file to /home/jenkins/agent/workspace/ease.verify.core.target.2019-06/tests/org.eclipse.ease.lang.python.test/target/classes
09:36:27 [2021-06-15T13:36:27.858Z] [INFO] 
09:36:27 [2021-06-15T13:36:27.858Z] [INFO] --- maven-resources-plugin:2.4.3:testResources (default-testResources) @ org.eclipse.ease.lang.python.test ---
09:36:27 [2021-06-15T13:36:27.858Z] [INFO] Using 'UTF-8' encoding to copy filtered resources.
09:36:27 [2021-06-15T13:36:27.858Z] [INFO] skip non existing resourceDirectory /home/jenkins/agent/workspace/ease.verify.core.target.2019-06/tests/org.eclipse.ease.lang.python.test/src/test/resources
09:36:27 [2021-06-15T13:36:27.858Z] [INFO] 
09:36:27 [2021-06-15T13:36:27.858Z] [INFO] --- target-platform-configuration:2.2.0:target-platform (default-target-platform) @ org.eclipse.ease.lang.python.test ---
09:36:27 [2021-06-15T13:36:27.858Z] [INFO] 
09:36:27 [2021-06-15T13:36:27.858Z] [INFO] --- tycho-packaging-plugin:2.2.0:package-plugin (default-package-plugin) @ org.eclipse.ease.lang.python.test ---
09:36:27 [2021-06-15T13:36:27.858Z] [INFO] Building jar: /home/jenkins/agent/workspace/ease.verify.core.target.2019-06/tests/org.eclipse.ease.lang.python.test/target/org.eclipse.ease.lang.python.test-0.8.0-SNAPSHOT.jar
09:36:27 [2021-06-15T13:36:27.858Z] [INFO] 
09:36:27 [2021-06-15T13:36:27.858Z] [INFO] --- tycho-p2-plugin:2.2.0:p2-metadata-default (default-p2-metadata-default) @ org.eclipse.ease.lang.python.test ---
09:36:27 [2021-06-15T13:36:27.858Z] [INFO] 
09:36:27 [2021-06-15T13:36:27.858Z] [INFO] --- jacoco-maven-plugin:0.8.6:prepare-agent (jacoco-initialize) @ org.eclipse.ease.lang.python.test ---
09:36:27 [2021-06-15T13:36:27.858Z] [INFO] tycho.testArgLine set to -javaagent:/home/jenkins/.m2/repository/org/jacoco/org.jacoco.agent/0.8.6/org.jacoco.agent-0.8.6-runtime.jar=destfile=/home/jenkins/agent/workspace/ease.verify.core.target.2019-06/tests/org.eclipse.ease.lang.python.test/target/jacoco.exec,output=file
09:36:27 [2021-06-15T13:36:27.858Z] [INFO] 
09:36:27 [2021-06-15T13:36:27.858Z] [INFO] --- tycho-surefire-plugin:2.2.0:test (default-test) @ org.eclipse.ease.lang.python.test ---
09:36:27 [2021-06-15T13:36:27.858Z] [INFO] Executing Test Runtime with timeout 0, logs (if any) will be placed at: /home/jenkins/agent/workspace/ease.verify.core.target.2019-06/tests/org.eclipse.ease.lang.python.test/target/work/data/.metadata/.log
09:36:27 [2021-06-15T13:36:27.858Z] [INFO] Command line:
09:36:27 [2021-06-15T13:36:27.858Z] 	[/opt/tools/java/openjdk/jdk-15/15.0.2+7/bin/java, -Dosgi.noShutdown=false, -Dosgi.os=linux, -Dosgi.ws=gtk, -Dosgi.arch=x86_64, -javaagent:/home/jenkins/.m2/repository/org/jacoco/org.jacoco.agent/0.8.6/org.jacoco.agent-0.8.6-runtime.jar=destfile=/home/jenkins/agent/workspace/ease.verify.core.target.2019-06/tests/org.eclipse.ease.lang.python.test/target/jacoco.exec,output=file, -Dosgi.clean=true, -jar, /home/jenkins/.m2/repository/p2/osgi/bundle/org.eclipse.equinox.launcher/1.6.0.v20200915-1508/org.eclipse.equinox.launcher-1.6.0.v20200915-1508.jar, -data, /home/jenkins/agent/workspace/ease.verify.core.target.2019-06/tests/org.eclipse.ease.lang.python.test/target/work/data, -install, /home/jenkins/agent/workspace/ease.verify.core.target.2019-06/tests/org.eclipse.ease.lang.python.test/target/work, -configuration, /home/jenkins/agent/workspace/ease.verify.core.target.2019-06/tests/org.eclipse.ease.lang.python.test/target/work/configuration, -application, org.eclipse.tycho.surefire.osgibooter.headlesstest, -testproperties, /home/jenkins/agent/workspace/ease.verify.core.target.2019-06/tests/org.eclipse.ease.lang.python.test/target/surefire.properties]
09:36:27 [2021-06-15T13:36:27.858Z] Picked up JAVA_TOOL_OPTIONS: -Dmaven.ext.class.path="/home/jenkins/agent/workspace/ease.verify.core.target.2019-06@tmp/withMavend6334c6d/pipeline-maven-spy.jar" -Dorg.jenkinsci.plugins.pipeline.maven.reportsFolder="/home/jenkins/agent/workspace/ease.verify.core.target.2019-06@tmp/withMavend6334c6d" 
09:36:30 [2021-06-15T13:36:30.419Z] Jun 15, 2021 1:36:30 PM org.junit.platform.launcher.core.DefaultLauncher handleThrowable
09:36:30 [2021-06-15T13:36:30.419Z] WARNING: TestEngine with ID 'junit-vintage' failed to discover tests
09:36:30 [2021-06-15T13:36:30.419Z] java.lang.NoClassDefFoundError: org/junit/runners/model/RunnerBuilder
09:36:30 [2021-06-15T13:36:30.419Z] 	at org.junit.vintage.engine.discovery.VintageDiscoverer.<init>(VintageDiscoverer.java:48)
09:36:30 [2021-06-15T13:36:30.419Z] 	at org.junit.vintage.engine.VintageTestEngine.discover(VintageTestEngine.java:65)
09:36:30 [2021-06-15T13:36:30.419Z] 	at org.junit.platform.launcher.core.DefaultLauncher.discoverEngineRoot(DefaultLauncher.java:130)
09:36:30 [2021-06-15T13:36:30.419Z] 	at org.junit.platform.launcher.core.DefaultLauncher.discoverRoot(DefaultLauncher.java:117)
09:36:30 [2021-06-15T13:36:30.419Z] 	at org.junit.platform.launcher.core.DefaultLauncher.discover(DefaultLauncher.java:82)
09:36:30 [2021-06-15T13:36:30.419Z] 	at org.apache.maven.surefire.junitplatform.TestPlanScannerFilter.accept(TestPlanScannerFilter.java:56)
09:36:30 [2021-06-15T13:36:30.420Z] 	at org.apache.maven.surefire.util.DefaultScanResult.applyFilter(DefaultScanResult.java:102)
09:36:30 [2021-06-15T13:36:30.420Z] 	at org.apache.maven.surefire.junitplatform.JUnitPlatformProvider.scanClasspath(JUnitPlatformProvider.java:143)
09:36:30 [2021-06-15T13:36:30.420Z] 	at org.apache.maven.surefire.junitplatform.JUnitPlatformProvider.invoke(JUnitPlatformProvider.java:124)
09:36:30 [2021-06-15T13:36:30.420Z] 	at java.base/jdk.internal.reflect.NativeMethodAccessorImpl.invoke0(Native Method)
09:36:30 [2021-06-15T13:36:30.420Z] 	at java.base/jdk.internal.reflect.NativeMethodAccessorImpl.invoke(NativeMethodAccessorImpl.java:64)
09:36:30 [2021-06-15T13:36:30.420Z] 	at java.base/jdk.internal.reflect.DelegatingMethodAccessorImpl.invoke(DelegatingMethodAccessorImpl.java:43)
09:36:30 [2021-06-15T13:36:30.420Z] 	at java.base/java.lang.reflect.Method.invoke(Method.java:564)
09:36:30 [2021-06-15T13:36:30.420Z] 	at org.apache.maven.surefire.util.ReflectionUtils.invokeMethodWithArray2(ReflectionUtils.java:206)
09:36:30 [2021-06-15T13:36:30.420Z] 	at org.apache.maven.surefire.booter.ProviderFactory$ProviderProxy.invoke(ProviderFactory.java:161)
09:36:30 [2021-06-15T13:36:30.420Z] 	at org.apache.maven.surefire.booter.ProviderFactory.invokeProvider(ProviderFactory.java:84)
09:36:30 [2021-06-15T13:36:30.420Z] 	at org.eclipse.tycho.surefire.osgibooter.OsgiSurefireBooter.run(OsgiSurefireBooter.java:116)
09:36:30 [2021-06-15T13:36:30.420Z] 	at org.eclipse.tycho.surefire.osgibooter.HeadlessTestApplication.start(HeadlessTestApplication.java:23)
09:36:30 [2021-06-15T13:36:30.420Z] 	at org.eclipse.equinox.internal.app.EclipseAppHandle.run(EclipseAppHandle.java:203)
09:36:30 [2021-06-15T13:36:30.420Z] 	at org.eclipse.core.runtime.internal.adaptor.EclipseAppLauncher.runApplication(EclipseAppLauncher.java:134)
09:36:30 [2021-06-15T13:36:30.420Z] 	at org.eclipse.core.runtime.internal.adaptor.EclipseAppLauncher.start(EclipseAppLauncher.java:104)
09:36:30 [2021-06-15T13:36:30.420Z] 	at org.eclipse.core.runtime.adaptor.EclipseStarter.run(EclipseStarter.java:401)
09:36:30 [2021-06-15T13:36:30.420Z] 	at org.eclipse.core.runtime.adaptor.EclipseStarter.run(EclipseStarter.java:255)
09:36:30 [2021-06-15T13:36:30.420Z] 	at java.base/jdk.internal.reflect.NativeMethodAccessorImpl.invoke0(Native Method)
09:36:30 [2021-06-15T13:36:30.420Z] 	at java.base/jdk.internal.reflect.NativeMethodAccessorImpl.invoke(NativeMethodAccessorImpl.java:64)
09:36:30 [2021-06-15T13:36:30.420Z] 	at java.base/jdk.internal.reflect.DelegatingMethodAccessorImpl.invoke(DelegatingMethodAccessorImpl.java:43)
09:36:30 [2021-06-15T13:36:30.420Z] 	at java.base/java.lang.reflect.Method.invoke(Method.java:564)
09:36:30 [2021-06-15T13:36:30.420Z] 	at org.eclipse.equinox.launcher.Main.invokeFramework(Main.java:653)
09:36:30 [2021-06-15T13:36:30.420Z] 	at org.eclipse.equinox.launcher.Main.basicRun(Main.java:590)
09:36:30 [2021-06-15T13:36:30.420Z] 	at org.eclipse.equinox.launcher.Main.run(Main.java:1461)
09:36:30 [2021-06-15T13:36:30.420Z] 	at org.eclipse.equinox.launcher.Main.main(Main.java:1434)
09:36:30 [2021-06-15T13:36:30.420Z] Caused by: java.lang.ClassNotFoundException: org.junit.runners.model.RunnerBuilder cannot be found by org.eclipse.tycho.surefire.osgibooter_2.2.0
09:36:30 [2021-06-15T13:36:30.420Z] 	at org.eclipse.osgi.internal.loader.BundleLoader.findClass(BundleLoader.java:516)
09:36:30 [2021-06-15T13:36:30.420Z] 	at org.eclipse.osgi.internal.loader.ModuleClassLoader.loadClass(ModuleClassLoader.java:171)
09:36:30 [2021-06-15T13:36:30.420Z] 	at java.base/java.lang.ClassLoader.loadClass(ClassLoader.java:522)
09:36:30 [2021-06-15T13:36:30.420Z] 	... 31 more
09:36:30 [2021-06-15T13:36:30.420Z] 
09:36:30 [2021-06-15T13:36:30.420Z] Jun 15, 2021 1:36:30 PM org.junit.platform.launcher.core.DefaultLauncher handleThrowable
09:36:30 [2021-06-15T13:36:30.420Z] WARNING: TestEngine with ID 'junit-vintage' failed to discover tests
09:36:30 [2021-06-15T13:36:30.420Z] java.lang.NoClassDefFoundError: org/junit/runners/model/RunnerBuilder
09:36:30 [2021-06-15T13:36:30.420Z] 	at org.junit.vintage.engine.discovery.VintageDiscoverer.<init>(VintageDiscoverer.java:48)
09:36:30 [2021-06-15T13:36:30.420Z] 	at org.junit.vintage.engine.VintageTestEngine.discover(VintageTestEngine.java:65)
09:36:30 [2021-06-15T13:36:30.420Z] 	at org.junit.platform.launcher.core.DefaultLauncher.discoverEngineRoot(DefaultLauncher.java:130)
09:36:30 [2021-06-15T13:36:30.420Z] 	at org.junit.platform.launcher.core.DefaultLauncher.discoverRoot(DefaultLauncher.java:117)
09:36:30 [2021-06-15T13:36:30.420Z] 	at org.junit.platform.launcher.core.DefaultLauncher.execute(DefaultLauncher.java:90)
09:36:30 [2021-06-15T13:36:30.420Z] 	at org.apache.maven.surefire.junitplatform.JUnitPlatformProvider.invokeAllTests(JUnitPlatformProvider.java:150)
09:36:30 [2021-06-15T13:36:30.420Z] 	at org.apache.maven.surefire.junitplatform.JUnitPlatformProvider.invoke(JUnitPlatformProvider.java:124)
09:36:30 [2021-06-15T13:36:30.420Z] 	at java.base/jdk.internal.reflect.NativeMethodAccessorImpl.invoke0(Native Method)
09:36:30 [2021-06-15T13:36:30.420Z] 	at java.base/jdk.internal.reflect.NativeMethodAccessorImpl.invoke(NativeMethodAccessorImpl.java:64)
09:36:30 [2021-06-15T13:36:30.420Z] 	at java.base/jdk.internal.reflect.DelegatingMethodAccessorImpl.invoke(DelegatingMethodAccessorImpl.java:43)
09:36:30 [2021-06-15T13:36:30.420Z] 	at java.base/java.lang.reflect.Method.invoke(Method.java:564)
09:36:30 [2021-06-15T13:36:30.420Z] 	at org.apache.maven.surefire.util.ReflectionUtils.invokeMethodWithArray2(ReflectionUtils.java:206)
09:36:30 [2021-06-15T13:36:30.420Z] 	at org.apache.maven.surefire.booter.ProviderFactory$ProviderProxy.invoke(ProviderFactory.java:161)
09:36:30 [2021-06-15T13:36:30.420Z] 	at org.apache.maven.surefire.booter.ProviderFactory.invokeProvider(ProviderFactory.java:84)
09:36:30 [2021-06-15T13:36:30.420Z] 	at org.eclipse.tycho.surefire.osgibooter.OsgiSurefireBooter.run(OsgiSurefireBooter.java:116)
09:36:30 [2021-06-15T13:36:30.420Z] 	at org.eclipse.tycho.surefire.osgibooter.HeadlessTestApplication.start(HeadlessTestApplication.java:23)
09:36:30 [2021-06-15T13:36:30.420Z] 	at org.eclipse.equinox.internal.app.EclipseAppHandle.run(EclipseAppHandle.java:203)
09:36:30 [2021-06-15T13:36:30.420Z] 	at org.eclipse.core.runtime.internal.adaptor.EclipseAppLauncher.runApplication(EclipseAppLauncher.java:134)
09:36:30 [2021-06-15T13:36:30.420Z] 	at org.eclipse.core.runtime.internal.adaptor.EclipseAppLauncher.start(EclipseAppLauncher.java:104)
09:36:30 [2021-06-15T13:36:30.420Z] 	at org.eclipse.core.runtime.adaptor.EclipseStarter.run(EclipseStarter.java:401)
09:36:30 [2021-06-15T13:36:30.420Z] 	at org.eclipse.core.runtime.adaptor.EclipseStarter.run(EclipseStarter.java:255)
09:36:30 [2021-06-15T13:36:30.420Z] 	at java.base/jdk.internal.reflect.NativeMethodAccessorImpl.invoke0(Native Method)
09:36:30 [2021-06-15T13:36:30.420Z] 	at java.base/jdk.internal.reflect.NativeMethodAccessorImpl.invoke(NativeMethodAccessorImpl.java:64)
09:36:30 [2021-06-15T13:36:30.420Z] 	at java.base/jdk.internal.reflect.DelegatingMethodAccessorImpl.invoke(DelegatingMethodAccessorImpl.java:43)
09:36:30 [2021-06-15T13:36:30.420Z] 	at java.base/java.lang.reflect.Method.invoke(Method.java:564)
09:36:30 [2021-06-15T13:36:30.420Z] 	at org.eclipse.equinox.launcher.Main.invokeFramework(Main.java:653)
09:36:30 [2021-06-15T13:36:30.420Z] 	at org.eclipse.equinox.launcher.Main.basicRun(Main.java:590)
09:36:30 [2021-06-15T13:36:30.420Z] 	at org.eclipse.equinox.launcher.Main.run(Main.java:1461)
09:36:30 [2021-06-15T13:36:30.420Z] 	at org.eclipse.equinox.launcher.Main.main(Main.java:1434)
09:36:30 [2021-06-15T13:36:30.420Z] Caused by: java.lang.ClassNotFoundException: org.junit.runners.model.RunnerBuilder cannot be found by org.eclipse.tycho.surefire.osgibooter_2.2.0
09:36:30 [2021-06-15T13:36:30.420Z] 	at org.eclipse.osgi.internal.loader.BundleLoader.findClass(BundleLoader.java:516)
09:36:30 [2021-06-15T13:36:30.420Z] 	at org.eclipse.osgi.internal.loader.ModuleClassLoader.loadClass(ModuleClassLoader.java:171)
09:36:30 [2021-06-15T13:36:30.420Z] 	at java.base/java.lang.ClassLoader.loadClass(ClassLoader.java:522)
09:36:30 [2021-06-15T13:36:30.421Z] 	... 29 more
09:36:30 [2021-06-15T13:36:30.421Z] 
09:36:30 [2021-06-15T13:36:30.421Z] Running org.eclipse.ease.lang.python.PythonCodeFactoryTest
09:36:30 [2021-06-15T13:36:30.982Z] Tests run: 3, Failures: 0, Errors: 0, Skipped: 0, Time elapsed: 0.736 s - in org.eclipse.ease.lang.python.PythonCodeFactoryTest
09:36:30 [2021-06-15T13:36:30.982Z] createFunctionWrapper_creates_return_andParameters_for_Py4J  Time elapsed: 0.728 s
09:36:30 [2021-06-15T13:36:30.982Z] testCommentCreator  Time elapsed: 0.001 s
09:36:30 [2021-06-15T13:36:30.982Z] createFunctionWrapper_creates_void_return_types_for_Py4J  Time elapsed: 0.001 s
09:36:30 [2021-06-15T13:36:30.982Z] 
09:36:30 [2021-06-15T13:36:30.982Z] Results:
09:36:30 [2021-06-15T13:36:30.982Z] 
09:36:30 [2021-06-15T13:36:30.982Z] Tests run: 3, Failures: 0, Errors: 0, Skipped: 0
09:36:30 [2021-06-15T13:36:30.982Z] 
09:36:31 [2021-06-15T13:36:31.910Z] [INFO] All tests passed!
09:36:31 [2021-06-15T13:36:31.910Z] [INFO] 
09:36:31 [2021-06-15T13:36:31.910Z] [INFO] --- maven-pmd-plugin:3.14.0:pmd (pmd-integration) @ org.eclipse.ease.lang.python.test ---
09:36:32 [2021-06-15T13:36:32.166Z] [INFO] 
09:36:32 [2021-06-15T13:36:32.166Z] [INFO] --- maven-pmd-plugin:3.14.0:cpd (pmd-integration) @ org.eclipse.ease.lang.python.test ---
09:36:32 [2021-06-15T13:36:32.166Z] [INFO] 
09:36:32 [2021-06-15T13:36:32.166Z] [INFO] --- spotbugs-maven-plugin:4.1.4:spotbugs (spotbugs-integration) @ org.eclipse.ease.lang.python.test ---
09:36:32 [2021-06-15T13:36:32.166Z] [INFO] Fork Value is false
09:36:32 [2021-06-15T13:36:32.166Z]      [java] JVM args ignored when same JVM is used.
09:36:34 [2021-06-15T13:36:34.120Z] [INFO] Done SpotBugs Analysis....
09:36:34 [2021-06-15T13:36:34.120Z] [INFO] 
09:36:34 [2021-06-15T13:36:34.120Z] [INFO] --- maven-checkstyle-plugin:3.1.1:check (checkstyle-integration) @ org.eclipse.ease.lang.python.test ---
09:36:34 [2021-06-15T13:36:34.120Z] [INFO] You have 0 Checkstyle violations.
09:36:34 [2021-06-15T13:36:34.120Z] [INFO] 
09:36:34 [2021-06-15T13:36:34.120Z] [INFO] --- maven-install-plugin:2.3.1:install (default-install) @ org.eclipse.ease.lang.python.test ---
09:36:34 [2021-06-15T13:36:34.121Z] [INFO] Installing /home/jenkins/agent/workspace/ease.verify.core.target.2019-06/tests/org.eclipse.ease.lang.python.test/target/org.eclipse.ease.lang.python.test-0.8.0-SNAPSHOT.jar to /home/jenkins/.m2/repository/org/eclipse/ease/org.eclipse.ease.lang.python.test/0.8.0-SNAPSHOT/org.eclipse.ease.lang.python.test-0.8.0-SNAPSHOT.jar
09:36:34 [2021-06-15T13:36:34.121Z] [INFO] Installing /home/jenkins/agent/workspace/ease.verify.core.target.2019-06/tests/org.eclipse.ease.lang.python.test/pom.xml to /home/jenkins/.m2/repository/org/eclipse/ease/org.eclipse.ease.lang.python.test/0.8.0-SNAPSHOT/org.eclipse.ease.lang.python.test-0.8.0-SNAPSHOT.pom
09:36:34 [2021-06-15T13:36:34.121Z] [INFO] Installing /home/jenkins/agent/workspace/ease.verify.core.target.2019-06/tests/org.eclipse.ease.lang.python.test/target/p2content.xml to /home/jenkins/.m2/repository/org/eclipse/ease/org.eclipse.ease.lang.python.test/0.8.0-SNAPSHOT/org.eclipse.ease.lang.python.test-0.8.0-SNAPSHOT-p2metadata.xml
09:36:34 [2021-06-15T13:36:34.121Z] [INFO] Installing /home/jenkins/agent/workspace/ease.verify.core.target.2019-06/tests/org.eclipse.ease.lang.python.test/target/p2artifacts.xml to /home/jenkins/.m2/repository/org/eclipse/ease/org.eclipse.ease.lang.python.test/0.8.0-SNAPSHOT/org.eclipse.ease.lang.python.test-0.8.0-SNAPSHOT-p2artifacts.xml
09:36:34 [2021-06-15T13:36:34.121Z] [INFO] 
09:36:34 [2021-06-15T13:36:34.121Z] [INFO] --- tycho-p2-plugin:2.2.0:update-local-index (default-update-local-index) @ org.eclipse.ease.lang.python.test ---
09:36:34 [2021-06-15T13:36:34.121Z] [INFO] 
09:36:34 [2021-06-15T13:36:34.121Z] [INFO] -----< org.eclipse.ease:org.eclipse.ease.lang.python.jython.test >------
09:36:34 [2021-06-15T13:36:34.121Z] [INFO] Building org.eclipse.ease.lang.python.jython.test 0.8.0-SNAPSHOT [42/48]
09:36:34 [2021-06-15T13:36:34.121Z] [INFO] ------------------------[ eclipse-test-plugin ]-------------------------
09:36:34 [2021-06-15T13:36:34.121Z] [INFO] 
09:36:34 [2021-06-15T13:36:34.121Z] [INFO] --- maven-clean-plugin:2.5:clean (default-clean) @ org.eclipse.ease.lang.python.jython.test ---
09:36:34 [2021-06-15T13:36:34.121Z] [INFO] 
09:36:34 [2021-06-15T13:36:34.121Z] [INFO] --- tycho-packaging-plugin:2.2.0:build-qualifier (default-build-qualifier) @ org.eclipse.ease.lang.python.jython.test ---
09:36:34 [2021-06-15T13:36:34.121Z] [INFO] The project's OSGi version is 0.8.0.I202106150726
09:36:34 [2021-06-15T13:36:34.121Z] [INFO] 
09:36:34 [2021-06-15T13:36:34.121Z] [INFO] --- tycho-packaging-plugin:2.2.0:validate-id (default-validate-id) @ org.eclipse.ease.lang.python.jython.test ---
09:36:34 [2021-06-15T13:36:34.121Z] [INFO] 
09:36:34 [2021-06-15T13:36:34.121Z] [INFO] --- tycho-packaging-plugin:2.2.0:validate-version (default-validate-version) @ org.eclipse.ease.lang.python.jython.test ---
09:36:34 [2021-06-15T13:36:34.121Z] [INFO] 
09:36:34 [2021-06-15T13:36:34.121Z] [INFO] --- maven-resources-plugin:2.4.3:resources (default-resources) @ org.eclipse.ease.lang.python.jython.test ---
09:36:34 [2021-06-15T13:36:34.121Z] [INFO] Using 'UTF-8' encoding to copy filtered resources.
09:36:34 [2021-06-15T13:36:34.121Z] [INFO] skip non existing resourceDirectory /home/jenkins/agent/workspace/ease.verify.core.target.2019-06/tests/org.eclipse.ease.lang.python.jython.test/src/main/resources
09:36:34 [2021-06-15T13:36:34.121Z] [INFO] 
09:36:34 [2021-06-15T13:36:34.121Z] [INFO] --- tycho-compiler-plugin:2.2.0:compile (default-compile) @ org.eclipse.ease.lang.python.jython.test ---
09:36:34 [2021-06-15T13:36:34.121Z] [INFO] Compiling 1 source file to /home/jenkins/agent/workspace/ease.verify.core.target.2019-06/tests/org.eclipse.ease.lang.python.jython.test/target/classes
09:36:34 [2021-06-15T13:36:34.378Z] [INFO] 
09:36:34 [2021-06-15T13:36:34.378Z] [INFO] --- maven-resources-plugin:2.4.3:testResources (default-testResources) @ org.eclipse.ease.lang.python.jython.test ---
09:36:34 [2021-06-15T13:36:34.378Z] [INFO] Using 'UTF-8' encoding to copy filtered resources.
09:36:34 [2021-06-15T13:36:34.378Z] [INFO] skip non existing resourceDirectory /home/jenkins/agent/workspace/ease.verify.core.target.2019-06/tests/org.eclipse.ease.lang.python.jython.test/src/test/resources
09:36:34 [2021-06-15T13:36:34.378Z] [INFO] 
09:36:34 [2021-06-15T13:36:34.378Z] [INFO] --- target-platform-configuration:2.2.0:target-platform (default-target-platform) @ org.eclipse.ease.lang.python.jython.test ---
09:36:34 [2021-06-15T13:36:34.378Z] [INFO] 
09:36:34 [2021-06-15T13:36:34.378Z] [INFO] --- tycho-packaging-plugin:2.2.0:package-plugin (default-package-plugin) @ org.eclipse.ease.lang.python.jython.test ---
09:36:34 [2021-06-15T13:36:34.378Z] [INFO] Building jar: /home/jenkins/agent/workspace/ease.verify.core.target.2019-06/tests/org.eclipse.ease.lang.python.jython.test/target/org.eclipse.ease.lang.python.jython.test-0.8.0-SNAPSHOT.jar
09:36:34 [2021-06-15T13:36:34.378Z] [INFO] 
09:36:34 [2021-06-15T13:36:34.378Z] [INFO] --- tycho-p2-plugin:2.2.0:p2-metadata-default (default-p2-metadata-default) @ org.eclipse.ease.lang.python.jython.test ---
09:36:34 [2021-06-15T13:36:34.378Z] [INFO] 
09:36:34 [2021-06-15T13:36:34.378Z] [INFO] --- jacoco-maven-plugin:0.8.6:prepare-agent (jacoco-initialize) @ org.eclipse.ease.lang.python.jython.test ---
09:36:34 [2021-06-15T13:36:34.378Z] [INFO] tycho.testArgLine set to -javaagent:/home/jenkins/.m2/repository/org/jacoco/org.jacoco.agent/0.8.6/org.jacoco.agent-0.8.6-runtime.jar=destfile=/home/jenkins/agent/workspace/ease.verify.core.target.2019-06/tests/org.eclipse.ease.lang.python.jython.test/target/jacoco.exec,output=file
09:36:34 [2021-06-15T13:36:34.378Z] [INFO] 
09:36:34 [2021-06-15T13:36:34.378Z] [INFO] --- tycho-surefire-plugin:2.2.0:test (default-test) @ org.eclipse.ease.lang.python.jython.test ---
09:36:34 [2021-06-15T13:36:34.958Z] [INFO] Executing Test Runtime with timeout 0, logs (if any) will be placed at: /home/jenkins/agent/workspace/ease.verify.core.target.2019-06/tests/org.eclipse.ease.lang.python.jython.test/target/work/data/.metadata/.log
09:36:34 [2021-06-15T13:36:34.958Z] [INFO] Command line:
09:36:34 [2021-06-15T13:36:34.958Z] 	[/opt/tools/java/openjdk/jdk-15/15.0.2+7/bin/java, -Dosgi.noShutdown=false, -Dosgi.os=linux, -Dosgi.ws=gtk, -Dosgi.arch=x86_64, -javaagent:/home/jenkins/.m2/repository/org/jacoco/org.jacoco.agent/0.8.6/org.jacoco.agent-0.8.6-runtime.jar=destfile=/home/jenkins/agent/workspace/ease.verify.core.target.2019-06/tests/org.eclipse.ease.lang.python.jython.test/target/jacoco.exec,output=file, -Dosgi.clean=true, -jar, /home/jenkins/.m2/repository/p2/osgi/bundle/org.eclipse.equinox.launcher/1.6.0.v20200915-1508/org.eclipse.equinox.launcher-1.6.0.v20200915-1508.jar, -data, /home/jenkins/agent/workspace/ease.verify.core.target.2019-06/tests/org.eclipse.ease.lang.python.jython.test/target/work/data, -install, /home/jenkins/agent/workspace/ease.verify.core.target.2019-06/tests/org.eclipse.ease.lang.python.jython.test/target/work, -configuration, /home/jenkins/agent/workspace/ease.verify.core.target.2019-06/tests/org.eclipse.ease.lang.python.jython.test/target/work/configuration, -application, org.eclipse.tycho.surefire.osgibooter.headlesstest, -testproperties, /home/jenkins/agent/workspace/ease.verify.core.target.2019-06/tests/org.eclipse.ease.lang.python.jython.test/target/surefire.properties]
09:36:34 [2021-06-15T13:36:34.958Z] Picked up JAVA_TOOL_OPTIONS: -Dmaven.ext.class.path="/home/jenkins/agent/workspace/ease.verify.core.target.2019-06@tmp/withMavend6334c6d/pipeline-maven-spy.jar" -Dorg.jenkinsci.plugins.pipeline.maven.reportsFolder="/home/jenkins/agent/workspace/ease.verify.core.target.2019-06@tmp/withMavend6334c6d" 
09:36:37 [2021-06-15T13:36:37.507Z] WARNING: An illegal reflective access operation has occurred
09:36:37 [2021-06-15T13:36:37.507Z] WARNING: Illegal reflective access by org.python.core.PySystemState (file:/home/jenkins/agent/workspace/ease.verify.core.target.2019-06/tests/org.eclipse.ease.lang.python.jython.test/target/work/plugins/org.jython_2.7.0.I202104151016/jython.jar) to method java.io.Console.encoding()
09:36:37 [2021-06-15T13:36:37.507Z] WARNING: Please consider reporting this to the maintainers of org.python.core.PySystemState
09:36:37 [2021-06-15T13:36:37.507Z] WARNING: Use --illegal-access=warn to enable warnings of further illegal reflective access operations
09:36:37 [2021-06-15T13:36:37.507Z] WARNING: All illegal access operations will be denied in a future release
09:36:37 [2021-06-15T13:36:37.764Z] Jun 15, 2021 1:36:37 PM org.junit.platform.launcher.core.DefaultLauncher handleThrowable
09:36:37 [2021-06-15T13:36:37.764Z] WARNING: TestEngine with ID 'junit-vintage' failed to discover tests
09:36:37 [2021-06-15T13:36:37.764Z] java.lang.NoClassDefFoundError: org/junit/runners/model/RunnerBuilder
09:36:37 [2021-06-15T13:36:37.764Z] 	at org.junit.vintage.engine.discovery.VintageDiscoverer.<init>(VintageDiscoverer.java:48)
09:36:37 [2021-06-15T13:36:37.764Z] 	at org.junit.vintage.engine.VintageTestEngine.discover(VintageTestEngine.java:65)
09:36:37 [2021-06-15T13:36:37.764Z] 	at org.junit.platform.launcher.core.DefaultLauncher.discoverEngineRoot(DefaultLauncher.java:130)
09:36:37 [2021-06-15T13:36:37.764Z] 	at org.junit.platform.launcher.core.DefaultLauncher.discoverRoot(DefaultLauncher.java:117)
09:36:37 [2021-06-15T13:36:37.764Z] 	at org.junit.platform.launcher.core.DefaultLauncher.discover(DefaultLauncher.java:82)
09:36:37 [2021-06-15T13:36:37.764Z] 	at org.apache.maven.surefire.junitplatform.TestPlanScannerFilter.accept(TestPlanScannerFilter.java:56)
09:36:37 [2021-06-15T13:36:37.764Z] 	at org.apache.maven.surefire.util.DefaultScanResult.applyFilter(DefaultScanResult.java:102)
09:36:37 [2021-06-15T13:36:37.764Z] 	at org.apache.maven.surefire.junitplatform.JUnitPlatformProvider.scanClasspath(JUnitPlatformProvider.java:143)
09:36:37 [2021-06-15T13:36:37.764Z] 	at org.apache.maven.surefire.junitplatform.JUnitPlatformProvider.invoke(JUnitPlatformProvider.java:124)
09:36:37 [2021-06-15T13:36:37.764Z] 	at java.base/jdk.internal.reflect.NativeMethodAccessorImpl.invoke0(Native Method)
09:36:37 [2021-06-15T13:36:37.764Z] 	at java.base/jdk.internal.reflect.NativeMethodAccessorImpl.invoke(NativeMethodAccessorImpl.java:64)
09:36:37 [2021-06-15T13:36:37.764Z] 	at java.base/jdk.internal.reflect.DelegatingMethodAccessorImpl.invoke(DelegatingMethodAccessorImpl.java:43)
09:36:37 [2021-06-15T13:36:37.764Z] 	at java.base/java.lang.reflect.Method.invoke(Method.java:564)
09:36:37 [2021-06-15T13:36:37.764Z] 	at org.apache.maven.surefire.util.ReflectionUtils.invokeMethodWithArray2(ReflectionUtils.java:206)
09:36:37 [2021-06-15T13:36:37.764Z] 	at org.apache.maven.surefire.booter.ProviderFactory$ProviderProxy.invoke(ProviderFactory.java:161)
09:36:37 [2021-06-15T13:36:37.764Z] 	at org.apache.maven.surefire.booter.ProviderFactory.invokeProvider(ProviderFactory.java:84)
09:36:37 [2021-06-15T13:36:37.764Z] 	at org.eclipse.tycho.surefire.osgibooter.OsgiSurefireBooter.run(OsgiSurefireBooter.java:116)
09:36:37 [2021-06-15T13:36:37.764Z] 	at org.eclipse.tycho.surefire.osgibooter.HeadlessTestApplication.start(HeadlessTestApplication.java:23)
09:36:37 [2021-06-15T13:36:37.764Z] 	at org.eclipse.equinox.internal.app.EclipseAppHandle.run(EclipseAppHandle.java:203)
09:36:37 [2021-06-15T13:36:37.764Z] 	at org.eclipse.core.runtime.internal.adaptor.EclipseAppLauncher.runApplication(EclipseAppLauncher.java:134)
09:36:37 [2021-06-15T13:36:37.764Z] 	at org.eclipse.core.runtime.internal.adaptor.EclipseAppLauncher.start(EclipseAppLauncher.java:104)
09:36:37 [2021-06-15T13:36:37.764Z] 	at org.eclipse.core.runtime.adaptor.EclipseStarter.run(EclipseStarter.java:401)
09:36:37 [2021-06-15T13:36:37.765Z] 	at org.eclipse.core.runtime.adaptor.EclipseStarter.run(EclipseStarter.java:255)
09:36:37 [2021-06-15T13:36:37.765Z] 	at java.base/jdk.internal.reflect.NativeMethodAccessorImpl.invoke0(Native Method)
09:36:37 [2021-06-15T13:36:37.765Z] 	at java.base/jdk.internal.reflect.NativeMethodAccessorImpl.invoke(NativeMethodAccessorImpl.java:64)
09:36:37 [2021-06-15T13:36:37.765Z] 	at java.base/jdk.internal.reflect.DelegatingMethodAccessorImpl.invoke(DelegatingMethodAccessorImpl.java:43)
09:36:37 [2021-06-15T13:36:37.765Z] 	at java.base/java.lang.reflect.Method.invoke(Method.java:564)
09:36:37 [2021-06-15T13:36:37.765Z] 	at org.eclipse.equinox.launcher.Main.invokeFramework(Main.java:653)
09:36:37 [2021-06-15T13:36:37.765Z] 	at org.eclipse.equinox.launcher.Main.basicRun(Main.java:590)
09:36:37 [2021-06-15T13:36:37.765Z] 	at org.eclipse.equinox.launcher.Main.run(Main.java:1461)
09:36:37 [2021-06-15T13:36:37.765Z] 	at org.eclipse.equinox.launcher.Main.main(Main.java:1434)
09:36:37 [2021-06-15T13:36:37.765Z] Caused by: java.lang.ClassNotFoundException: org.junit.runners.model.RunnerBuilder cannot be found by org.eclipse.tycho.surefire.osgibooter_2.2.0
09:36:37 [2021-06-15T13:36:37.765Z] 	at org.eclipse.osgi.internal.loader.BundleLoader.findClass(BundleLoader.java:516)
09:36:37 [2021-06-15T13:36:37.765Z] 	at org.eclipse.osgi.internal.loader.ModuleClassLoader.loadClass(ModuleClassLoader.java:171)
09:36:37 [2021-06-15T13:36:37.765Z] 	at java.base/java.lang.ClassLoader.loadClass(ClassLoader.java:522)
09:36:37 [2021-06-15T13:36:37.765Z] 	... 31 more
09:36:37 [2021-06-15T13:36:37.765Z] 
09:36:38 [2021-06-15T13:36:38.021Z] Jun 15, 2021 1:36:37 PM org.junit.platform.launcher.core.DefaultLauncher handleThrowable
09:36:38 [2021-06-15T13:36:38.021Z] WARNING: TestEngine with ID 'junit-vintage' failed to discover tests
09:36:38 [2021-06-15T13:36:38.021Z] java.lang.NoClassDefFoundError: org/junit/runners/model/RunnerBuilder
09:36:38 [2021-06-15T13:36:38.021Z] 	at org.junit.vintage.engine.discovery.VintageDiscoverer.<init>(VintageDiscoverer.java:48)
09:36:38 [2021-06-15T13:36:38.021Z] 	at org.junit.vintage.engine.VintageTestEngine.discover(VintageTestEngine.java:65)
09:36:38 [2021-06-15T13:36:38.021Z] 	at org.junit.platform.launcher.core.DefaultLauncher.discoverEngineRoot(DefaultLauncher.java:130)
09:36:38 [2021-06-15T13:36:38.022Z] 	at org.junit.platform.launcher.core.DefaultLauncher.discoverRoot(DefaultLauncher.java:117)
09:36:38 [2021-06-15T13:36:38.022Z] 	at org.junit.platform.launcher.core.DefaultLauncher.execute(DefaultLauncher.java:90)
09:36:38 [2021-06-15T13:36:38.022Z] 	at org.apache.maven.surefire.junitplatform.JUnitPlatformProvider.invokeAllTests(JUnitPlatformProvider.java:150)
09:36:38 [2021-06-15T13:36:38.022Z] 	at org.apache.maven.surefire.junitplatform.JUnitPlatformProvider.invoke(JUnitPlatformProvider.java:124)
09:36:38 [2021-06-15T13:36:38.022Z] 	at java.base/jdk.internal.reflect.NativeMethodAccessorImpl.invoke0(Native Method)
09:36:38 [2021-06-15T13:36:38.022Z] 	at java.base/jdk.internal.reflect.NativeMethodAccessorImpl.invoke(NativeMethodAccessorImpl.java:64)
09:36:38 [2021-06-15T13:36:38.022Z] 	at java.base/jdk.internal.reflect.DelegatingMethodAccessorImpl.invoke(DelegatingMethodAccessorImpl.java:43)
09:36:38 [2021-06-15T13:36:38.022Z] 	at java.base/java.lang.reflect.Method.invoke(Method.java:564)
09:36:38 [2021-06-15T13:36:38.022Z] 	at org.apache.maven.surefire.util.ReflectionUtils.invokeMethodWithArray2(ReflectionUtils.java:206)
09:36:38 [2021-06-15T13:36:38.022Z] 	at org.apache.maven.surefire.booter.ProviderFactory$ProviderProxy.invoke(ProviderFactory.java:161)
09:36:38 [2021-06-15T13:36:38.022Z] 	at org.apache.maven.surefire.booter.ProviderFactory.invokeProvider(ProviderFactory.java:84)
09:36:38 [2021-06-15T13:36:38.022Z] 	at org.eclipse.tycho.surefire.osgibooter.OsgiSurefireBooter.run(OsgiSurefireBooter.java:116)
09:36:38 [2021-06-15T13:36:38.022Z] 	at org.eclipse.tycho.surefire.osgibooter.HeadlessTestApplication.start(HeadlessTestApplication.java:23)
09:36:38 [2021-06-15T13:36:38.022Z] 	at org.eclipse.equinox.internal.app.EclipseAppHandle.run(EclipseAppHandle.java:203)
09:36:38 [2021-06-15T13:36:38.022Z] 	at org.eclipse.core.runtime.internal.adaptor.EclipseAppLauncher.runApplication(EclipseAppLauncher.java:134)
09:36:38 [2021-06-15T13:36:38.022Z] 	at org.eclipse.core.runtime.internal.adaptor.EclipseAppLauncher.start(EclipseAppLauncher.java:104)
09:36:38 [2021-06-15T13:36:38.022Z] 	at org.eclipse.core.runtime.adaptor.EclipseStarter.run(EclipseStarter.java:401)
09:36:38 [2021-06-15T13:36:38.022Z] 	at org.eclipse.core.runtime.adaptor.EclipseStarter.run(EclipseStarter.java:255)
09:36:38 [2021-06-15T13:36:38.022Z] 	at java.base/jdk.internal.reflect.NativeMethodAccessorImpl.invoke0(Native Method)
09:36:38 [2021-06-15T13:36:38.022Z] 	at java.base/jdk.internal.reflect.NativeMethodAccessorImpl.invoke(NativeMethodAccessorImpl.java:64)
09:36:38 [2021-06-15T13:36:38.022Z] 	at java.base/jdk.internal.reflect.DelegatingMethodAccessorImpl.invoke(DelegatingMethodAccessorImpl.java:43)
09:36:38 [2021-06-15T13:36:38.022Z] 	at java.base/java.lang.reflect.Method.invoke(Method.java:564)
09:36:38 [2021-06-15T13:36:38.022Z] 	at org.eclipse.equinox.launcher.Main.invokeFramework(Main.java:653)
09:36:38 [2021-06-15T13:36:38.022Z] 	at org.eclipse.equinox.launcher.Main.basicRun(Main.java:590)
09:36:38 [2021-06-15T13:36:38.022Z] 	at org.eclipse.equinox.launcher.Main.run(Main.java:1461)
09:36:38 [2021-06-15T13:36:38.022Z] 	at org.eclipse.equinox.launcher.Main.main(Main.java:1434)
09:36:38 [2021-06-15T13:36:38.022Z] Caused by: java.lang.ClassNotFoundException: org.junit.runners.model.RunnerBuilder cannot be found by org.eclipse.tycho.surefire.osgibooter_2.2.0
09:36:38 [2021-06-15T13:36:38.022Z] 	at org.eclipse.osgi.internal.loader.BundleLoader.findClass(BundleLoader.java:516)
09:36:38 [2021-06-15T13:36:38.022Z] 	at org.eclipse.osgi.internal.loader.ModuleClassLoader.loadClass(ModuleClassLoader.java:171)
09:36:38 [2021-06-15T13:36:38.022Z] 	at java.base/java.lang.ClassLoader.loadClass(ClassLoader.java:522)
09:36:38 [2021-06-15T13:36:38.022Z] 	... 29 more
09:36:38 [2021-06-15T13:36:38.022Z] 
09:36:38 [2021-06-15T13:36:38.022Z] Running org.eclipse.ease.lang.python.jython.debugger.JythonDebugTest
09:36:41 [2021-06-15T13:36:41.307Z] Start of script
09:36:41 [2021-06-15T13:36:41.307Z] include file start
09:36:41 [2021-06-15T13:36:41.307Z] include file processed
09:36:41 [2021-06-15T13:36:41.307Z] Result of testMethod = 5
09:36:41 [2021-06-15T13:36:41.307Z] End of script
09:36:41 [2021-06-15T13:36:41.307Z] Start of script
09:36:41 [2021-06-15T13:36:41.307Z] include file start
09:36:41 [2021-06-15T13:36:41.307Z] include file processed
09:36:41 [2021-06-15T13:36:41.307Z] Result of testMethod = 5
09:36:41 [2021-06-15T13:36:41.307Z] End of script
09:36:41 [2021-06-15T13:36:41.563Z] Start of script
09:36:41 [2021-06-15T13:36:41.563Z] include file start
09:36:41 [2021-06-15T13:36:41.563Z] include file processed
09:36:41 [2021-06-15T13:36:41.563Z] Result of testMethod = 5
09:36:41 [2021-06-15T13:36:41.563Z] End of script
09:36:41 [2021-06-15T13:36:41.563Z] Start of script
09:36:41 [2021-06-15T13:36:41.819Z] include file start
09:36:41 [2021-06-15T13:36:41.819Z] include file processed
09:36:41 [2021-06-15T13:36:41.819Z] Result of testMethod = 5
09:36:41 [2021-06-15T13:36:41.819Z] End of script
09:36:42 [2021-06-15T13:36:42.075Z] Start of script
09:36:42 [2021-06-15T13:36:42.075Z] include file start
09:36:42 [2021-06-15T13:36:42.075Z] include file processed
09:36:42 [2021-06-15T13:36:42.075Z] Result of testMethod = 5
09:36:42 [2021-06-15T13:36:42.075Z] End of script
09:36:42 [2021-06-15T13:36:42.332Z] Start of script
09:36:42 [2021-06-15T13:36:42.332Z] include file start
09:36:42 [2021-06-15T13:36:42.332Z] include file processed
09:36:42 [2021-06-15T13:36:42.332Z] Result of testMethod = 5
09:36:42 [2021-06-15T13:36:42.332Z] End of script
09:36:42 [2021-06-15T13:36:42.588Z] Start of script
09:36:42 [2021-06-15T13:36:42.588Z] include file start
09:36:42 [2021-06-15T13:36:42.588Z] include file processed
09:36:42 [2021-06-15T13:36:42.588Z] Result of testMethod = 5
09:36:42 [2021-06-15T13:36:42.844Z] Traceback (most recent call last):
09:36:42 [2021-06-15T13:36:42.844Z]   File "(none)", line 184, in run
09:36:42 [2021-06-15T13:36:42.844Z]   File "__ref_L/Debug Test/Main.py_pwbjtcscou", line 23, in <module>
09:36:42 [2021-06-15T13:36:42.844Z]   File "(none)", line 161, in trace_dispatch
09:36:42 [2021-06-15T13:36:42.844Z] 	at org.eclipse.ease.debugging.AbstractEaseDebugger.handleEventsInSuspendedState(AbstractEaseDebugger.java:331)
09:36:42 [2021-06-15T13:36:42.844Z] 	at org.eclipse.ease.debugging.AbstractEaseDebugger.suspend(AbstractEaseDebugger.java:257)
09:36:42 [2021-06-15T13:36:42.844Z] 	at org.eclipse.ease.debugging.AbstractEaseDebugger.processLine(AbstractEaseDebugger.java:492)
09:36:42 [2021-06-15T13:36:42.844Z] 	at org.eclipse.ease.lang.python.debugger.PythonDebugger.traceDispatch(PythonDebugger.java:179)
09:36:42 [2021-06-15T13:36:42.844Z] 	at org.eclipse.ease.lang.python.jython.debugger.JythonDebugger.traceDispatch(JythonDebugger.java:46)
09:36:42 [2021-06-15T13:36:42.844Z] 	at jdk.internal.reflect.GeneratedMethodAccessor25.invoke(Unknown Source)
09:36:42 [2021-06-15T13:36:42.844Z] 	at java.base/jdk.internal.reflect.DelegatingMethodAccessorImpl.invoke(DelegatingMethodAccessorImpl.java:43)
09:36:42 [2021-06-15T13:36:42.844Z] 	at java.base/java.lang.reflect.Method.invoke(Method.java:564)
09:36:42 [2021-06-15T13:36:42.844Z] 
09:36:42 [2021-06-15T13:36:42.844Z] org.eclipse.ease.ScriptEngineCancellationException: org.eclipse.ease.ScriptEngineCancellationException: Terminated on user request
09:36:42 [2021-06-15T13:36:42.844Z] Start of script
09:36:42 [2021-06-15T13:36:42.844Z] include file start
09:36:42 [2021-06-15T13:36:42.844Z] include file processed
09:36:43 [2021-06-15T13:36:43.108Z] Result of testMethod = 5
09:36:43 [2021-06-15T13:36:43.108Z] End of script
09:36:43 [2021-06-15T13:36:43.108Z] Start of script
09:36:43 [2021-06-15T13:36:43.108Z] include file start
09:36:43 [2021-06-15T13:36:43.108Z] include file processed
09:36:43 [2021-06-15T13:36:43.108Z] Result of testMethod = 5
09:36:43 [2021-06-15T13:36:43.374Z] End of script
09:36:43 [2021-06-15T13:36:43.374Z] Start of script
09:36:43 [2021-06-15T13:36:43.374Z] include file start
09:36:43 [2021-06-15T13:36:43.374Z] include file processed
09:36:43 [2021-06-15T13:36:43.947Z] Traceback (most recent call last):
09:36:43 [2021-06-15T13:36:43.947Z]   File "(none)", line 184, in run
09:36:43 [2021-06-15T13:36:43.947Z]   File "__ref_L/Debug Test/Main.py_dleqireljt", line 22, in <module>
09:36:43 [2021-06-15T13:36:43.947Z]   File "(none)", line 161, in trace_dispatch
09:36:43 [2021-06-15T13:36:43.947Z] 	at org.eclipse.ease.debugging.AbstractEaseDebugger.handleEventsInSuspendedState(AbstractEaseDebugger.java:331)
09:36:43 [2021-06-15T13:36:43.947Z] 	at org.eclipse.ease.debugging.AbstractEaseDebugger.suspend(AbstractEaseDebugger.java:257)
09:36:43 [2021-06-15T13:36:43.947Z] 	at org.eclipse.ease.debugging.AbstractEaseDebugger.processLine(AbstractEaseDebugger.java:512)
09:36:43 [2021-06-15T13:36:43.947Z] 	at org.eclipse.ease.lang.python.debugger.PythonDebugger.traceDispatch(PythonDebugger.java:179)
09:36:43 [2021-06-15T13:36:43.947Z] 	at org.eclipse.ease.lang.python.jython.debugger.JythonDebugger.traceDispatch(JythonDebugger.java:46)
09:36:43 [2021-06-15T13:36:43.947Z] 	at jdk.internal.reflect.GeneratedMethodAccessor25.invoke(Unknown Source)
09:36:43 [2021-06-15T13:36:43.947Z] 	at java.base/jdk.internal.reflect.DelegatingMethodAccessorImpl.invoke(DelegatingMethodAccessorImpl.java:43)
09:36:43 [2021-06-15T13:36:43.947Z] 	at java.base/java.lang.reflect.Method.invoke(Method.java:564)
09:36:43 [2021-06-15T13:36:43.947Z] 
09:36:43 [2021-06-15T13:36:43.947Z] org.eclipse.ease.ScriptEngineCancellationException: org.eclipse.ease.ScriptEngineCancellationException: Terminated on user request
09:36:43 [2021-06-15T13:36:43.947Z] Start of script
09:36:43 [2021-06-15T13:36:43.947Z] include file start
09:36:44 [2021-06-15T13:36:44.203Z] include file processed
09:36:44 [2021-06-15T13:36:44.203Z] Result of testMethod = 5
09:36:44 [2021-06-15T13:36:44.203Z] End of script
09:36:44 [2021-06-15T13:36:44.203Z] Start of script
09:36:44 [2021-06-15T13:36:44.203Z] include file start
09:36:44 [2021-06-15T13:36:44.203Z] include file processed
09:36:44 [2021-06-15T13:36:44.459Z] Result of testMethod = 5
09:36:44 [2021-06-15T13:36:44.459Z] End of script
09:36:44 [2021-06-15T13:36:44.716Z] Traceback (most recent call last):
09:36:44 [2021-06-15T13:36:44.716Z]   File "(none)", line 184, in run
09:36:44 [2021-06-15T13:36:44.716Z]   File "__ref_L/Debug Test/Main.py_zadhsjyrfb", line 1, in <module>
09:36:44 [2021-06-15T13:36:44.716Z]   File "(none)", line 161, in trace_dispatch
09:36:44 [2021-06-15T13:36:44.716Z] 	at org.eclipse.ease.debugging.AbstractEaseDebugger.handleEventsInSuspendedState(AbstractEaseDebugger.java:331)
09:36:44 [2021-06-15T13:36:44.716Z] 	at org.eclipse.ease.debugging.AbstractEaseDebugger.suspend(AbstractEaseDebugger.java:257)
09:36:44 [2021-06-15T13:36:44.716Z] 	at org.eclipse.ease.debugging.AbstractEaseDebugger.processLine(AbstractEaseDebugger.java:492)
09:36:44 [2021-06-15T13:36:44.716Z] 	at org.eclipse.ease.lang.python.debugger.PythonDebugger.traceDispatch(PythonDebugger.java:179)
09:36:44 [2021-06-15T13:36:44.716Z] 	at org.eclipse.ease.lang.python.jython.debugger.JythonDebugger.traceDispatch(JythonDebugger.java:46)
09:36:44 [2021-06-15T13:36:44.716Z] 	at jdk.internal.reflect.GeneratedMethodAccessor25.invoke(Unknown Source)
09:36:44 [2021-06-15T13:36:44.716Z] 	at java.base/jdk.internal.reflect.DelegatingMethodAccessorImpl.invoke(DelegatingMethodAccessorImpl.java:43)
09:36:44 [2021-06-15T13:36:44.716Z] 	at java.base/java.lang.reflect.Method.invoke(Method.java:564)
09:36:44 [2021-06-15T13:36:44.716Z] 
09:36:44 [2021-06-15T13:36:44.716Z] org.eclipse.ease.ScriptEngineCancellationException: org.eclipse.ease.ScriptEngineCancellationException: Terminated on user request
09:36:44 [2021-06-15T13:36:44.716Z] Start of script
09:36:44 [2021-06-15T13:36:44.716Z] include file start
09:36:44 [2021-06-15T13:36:44.716Z] include file processed
09:36:44 [2021-06-15T13:36:44.716Z] Result of testMethod = 5
09:36:44 [2021-06-15T13:36:44.716Z] End of script
09:36:44 [2021-06-15T13:36:44.972Z] Start of script
09:36:44 [2021-06-15T13:36:44.972Z] include file start
09:36:44 [2021-06-15T13:36:44.972Z] include file processed
09:36:45 [2021-06-15T13:36:45.229Z] Result of testMethod = 5
09:36:45 [2021-06-15T13:36:45.229Z] End of script
09:36:45 [2021-06-15T13:36:45.229Z] Start of script
09:36:45 [2021-06-15T13:36:45.229Z] include file start
09:36:45 [2021-06-15T13:36:45.229Z] include file processed
09:36:45 [2021-06-15T13:36:45.229Z] Result of testMethod = 5
09:36:45 [2021-06-15T13:36:45.485Z] Traceback (most recent call last):
09:36:45 [2021-06-15T13:36:45.485Z]   File "(none)", line 184, in run
09:36:45 [2021-06-15T13:36:45.485Z]   File "__ref_L/Debug Test/Main.py_voyvonaocn", line 23, in <module>
09:36:45 [2021-06-15T13:36:45.485Z]   File "(none)", line 161, in trace_dispatch
09:36:45 [2021-06-15T13:36:45.485Z] 	at org.eclipse.ease.debugging.AbstractEaseDebugger.handleEventsInSuspendedState(AbstractEaseDebugger.java:331)
09:36:45 [2021-06-15T13:36:45.485Z] 	at org.eclipse.ease.debugging.AbstractEaseDebugger.suspend(AbstractEaseDebugger.java:257)
09:36:45 [2021-06-15T13:36:45.485Z] 	at org.eclipse.ease.debugging.AbstractEaseDebugger.processLine(AbstractEaseDebugger.java:492)
09:36:45 [2021-06-15T13:36:45.485Z] 	at org.eclipse.ease.lang.python.debugger.PythonDebugger.traceDispatch(PythonDebugger.java:179)
09:36:45 [2021-06-15T13:36:45.485Z] 	at org.eclipse.ease.lang.python.jython.debugger.JythonDebugger.traceDispatch(JythonDebugger.java:46)
09:36:45 [2021-06-15T13:36:45.485Z] 	at jdk.internal.reflect.GeneratedMethodAccessor25.invoke(Unknown Source)
09:36:45 [2021-06-15T13:36:45.485Z] 	at java.base/jdk.internal.reflect.DelegatingMethodAccessorImpl.invoke(DelegatingMethodAccessorImpl.java:43)
09:36:45 [2021-06-15T13:36:45.485Z] 	at java.base/java.lang.reflect.Method.invoke(Method.java:564)
09:36:45 [2021-06-15T13:36:45.485Z] 
09:36:45 [2021-06-15T13:36:45.485Z] org.eclipse.ease.ScriptEngineCancellationException: org.eclipse.ease.ScriptEngineCancellationException: Terminated on user request
09:36:45 [2021-06-15T13:36:45.485Z] Start of script
09:36:45 [2021-06-15T13:36:45.485Z] include file start
09:36:45 [2021-06-15T13:36:45.485Z] include file processed
09:36:45 [2021-06-15T13:36:45.741Z] Result of testMethod = 5
09:36:45 [2021-06-15T13:36:45.741Z] End of script
09:36:45 [2021-06-15T13:36:45.997Z] Traceback (most recent call last):
09:36:45 [2021-06-15T13:36:45.997Z]   File "(none)", line 184, in run
09:36:45 [2021-06-15T13:36:45.997Z]   File "__ref_L/Debug Test/Main.py_xfaezkuuku", line 1, in <module>
09:36:45 [2021-06-15T13:36:45.997Z]   File "(none)", line 161, in trace_dispatch
09:36:45 [2021-06-15T13:36:45.997Z] 	at org.eclipse.ease.debugging.AbstractEaseDebugger.handleEventsInSuspendedState(AbstractEaseDebugger.java:331)
09:36:45 [2021-06-15T13:36:45.997Z] 	at org.eclipse.ease.debugging.AbstractEaseDebugger.suspend(AbstractEaseDebugger.java:257)
09:36:45 [2021-06-15T13:36:45.997Z] 	at org.eclipse.ease.debugging.AbstractEaseDebugger.processLine(AbstractEaseDebugger.java:492)
09:36:45 [2021-06-15T13:36:45.997Z] 	at org.eclipse.ease.lang.python.debugger.PythonDebugger.traceDispatch(PythonDebugger.java:179)
09:36:45 [2021-06-15T13:36:45.997Z] 	at org.eclipse.ease.lang.python.jython.debugger.JythonDebugger.traceDispatch(JythonDebugger.java:46)
09:36:45 [2021-06-15T13:36:45.997Z] 	at jdk.internal.reflect.GeneratedMethodAccessor25.invoke(Unknown Source)
09:36:45 [2021-06-15T13:36:45.997Z] 	at java.base/jdk.internal.reflect.DelegatingMethodAccessorImpl.invoke(DelegatingMethodAccessorImpl.java:43)
09:36:45 [2021-06-15T13:36:45.997Z] 	at java.base/java.lang.reflect.Method.invoke(Method.java:564)
09:36:45 [2021-06-15T13:36:45.997Z] 
09:36:45 [2021-06-15T13:36:45.997Z] org.eclipse.ease.ScriptEngineCancellationException: org.eclipse.ease.ScriptEngineCancellationException: Terminated on user request
09:36:45 [2021-06-15T13:36:45.997Z] Start of script
09:36:45 [2021-06-15T13:36:45.997Z] include file start
09:36:45 [2021-06-15T13:36:45.997Z] include file processed
09:36:45 [2021-06-15T13:36:45.997Z] Result of testMethod = 5
09:36:46 [2021-06-15T13:36:46.253Z] End of script
09:36:46 [2021-06-15T13:36:46.253Z] Start of script
09:36:46 [2021-06-15T13:36:46.253Z] include file start
09:36:46 [2021-06-15T13:36:46.253Z] include file processed
09:36:46 [2021-06-15T13:36:46.508Z] Result of testMethod = 5
09:36:46 [2021-06-15T13:36:46.508Z] End of script
09:36:46 [2021-06-15T13:36:46.764Z] Traceback (most recent call last):
09:36:46 [2021-06-15T13:36:46.764Z]   File "(none)", line 184, in run
09:36:46 [2021-06-15T13:36:46.764Z]   File "__ref_L/Debug Test/Main.py_wlijjifiqk", line 1, in <module>
09:36:46 [2021-06-15T13:36:46.764Z]   File "(none)", line 161, in trace_dispatch
09:36:46 [2021-06-15T13:36:46.764Z] 	at org.eclipse.ease.debugging.AbstractEaseDebugger.handleEventsInSuspendedState(AbstractEaseDebugger.java:331)
09:36:46 [2021-06-15T13:36:46.764Z] 	at org.eclipse.ease.debugging.AbstractEaseDebugger.suspend(AbstractEaseDebugger.java:257)
09:36:46 [2021-06-15T13:36:46.764Z] 	at org.eclipse.ease.debugging.AbstractEaseDebugger.processLine(AbstractEaseDebugger.java:492)
09:36:46 [2021-06-15T13:36:46.764Z] 	at org.eclipse.ease.lang.python.debugger.PythonDebugger.traceDispatch(PythonDebugger.java:179)
09:36:46 [2021-06-15T13:36:46.764Z] 	at org.eclipse.ease.lang.python.jython.debugger.JythonDebugger.traceDispatch(JythonDebugger.java:46)
09:36:46 [2021-06-15T13:36:46.764Z] 	at jdk.internal.reflect.GeneratedMethodAccessor25.invoke(Unknown Source)
09:36:46 [2021-06-15T13:36:46.764Z] 	at java.base/jdk.internal.reflect.DelegatingMethodAccessorImpl.invoke(DelegatingMethodAccessorImpl.java:43)
09:36:46 [2021-06-15T13:36:46.764Z] 	at java.base/java.lang.reflect.Method.invoke(Method.java:564)
09:36:46 [2021-06-15T13:36:46.764Z] 
09:36:46 [2021-06-15T13:36:46.764Z] org.eclipse.ease.ScriptEngineCancellationException: org.eclipse.ease.ScriptEngineCancellationException: Terminated on user request
09:36:46 [2021-06-15T13:36:46.764Z] Start of script
09:36:46 [2021-06-15T13:36:46.764Z] include file start
09:36:46 [2021-06-15T13:36:46.764Z] include file processed
09:36:47 [2021-06-15T13:36:47.020Z] Result of testMethod = 5
09:36:47 [2021-06-15T13:36:47.020Z] End of script
09:36:47 [2021-06-15T13:36:47.020Z] Start of script
09:36:47 [2021-06-15T13:36:47.020Z] include file start
09:36:47 [2021-06-15T13:36:47.020Z] include file processed
09:36:47 [2021-06-15T13:36:47.020Z] Result of testMethod = 5
09:36:47 [2021-06-15T13:36:47.276Z] Traceback (most recent call last):
09:36:47 [2021-06-15T13:36:47.276Z]   File "(none)", line 184, in run
09:36:47 [2021-06-15T13:36:47.276Z]   File "__ref_L/Debug Test/Main.py_ctewgedwkt", line 23, in <module>
09:36:47 [2021-06-15T13:36:47.276Z]   File "(none)", line 161, in trace_dispatch
09:36:47 [2021-06-15T13:36:47.276Z] 	at org.eclipse.ease.debugging.AbstractEaseDebugger.handleEventsInSuspendedState(AbstractEaseDebugger.java:331)
09:36:47 [2021-06-15T13:36:47.276Z] 	at org.eclipse.ease.debugging.AbstractEaseDebugger.suspend(AbstractEaseDebugger.java:257)
09:36:47 [2021-06-15T13:36:47.276Z] 	at org.eclipse.ease.debugging.AbstractEaseDebugger.processLine(AbstractEaseDebugger.java:492)
09:36:47 [2021-06-15T13:36:47.276Z] 	at org.eclipse.ease.lang.python.debugger.PythonDebugger.traceDispatch(PythonDebugger.java:179)
09:36:47 [2021-06-15T13:36:47.276Z] 	at org.eclipse.ease.lang.python.jython.debugger.JythonDebugger.traceDispatch(JythonDebugger.java:46)
09:36:47 [2021-06-15T13:36:47.276Z] 	at jdk.internal.reflect.GeneratedMethodAccessor25.invoke(Unknown Source)
09:36:47 [2021-06-15T13:36:47.276Z] 	at java.base/jdk.internal.reflect.DelegatingMethodAccessorImpl.invoke(DelegatingMethodAccessorImpl.java:43)
09:36:47 [2021-06-15T13:36:47.276Z] 	at java.base/java.lang.reflect.Method.invoke(Method.java:564)
09:36:47 [2021-06-15T13:36:47.276Z] 
09:36:47 [2021-06-15T13:36:47.276Z] org.eclipse.ease.ScriptEngineCancellationException: org.eclipse.ease.ScriptEngineCancellationException: Terminated on user request
09:36:47 [2021-06-15T13:36:47.532Z] Start of script
09:36:47 [2021-06-15T13:36:47.532Z] include file start
09:36:47 [2021-06-15T13:36:47.532Z] include file processed
09:36:47 [2021-06-15T13:36:47.532Z] Result of testMethod = 5
09:36:47 [2021-06-15T13:36:47.532Z] End of script
09:36:47 [2021-06-15T13:36:47.532Z] Start of script
09:36:47 [2021-06-15T13:36:47.532Z] include file start
09:36:47 [2021-06-15T13:36:47.532Z] include file processed
09:36:47 [2021-06-15T13:36:47.788Z] Result of testMethod = 5
09:36:47 [2021-06-15T13:36:47.788Z] End of script
09:36:47 [2021-06-15T13:36:47.788Z] Start of script
09:36:48 [2021-06-15T13:36:48.045Z] include file start
09:36:48 [2021-06-15T13:36:48.045Z] include file processed
09:36:48 [2021-06-15T13:36:48.045Z] Result of testMethod = 5
09:36:48 [2021-06-15T13:36:48.045Z] End of script
09:36:48 [2021-06-15T13:36:48.045Z] Start of script
09:36:48 [2021-06-15T13:36:48.301Z] include file start
09:36:48 [2021-06-15T13:36:48.301Z] include file processed
09:36:48 [2021-06-15T13:36:48.301Z] Result of testMethod = 5
09:36:48 [2021-06-15T13:36:48.301Z] End of script
09:36:48 [2021-06-15T13:36:48.301Z] Start of script
09:36:48 [2021-06-15T13:36:48.301Z] include file start
09:36:48 [2021-06-15T13:36:48.301Z] include file processed
09:36:48 [2021-06-15T13:36:48.558Z] Traceback (most recent call last):
09:36:48 [2021-06-15T13:36:48.558Z]   File "(none)", line 184, in run
09:36:48 [2021-06-15T13:36:48.558Z]   File "__ref_L/Debug Test/Main.py_dadnqiehaw", line 21, in <module>
09:36:48 [2021-06-15T13:36:48.558Z]   File "__ref_L/Debug Test/Main.py_dadnqiehaw", line 18, in testMethod
09:36:48 [2021-06-15T13:36:48.558Z]   File "(none)", line 161, in trace_dispatch
09:36:48 [2021-06-15T13:36:48.558Z] 	at org.eclipse.ease.debugging.AbstractEaseDebugger.handleEventsInSuspendedState(AbstractEaseDebugger.java:331)
09:36:48 [2021-06-15T13:36:48.558Z] 	at org.eclipse.ease.debugging.AbstractEaseDebugger.suspend(AbstractEaseDebugger.java:257)
09:36:48 [2021-06-15T13:36:48.558Z] 	at org.eclipse.ease.debugging.AbstractEaseDebugger.processLine(AbstractEaseDebugger.java:492)
09:36:48 [2021-06-15T13:36:48.558Z] 	at org.eclipse.ease.lang.python.debugger.PythonDebugger.traceDispatch(PythonDebugger.java:179)
09:36:48 [2021-06-15T13:36:48.558Z] 	at org.eclipse.ease.lang.python.jython.debugger.JythonDebugger.traceDispatch(JythonDebugger.java:46)
09:36:48 [2021-06-15T13:36:48.558Z] 	at jdk.internal.reflect.GeneratedMethodAccessor25.invoke(Unknown Source)
09:36:48 [2021-06-15T13:36:48.558Z] 	at java.base/jdk.internal.reflect.DelegatingMethodAccessorImpl.invoke(DelegatingMethodAccessorImpl.java:43)
09:36:48 [2021-06-15T13:36:48.558Z] 	at java.base/java.lang.reflect.Method.invoke(Method.java:564)
09:36:48 [2021-06-15T13:36:48.558Z] 
09:36:48 [2021-06-15T13:36:48.558Z] org.eclipse.ease.ScriptEngineCancellationException: org.eclipse.ease.ScriptEngineCancellationException: Terminated on user request
09:36:48 [2021-06-15T13:36:48.814Z] Start of script
09:36:48 [2021-06-15T13:36:48.814Z] include file start
09:36:48 [2021-06-15T13:36:48.814Z] include file processed
09:36:48 [2021-06-15T13:36:48.814Z] Result of testMethod = 5
09:36:48 [2021-06-15T13:36:48.814Z] End of script
09:36:49 [2021-06-15T13:36:49.070Z] Start of script
09:36:49 [2021-06-15T13:36:49.070Z] include file start
09:36:49 [2021-06-15T13:36:49.070Z] include file processed
09:36:49 [2021-06-15T13:36:49.070Z] Result of testMethod = 5
09:36:49 [2021-06-15T13:36:49.327Z] Traceback (most recent call last):
09:36:49 [2021-06-15T13:36:49.327Z]   File "(none)", line 184, in run
09:36:49 [2021-06-15T13:36:49.327Z]   File "__ref_L/Debug Test/Main.py_imqpdztnom", line 23, in <module>
09:36:49 [2021-06-15T13:36:49.327Z]   File "(none)", line 161, in trace_dispatch
09:36:49 [2021-06-15T13:36:49.327Z] 	at org.eclipse.ease.debugging.AbstractEaseDebugger.handleEventsInSuspendedState(AbstractEaseDebugger.java:331)
09:36:49 [2021-06-15T13:36:49.327Z] 	at org.eclipse.ease.debugging.AbstractEaseDebugger.suspend(AbstractEaseDebugger.java:257)
09:36:49 [2021-06-15T13:36:49.327Z] 	at org.eclipse.ease.debugging.AbstractEaseDebugger.processLine(AbstractEaseDebugger.java:492)
09:36:49 [2021-06-15T13:36:49.327Z] 	at org.eclipse.ease.lang.python.debugger.PythonDebugger.traceDispatch(PythonDebugger.java:179)
09:36:49 [2021-06-15T13:36:49.327Z] 	at org.eclipse.ease.lang.python.jython.debugger.JythonDebugger.traceDispatch(JythonDebugger.java:46)
09:36:49 [2021-06-15T13:36:49.327Z] 	at jdk.internal.reflect.GeneratedMethodAccessor25.invoke(Unknown Source)
09:36:49 [2021-06-15T13:36:49.327Z] 	at java.base/jdk.internal.reflect.DelegatingMethodAccessorImpl.invoke(DelegatingMethodAccessorImpl.java:43)
09:36:49 [2021-06-15T13:36:49.327Z] 	at java.base/java.lang.reflect.Method.invoke(Method.java:564)
09:36:49 [2021-06-15T13:36:49.327Z] 
09:36:49 [2021-06-15T13:36:49.327Z] org.eclipse.ease.ScriptEngineCancellationException: org.eclipse.ease.ScriptEngineCancellationException: Terminated on user request
09:36:49 [2021-06-15T13:36:49.327Z] Start of script
09:36:49 [2021-06-15T13:36:49.327Z] include file start
09:36:49 [2021-06-15T13:36:49.327Z] include file processed
09:36:49 [2021-06-15T13:36:49.327Z] Result of testMethod = 5
09:36:49 [2021-06-15T13:36:49.327Z] End of script
09:36:49 [2021-06-15T13:36:49.584Z] Start of script
09:36:49 [2021-06-15T13:36:49.584Z] include file start
09:36:49 [2021-06-15T13:36:49.584Z] include file processed
09:36:49 [2021-06-15T13:36:49.840Z] Result of testMethod = 5
09:36:49 [2021-06-15T13:36:49.840Z] End of script
09:36:49 [2021-06-15T13:36:49.840Z] Start of script
09:36:49 [2021-06-15T13:36:49.840Z] include file start
09:36:49 [2021-06-15T13:36:49.840Z] include file processed
09:36:50 [2021-06-15T13:36:50.096Z] Result of testMethod = 5
09:36:50 [2021-06-15T13:36:50.096Z] End of script
09:36:50 [2021-06-15T13:36:50.096Z] Start of script
09:36:50 [2021-06-15T13:36:50.096Z] include file start
09:36:50 [2021-06-15T13:36:50.096Z] include file processed
09:36:50 [2021-06-15T13:36:50.096Z] Result of testMethod = 5
09:36:50 [2021-06-15T13:36:50.353Z] End of script
09:36:50 [2021-06-15T13:36:50.353Z] Start of script
09:36:50 [2021-06-15T13:36:50.353Z] include file start
09:36:50 [2021-06-15T13:36:50.353Z] include file processed
09:36:50 [2021-06-15T13:36:50.353Z] Result of testMethod = 5
09:36:50 [2021-06-15T13:36:50.609Z] Traceback (most recent call last):
09:36:50 [2021-06-15T13:36:50.609Z]   File "(none)", line 184, in run
09:36:50 [2021-06-15T13:36:50.609Z]   File "__ref_L/Debug Test/Main.py_jzkvgxersi", line 23, in <module>
09:36:50 [2021-06-15T13:36:50.609Z]   File "(none)", line 161, in trace_dispatch
09:36:50 [2021-06-15T13:36:50.609Z] 	at org.eclipse.ease.debugging.AbstractEaseDebugger.handleEventsInSuspendedState(AbstractEaseDebugger.java:331)
09:36:50 [2021-06-15T13:36:50.609Z] 	at org.eclipse.ease.debugging.AbstractEaseDebugger.suspend(AbstractEaseDebugger.java:257)
09:36:50 [2021-06-15T13:36:50.609Z] 	at org.eclipse.ease.debugging.AbstractEaseDebugger.processLine(AbstractEaseDebugger.java:492)
09:36:50 [2021-06-15T13:36:50.609Z] 	at org.eclipse.ease.lang.python.debugger.PythonDebugger.traceDispatch(PythonDebugger.java:179)
09:36:50 [2021-06-15T13:36:50.609Z] 	at org.eclipse.ease.lang.python.jython.debugger.JythonDebugger.traceDispatch(JythonDebugger.java:46)
09:36:50 [2021-06-15T13:36:50.609Z] 	at jdk.internal.reflect.GeneratedMethodAccessor25.invoke(Unknown Source)
09:36:50 [2021-06-15T13:36:50.609Z] 	at java.base/jdk.internal.reflect.DelegatingMethodAccessorImpl.invoke(DelegatingMethodAccessorImpl.java:43)
09:36:50 [2021-06-15T13:36:50.609Z] 	at java.base/java.lang.reflect.Method.invoke(Method.java:564)
09:36:50 [2021-06-15T13:36:50.609Z] 
09:36:50 [2021-06-15T13:36:50.609Z] org.eclipse.ease.ScriptEngineCancellationException: org.eclipse.ease.ScriptEngineCancellationException: Terminated on user request
09:36:50 [2021-06-15T13:36:50.609Z] Start of script
09:36:50 [2021-06-15T13:36:50.609Z] include file start
09:36:50 [2021-06-15T13:36:50.609Z] include file processed
09:36:50 [2021-06-15T13:36:50.609Z] Result of testMethod = 5
09:36:50 [2021-06-15T13:36:50.866Z] End of script
09:36:50 [2021-06-15T13:36:50.866Z] Start of script
09:36:50 [2021-06-15T13:36:50.866Z] include file start
09:36:50 [2021-06-15T13:36:50.866Z] include file processed
09:36:50 [2021-06-15T13:36:50.866Z] Result of testMethod = 5
09:36:51 [2021-06-15T13:36:51.122Z] Traceback (most recent call last):
09:36:51 [2021-06-15T13:36:51.122Z]   File "(none)", line 184, in run
09:36:51 [2021-06-15T13:36:51.122Z]   File "__ref_L/Debug Test/Main.py_icffqxvotz", line 23, in <module>
09:36:51 [2021-06-15T13:36:51.122Z]   File "(none)", line 161, in trace_dispatch
09:36:51 [2021-06-15T13:36:51.122Z] 	at org.eclipse.ease.debugging.AbstractEaseDebugger.handleEventsInSuspendedState(AbstractEaseDebugger.java:331)
09:36:51 [2021-06-15T13:36:51.122Z] 	at org.eclipse.ease.debugging.AbstractEaseDebugger.suspend(AbstractEaseDebugger.java:257)
09:36:51 [2021-06-15T13:36:51.122Z] 	at org.eclipse.ease.debugging.AbstractEaseDebugger.processLine(AbstractEaseDebugger.java:492)
09:36:51 [2021-06-15T13:36:51.122Z] 	at org.eclipse.ease.lang.python.debugger.PythonDebugger.traceDispatch(PythonDebugger.java:179)
09:36:51 [2021-06-15T13:36:51.122Z] 	at org.eclipse.ease.lang.python.jython.debugger.JythonDebugger.traceDispatch(JythonDebugger.java:46)
09:36:51 [2021-06-15T13:36:51.122Z] 	at jdk.internal.reflect.GeneratedMethodAccessor25.invoke(Unknown Source)
09:36:51 [2021-06-15T13:36:51.122Z] 	at java.base/jdk.internal.reflect.DelegatingMethodAccessorImpl.invoke(DelegatingMethodAccessorImpl.java:43)
09:36:51 [2021-06-15T13:36:51.122Z] 	at java.base/java.lang.reflect.Method.invoke(Method.java:564)
09:36:51 [2021-06-15T13:36:51.122Z] 
09:36:51 [2021-06-15T13:36:51.122Z] org.eclipse.ease.ScriptEngineCancellationException: org.eclipse.ease.ScriptEngineCancellationException: Terminated on user request
09:36:51 [2021-06-15T13:36:51.378Z] Traceback (most recent call last):
09:36:51 [2021-06-15T13:36:51.378Z]   File "(none)", line 184, in run
09:36:51 [2021-06-15T13:36:51.378Z]   File "__ref_L/Debug Test/Main.py_jggadgwzgn", line 1, in <module>
09:36:51 [2021-06-15T13:36:51.378Z]   File "(none)", line 161, in trace_dispatch
09:36:51 [2021-06-15T13:36:51.378Z] 	at org.eclipse.ease.debugging.AbstractEaseDebugger.handleEventsInSuspendedState(AbstractEaseDebugger.java:331)
09:36:51 [2021-06-15T13:36:51.378Z] 	at org.eclipse.ease.debugging.AbstractEaseDebugger.suspend(AbstractEaseDebugger.java:257)
09:36:51 [2021-06-15T13:36:51.378Z] 	at org.eclipse.ease.debugging.AbstractEaseDebugger.processLine(AbstractEaseDebugger.java:492)
09:36:51 [2021-06-15T13:36:51.378Z] 	at org.eclipse.ease.lang.python.debugger.PythonDebugger.traceDispatch(PythonDebugger.java:179)
09:36:51 [2021-06-15T13:36:51.378Z] 	at org.eclipse.ease.lang.python.jython.debugger.JythonDebugger.traceDispatch(JythonDebugger.java:46)
09:36:51 [2021-06-15T13:36:51.378Z] 	at jdk.internal.reflect.GeneratedMethodAccessor25.invoke(Unknown Source)
09:36:51 [2021-06-15T13:36:51.378Z] 	at java.base/jdk.internal.reflect.DelegatingMethodAccessorImpl.invoke(DelegatingMethodAccessorImpl.java:43)
09:36:51 [2021-06-15T13:36:51.378Z] 	at java.base/java.lang.reflect.Method.invoke(Method.java:564)
09:36:51 [2021-06-15T13:36:51.378Z] 
09:36:51 [2021-06-15T13:36:51.378Z] org.eclipse.ease.ScriptEngineCancellationException: org.eclipse.ease.ScriptEngineCancellationException: Terminated on user request
09:36:51 [2021-06-15T13:36:51.378Z] Start of script
09:36:51 [2021-06-15T13:36:51.378Z] include file start
09:36:51 [2021-06-15T13:36:51.378Z] include file processed
09:36:51 [2021-06-15T13:36:51.378Z] Result of testMethod = 5
09:36:51 [2021-06-15T13:36:51.378Z] End of script
09:36:51 [2021-06-15T13:36:51.634Z] Start of script
09:36:51 [2021-06-15T13:36:51.635Z] include file start
09:36:51 [2021-06-15T13:36:51.635Z] include file processed
09:36:51 [2021-06-15T13:36:51.891Z] Result of testMethod = 5
09:36:51 [2021-06-15T13:36:51.891Z] End of script
09:36:51 [2021-06-15T13:36:51.891Z] Start of script
09:36:51 [2021-06-15T13:36:51.891Z] include file start
09:36:51 [2021-06-15T13:36:51.891Z] include file processed
09:36:51 [2021-06-15T13:36:51.891Z] Result of testMethod = 5
09:36:52 [2021-06-15T13:36:52.147Z] End of script
09:36:52 [2021-06-15T13:36:52.147Z] Tests run: 42, Failures: 1, Errors: 0, Skipped: 0, Time elapsed: 14.239 s <<< FAILURE! - in org.eclipse.ease.lang.python.jython.debugger.JythonDebugTest
09:36:52 [2021-06-15T13:36:52.147Z] disconnectProcessInSuspendedState  Time elapsed: 3.252 s
09:36:52 [2021-06-15T13:36:52.147Z] stepReturnIncludeCommand  Time elapsed: 0.311 s
09:36:52 [2021-06-15T13:36:52.147Z] arrayVariableSorting  Time elapsed: 0.113 s  <<< FAILURE!
09:36:52 [2021-06-15T13:36:52.147Z] org.opentest4j.AssertionFailedError: expected: <1> but was: <0>
09:36:52 [2021-06-15T13:36:52.147Z] 	at org.eclipse.ease.testhelper.AbstractDebugTest.arrayVariableSorting(AbstractDebugTest.java:892)
09:36:52 [2021-06-15T13:36:52.147Z] 
09:36:52 [2021-06-15T13:36:52.147Z] stepOverOnDebugTarget  Time elapsed: 0.307 s
09:36:52 [2021-06-15T13:36:52.147Z] hasDebugTarget  Time elapsed: 0.106 s
09:36:52 [2021-06-15T13:36:52.147Z] disconnectThreadInSuspendedState  Time elapsed: 0.208 s
09:36:52 [2021-06-15T13:36:52.147Z] stepReturnOnDebugTarget  Time elapsed: 0.309 s
09:36:52 [2021-06-15T13:36:52.147Z] nullVariable  Time elapsed: 0.308 s
09:36:52 [2021-06-15T13:36:52.147Z] stepOverOnStackFrame  Time elapsed: 0.308 s
09:36:52 [2021-06-15T13:36:52.147Z] resumeOnDebugTarget  Time elapsed: 0.205 s
09:36:52 [2021-06-15T13:36:52.147Z] modifyVariableKeepingType  Time elapsed: 0.606 s
09:36:52 [2021-06-15T13:36:52.147Z] resumeOnLastIncludeLine  Time elapsed: 0.205 s
09:36:52 [2021-06-15T13:36:52.147Z] stepReturnOnStackFrame  Time elapsed: 0.306 s
09:36:52 [2021-06-15T13:36:52.147Z] terminateStackFrameInSuspendedState  Time elapsed: 0.206 s
09:36:52 [2021-06-15T13:36:52.147Z] breakpointLocation  Time elapsed: 0.206 s
09:36:52 [2021-06-15T13:36:52.147Z] stepReturnOnThread  Time elapsed: 0.307 s
09:36:52 [2021-06-15T13:36:52.147Z] javaClassVariable  Time elapsed: 0.307 s
09:36:52 [2021-06-15T13:36:52.147Z] stepIntoOnThread  Time elapsed: 0.308 s
09:36:52 [2021-06-15T13:36:52.147Z] terminateThreadInSuspendedState  Time elapsed: 0.207 s
09:36:52 [2021-06-15T13:36:52.147Z] resumeOnThread  Time elapsed: 0.207 s
09:36:52 [2021-06-15T13:36:52.147Z] stepIntoOnStackFrame  Time elapsed: 0.307 s
09:36:52 [2021-06-15T13:36:52.147Z] terminateProcessInSuspendedState  Time elapsed: 0.205 s
09:36:52 [2021-06-15T13:36:52.147Z] stepOverOnProcess  Time elapsed: 0.306 s
09:36:52 [2021-06-15T13:36:52.147Z] nativeArrayVariable  Time elapsed: 0.305 s
09:36:52 [2021-06-15T13:36:52.147Z] disconnectDebugTargetInSuspendedState  Time elapsed: 0.206 s
09:36:52 [2021-06-15T13:36:52.147Z] stepIntoOnProcess  Time elapsed: 0.307 s
09:36:52 [2021-06-15T13:36:52.147Z] terminatedState  Time elapsed: 0.104 s
09:36:52 [2021-06-15T13:36:52.147Z] stepOverIncludeCommand  Time elapsed: 0.405 s
09:36:52 [2021-06-15T13:36:52.147Z] innerScopeVariableBeforeOuterScopeVariable  Time elapsed: 0.304 s
09:36:52 [2021-06-15T13:36:52.147Z] stepIntoIncludeCommand  Time elapsed: 0.305 s
09:36:52 [2021-06-15T13:36:52.147Z] primitiveStringVariable  Time elapsed: 0.305 s
09:36:52 [2021-06-15T13:36:52.147Z] resumeOnProcess  Time elapsed: 0.204 s
09:36:52 [2021-06-15T13:36:52.147Z] stepIntoOnDebugTarget  Time elapsed: 0.305 s
09:36:52 [2021-06-15T13:36:52.147Z] stepOverOnThread  Time elapsed: 0.306 s
09:36:52 [2021-06-15T13:36:52.147Z] suspendedState  Time elapsed: 0.205 s
09:36:52 [2021-06-15T13:36:52.147Z] primitiveDoubleVariable  Time elapsed: 0.305 s
09:36:52 [2021-06-15T13:36:52.147Z] resumeOnStackFrame  Time elapsed: 0.207 s
09:36:52 [2021-06-15T13:36:52.147Z] nativeObjectVariable  Time elapsed: 0.305 s
09:36:52 [2021-06-15T13:36:52.147Z] terminateDebugTargetInSuspendedState  Time elapsed: 0.206 s
09:36:52 [2021-06-15T13:36:52.147Z] disconnectStackFrameInSuspendedState  Time elapsed: 0.205 s
09:36:52 [2021-06-15T13:36:52.147Z] stepReturnOnProcess  Time elapsed: 0.306 s
09:36:52 [2021-06-15T13:36:52.147Z] evaluateWatchExpression  Time elapsed: 0.32 s
09:36:52 [2021-06-15T13:36:52.147Z] 
09:36:52 [2021-06-15T13:36:52.147Z] Results:
09:36:52 [2021-06-15T13:36:52.147Z] 
09:36:52 [2021-06-15T13:36:52.147Z] Failures: 
09:36:52 [2021-06-15T13:36:52.148Z]   AbstractDebugTest.arrayVariableSorting:892 expected: <1> but was: <0>
09:36:52 [2021-06-15T13:36:52.148Z] 
09:36:52 [2021-06-15T13:36:52.148Z] Tests run: 42, Failures: 1, Errors: 0, Skipped: 0
09:36:52 [2021-06-15T13:36:52.148Z] 
09:36:53 [2021-06-15T13:36:53.076Z] [INFO] ------------------------------------------------------------------------
09:36:53 [2021-06-15T13:36:53.076Z] [INFO] Reactor Summary:
09:36:53 [2021-06-15T13:36:53.076Z] [INFO] 
09:36:53 [2021-06-15T13:36:53.076Z] [INFO] org.eclipse.ease.classloader 0.8.0-SNAPSHOT ........ SUCCESS [ 49.406 s]
09:36:53 [2021-06-15T13:36:53.076Z] [INFO] org.eclipse.ease 0.8.0-SNAPSHOT .................... SUCCESS [ 15.424 s]
09:36:53 [2021-06-15T13:36:53.076Z] [INFO] org.eclipse.ease.ui 0.8.0-SNAPSHOT ................. SUCCESS [ 18.627 s]
09:36:53 [2021-06-15T13:36:53.076Z] [INFO] org.eclipse.ease.ui.completions.java 0.8.0-SNAPSHOT  SUCCESS [  6.480 s]
09:36:53 [2021-06-15T13:36:53.076Z] [INFO] org.eclipse.ease.ui.scripts 0.8.0-SNAPSHOT ......... SUCCESS [ 14.542 s]
09:36:53 [2021-06-15T13:36:53.076Z] [INFO] org.eclipse.ease.releng 0.8.0-SNAPSHOT ............. SUCCESS [  0.388 s]
09:36:53 [2021-06-15T13:36:53.076Z] [INFO] org.eclipse.ease.lang.javascript 0.8.0-SNAPSHOT .... SUCCESS [  4.936 s]
09:36:53 [2021-06-15T13:36:53.076Z] [INFO] org.eclipse.ease.lang.scriptarchive 0.8.0-SNAPSHOT . SUCCESS [  3.989 s]
09:36:53 [2021-06-15T13:36:53.076Z] [INFO] org.eclipse.ease.lang.python 0.8.0-SNAPSHOT ........ SUCCESS [  6.172 s]
09:36:53 [2021-06-15T13:36:53.076Z] [INFO] org.eclipse.ease.lang.python.py4j 0.8.0-SNAPSHOT ... SUCCESS [  5.910 s]
09:36:53 [2021-06-15T13:36:53.076Z] [INFO] org.eclipse.ease.lang.groovy 0.8.0-SNAPSHOT ........ SUCCESS [  3.721 s]
09:36:53 [2021-06-15T13:36:53.076Z] [INFO] org.eclipse.ease.lang.groovy.interpreter 0.8.0-SNAPSHOT SUCCESS [  4.197 s]
09:36:53 [2021-06-15T13:36:53.076Z] [INFO] org.eclipse.ease.lang.unittest 0.8.0-SNAPSHOT ...... SUCCESS [  8.291 s]
09:36:53 [2021-06-15T13:36:53.076Z] [INFO] org.eclipse.ease.lang.unittest.ui 0.8.0-SNAPSHOT ... SUCCESS [  9.797 s]
09:36:53 [2021-06-15T13:36:53.076Z] [INFO] org.eclipse.ease.lang.ruby 0.8.0-SNAPSHOT .......... SUCCESS [  4.398 s]
09:36:53 [2021-06-15T13:36:53.076Z] [INFO] org.eclipse.ease.lang.ruby.jruby 0.8.0-SNAPSHOT .... SUCCESS [  4.059 s]
09:36:53 [2021-06-15T13:36:53.076Z] [INFO] org.eclipse.ease.lang.javascript.nashorn 0.8.0-SNAPSHOT SUCCESS [  4.534 s]
09:36:53 [2021-06-15T13:36:53.076Z] [INFO] org.eclipse.ease.lang.javascript.rhino 0.8.0-SNAPSHOT SUCCESS [  6.607 s]
09:36:53 [2021-06-15T13:36:53.076Z] [INFO] org.eclipse.ease.lang.python.jython 0.8.0-SNAPSHOT . SUCCESS [  6.148 s]
09:36:53 [2021-06-15T13:36:53.076Z] [INFO] org.eclipse.ease.lang.javascript.ui 0.8.0-SNAPSHOT . SUCCESS [  4.383 s]
09:36:53 [2021-06-15T13:36:53.076Z] [INFO] org.eclipse.ease.lang.jvm.compiled 0.8.0-SNAPSHOT .. SUCCESS [  4.374 s]
09:36:53 [2021-06-15T13:36:53.076Z] [INFO] org.eclipse.ease.lang.scriptarchive.ui 0.8.0-SNAPSHOT SUCCESS [  5.593 s]
09:36:53 [2021-06-15T13:36:53.076Z] [INFO] org.eclipse.ease.help 0.8.0-SNAPSHOT ............... SUCCESS [  6.774 s]
09:36:53 [2021-06-15T13:36:53.076Z] [INFO] org.eclipse.ease.feature 0.8.0-SNAPSHOT ............ SUCCESS [  0.287 s]
09:36:53 [2021-06-15T13:36:53.076Z] [INFO] org.eclipse.ease.ui.feature 0.8.0-SNAPSHOT ......... SUCCESS [  0.120 s]
09:36:53 [2021-06-15T13:36:53.076Z] [INFO] org.eclipse.ease.lang.javascript.feature 0.8.0-SNAPSHOT SUCCESS [  0.114 s]
09:36:53 [2021-06-15T13:36:53.076Z] [INFO] org.eclipse.ease.lang.python.feature 0.8.0-SNAPSHOT  SUCCESS [  0.095 s]
09:36:53 [2021-06-15T13:36:53.076Z] [INFO] org.eclipse.ease.python.jython.feature 0.8.0-SNAPSHOT SUCCESS [  0.094 s]
09:36:53 [2021-06-15T13:36:53.076Z] [INFO] org.eclipse.ease.lang.python.py4j.feature 0.8.0-SNAPSHOT SUCCESS [  0.048 s]
09:36:53 [2021-06-15T13:36:53.076Z] [INFO] org.eclipse.ease.lang.jvm.feature 0.8.0-SNAPSHOT ... SUCCESS [  0.145 s]
09:36:53 [2021-06-15T13:36:53.076Z] [INFO] org.eclipse.ease.lang.groovy.feature 0.8.0-SNAPSHOT  SUCCESS [  0.159 s]
09:36:53 [2021-06-15T13:36:53.076Z] [INFO] org.eclipse.ease.lang.ruby.feature 0.8.0-SNAPSHOT .. SUCCESS [  0.134 s]
09:36:53 [2021-06-15T13:36:53.076Z] [INFO] org.eclipse.ease.lang.scriptarchive.feature 0.8.0-SNAPSHOT SUCCESS [  0.125 s]
09:36:53 [2021-06-15T13:36:53.076Z] [INFO] org.eclipse.ease.lang.unittest.feature 0.8.0-SNAPSHOT SUCCESS [  0.143 s]
09:36:53 [2021-06-15T13:36:53.076Z] [INFO] org.eclipse.ease.releng.target 0.8.0-SNAPSHOT ...... SUCCESS [  0.030 s]
09:36:53 [2021-06-15T13:36:53.076Z] [INFO] org.eclipse.ease.releng.p2 0.8.0-SNAPSHOT .......... SUCCESS [  4.434 s]
09:36:53 [2021-06-15T13:36:53.076Z] [INFO] org.eclipse.ease.testhelper 0.8.0-SNAPSHOT ......... SUCCESS [  7.087 s]
09:36:53 [2021-06-15T13:36:53.076Z] [INFO] org.eclipse.ease.test 0.8.0-SNAPSHOT ............... SUCCESS [ 22.053 s]
09:36:53 [2021-06-15T13:36:53.076Z] [INFO] org.eclipse.ease.lang.javascript.rhino.test 0.8.0-SNAPSHOT SUCCESS [ 21.004 s]
09:36:53 [2021-06-15T13:36:53.076Z] [INFO] org.eclipse.ease.lang.javascript.test 0.8.0-SNAPSHOT SUCCESS [  6.848 s]
09:36:53 [2021-06-15T13:36:53.076Z] [INFO] org.eclipse.ease.lang.python.test 0.8.0-SNAPSHOT ... SUCCESS [  6.553 s]
09:36:53 [2021-06-15T13:36:53.076Z] [INFO] org.eclipse.ease.lang.python.jython.test 0.8.0-SNAPSHOT FAILURE [ 18.914 s]
09:36:53 [2021-06-15T13:36:53.076Z] [INFO] org.eclipse.ease.lang.scriptarchive.test 0.8.0-SNAPSHOT SKIPPED
09:36:53 [2021-06-15T13:36:53.076Z] [INFO] org.eclipse.ease.lang.unittest.test 0.8.0-SNAPSHOT . SKIPPED
09:36:53 [2021-06-15T13:36:53.076Z] [INFO] org.eclipse.ease.ui.scripts.test 0.8.0-SNAPSHOT .... SKIPPED
09:36:53 [2021-06-15T13:36:53.076Z] [INFO] org.eclipse.ease.ui.test 0.8.0-SNAPSHOT ............ SKIPPED
09:36:53 [2021-06-15T13:36:53.076Z] [INFO] org.eclipse.ease.releng.coverage 0.8.0-SNAPSHOT .... SKIPPED
09:36:53 [2021-06-15T13:36:53.076Z] [INFO] EASE (Incubation) 0.4.0-SNAPSHOT ................... SKIPPED
09:36:53 [2021-06-15T13:36:53.076Z] [INFO] ------------------------------------------------------------------------
09:36:53 [2021-06-15T13:36:53.076Z] [INFO] BUILD FAILURE
09:36:53 [2021-06-15T13:36:53.076Z] [INFO] ------------------------------------------------------------------------
09:36:53 [2021-06-15T13:36:53.076Z] [INFO] Total time:  07:22 min
09:36:53 [2021-06-15T13:36:53.076Z] [INFO] Finished at: 2021-06-15T13:36:52Z
09:36:53 [2021-06-15T13:36:53.076Z] [INFO] ------------------------------------------------------------------------
09:36:53 [2021-06-15T13:36:53.076Z] [INFO] [jenkins-event-spy] Generated /home/jenkins/agent/workspace/ease.verify.core.target.2019-06@tmp/withMavend6334c6d/maven-spy-20210615-132929-97914624404034854430930.log
09:36:53 [2021-06-15T13:36:53.077Z] [ERROR] Failed to execute goal org.eclipse.tycho:tycho-surefire-plugin:2.2.0:test (default-test) on project org.eclipse.ease.lang.python.jython.test: There are test failures.
09:36:53 [2021-06-15T13:36:53.077Z] [ERROR] 
09:36:53 [2021-06-15T13:36:53.077Z] [ERROR] Please refer to /home/jenkins/agent/workspace/ease.verify.core.target.2019-06/tests/org.eclipse.ease.lang.python.jython.test/target/surefire-reports for the individual test results.
09:36:53 [2021-06-15T13:36:53.077Z] [ERROR] -> [Help 1]
09:36:53 [2021-06-15T13:36:53.077Z] [ERROR] 
09:36:53 [2021-06-15T13:36:53.077Z] [ERROR] To see the full stack trace of the errors, re-run Maven with the -e switch.
09:36:53 [2021-06-15T13:36:53.077Z] [ERROR] Re-run Maven using the -X switch to enable full debug logging.
09:36:53 [2021-06-15T13:36:53.077Z] [ERROR] 
09:36:53 [2021-06-15T13:36:53.077Z] [ERROR] For more information about the errors and possible solutions, please read the following articles:
09:36:53 [2021-06-15T13:36:53.077Z] [ERROR] [Help 1] http://cwiki.apache.org/confluence/display/MAVEN/MojoFailureException
09:36:53 [2021-06-15T13:36:53.077Z] [ERROR] 
09:36:53 [2021-06-15T13:36:53.077Z] [ERROR] After correcting the problems, you can resume the build with the command
09:36:53 [2021-06-15T13:36:53.077Z] [ERROR]   mvn <args> -rf :org.eclipse.ease.lang.python.jython.test
[Pipeline] }
09:36:54 [2021-06-15T13:36:54.261Z] [withMaven] junitPublisher - Archive test results for Maven artifact org.eclipse.ease:org.eclipse.ease.test:eclipse-test-plugin:0.8.0-SNAPSHOT generated by tycho-surefire-plugin:test (default-test): tests/org.eclipse.ease.test/target/surefire-reports/*.xml
09:36:54 [2021-06-15T13:36:54.262Z] [withMaven] junitPublisher - Archive test results for Maven artifact org.eclipse.ease:org.eclipse.ease.lang.javascript.rhino.test:eclipse-test-plugin:0.8.0-SNAPSHOT generated by tycho-surefire-plugin:test (default-test): tests/org.eclipse.ease.lang.javascript.rhino.test/target/surefire-reports/*.xml
09:36:54 [2021-06-15T13:36:54.262Z] [withMaven] junitPublisher - Archive test results for Maven artifact org.eclipse.ease:org.eclipse.ease.lang.javascript.test:eclipse-test-plugin:0.8.0-SNAPSHOT generated by tycho-surefire-plugin:test (default-test): tests/org.eclipse.ease.lang.javascript.test/target/surefire-reports/*.xml
09:36:54 [2021-06-15T13:36:54.262Z] [withMaven] junitPublisher - Archive test results for Maven artifact org.eclipse.ease:org.eclipse.ease.lang.python.test:eclipse-test-plugin:0.8.0-SNAPSHOT generated by tycho-surefire-plugin:test (default-test): tests/org.eclipse.ease.lang.python.test/target/surefire-reports/*.xml
09:36:54 [2021-06-15T13:36:54.262Z] [withMaven] junitPublisher - Archive test results for Maven artifact org.eclipse.ease:org.eclipse.ease.lang.python.jython.test:eclipse-test-plugin:0.8.0-SNAPSHOT generated by tycho-surefire-plugin:test (default-test): tests/org.eclipse.ease.lang.python.jython.test/target/surefire-reports/*.xml
09:36:54 [2021-06-15T13:36:54.263Z] [withMaven] junitPublisher - Jenkins JUnit Attachments Plugin not found, can't publish test attachments.Recording test results
09:36:55 [2021-06-15T13:36:55.704Z] [withMaven] Jenkins JaCoCo Plugin not found, don't display org.jacoco:jacoco-maven-plugin:prepare-agent[-integration] results in pipeline screen.
09:36:55 [2021-06-15T13:36:55.707Z] [withMaven] Jenkins FindBugs Plugin not found, don't display com.github.spotbugs:spotbugs-maven-plugin:spotbugs results in pipeline screen.
09:36:55 [2021-06-15T13:36:55.709Z] [withMaven] Publishers: Pipeline Graph Publisher: 51 ms, Invoker Publisher: 1 ms, Junit Publisher: 317 ms, Concordion Publisher: 1 ms, Dependencies Fingerprint Publisher: 1114 ms, Findbugs Publisher: 1 ms, Jacoco Publisher: 1 ms, SpotBugs Publisher: 1 ms
[Pipeline] // withMaven
[Pipeline] }
[Pipeline] // stage
[Pipeline] stage
[Pipeline] { (Test)
Stage "Test" skipped due to earlier failure(s)
[Pipeline] }
[Pipeline] // stage
[Pipeline] stage
[Pipeline] { (Declarative: Post Actions)
[Pipeline] archiveArtifacts
09:36:55 [2021-06-15T13:36:55.759Z] Archiving artifacts
[Pipeline] emailext
09:37:08 [2021-06-15T13:37:08.417Z] Sending email to: christian.pontesegger@web.de
[Pipeline] }
[Pipeline] // stage
[Pipeline] }
[Pipeline] // timeout
[Pipeline] }
[Pipeline] // timestamps
[Pipeline] }
[Pipeline] // node
[Pipeline] End of Pipeline
ERROR: script returned exit code 1
Finished: FAILURE