Console Output

Skipping 839 KB.. Full Log
09:51:37 [2021-06-01T13:51:37.161Z] End of script
09:51:37 [2021-06-01T13:51:37.419Z] Start of script
09:51:37 [2021-06-01T13:51:37.420Z] include file start
09:51:37 [2021-06-01T13:51:37.420Z] Include file processed
09:51:37 [2021-06-01T13:51:37.420Z] line after include file
09:51:37 [2021-06-01T13:51:37.679Z] org.eclipse.ease.ScriptEngineCancellationException: Terminated on user request
09:51:37 [2021-06-01T13:51:37.679Z] 	at org.eclipse.ease.debugging.AbstractEaseDebugger.handleEventsInSuspendedState(AbstractEaseDebugger.java:329)
09:51:37 [2021-06-01T13:51:37.679Z] 	at org.eclipse.ease.debugging.AbstractEaseDebugger.suspend(AbstractEaseDebugger.java:255)
09:51:37 [2021-06-01T13:51:37.679Z] 	at org.eclipse.ease.debugging.AbstractEaseDebugger.processLine(AbstractEaseDebugger.java:510)
09:51:37 [2021-06-01T13:51:37.679Z] 	at org.eclipse.ease.lang.javascript.rhino.debugger.RhinoDebugger.access$4(RhinoDebugger.java:1)
09:51:37 [2021-06-01T13:51:37.679Z] 	at org.eclipse.ease.lang.javascript.rhino.debugger.RhinoDebugger$RhinoDebugFrame.onLineChange(RhinoDebugger.java:122)
09:51:37 [2021-06-01T13:51:37.679Z] 	at org.mozilla.javascript.Interpreter.interpretLoop(Interpreter.java:1931)
09:51:37 [2021-06-01T13:51:37.679Z] 	at org.mozilla.javascript.Interpreter.interpret(Interpreter.java:911)
09:51:37 [2021-06-01T13:51:37.679Z] 	at org.mozilla.javascript.InterpretedFunction.call(InterpretedFunction.java:109)
09:51:37 [2021-06-01T13:51:37.679Z] 	at org.mozilla.javascript.ContextFactory.doTopCall(ContextFactory.java:405)
09:51:37 [2021-06-01T13:51:37.679Z] 	at org.mozilla.javascript.ScriptRuntime.doTopCall(ScriptRuntime.java:3508)
09:51:37 [2021-06-01T13:51:37.679Z] 	at org.mozilla.javascript.InterpretedFunction.exec(InterpretedFunction.java:120)
09:51:37 [2021-06-01T13:51:37.679Z] 	at org.mozilla.javascript.Context.evaluateReader(Context.java:1293)
09:51:37 [2021-06-01T13:51:37.679Z] 	at org.eclipse.ease.lang.javascript.rhino.RhinoScriptEngine.internalExecute(RhinoScriptEngine.java:224)
09:51:37 [2021-06-01T13:51:37.679Z] 	at org.eclipse.ease.lang.javascript.rhino.RhinoScriptEngine.execute(RhinoScriptEngine.java:203)
09:51:37 [2021-06-01T13:51:37.679Z] 	at org.eclipse.ease.AbstractScriptEngine.inject(AbstractScriptEngine.java:189)
09:51:37 [2021-06-01T13:51:37.679Z] 	at org.eclipse.ease.AbstractScriptEngine.run(AbstractScriptEngine.java:242)
09:51:37 [2021-06-01T13:51:37.679Z] 	at org.eclipse.core.internal.jobs.Worker.run(Worker.java:63)
09:51:37 [2021-06-01T13:51:37.937Z] Start of script
09:51:37 [2021-06-01T13:51:37.937Z] include file start
09:51:37 [2021-06-01T13:51:37.937Z] Include file processed
09:51:37 [2021-06-01T13:51:37.937Z] line after include file
09:51:37 [2021-06-01T13:51:37.937Z] Result of testMethod = 5
09:51:37 [2021-06-01T13:51:37.937Z] End of script
09:51:39 [2021-06-01T13:51:39.835Z] Start of script
09:51:39 [2021-06-01T13:51:39.835Z] include file start
09:51:39 [2021-06-01T13:51:39.835Z] Include file processed
09:51:39 [2021-06-01T13:51:39.835Z] line after include file
09:51:39 [2021-06-01T13:51:39.835Z] Result of testMethod = 5
09:51:39 [2021-06-01T13:51:39.835Z] End of script
09:51:40 [2021-06-01T13:51:40.093Z] org.eclipse.ease.ScriptEngineCancellationException: Terminated on user request
09:51:40 [2021-06-01T13:51:40.093Z] 	at org.eclipse.ease.debugging.AbstractEaseDebugger.handleEventsInSuspendedState(AbstractEaseDebugger.java:329)
09:51:40 [2021-06-01T13:51:40.093Z] 	at org.eclipse.ease.debugging.AbstractEaseDebugger.suspend(AbstractEaseDebugger.java:255)
09:51:40 [2021-06-01T13:51:40.093Z] 	at org.eclipse.ease.debugging.AbstractEaseDebugger.processLine(AbstractEaseDebugger.java:490)
09:51:40 [2021-06-01T13:51:40.093Z] 	at org.eclipse.ease.lang.javascript.rhino.debugger.RhinoDebugger.access$4(RhinoDebugger.java:1)
09:51:40 [2021-06-01T13:51:40.093Z] 	at org.eclipse.ease.lang.javascript.rhino.debugger.RhinoDebugger$RhinoDebugFrame.onLineChange(RhinoDebugger.java:122)
09:51:40 [2021-06-01T13:51:40.093Z] 	at org.mozilla.javascript.Interpreter.interpretLoop(Interpreter.java:1931)
09:51:40 [2021-06-01T13:51:40.093Z] 	at org.mozilla.javascript.Interpreter.interpret(Interpreter.java:911)
09:51:40 [2021-06-01T13:51:40.093Z] 	at org.mozilla.javascript.InterpretedFunction.call(InterpretedFunction.java:109)
09:51:40 [2021-06-01T13:51:40.093Z] 	at org.mozilla.javascript.ContextFactory.doTopCall(ContextFactory.java:405)
09:51:40 [2021-06-01T13:51:40.093Z] 	at org.mozilla.javascript.ScriptRuntime.doTopCall(ScriptRuntime.java:3508)
09:51:40 [2021-06-01T13:51:40.093Z] 	at org.mozilla.javascript.InterpretedFunction.exec(InterpretedFunction.java:120)
09:51:40 [2021-06-01T13:51:40.093Z] 	at org.mozilla.javascript.Context.evaluateReader(Context.java:1293)
09:51:40 [2021-06-01T13:51:40.093Z] 	at org.eclipse.ease.lang.javascript.rhino.RhinoScriptEngine.internalExecute(RhinoScriptEngine.java:224)
09:51:40 [2021-06-01T13:51:40.093Z] 	at org.eclipse.ease.lang.javascript.rhino.RhinoScriptEngine.execute(RhinoScriptEngine.java:203)
09:51:40 [2021-06-01T13:51:40.093Z] 	at org.eclipse.ease.AbstractScriptEngine.inject(AbstractScriptEngine.java:189)
09:51:40 [2021-06-01T13:51:40.093Z] 	at org.eclipse.ease.AbstractScriptEngine.run(AbstractScriptEngine.java:242)
09:51:40 [2021-06-01T13:51:40.093Z] 	at org.eclipse.core.internal.jobs.Worker.run(Worker.java:63)
09:51:40 [2021-06-01T13:51:40.659Z] Start of script
09:51:40 [2021-06-01T13:51:40.659Z] include file start
09:51:40 [2021-06-01T13:51:40.659Z] Include file processed
09:51:40 [2021-06-01T13:51:40.659Z] line after include file
09:51:40 [2021-06-01T13:51:40.659Z] Result of testMethod = 5
09:51:40 [2021-06-01T13:51:40.659Z] End of script
09:51:40 [2021-06-01T13:51:40.659Z] Start of script
09:51:40 [2021-06-01T13:51:40.659Z] include file start
09:51:40 [2021-06-01T13:51:40.659Z] Include file processed
09:51:40 [2021-06-01T13:51:40.659Z] line after include file
09:51:40 [2021-06-01T13:51:40.917Z] Result of testMethod = 5
09:51:40 [2021-06-01T13:51:40.917Z] End of script
09:51:40 [2021-06-01T13:51:40.917Z] Start of script
09:51:40 [2021-06-01T13:51:40.917Z] include file start
09:51:40 [2021-06-01T13:51:40.917Z] Include file processed
09:51:40 [2021-06-01T13:51:40.917Z] line after include file
09:51:40 [2021-06-01T13:51:40.917Z] Result of testMethod = 5
09:51:41 [2021-06-01T13:51:41.175Z] org.eclipse.ease.ScriptEngineCancellationException: Terminated on user request
09:51:41 [2021-06-01T13:51:41.175Z] 	at org.eclipse.ease.debugging.AbstractEaseDebugger.handleEventsInSuspendedState(AbstractEaseDebugger.java:329)
09:51:41 [2021-06-01T13:51:41.175Z] 	at org.eclipse.ease.debugging.AbstractEaseDebugger.suspend(AbstractEaseDebugger.java:255)
09:51:41 [2021-06-01T13:51:41.175Z] 	at org.eclipse.ease.debugging.AbstractEaseDebugger.processLine(AbstractEaseDebugger.java:490)
09:51:41 [2021-06-01T13:51:41.175Z] 	at org.eclipse.ease.lang.javascript.rhino.debugger.RhinoDebugger.access$4(RhinoDebugger.java:1)
09:51:41 [2021-06-01T13:51:41.175Z] 	at org.eclipse.ease.lang.javascript.rhino.debugger.RhinoDebugger$RhinoDebugFrame.onLineChange(RhinoDebugger.java:122)
09:51:41 [2021-06-01T13:51:41.175Z] 	at org.mozilla.javascript.Interpreter.interpretLoop(Interpreter.java:1931)
09:51:41 [2021-06-01T13:51:41.175Z] 	at org.mozilla.javascript.Interpreter.interpret(Interpreter.java:911)
09:51:41 [2021-06-01T13:51:41.175Z] 	at org.mozilla.javascript.InterpretedFunction.call(InterpretedFunction.java:109)
09:51:41 [2021-06-01T13:51:41.175Z] 	at org.mozilla.javascript.ContextFactory.doTopCall(ContextFactory.java:405)
09:51:41 [2021-06-01T13:51:41.175Z] 	at org.mozilla.javascript.ScriptRuntime.doTopCall(ScriptRuntime.java:3508)
09:51:41 [2021-06-01T13:51:41.175Z] 	at org.mozilla.javascript.InterpretedFunction.exec(InterpretedFunction.java:120)
09:51:41 [2021-06-01T13:51:41.175Z] 	at org.mozilla.javascript.Context.evaluateReader(Context.java:1293)
09:51:41 [2021-06-01T13:51:41.175Z] 	at org.eclipse.ease.lang.javascript.rhino.RhinoScriptEngine.internalExecute(RhinoScriptEngine.java:224)
09:51:41 [2021-06-01T13:51:41.175Z] 	at org.eclipse.ease.lang.javascript.rhino.RhinoScriptEngine.execute(RhinoScriptEngine.java:203)
09:51:41 [2021-06-01T13:51:41.175Z] 	at org.eclipse.ease.AbstractScriptEngine.inject(AbstractScriptEngine.java:189)
09:51:41 [2021-06-01T13:51:41.175Z] 	at org.eclipse.ease.AbstractScriptEngine.run(AbstractScriptEngine.java:242)
09:51:41 [2021-06-01T13:51:41.175Z] 	at org.eclipse.core.internal.jobs.Worker.run(Worker.java:63)
09:51:42 [2021-06-01T13:51:42.109Z] Start of script
09:51:42 [2021-06-01T13:51:42.109Z] include file start
09:51:42 [2021-06-01T13:51:42.109Z] Include file processed
09:51:42 [2021-06-01T13:51:42.109Z] line after include file
09:51:42 [2021-06-01T13:51:42.367Z] Result of testMethod = 5
09:51:42 [2021-06-01T13:51:42.367Z] End of script
09:51:42 [2021-06-01T13:51:42.626Z] org.eclipse.ease.ScriptEngineCancellationException: Terminated on user request
09:51:42 [2021-06-01T13:51:42.626Z] 	at org.eclipse.ease.debugging.AbstractEaseDebugger.handleEventsInSuspendedState(AbstractEaseDebugger.java:329)
09:51:42 [2021-06-01T13:51:42.626Z] 	at org.eclipse.ease.debugging.AbstractEaseDebugger.suspend(AbstractEaseDebugger.java:255)
09:51:42 [2021-06-01T13:51:42.626Z] 	at org.eclipse.ease.debugging.AbstractEaseDebugger.processLine(AbstractEaseDebugger.java:490)
09:51:42 [2021-06-01T13:51:42.626Z] 	at org.eclipse.ease.lang.javascript.rhino.debugger.RhinoDebugger.access$4(RhinoDebugger.java:1)
09:51:42 [2021-06-01T13:51:42.626Z] 	at org.eclipse.ease.lang.javascript.rhino.debugger.RhinoDebugger$RhinoDebugFrame.onLineChange(RhinoDebugger.java:122)
09:51:42 [2021-06-01T13:51:42.626Z] 	at org.mozilla.javascript.Interpreter.interpretLoop(Interpreter.java:1931)
09:51:42 [2021-06-01T13:51:42.626Z] 	at org.mozilla.javascript.Interpreter.interpret(Interpreter.java:911)
09:51:42 [2021-06-01T13:51:42.626Z] 	at org.mozilla.javascript.InterpretedFunction.call(InterpretedFunction.java:109)
09:51:42 [2021-06-01T13:51:42.626Z] 	at org.mozilla.javascript.ContextFactory.doTopCall(ContextFactory.java:405)
09:51:42 [2021-06-01T13:51:42.626Z] 	at org.mozilla.javascript.ScriptRuntime.doTopCall(ScriptRuntime.java:3508)
09:51:42 [2021-06-01T13:51:42.626Z] 	at org.mozilla.javascript.InterpretedFunction.exec(InterpretedFunction.java:120)
09:51:42 [2021-06-01T13:51:42.626Z] 	at org.mozilla.javascript.Context.evaluateReader(Context.java:1293)
09:51:42 [2021-06-01T13:51:42.626Z] 	at org.eclipse.ease.lang.javascript.rhino.RhinoScriptEngine.internalExecute(RhinoScriptEngine.java:224)
09:51:42 [2021-06-01T13:51:42.626Z] 	at org.eclipse.ease.lang.javascript.rhino.RhinoScriptEngine.execute(RhinoScriptEngine.java:203)
09:51:42 [2021-06-01T13:51:42.626Z] 	at org.eclipse.ease.AbstractScriptEngine.inject(AbstractScriptEngine.java:189)
09:51:42 [2021-06-01T13:51:42.626Z] 	at org.eclipse.ease.AbstractScriptEngine.run(AbstractScriptEngine.java:242)
09:51:42 [2021-06-01T13:51:42.626Z] 	at org.eclipse.core.internal.jobs.Worker.run(Worker.java:63)
09:51:43 [2021-06-01T13:51:43.192Z] Start of script
09:51:43 [2021-06-01T13:51:43.192Z] include file start
09:51:43 [2021-06-01T13:51:43.192Z] Include file processed
09:51:43 [2021-06-01T13:51:43.192Z] line after include file
09:51:43 [2021-06-01T13:51:43.192Z] Result of testMethod = 5
09:51:43 [2021-06-01T13:51:43.192Z] End of script
09:51:43 [2021-06-01T13:51:43.450Z] Start of script
09:51:43 [2021-06-01T13:51:43.450Z] include file start
09:51:43 [2021-06-01T13:51:43.450Z] Include file processed
09:51:43 [2021-06-01T13:51:43.450Z] line after include file
09:51:43 [2021-06-01T13:51:43.708Z] Result of testMethod = 5
09:51:43 [2021-06-01T13:51:43.708Z] End of script
09:51:43 [2021-06-01T13:51:43.967Z] org.eclipse.ease.ScriptEngineCancellationException: Terminated on user request
09:51:43 [2021-06-01T13:51:43.967Z] 	at org.eclipse.ease.debugging.AbstractEaseDebugger.handleEventsInSuspendedState(AbstractEaseDebugger.java:329)
09:51:43 [2021-06-01T13:51:43.967Z] 	at org.eclipse.ease.debugging.AbstractEaseDebugger.suspend(AbstractEaseDebugger.java:255)
09:51:43 [2021-06-01T13:51:43.967Z] 	at org.eclipse.ease.debugging.AbstractEaseDebugger.processLine(AbstractEaseDebugger.java:490)
09:51:43 [2021-06-01T13:51:43.967Z] 	at org.eclipse.ease.lang.javascript.rhino.debugger.RhinoDebugger.access$4(RhinoDebugger.java:1)
09:51:43 [2021-06-01T13:51:43.967Z] 	at org.eclipse.ease.lang.javascript.rhino.debugger.RhinoDebugger$RhinoDebugFrame.onLineChange(RhinoDebugger.java:122)
09:51:43 [2021-06-01T13:51:43.967Z] 	at org.mozilla.javascript.Interpreter.interpretLoop(Interpreter.java:1931)
09:51:43 [2021-06-01T13:51:43.967Z] 	at org.mozilla.javascript.Interpreter.interpret(Interpreter.java:911)
09:51:43 [2021-06-01T13:51:43.967Z] 	at org.mozilla.javascript.InterpretedFunction.call(InterpretedFunction.java:109)
09:51:43 [2021-06-01T13:51:43.967Z] 	at org.mozilla.javascript.ContextFactory.doTopCall(ContextFactory.java:405)
09:51:43 [2021-06-01T13:51:43.967Z] 	at org.mozilla.javascript.ScriptRuntime.doTopCall(ScriptRuntime.java:3508)
09:51:43 [2021-06-01T13:51:43.967Z] 	at org.mozilla.javascript.InterpretedFunction.exec(InterpretedFunction.java:120)
09:51:43 [2021-06-01T13:51:43.967Z] 	at org.mozilla.javascript.Context.evaluateReader(Context.java:1293)
09:51:43 [2021-06-01T13:51:43.967Z] 	at org.eclipse.ease.lang.javascript.rhino.RhinoScriptEngine.internalExecute(RhinoScriptEngine.java:224)
09:51:43 [2021-06-01T13:51:43.967Z] 	at org.eclipse.ease.lang.javascript.rhino.RhinoScriptEngine.execute(RhinoScriptEngine.java:203)
09:51:43 [2021-06-01T13:51:43.967Z] 	at org.eclipse.ease.AbstractScriptEngine.inject(AbstractScriptEngine.java:189)
09:51:43 [2021-06-01T13:51:43.967Z] 	at org.eclipse.ease.AbstractScriptEngine.run(AbstractScriptEngine.java:242)
09:51:43 [2021-06-01T13:51:43.967Z] 	at org.eclipse.core.internal.jobs.Worker.run(Worker.java:63)
09:51:43 [2021-06-01T13:51:43.967Z] Start of script
09:51:43 [2021-06-01T13:51:43.967Z] include file start
09:51:43 [2021-06-01T13:51:43.967Z] Include file processed
09:51:43 [2021-06-01T13:51:43.967Z] line after include file
09:51:44 [2021-06-01T13:51:44.225Z] Result of testMethod = 5
09:51:44 [2021-06-01T13:51:44.225Z] End of script
09:51:44 [2021-06-01T13:51:44.482Z] Start of script
09:51:44 [2021-06-01T13:51:44.482Z] include file start
09:51:44 [2021-06-01T13:51:44.482Z] Include file processed
09:51:44 [2021-06-01T13:51:44.482Z] line after include file
09:51:44 [2021-06-01T13:51:44.482Z] Result of testMethod = 5
09:51:44 [2021-06-01T13:51:44.482Z] WARNING: An illegal reflective access operation has occurred
09:51:44 [2021-06-01T13:51:44.482Z] WARNING: Illegal reflective access by org.eclipse.ease.debugging.model.EaseDebugValue (file:/home/jenkins/agent/workspace/ease.verify.core.target.2019-06/plugins/org.eclipse.ease/target/org.eclipse.ease-0.8.0-SNAPSHOT.jar) to field java.lang.String.hash
09:51:44 [2021-06-01T13:51:44.482Z] WARNING: Please consider reporting this to the maintainers of org.eclipse.ease.debugging.model.EaseDebugValue
09:51:44 [2021-06-01T13:51:44.482Z] WARNING: Use --illegal-access=warn to enable warnings of further illegal reflective access operations
09:51:44 [2021-06-01T13:51:44.482Z] WARNING: All illegal access operations will be denied in a future release
09:51:44 [2021-06-01T13:51:44.483Z] org.eclipse.ease.ScriptEngineCancellationException: Terminated on user request
09:51:44 [2021-06-01T13:51:44.483Z] 	at org.eclipse.ease.debugging.AbstractEaseDebugger.handleEventsInSuspendedState(AbstractEaseDebugger.java:329)
09:51:44 [2021-06-01T13:51:44.483Z] 	at org.eclipse.ease.debugging.AbstractEaseDebugger.suspend(AbstractEaseDebugger.java:255)
09:51:44 [2021-06-01T13:51:44.483Z] 	at org.eclipse.ease.debugging.AbstractEaseDebugger.processLine(AbstractEaseDebugger.java:490)
09:51:44 [2021-06-01T13:51:44.483Z] 	at org.eclipse.ease.lang.javascript.rhino.debugger.RhinoDebugger.access$4(RhinoDebugger.java:1)
09:51:44 [2021-06-01T13:51:44.483Z] 	at org.eclipse.ease.lang.javascript.rhino.debugger.RhinoDebugger$RhinoDebugFrame.onLineChange(RhinoDebugger.java:122)
09:51:44 [2021-06-01T13:51:44.483Z] 	at org.mozilla.javascript.Interpreter.interpretLoop(Interpreter.java:1931)
09:51:44 [2021-06-01T13:51:44.483Z] 	at org.mozilla.javascript.Interpreter.interpret(Interpreter.java:911)
09:51:44 [2021-06-01T13:51:44.483Z] 	at org.mozilla.javascript.InterpretedFunction.call(InterpretedFunction.java:109)
09:51:44 [2021-06-01T13:51:44.483Z] 	at org.mozilla.javascript.ContextFactory.doTopCall(ContextFactory.java:405)
09:51:44 [2021-06-01T13:51:44.483Z] 	at org.mozilla.javascript.ScriptRuntime.doTopCall(ScriptRuntime.java:3508)
09:51:44 [2021-06-01T13:51:44.483Z] 	at org.mozilla.javascript.InterpretedFunction.exec(InterpretedFunction.java:120)
09:51:44 [2021-06-01T13:51:44.483Z] 	at org.mozilla.javascript.Context.evaluateReader(Context.java:1293)
09:51:44 [2021-06-01T13:51:44.483Z] 	at org.eclipse.ease.lang.javascript.rhino.RhinoScriptEngine.internalExecute(RhinoScriptEngine.java:224)
09:51:44 [2021-06-01T13:51:44.483Z] 	at org.eclipse.ease.lang.javascript.rhino.RhinoScriptEngine.execute(RhinoScriptEngine.java:203)
09:51:44 [2021-06-01T13:51:44.483Z] 	at org.eclipse.ease.AbstractScriptEngine.inject(AbstractScriptEngine.java:189)
09:51:44 [2021-06-01T13:51:44.483Z] 	at org.eclipse.ease.AbstractScriptEngine.run(AbstractScriptEngine.java:242)
09:51:44 [2021-06-01T13:51:44.483Z] 	at org.eclipse.core.internal.jobs.Worker.run(Worker.java:63)
09:51:45 [2021-06-01T13:51:45.048Z] Start of script
09:51:45 [2021-06-01T13:51:45.048Z] include file start
09:51:45 [2021-06-01T13:51:45.048Z] Include file processed
09:51:45 [2021-06-01T13:51:45.048Z] line after include file
09:51:45 [2021-06-01T13:51:45.048Z] Result of testMethod = 5
09:51:45 [2021-06-01T13:51:45.049Z] End of script
09:51:45 [2021-06-01T13:51:45.615Z] Start of script
09:51:45 [2021-06-01T13:51:45.615Z] include file start
09:51:45 [2021-06-01T13:51:45.615Z] Include file processed
09:51:45 [2021-06-01T13:51:45.615Z] line after include file
09:51:45 [2021-06-01T13:51:45.615Z] Result of testMethod = 5
09:51:45 [2021-06-01T13:51:45.615Z] End of script
09:51:45 [2021-06-01T13:51:45.873Z] Start of script
09:51:45 [2021-06-01T13:51:45.873Z] include file start
09:51:45 [2021-06-01T13:51:45.873Z] Include file processed
09:51:45 [2021-06-01T13:51:45.873Z] line after include file
09:51:45 [2021-06-01T13:51:45.873Z] Result of testMethod = 5
09:51:45 [2021-06-01T13:51:45.873Z] End of script
09:51:45 [2021-06-01T13:51:45.873Z] Start of script
09:51:46 [2021-06-01T13:51:46.145Z] include file start
09:51:46 [2021-06-01T13:51:46.145Z] Include file processed
09:51:46 [2021-06-01T13:51:46.145Z] line after include file
09:51:46 [2021-06-01T13:51:46.145Z] Result of testMethod = 5
09:51:46 [2021-06-01T13:51:46.145Z] End of script
09:51:50 [2021-06-01T13:51:50.331Z] Start of script
09:51:50 [2021-06-01T13:51:50.331Z] include file start
09:51:50 [2021-06-01T13:51:50.331Z] Include file processed
09:51:50 [2021-06-01T13:51:50.331Z] line after include file
09:51:50 [2021-06-01T13:51:50.331Z] org.eclipse.ease.ScriptEngineCancellationException: Terminated on user request
09:51:50 [2021-06-01T13:51:50.331Z] 	at org.eclipse.ease.debugging.AbstractEaseDebugger.handleEventsInSuspendedState(AbstractEaseDebugger.java:329)
09:51:50 [2021-06-01T13:51:50.331Z] 	at org.eclipse.ease.debugging.AbstractEaseDebugger.suspend(AbstractEaseDebugger.java:255)
09:51:50 [2021-06-01T13:51:50.331Z] 	at org.eclipse.ease.debugging.AbstractEaseDebugger.processLine(AbstractEaseDebugger.java:490)
09:51:50 [2021-06-01T13:51:50.331Z] 	at org.eclipse.ease.lang.javascript.rhino.debugger.RhinoDebugger.access$4(RhinoDebugger.java:1)
09:51:50 [2021-06-01T13:51:50.331Z] 	at org.eclipse.ease.lang.javascript.rhino.debugger.RhinoDebugger$RhinoDebugFrame.onLineChange(RhinoDebugger.java:122)
09:51:50 [2021-06-01T13:51:50.331Z] 	at org.mozilla.javascript.Interpreter.interpretLoop(Interpreter.java:1931)
09:51:50 [2021-06-01T13:51:50.331Z] 	at org.mozilla.javascript.Interpreter.interpret(Interpreter.java:911)
09:51:50 [2021-06-01T13:51:50.331Z] 	at org.mozilla.javascript.InterpretedFunction.call(InterpretedFunction.java:109)
09:51:50 [2021-06-01T13:51:50.331Z] 	at org.mozilla.javascript.ContextFactory.doTopCall(ContextFactory.java:405)
09:51:50 [2021-06-01T13:51:50.331Z] 	at org.mozilla.javascript.ScriptRuntime.doTopCall(ScriptRuntime.java:3508)
09:51:50 [2021-06-01T13:51:50.331Z] 	at org.mozilla.javascript.InterpretedFunction.exec(InterpretedFunction.java:120)
09:51:50 [2021-06-01T13:51:50.331Z] 	at org.mozilla.javascript.Context.evaluateReader(Context.java:1293)
09:51:50 [2021-06-01T13:51:50.331Z] 	at org.eclipse.ease.lang.javascript.rhino.RhinoScriptEngine.internalExecute(RhinoScriptEngine.java:224)
09:51:50 [2021-06-01T13:51:50.331Z] 	at org.eclipse.ease.lang.javascript.rhino.RhinoScriptEngine.execute(RhinoScriptEngine.java:203)
09:51:50 [2021-06-01T13:51:50.331Z] 	at org.eclipse.ease.AbstractScriptEngine.inject(AbstractScriptEngine.java:189)
09:51:50 [2021-06-01T13:51:50.331Z] 	at org.eclipse.ease.AbstractScriptEngine.run(AbstractScriptEngine.java:242)
09:51:50 [2021-06-01T13:51:50.331Z] 	at org.eclipse.core.internal.jobs.Worker.run(Worker.java:63)
09:51:51 [2021-06-01T13:51:51.277Z] Start of script
09:51:51 [2021-06-01T13:51:51.277Z] include file start
09:51:51 [2021-06-01T13:51:51.277Z] Include file processed
09:51:51 [2021-06-01T13:51:51.277Z] line after include file
09:51:51 [2021-06-01T13:51:51.277Z] Result of testMethod = 5
09:51:51 [2021-06-01T13:51:51.277Z] End of script
09:51:51 [2021-06-01T13:51:51.844Z] Start of script
09:51:51 [2021-06-01T13:51:51.844Z] include file start
09:51:51 [2021-06-01T13:51:51.844Z] Include file processed
09:51:51 [2021-06-01T13:51:51.844Z] line after include file
09:51:51 [2021-06-01T13:51:51.844Z] Result of testMethod = 5
09:51:51 [2021-06-01T13:51:51.844Z] org.eclipse.ease.ScriptEngineCancellationException: Terminated on user request
09:51:51 [2021-06-01T13:51:51.845Z] 	at org.eclipse.ease.debugging.AbstractEaseDebugger.handleEventsInSuspendedState(AbstractEaseDebugger.java:329)
09:51:51 [2021-06-01T13:51:51.845Z] 	at org.eclipse.ease.debugging.AbstractEaseDebugger.suspend(AbstractEaseDebugger.java:255)
09:51:51 [2021-06-01T13:51:51.845Z] 	at org.eclipse.ease.debugging.AbstractEaseDebugger.processLine(AbstractEaseDebugger.java:490)
09:51:51 [2021-06-01T13:51:51.845Z] 	at org.eclipse.ease.lang.javascript.rhino.debugger.RhinoDebugger.access$4(RhinoDebugger.java:1)
09:51:51 [2021-06-01T13:51:51.845Z] 	at org.eclipse.ease.lang.javascript.rhino.debugger.RhinoDebugger$RhinoDebugFrame.onLineChange(RhinoDebugger.java:122)
09:51:51 [2021-06-01T13:51:51.845Z] 	at org.mozilla.javascript.Interpreter.interpretLoop(Interpreter.java:1931)
09:51:51 [2021-06-01T13:51:51.845Z] 	at org.mozilla.javascript.Interpreter.interpret(Interpreter.java:911)
09:51:51 [2021-06-01T13:51:51.845Z] 	at org.mozilla.javascript.InterpretedFunction.call(InterpretedFunction.java:109)
09:51:51 [2021-06-01T13:51:51.845Z] 	at org.mozilla.javascript.ContextFactory.doTopCall(ContextFactory.java:405)
09:51:51 [2021-06-01T13:51:51.845Z] 	at org.mozilla.javascript.ScriptRuntime.doTopCall(ScriptRuntime.java:3508)
09:51:51 [2021-06-01T13:51:51.845Z] 	at org.mozilla.javascript.InterpretedFunction.exec(InterpretedFunction.java:120)
09:51:51 [2021-06-01T13:51:51.845Z] 	at org.mozilla.javascript.Context.evaluateReader(Context.java:1293)
09:51:51 [2021-06-01T13:51:51.845Z] 	at org.eclipse.ease.lang.javascript.rhino.RhinoScriptEngine.internalExecute(RhinoScriptEngine.java:224)
09:51:51 [2021-06-01T13:51:51.845Z] 	at org.eclipse.ease.lang.javascript.rhino.RhinoScriptEngine.execute(RhinoScriptEngine.java:203)
09:51:51 [2021-06-01T13:51:51.845Z] 	at org.eclipse.ease.AbstractScriptEngine.inject(AbstractScriptEngine.java:189)
09:51:51 [2021-06-01T13:51:51.845Z] 	at org.eclipse.ease.AbstractScriptEngine.run(AbstractScriptEngine.java:242)
09:51:51 [2021-06-01T13:51:51.845Z] 	at org.eclipse.core.internal.jobs.Worker.run(Worker.java:63)
09:51:52 [2021-06-01T13:51:52.102Z] Start of script
09:51:52 [2021-06-01T13:51:52.102Z] include file start
09:51:52 [2021-06-01T13:51:52.102Z] Include file processed
09:51:52 [2021-06-01T13:51:52.102Z] line after include file
09:51:52 [2021-06-01T13:51:52.102Z] Result of testMethod = 5
09:51:52 [2021-06-01T13:51:52.102Z] End of script
09:51:52 [2021-06-01T13:51:52.669Z] Start of script
09:51:52 [2021-06-01T13:51:52.669Z] include file start
09:51:52 [2021-06-01T13:51:52.669Z] Include file processed
09:51:52 [2021-06-01T13:51:52.669Z] line after include file
09:51:53 [2021-06-01T13:51:53.244Z] Result of testMethod = 5
09:51:53 [2021-06-01T13:51:53.244Z] End of script
09:51:53 [2021-06-01T13:51:53.887Z] Start of script
09:51:53 [2021-06-01T13:51:53.887Z] include file start
09:51:53 [2021-06-01T13:51:53.887Z] Include file processed
09:51:53 [2021-06-01T13:51:53.887Z] line after include file
09:51:54 [2021-06-01T13:51:54.478Z] Result of testMethod = 5
09:51:54 [2021-06-01T13:51:54.478Z] End of script
09:51:55 [2021-06-01T13:51:55.389Z] Start of script
09:51:55 [2021-06-01T13:51:55.389Z] include file start
09:51:55 [2021-06-01T13:51:55.389Z] Include file processed
09:51:55 [2021-06-01T13:51:55.389Z] line after include file
09:51:55 [2021-06-01T13:51:55.389Z] Result of testMethod = 5
09:51:55 [2021-06-01T13:51:55.647Z] End of script
09:51:55 [2021-06-01T13:51:55.647Z] Start of script
09:51:55 [2021-06-01T13:51:55.647Z] include file start
09:51:55 [2021-06-01T13:51:55.647Z] Include file processed
09:51:55 [2021-06-01T13:51:55.647Z] line after include file
09:51:55 [2021-06-01T13:51:55.647Z] Result of testMethod = 5
09:51:55 [2021-06-01T13:51:55.647Z] org.eclipse.ease.ScriptEngineCancellationException: Terminated on user request
09:51:55 [2021-06-01T13:51:55.647Z] 	at org.eclipse.ease.debugging.AbstractEaseDebugger.handleEventsInSuspendedState(AbstractEaseDebugger.java:329)
09:51:55 [2021-06-01T13:51:55.647Z] 	at org.eclipse.ease.debugging.AbstractEaseDebugger.suspend(AbstractEaseDebugger.java:255)
09:51:55 [2021-06-01T13:51:55.647Z] 	at org.eclipse.ease.debugging.AbstractEaseDebugger.processLine(AbstractEaseDebugger.java:490)
09:51:55 [2021-06-01T13:51:55.647Z] 	at org.eclipse.ease.lang.javascript.rhino.debugger.RhinoDebugger.access$4(RhinoDebugger.java:1)
09:51:55 [2021-06-01T13:51:55.647Z] 	at org.eclipse.ease.lang.javascript.rhino.debugger.RhinoDebugger$RhinoDebugFrame.onLineChange(RhinoDebugger.java:122)
09:51:55 [2021-06-01T13:51:55.647Z] 	at org.mozilla.javascript.Interpreter.interpretLoop(Interpreter.java:1931)
09:51:55 [2021-06-01T13:51:55.647Z] 	at org.mozilla.javascript.Interpreter.interpret(Interpreter.java:911)
09:51:55 [2021-06-01T13:51:55.647Z] 	at org.mozilla.javascript.InterpretedFunction.call(InterpretedFunction.java:109)
09:51:55 [2021-06-01T13:51:55.647Z] 	at org.mozilla.javascript.ContextFactory.doTopCall(ContextFactory.java:405)
09:51:55 [2021-06-01T13:51:55.647Z] 	at org.mozilla.javascript.ScriptRuntime.doTopCall(ScriptRuntime.java:3508)
09:51:55 [2021-06-01T13:51:55.647Z] 	at org.mozilla.javascript.InterpretedFunction.exec(InterpretedFunction.java:120)
09:51:55 [2021-06-01T13:51:55.647Z] 	at org.mozilla.javascript.Context.evaluateReader(Context.java:1293)
09:51:55 [2021-06-01T13:51:55.647Z] 	at org.eclipse.ease.lang.javascript.rhino.RhinoScriptEngine.internalExecute(RhinoScriptEngine.java:224)
09:51:55 [2021-06-01T13:51:55.647Z] 	at org.eclipse.ease.lang.javascript.rhino.RhinoScriptEngine.execute(RhinoScriptEngine.java:203)
09:51:55 [2021-06-01T13:51:55.647Z] 	at org.eclipse.ease.AbstractScriptEngine.inject(AbstractScriptEngine.java:189)
09:51:55 [2021-06-01T13:51:55.647Z] 	at org.eclipse.ease.AbstractScriptEngine.run(AbstractScriptEngine.java:242)
09:51:55 [2021-06-01T13:51:55.647Z] 	at org.eclipse.core.internal.jobs.Worker.run(Worker.java:63)
09:51:55 [2021-06-01T13:51:55.914Z] Start of script
09:51:55 [2021-06-01T13:51:55.914Z] include file start
09:51:55 [2021-06-01T13:51:55.914Z] Include file processed
09:51:55 [2021-06-01T13:51:55.914Z] line after include file
09:51:55 [2021-06-01T13:51:55.914Z] Result of testMethod = 5
09:51:55 [2021-06-01T13:51:55.914Z] End of script
09:51:56 [2021-06-01T13:51:56.180Z] Start of script
09:51:56 [2021-06-01T13:51:56.180Z] include file start
09:51:56 [2021-06-01T13:51:56.180Z] Include file processed
09:51:56 [2021-06-01T13:51:56.180Z] line after include file
09:51:56 [2021-06-01T13:51:56.180Z] Result of testMethod = 5
09:52:00 [2021-06-01T13:52:00.024Z] org.eclipse.ease.ScriptEngineCancellationException: Terminated on user request
09:52:00 [2021-06-01T13:52:00.024Z] 	at org.eclipse.ease.debugging.AbstractEaseDebugger.handleEventsInSuspendedState(AbstractEaseDebugger.java:329)
09:52:00 [2021-06-01T13:52:00.024Z] 	at org.eclipse.ease.debugging.AbstractEaseDebugger.suspend(AbstractEaseDebugger.java:255)
09:52:00 [2021-06-01T13:52:00.024Z] 	at org.eclipse.ease.debugging.AbstractEaseDebugger.processLine(AbstractEaseDebugger.java:490)
09:52:00 [2021-06-01T13:52:00.024Z] 	at org.eclipse.ease.lang.javascript.rhino.debugger.RhinoDebugger.access$4(RhinoDebugger.java:1)
09:52:00 [2021-06-01T13:52:00.024Z] 	at org.eclipse.ease.lang.javascript.rhino.debugger.RhinoDebugger$RhinoDebugFrame.onLineChange(RhinoDebugger.java:122)
09:52:00 [2021-06-01T13:52:00.024Z] 	at org.mozilla.javascript.Interpreter.interpretLoop(Interpreter.java:1931)
09:52:00 [2021-06-01T13:52:00.024Z] 	at org.mozilla.javascript.Interpreter.interpret(Interpreter.java:911)
09:52:00 [2021-06-01T13:52:00.024Z] 	at org.mozilla.javascript.InterpretedFunction.call(InterpretedFunction.java:109)
09:52:00 [2021-06-01T13:52:00.024Z] 	at org.mozilla.javascript.ContextFactory.doTopCall(ContextFactory.java:405)
09:52:00 [2021-06-01T13:52:00.024Z] 	at org.mozilla.javascript.ScriptRuntime.doTopCall(ScriptRuntime.java:3508)
09:52:00 [2021-06-01T13:52:00.024Z] 	at org.mozilla.javascript.InterpretedFunction.exec(InterpretedFunction.java:120)
09:52:00 [2021-06-01T13:52:00.024Z] 	at org.mozilla.javascript.Context.evaluateReader(Context.java:1293)
09:52:00 [2021-06-01T13:52:00.024Z] 	at org.eclipse.ease.lang.javascript.rhino.RhinoScriptEngine.internalExecute(RhinoScriptEngine.java:224)
09:52:00 [2021-06-01T13:52:00.024Z] 	at org.eclipse.ease.lang.javascript.rhino.RhinoScriptEngine.execute(RhinoScriptEngine.java:203)
09:52:00 [2021-06-01T13:52:00.024Z] 	at org.eclipse.ease.AbstractScriptEngine.inject(AbstractScriptEngine.java:189)
09:52:00 [2021-06-01T13:52:00.024Z] 	at org.eclipse.ease.AbstractScriptEngine.run(AbstractScriptEngine.java:242)
09:52:00 [2021-06-01T13:52:00.024Z] 	at org.eclipse.core.internal.jobs.Worker.run(Worker.java:63)
09:52:00 [2021-06-01T13:52:00.282Z] org.eclipse.ease.ScriptEngineCancellationException: Terminated on user request
09:52:00 [2021-06-01T13:52:00.282Z] 	at org.eclipse.ease.debugging.AbstractEaseDebugger.handleEventsInSuspendedState(AbstractEaseDebugger.java:329)
09:52:00 [2021-06-01T13:52:00.282Z] 	at org.eclipse.ease.debugging.AbstractEaseDebugger.suspend(AbstractEaseDebugger.java:255)
09:52:00 [2021-06-01T13:52:00.282Z] 	at org.eclipse.ease.debugging.AbstractEaseDebugger.processLine(AbstractEaseDebugger.java:490)
09:52:00 [2021-06-01T13:52:00.282Z] 	at org.eclipse.ease.lang.javascript.rhino.debugger.RhinoDebugger.access$4(RhinoDebugger.java:1)
09:52:00 [2021-06-01T13:52:00.282Z] 	at org.eclipse.ease.lang.javascript.rhino.debugger.RhinoDebugger$RhinoDebugFrame.onLineChange(RhinoDebugger.java:122)
09:52:00 [2021-06-01T13:52:00.282Z] 	at org.mozilla.javascript.Interpreter.interpretLoop(Interpreter.java:1931)
09:52:00 [2021-06-01T13:52:00.282Z] 	at org.mozilla.javascript.Interpreter.interpret(Interpreter.java:911)
09:52:00 [2021-06-01T13:52:00.282Z] 	at org.mozilla.javascript.InterpretedFunction.call(InterpretedFunction.java:109)
09:52:00 [2021-06-01T13:52:00.282Z] 	at org.mozilla.javascript.ContextFactory.doTopCall(ContextFactory.java:405)
09:52:00 [2021-06-01T13:52:00.282Z] 	at org.mozilla.javascript.ScriptRuntime.doTopCall(ScriptRuntime.java:3508)
09:52:00 [2021-06-01T13:52:00.282Z] 	at org.mozilla.javascript.InterpretedFunction.exec(InterpretedFunction.java:120)
09:52:00 [2021-06-01T13:52:00.282Z] 	at org.mozilla.javascript.Context.evaluateReader(Context.java:1293)
09:52:00 [2021-06-01T13:52:00.282Z] 	at org.eclipse.ease.lang.javascript.rhino.RhinoScriptEngine.internalExecute(RhinoScriptEngine.java:224)
09:52:00 [2021-06-01T13:52:00.282Z] 	at org.eclipse.ease.lang.javascript.rhino.RhinoScriptEngine.execute(RhinoScriptEngine.java:203)
09:52:00 [2021-06-01T13:52:00.282Z] 	at org.eclipse.ease.AbstractScriptEngine.inject(AbstractScriptEngine.java:189)
09:52:00 [2021-06-01T13:52:00.282Z] 	at org.eclipse.ease.AbstractScriptEngine.run(AbstractScriptEngine.java:242)
09:52:00 [2021-06-01T13:52:00.282Z] 	at org.eclipse.core.internal.jobs.Worker.run(Worker.java:63)
09:52:00 [2021-06-01T13:52:00.848Z] Start of script
09:52:00 [2021-06-01T13:52:00.848Z] include file start
09:52:00 [2021-06-01T13:52:00.848Z] Include file processed
09:52:00 [2021-06-01T13:52:00.848Z] line after include file
09:52:00 [2021-06-01T13:52:00.848Z] Result of testMethod = 5
09:52:00 [2021-06-01T13:52:00.848Z] End of script
09:52:01 [2021-06-01T13:52:01.780Z] Start of script
09:52:01 [2021-06-01T13:52:01.780Z] include file start
09:52:01 [2021-06-01T13:52:01.780Z] Include file processed
09:52:01 [2021-06-01T13:52:01.781Z] line after include file
09:52:02 [2021-06-01T13:52:02.038Z] Result of testMethod = 5
09:52:02 [2021-06-01T13:52:02.038Z] End of script
09:52:02 [2021-06-01T13:52:02.296Z] Start of script
09:52:02 [2021-06-01T13:52:02.296Z] include file start
09:52:02 [2021-06-01T13:52:02.296Z] Include file processed
09:52:02 [2021-06-01T13:52:02.296Z] line after include file
09:52:02 [2021-06-01T13:52:02.296Z] Result of testMethod = 5
09:52:02 [2021-06-01T13:52:02.296Z] End of script
09:52:02 [2021-06-01T13:52:02.296Z] Tests run: 42, Failures: 0, Errors: 0, Skipped: 0, Time elapsed: 30.014 s - in org.eclipse.ease.lang.javascript.rhino.RhinoDebugTest
09:52:02 [2021-06-01T13:52:02.296Z] disconnectProcessInSuspendedState  Time elapsed: 0.327 s
09:52:02 [2021-06-01T13:52:02.296Z] stepReturnIncludeCommand  Time elapsed: 0.669 s
09:52:02 [2021-06-01T13:52:02.296Z] arrayVariableSorting  Time elapsed: 0.384 s
09:52:02 [2021-06-01T13:52:02.296Z] stepOverOnDebugTarget  Time elapsed: 0.315 s
09:52:02 [2021-06-01T13:52:02.296Z] hasDebugTarget  Time elapsed: 0.355 s
09:52:02 [2021-06-01T13:52:02.296Z] disconnectThreadInSuspendedState  Time elapsed: 1.318 s
09:52:02 [2021-06-01T13:52:02.296Z] stepReturnOnDebugTarget  Time elapsed: 0.49 s
09:52:02 [2021-06-01T13:52:02.296Z] nullVariable  Time elapsed: 0.326 s
09:52:02 [2021-06-01T13:52:02.296Z] stepOverOnStackFrame  Time elapsed: 0.356 s
09:52:02 [2021-06-01T13:52:02.296Z] resumeOnDebugTarget  Time elapsed: 0.462 s
09:52:02 [2021-06-01T13:52:02.296Z] modifyVariableKeepingType  Time elapsed: 0.417 s
09:52:02 [2021-06-01T13:52:02.296Z] resumeOnLastIncludeLine  Time elapsed: 0.254 s
09:52:02 [2021-06-01T13:52:02.296Z] stepReturnOnStackFrame  Time elapsed: 1.915 s
09:52:02 [2021-06-01T13:52:02.296Z] terminateStackFrameInSuspendedState  Time elapsed: 0.209 s
09:52:02 [2021-06-01T13:52:02.296Z] breakpointLocation  Time elapsed: 0.514 s
09:52:02 [2021-06-01T13:52:02.296Z] stepReturnOnThread  Time elapsed: 0.316 s
09:52:02 [2021-06-01T13:52:02.296Z] javaClassVariable  Time elapsed: 0.322 s
09:52:02 [2021-06-01T13:52:02.296Z] stepIntoOnThread  Time elapsed: 1.159 s
09:52:02 [2021-06-01T13:52:02.296Z] terminateThreadInSuspendedState  Time elapsed: 0.331 s
09:52:02 [2021-06-01T13:52:02.296Z] resumeOnThread  Time elapsed: 0.406 s
09:52:02 [2021-06-01T13:52:02.296Z] stepIntoOnStackFrame  Time elapsed: 0.479 s
09:52:02 [2021-06-01T13:52:02.296Z] terminateProcessInSuspendedState  Time elapsed: 0.244 s
09:52:02 [2021-06-01T13:52:02.296Z] stepOverOnProcess  Time elapsed: 0.386 s
09:52:02 [2021-06-01T13:52:02.296Z] nativeArrayVariable  Time elapsed: 0.334 s
09:52:02 [2021-06-01T13:52:02.296Z] disconnectDebugTargetInSuspendedState  Time elapsed: 0.456 s
09:52:02 [2021-06-01T13:52:02.296Z] stepIntoOnProcess  Time elapsed: 0.651 s
09:52:02 [2021-06-01T13:52:02.296Z] terminatedState  Time elapsed: 0.115 s
09:52:02 [2021-06-01T13:52:02.296Z] stepOverIncludeCommand  Time elapsed: 0.349 s
09:52:02 [2021-06-01T13:52:02.296Z] innerScopeVariableBeforeOuterScopeVariable  Time elapsed: 3.848 s
09:52:02 [2021-06-01T13:52:02.296Z] stepIntoIncludeCommand  Time elapsed: 1.367 s
09:52:02 [2021-06-01T13:52:02.296Z] primitiveStringVariable  Time elapsed: 0.591 s
09:52:02 [2021-06-01T13:52:02.296Z] resumeOnProcess  Time elapsed: 0.213 s
09:52:02 [2021-06-01T13:52:02.296Z] stepIntoOnDebugTarget  Time elapsed: 0.669 s
09:52:02 [2021-06-01T13:52:02.296Z] stepOverOnThread  Time elapsed: 0.764 s
09:52:02 [2021-06-01T13:52:02.296Z] suspendedState  Time elapsed: 1.045 s
09:52:02 [2021-06-01T13:52:02.296Z] primitiveDoubleVariable  Time elapsed: 1.088 s
09:52:02 [2021-06-01T13:52:02.296Z] resumeOnStackFrame  Time elapsed: 0.245 s
09:52:02 [2021-06-01T13:52:02.296Z] nativeObjectVariable  Time elapsed: 0.357 s
09:52:02 [2021-06-01T13:52:02.296Z] terminateDebugTargetInSuspendedState  Time elapsed: 3.982 s
09:52:02 [2021-06-01T13:52:02.296Z] disconnectStackFrameInSuspendedState  Time elapsed: 0.544 s
09:52:02 [2021-06-01T13:52:02.296Z] stepReturnOnProcess  Time elapsed: 1.086 s
09:52:02 [2021-06-01T13:52:02.296Z] evaluateWatchExpression  Time elapsed: 0.341 s
09:52:02 [2021-06-01T13:52:02.296Z] 
09:52:02 [2021-06-01T13:52:02.296Z] Results:
09:52:02 [2021-06-01T13:52:02.296Z] 
09:52:02 [2021-06-01T13:52:02.296Z] Tests run: 70, Failures: 0, Errors: 0, Skipped: 0
09:52:02 [2021-06-01T13:52:02.296Z] 
09:52:07 [2021-06-01T13:52:07.557Z] [INFO] All tests passed!
09:52:07 [2021-06-01T13:52:07.557Z] [INFO] 
09:52:07 [2021-06-01T13:52:07.557Z] [INFO] --- maven-pmd-plugin:3.14.0:pmd (pmd-integration) @ org.eclipse.ease.lang.javascript.rhino.test ---
09:52:15 [2021-06-01T13:52:15.681Z] [INFO] 
09:52:15 [2021-06-01T13:52:15.681Z] [INFO] --- maven-pmd-plugin:3.14.0:cpd (pmd-integration) @ org.eclipse.ease.lang.javascript.rhino.test ---
09:52:15 [2021-06-01T13:52:15.681Z] [INFO] 
09:52:15 [2021-06-01T13:52:15.681Z] [INFO] --- spotbugs-maven-plugin:4.1.4:spotbugs (spotbugs-integration) @ org.eclipse.ease.lang.javascript.rhino.test ---
09:52:15 [2021-06-01T13:52:15.681Z] [INFO] Fork Value is false
09:52:15 [2021-06-01T13:52:15.681Z]      [java] JVM args ignored when same JVM is used.
09:52:21 [2021-06-01T13:52:21.032Z] [INFO] Done SpotBugs Analysis....
09:52:21 [2021-06-01T13:52:21.032Z] [INFO] 
09:52:21 [2021-06-01T13:52:21.032Z] [INFO] --- maven-checkstyle-plugin:3.1.1:check (checkstyle-integration) @ org.eclipse.ease.lang.javascript.rhino.test ---
09:52:21 [2021-06-01T13:52:21.033Z] [INFO] You have 0 Checkstyle violations.
09:52:21 [2021-06-01T13:52:21.033Z] [INFO] 
09:52:21 [2021-06-01T13:52:21.033Z] [INFO] --- maven-install-plugin:2.3.1:install (default-install) @ org.eclipse.ease.lang.javascript.rhino.test ---
09:52:21 [2021-06-01T13:52:21.033Z] [INFO] Installing /home/jenkins/agent/workspace/ease.verify.core.target.2019-06/tests/org.eclipse.ease.lang.javascript.rhino.test/target/org.eclipse.ease.lang.javascript.rhino.test-0.8.0-SNAPSHOT.jar to /home/jenkins/.m2/repository/org/eclipse/ease/org.eclipse.ease.lang.javascript.rhino.test/0.8.0-SNAPSHOT/org.eclipse.ease.lang.javascript.rhino.test-0.8.0-SNAPSHOT.jar
09:52:21 [2021-06-01T13:52:21.033Z] [INFO] Installing /home/jenkins/agent/workspace/ease.verify.core.target.2019-06/tests/org.eclipse.ease.lang.javascript.rhino.test/pom.xml to /home/jenkins/.m2/repository/org/eclipse/ease/org.eclipse.ease.lang.javascript.rhino.test/0.8.0-SNAPSHOT/org.eclipse.ease.lang.javascript.rhino.test-0.8.0-SNAPSHOT.pom
09:52:21 [2021-06-01T13:52:21.033Z] [INFO] Installing /home/jenkins/agent/workspace/ease.verify.core.target.2019-06/tests/org.eclipse.ease.lang.javascript.rhino.test/target/p2content.xml to /home/jenkins/.m2/repository/org/eclipse/ease/org.eclipse.ease.lang.javascript.rhino.test/0.8.0-SNAPSHOT/org.eclipse.ease.lang.javascript.rhino.test-0.8.0-SNAPSHOT-p2metadata.xml
09:52:21 [2021-06-01T13:52:21.033Z] [INFO] Installing /home/jenkins/agent/workspace/ease.verify.core.target.2019-06/tests/org.eclipse.ease.lang.javascript.rhino.test/target/p2artifacts.xml to /home/jenkins/.m2/repository/org/eclipse/ease/org.eclipse.ease.lang.javascript.rhino.test/0.8.0-SNAPSHOT/org.eclipse.ease.lang.javascript.rhino.test-0.8.0-SNAPSHOT-p2artifacts.xml
09:52:21 [2021-06-01T13:52:21.033Z] [INFO] 
09:52:21 [2021-06-01T13:52:21.033Z] [INFO] --- tycho-p2-plugin:2.2.0:update-local-index (default-update-local-index) @ org.eclipse.ease.lang.javascript.rhino.test ---
09:52:21 [2021-06-01T13:52:21.033Z] [INFO] 
09:52:21 [2021-06-01T13:52:21.033Z] [INFO] -------< org.eclipse.ease:org.eclipse.ease.lang.javascript.test >-------
09:52:21 [2021-06-01T13:52:21.033Z] [INFO] Building org.eclipse.ease.lang.javascript.test 0.8.0-SNAPSHOT    [40/48]
09:52:21 [2021-06-01T13:52:21.033Z] [INFO] ------------------------[ eclipse-test-plugin ]-------------------------
09:52:21 [2021-06-01T13:52:21.033Z] [INFO] 
09:52:21 [2021-06-01T13:52:21.033Z] [INFO] --- maven-clean-plugin:2.5:clean (default-clean) @ org.eclipse.ease.lang.javascript.test ---
09:52:21 [2021-06-01T13:52:21.033Z] [INFO] 
09:52:21 [2021-06-01T13:52:21.033Z] [INFO] --- tycho-packaging-plugin:2.2.0:build-qualifier (default-build-qualifier) @ org.eclipse.ease.lang.javascript.test ---
09:52:21 [2021-06-01T13:52:21.033Z] [INFO] The project's OSGi version is 0.8.0.I202104091518
09:52:21 [2021-06-01T13:52:21.033Z] [INFO] 
09:52:21 [2021-06-01T13:52:21.033Z] [INFO] --- tycho-packaging-plugin:2.2.0:validate-id (default-validate-id) @ org.eclipse.ease.lang.javascript.test ---
09:52:21 [2021-06-01T13:52:21.033Z] [INFO] 
09:52:21 [2021-06-01T13:52:21.033Z] [INFO] --- tycho-packaging-plugin:2.2.0:validate-version (default-validate-version) @ org.eclipse.ease.lang.javascript.test ---
09:52:21 [2021-06-01T13:52:21.033Z] [INFO] 
09:52:21 [2021-06-01T13:52:21.033Z] [INFO] --- maven-resources-plugin:2.4.3:resources (default-resources) @ org.eclipse.ease.lang.javascript.test ---
09:52:21 [2021-06-01T13:52:21.033Z] [INFO] Using 'UTF-8' encoding to copy filtered resources.
09:52:21 [2021-06-01T13:52:21.033Z] [INFO] skip non existing resourceDirectory /home/jenkins/agent/workspace/ease.verify.core.target.2019-06/tests/org.eclipse.ease.lang.javascript.test/src/main/resources
09:52:21 [2021-06-01T13:52:21.033Z] [INFO] 
09:52:21 [2021-06-01T13:52:21.033Z] [INFO] --- tycho-compiler-plugin:2.2.0:compile (default-compile) @ org.eclipse.ease.lang.javascript.test ---
09:52:21 [2021-06-01T13:52:21.033Z] [INFO] Compiling 2 source files to /home/jenkins/agent/workspace/ease.verify.core.target.2019-06/tests/org.eclipse.ease.lang.javascript.test/target/classes
09:52:21 [2021-06-01T13:52:21.033Z] [INFO] 
09:52:21 [2021-06-01T13:52:21.033Z] [INFO] --- maven-resources-plugin:2.4.3:testResources (default-testResources) @ org.eclipse.ease.lang.javascript.test ---
09:52:21 [2021-06-01T13:52:21.033Z] [INFO] Using 'UTF-8' encoding to copy filtered resources.
09:52:21 [2021-06-01T13:52:21.033Z] [INFO] skip non existing resourceDirectory /home/jenkins/agent/workspace/ease.verify.core.target.2019-06/tests/org.eclipse.ease.lang.javascript.test/src/test/resources
09:52:21 [2021-06-01T13:52:21.033Z] [INFO] 
09:52:21 [2021-06-01T13:52:21.034Z] [INFO] --- target-platform-configuration:2.2.0:target-platform (default-target-platform) @ org.eclipse.ease.lang.javascript.test ---
09:52:21 [2021-06-01T13:52:21.034Z] [INFO] 
09:52:21 [2021-06-01T13:52:21.034Z] [INFO] --- tycho-packaging-plugin:2.2.0:package-plugin (default-package-plugin) @ org.eclipse.ease.lang.javascript.test ---
09:52:21 [2021-06-01T13:52:21.034Z] [INFO] Building jar: /home/jenkins/agent/workspace/ease.verify.core.target.2019-06/tests/org.eclipse.ease.lang.javascript.test/target/org.eclipse.ease.lang.javascript.test-0.8.0-SNAPSHOT.jar
09:52:21 [2021-06-01T13:52:21.034Z] [INFO] 
09:52:21 [2021-06-01T13:52:21.034Z] [INFO] --- tycho-p2-plugin:2.2.0:p2-metadata-default (default-p2-metadata-default) @ org.eclipse.ease.lang.javascript.test ---
09:52:21 [2021-06-01T13:52:21.034Z] [INFO] 
09:52:21 [2021-06-01T13:52:21.034Z] [INFO] --- jacoco-maven-plugin:0.8.6:prepare-agent (jacoco-initialize) @ org.eclipse.ease.lang.javascript.test ---
09:52:21 [2021-06-01T13:52:21.034Z] [INFO] tycho.testArgLine set to -javaagent:/home/jenkins/.m2/repository/org/jacoco/org.jacoco.agent/0.8.6/org.jacoco.agent-0.8.6-runtime.jar=destfile=/home/jenkins/agent/workspace/ease.verify.core.target.2019-06/tests/org.eclipse.ease.lang.javascript.test/target/jacoco.exec,output=file
09:52:21 [2021-06-01T13:52:21.034Z] [INFO] 
09:52:21 [2021-06-01T13:52:21.034Z] [INFO] --- tycho-surefire-plugin:2.2.0:test (default-test) @ org.eclipse.ease.lang.javascript.test ---
09:52:21 [2021-06-01T13:52:21.034Z] [INFO] Executing Test Runtime with timeout 0, logs (if any) will be placed at: /home/jenkins/agent/workspace/ease.verify.core.target.2019-06/tests/org.eclipse.ease.lang.javascript.test/target/work/data/.metadata/.log
09:52:21 [2021-06-01T13:52:21.034Z] [INFO] Command line:
09:52:21 [2021-06-01T13:52:21.034Z] 	[/opt/tools/java/openjdk/jdk-15/15.0.2+7/bin/java, -Dosgi.noShutdown=false, -Dosgi.os=linux, -Dosgi.ws=gtk, -Dosgi.arch=x86_64, -javaagent:/home/jenkins/.m2/repository/org/jacoco/org.jacoco.agent/0.8.6/org.jacoco.agent-0.8.6-runtime.jar=destfile=/home/jenkins/agent/workspace/ease.verify.core.target.2019-06/tests/org.eclipse.ease.lang.javascript.test/target/jacoco.exec,output=file, -Dosgi.clean=true, -jar, /home/jenkins/.m2/repository/p2/osgi/bundle/org.eclipse.equinox.launcher/1.6.0.v20200915-1508/org.eclipse.equinox.launcher-1.6.0.v20200915-1508.jar, -data, /home/jenkins/agent/workspace/ease.verify.core.target.2019-06/tests/org.eclipse.ease.lang.javascript.test/target/work/data, -install, /home/jenkins/agent/workspace/ease.verify.core.target.2019-06/tests/org.eclipse.ease.lang.javascript.test/target/work, -configuration, /home/jenkins/agent/workspace/ease.verify.core.target.2019-06/tests/org.eclipse.ease.lang.javascript.test/target/work/configuration, -application, org.eclipse.tycho.surefire.osgibooter.headlesstest, -testproperties, /home/jenkins/agent/workspace/ease.verify.core.target.2019-06/tests/org.eclipse.ease.lang.javascript.test/target/surefire.properties]
09:52:21 [2021-06-01T13:52:21.034Z] Picked up JAVA_TOOL_OPTIONS: -Dmaven.ext.class.path="/home/jenkins/agent/workspace/ease.verify.core.target.2019-06@tmp/withMaven65c87659/pipeline-maven-spy.jar" -Dorg.jenkinsci.plugins.pipeline.maven.reportsFolder="/home/jenkins/agent/workspace/ease.verify.core.target.2019-06@tmp/withMaven65c87659" 
09:52:29 [2021-06-01T13:52:29.211Z] Jun 01, 2021 1:52:28 PM org.junit.platform.launcher.core.DefaultLauncher handleThrowable
09:52:29 [2021-06-01T13:52:29.211Z] WARNING: TestEngine with ID 'junit-vintage' failed to discover tests
09:52:29 [2021-06-01T13:52:29.211Z] java.lang.NoClassDefFoundError: org/junit/runners/model/RunnerBuilder
09:52:29 [2021-06-01T13:52:29.211Z] 	at org.junit.vintage.engine.discovery.VintageDiscoverer.<init>(VintageDiscoverer.java:48)
09:52:29 [2021-06-01T13:52:29.211Z] 	at org.junit.vintage.engine.VintageTestEngine.discover(VintageTestEngine.java:65)
09:52:29 [2021-06-01T13:52:29.211Z] 	at org.junit.platform.launcher.core.DefaultLauncher.discoverEngineRoot(DefaultLauncher.java:130)
09:52:29 [2021-06-01T13:52:29.211Z] 	at org.junit.platform.launcher.core.DefaultLauncher.discoverRoot(DefaultLauncher.java:117)
09:52:29 [2021-06-01T13:52:29.211Z] 	at org.junit.platform.launcher.core.DefaultLauncher.discover(DefaultLauncher.java:82)
09:52:29 [2021-06-01T13:52:29.211Z] 	at org.apache.maven.surefire.junitplatform.TestPlanScannerFilter.accept(TestPlanScannerFilter.java:56)
09:52:29 [2021-06-01T13:52:29.211Z] 	at org.apache.maven.surefire.util.DefaultScanResult.applyFilter(DefaultScanResult.java:102)
09:52:29 [2021-06-01T13:52:29.211Z] 	at org.apache.maven.surefire.junitplatform.JUnitPlatformProvider.scanClasspath(JUnitPlatformProvider.java:143)
09:52:29 [2021-06-01T13:52:29.211Z] 	at org.apache.maven.surefire.junitplatform.JUnitPlatformProvider.invoke(JUnitPlatformProvider.java:124)
09:52:29 [2021-06-01T13:52:29.211Z] 	at java.base/jdk.internal.reflect.NativeMethodAccessorImpl.invoke0(Native Method)
09:52:29 [2021-06-01T13:52:29.211Z] 	at java.base/jdk.internal.reflect.NativeMethodAccessorImpl.invoke(NativeMethodAccessorImpl.java:64)
09:52:29 [2021-06-01T13:52:29.211Z] 	at java.base/jdk.internal.reflect.DelegatingMethodAccessorImpl.invoke(DelegatingMethodAccessorImpl.java:43)
09:52:29 [2021-06-01T13:52:29.211Z] 	at java.base/java.lang.reflect.Method.invoke(Method.java:564)
09:52:29 [2021-06-01T13:52:29.211Z] 	at org.apache.maven.surefire.util.ReflectionUtils.invokeMethodWithArray2(ReflectionUtils.java:206)
09:52:29 [2021-06-01T13:52:29.212Z] 	at org.apache.maven.surefire.booter.ProviderFactory$ProviderProxy.invoke(ProviderFactory.java:161)
09:52:29 [2021-06-01T13:52:29.212Z] 	at org.apache.maven.surefire.booter.ProviderFactory.invokeProvider(ProviderFactory.java:84)
09:52:29 [2021-06-01T13:52:29.212Z] 	at org.eclipse.tycho.surefire.osgibooter.OsgiSurefireBooter.run(OsgiSurefireBooter.java:116)
09:52:29 [2021-06-01T13:52:29.212Z] 	at org.eclipse.tycho.surefire.osgibooter.HeadlessTestApplication.start(HeadlessTestApplication.java:23)
09:52:29 [2021-06-01T13:52:29.212Z] 	at org.eclipse.equinox.internal.app.EclipseAppHandle.run(EclipseAppHandle.java:203)
09:52:29 [2021-06-01T13:52:29.212Z] 	at org.eclipse.core.runtime.internal.adaptor.EclipseAppLauncher.runApplication(EclipseAppLauncher.java:134)
09:52:29 [2021-06-01T13:52:29.212Z] 	at org.eclipse.core.runtime.internal.adaptor.EclipseAppLauncher.start(EclipseAppLauncher.java:104)
09:52:29 [2021-06-01T13:52:29.212Z] 	at org.eclipse.core.runtime.adaptor.EclipseStarter.run(EclipseStarter.java:401)
09:52:29 [2021-06-01T13:52:29.212Z] 	at org.eclipse.core.runtime.adaptor.EclipseStarter.run(EclipseStarter.java:255)
09:52:29 [2021-06-01T13:52:29.212Z] 	at java.base/jdk.internal.reflect.NativeMethodAccessorImpl.invoke0(Native Method)
09:52:29 [2021-06-01T13:52:29.212Z] 	at java.base/jdk.internal.reflect.NativeMethodAccessorImpl.invoke(NativeMethodAccessorImpl.java:64)
09:52:29 [2021-06-01T13:52:29.212Z] 	at java.base/jdk.internal.reflect.DelegatingMethodAccessorImpl.invoke(DelegatingMethodAccessorImpl.java:43)
09:52:29 [2021-06-01T13:52:29.212Z] 	at java.base/java.lang.reflect.Method.invoke(Method.java:564)
09:52:29 [2021-06-01T13:52:29.212Z] 	at org.eclipse.equinox.launcher.Main.invokeFramework(Main.java:653)
09:52:29 [2021-06-01T13:52:29.212Z] 	at org.eclipse.equinox.launcher.Main.basicRun(Main.java:590)
09:52:29 [2021-06-01T13:52:29.212Z] 	at org.eclipse.equinox.launcher.Main.run(Main.java:1461)
09:52:29 [2021-06-01T13:52:29.212Z] 	at org.eclipse.equinox.launcher.Main.main(Main.java:1434)
09:52:29 [2021-06-01T13:52:29.212Z] Caused by: java.lang.ClassNotFoundException: org.junit.runners.model.RunnerBuilder cannot be found by org.eclipse.tycho.surefire.osgibooter_2.2.0
09:52:29 [2021-06-01T13:52:29.212Z] 	at org.eclipse.osgi.internal.loader.BundleLoader.findClass(BundleLoader.java:516)
09:52:29 [2021-06-01T13:52:29.212Z] 	at org.eclipse.osgi.internal.loader.ModuleClassLoader.loadClass(ModuleClassLoader.java:171)
09:52:29 [2021-06-01T13:52:29.212Z] 	at java.base/java.lang.ClassLoader.loadClass(ClassLoader.java:522)
09:52:29 [2021-06-01T13:52:29.212Z] 	... 31 more
09:52:29 [2021-06-01T13:52:29.212Z] 
09:52:29 [2021-06-01T13:52:29.212Z] Jun 01, 2021 1:52:28 PM org.junit.platform.launcher.core.DefaultLauncher handleThrowable
09:52:29 [2021-06-01T13:52:29.212Z] WARNING: TestEngine with ID 'junit-vintage' failed to discover tests
09:52:29 [2021-06-01T13:52:29.212Z] java.lang.NoClassDefFoundError: org/junit/runners/model/RunnerBuilder
09:52:29 [2021-06-01T13:52:29.212Z] 	at org.junit.vintage.engine.discovery.VintageDiscoverer.<init>(VintageDiscoverer.java:48)
09:52:29 [2021-06-01T13:52:29.212Z] 	at org.junit.vintage.engine.VintageTestEngine.discover(VintageTestEngine.java:65)
09:52:29 [2021-06-01T13:52:29.212Z] 	at org.junit.platform.launcher.core.DefaultLauncher.discoverEngineRoot(DefaultLauncher.java:130)
09:52:29 [2021-06-01T13:52:29.212Z] 	at org.junit.platform.launcher.core.DefaultLauncher.discoverRoot(DefaultLauncher.java:117)
09:52:29 [2021-06-01T13:52:29.212Z] 	at org.junit.platform.launcher.core.DefaultLauncher.discover(DefaultLauncher.java:82)
09:52:29 [2021-06-01T13:52:29.212Z] 	at org.apache.maven.surefire.junitplatform.TestPlanScannerFilter.accept(TestPlanScannerFilter.java:56)
09:52:29 [2021-06-01T13:52:29.212Z] 	at org.apache.maven.surefire.util.DefaultScanResult.applyFilter(DefaultScanResult.java:102)
09:52:29 [2021-06-01T13:52:29.212Z] 	at org.apache.maven.surefire.junitplatform.JUnitPlatformProvider.scanClasspath(JUnitPlatformProvider.java:143)
09:52:29 [2021-06-01T13:52:29.212Z] 	at org.apache.maven.surefire.junitplatform.JUnitPlatformProvider.invoke(JUnitPlatformProvider.java:124)
09:52:29 [2021-06-01T13:52:29.212Z] 	at java.base/jdk.internal.reflect.NativeMethodAccessorImpl.invoke0(Native Method)
09:52:29 [2021-06-01T13:52:29.212Z] 	at java.base/jdk.internal.reflect.NativeMethodAccessorImpl.invoke(NativeMethodAccessorImpl.java:64)
09:52:29 [2021-06-01T13:52:29.212Z] 	at java.base/jdk.internal.reflect.DelegatingMethodAccessorImpl.invoke(DelegatingMethodAccessorImpl.java:43)
09:52:29 [2021-06-01T13:52:29.212Z] 	at java.base/java.lang.reflect.Method.invoke(Method.java:564)
09:52:29 [2021-06-01T13:52:29.212Z] 	at org.apache.maven.surefire.util.ReflectionUtils.invokeMethodWithArray2(ReflectionUtils.java:206)
09:52:29 [2021-06-01T13:52:29.212Z] 	at org.apache.maven.surefire.booter.ProviderFactory$ProviderProxy.invoke(ProviderFactory.java:161)
09:52:29 [2021-06-01T13:52:29.212Z] 	at org.apache.maven.surefire.booter.ProviderFactory.invokeProvider(ProviderFactory.java:84)
09:52:29 [2021-06-01T13:52:29.212Z] 	at org.eclipse.tycho.surefire.osgibooter.OsgiSurefireBooter.run(OsgiSurefireBooter.java:116)
09:52:29 [2021-06-01T13:52:29.212Z] 	at org.eclipse.tycho.surefire.osgibooter.HeadlessTestApplication.start(HeadlessTestApplication.java:23)
09:52:29 [2021-06-01T13:52:29.212Z] 	at org.eclipse.equinox.internal.app.EclipseAppHandle.run(EclipseAppHandle.java:203)
09:52:29 [2021-06-01T13:52:29.212Z] 	at org.eclipse.core.runtime.internal.adaptor.EclipseAppLauncher.runApplication(EclipseAppLauncher.java:134)
09:52:29 [2021-06-01T13:52:29.212Z] 	at org.eclipse.core.runtime.internal.adaptor.EclipseAppLauncher.start(EclipseAppLauncher.java:104)
09:52:29 [2021-06-01T13:52:29.212Z] 	at org.eclipse.core.runtime.adaptor.EclipseStarter.run(EclipseStarter.java:401)
09:52:29 [2021-06-01T13:52:29.212Z] 	at org.eclipse.core.runtime.adaptor.EclipseStarter.run(EclipseStarter.java:255)
09:52:29 [2021-06-01T13:52:29.212Z] 	at java.base/jdk.internal.reflect.NativeMethodAccessorImpl.invoke0(Native Method)
09:52:29 [2021-06-01T13:52:29.212Z] 	at java.base/jdk.internal.reflect.NativeMethodAccessorImpl.invoke(NativeMethodAccessorImpl.java:64)
09:52:29 [2021-06-01T13:52:29.212Z] 	at java.base/jdk.internal.reflect.DelegatingMethodAccessorImpl.invoke(DelegatingMethodAccessorImpl.java:43)
09:52:29 [2021-06-01T13:52:29.212Z] 	at java.base/java.lang.reflect.Method.invoke(Method.java:564)
09:52:29 [2021-06-01T13:52:29.212Z] 	at org.eclipse.equinox.launcher.Main.invokeFramework(Main.java:653)
09:52:29 [2021-06-01T13:52:29.212Z] 	at org.eclipse.equinox.launcher.Main.basicRun(Main.java:590)
09:52:29 [2021-06-01T13:52:29.212Z] 	at org.eclipse.equinox.launcher.Main.run(Main.java:1461)
09:52:29 [2021-06-01T13:52:29.212Z] 	at org.eclipse.equinox.launcher.Main.main(Main.java:1434)
09:52:29 [2021-06-01T13:52:29.212Z] Caused by: java.lang.ClassNotFoundException: org.junit.runners.model.RunnerBuilder cannot be found by org.eclipse.tycho.surefire.osgibooter_2.2.0
09:52:29 [2021-06-01T13:52:29.213Z] 	at org.eclipse.osgi.internal.loader.BundleLoader.findClass(BundleLoader.java:516)
09:52:29 [2021-06-01T13:52:29.213Z] 	at org.eclipse.osgi.internal.loader.ModuleClassLoader.loadClass(ModuleClassLoader.java:171)
09:52:29 [2021-06-01T13:52:29.213Z] 	at java.base/java.lang.ClassLoader.loadClass(ClassLoader.java:522)
09:52:29 [2021-06-01T13:52:29.213Z] 	... 31 more
09:52:29 [2021-06-01T13:52:29.213Z] 
09:52:29 [2021-06-01T13:52:29.213Z] Jun 01, 2021 1:52:28 PM org.junit.platform.launcher.core.DefaultLauncher handleThrowable
09:52:29 [2021-06-01T13:52:29.213Z] WARNING: TestEngine with ID 'junit-vintage' failed to discover tests
09:52:29 [2021-06-01T13:52:29.213Z] java.lang.NoClassDefFoundError: org/junit/runners/model/RunnerBuilder
09:52:29 [2021-06-01T13:52:29.213Z] 	at org.junit.vintage.engine.discovery.VintageDiscoverer.<init>(VintageDiscoverer.java:48)
09:52:29 [2021-06-01T13:52:29.213Z] 	at org.junit.vintage.engine.VintageTestEngine.discover(VintageTestEngine.java:65)
09:52:29 [2021-06-01T13:52:29.213Z] 	at org.junit.platform.launcher.core.DefaultLauncher.discoverEngineRoot(DefaultLauncher.java:130)
09:52:29 [2021-06-01T13:52:29.213Z] 	at org.junit.platform.launcher.core.DefaultLauncher.discoverRoot(DefaultLauncher.java:117)
09:52:29 [2021-06-01T13:52:29.213Z] 	at org.junit.platform.launcher.core.DefaultLauncher.execute(DefaultLauncher.java:90)
09:52:29 [2021-06-01T13:52:29.213Z] 	at org.apache.maven.surefire.junitplatform.JUnitPlatformProvider.invokeAllTests(JUnitPlatformProvider.java:150)
09:52:29 [2021-06-01T13:52:29.213Z] 	at org.apache.maven.surefire.junitplatform.JUnitPlatformProvider.invoke(JUnitPlatformProvider.java:124)
09:52:29 [2021-06-01T13:52:29.213Z] 	at java.base/jdk.internal.reflect.NativeMethodAccessorImpl.invoke0(Native Method)
09:52:29 [2021-06-01T13:52:29.213Z] 	at java.base/jdk.internal.reflect.NativeMethodAccessorImpl.invoke(NativeMethodAccessorImpl.java:64)
09:52:29 [2021-06-01T13:52:29.213Z] 	at java.base/jdk.internal.reflect.DelegatingMethodAccessorImpl.invoke(DelegatingMethodAccessorImpl.java:43)
09:52:29 [2021-06-01T13:52:29.213Z] 	at java.base/java.lang.reflect.Method.invoke(Method.java:564)
09:52:29 [2021-06-01T13:52:29.213Z] 	at org.apache.maven.surefire.util.ReflectionUtils.invokeMethodWithArray2(ReflectionUtils.java:206)
09:52:29 [2021-06-01T13:52:29.213Z] 	at org.apache.maven.surefire.booter.ProviderFactory$ProviderProxy.invoke(ProviderFactory.java:161)
09:52:29 [2021-06-01T13:52:29.213Z] 	at org.apache.maven.surefire.booter.ProviderFactory.invokeProvider(ProviderFactory.java:84)
09:52:29 [2021-06-01T13:52:29.213Z] 	at org.eclipse.tycho.surefire.osgibooter.OsgiSurefireBooter.run(OsgiSurefireBooter.java:116)
09:52:29 [2021-06-01T13:52:29.213Z] 	at org.eclipse.tycho.surefire.osgibooter.HeadlessTestApplication.start(HeadlessTestApplication.java:23)
09:52:29 [2021-06-01T13:52:29.213Z] 	at org.eclipse.equinox.internal.app.EclipseAppHandle.run(EclipseAppHandle.java:203)
09:52:29 [2021-06-01T13:52:29.213Z] 	at org.eclipse.core.runtime.internal.adaptor.EclipseAppLauncher.runApplication(EclipseAppLauncher.java:134)
09:52:29 [2021-06-01T13:52:29.213Z] 	at org.eclipse.core.runtime.internal.adaptor.EclipseAppLauncher.start(EclipseAppLauncher.java:104)
09:52:29 [2021-06-01T13:52:29.213Z] 	at org.eclipse.core.runtime.adaptor.EclipseStarter.run(EclipseStarter.java:401)
09:52:29 [2021-06-01T13:52:29.213Z] 	at org.eclipse.core.runtime.adaptor.EclipseStarter.run(EclipseStarter.java:255)
09:52:29 [2021-06-01T13:52:29.213Z] 	at java.base/jdk.internal.reflect.NativeMethodAccessorImpl.invoke0(Native Method)
09:52:29 [2021-06-01T13:52:29.213Z] 	at java.base/jdk.internal.reflect.NativeMethodAccessorImpl.invoke(NativeMethodAccessorImpl.java:64)
09:52:29 [2021-06-01T13:52:29.213Z] 	at java.base/jdk.internal.reflect.DelegatingMethodAccessorImpl.invoke(DelegatingMethodAccessorImpl.java:43)
09:52:29 [2021-06-01T13:52:29.213Z] 	at java.base/java.lang.reflect.Method.invoke(Method.java:564)
09:52:29 [2021-06-01T13:52:29.213Z] 	at org.eclipse.equinox.launcher.Main.invokeFramework(Main.java:653)
09:52:29 [2021-06-01T13:52:29.213Z] 	at org.eclipse.equinox.launcher.Main.basicRun(Main.java:590)
09:52:29 [2021-06-01T13:52:29.213Z] 	at org.eclipse.equinox.launcher.Main.run(Main.java:1461)
09:52:29 [2021-06-01T13:52:29.213Z] 	at org.eclipse.equinox.launcher.Main.main(Main.java:1434)
09:52:29 [2021-06-01T13:52:29.213Z] Caused by: java.lang.ClassNotFoundException: org.junit.runners.model.RunnerBuilder cannot be found by org.eclipse.tycho.surefire.osgibooter_2.2.0
09:52:29 [2021-06-01T13:52:29.213Z] 	at org.eclipse.osgi.internal.loader.BundleLoader.findClass(BundleLoader.java:516)
09:52:29 [2021-06-01T13:52:29.213Z] 	at org.eclipse.osgi.internal.loader.ModuleClassLoader.loadClass(ModuleClassLoader.java:171)
09:52:29 [2021-06-01T13:52:29.213Z] 	at java.base/java.lang.ClassLoader.loadClass(ClassLoader.java:522)
09:52:29 [2021-06-01T13:52:29.213Z] 	... 29 more
09:52:29 [2021-06-01T13:52:29.213Z] 
09:52:29 [2021-06-01T13:52:29.213Z] Running org.eclipse.ease.lang.javascript.JavaScriptCompletionContextTest
09:52:29 [2021-06-01T13:52:29.471Z] Tests run: 8, Failures: 0, Errors: 0, Skipped: 0, Time elapsed: 0.808 s - in org.eclipse.ease.lang.javascript.JavaScriptCompletionContextTest
09:52:29 [2021-06-01T13:52:29.471Z] verifyStaticClassTypes  Time elapsed: 0.282 s
09:52:29 [2021-06-01T13:52:29.472Z] verifyClassInstanceTypes  Time elapsed: 0.027 s
09:52:29 [2021-06-01T13:52:29.472Z] verifyTypesForScriptEngine  Time elapsed: 0.481 s
09:52:29 [2021-06-01T13:52:29.472Z] verifyPackageTypes  Time elapsed: 0.001 s
09:52:29 [2021-06-01T13:52:29.472Z] definedVariableTypes  Time elapsed: 0.002 s
09:52:29 [2021-06-01T13:52:29.472Z] verifyStringLiteralTypes  Time elapsed: 0.001 s
09:52:29 [2021-06-01T13:52:29.472Z] verifyUnknownTypes  Time elapsed: 0.001 s
09:52:29 [2021-06-01T13:52:29.472Z] verifyNoneTypes  Time elapsed: 0 s
09:52:29 [2021-06-01T13:52:29.472Z] Running org.eclipse.ease.lang.javascript.JavaScriptCodeFactoryTest
09:52:29 [2021-06-01T13:52:29.472Z] Tests run: 1, Failures: 0, Errors: 0, Skipped: 0, Time elapsed: 0.003 s - in org.eclipse.ease.lang.javascript.JavaScriptCodeFactoryTest
09:52:29 [2021-06-01T13:52:29.472Z] testCommentCreator  Time elapsed: 0.002 s
09:52:29 [2021-06-01T13:52:29.472Z] 
09:52:29 [2021-06-01T13:52:29.472Z] Results:
09:52:29 [2021-06-01T13:52:29.472Z] 
09:52:29 [2021-06-01T13:52:29.472Z] Tests run: 9, Failures: 0, Errors: 0, Skipped: 0
09:52:29 [2021-06-01T13:52:29.472Z] 
09:52:34 [2021-06-01T13:52:34.735Z] [INFO] All tests passed!
09:52:34 [2021-06-01T13:52:34.735Z] [INFO] 
09:52:34 [2021-06-01T13:52:34.735Z] [INFO] --- maven-pmd-plugin:3.14.0:pmd (pmd-integration) @ org.eclipse.ease.lang.javascript.test ---
09:52:35 [2021-06-01T13:52:35.032Z] [INFO] 
09:52:35 [2021-06-01T13:52:35.032Z] [INFO] --- maven-pmd-plugin:3.14.0:cpd (pmd-integration) @ org.eclipse.ease.lang.javascript.test ---
09:52:35 [2021-06-01T13:52:35.032Z] [INFO] 
09:52:35 [2021-06-01T13:52:35.032Z] [INFO] --- spotbugs-maven-plugin:4.1.4:spotbugs (spotbugs-integration) @ org.eclipse.ease.lang.javascript.test ---
09:52:35 [2021-06-01T13:52:35.032Z] [INFO] Fork Value is false
09:52:35 [2021-06-01T13:52:35.032Z]      [java] JVM args ignored when same JVM is used.
09:52:39 [2021-06-01T13:52:39.291Z] [INFO] Done SpotBugs Analysis....
09:52:39 [2021-06-01T13:52:39.291Z] [INFO] 
09:52:39 [2021-06-01T13:52:39.291Z] [INFO] --- maven-checkstyle-plugin:3.1.1:check (checkstyle-integration) @ org.eclipse.ease.lang.javascript.test ---
09:52:39 [2021-06-01T13:52:39.291Z] [INFO] You have 0 Checkstyle violations.
09:52:39 [2021-06-01T13:52:39.291Z] [INFO] 
09:52:39 [2021-06-01T13:52:39.291Z] [INFO] --- maven-install-plugin:2.3.1:install (default-install) @ org.eclipse.ease.lang.javascript.test ---
09:52:39 [2021-06-01T13:52:39.291Z] [INFO] Installing /home/jenkins/agent/workspace/ease.verify.core.target.2019-06/tests/org.eclipse.ease.lang.javascript.test/target/org.eclipse.ease.lang.javascript.test-0.8.0-SNAPSHOT.jar to /home/jenkins/.m2/repository/org/eclipse/ease/org.eclipse.ease.lang.javascript.test/0.8.0-SNAPSHOT/org.eclipse.ease.lang.javascript.test-0.8.0-SNAPSHOT.jar
09:52:39 [2021-06-01T13:52:39.291Z] [INFO] Installing /home/jenkins/agent/workspace/ease.verify.core.target.2019-06/tests/org.eclipse.ease.lang.javascript.test/pom.xml to /home/jenkins/.m2/repository/org/eclipse/ease/org.eclipse.ease.lang.javascript.test/0.8.0-SNAPSHOT/org.eclipse.ease.lang.javascript.test-0.8.0-SNAPSHOT.pom
09:52:39 [2021-06-01T13:52:39.291Z] [INFO] Installing /home/jenkins/agent/workspace/ease.verify.core.target.2019-06/tests/org.eclipse.ease.lang.javascript.test/target/p2content.xml to /home/jenkins/.m2/repository/org/eclipse/ease/org.eclipse.ease.lang.javascript.test/0.8.0-SNAPSHOT/org.eclipse.ease.lang.javascript.test-0.8.0-SNAPSHOT-p2metadata.xml
09:52:39 [2021-06-01T13:52:39.291Z] [INFO] Installing /home/jenkins/agent/workspace/ease.verify.core.target.2019-06/tests/org.eclipse.ease.lang.javascript.test/target/p2artifacts.xml to /home/jenkins/.m2/repository/org/eclipse/ease/org.eclipse.ease.lang.javascript.test/0.8.0-SNAPSHOT/org.eclipse.ease.lang.javascript.test-0.8.0-SNAPSHOT-p2artifacts.xml
09:52:39 [2021-06-01T13:52:39.291Z] [INFO] 
09:52:39 [2021-06-01T13:52:39.291Z] [INFO] --- tycho-p2-plugin:2.2.0:update-local-index (default-update-local-index) @ org.eclipse.ease.lang.javascript.test ---
09:52:39 [2021-06-01T13:52:39.291Z] [INFO] 
09:52:39 [2021-06-01T13:52:39.291Z] [INFO] ---------< org.eclipse.ease:org.eclipse.ease.lang.python.test >---------
09:52:39 [2021-06-01T13:52:39.291Z] [INFO] Building org.eclipse.ease.lang.python.test 0.8.0-SNAPSHOT        [41/48]
09:52:39 [2021-06-01T13:52:39.291Z] [INFO] ------------------------[ eclipse-test-plugin ]-------------------------
09:52:39 [2021-06-01T13:52:39.291Z] [INFO] 
09:52:39 [2021-06-01T13:52:39.291Z] [INFO] --- maven-clean-plugin:2.5:clean (default-clean) @ org.eclipse.ease.lang.python.test ---
09:52:39 [2021-06-01T13:52:39.291Z] [INFO] 
09:52:39 [2021-06-01T13:52:39.292Z] [INFO] --- tycho-packaging-plugin:2.2.0:build-qualifier (default-build-qualifier) @ org.eclipse.ease.lang.python.test ---
09:52:39 [2021-06-01T13:52:39.292Z] [INFO] The project's OSGi version is 0.8.0.I202104091518
09:52:39 [2021-06-01T13:52:39.292Z] [INFO] 
09:52:39 [2021-06-01T13:52:39.292Z] [INFO] --- tycho-packaging-plugin:2.2.0:validate-id (default-validate-id) @ org.eclipse.ease.lang.python.test ---
09:52:39 [2021-06-01T13:52:39.292Z] [INFO] 
09:52:39 [2021-06-01T13:52:39.292Z] [INFO] --- tycho-packaging-plugin:2.2.0:validate-version (default-validate-version) @ org.eclipse.ease.lang.python.test ---
09:52:39 [2021-06-01T13:52:39.292Z] [INFO] 
09:52:39 [2021-06-01T13:52:39.292Z] [INFO] --- maven-resources-plugin:2.4.3:resources (default-resources) @ org.eclipse.ease.lang.python.test ---
09:52:39 [2021-06-01T13:52:39.292Z] [INFO] Using 'UTF-8' encoding to copy filtered resources.
09:52:39 [2021-06-01T13:52:39.292Z] [INFO] skip non existing resourceDirectory /home/jenkins/agent/workspace/ease.verify.core.target.2019-06/tests/org.eclipse.ease.lang.python.test/src/main/resources
09:52:39 [2021-06-01T13:52:39.292Z] [INFO] 
09:52:39 [2021-06-01T13:52:39.292Z] [INFO] --- tycho-compiler-plugin:2.2.0:compile (default-compile) @ org.eclipse.ease.lang.python.test ---
09:52:40 [2021-06-01T13:52:40.495Z] [INFO] Compiling 1 source file to /home/jenkins/agent/workspace/ease.verify.core.target.2019-06/tests/org.eclipse.ease.lang.python.test/target/classes
09:52:41 [2021-06-01T13:52:41.871Z] [INFO] 
09:52:41 [2021-06-01T13:52:41.871Z] [INFO] --- maven-resources-plugin:2.4.3:testResources (default-testResources) @ org.eclipse.ease.lang.python.test ---
09:52:41 [2021-06-01T13:52:41.871Z] [INFO] Using 'UTF-8' encoding to copy filtered resources.
09:52:41 [2021-06-01T13:52:41.871Z] [INFO] skip non existing resourceDirectory /home/jenkins/agent/workspace/ease.verify.core.target.2019-06/tests/org.eclipse.ease.lang.python.test/src/test/resources
09:52:41 [2021-06-01T13:52:41.871Z] [INFO] 
09:52:41 [2021-06-01T13:52:41.871Z] [INFO] --- target-platform-configuration:2.2.0:target-platform (default-target-platform) @ org.eclipse.ease.lang.python.test ---
09:52:41 [2021-06-01T13:52:41.871Z] [INFO] 
09:52:41 [2021-06-01T13:52:41.871Z] [INFO] --- tycho-packaging-plugin:2.2.0:package-plugin (default-package-plugin) @ org.eclipse.ease.lang.python.test ---
09:52:41 [2021-06-01T13:52:41.871Z] [INFO] Building jar: /home/jenkins/agent/workspace/ease.verify.core.target.2019-06/tests/org.eclipse.ease.lang.python.test/target/org.eclipse.ease.lang.python.test-0.8.0-SNAPSHOT.jar
09:52:41 [2021-06-01T13:52:41.871Z] [INFO] 
09:52:41 [2021-06-01T13:52:41.871Z] [INFO] --- tycho-p2-plugin:2.2.0:p2-metadata-default (default-p2-metadata-default) @ org.eclipse.ease.lang.python.test ---
09:52:41 [2021-06-01T13:52:41.871Z] [INFO] 
09:52:41 [2021-06-01T13:52:41.871Z] [INFO] --- jacoco-maven-plugin:0.8.6:prepare-agent (jacoco-initialize) @ org.eclipse.ease.lang.python.test ---
09:52:41 [2021-06-01T13:52:41.871Z] [INFO] tycho.testArgLine set to -javaagent:/home/jenkins/.m2/repository/org/jacoco/org.jacoco.agent/0.8.6/org.jacoco.agent-0.8.6-runtime.jar=destfile=/home/jenkins/agent/workspace/ease.verify.core.target.2019-06/tests/org.eclipse.ease.lang.python.test/target/jacoco.exec,output=file
09:52:41 [2021-06-01T13:52:41.871Z] [INFO] 
09:52:41 [2021-06-01T13:52:41.871Z] [INFO] --- tycho-surefire-plugin:2.2.0:test (default-test) @ org.eclipse.ease.lang.python.test ---
09:52:42 [2021-06-01T13:52:42.134Z] [INFO] Executing Test Runtime with timeout 0, logs (if any) will be placed at: /home/jenkins/agent/workspace/ease.verify.core.target.2019-06/tests/org.eclipse.ease.lang.python.test/target/work/data/.metadata/.log
09:52:42 [2021-06-01T13:52:42.134Z] [INFO] Command line:
09:52:42 [2021-06-01T13:52:42.134Z] 	[/opt/tools/java/openjdk/jdk-15/15.0.2+7/bin/java, -Dosgi.noShutdown=false, -Dosgi.os=linux, -Dosgi.ws=gtk, -Dosgi.arch=x86_64, -javaagent:/home/jenkins/.m2/repository/org/jacoco/org.jacoco.agent/0.8.6/org.jacoco.agent-0.8.6-runtime.jar=destfile=/home/jenkins/agent/workspace/ease.verify.core.target.2019-06/tests/org.eclipse.ease.lang.python.test/target/jacoco.exec,output=file, -Dosgi.clean=true, -jar, /home/jenkins/.m2/repository/p2/osgi/bundle/org.eclipse.equinox.launcher/1.6.0.v20200915-1508/org.eclipse.equinox.launcher-1.6.0.v20200915-1508.jar, -data, /home/jenkins/agent/workspace/ease.verify.core.target.2019-06/tests/org.eclipse.ease.lang.python.test/target/work/data, -install, /home/jenkins/agent/workspace/ease.verify.core.target.2019-06/tests/org.eclipse.ease.lang.python.test/target/work, -configuration, /home/jenkins/agent/workspace/ease.verify.core.target.2019-06/tests/org.eclipse.ease.lang.python.test/target/work/configuration, -application, org.eclipse.tycho.surefire.osgibooter.headlesstest, -testproperties, /home/jenkins/agent/workspace/ease.verify.core.target.2019-06/tests/org.eclipse.ease.lang.python.test/target/surefire.properties]
09:52:42 [2021-06-01T13:52:42.135Z] Picked up JAVA_TOOL_OPTIONS: -Dmaven.ext.class.path="/home/jenkins/agent/workspace/ease.verify.core.target.2019-06@tmp/withMaven65c87659/pipeline-maven-spy.jar" -Dorg.jenkinsci.plugins.pipeline.maven.reportsFolder="/home/jenkins/agent/workspace/ease.verify.core.target.2019-06@tmp/withMaven65c87659" 
09:52:46 [2021-06-01T13:52:46.390Z] Jun 01, 2021 1:52:46 PM org.junit.platform.launcher.core.DefaultLauncher handleThrowable
09:52:46 [2021-06-01T13:52:46.390Z] WARNING: TestEngine with ID 'junit-vintage' failed to discover tests
09:52:46 [2021-06-01T13:52:46.390Z] java.lang.NoClassDefFoundError: org/junit/runners/model/RunnerBuilder
09:52:46 [2021-06-01T13:52:46.390Z] 	at org.junit.vintage.engine.discovery.VintageDiscoverer.<init>(VintageDiscoverer.java:48)
09:52:46 [2021-06-01T13:52:46.390Z] 	at org.junit.vintage.engine.VintageTestEngine.discover(VintageTestEngine.java:65)
09:52:46 [2021-06-01T13:52:46.390Z] 	at org.junit.platform.launcher.core.DefaultLauncher.discoverEngineRoot(DefaultLauncher.java:130)
09:52:46 [2021-06-01T13:52:46.390Z] 	at org.junit.platform.launcher.core.DefaultLauncher.discoverRoot(DefaultLauncher.java:117)
09:52:46 [2021-06-01T13:52:46.391Z] 	at org.junit.platform.launcher.core.DefaultLauncher.discover(DefaultLauncher.java:82)
09:52:46 [2021-06-01T13:52:46.391Z] 	at org.apache.maven.surefire.junitplatform.TestPlanScannerFilter.accept(TestPlanScannerFilter.java:56)
09:52:46 [2021-06-01T13:52:46.391Z] 	at org.apache.maven.surefire.util.DefaultScanResult.applyFilter(DefaultScanResult.java:102)
09:52:46 [2021-06-01T13:52:46.391Z] 	at org.apache.maven.surefire.junitplatform.JUnitPlatformProvider.scanClasspath(JUnitPlatformProvider.java:143)
09:52:46 [2021-06-01T13:52:46.391Z] 	at org.apache.maven.surefire.junitplatform.JUnitPlatformProvider.invoke(JUnitPlatformProvider.java:124)
09:52:46 [2021-06-01T13:52:46.391Z] 	at java.base/jdk.internal.reflect.NativeMethodAccessorImpl.invoke0(Native Method)
09:52:46 [2021-06-01T13:52:46.391Z] 	at java.base/jdk.internal.reflect.NativeMethodAccessorImpl.invoke(NativeMethodAccessorImpl.java:64)
09:52:46 [2021-06-01T13:52:46.391Z] 	at java.base/jdk.internal.reflect.DelegatingMethodAccessorImpl.invoke(DelegatingMethodAccessorImpl.java:43)
09:52:46 [2021-06-01T13:52:46.391Z] 	at java.base/java.lang.reflect.Method.invoke(Method.java:564)
09:52:46 [2021-06-01T13:52:46.391Z] 	at org.apache.maven.surefire.util.ReflectionUtils.invokeMethodWithArray2(ReflectionUtils.java:206)
09:52:46 [2021-06-01T13:52:46.391Z] 	at org.apache.maven.surefire.booter.ProviderFactory$ProviderProxy.invoke(ProviderFactory.java:161)
09:52:46 [2021-06-01T13:52:46.391Z] 	at org.apache.maven.surefire.booter.ProviderFactory.invokeProvider(ProviderFactory.java:84)
09:52:46 [2021-06-01T13:52:46.391Z] 	at org.eclipse.tycho.surefire.osgibooter.OsgiSurefireBooter.run(OsgiSurefireBooter.java:116)
09:52:46 [2021-06-01T13:52:46.391Z] 	at org.eclipse.tycho.surefire.osgibooter.HeadlessTestApplication.start(HeadlessTestApplication.java:23)
09:52:46 [2021-06-01T13:52:46.391Z] 	at org.eclipse.equinox.internal.app.EclipseAppHandle.run(EclipseAppHandle.java:203)
09:52:46 [2021-06-01T13:52:46.391Z] 	at org.eclipse.core.runtime.internal.adaptor.EclipseAppLauncher.runApplication(EclipseAppLauncher.java:134)
09:52:46 [2021-06-01T13:52:46.391Z] 	at org.eclipse.core.runtime.internal.adaptor.EclipseAppLauncher.start(EclipseAppLauncher.java:104)
09:52:46 [2021-06-01T13:52:46.391Z] 	at org.eclipse.core.runtime.adaptor.EclipseStarter.run(EclipseStarter.java:401)
09:52:46 [2021-06-01T13:52:46.391Z] 	at org.eclipse.core.runtime.adaptor.EclipseStarter.run(EclipseStarter.java:255)
09:52:46 [2021-06-01T13:52:46.391Z] 	at java.base/jdk.internal.reflect.NativeMethodAccessorImpl.invoke0(Native Method)
09:52:46 [2021-06-01T13:52:46.391Z] 	at java.base/jdk.internal.reflect.NativeMethodAccessorImpl.invoke(NativeMethodAccessorImpl.java:64)
09:52:46 [2021-06-01T13:52:46.391Z] 	at java.base/jdk.internal.reflect.DelegatingMethodAccessorImpl.invoke(DelegatingMethodAccessorImpl.java:43)
09:52:46 [2021-06-01T13:52:46.391Z] 	at java.base/java.lang.reflect.Method.invoke(Method.java:564)
09:52:46 [2021-06-01T13:52:46.391Z] 	at org.eclipse.equinox.launcher.Main.invokeFramework(Main.java:653)
09:52:46 [2021-06-01T13:52:46.391Z] 	at org.eclipse.equinox.launcher.Main.basicRun(Main.java:590)
09:52:46 [2021-06-01T13:52:46.391Z] 	at org.eclipse.equinox.launcher.Main.run(Main.java:1461)
09:52:46 [2021-06-01T13:52:46.391Z] 	at org.eclipse.equinox.launcher.Main.main(Main.java:1434)
09:52:46 [2021-06-01T13:52:46.391Z] Caused by: java.lang.ClassNotFoundException: org.junit.runners.model.RunnerBuilder cannot be found by org.eclipse.tycho.surefire.osgibooter_2.2.0
09:52:46 [2021-06-01T13:52:46.391Z] 	at org.eclipse.osgi.internal.loader.BundleLoader.findClass(BundleLoader.java:516)
09:52:46 [2021-06-01T13:52:46.391Z] 	at org.eclipse.osgi.internal.loader.ModuleClassLoader.loadClass(ModuleClassLoader.java:171)
09:52:46 [2021-06-01T13:52:46.391Z] 	at java.base/java.lang.ClassLoader.loadClass(ClassLoader.java:522)
09:52:46 [2021-06-01T13:52:46.391Z] 	... 31 more
09:52:46 [2021-06-01T13:52:46.391Z] 
09:52:46 [2021-06-01T13:52:46.391Z] Jun 01, 2021 1:52:46 PM org.junit.platform.launcher.core.DefaultLauncher handleThrowable
09:52:46 [2021-06-01T13:52:46.391Z] WARNING: TestEngine with ID 'junit-vintage' failed to discover tests
09:52:46 [2021-06-01T13:52:46.391Z] java.lang.NoClassDefFoundError: org/junit/runners/model/RunnerBuilder
09:52:46 [2021-06-01T13:52:46.391Z] 	at org.junit.vintage.engine.discovery.VintageDiscoverer.<init>(VintageDiscoverer.java:48)
09:52:46 [2021-06-01T13:52:46.391Z] 	at org.junit.vintage.engine.VintageTestEngine.discover(VintageTestEngine.java:65)
09:52:46 [2021-06-01T13:52:46.391Z] 	at org.junit.platform.launcher.core.DefaultLauncher.discoverEngineRoot(DefaultLauncher.java:130)
09:52:46 [2021-06-01T13:52:46.391Z] 	at org.junit.platform.launcher.core.DefaultLauncher.discoverRoot(DefaultLauncher.java:117)
09:52:46 [2021-06-01T13:52:46.391Z] 	at org.junit.platform.launcher.core.DefaultLauncher.execute(DefaultLauncher.java:90)
09:52:46 [2021-06-01T13:52:46.391Z] 	at org.apache.maven.surefire.junitplatform.JUnitPlatformProvider.invokeAllTests(JUnitPlatformProvider.java:150)
09:52:46 [2021-06-01T13:52:46.391Z] 	at org.apache.maven.surefire.junitplatform.JUnitPlatformProvider.invoke(JUnitPlatformProvider.java:124)
09:52:46 [2021-06-01T13:52:46.391Z] 	at java.base/jdk.internal.reflect.NativeMethodAccessorImpl.invoke0(Native Method)
09:52:46 [2021-06-01T13:52:46.391Z] 	at java.base/jdk.internal.reflect.NativeMethodAccessorImpl.invoke(NativeMethodAccessorImpl.java:64)
09:52:46 [2021-06-01T13:52:46.391Z] 	at java.base/jdk.internal.reflect.DelegatingMethodAccessorImpl.invoke(DelegatingMethodAccessorImpl.java:43)
09:52:46 [2021-06-01T13:52:46.391Z] 	at java.base/java.lang.reflect.Method.invoke(Method.java:564)
09:52:46 [2021-06-01T13:52:46.391Z] 	at org.apache.maven.surefire.util.ReflectionUtils.invokeMethodWithArray2(ReflectionUtils.java:206)
09:52:46 [2021-06-01T13:52:46.391Z] 	at org.apache.maven.surefire.booter.ProviderFactory$ProviderProxy.invoke(ProviderFactory.java:161)
09:52:46 [2021-06-01T13:52:46.391Z] 	at org.apache.maven.surefire.booter.ProviderFactory.invokeProvider(ProviderFactory.java:84)
09:52:46 [2021-06-01T13:52:46.391Z] 	at org.eclipse.tycho.surefire.osgibooter.OsgiSurefireBooter.run(OsgiSurefireBooter.java:116)
09:52:46 [2021-06-01T13:52:46.391Z] 	at org.eclipse.tycho.surefire.osgibooter.HeadlessTestApplication.start(HeadlessTestApplication.java:23)
09:52:46 [2021-06-01T13:52:46.391Z] 	at org.eclipse.equinox.internal.app.EclipseAppHandle.run(EclipseAppHandle.java:203)
09:52:46 [2021-06-01T13:52:46.391Z] 	at org.eclipse.core.runtime.internal.adaptor.EclipseAppLauncher.runApplication(EclipseAppLauncher.java:134)
09:52:46 [2021-06-01T13:52:46.391Z] 	at org.eclipse.core.runtime.internal.adaptor.EclipseAppLauncher.start(EclipseAppLauncher.java:104)
09:52:46 [2021-06-01T13:52:46.391Z] 	at org.eclipse.core.runtime.adaptor.EclipseStarter.run(EclipseStarter.java:401)
09:52:46 [2021-06-01T13:52:46.392Z] 	at org.eclipse.core.runtime.adaptor.EclipseStarter.run(EclipseStarter.java:255)
09:52:46 [2021-06-01T13:52:46.392Z] 	at java.base/jdk.internal.reflect.NativeMethodAccessorImpl.invoke0(Native Method)
09:52:46 [2021-06-01T13:52:46.392Z] 	at java.base/jdk.internal.reflect.NativeMethodAccessorImpl.invoke(NativeMethodAccessorImpl.java:64)
09:52:46 [2021-06-01T13:52:46.392Z] 	at java.base/jdk.internal.reflect.DelegatingMethodAccessorImpl.invoke(DelegatingMethodAccessorImpl.java:43)
09:52:46 [2021-06-01T13:52:46.392Z] 	at java.base/java.lang.reflect.Method.invoke(Method.java:564)
09:52:46 [2021-06-01T13:52:46.392Z] 	at org.eclipse.equinox.launcher.Main.invokeFramework(Main.java:653)
09:52:46 [2021-06-01T13:52:46.392Z] 	at org.eclipse.equinox.launcher.Main.basicRun(Main.java:590)
09:52:46 [2021-06-01T13:52:46.392Z] 	at org.eclipse.equinox.launcher.Main.run(Main.java:1461)
09:52:46 [2021-06-01T13:52:46.392Z] 	at org.eclipse.equinox.launcher.Main.main(Main.java:1434)
09:52:46 [2021-06-01T13:52:46.392Z] Caused by: java.lang.ClassNotFoundException: org.junit.runners.model.RunnerBuilder cannot be found by org.eclipse.tycho.surefire.osgibooter_2.2.0
09:52:46 [2021-06-01T13:52:46.392Z] 	at org.eclipse.osgi.internal.loader.BundleLoader.findClass(BundleLoader.java:516)
09:52:46 [2021-06-01T13:52:46.392Z] 	at org.eclipse.osgi.internal.loader.ModuleClassLoader.loadClass(ModuleClassLoader.java:171)
09:52:46 [2021-06-01T13:52:46.392Z] 	at java.base/java.lang.ClassLoader.loadClass(ClassLoader.java:522)
09:52:46 [2021-06-01T13:52:46.392Z] 	... 29 more
09:52:46 [2021-06-01T13:52:46.392Z] 
09:52:46 [2021-06-01T13:52:46.649Z] Running org.eclipse.ease.lang.python.PythonCodeFactoryTest
09:52:52 [2021-06-01T13:52:52.429Z] Tests run: 3, Failures: 0, Errors: 0, Skipped: 0, Time elapsed: 1.293 s - in org.eclipse.ease.lang.python.PythonCodeFactoryTest
09:52:52 [2021-06-01T13:52:52.429Z] createFunctionWrapper_creates_return_andParameters_for_Py4J  Time elapsed: 1.279 s
09:52:52 [2021-06-01T13:52:52.429Z] testCommentCreator  Time elapsed: 0.002 s
09:52:52 [2021-06-01T13:52:52.429Z] createFunctionWrapper_creates_void_return_types_for_Py4J  Time elapsed: 0.003 s
09:52:52 [2021-06-01T13:52:52.430Z] 
09:52:52 [2021-06-01T13:52:52.430Z] Results:
09:52:52 [2021-06-01T13:52:52.430Z] 
09:52:52 [2021-06-01T13:52:52.430Z] Tests run: 3, Failures: 0, Errors: 0, Skipped: 0
09:52:52 [2021-06-01T13:52:52.430Z] 
09:52:58 [2021-06-01T13:52:58.988Z] [INFO] All tests passed!
09:52:58 [2021-06-01T13:52:58.988Z] [INFO] 
09:52:58 [2021-06-01T13:52:58.988Z] [INFO] --- maven-pmd-plugin:3.14.0:pmd (pmd-integration) @ org.eclipse.ease.lang.python.test ---
09:52:58 [2021-06-01T13:52:58.988Z] [INFO] 
09:52:58 [2021-06-01T13:52:58.988Z] [INFO] --- maven-pmd-plugin:3.14.0:cpd (pmd-integration) @ org.eclipse.ease.lang.python.test ---
09:52:58 [2021-06-01T13:52:58.988Z] [INFO] 
09:52:58 [2021-06-01T13:52:58.988Z] [INFO] --- spotbugs-maven-plugin:4.1.4:spotbugs (spotbugs-integration) @ org.eclipse.ease.lang.python.test ---
09:52:58 [2021-06-01T13:52:58.988Z] [INFO] Fork Value is false
09:52:58 [2021-06-01T13:52:58.988Z]      [java] JVM args ignored when same JVM is used.
09:53:02 [2021-06-01T13:53:02.283Z] [INFO] Done SpotBugs Analysis....
09:53:02 [2021-06-01T13:53:02.283Z] [INFO] 
09:53:02 [2021-06-01T13:53:02.284Z] [INFO] --- maven-checkstyle-plugin:3.1.1:check (checkstyle-integration) @ org.eclipse.ease.lang.python.test ---
09:53:02 [2021-06-01T13:53:02.541Z] [INFO] You have 0 Checkstyle violations.
09:53:02 [2021-06-01T13:53:02.541Z] [INFO] 
09:53:02 [2021-06-01T13:53:02.541Z] [INFO] --- maven-install-plugin:2.3.1:install (default-install) @ org.eclipse.ease.lang.python.test ---
09:53:02 [2021-06-01T13:53:02.541Z] [INFO] Installing /home/jenkins/agent/workspace/ease.verify.core.target.2019-06/tests/org.eclipse.ease.lang.python.test/target/org.eclipse.ease.lang.python.test-0.8.0-SNAPSHOT.jar to /home/jenkins/.m2/repository/org/eclipse/ease/org.eclipse.ease.lang.python.test/0.8.0-SNAPSHOT/org.eclipse.ease.lang.python.test-0.8.0-SNAPSHOT.jar
09:53:02 [2021-06-01T13:53:02.799Z] [INFO] Installing /home/jenkins/agent/workspace/ease.verify.core.target.2019-06/tests/org.eclipse.ease.lang.python.test/pom.xml to /home/jenkins/.m2/repository/org/eclipse/ease/org.eclipse.ease.lang.python.test/0.8.0-SNAPSHOT/org.eclipse.ease.lang.python.test-0.8.0-SNAPSHOT.pom
09:53:03 [2021-06-01T13:53:03.059Z] [INFO] Installing /home/jenkins/agent/workspace/ease.verify.core.target.2019-06/tests/org.eclipse.ease.lang.python.test/target/p2content.xml to /home/jenkins/.m2/repository/org/eclipse/ease/org.eclipse.ease.lang.python.test/0.8.0-SNAPSHOT/org.eclipse.ease.lang.python.test-0.8.0-SNAPSHOT-p2metadata.xml
09:53:03 [2021-06-01T13:53:03.634Z] [INFO] Installing /home/jenkins/agent/workspace/ease.verify.core.target.2019-06/tests/org.eclipse.ease.lang.python.test/target/p2artifacts.xml to /home/jenkins/.m2/repository/org/eclipse/ease/org.eclipse.ease.lang.python.test/0.8.0-SNAPSHOT/org.eclipse.ease.lang.python.test-0.8.0-SNAPSHOT-p2artifacts.xml
09:53:03 [2021-06-01T13:53:03.634Z] [INFO] 
09:53:03 [2021-06-01T13:53:03.634Z] [INFO] --- tycho-p2-plugin:2.2.0:update-local-index (default-update-local-index) @ org.eclipse.ease.lang.python.test ---
09:53:03 [2021-06-01T13:53:03.634Z] [INFO] 
09:53:03 [2021-06-01T13:53:03.634Z] [INFO] -----< org.eclipse.ease:org.eclipse.ease.lang.python.jython.test >------
09:53:03 [2021-06-01T13:53:03.634Z] [INFO] Building org.eclipse.ease.lang.python.jython.test 0.8.0-SNAPSHOT [42/48]
09:53:03 [2021-06-01T13:53:03.634Z] [INFO] ------------------------[ eclipse-test-plugin ]-------------------------
09:53:03 [2021-06-01T13:53:03.634Z] [INFO] 
09:53:03 [2021-06-01T13:53:03.634Z] [INFO] --- maven-clean-plugin:2.5:clean (default-clean) @ org.eclipse.ease.lang.python.jython.test ---
09:53:03 [2021-06-01T13:53:03.634Z] [INFO] 
09:53:03 [2021-06-01T13:53:03.634Z] [INFO] --- tycho-packaging-plugin:2.2.0:build-qualifier (default-build-qualifier) @ org.eclipse.ease.lang.python.jython.test ---
09:53:03 [2021-06-01T13:53:03.634Z] [INFO] The project's OSGi version is 0.8.0.I202104091518
09:53:03 [2021-06-01T13:53:03.634Z] [INFO] 
09:53:03 [2021-06-01T13:53:03.634Z] [INFO] --- tycho-packaging-plugin:2.2.0:validate-id (default-validate-id) @ org.eclipse.ease.lang.python.jython.test ---
09:53:03 [2021-06-01T13:53:03.634Z] [INFO] 
09:53:03 [2021-06-01T13:53:03.634Z] [INFO] --- tycho-packaging-plugin:2.2.0:validate-version (default-validate-version) @ org.eclipse.ease.lang.python.jython.test ---
09:53:03 [2021-06-01T13:53:03.634Z] [INFO] 
09:53:03 [2021-06-01T13:53:03.634Z] [INFO] --- maven-resources-plugin:2.4.3:resources (default-resources) @ org.eclipse.ease.lang.python.jython.test ---
09:53:03 [2021-06-01T13:53:03.634Z] [INFO] Using 'UTF-8' encoding to copy filtered resources.
09:53:03 [2021-06-01T13:53:03.634Z] [INFO] skip non existing resourceDirectory /home/jenkins/agent/workspace/ease.verify.core.target.2019-06/tests/org.eclipse.ease.lang.python.jython.test/src/main/resources
09:53:03 [2021-06-01T13:53:03.635Z] [INFO] 
09:53:03 [2021-06-01T13:53:03.635Z] [INFO] --- tycho-compiler-plugin:2.2.0:compile (default-compile) @ org.eclipse.ease.lang.python.jython.test ---
09:53:03 [2021-06-01T13:53:03.635Z] [INFO] Compiling 1 source file to /home/jenkins/agent/workspace/ease.verify.core.target.2019-06/tests/org.eclipse.ease.lang.python.jython.test/target/classes
09:53:03 [2021-06-01T13:53:03.635Z] [INFO] 
09:53:03 [2021-06-01T13:53:03.635Z] [INFO] --- maven-resources-plugin:2.4.3:testResources (default-testResources) @ org.eclipse.ease.lang.python.jython.test ---
09:53:03 [2021-06-01T13:53:03.635Z] [INFO] Using 'UTF-8' encoding to copy filtered resources.
09:53:03 [2021-06-01T13:53:03.635Z] [INFO] skip non existing resourceDirectory /home/jenkins/agent/workspace/ease.verify.core.target.2019-06/tests/org.eclipse.ease.lang.python.jython.test/src/test/resources
09:53:03 [2021-06-01T13:53:03.635Z] [INFO] 
09:53:03 [2021-06-01T13:53:03.635Z] [INFO] --- target-platform-configuration:2.2.0:target-platform (default-target-platform) @ org.eclipse.ease.lang.python.jython.test ---
09:53:03 [2021-06-01T13:53:03.635Z] [INFO] 
09:53:03 [2021-06-01T13:53:03.635Z] [INFO] --- tycho-packaging-plugin:2.2.0:package-plugin (default-package-plugin) @ org.eclipse.ease.lang.python.jython.test ---
09:53:03 [2021-06-01T13:53:03.893Z] [INFO] Building jar: /home/jenkins/agent/workspace/ease.verify.core.target.2019-06/tests/org.eclipse.ease.lang.python.jython.test/target/org.eclipse.ease.lang.python.jython.test-0.8.0-SNAPSHOT.jar
09:53:03 [2021-06-01T13:53:03.893Z] [INFO] 
09:53:03 [2021-06-01T13:53:03.893Z] [INFO] --- tycho-p2-plugin:2.2.0:p2-metadata-default (default-p2-metadata-default) @ org.eclipse.ease.lang.python.jython.test ---
09:53:03 [2021-06-01T13:53:03.893Z] [INFO] 
09:53:03 [2021-06-01T13:53:03.893Z] [INFO] --- jacoco-maven-plugin:0.8.6:prepare-agent (jacoco-initialize) @ org.eclipse.ease.lang.python.jython.test ---
09:53:03 [2021-06-01T13:53:03.893Z] [INFO] tycho.testArgLine set to -javaagent:/home/jenkins/.m2/repository/org/jacoco/org.jacoco.agent/0.8.6/org.jacoco.agent-0.8.6-runtime.jar=destfile=/home/jenkins/agent/workspace/ease.verify.core.target.2019-06/tests/org.eclipse.ease.lang.python.jython.test/target/jacoco.exec,output=file
09:53:03 [2021-06-01T13:53:03.893Z] [INFO] 
09:53:03 [2021-06-01T13:53:03.893Z] [INFO] --- tycho-surefire-plugin:2.2.0:test (default-test) @ org.eclipse.ease.lang.python.jython.test ---
09:53:04 [2021-06-01T13:53:04.826Z] [INFO] Executing Test Runtime with timeout 0, logs (if any) will be placed at: /home/jenkins/agent/workspace/ease.verify.core.target.2019-06/tests/org.eclipse.ease.lang.python.jython.test/target/work/data/.metadata/.log
09:53:04 [2021-06-01T13:53:04.826Z] [INFO] Command line:
09:53:04 [2021-06-01T13:53:04.826Z] 	[/opt/tools/java/openjdk/jdk-15/15.0.2+7/bin/java, -Dosgi.noShutdown=false, -Dosgi.os=linux, -Dosgi.ws=gtk, -Dosgi.arch=x86_64, -javaagent:/home/jenkins/.m2/repository/org/jacoco/org.jacoco.agent/0.8.6/org.jacoco.agent-0.8.6-runtime.jar=destfile=/home/jenkins/agent/workspace/ease.verify.core.target.2019-06/tests/org.eclipse.ease.lang.python.jython.test/target/jacoco.exec,output=file, -Dosgi.clean=true, -jar, /home/jenkins/.m2/repository/p2/osgi/bundle/org.eclipse.equinox.launcher/1.6.0.v20200915-1508/org.eclipse.equinox.launcher-1.6.0.v20200915-1508.jar, -data, /home/jenkins/agent/workspace/ease.verify.core.target.2019-06/tests/org.eclipse.ease.lang.python.jython.test/target/work/data, -install, /home/jenkins/agent/workspace/ease.verify.core.target.2019-06/tests/org.eclipse.ease.lang.python.jython.test/target/work, -configuration, /home/jenkins/agent/workspace/ease.verify.core.target.2019-06/tests/org.eclipse.ease.lang.python.jython.test/target/work/configuration, -application, org.eclipse.tycho.surefire.osgibooter.headlesstest, -testproperties, /home/jenkins/agent/workspace/ease.verify.core.target.2019-06/tests/org.eclipse.ease.lang.python.jython.test/target/surefire.properties]
09:53:04 [2021-06-01T13:53:04.826Z] Picked up JAVA_TOOL_OPTIONS: -Dmaven.ext.class.path="/home/jenkins/agent/workspace/ease.verify.core.target.2019-06@tmp/withMaven65c87659/pipeline-maven-spy.jar" -Dorg.jenkinsci.plugins.pipeline.maven.reportsFolder="/home/jenkins/agent/workspace/ease.verify.core.target.2019-06@tmp/withMaven65c87659" 
09:53:11 [2021-06-01T13:53:11.553Z] WARNING: An illegal reflective access operation has occurred
09:53:11 [2021-06-01T13:53:11.553Z] WARNING: Illegal reflective access by org.python.core.PySystemState (file:/home/jenkins/agent/workspace/ease.verify.core.target.2019-06/tests/org.eclipse.ease.lang.python.jython.test/target/work/plugins/org.jython_2.7.0.I202104151016/jython.jar) to method java.io.Console.encoding()
09:53:11 [2021-06-01T13:53:11.553Z] WARNING: Please consider reporting this to the maintainers of org.python.core.PySystemState
09:53:11 [2021-06-01T13:53:11.553Z] WARNING: Use --illegal-access=warn to enable warnings of further illegal reflective access operations
09:53:11 [2021-06-01T13:53:11.553Z] WARNING: All illegal access operations will be denied in a future release
09:53:12 [2021-06-01T13:53:12.487Z] Jun 01, 2021 1:53:12 PM org.junit.platform.launcher.core.DefaultLauncher handleThrowable
09:53:12 [2021-06-01T13:53:12.487Z] WARNING: TestEngine with ID 'junit-vintage' failed to discover tests
09:53:12 [2021-06-01T13:53:12.487Z] java.lang.NoClassDefFoundError: org/junit/runners/model/RunnerBuilder
09:53:12 [2021-06-01T13:53:12.487Z] 	at org.junit.vintage.engine.discovery.VintageDiscoverer.<init>(VintageDiscoverer.java:48)
09:53:12 [2021-06-01T13:53:12.487Z] 	at org.junit.vintage.engine.VintageTestEngine.discover(VintageTestEngine.java:65)
09:53:12 [2021-06-01T13:53:12.487Z] 	at org.junit.platform.launcher.core.DefaultLauncher.discoverEngineRoot(DefaultLauncher.java:130)
09:53:12 [2021-06-01T13:53:12.487Z] 	at org.junit.platform.launcher.core.DefaultLauncher.discoverRoot(DefaultLauncher.java:117)
09:53:12 [2021-06-01T13:53:12.487Z] 	at org.junit.platform.launcher.core.DefaultLauncher.discover(DefaultLauncher.java:82)
09:53:12 [2021-06-01T13:53:12.487Z] 	at org.apache.maven.surefire.junitplatform.TestPlanScannerFilter.accept(TestPlanScannerFilter.java:56)
09:53:12 [2021-06-01T13:53:12.487Z] 	at org.apache.maven.surefire.util.DefaultScanResult.applyFilter(DefaultScanResult.java:102)
09:53:12 [2021-06-01T13:53:12.487Z] 	at org.apache.maven.surefire.junitplatform.JUnitPlatformProvider.scanClasspath(JUnitPlatformProvider.java:143)
09:53:12 [2021-06-01T13:53:12.487Z] 	at org.apache.maven.surefire.junitplatform.JUnitPlatformProvider.invoke(JUnitPlatformProvider.java:124)
09:53:12 [2021-06-01T13:53:12.487Z] 	at java.base/jdk.internal.reflect.NativeMethodAccessorImpl.invoke0(Native Method)
09:53:12 [2021-06-01T13:53:12.488Z] 	at java.base/jdk.internal.reflect.NativeMethodAccessorImpl.invoke(NativeMethodAccessorImpl.java:64)
09:53:12 [2021-06-01T13:53:12.488Z] 	at java.base/jdk.internal.reflect.DelegatingMethodAccessorImpl.invoke(DelegatingMethodAccessorImpl.java:43)
09:53:12 [2021-06-01T13:53:12.488Z] 	at java.base/java.lang.reflect.Method.invoke(Method.java:564)
09:53:12 [2021-06-01T13:53:12.488Z] 	at org.apache.maven.surefire.util.ReflectionUtils.invokeMethodWithArray2(ReflectionUtils.java:206)
09:53:12 [2021-06-01T13:53:12.488Z] 	at org.apache.maven.surefire.booter.ProviderFactory$ProviderProxy.invoke(ProviderFactory.java:161)
09:53:12 [2021-06-01T13:53:12.488Z] 	at org.apache.maven.surefire.booter.ProviderFactory.invokeProvider(ProviderFactory.java:84)
09:53:12 [2021-06-01T13:53:12.488Z] 	at org.eclipse.tycho.surefire.osgibooter.OsgiSurefireBooter.run(OsgiSurefireBooter.java:116)
09:53:12 [2021-06-01T13:53:12.488Z] 	at org.eclipse.tycho.surefire.osgibooter.HeadlessTestApplication.start(HeadlessTestApplication.java:23)
09:53:12 [2021-06-01T13:53:12.488Z] 	at org.eclipse.equinox.internal.app.EclipseAppHandle.run(EclipseAppHandle.java:203)
09:53:12 [2021-06-01T13:53:12.488Z] 	at org.eclipse.core.runtime.internal.adaptor.EclipseAppLauncher.runApplication(EclipseAppLauncher.java:134)
09:53:12 [2021-06-01T13:53:12.488Z] 	at org.eclipse.core.runtime.internal.adaptor.EclipseAppLauncher.start(EclipseAppLauncher.java:104)
09:53:12 [2021-06-01T13:53:12.488Z] 	at org.eclipse.core.runtime.adaptor.EclipseStarter.run(EclipseStarter.java:401)
09:53:12 [2021-06-01T13:53:12.488Z] 	at org.eclipse.core.runtime.adaptor.EclipseStarter.run(EclipseStarter.java:255)
09:53:12 [2021-06-01T13:53:12.488Z] 	at java.base/jdk.internal.reflect.NativeMethodAccessorImpl.invoke0(Native Method)
09:53:12 [2021-06-01T13:53:12.488Z] 	at java.base/jdk.internal.reflect.NativeMethodAccessorImpl.invoke(NativeMethodAccessorImpl.java:64)
09:53:12 [2021-06-01T13:53:12.488Z] 	at java.base/jdk.internal.reflect.DelegatingMethodAccessorImpl.invoke(DelegatingMethodAccessorImpl.java:43)
09:53:12 [2021-06-01T13:53:12.488Z] 	at java.base/java.lang.reflect.Method.invoke(Method.java:564)
09:53:12 [2021-06-01T13:53:12.488Z] 	at org.eclipse.equinox.launcher.Main.invokeFramework(Main.java:653)
09:53:12 [2021-06-01T13:53:12.488Z] 	at org.eclipse.equinox.launcher.Main.basicRun(Main.java:590)
09:53:12 [2021-06-01T13:53:12.488Z] 	at org.eclipse.equinox.launcher.Main.run(Main.java:1461)
09:53:12 [2021-06-01T13:53:12.488Z] 	at org.eclipse.equinox.launcher.Main.main(Main.java:1434)
09:53:12 [2021-06-01T13:53:12.488Z] Caused by: java.lang.ClassNotFoundException: org.junit.runners.model.RunnerBuilder cannot be found by org.eclipse.tycho.surefire.osgibooter_2.2.0
09:53:12 [2021-06-01T13:53:12.488Z] 	at org.eclipse.osgi.internal.loader.BundleLoader.findClass(BundleLoader.java:516)
09:53:12 [2021-06-01T13:53:12.488Z] 	at org.eclipse.osgi.internal.loader.ModuleClassLoader.loadClass(ModuleClassLoader.java:171)
09:53:12 [2021-06-01T13:53:12.488Z] 	at java.base/java.lang.ClassLoader.loadClass(ClassLoader.java:522)
09:53:12 [2021-06-01T13:53:12.488Z] 	... 31 more
09:53:12 [2021-06-01T13:53:12.488Z] 
09:53:12 [2021-06-01T13:53:12.751Z] Jun 01, 2021 1:53:12 PM org.junit.platform.launcher.core.DefaultLauncher handleThrowable
09:53:12 [2021-06-01T13:53:12.751Z] WARNING: TestEngine with ID 'junit-vintage' failed to discover tests
09:53:12 [2021-06-01T13:53:12.751Z] java.lang.NoClassDefFoundError: org/junit/runners/model/RunnerBuilder
09:53:12 [2021-06-01T13:53:12.751Z] 	at org.junit.vintage.engine.discovery.VintageDiscoverer.<init>(VintageDiscoverer.java:48)
09:53:12 [2021-06-01T13:53:12.751Z] 	at org.junit.vintage.engine.VintageTestEngine.discover(VintageTestEngine.java:65)
09:53:12 [2021-06-01T13:53:12.751Z] 	at org.junit.platform.launcher.core.DefaultLauncher.discoverEngineRoot(DefaultLauncher.java:130)
09:53:12 [2021-06-01T13:53:12.751Z] 	at org.junit.platform.launcher.core.DefaultLauncher.discoverRoot(DefaultLauncher.java:117)
09:53:12 [2021-06-01T13:53:12.751Z] 	at org.junit.platform.launcher.core.DefaultLauncher.execute(DefaultLauncher.java:90)
09:53:12 [2021-06-01T13:53:12.751Z] 	at org.apache.maven.surefire.junitplatform.JUnitPlatformProvider.invokeAllTests(JUnitPlatformProvider.java:150)
09:53:12 [2021-06-01T13:53:12.751Z] 	at org.apache.maven.surefire.junitplatform.JUnitPlatformProvider.invoke(JUnitPlatformProvider.java:124)
09:53:12 [2021-06-01T13:53:12.751Z] 	at java.base/jdk.internal.reflect.NativeMethodAccessorImpl.invoke0(Native Method)
09:53:12 [2021-06-01T13:53:12.751Z] 	at java.base/jdk.internal.reflect.NativeMethodAccessorImpl.invoke(NativeMethodAccessorImpl.java:64)
09:53:12 [2021-06-01T13:53:12.751Z] 	at java.base/jdk.internal.reflect.DelegatingMethodAccessorImpl.invoke(DelegatingMethodAccessorImpl.java:43)
09:53:12 [2021-06-01T13:53:12.751Z] 	at java.base/java.lang.reflect.Method.invoke(Method.java:564)
09:53:12 [2021-06-01T13:53:12.751Z] 	at org.apache.maven.surefire.util.ReflectionUtils.invokeMethodWithArray2(ReflectionUtils.java:206)
09:53:12 [2021-06-01T13:53:12.752Z] 	at org.apache.maven.surefire.booter.ProviderFactory$ProviderProxy.invoke(ProviderFactory.java:161)
09:53:12 [2021-06-01T13:53:12.752Z] 	at org.apache.maven.surefire.booter.ProviderFactory.invokeProvider(ProviderFactory.java:84)
09:53:12 [2021-06-01T13:53:12.752Z] 	at org.eclipse.tycho.surefire.osgibooter.OsgiSurefireBooter.run(OsgiSurefireBooter.java:116)
09:53:12 [2021-06-01T13:53:12.752Z] 	at org.eclipse.tycho.surefire.osgibooter.HeadlessTestApplication.start(HeadlessTestApplication.java:23)
09:53:12 [2021-06-01T13:53:12.752Z] 	at org.eclipse.equinox.internal.app.EclipseAppHandle.run(EclipseAppHandle.java:203)
09:53:12 [2021-06-01T13:53:12.752Z] 	at org.eclipse.core.runtime.internal.adaptor.EclipseAppLauncher.runApplication(EclipseAppLauncher.java:134)
09:53:12 [2021-06-01T13:53:12.752Z] 	at org.eclipse.core.runtime.internal.adaptor.EclipseAppLauncher.start(EclipseAppLauncher.java:104)
09:53:12 [2021-06-01T13:53:12.752Z] 	at org.eclipse.core.runtime.adaptor.EclipseStarter.run(EclipseStarter.java:401)
09:53:12 [2021-06-01T13:53:12.752Z] 	at org.eclipse.core.runtime.adaptor.EclipseStarter.run(EclipseStarter.java:255)
09:53:12 [2021-06-01T13:53:12.752Z] 	at java.base/jdk.internal.reflect.NativeMethodAccessorImpl.invoke0(Native Method)
09:53:12 [2021-06-01T13:53:12.752Z] 	at java.base/jdk.internal.reflect.NativeMethodAccessorImpl.invoke(NativeMethodAccessorImpl.java:64)
09:53:12 [2021-06-01T13:53:12.752Z] 	at java.base/jdk.internal.reflect.DelegatingMethodAccessorImpl.invoke(DelegatingMethodAccessorImpl.java:43)
09:53:12 [2021-06-01T13:53:12.752Z] 	at java.base/java.lang.reflect.Method.invoke(Method.java:564)
09:53:12 [2021-06-01T13:53:12.752Z] 	at org.eclipse.equinox.launcher.Main.invokeFramework(Main.java:653)
09:53:12 [2021-06-01T13:53:12.752Z] 	at org.eclipse.equinox.launcher.Main.basicRun(Main.java:590)
09:53:12 [2021-06-01T13:53:12.752Z] 	at org.eclipse.equinox.launcher.Main.run(Main.java:1461)
09:53:12 [2021-06-01T13:53:12.752Z] 	at org.eclipse.equinox.launcher.Main.main(Main.java:1434)
09:53:12 [2021-06-01T13:53:12.752Z] Caused by: java.lang.ClassNotFoundException: org.junit.runners.model.RunnerBuilder cannot be found by org.eclipse.tycho.surefire.osgibooter_2.2.0
09:53:12 [2021-06-01T13:53:12.752Z] 	at org.eclipse.osgi.internal.loader.BundleLoader.findClass(BundleLoader.java:516)
09:53:12 [2021-06-01T13:53:12.752Z] 	at org.eclipse.osgi.internal.loader.ModuleClassLoader.loadClass(ModuleClassLoader.java:171)
09:53:12 [2021-06-01T13:53:12.752Z] 	at java.base/java.lang.ClassLoader.loadClass(ClassLoader.java:522)
09:53:12 [2021-06-01T13:53:12.752Z] 	... 29 more
09:53:12 [2021-06-01T13:53:12.752Z] 
09:53:12 [2021-06-01T13:53:12.752Z] Running org.eclipse.ease.lang.python.jython.debugger.JythonDebugTest
09:53:19 [2021-06-01T13:53:19.352Z] Start of script
09:53:19 [2021-06-01T13:53:19.352Z] include file start
09:53:19 [2021-06-01T13:53:19.352Z] include file processed
09:53:19 [2021-06-01T13:53:19.352Z] Result of testMethod = 5
09:53:19 [2021-06-01T13:53:19.352Z] End of script
09:53:19 [2021-06-01T13:53:19.352Z] Start of script
09:53:19 [2021-06-01T13:53:19.352Z] include file start
09:53:19 [2021-06-01T13:53:19.352Z] include file processed
09:53:19 [2021-06-01T13:53:19.352Z] Result of testMethod = 5
09:53:19 [2021-06-01T13:53:19.352Z] End of script
09:53:19 [2021-06-01T13:53:19.352Z] Start of script
09:53:19 [2021-06-01T13:53:19.615Z] include file start
09:53:19 [2021-06-01T13:53:19.615Z] include file processed
09:53:19 [2021-06-01T13:53:19.615Z] Result of testMethod = 5
09:53:19 [2021-06-01T13:53:19.615Z] Traceback (most recent call last):
09:53:19 [2021-06-01T13:53:19.615Z]   File "(none)", line 184, in run
09:53:19 [2021-06-01T13:53:19.615Z]   File "__ref_L/Debug Test/Main.py_rwdhjfgqkf", line 23, in <module>
09:53:19 [2021-06-01T13:53:19.615Z]   File "(none)", line 161, in trace_dispatch
09:53:19 [2021-06-01T13:53:19.615Z] 	at org.eclipse.ease.debugging.AbstractEaseDebugger.handleEventsInSuspendedState(AbstractEaseDebugger.java:329)
09:53:19 [2021-06-01T13:53:19.615Z] 	at org.eclipse.ease.debugging.AbstractEaseDebugger.suspend(AbstractEaseDebugger.java:255)
09:53:19 [2021-06-01T13:53:19.615Z] 	at org.eclipse.ease.debugging.AbstractEaseDebugger.processLine(AbstractEaseDebugger.java:490)
09:53:19 [2021-06-01T13:53:19.615Z] 	at org.eclipse.ease.lang.python.debugger.PythonDebugger.traceDispatch(PythonDebugger.java:177)
09:53:19 [2021-06-01T13:53:19.615Z] 	at org.eclipse.ease.lang.python.jython.debugger.JythonDebugger.traceDispatch(JythonDebugger.java:44)
09:53:19 [2021-06-01T13:53:19.615Z] 	at jdk.internal.reflect.GeneratedMethodAccessor25.invoke(Unknown Source)
09:53:19 [2021-06-01T13:53:19.615Z] 	at java.base/jdk.internal.reflect.DelegatingMethodAccessorImpl.invoke(DelegatingMethodAccessorImpl.java:43)
09:53:19 [2021-06-01T13:53:19.616Z] 	at java.base/java.lang.reflect.Method.invoke(Method.java:564)
09:53:19 [2021-06-01T13:53:19.616Z] 
09:53:19 [2021-06-01T13:53:19.616Z] org.eclipse.ease.ScriptEngineCancellationException: org.eclipse.ease.ScriptEngineCancellationException: Terminated on user request
09:53:20 [2021-06-01T13:53:20.181Z] Start of script
09:53:20 [2021-06-01T13:53:20.181Z] include file start
09:53:20 [2021-06-01T13:53:20.181Z] include file processed
09:53:20 [2021-06-01T13:53:20.181Z] Result of testMethod = 5
09:53:20 [2021-06-01T13:53:20.181Z] End of script
09:53:21 [2021-06-01T13:53:21.116Z] Start of script
09:53:21 [2021-06-01T13:53:21.116Z] include file start
09:53:21 [2021-06-01T13:53:21.116Z] include file processed
09:53:21 [2021-06-01T13:53:21.116Z] Result of testMethod = 5
09:53:21 [2021-06-01T13:53:21.116Z] End of script
09:53:21 [2021-06-01T13:53:21.374Z] Start of script
09:53:21 [2021-06-01T13:53:21.374Z] include file start
09:53:21 [2021-06-01T13:53:21.374Z] include file processed
09:53:21 [2021-06-01T13:53:21.632Z] Result of testMethod = 5
09:53:21 [2021-06-01T13:53:21.632Z] End of script
09:53:21 [2021-06-01T13:53:21.890Z] Start of script
09:53:21 [2021-06-01T13:53:21.890Z] include file start
09:53:21 [2021-06-01T13:53:21.890Z] include file processed
09:53:21 [2021-06-01T13:53:21.890Z] Result of testMethod = 5
09:53:21 [2021-06-01T13:53:21.890Z] Traceback (most recent call last):
09:53:21 [2021-06-01T13:53:21.890Z]   File "(none)", line 184, in run
09:53:21 [2021-06-01T13:53:21.890Z]   File "__ref_L/Debug Test/Main.py_ouvjcyrfjg", line 23, in <module>
09:53:21 [2021-06-01T13:53:21.890Z]   File "(none)", line 161, in trace_dispatch
09:53:21 [2021-06-01T13:53:21.890Z] 	at org.eclipse.ease.debugging.AbstractEaseDebugger.handleEventsInSuspendedState(AbstractEaseDebugger.java:329)
09:53:21 [2021-06-01T13:53:21.890Z] 	at org.eclipse.ease.debugging.AbstractEaseDebugger.suspend(AbstractEaseDebugger.java:255)
09:53:21 [2021-06-01T13:53:21.890Z] 	at org.eclipse.ease.debugging.AbstractEaseDebugger.processLine(AbstractEaseDebugger.java:490)
09:53:21 [2021-06-01T13:53:21.891Z] 	at org.eclipse.ease.lang.python.debugger.PythonDebugger.traceDispatch(PythonDebugger.java:177)
09:53:21 [2021-06-01T13:53:21.891Z] 	at org.eclipse.ease.lang.python.jython.debugger.JythonDebugger.traceDispatch(JythonDebugger.java:44)
09:53:21 [2021-06-01T13:53:21.891Z] 	at jdk.internal.reflect.GeneratedMethodAccessor25.invoke(Unknown Source)
09:53:21 [2021-06-01T13:53:21.891Z] 	at java.base/jdk.internal.reflect.DelegatingMethodAccessorImpl.invoke(DelegatingMethodAccessorImpl.java:43)
09:53:21 [2021-06-01T13:53:21.891Z] 	at java.base/java.lang.reflect.Method.invoke(Method.java:564)
09:53:21 [2021-06-01T13:53:21.891Z] 
09:53:21 [2021-06-01T13:53:21.891Z] org.eclipse.ease.ScriptEngineCancellationException: org.eclipse.ease.ScriptEngineCancellationException: Terminated on user request
09:53:22 [2021-06-01T13:53:22.148Z] Start of script
09:53:22 [2021-06-01T13:53:22.148Z] include file start
09:53:22 [2021-06-01T13:53:22.148Z] include file processed
09:53:22 [2021-06-01T13:53:22.408Z] Result of testMethod = 5
09:53:22 [2021-06-01T13:53:22.408Z] End of script
09:53:22 [2021-06-01T13:53:22.408Z] Start of script
09:53:22 [2021-06-01T13:53:22.408Z] include file start
09:53:22 [2021-06-01T13:53:22.408Z] include file processed
09:53:22 [2021-06-01T13:53:22.408Z] Result of testMethod = 5
09:53:22 [2021-06-01T13:53:22.408Z] End of script
09:53:22 [2021-06-01T13:53:22.666Z] Start of script
09:53:22 [2021-06-01T13:53:22.666Z] include file start
09:53:22 [2021-06-01T13:53:22.666Z] include file processed
09:53:23 [2021-06-01T13:53:23.233Z] Traceback (most recent call last):
09:53:23 [2021-06-01T13:53:23.233Z]   File "(none)", line 184, in run
09:53:23 [2021-06-01T13:53:23.233Z]   File "__ref_L/Debug Test/Main.py_jbvxtxdejy", line 22, in <module>
09:53:23 [2021-06-01T13:53:23.233Z]   File "(none)", line 161, in trace_dispatch
09:53:23 [2021-06-01T13:53:23.233Z] 	at org.eclipse.ease.debugging.AbstractEaseDebugger.handleEventsInSuspendedState(AbstractEaseDebugger.java:329)
09:53:23 [2021-06-01T13:53:23.233Z] 	at org.eclipse.ease.debugging.AbstractEaseDebugger.suspend(AbstractEaseDebugger.java:255)
09:53:23 [2021-06-01T13:53:23.233Z] 	at org.eclipse.ease.debugging.AbstractEaseDebugger.processLine(AbstractEaseDebugger.java:510)
09:53:23 [2021-06-01T13:53:23.233Z] 	at org.eclipse.ease.lang.python.debugger.PythonDebugger.traceDispatch(PythonDebugger.java:177)
09:53:23 [2021-06-01T13:53:23.233Z] 	at org.eclipse.ease.lang.python.jython.debugger.JythonDebugger.traceDispatch(JythonDebugger.java:44)
09:53:23 [2021-06-01T13:53:23.233Z] 	at jdk.internal.reflect.GeneratedMethodAccessor25.invoke(Unknown Source)
09:53:23 [2021-06-01T13:53:23.233Z] 	at java.base/jdk.internal.reflect.DelegatingMethodAccessorImpl.invoke(DelegatingMethodAccessorImpl.java:43)
09:53:23 [2021-06-01T13:53:23.233Z] 	at java.base/java.lang.reflect.Method.invoke(Method.java:564)
09:53:23 [2021-06-01T13:53:23.233Z] 
09:53:23 [2021-06-01T13:53:23.233Z] org.eclipse.ease.ScriptEngineCancellationException: org.eclipse.ease.ScriptEngineCancellationException: Terminated on user request
09:53:23 [2021-06-01T13:53:23.490Z] Start of script
09:53:23 [2021-06-01T13:53:23.490Z] include file start
09:53:23 [2021-06-01T13:53:23.490Z] include file processed
09:53:23 [2021-06-01T13:53:23.490Z] Result of testMethod = 5
09:53:23 [2021-06-01T13:53:23.490Z] End of script
09:53:23 [2021-06-01T13:53:23.748Z] Start of script
09:53:23 [2021-06-01T13:53:23.748Z] include file start
09:53:23 [2021-06-01T13:53:23.748Z] include file processed
09:53:24 [2021-06-01T13:53:24.006Z] Result of testMethod = 5
09:53:24 [2021-06-01T13:53:24.006Z] End of script
09:53:24 [2021-06-01T13:53:24.264Z] Traceback (most recent call last):
09:53:24 [2021-06-01T13:53:24.264Z]   File "(none)", line 184, in run
09:53:24 [2021-06-01T13:53:24.264Z]   File "__ref_L/Debug Test/Main.py_jfhgaluqci", line 1, in <module>
09:53:24 [2021-06-01T13:53:24.264Z]   File "(none)", line 161, in trace_dispatch
09:53:24 [2021-06-01T13:53:24.264Z] 	at org.eclipse.ease.debugging.AbstractEaseDebugger.handleEventsInSuspendedState(AbstractEaseDebugger.java:329)
09:53:24 [2021-06-01T13:53:24.264Z] 	at org.eclipse.ease.debugging.AbstractEaseDebugger.suspend(AbstractEaseDebugger.java:255)
09:53:24 [2021-06-01T13:53:24.264Z] 	at org.eclipse.ease.debugging.AbstractEaseDebugger.processLine(AbstractEaseDebugger.java:490)
09:53:24 [2021-06-01T13:53:24.264Z] 	at org.eclipse.ease.lang.python.debugger.PythonDebugger.traceDispatch(PythonDebugger.java:177)
09:53:24 [2021-06-01T13:53:24.265Z] 	at org.eclipse.ease.lang.python.jython.debugger.JythonDebugger.traceDispatch(JythonDebugger.java:44)
09:53:24 [2021-06-01T13:53:24.265Z] 	at jdk.internal.reflect.GeneratedMethodAccessor25.invoke(Unknown Source)
09:53:24 [2021-06-01T13:53:24.265Z] 	at java.base/jdk.internal.reflect.DelegatingMethodAccessorImpl.invoke(DelegatingMethodAccessorImpl.java:43)
09:53:24 [2021-06-01T13:53:24.265Z] 	at java.base/java.lang.reflect.Method.invoke(Method.java:564)
09:53:24 [2021-06-01T13:53:24.265Z] 
09:53:24 [2021-06-01T13:53:24.265Z] org.eclipse.ease.ScriptEngineCancellationException: org.eclipse.ease.ScriptEngineCancellationException: Terminated on user request
09:53:24 [2021-06-01T13:53:24.522Z] Start of script
09:53:24 [2021-06-01T13:53:24.522Z] include file start
09:53:24 [2021-06-01T13:53:24.522Z] include file processed
09:53:24 [2021-06-01T13:53:24.522Z] Result of testMethod = 5
09:53:24 [2021-06-01T13:53:24.522Z] End of script
09:53:24 [2021-06-01T13:53:24.785Z] Start of script
09:53:24 [2021-06-01T13:53:24.785Z] include file start
09:53:24 [2021-06-01T13:53:24.785Z] include file processed
09:53:25 [2021-06-01T13:53:25.043Z] Result of testMethod = 5
09:53:25 [2021-06-01T13:53:25.043Z] End of script
09:53:25 [2021-06-01T13:53:25.300Z] Start of script
09:53:25 [2021-06-01T13:53:25.300Z] include file start
09:53:25 [2021-06-01T13:53:25.300Z] include file processed
09:53:25 [2021-06-01T13:53:25.300Z] Result of testMethod = 5
09:53:25 [2021-06-01T13:53:25.559Z] Traceback (most recent call last):
09:53:25 [2021-06-01T13:53:25.559Z]   File "(none)", line 184, in run
09:53:25 [2021-06-01T13:53:25.559Z]   File "__ref_L/Debug Test/Main.py_dxaasgbrug", line 23, in <module>
09:53:25 [2021-06-01T13:53:25.559Z]   File "(none)", line 161, in trace_dispatch
09:53:25 [2021-06-01T13:53:25.559Z] 	at org.eclipse.ease.debugging.AbstractEaseDebugger.handleEventsInSuspendedState(AbstractEaseDebugger.java:329)
09:53:25 [2021-06-01T13:53:25.559Z] 	at org.eclipse.ease.debugging.AbstractEaseDebugger.suspend(AbstractEaseDebugger.java:255)
09:53:25 [2021-06-01T13:53:25.559Z] 	at org.eclipse.ease.debugging.AbstractEaseDebugger.processLine(AbstractEaseDebugger.java:490)
09:53:25 [2021-06-01T13:53:25.559Z] 	at org.eclipse.ease.lang.python.debugger.PythonDebugger.traceDispatch(PythonDebugger.java:177)
09:53:25 [2021-06-01T13:53:25.559Z] 	at org.eclipse.ease.lang.python.jython.debugger.JythonDebugger.traceDispatch(JythonDebugger.java:44)
09:53:25 [2021-06-01T13:53:25.559Z] 	at jdk.internal.reflect.GeneratedMethodAccessor25.invoke(Unknown Source)
09:53:25 [2021-06-01T13:53:25.559Z] 	at java.base/jdk.internal.reflect.DelegatingMethodAccessorImpl.invoke(DelegatingMethodAccessorImpl.java:43)
09:53:25 [2021-06-01T13:53:25.559Z] 	at java.base/java.lang.reflect.Method.invoke(Method.java:564)
09:53:25 [2021-06-01T13:53:25.559Z] 
09:53:25 [2021-06-01T13:53:25.559Z] org.eclipse.ease.ScriptEngineCancellationException: org.eclipse.ease.ScriptEngineCancellationException: Terminated on user request
09:53:25 [2021-06-01T13:53:25.817Z] Start of script
09:53:25 [2021-06-01T13:53:25.817Z] include file start
09:53:25 [2021-06-01T13:53:25.817Z] include file processed
09:53:26 [2021-06-01T13:53:26.076Z] Result of testMethod = 5
09:53:26 [2021-06-01T13:53:26.076Z] End of script
09:53:26 [2021-06-01T13:53:26.076Z] Traceback (most recent call last):
09:53:26 [2021-06-01T13:53:26.076Z]   File "(none)", line 184, in run
09:53:26 [2021-06-01T13:53:26.076Z]   File "__ref_L/Debug Test/Main.py_bcvukknrfl", line 1, in <module>
09:53:26 [2021-06-01T13:53:26.076Z]   File "(none)", line 161, in trace_dispatch
09:53:26 [2021-06-01T13:53:26.076Z] 	at org.eclipse.ease.debugging.AbstractEaseDebugger.handleEventsInSuspendedState(AbstractEaseDebugger.java:329)
09:53:26 [2021-06-01T13:53:26.076Z] 	at org.eclipse.ease.debugging.AbstractEaseDebugger.suspend(AbstractEaseDebugger.java:255)
09:53:26 [2021-06-01T13:53:26.076Z] 	at org.eclipse.ease.debugging.AbstractEaseDebugger.processLine(AbstractEaseDebugger.java:490)
09:53:26 [2021-06-01T13:53:26.076Z] 	at org.eclipse.ease.lang.python.debugger.PythonDebugger.traceDispatch(PythonDebugger.java:177)
09:53:26 [2021-06-01T13:53:26.076Z] 	at org.eclipse.ease.lang.python.jython.debugger.JythonDebugger.traceDispatch(JythonDebugger.java:44)
09:53:26 [2021-06-01T13:53:26.076Z] 	at jdk.internal.reflect.GeneratedMethodAccessor25.invoke(Unknown Source)
09:53:26 [2021-06-01T13:53:26.076Z] 	at java.base/jdk.internal.reflect.DelegatingMethodAccessorImpl.invoke(DelegatingMethodAccessorImpl.java:43)
09:53:26 [2021-06-01T13:53:26.076Z] 	at java.base/java.lang.reflect.Method.invoke(Method.java:564)
09:53:26 [2021-06-01T13:53:26.076Z] 
09:53:26 [2021-06-01T13:53:26.076Z] org.eclipse.ease.ScriptEngineCancellationException: org.eclipse.ease.ScriptEngineCancellationException: Terminated on user request
09:53:27 [2021-06-01T13:53:27.813Z] Start of script
09:53:27 [2021-06-01T13:53:27.813Z] include file start
09:53:27 [2021-06-01T13:53:27.813Z] include file processed
09:53:27 [2021-06-01T13:53:27.813Z] Result of testMethod = 5
09:53:27 [2021-06-01T13:53:27.813Z] End of script
09:53:28 [2021-06-01T13:53:28.095Z] Start of script
09:53:28 [2021-06-01T13:53:28.095Z] include file start
09:53:28 [2021-06-01T13:53:28.095Z] include file processed
09:53:28 [2021-06-01T13:53:28.095Z] Result of testMethod = 5
09:53:28 [2021-06-01T13:53:28.095Z] End of script
09:53:28 [2021-06-01T13:53:28.353Z] Traceback (most recent call last):
09:53:28 [2021-06-01T13:53:28.353Z]   File "(none)", line 184, in run
09:53:28 [2021-06-01T13:53:28.353Z]   File "__ref_L/Debug Test/Main.py_qpndfmplyu", line 1, in <module>
09:53:28 [2021-06-01T13:53:28.353Z]   File "(none)", line 161, in trace_dispatch
09:53:28 [2021-06-01T13:53:28.993Z] 	at org.eclipse.ease.debugging.AbstractEaseDebugger.handleEventsInSuspendedState(AbstractEaseDebugger.java:329)
09:53:28 [2021-06-01T13:53:28.993Z] 	at org.eclipse.ease.debugging.AbstractEaseDebugger.suspend(AbstractEaseDebugger.java:255)
09:53:28 [2021-06-01T13:53:28.993Z] 	at org.eclipse.ease.debugging.AbstractEaseDebugger.processLine(AbstractEaseDebugger.java:490)
09:53:28 [2021-06-01T13:53:28.993Z] 	at org.eclipse.ease.lang.python.debugger.PythonDebugger.traceDispatch(PythonDebugger.java:177)
09:53:28 [2021-06-01T13:53:28.993Z] 	at org.eclipse.ease.lang.python.jython.debugger.JythonDebugger.traceDispatch(JythonDebugger.java:44)
09:53:28 [2021-06-01T13:53:28.993Z] 	at jdk.internal.reflect.GeneratedMethodAccessor25.invoke(Unknown Source)
09:53:28 [2021-06-01T13:53:28.993Z] 	at java.base/jdk.internal.reflect.DelegatingMethodAccessorImpl.invoke(DelegatingMethodAccessorImpl.java:43)
09:53:28 [2021-06-01T13:53:28.993Z] 	at java.base/java.lang.reflect.Method.invoke(Method.java:564)
09:53:28 [2021-06-01T13:53:28.993Z] 
09:53:28 [2021-06-01T13:53:28.993Z] org.eclipse.ease.ScriptEngineCancellationException: org.eclipse.ease.ScriptEngineCancellationException: Terminated on user request
09:53:29 [2021-06-01T13:53:29.253Z] Start of script
09:53:29 [2021-06-01T13:53:29.253Z] include file start
09:53:29 [2021-06-01T13:53:29.253Z] include file processed
09:53:35 [2021-06-01T13:53:35.096Z] Result of testMethod = 5
09:53:35 [2021-06-01T13:53:35.096Z] End of script
09:53:35 [2021-06-01T13:53:35.354Z] Start of script
09:53:35 [2021-06-01T13:53:35.354Z] include file start
09:53:35 [2021-06-01T13:53:35.354Z] include file processed
09:53:35 [2021-06-01T13:53:35.354Z] Result of testMethod = 5
09:53:35 [2021-06-01T13:53:35.354Z] Traceback (most recent call last):
09:53:35 [2021-06-01T13:53:35.354Z]   File "(none)", line 184, in run
09:53:35 [2021-06-01T13:53:35.354Z]   File "__ref_L/Debug Test/Main.py_rqxlthhaxq", line 23, in <module>
09:53:35 [2021-06-01T13:53:35.354Z]   File "(none)", line 161, in trace_dispatch
09:53:35 [2021-06-01T13:53:35.354Z] 	at org.eclipse.ease.debugging.AbstractEaseDebugger.handleEventsInSuspendedState(AbstractEaseDebugger.java:329)
09:53:35 [2021-06-01T13:53:35.354Z] 	at org.eclipse.ease.debugging.AbstractEaseDebugger.suspend(AbstractEaseDebugger.java:255)
09:53:35 [2021-06-01T13:53:35.354Z] 	at org.eclipse.ease.debugging.AbstractEaseDebugger.processLine(AbstractEaseDebugger.java:490)
09:53:35 [2021-06-01T13:53:35.354Z] 	at org.eclipse.ease.lang.python.debugger.PythonDebugger.traceDispatch(PythonDebugger.java:177)
09:53:35 [2021-06-01T13:53:35.354Z] 	at org.eclipse.ease.lang.python.jython.debugger.JythonDebugger.traceDispatch(JythonDebugger.java:44)
09:53:35 [2021-06-01T13:53:35.354Z] 	at jdk.internal.reflect.GeneratedMethodAccessor25.invoke(Unknown Source)
09:53:35 [2021-06-01T13:53:35.354Z] 	at java.base/jdk.internal.reflect.DelegatingMethodAccessorImpl.invoke(DelegatingMethodAccessorImpl.java:43)
09:53:35 [2021-06-01T13:53:35.354Z] 	at java.base/java.lang.reflect.Method.invoke(Method.java:564)
09:53:35 [2021-06-01T13:53:35.354Z] 
09:53:35 [2021-06-01T13:53:35.354Z] org.eclipse.ease.ScriptEngineCancellationException: org.eclipse.ease.ScriptEngineCancellationException: Terminated on user request
09:53:35 [2021-06-01T13:53:35.612Z] Start of script
09:53:35 [2021-06-01T13:53:35.612Z] include file start
09:53:35 [2021-06-01T13:53:35.612Z] include file processed
09:53:35 [2021-06-01T13:53:35.612Z] Result of testMethod = 5
09:53:35 [2021-06-01T13:53:35.612Z] End of script
09:53:35 [2021-06-01T13:53:35.870Z] Start of script
09:53:35 [2021-06-01T13:53:35.870Z] include file start
09:53:35 [2021-06-01T13:53:35.870Z] include file processed
09:53:36 [2021-06-01T13:53:36.127Z] Result of testMethod = 5
09:53:36 [2021-06-01T13:53:36.127Z] End of script
09:53:36 [2021-06-01T13:53:36.691Z] Start of script
09:53:36 [2021-06-01T13:53:36.691Z] include file start
09:53:36 [2021-06-01T13:53:36.691Z] include file processed
09:53:36 [2021-06-01T13:53:36.691Z] Result of testMethod = 5
09:53:36 [2021-06-01T13:53:36.691Z] End of script
09:53:37 [2021-06-01T13:53:37.257Z] Start of script
09:53:37 [2021-06-01T13:53:37.257Z] include file start
09:53:37 [2021-06-01T13:53:37.258Z] include file processed
09:53:37 [2021-06-01T13:53:37.258Z] Result of testMethod = 5
09:53:37 [2021-06-01T13:53:37.258Z] End of script
09:53:38 [2021-06-01T13:53:38.189Z] Start of script
09:53:38 [2021-06-01T13:53:38.190Z] include file start
09:53:38 [2021-06-01T13:53:38.190Z] include file processed
09:53:38 [2021-06-01T13:53:38.190Z] Traceback (most recent call last):
09:53:38 [2021-06-01T13:53:38.190Z]   File "(none)", line 184, in run
09:53:38 [2021-06-01T13:53:38.190Z]   File "__ref_L/Debug Test/Main.py_zqzxxxxqyh", line 21, in <module>
09:53:38 [2021-06-01T13:53:38.190Z]   File "__ref_L/Debug Test/Main.py_zqzxxxxqyh", line 18, in testMethod
09:53:38 [2021-06-01T13:53:38.190Z]   File "(none)", line 161, in trace_dispatch
09:53:38 [2021-06-01T13:53:38.190Z] 	at org.eclipse.ease.debugging.AbstractEaseDebugger.handleEventsInSuspendedState(AbstractEaseDebugger.java:329)
09:53:38 [2021-06-01T13:53:38.190Z] 	at org.eclipse.ease.debugging.AbstractEaseDebugger.suspend(AbstractEaseDebugger.java:255)
09:53:38 [2021-06-01T13:53:38.190Z] 	at org.eclipse.ease.debugging.AbstractEaseDebugger.processLine(AbstractEaseDebugger.java:490)
09:53:38 [2021-06-01T13:53:38.190Z] 	at org.eclipse.ease.lang.python.debugger.PythonDebugger.traceDispatch(PythonDebugger.java:177)
09:53:38 [2021-06-01T13:53:38.190Z] 	at org.eclipse.ease.lang.python.jython.debugger.JythonDebugger.traceDispatch(JythonDebugger.java:44)
09:53:38 [2021-06-01T13:53:38.190Z] 	at jdk.internal.reflect.GeneratedMethodAccessor25.invoke(Unknown Source)
09:53:38 [2021-06-01T13:53:38.190Z] 	at java.base/jdk.internal.reflect.DelegatingMethodAccessorImpl.invoke(DelegatingMethodAccessorImpl.java:43)
09:53:38 [2021-06-01T13:53:38.190Z] 	at java.base/java.lang.reflect.Method.invoke(Method.java:564)
09:53:38 [2021-06-01T13:53:38.190Z] 
09:53:38 [2021-06-01T13:53:38.190Z] org.eclipse.ease.ScriptEngineCancellationException: org.eclipse.ease.ScriptEngineCancellationException: Terminated on user request
09:53:38 [2021-06-01T13:53:38.190Z] Start of script
09:53:38 [2021-06-01T13:53:38.448Z] include file start
09:53:38 [2021-06-01T13:53:38.448Z] include file processed
09:53:38 [2021-06-01T13:53:38.448Z] Result of testMethod = 5
09:53:38 [2021-06-01T13:53:38.448Z] End of script
09:53:39 [2021-06-01T13:53:39.013Z] Start of script
09:53:39 [2021-06-01T13:53:39.013Z] include file start
09:53:39 [2021-06-01T13:53:39.013Z] include file processed
09:53:39 [2021-06-01T13:53:39.013Z] Result of testMethod = 5
09:53:39 [2021-06-01T13:53:39.271Z] Traceback (most recent call last):
09:53:39 [2021-06-01T13:53:39.271Z]   File "(none)", line 184, in run
09:53:39 [2021-06-01T13:53:39.271Z]   File "__ref_L/Debug Test/Main.py_acrceujugv", line 23, in <module>
09:53:39 [2021-06-01T13:53:39.271Z]   File "(none)", line 161, in trace_dispatch
09:53:39 [2021-06-01T13:53:39.271Z] 	at org.eclipse.ease.debugging.AbstractEaseDebugger.handleEventsInSuspendedState(AbstractEaseDebugger.java:329)
09:53:39 [2021-06-01T13:53:39.271Z] 	at org.eclipse.ease.debugging.AbstractEaseDebugger.suspend(AbstractEaseDebugger.java:255)
09:53:39 [2021-06-01T13:53:39.271Z] 	at org.eclipse.ease.debugging.AbstractEaseDebugger.processLine(AbstractEaseDebugger.java:490)
09:53:39 [2021-06-01T13:53:39.271Z] 	at org.eclipse.ease.lang.python.debugger.PythonDebugger.traceDispatch(PythonDebugger.java:177)
09:53:39 [2021-06-01T13:53:39.271Z] 	at org.eclipse.ease.lang.python.jython.debugger.JythonDebugger.traceDispatch(JythonDebugger.java:44)
09:53:39 [2021-06-01T13:53:39.271Z] 	at jdk.internal.reflect.GeneratedMethodAccessor25.invoke(Unknown Source)
09:53:39 [2021-06-01T13:53:39.271Z] 	at java.base/jdk.internal.reflect.DelegatingMethodAccessorImpl.invoke(DelegatingMethodAccessorImpl.java:43)
09:53:39 [2021-06-01T13:53:39.271Z] 	at java.base/java.lang.reflect.Method.invoke(Method.java:564)
09:53:39 [2021-06-01T13:53:39.271Z] 
09:53:39 [2021-06-01T13:53:39.271Z] org.eclipse.ease.ScriptEngineCancellationException: org.eclipse.ease.ScriptEngineCancellationException: Terminated on user request
09:53:39 [2021-06-01T13:53:39.530Z] Start of script
09:53:39 [2021-06-01T13:53:39.530Z] include file start
09:53:39 [2021-06-01T13:53:39.530Z] include file processed
09:53:39 [2021-06-01T13:53:39.530Z] Result of testMethod = 5
09:53:39 [2021-06-01T13:53:39.530Z] End of script
09:53:39 [2021-06-01T13:53:39.530Z] Start of script
09:53:39 [2021-06-01T13:53:39.530Z] include file start
09:53:39 [2021-06-01T13:53:39.530Z] include file processed
09:53:39 [2021-06-01T13:53:39.789Z] Result of testMethod = 5
09:53:39 [2021-06-01T13:53:39.789Z] End of script
09:53:40 [2021-06-01T13:53:40.046Z] Start of script
09:53:40 [2021-06-01T13:53:40.304Z] include file start
09:53:40 [2021-06-01T13:53:40.304Z] include file processed
09:53:40 [2021-06-01T13:53:40.304Z] Result of testMethod = 5
09:53:40 [2021-06-01T13:53:40.304Z] End of script
09:53:40 [2021-06-01T13:53:40.873Z] Start of script
09:53:41 [2021-06-01T13:53:41.131Z] include file start
09:53:41 [2021-06-01T13:53:41.131Z] include file processed
09:53:41 [2021-06-01T13:53:41.131Z] Result of testMethod = 5
09:53:41 [2021-06-01T13:53:41.131Z] End of script
09:53:41 [2021-06-01T13:53:41.131Z] Start of script
09:53:41 [2021-06-01T13:53:41.389Z] include file start
09:53:41 [2021-06-01T13:53:41.389Z] include file processed
09:53:41 [2021-06-01T13:53:41.389Z] Result of testMethod = 5
09:53:41 [2021-06-01T13:53:41.389Z] Traceback (most recent call last):
09:53:41 [2021-06-01T13:53:41.389Z]   File "(none)", line 184, in run
09:53:41 [2021-06-01T13:53:41.389Z]   File "__ref_L/Debug Test/Main.py_xgwusghnye", line 23, in <module>
09:53:41 [2021-06-01T13:53:41.389Z]   File "(none)", line 161, in trace_dispatch
09:53:41 [2021-06-01T13:53:41.389Z] 	at org.eclipse.ease.debugging.AbstractEaseDebugger.handleEventsInSuspendedState(AbstractEaseDebugger.java:329)
09:53:41 [2021-06-01T13:53:41.389Z] 	at org.eclipse.ease.debugging.AbstractEaseDebugger.suspend(AbstractEaseDebugger.java:255)
09:53:41 [2021-06-01T13:53:41.389Z] 	at org.eclipse.ease.debugging.AbstractEaseDebugger.processLine(AbstractEaseDebugger.java:490)
09:53:41 [2021-06-01T13:53:41.389Z] 	at org.eclipse.ease.lang.python.debugger.PythonDebugger.traceDispatch(PythonDebugger.java:177)
09:53:41 [2021-06-01T13:53:41.389Z] 	at org.eclipse.ease.lang.python.jython.debugger.JythonDebugger.traceDispatch(JythonDebugger.java:44)
09:53:41 [2021-06-01T13:53:41.389Z] 	at jdk.internal.reflect.GeneratedMethodAccessor25.invoke(Unknown Source)
09:53:41 [2021-06-01T13:53:41.389Z] 	at java.base/jdk.internal.reflect.DelegatingMethodAccessorImpl.invoke(DelegatingMethodAccessorImpl.java:43)
09:53:41 [2021-06-01T13:53:41.389Z] 	at java.base/java.lang.reflect.Method.invoke(Method.java:564)
09:53:41 [2021-06-01T13:53:41.389Z] 
09:53:41 [2021-06-01T13:53:41.389Z] org.eclipse.ease.ScriptEngineCancellationException: org.eclipse.ease.ScriptEngineCancellationException: Terminated on user request
09:53:41 [2021-06-01T13:53:41.647Z] Start of script
09:53:41 [2021-06-01T13:53:41.647Z] include file start
09:53:41 [2021-06-01T13:53:41.647Z] include file processed
09:53:41 [2021-06-01T13:53:41.647Z] Result of testMethod = 5
09:53:41 [2021-06-01T13:53:41.647Z] End of script
09:53:41 [2021-06-01T13:53:41.905Z] Start of script
09:53:41 [2021-06-01T13:53:41.905Z] include file start
09:53:41 [2021-06-01T13:53:41.905Z] include file processed
09:53:41 [2021-06-01T13:53:41.905Z] Result of testMethod = 5
09:53:41 [2021-06-01T13:53:41.905Z] Traceback (most recent call last):
09:53:41 [2021-06-01T13:53:41.905Z]   File "(none)", line 184, in run
09:53:41 [2021-06-01T13:53:41.905Z]   File "__ref_L/Debug Test/Main.py_glkpycuquu", line 23, in <module>
09:53:41 [2021-06-01T13:53:41.905Z]   File "(none)", line 161, in trace_dispatch
09:53:41 [2021-06-01T13:53:41.905Z] 	at org.eclipse.ease.debugging.AbstractEaseDebugger.handleEventsInSuspendedState(AbstractEaseDebugger.java:329)
09:53:41 [2021-06-01T13:53:41.905Z] 	at org.eclipse.ease.debugging.AbstractEaseDebugger.suspend(AbstractEaseDebugger.java:255)
09:53:41 [2021-06-01T13:53:41.905Z] 	at org.eclipse.ease.debugging.AbstractEaseDebugger.processLine(AbstractEaseDebugger.java:490)
09:53:41 [2021-06-01T13:53:41.905Z] 	at org.eclipse.ease.lang.python.debugger.PythonDebugger.traceDispatch(PythonDebugger.java:177)
09:53:41 [2021-06-01T13:53:41.905Z] 	at org.eclipse.ease.lang.python.jython.debugger.JythonDebugger.traceDispatch(JythonDebugger.java:44)
09:53:41 [2021-06-01T13:53:41.905Z] 	at jdk.internal.reflect.GeneratedMethodAccessor25.invoke(Unknown Source)
09:53:41 [2021-06-01T13:53:41.905Z] 	at java.base/jdk.internal.reflect.DelegatingMethodAccessorImpl.invoke(DelegatingMethodAccessorImpl.java:43)
09:53:41 [2021-06-01T13:53:41.905Z] 	at java.base/java.lang.reflect.Method.invoke(Method.java:564)
09:53:41 [2021-06-01T13:53:41.905Z] 
09:53:41 [2021-06-01T13:53:41.905Z] org.eclipse.ease.ScriptEngineCancellationException: org.eclipse.ease.ScriptEngineCancellationException: Terminated on user request
09:53:42 [2021-06-01T13:53:42.839Z] Traceback (most recent call last):
09:53:42 [2021-06-01T13:53:42.839Z]   File "(none)", line 184, in run
09:53:42 [2021-06-01T13:53:42.839Z]   File "__ref_L/Debug Test/Main.py_exjhwyvarn", line 1, in <module>
09:53:42 [2021-06-01T13:53:42.839Z]   File "(none)", line 161, in trace_dispatch
09:53:42 [2021-06-01T13:53:42.839Z] 	at org.eclipse.ease.debugging.AbstractEaseDebugger.handleEventsInSuspendedState(AbstractEaseDebugger.java:329)
09:53:42 [2021-06-01T13:53:42.839Z] 	at org.eclipse.ease.debugging.AbstractEaseDebugger.suspend(AbstractEaseDebugger.java:255)
09:53:42 [2021-06-01T13:53:42.839Z] 	at org.eclipse.ease.debugging.AbstractEaseDebugger.processLine(AbstractEaseDebugger.java:490)
09:53:42 [2021-06-01T13:53:42.839Z] 	at org.eclipse.ease.lang.python.debugger.PythonDebugger.traceDispatch(PythonDebugger.java:177)
09:53:42 [2021-06-01T13:53:42.839Z] 	at org.eclipse.ease.lang.python.jython.debugger.JythonDebugger.traceDispatch(JythonDebugger.java:44)
09:53:42 [2021-06-01T13:53:42.839Z] 	at jdk.internal.reflect.GeneratedMethodAccessor25.invoke(Unknown Source)
09:53:42 [2021-06-01T13:53:42.839Z] 	at java.base/jdk.internal.reflect.DelegatingMethodAccessorImpl.invoke(DelegatingMethodAccessorImpl.java:43)
09:53:42 [2021-06-01T13:53:42.839Z] 	at java.base/java.lang.reflect.Method.invoke(Method.java:564)
09:53:42 [2021-06-01T13:53:42.839Z] 
09:53:42 [2021-06-01T13:53:42.839Z] org.eclipse.ease.ScriptEngineCancellationException: org.eclipse.ease.ScriptEngineCancellationException: Terminated on user request
09:53:43 [2021-06-01T13:53:43.097Z] Start of script
09:53:43 [2021-06-01T13:53:43.097Z] include file start
09:53:43 [2021-06-01T13:53:43.097Z] include file processed
09:53:43 [2021-06-01T13:53:43.097Z] Result of testMethod = 5
09:53:43 [2021-06-01T13:53:43.097Z] End of script
09:53:43 [2021-06-01T13:53:43.354Z] Start of script
09:53:43 [2021-06-01T13:53:43.354Z] include file start
09:53:43 [2021-06-01T13:53:43.354Z] include file processed
09:53:43 [2021-06-01T13:53:43.613Z] Result of testMethod = 5
09:53:43 [2021-06-01T13:53:43.613Z] End of script
09:53:43 [2021-06-01T13:53:43.613Z] Start of script
09:53:43 [2021-06-01T13:53:43.613Z] include file start
09:53:43 [2021-06-01T13:53:43.613Z] include file processed
09:53:43 [2021-06-01T13:53:43.613Z] Result of testMethod = 5
09:53:43 [2021-06-01T13:53:43.874Z] End of script
09:53:43 [2021-06-01T13:53:43.874Z] Tests run: 42, Failures: 1, Errors: 0, Skipped: 0, Time elapsed: 31.077 s <<< FAILURE! - in org.eclipse.ease.lang.python.jython.debugger.JythonDebugTest
09:53:43 [2021-06-01T13:53:43.874Z] disconnectProcessInSuspendedState  Time elapsed: 6.03 s
09:53:43 [2021-06-01T13:53:43.874Z] stepReturnIncludeCommand  Time elapsed: 0.479 s
09:53:43 [2021-06-01T13:53:43.874Z] arrayVariableSorting  Time elapsed: 0.515 s
09:53:43 [2021-06-01T13:53:43.874Z] stepOverOnDebugTarget  Time elapsed: 0.596 s
09:53:43 [2021-06-01T13:53:43.874Z] hasDebugTarget  Time elapsed: 0.324 s
09:53:43 [2021-06-01T13:53:43.874Z] disconnectThreadInSuspendedState  Time elapsed: 0.471 s
09:53:43 [2021-06-01T13:53:43.874Z] stepReturnOnDebugTarget  Time elapsed: 0.524 s
09:53:43 [2021-06-01T13:53:43.874Z] nullVariable  Time elapsed: 0.327 s
09:53:43 [2021-06-01T13:53:43.874Z] stepOverOnStackFrame  Time elapsed: 0.355 s
09:53:43 [2021-06-01T13:53:43.874Z] resumeOnDebugTarget  Time elapsed: 0.225 s
09:53:43 [2021-06-01T13:53:43.874Z] modifyVariableKeepingType  Time elapsed: 0.559 s
09:53:43 [2021-06-01T13:53:43.874Z] resumeOnLastIncludeLine  Time elapsed: 0.497 s
09:53:43 [2021-06-01T13:53:43.874Z] stepReturnOnStackFrame  Time elapsed: 0.418 s
09:53:43 [2021-06-01T13:53:43.874Z] terminateStackFrameInSuspendedState  Time elapsed: 0.25 s
09:53:43 [2021-06-01T13:53:43.874Z] breakpointLocation  Time elapsed: 0.249 s
09:53:43 [2021-06-01T13:53:43.874Z] stepReturnOnThread  Time elapsed: 0.504 s
09:53:43 [2021-06-01T13:53:43.874Z] javaClassVariable  Time elapsed: 0.479 s
09:53:43 [2021-06-01T13:53:43.874Z] stepIntoOnThread  Time elapsed: 0.455 s
09:53:43 [2021-06-01T13:53:43.874Z] terminateThreadInSuspendedState  Time elapsed: 0.212 s
09:53:43 [2021-06-01T13:53:43.874Z] resumeOnThread  Time elapsed: 0.334 s
09:53:43 [2021-06-01T13:53:43.874Z] stepIntoOnStackFrame  Time elapsed: 1.668 s
09:53:43 [2021-06-01T13:53:43.874Z] terminateProcessInSuspendedState  Time elapsed: 0.334 s  <<< FAILURE!
09:53:43 [2021-06-01T13:53:43.874Z] org.opentest4j.AssertionFailedError: expected: <1> but was: <2>
09:53:43 [2021-06-01T13:53:43.874Z] 	at org.eclipse.ease.testhelper.AbstractDebugTest.terminateTestTemplate(AbstractDebugTest.java:493)
09:53:43 [2021-06-01T13:53:43.874Z] 	at org.eclipse.ease.testhelper.AbstractDebugTest.terminateProcessInSuspendedState(AbstractDebugTest.java:505)
09:53:43 [2021-06-01T13:53:43.874Z] 
09:53:43 [2021-06-01T13:53:43.874Z] stepOverOnProcess  Time elapsed: 0.969 s
09:53:43 [2021-06-01T13:53:43.874Z] nativeArrayVariable  Time elapsed: 5.985 s
09:53:43 [2021-06-01T13:53:43.874Z] disconnectDebugTargetInSuspendedState  Time elapsed: 0.249 s
09:53:43 [2021-06-01T13:53:43.874Z] stepIntoOnProcess  Time elapsed: 0.411 s
09:53:43 [2021-06-01T13:53:43.874Z] terminatedState  Time elapsed: 0.534 s
09:53:43 [2021-06-01T13:53:43.874Z] stepOverIncludeCommand  Time elapsed: 0.659 s
09:53:43 [2021-06-01T13:53:43.874Z] innerScopeVariableBeforeOuterScopeVariable  Time elapsed: 0.807 s
09:53:43 [2021-06-01T13:53:43.874Z] stepIntoIncludeCommand  Time elapsed: 0.32 s
09:53:43 [2021-06-01T13:53:43.874Z] primitiveStringVariable  Time elapsed: 0.765 s
09:53:43 [2021-06-01T13:53:43.874Z] resumeOnProcess  Time elapsed: 0.263 s
09:53:43 [2021-06-01T13:53:43.874Z] stepIntoOnDebugTarget  Time elapsed: 0.321 s
09:53:43 [2021-06-01T13:53:43.874Z] stepOverOnThread  Time elapsed: 0.528 s
09:53:43 [2021-06-01T13:53:43.874Z] suspendedState  Time elapsed: 0.727 s
09:53:43 [2021-06-01T13:53:43.874Z] primitiveDoubleVariable  Time elapsed: 0.365 s
09:53:43 [2021-06-01T13:53:43.874Z] resumeOnStackFrame  Time elapsed: 0.231 s
09:53:43 [2021-06-01T13:53:43.874Z] nativeObjectVariable  Time elapsed: 0.315 s
09:53:43 [2021-06-01T13:53:43.874Z] terminateDebugTargetInSuspendedState  Time elapsed: 0.686 s
09:53:43 [2021-06-01T13:53:43.874Z] disconnectStackFrameInSuspendedState  Time elapsed: 0.51 s
09:53:43 [2021-06-01T13:53:43.874Z] stepReturnOnProcess  Time elapsed: 0.354 s
09:53:43 [2021-06-01T13:53:43.874Z] evaluateWatchExpression  Time elapsed: 0.234 s
09:53:43 [2021-06-01T13:53:43.874Z] 
09:53:43 [2021-06-01T13:53:43.874Z] Results:
09:53:43 [2021-06-01T13:53:43.874Z] 
09:53:43 [2021-06-01T13:53:43.874Z] Failures: 
09:53:43 [2021-06-01T13:53:43.874Z]   AbstractDebugTest.terminateProcessInSuspendedState:505->terminateTestTemplate:493 expected: <1> but was: <2>
09:53:43 [2021-06-01T13:53:43.874Z] 
09:53:43 [2021-06-01T13:53:43.874Z] Tests run: 42, Failures: 1, Errors: 0, Skipped: 0
09:53:43 [2021-06-01T13:53:43.874Z] 
09:53:47 [2021-06-01T13:53:47.179Z] [INFO] ------------------------------------------------------------------------
09:53:47 [2021-06-01T13:53:47.179Z] [INFO] Reactor Summary:
09:53:47 [2021-06-01T13:53:47.179Z] [INFO] 
09:53:47 [2021-06-01T13:53:47.179Z] [INFO] org.eclipse.ease.classloader 0.8.0-SNAPSHOT ........ SUCCESS [02:43 min]
09:53:47 [2021-06-01T13:53:47.179Z] [INFO] org.eclipse.ease 0.8.0-SNAPSHOT .................... SUCCESS [ 32.976 s]
09:53:47 [2021-06-01T13:53:47.179Z] [INFO] org.eclipse.ease.ui 0.8.0-SNAPSHOT ................. SUCCESS [ 31.661 s]
09:53:47 [2021-06-01T13:53:47.179Z] [INFO] org.eclipse.ease.ui.completions.java 0.8.0-SNAPSHOT  SUCCESS [ 11.956 s]
09:53:47 [2021-06-01T13:53:47.179Z] [INFO] org.eclipse.ease.ui.scripts 0.8.0-SNAPSHOT ......... SUCCESS [ 24.809 s]
09:53:47 [2021-06-01T13:53:47.179Z] [INFO] org.eclipse.ease.releng 0.8.0-SNAPSHOT ............. SUCCESS [  2.291 s]
09:53:47 [2021-06-01T13:53:47.179Z] [INFO] org.eclipse.ease.lang.javascript 0.8.0-SNAPSHOT .... SUCCESS [  9.830 s]
09:53:47 [2021-06-01T13:53:47.179Z] [INFO] org.eclipse.ease.lang.scriptarchive 0.8.0-SNAPSHOT . SUCCESS [  8.737 s]
09:53:47 [2021-06-01T13:53:47.179Z] [INFO] org.eclipse.ease.lang.python 0.8.0-SNAPSHOT ........ SUCCESS [ 12.848 s]
09:53:47 [2021-06-01T13:53:47.179Z] [INFO] org.eclipse.ease.lang.python.py4j 0.8.0-SNAPSHOT ... SUCCESS [ 10.447 s]
09:53:47 [2021-06-01T13:53:47.179Z] [INFO] org.eclipse.ease.lang.groovy 0.8.0-SNAPSHOT ........ SUCCESS [  7.102 s]
09:53:47 [2021-06-01T13:53:47.180Z] [INFO] org.eclipse.ease.lang.groovy.interpreter 0.8.0-SNAPSHOT SUCCESS [  8.705 s]
09:53:47 [2021-06-01T13:53:47.180Z] [INFO] org.eclipse.ease.lang.unittest 0.8.0-SNAPSHOT ...... SUCCESS [ 16.955 s]
09:53:47 [2021-06-01T13:53:47.180Z] [INFO] org.eclipse.ease.lang.unittest.ui 0.8.0-SNAPSHOT ... SUCCESS [ 18.510 s]
09:53:47 [2021-06-01T13:53:47.180Z] [INFO] org.eclipse.ease.lang.ruby 0.8.0-SNAPSHOT .......... SUCCESS [  8.340 s]
09:53:47 [2021-06-01T13:53:47.180Z] [INFO] org.eclipse.ease.lang.ruby.jruby 0.8.0-SNAPSHOT .... SUCCESS [  7.785 s]
09:53:47 [2021-06-01T13:53:47.180Z] [INFO] org.eclipse.ease.lang.javascript.nashorn 0.8.0-SNAPSHOT SUCCESS [ 10.256 s]
09:53:47 [2021-06-01T13:53:47.180Z] [INFO] org.eclipse.ease.lang.javascript.rhino 0.8.0-SNAPSHOT SUCCESS [ 12.457 s]
09:53:47 [2021-06-01T13:53:47.180Z] [INFO] org.eclipse.ease.lang.python.jython 0.8.0-SNAPSHOT . SUCCESS [ 11.436 s]
09:53:47 [2021-06-01T13:53:47.180Z] [INFO] org.eclipse.ease.lang.javascript.ui 0.8.0-SNAPSHOT . SUCCESS [  8.165 s]
09:53:47 [2021-06-01T13:53:47.180Z] [INFO] org.eclipse.ease.lang.jvm.compiled 0.8.0-SNAPSHOT .. SUCCESS [  8.439 s]
09:53:47 [2021-06-01T13:53:47.180Z] [INFO] org.eclipse.ease.lang.scriptarchive.ui 0.8.0-SNAPSHOT SUCCESS [ 10.202 s]
09:53:47 [2021-06-01T13:53:47.180Z] [INFO] org.eclipse.ease.help 0.8.0-SNAPSHOT ............... SUCCESS [ 12.457 s]
09:53:47 [2021-06-01T13:53:47.180Z] [INFO] org.eclipse.ease.feature 0.8.0-SNAPSHOT ............ SUCCESS [  2.662 s]
09:53:47 [2021-06-01T13:53:47.180Z] [INFO] org.eclipse.ease.ui.feature 0.8.0-SNAPSHOT ......... SUCCESS [  1.013 s]
09:53:47 [2021-06-01T13:53:47.180Z] [INFO] org.eclipse.ease.lang.javascript.feature 0.8.0-SNAPSHOT SUCCESS [  1.553 s]
09:53:47 [2021-06-01T13:53:47.180Z] [INFO] org.eclipse.ease.lang.python.feature 0.8.0-SNAPSHOT  SUCCESS [  1.430 s]
09:53:47 [2021-06-01T13:53:47.180Z] [INFO] org.eclipse.ease.python.jython.feature 0.8.0-SNAPSHOT SUCCESS [  0.969 s]
09:53:47 [2021-06-01T13:53:47.180Z] [INFO] org.eclipse.ease.lang.python.py4j.feature 0.8.0-SNAPSHOT SUCCESS [  1.562 s]
09:53:47 [2021-06-01T13:53:47.180Z] [INFO] org.eclipse.ease.lang.jvm.feature 0.8.0-SNAPSHOT ... SUCCESS [  0.390 s]
09:53:47 [2021-06-01T13:53:47.180Z] [INFO] org.eclipse.ease.lang.groovy.feature 0.8.0-SNAPSHOT  SUCCESS [  0.208 s]
09:53:47 [2021-06-01T13:53:47.180Z] [INFO] org.eclipse.ease.lang.ruby.feature 0.8.0-SNAPSHOT .. SUCCESS [  0.137 s]
09:53:47 [2021-06-01T13:53:47.180Z] [INFO] org.eclipse.ease.lang.scriptarchive.feature 0.8.0-SNAPSHOT SUCCESS [  0.179 s]
09:53:47 [2021-06-01T13:53:47.180Z] [INFO] org.eclipse.ease.lang.unittest.feature 0.8.0-SNAPSHOT SUCCESS [  0.161 s]
09:53:47 [2021-06-01T13:53:47.180Z] [INFO] org.eclipse.ease.releng.target 0.8.0-SNAPSHOT ...... SUCCESS [  0.011 s]
09:53:47 [2021-06-01T13:53:47.180Z] [INFO] org.eclipse.ease.releng.p2 0.8.0-SNAPSHOT .......... SUCCESS [ 22.295 s]
09:53:47 [2021-06-01T13:53:47.180Z] [INFO] org.eclipse.ease.testhelper 0.8.0-SNAPSHOT ......... SUCCESS [ 31.412 s]
09:53:47 [2021-06-01T13:53:47.180Z] [INFO] org.eclipse.ease.test 0.8.0-SNAPSHOT ............... SUCCESS [ 50.852 s]
09:53:47 [2021-06-01T13:53:47.180Z] [INFO] org.eclipse.ease.lang.javascript.rhino.test 0.8.0-SNAPSHOT SUCCESS [01:02 min]
09:53:47 [2021-06-01T13:53:47.180Z] [INFO] org.eclipse.ease.lang.javascript.test 0.8.0-SNAPSHOT SUCCESS [ 18.770 s]
09:53:47 [2021-06-01T13:53:47.180Z] [INFO] org.eclipse.ease.lang.python.test 0.8.0-SNAPSHOT ... SUCCESS [ 24.097 s]
09:53:47 [2021-06-01T13:53:47.180Z] [INFO] org.eclipse.ease.lang.python.jython.test 0.8.0-SNAPSHOT FAILURE [ 43.194 s]
09:53:47 [2021-06-01T13:53:47.180Z] [INFO] org.eclipse.ease.lang.scriptarchive.test 0.8.0-SNAPSHOT SKIPPED
09:53:47 [2021-06-01T13:53:47.180Z] [INFO] org.eclipse.ease.lang.unittest.test 0.8.0-SNAPSHOT . SKIPPED
09:53:47 [2021-06-01T13:53:47.180Z] [INFO] org.eclipse.ease.ui.scripts.test 0.8.0-SNAPSHOT .... SKIPPED
09:53:47 [2021-06-01T13:53:47.180Z] [INFO] org.eclipse.ease.ui.test 0.8.0-SNAPSHOT ............ SKIPPED
09:53:47 [2021-06-01T13:53:47.180Z] [INFO] org.eclipse.ease.releng.coverage 0.8.0-SNAPSHOT .... SKIPPED
09:53:47 [2021-06-01T13:53:47.180Z] [INFO] EASE (Incubation) 0.4.0-SNAPSHOT ................... SKIPPED
09:53:47 [2021-06-01T13:53:47.180Z] [INFO] ------------------------------------------------------------------------
09:53:47 [2021-06-01T13:53:47.180Z] [INFO] BUILD FAILURE
09:53:47 [2021-06-01T13:53:47.180Z] [INFO] ------------------------------------------------------------------------
09:53:47 [2021-06-01T13:53:47.180Z] [INFO] Total time:  23:46 min
09:53:47 [2021-06-01T13:53:47.180Z] [INFO] Finished at: 2021-06-01T13:53:46Z
09:53:47 [2021-06-01T13:53:47.180Z] [INFO] ------------------------------------------------------------------------
09:53:47 [2021-06-01T13:53:47.180Z] [INFO] [jenkins-event-spy] Generated /home/jenkins/agent/workspace/ease.verify.core.target.2019-06@tmp/withMaven65c87659/maven-spy-20210601-132959-5322668333419262323774.log
09:53:47 [2021-06-01T13:53:47.180Z] [ERROR] Failed to execute goal org.eclipse.tycho:tycho-surefire-plugin:2.2.0:test (default-test) on project org.eclipse.ease.lang.python.jython.test: There are test failures.
09:53:47 [2021-06-01T13:53:47.180Z] [ERROR] 
09:53:47 [2021-06-01T13:53:47.180Z] [ERROR] Please refer to /home/jenkins/agent/workspace/ease.verify.core.target.2019-06/tests/org.eclipse.ease.lang.python.jython.test/target/surefire-reports for the individual test results.
09:53:47 [2021-06-01T13:53:47.180Z] [ERROR] -> [Help 1]
09:53:47 [2021-06-01T13:53:47.180Z] [ERROR] 
09:53:47 [2021-06-01T13:53:47.180Z] [ERROR] To see the full stack trace of the errors, re-run Maven with the -e switch.
09:53:47 [2021-06-01T13:53:47.180Z] [ERROR] Re-run Maven using the -X switch to enable full debug logging.
09:53:47 [2021-06-01T13:53:47.180Z] [ERROR] 
09:53:47 [2021-06-01T13:53:47.180Z] [ERROR] For more information about the errors and possible solutions, please read the following articles:
09:53:47 [2021-06-01T13:53:47.181Z] [ERROR] [Help 1] http://cwiki.apache.org/confluence/display/MAVEN/MojoFailureException
09:53:47 [2021-06-01T13:53:47.181Z] [ERROR] 
09:53:47 [2021-06-01T13:53:47.181Z] [ERROR] After correcting the problems, you can resume the build with the command
09:53:47 [2021-06-01T13:53:47.181Z] [ERROR]   mvn <args> -rf :org.eclipse.ease.lang.python.jython.test
[Pipeline] }
09:53:49 [2021-06-01T13:53:49.437Z] [withMaven] junitPublisher - Archive test results for Maven artifact org.eclipse.ease:org.eclipse.ease.test:eclipse-test-plugin:0.8.0-SNAPSHOT generated by tycho-surefire-plugin:test (default-test): tests/org.eclipse.ease.test/target/surefire-reports/*.xml
09:53:49 [2021-06-01T13:53:49.437Z] [withMaven] junitPublisher - Archive test results for Maven artifact org.eclipse.ease:org.eclipse.ease.lang.javascript.rhino.test:eclipse-test-plugin:0.8.0-SNAPSHOT generated by tycho-surefire-plugin:test (default-test): tests/org.eclipse.ease.lang.javascript.rhino.test/target/surefire-reports/*.xml
09:53:49 [2021-06-01T13:53:49.437Z] [withMaven] junitPublisher - Archive test results for Maven artifact org.eclipse.ease:org.eclipse.ease.lang.javascript.test:eclipse-test-plugin:0.8.0-SNAPSHOT generated by tycho-surefire-plugin:test (default-test): tests/org.eclipse.ease.lang.javascript.test/target/surefire-reports/*.xml
09:53:49 [2021-06-01T13:53:49.437Z] [withMaven] junitPublisher - Archive test results for Maven artifact org.eclipse.ease:org.eclipse.ease.lang.python.test:eclipse-test-plugin:0.8.0-SNAPSHOT generated by tycho-surefire-plugin:test (default-test): tests/org.eclipse.ease.lang.python.test/target/surefire-reports/*.xml
09:53:49 [2021-06-01T13:53:49.437Z] [withMaven] junitPublisher - Archive test results for Maven artifact org.eclipse.ease:org.eclipse.ease.lang.python.jython.test:eclipse-test-plugin:0.8.0-SNAPSHOT generated by tycho-surefire-plugin:test (default-test): tests/org.eclipse.ease.lang.python.jython.test/target/surefire-reports/*.xml
09:53:49 [2021-06-01T13:53:49.439Z] [withMaven] junitPublisher - Jenkins JUnit Attachments Plugin not found, can't publish test attachments.Recording test results
09:53:52 [2021-06-01T13:53:52.013Z] [withMaven] Jenkins JaCoCo Plugin not found, don't display org.jacoco:jacoco-maven-plugin:prepare-agent[-integration] results in pipeline screen.
09:53:52 [2021-06-01T13:53:52.016Z] [withMaven] Jenkins FindBugs Plugin not found, don't display com.github.spotbugs:spotbugs-maven-plugin:spotbugs results in pipeline screen.
09:53:52 [2021-06-01T13:53:52.018Z] [withMaven] Publishers: Pipeline Graph Publisher: 68 ms, Invoker Publisher: 1 ms, Junit Publisher: 517 ms, Concordion Publisher: 2 ms, Dependencies Fingerprint Publisher: 2041 ms, Findbugs Publisher: 1 ms, Jacoco Publisher: 2 ms, SpotBugs Publisher: 1 ms
[Pipeline] // withMaven
[Pipeline] }
[Pipeline] // stage
[Pipeline] stage
[Pipeline] { (Test)
Stage "Test" skipped due to earlier failure(s)
[Pipeline] }
[Pipeline] // stage
[Pipeline] stage
[Pipeline] { (Declarative: Post Actions)
[Pipeline] archiveArtifacts
09:53:52 [2021-06-01T13:53:52.320Z] Archiving artifacts
[Pipeline] emailext
09:54:33 [2021-06-01T13:54:33.785Z] Sending email to: christian.pontesegger@web.de
[Pipeline] }
[Pipeline] // stage
[Pipeline] }
[Pipeline] // timeout
[Pipeline] }
[Pipeline] // timestamps
[Pipeline] }
[Pipeline] // node
[Pipeline] End of Pipeline
ERROR: script returned exit code 1
Finished: FAILURE