Console Output

Skipping 1,248 KB.. Full Log
09:46:47 [2021-05-18T13:46:47.178Z] 	at org.apache.maven.surefire.junitplatform.JUnitPlatformProvider.scanClasspath(JUnitPlatformProvider.java:143)
09:46:47 [2021-05-18T13:46:47.178Z] 	at org.apache.maven.surefire.junitplatform.JUnitPlatformProvider.invoke(JUnitPlatformProvider.java:124)
09:46:47 [2021-05-18T13:46:47.178Z] 	at java.base/jdk.internal.reflect.NativeMethodAccessorImpl.invoke0(Native Method)
09:46:47 [2021-05-18T13:46:47.178Z] 	at java.base/jdk.internal.reflect.NativeMethodAccessorImpl.invoke(NativeMethodAccessorImpl.java:64)
09:46:47 [2021-05-18T13:46:47.178Z] 	at java.base/jdk.internal.reflect.DelegatingMethodAccessorImpl.invoke(DelegatingMethodAccessorImpl.java:43)
09:46:47 [2021-05-18T13:46:47.178Z] 	at java.base/java.lang.reflect.Method.invoke(Method.java:564)
09:46:47 [2021-05-18T13:46:47.178Z] 	at org.apache.maven.surefire.util.ReflectionUtils.invokeMethodWithArray2(ReflectionUtils.java:206)
09:46:47 [2021-05-18T13:46:47.178Z] 	at org.apache.maven.surefire.booter.ProviderFactory$ProviderProxy.invoke(ProviderFactory.java:161)
09:46:47 [2021-05-18T13:46:47.178Z] 	at org.apache.maven.surefire.booter.ProviderFactory.invokeProvider(ProviderFactory.java:84)
09:46:47 [2021-05-18T13:46:47.178Z] 	at org.eclipse.tycho.surefire.osgibooter.OsgiSurefireBooter.run(OsgiSurefireBooter.java:116)
09:46:47 [2021-05-18T13:46:47.178Z] 	at org.eclipse.tycho.surefire.osgibooter.HeadlessTestApplication.start(HeadlessTestApplication.java:23)
09:46:47 [2021-05-18T13:46:47.178Z] 	at org.eclipse.equinox.internal.app.EclipseAppHandle.run(EclipseAppHandle.java:203)
09:46:47 [2021-05-18T13:46:47.178Z] 	at org.eclipse.core.runtime.internal.adaptor.EclipseAppLauncher.runApplication(EclipseAppLauncher.java:137)
09:46:47 [2021-05-18T13:46:47.178Z] 	at org.eclipse.core.runtime.internal.adaptor.EclipseAppLauncher.start(EclipseAppLauncher.java:107)
09:46:47 [2021-05-18T13:46:47.178Z] 	at org.eclipse.core.runtime.adaptor.EclipseStarter.run(EclipseStarter.java:400)
09:46:47 [2021-05-18T13:46:47.178Z] 	at org.eclipse.core.runtime.adaptor.EclipseStarter.run(EclipseStarter.java:255)
09:46:47 [2021-05-18T13:46:47.178Z] 	at java.base/jdk.internal.reflect.NativeMethodAccessorImpl.invoke0(Native Method)
09:46:47 [2021-05-18T13:46:47.178Z] 	at java.base/jdk.internal.reflect.NativeMethodAccessorImpl.invoke(NativeMethodAccessorImpl.java:64)
09:46:47 [2021-05-18T13:46:47.178Z] 	at java.base/jdk.internal.reflect.DelegatingMethodAccessorImpl.invoke(DelegatingMethodAccessorImpl.java:43)
09:46:47 [2021-05-18T13:46:47.178Z] 	at java.base/java.lang.reflect.Method.invoke(Method.java:564)
09:46:47 [2021-05-18T13:46:47.178Z] 	at org.eclipse.equinox.launcher.Main.invokeFramework(Main.java:660)
09:46:47 [2021-05-18T13:46:47.178Z] 	at org.eclipse.equinox.launcher.Main.basicRun(Main.java:597)
09:46:47 [2021-05-18T13:46:47.178Z] 	at org.eclipse.equinox.launcher.Main.run(Main.java:1468)
09:46:47 [2021-05-18T13:46:47.178Z] 	at org.eclipse.equinox.launcher.Main.main(Main.java:1441)
09:46:47 [2021-05-18T13:46:47.178Z] Caused by: java.lang.ClassNotFoundException: org.junit.runners.model.RunnerBuilder cannot be found by org.eclipse.tycho.surefire.osgibooter_2.2.0
09:46:47 [2021-05-18T13:46:47.178Z] 	at org.eclipse.osgi.internal.loader.BundleLoader.findClassInternal(BundleLoader.java:512)
09:46:47 [2021-05-18T13:46:47.178Z] 	at org.eclipse.osgi.internal.loader.BundleLoader.findClass(BundleLoader.java:423)
09:46:47 [2021-05-18T13:46:47.178Z] 	at org.eclipse.osgi.internal.loader.BundleLoader.findClass(BundleLoader.java:415)
09:46:47 [2021-05-18T13:46:47.178Z] 	at org.eclipse.osgi.internal.loader.ModuleClassLoader.loadClass(ModuleClassLoader.java:155)
09:46:47 [2021-05-18T13:46:47.178Z] 	at java.base/java.lang.ClassLoader.loadClass(ClassLoader.java:522)
09:46:47 [2021-05-18T13:46:47.178Z] 	... 31 more
09:46:47 [2021-05-18T13:46:47.178Z] 
09:46:47 [2021-05-18T13:46:47.178Z] May 18, 2021 1:46:46 PM org.junit.platform.launcher.core.DefaultLauncher handleThrowable
09:46:47 [2021-05-18T13:46:47.178Z] WARNING: TestEngine with ID 'junit-vintage' failed to discover tests
09:46:47 [2021-05-18T13:46:47.178Z] java.lang.NoClassDefFoundError: org/junit/runners/model/RunnerBuilder
09:46:47 [2021-05-18T13:46:47.178Z] 	at org.junit.vintage.engine.discovery.VintageDiscoverer.<init>(VintageDiscoverer.java:48)
09:46:47 [2021-05-18T13:46:47.178Z] 	at org.junit.vintage.engine.VintageTestEngine.discover(VintageTestEngine.java:65)
09:46:47 [2021-05-18T13:46:47.178Z] 	at org.junit.platform.launcher.core.DefaultLauncher.discoverEngineRoot(DefaultLauncher.java:130)
09:46:47 [2021-05-18T13:46:47.178Z] 	at org.junit.platform.launcher.core.DefaultLauncher.discoverRoot(DefaultLauncher.java:117)
09:46:47 [2021-05-18T13:46:47.178Z] 	at org.junit.platform.launcher.core.DefaultLauncher.discover(DefaultLauncher.java:82)
09:46:47 [2021-05-18T13:46:47.179Z] 	at org.apache.maven.surefire.junitplatform.TestPlanScannerFilter.accept(TestPlanScannerFilter.java:56)
09:46:47 [2021-05-18T13:46:47.179Z] 	at org.apache.maven.surefire.util.DefaultScanResult.applyFilter(DefaultScanResult.java:102)
09:46:47 [2021-05-18T13:46:47.179Z] 	at org.apache.maven.surefire.junitplatform.JUnitPlatformProvider.scanClasspath(JUnitPlatformProvider.java:143)
09:46:47 [2021-05-18T13:46:47.179Z] 	at org.apache.maven.surefire.junitplatform.JUnitPlatformProvider.invoke(JUnitPlatformProvider.java:124)
09:46:47 [2021-05-18T13:46:47.179Z] 	at java.base/jdk.internal.reflect.NativeMethodAccessorImpl.invoke0(Native Method)
09:46:47 [2021-05-18T13:46:47.179Z] 	at java.base/jdk.internal.reflect.NativeMethodAccessorImpl.invoke(NativeMethodAccessorImpl.java:64)
09:46:47 [2021-05-18T13:46:47.179Z] 	at java.base/jdk.internal.reflect.DelegatingMethodAccessorImpl.invoke(DelegatingMethodAccessorImpl.java:43)
09:46:47 [2021-05-18T13:46:47.179Z] 	at java.base/java.lang.reflect.Method.invoke(Method.java:564)
09:46:47 [2021-05-18T13:46:47.179Z] 	at org.apache.maven.surefire.util.ReflectionUtils.invokeMethodWithArray2(ReflectionUtils.java:206)
09:46:47 [2021-05-18T13:46:47.179Z] 	at org.apache.maven.surefire.booter.ProviderFactory$ProviderProxy.invoke(ProviderFactory.java:161)
09:46:47 [2021-05-18T13:46:47.179Z] 	at org.apache.maven.surefire.booter.ProviderFactory.invokeProvider(ProviderFactory.java:84)
09:46:47 [2021-05-18T13:46:47.179Z] 	at org.eclipse.tycho.surefire.osgibooter.OsgiSurefireBooter.run(OsgiSurefireBooter.java:116)
09:46:47 [2021-05-18T13:46:47.179Z] 	at org.eclipse.tycho.surefire.osgibooter.HeadlessTestApplication.start(HeadlessTestApplication.java:23)
09:46:47 [2021-05-18T13:46:47.179Z] 	at org.eclipse.equinox.internal.app.EclipseAppHandle.run(EclipseAppHandle.java:203)
09:46:47 [2021-05-18T13:46:47.179Z] 	at org.eclipse.core.runtime.internal.adaptor.EclipseAppLauncher.runApplication(EclipseAppLauncher.java:137)
09:46:47 [2021-05-18T13:46:47.179Z] 	at org.eclipse.core.runtime.internal.adaptor.EclipseAppLauncher.start(EclipseAppLauncher.java:107)
09:46:47 [2021-05-18T13:46:47.179Z] 	at org.eclipse.core.runtime.adaptor.EclipseStarter.run(EclipseStarter.java:400)
09:46:47 [2021-05-18T13:46:47.179Z] 	at org.eclipse.core.runtime.adaptor.EclipseStarter.run(EclipseStarter.java:255)
09:46:47 [2021-05-18T13:46:47.179Z] 	at java.base/jdk.internal.reflect.NativeMethodAccessorImpl.invoke0(Native Method)
09:46:47 [2021-05-18T13:46:47.179Z] 	at java.base/jdk.internal.reflect.NativeMethodAccessorImpl.invoke(NativeMethodAccessorImpl.java:64)
09:46:47 [2021-05-18T13:46:47.179Z] 	at java.base/jdk.internal.reflect.DelegatingMethodAccessorImpl.invoke(DelegatingMethodAccessorImpl.java:43)
09:46:47 [2021-05-18T13:46:47.179Z] 	at java.base/java.lang.reflect.Method.invoke(Method.java:564)
09:46:47 [2021-05-18T13:46:47.179Z] 	at org.eclipse.equinox.launcher.Main.invokeFramework(Main.java:660)
09:46:47 [2021-05-18T13:46:47.179Z] 	at org.eclipse.equinox.launcher.Main.basicRun(Main.java:597)
09:46:47 [2021-05-18T13:46:47.179Z] 	at org.eclipse.equinox.launcher.Main.run(Main.java:1468)
09:46:47 [2021-05-18T13:46:47.179Z] 	at org.eclipse.equinox.launcher.Main.main(Main.java:1441)
09:46:47 [2021-05-18T13:46:47.179Z] Caused by: java.lang.ClassNotFoundException: org.junit.runners.model.RunnerBuilder cannot be found by org.eclipse.tycho.surefire.osgibooter_2.2.0
09:46:47 [2021-05-18T13:46:47.179Z] 	at org.eclipse.osgi.internal.loader.BundleLoader.findClassInternal(BundleLoader.java:512)
09:46:47 [2021-05-18T13:46:47.179Z] 	at org.eclipse.osgi.internal.loader.BundleLoader.findClass(BundleLoader.java:423)
09:46:47 [2021-05-18T13:46:47.179Z] 	at org.eclipse.osgi.internal.loader.BundleLoader.findClass(BundleLoader.java:415)
09:46:47 [2021-05-18T13:46:47.179Z] 	at org.eclipse.osgi.internal.loader.ModuleClassLoader.loadClass(ModuleClassLoader.java:155)
09:46:47 [2021-05-18T13:46:47.179Z] 	at java.base/java.lang.ClassLoader.loadClass(ClassLoader.java:522)
09:46:47 [2021-05-18T13:46:47.179Z] 	... 31 more
09:46:47 [2021-05-18T13:46:47.179Z] 
09:46:47 [2021-05-18T13:46:47.179Z] May 18, 2021 1:46:46 PM org.junit.platform.launcher.core.DefaultLauncher handleThrowable
09:46:47 [2021-05-18T13:46:47.179Z] WARNING: TestEngine with ID 'junit-vintage' failed to discover tests
09:46:47 [2021-05-18T13:46:47.179Z] java.lang.NoClassDefFoundError: org/junit/runners/model/RunnerBuilder
09:46:47 [2021-05-18T13:46:47.179Z] 	at org.junit.vintage.engine.discovery.VintageDiscoverer.<init>(VintageDiscoverer.java:48)
09:46:47 [2021-05-18T13:46:47.179Z] 	at org.junit.vintage.engine.VintageTestEngine.discover(VintageTestEngine.java:65)
09:46:47 [2021-05-18T13:46:47.179Z] 	at org.junit.platform.launcher.core.DefaultLauncher.discoverEngineRoot(DefaultLauncher.java:130)
09:46:47 [2021-05-18T13:46:47.179Z] 	at org.junit.platform.launcher.core.DefaultLauncher.discoverRoot(DefaultLauncher.java:117)
09:46:47 [2021-05-18T13:46:47.179Z] 	at org.junit.platform.launcher.core.DefaultLauncher.discover(DefaultLauncher.java:82)
09:46:47 [2021-05-18T13:46:47.179Z] 	at org.apache.maven.surefire.junitplatform.TestPlanScannerFilter.accept(TestPlanScannerFilter.java:56)
09:46:47 [2021-05-18T13:46:47.179Z] 	at org.apache.maven.surefire.util.DefaultScanResult.applyFilter(DefaultScanResult.java:102)
09:46:47 [2021-05-18T13:46:47.179Z] 	at org.apache.maven.surefire.junitplatform.JUnitPlatformProvider.scanClasspath(JUnitPlatformProvider.java:143)
09:46:47 [2021-05-18T13:46:47.179Z] 	at org.apache.maven.surefire.junitplatform.JUnitPlatformProvider.invoke(JUnitPlatformProvider.java:124)
09:46:47 [2021-05-18T13:46:47.179Z] 	at java.base/jdk.internal.reflect.NativeMethodAccessorImpl.invoke0(Native Method)
09:46:47 [2021-05-18T13:46:47.179Z] 	at java.base/jdk.internal.reflect.NativeMethodAccessorImpl.invoke(NativeMethodAccessorImpl.java:64)
09:46:47 [2021-05-18T13:46:47.179Z] 	at java.base/jdk.internal.reflect.DelegatingMethodAccessorImpl.invoke(DelegatingMethodAccessorImpl.java:43)
09:46:47 [2021-05-18T13:46:47.179Z] 	at java.base/java.lang.reflect.Method.invoke(Method.java:564)
09:46:47 [2021-05-18T13:46:47.179Z] 	at org.apache.maven.surefire.util.ReflectionUtils.invokeMethodWithArray2(ReflectionUtils.java:206)
09:46:47 [2021-05-18T13:46:47.179Z] 	at org.apache.maven.surefire.booter.ProviderFactory$ProviderProxy.invoke(ProviderFactory.java:161)
09:46:47 [2021-05-18T13:46:47.179Z] 	at org.apache.maven.surefire.booter.ProviderFactory.invokeProvider(ProviderFactory.java:84)
09:46:47 [2021-05-18T13:46:47.179Z] 	at org.eclipse.tycho.surefire.osgibooter.OsgiSurefireBooter.run(OsgiSurefireBooter.java:116)
09:46:47 [2021-05-18T13:46:47.180Z] 	at org.eclipse.tycho.surefire.osgibooter.HeadlessTestApplication.start(HeadlessTestApplication.java:23)
09:46:47 [2021-05-18T13:46:47.180Z] 	at org.eclipse.equinox.internal.app.EclipseAppHandle.run(EclipseAppHandle.java:203)
09:46:47 [2021-05-18T13:46:47.180Z] 	at org.eclipse.core.runtime.internal.adaptor.EclipseAppLauncher.runApplication(EclipseAppLauncher.java:137)
09:46:47 [2021-05-18T13:46:47.180Z] 	at org.eclipse.core.runtime.internal.adaptor.EclipseAppLauncher.start(EclipseAppLauncher.java:107)
09:46:47 [2021-05-18T13:46:47.180Z] 	at org.eclipse.core.runtime.adaptor.EclipseStarter.run(EclipseStarter.java:400)
09:46:47 [2021-05-18T13:46:47.180Z] 	at org.eclipse.core.runtime.adaptor.EclipseStarter.run(EclipseStarter.java:255)
09:46:47 [2021-05-18T13:46:47.180Z] 	at java.base/jdk.internal.reflect.NativeMethodAccessorImpl.invoke0(Native Method)
09:46:47 [2021-05-18T13:46:47.180Z] 	at java.base/jdk.internal.reflect.NativeMethodAccessorImpl.invoke(NativeMethodAccessorImpl.java:64)
09:46:47 [2021-05-18T13:46:47.180Z] 	at java.base/jdk.internal.reflect.DelegatingMethodAccessorImpl.invoke(DelegatingMethodAccessorImpl.java:43)
09:46:47 [2021-05-18T13:46:47.180Z] 	at java.base/java.lang.reflect.Method.invoke(Method.java:564)
09:46:47 [2021-05-18T13:46:47.180Z] 	at org.eclipse.equinox.launcher.Main.invokeFramework(Main.java:660)
09:46:47 [2021-05-18T13:46:47.180Z] 	at org.eclipse.equinox.launcher.Main.basicRun(Main.java:597)
09:46:47 [2021-05-18T13:46:47.180Z] 	at org.eclipse.equinox.launcher.Main.run(Main.java:1468)
09:46:47 [2021-05-18T13:46:47.180Z] 	at org.eclipse.equinox.launcher.Main.main(Main.java:1441)
09:46:47 [2021-05-18T13:46:47.180Z] Caused by: java.lang.ClassNotFoundException: org.junit.runners.model.RunnerBuilder cannot be found by org.eclipse.tycho.surefire.osgibooter_2.2.0
09:46:47 [2021-05-18T13:46:47.180Z] 	at org.eclipse.osgi.internal.loader.BundleLoader.findClassInternal(BundleLoader.java:512)
09:46:47 [2021-05-18T13:46:47.180Z] 	at org.eclipse.osgi.internal.loader.BundleLoader.findClass(BundleLoader.java:423)
09:46:47 [2021-05-18T13:46:47.180Z] 	at org.eclipse.osgi.internal.loader.BundleLoader.findClass(BundleLoader.java:415)
09:46:47 [2021-05-18T13:46:47.180Z] 	at org.eclipse.osgi.internal.loader.ModuleClassLoader.loadClass(ModuleClassLoader.java:155)
09:46:47 [2021-05-18T13:46:47.180Z] 	at java.base/java.lang.ClassLoader.loadClass(ClassLoader.java:522)
09:46:47 [2021-05-18T13:46:47.180Z] 	... 31 more
09:46:47 [2021-05-18T13:46:47.180Z] 
09:46:47 [2021-05-18T13:46:47.180Z] May 18, 2021 1:46:46 PM org.junit.platform.launcher.core.DefaultLauncher handleThrowable
09:46:47 [2021-05-18T13:46:47.180Z] WARNING: TestEngine with ID 'junit-vintage' failed to discover tests
09:46:47 [2021-05-18T13:46:47.180Z] java.lang.NoClassDefFoundError: org/junit/runners/model/RunnerBuilder
09:46:47 [2021-05-18T13:46:47.180Z] 	at org.junit.vintage.engine.discovery.VintageDiscoverer.<init>(VintageDiscoverer.java:48)
09:46:47 [2021-05-18T13:46:47.180Z] 	at org.junit.vintage.engine.VintageTestEngine.discover(VintageTestEngine.java:65)
09:46:47 [2021-05-18T13:46:47.180Z] 	at org.junit.platform.launcher.core.DefaultLauncher.discoverEngineRoot(DefaultLauncher.java:130)
09:46:47 [2021-05-18T13:46:47.180Z] 	at org.junit.platform.launcher.core.DefaultLauncher.discoverRoot(DefaultLauncher.java:117)
09:46:47 [2021-05-18T13:46:47.180Z] 	at org.junit.platform.launcher.core.DefaultLauncher.discover(DefaultLauncher.java:82)
09:46:47 [2021-05-18T13:46:47.180Z] 	at org.apache.maven.surefire.junitplatform.TestPlanScannerFilter.accept(TestPlanScannerFilter.java:56)
09:46:47 [2021-05-18T13:46:47.180Z] 	at org.apache.maven.surefire.util.DefaultScanResult.applyFilter(DefaultScanResult.java:102)
09:46:47 [2021-05-18T13:46:47.180Z] 	at org.apache.maven.surefire.junitplatform.JUnitPlatformProvider.scanClasspath(JUnitPlatformProvider.java:143)
09:46:47 [2021-05-18T13:46:47.180Z] 	at org.apache.maven.surefire.junitplatform.JUnitPlatformProvider.invoke(JUnitPlatformProvider.java:124)
09:46:47 [2021-05-18T13:46:47.180Z] 	at java.base/jdk.internal.reflect.NativeMethodAccessorImpl.invoke0(Native Method)
09:46:47 [2021-05-18T13:46:47.180Z] 	at java.base/jdk.internal.reflect.NativeMethodAccessorImpl.invoke(NativeMethodAccessorImpl.java:64)
09:46:47 [2021-05-18T13:46:47.180Z] 	at java.base/jdk.internal.reflect.DelegatingMethodAccessorImpl.invoke(DelegatingMethodAccessorImpl.java:43)
09:46:47 [2021-05-18T13:46:47.180Z] 	at java.base/java.lang.reflect.Method.invoke(Method.java:564)
09:46:47 [2021-05-18T13:46:47.180Z] 	at org.apache.maven.surefire.util.ReflectionUtils.invokeMethodWithArray2(ReflectionUtils.java:206)
09:46:47 [2021-05-18T13:46:47.180Z] 	at org.apache.maven.surefire.booter.ProviderFactory$ProviderProxy.invoke(ProviderFactory.java:161)
09:46:47 [2021-05-18T13:46:47.180Z] 	at org.apache.maven.surefire.booter.ProviderFactory.invokeProvider(ProviderFactory.java:84)
09:46:47 [2021-05-18T13:46:47.180Z] 	at org.eclipse.tycho.surefire.osgibooter.OsgiSurefireBooter.run(OsgiSurefireBooter.java:116)
09:46:47 [2021-05-18T13:46:47.180Z] 	at org.eclipse.tycho.surefire.osgibooter.HeadlessTestApplication.start(HeadlessTestApplication.java:23)
09:46:47 [2021-05-18T13:46:47.180Z] 	at org.eclipse.equinox.internal.app.EclipseAppHandle.run(EclipseAppHandle.java:203)
09:46:47 [2021-05-18T13:46:47.180Z] 	at org.eclipse.core.runtime.internal.adaptor.EclipseAppLauncher.runApplication(EclipseAppLauncher.java:137)
09:46:47 [2021-05-18T13:46:47.180Z] 	at org.eclipse.core.runtime.internal.adaptor.EclipseAppLauncher.start(EclipseAppLauncher.java:107)
09:46:47 [2021-05-18T13:46:47.180Z] 	at org.eclipse.core.runtime.adaptor.EclipseStarter.run(EclipseStarter.java:400)
09:46:47 [2021-05-18T13:46:47.180Z] 	at org.eclipse.core.runtime.adaptor.EclipseStarter.run(EclipseStarter.java:255)
09:46:47 [2021-05-18T13:46:47.180Z] 	at java.base/jdk.internal.reflect.NativeMethodAccessorImpl.invoke0(Native Method)
09:46:47 [2021-05-18T13:46:47.180Z] 	at java.base/jdk.internal.reflect.NativeMethodAccessorImpl.invoke(NativeMethodAccessorImpl.java:64)
09:46:47 [2021-05-18T13:46:47.180Z] 	at java.base/jdk.internal.reflect.DelegatingMethodAccessorImpl.invoke(DelegatingMethodAccessorImpl.java:43)
09:46:47 [2021-05-18T13:46:47.180Z] 	at java.base/java.lang.reflect.Method.invoke(Method.java:564)
09:46:47 [2021-05-18T13:46:47.180Z] 	at org.eclipse.equinox.launcher.Main.invokeFramework(Main.java:660)
09:46:47 [2021-05-18T13:46:47.180Z] 	at org.eclipse.equinox.launcher.Main.basicRun(Main.java:597)
09:46:47 [2021-05-18T13:46:47.180Z] 	at org.eclipse.equinox.launcher.Main.run(Main.java:1468)
09:46:47 [2021-05-18T13:46:47.180Z] 	at org.eclipse.equinox.launcher.Main.main(Main.java:1441)
09:46:47 [2021-05-18T13:46:47.180Z] Caused by: java.lang.ClassNotFoundException: org.junit.runners.model.RunnerBuilder cannot be found by org.eclipse.tycho.surefire.osgibooter_2.2.0
09:46:47 [2021-05-18T13:46:47.180Z] 	at org.eclipse.osgi.internal.loader.BundleLoader.findClassInternal(BundleLoader.java:512)
09:46:47 [2021-05-18T13:46:47.181Z] 	at org.eclipse.osgi.internal.loader.BundleLoader.findClass(BundleLoader.java:423)
09:46:47 [2021-05-18T13:46:47.181Z] 	at org.eclipse.osgi.internal.loader.BundleLoader.findClass(BundleLoader.java:415)
09:46:47 [2021-05-18T13:46:47.181Z] 	at org.eclipse.osgi.internal.loader.ModuleClassLoader.loadClass(ModuleClassLoader.java:155)
09:46:47 [2021-05-18T13:46:47.181Z] 	at java.base/java.lang.ClassLoader.loadClass(ClassLoader.java:522)
09:46:47 [2021-05-18T13:46:47.181Z] 	... 31 more
09:46:47 [2021-05-18T13:46:47.181Z] 
09:46:47 [2021-05-18T13:46:47.181Z] May 18, 2021 1:46:47 PM org.junit.platform.launcher.core.DefaultLauncher handleThrowable
09:46:47 [2021-05-18T13:46:47.181Z] WARNING: TestEngine with ID 'junit-vintage' failed to discover tests
09:46:47 [2021-05-18T13:46:47.181Z] java.lang.NoClassDefFoundError: org/junit/runners/model/RunnerBuilder
09:46:47 [2021-05-18T13:46:47.181Z] 	at org.junit.vintage.engine.discovery.VintageDiscoverer.<init>(VintageDiscoverer.java:48)
09:46:47 [2021-05-18T13:46:47.181Z] 	at org.junit.vintage.engine.VintageTestEngine.discover(VintageTestEngine.java:65)
09:46:47 [2021-05-18T13:46:47.181Z] 	at org.junit.platform.launcher.core.DefaultLauncher.discoverEngineRoot(DefaultLauncher.java:130)
09:46:47 [2021-05-18T13:46:47.181Z] 	at org.junit.platform.launcher.core.DefaultLauncher.discoverRoot(DefaultLauncher.java:117)
09:46:47 [2021-05-18T13:46:47.181Z] 	at org.junit.platform.launcher.core.DefaultLauncher.execute(DefaultLauncher.java:90)
09:46:47 [2021-05-18T13:46:47.181Z] 	at org.apache.maven.surefire.junitplatform.JUnitPlatformProvider.invokeAllTests(JUnitPlatformProvider.java:150)
09:46:47 [2021-05-18T13:46:47.181Z] 	at org.apache.maven.surefire.junitplatform.JUnitPlatformProvider.invoke(JUnitPlatformProvider.java:124)
09:46:47 [2021-05-18T13:46:47.181Z] 	at java.base/jdk.internal.reflect.NativeMethodAccessorImpl.invoke0(Native Method)
09:46:47 [2021-05-18T13:46:47.181Z] 	at java.base/jdk.internal.reflect.NativeMethodAccessorImpl.invoke(NativeMethodAccessorImpl.java:64)
09:46:47 [2021-05-18T13:46:47.181Z] 	at java.base/jdk.internal.reflect.DelegatingMethodAccessorImpl.invoke(DelegatingMethodAccessorImpl.java:43)
09:46:47 [2021-05-18T13:46:47.181Z] 	at java.base/java.lang.reflect.Method.invoke(Method.java:564)
09:46:47 [2021-05-18T13:46:47.181Z] 	at org.apache.maven.surefire.util.ReflectionUtils.invokeMethodWithArray2(ReflectionUtils.java:206)
09:46:47 [2021-05-18T13:46:47.181Z] 	at org.apache.maven.surefire.booter.ProviderFactory$ProviderProxy.invoke(ProviderFactory.java:161)
09:46:47 [2021-05-18T13:46:47.181Z] 	at org.apache.maven.surefire.booter.ProviderFactory.invokeProvider(ProviderFactory.java:84)
09:46:47 [2021-05-18T13:46:47.181Z] 	at org.eclipse.tycho.surefire.osgibooter.OsgiSurefireBooter.run(OsgiSurefireBooter.java:116)
09:46:47 [2021-05-18T13:46:47.181Z] 	at org.eclipse.tycho.surefire.osgibooter.HeadlessTestApplication.start(HeadlessTestApplication.java:23)
09:46:47 [2021-05-18T13:46:47.181Z] 	at org.eclipse.equinox.internal.app.EclipseAppHandle.run(EclipseAppHandle.java:203)
09:46:47 [2021-05-18T13:46:47.181Z] 	at org.eclipse.core.runtime.internal.adaptor.EclipseAppLauncher.runApplication(EclipseAppLauncher.java:137)
09:46:47 [2021-05-18T13:46:47.181Z] 	at org.eclipse.core.runtime.internal.adaptor.EclipseAppLauncher.start(EclipseAppLauncher.java:107)
09:46:47 [2021-05-18T13:46:47.181Z] 	at org.eclipse.core.runtime.adaptor.EclipseStarter.run(EclipseStarter.java:400)
09:46:47 [2021-05-18T13:46:47.181Z] 	at org.eclipse.core.runtime.adaptor.EclipseStarter.run(EclipseStarter.java:255)
09:46:47 [2021-05-18T13:46:47.181Z] 	at java.base/jdk.internal.reflect.NativeMethodAccessorImpl.invoke0(Native Method)
09:46:47 [2021-05-18T13:46:47.181Z] 	at java.base/jdk.internal.reflect.NativeMethodAccessorImpl.invoke(NativeMethodAccessorImpl.java:64)
09:46:47 [2021-05-18T13:46:47.181Z] 	at java.base/jdk.internal.reflect.DelegatingMethodAccessorImpl.invoke(DelegatingMethodAccessorImpl.java:43)
09:46:47 [2021-05-18T13:46:47.181Z] 	at java.base/java.lang.reflect.Method.invoke(Method.java:564)
09:46:47 [2021-05-18T13:46:47.181Z] 	at org.eclipse.equinox.launcher.Main.invokeFramework(Main.java:660)
09:46:47 [2021-05-18T13:46:47.181Z] 	at org.eclipse.equinox.launcher.Main.basicRun(Main.java:597)
09:46:47 [2021-05-18T13:46:47.181Z] 	at org.eclipse.equinox.launcher.Main.run(Main.java:1468)
09:46:47 [2021-05-18T13:46:47.181Z] 	at org.eclipse.equinox.launcher.Main.main(Main.java:1441)
09:46:47 [2021-05-18T13:46:47.181Z] Caused by: java.lang.ClassNotFoundException: org.junit.runners.model.RunnerBuilder cannot be found by org.eclipse.tycho.surefire.osgibooter_2.2.0
09:46:47 [2021-05-18T13:46:47.181Z] 	at org.eclipse.osgi.internal.loader.BundleLoader.findClassInternal(BundleLoader.java:512)
09:46:47 [2021-05-18T13:46:47.181Z] 	at org.eclipse.osgi.internal.loader.BundleLoader.findClass(BundleLoader.java:423)
09:46:47 [2021-05-18T13:46:47.181Z] 	at org.eclipse.osgi.internal.loader.BundleLoader.findClass(BundleLoader.java:415)
09:46:47 [2021-05-18T13:46:47.181Z] 	at org.eclipse.osgi.internal.loader.ModuleClassLoader.loadClass(ModuleClassLoader.java:155)
09:46:47 [2021-05-18T13:46:47.181Z] 	at java.base/java.lang.ClassLoader.loadClass(ClassLoader.java:522)
09:46:47 [2021-05-18T13:46:47.181Z] 	... 29 more
09:46:47 [2021-05-18T13:46:47.181Z] 
09:46:47 [2021-05-18T13:46:47.471Z] Running org.eclipse.ease.AbstractReplScriptEngineTest
09:46:52 [2021-05-18T13:46:52.737Z] testorg.eclipse.ease.ScriptEngineCancellationException: Terminated on user request
09:46:52 [2021-05-18T13:46:52.737Z] 	at org.eclipse.ease.AbstractScriptEngine.checkForCancellation(AbstractScriptEngine.java:391)
09:46:52 [2021-05-18T13:46:52.737Z] 	at org.eclipse.ease.AbstractScriptEngineTest$3.execute(AbstractScriptEngineTest.java:294)
09:46:52 [2021-05-18T13:46:52.737Z] 	at org.eclipse.ease.AbstractScriptEngine.inject(AbstractScriptEngine.java:189)
09:46:52 [2021-05-18T13:46:52.737Z] 	at org.eclipse.ease.AbstractScriptEngine.run(AbstractScriptEngine.java:242)
09:46:52 [2021-05-18T13:46:52.737Z] 	at org.eclipse.core.internal.jobs.Worker.run(Worker.java:63)
09:46:52 [2021-05-18T13:46:52.737Z] java.lang.RuntimeException: ERROR
09:46:52 [2021-05-18T13:46:52.737Z] 	at org.eclipse.ease.AbstractReplScriptEngineTest$MockedScriptEngine.execute(AbstractReplScriptEngineTest.java:61)
09:46:52 [2021-05-18T13:46:52.737Z] 	at org.eclipse.ease.AbstractScriptEngine.inject(AbstractScriptEngine.java:189)
09:46:52 [2021-05-18T13:46:52.737Z] 	at org.eclipse.ease.AbstractScriptEngine.run(AbstractScriptEngine.java:242)
09:46:52 [2021-05-18T13:46:52.737Z] 	at org.eclipse.core.internal.jobs.Worker.run(Worker.java:63)
09:46:56 [2021-05-18T13:46:56.019Z] 1Hello worldHello worldTests run: 20, Failures: 0, Errors: 0, Skipped: 0, Time elapsed: 8.109 s - in org.eclipse.ease.AbstractReplScriptEngineTest
09:46:56 [2021-05-18T13:46:56.019Z] extractEmptyArguments  Time elapsed: 0.105 s
09:46:56 [2021-05-18T13:46:56.019Z] setNotNullOutputStream  Time elapsed: 0.001 s
09:46:56 [2021-05-18T13:46:56.019Z] terminateViaMonitorCancellation  Time elapsed: 1.114 s
09:46:56 [2021-05-18T13:46:56.019Z] inject  Time elapsed: 0.003 s
09:46:56 [2021-05-18T13:46:56.019Z] extractArguments  Time elapsed: 0.004 s
09:46:56 [2021-05-18T13:46:56.019Z] executeSync  Time elapsed: 1.001 s
09:46:56 [2021-05-18T13:46:56.019Z] setNotNullErrorStream  Time elapsed: 0 s
09:46:56 [2021-05-18T13:46:56.019Z] setNullErrorStream  Time elapsed: 0 s
09:46:56 [2021-05-18T13:46:56.019Z] isJob  Time elapsed: 0.001 s
09:46:56 [2021-05-18T13:46:56.019Z] streamsAvailable  Time elapsed: 0 s
09:46:56 [2021-05-18T13:46:56.019Z] executeValidCodeAndTerminate  Time elapsed: 1.001 s
09:46:56 [2021-05-18T13:46:56.019Z] setNullOutputStream  Time elapsed: 0 s
09:46:56 [2021-05-18T13:46:56.019Z] terminateMultipleTimes  Time elapsed: 0.602 s
09:46:56 [2021-05-18T13:46:56.019Z] engineTerminatesWhenIdle  Time elapsed: 1.002 s
09:46:56 [2021-05-18T13:46:56.019Z] terminateViaTerminateMethod  Time elapsed: 0.203 s
09:46:56 [2021-05-18T13:46:56.019Z] terminateViaMethodCallback  Time elapsed: 0.004 s
09:46:56 [2021-05-18T13:46:56.019Z] executeErrorCodeAndTerminate  Time elapsed: 0.002 s
09:46:56 [2021-05-18T13:46:56.019Z] terminateOnIdleAfterSchedule  Time elapsed: 1.011 s
09:46:56 [2021-05-18T13:46:56.019Z] terminateEngine  Time elapsed: 1.001 s
09:46:56 [2021-05-18T13:46:56.019Z] keepRunningOnIdle  Time elapsed: 1.001 s
09:46:56 [2021-05-18T13:46:56.019Z] Running org.eclipse.ease.applications.RunHeadlessScriptTest
09:46:56 [2021-05-18T13:46:56.954Z] org.eclipse.ease.ScriptExecutionException: SyntaxError: missing ; before statement (file:///home/jenkins/agent/workspace/ease.verify.core.target.2019-06/tests/org.eclipse.ease.test/resources/throwsException.js#1)
09:46:56 [2021-05-18T13:46:56.954Z] this does not work;
09:46:56 [2021-05-18T13:46:56.954Z]          ^
09:46:56 [2021-05-18T13:46:56.954Z] 	at throwsException.js,file:///home/jenkins/agent/workspace/ease.verify.core.target.2019-06/tests/org.eclipse.ease.test/resources/throwsException.js
09:46:56 [2021-05-18T13:46:56.954Z] ERROR: invalid command line argument
09:46:56 [2021-05-18T13:46:56.954Z] 	invalid argument: -unknown
09:46:56 [2021-05-18T13:46:56.954Z] 
09:46:56 [2021-05-18T13:46:56.954Z] SYNTAX: [-workspace <workspace location> [-refreshWorkspace]] [-engine <engineID>]-script <script name> <script parameters>
09:46:56 [2021-05-18T13:46:56.954Z] 
09:46:56 [2021-05-18T13:46:56.955Z] 		<script name> is a path like 'file://C/myfolder/myscript.js'
09:46:56 [2021-05-18T13:46:56.955Z] 		<engineID> provides a dedicated script engine ID. Use org.eclipse.ease.listEngines application.
09:46:56 [2021-05-18T13:46:56.955Z] 		<workspace location> is a file system path like 'C:\somefolder\myworkspace'
09:46:56 [2021-05-18T13:46:56.955Z] 			if you provide a workspace you can use workspace:// identifiers in your scripts
09:46:56 [2021-05-18T13:46:56.955Z] 			if you provide a workspace you may ask to refresh it first prior to script execution
09:46:56 [2021-05-18T13:46:56.955Z] 		<script parameters> will be passed to the script as String[] in the variable 'argv'
09:46:56 [2021-05-18T13:46:56.955Z] ERROR: invalid command line argument
09:46:56 [2021-05-18T13:46:56.955Z] 	script name is missing
09:46:56 [2021-05-18T13:46:56.955Z] 
09:46:56 [2021-05-18T13:46:56.955Z] SYNTAX: [-workspace <workspace location> [-refreshWorkspace]] [-engine <engineID>]-script <script name> <script parameters>
09:46:56 [2021-05-18T13:46:56.955Z] 
09:46:56 [2021-05-18T13:46:56.955Z] 		<script name> is a path like 'file://C/myfolder/myscript.js'
09:46:56 [2021-05-18T13:46:56.955Z] 		<engineID> provides a dedicated script engine ID. Use org.eclipse.ease.listEngines application.
09:46:56 [2021-05-18T13:46:56.955Z] 		<workspace location> is a file system path like 'C:\somefolder\myworkspace'
09:46:56 [2021-05-18T13:46:56.955Z] 			if you provide a workspace you can use workspace:// identifiers in your scripts
09:46:56 [2021-05-18T13:46:56.955Z] 			if you provide a workspace you may ask to refresh it first prior to script execution
09:46:56 [2021-05-18T13:46:56.955Z] 		<script parameters> will be passed to the script as String[] in the variable 'argv'
09:46:56 [2021-05-18T13:46:56.955Z] SYNTAX: [-workspace <workspace location> [-refreshWorkspace]] [-engine <engineID>]-script <script name> <script parameters>
09:46:56 [2021-05-18T13:46:56.955Z] 
09:46:56 [2021-05-18T13:46:56.955Z] 		<script name> is a path like 'file://C/myfolder/myscript.js'
09:46:56 [2021-05-18T13:46:56.955Z] 		<engineID> provides a dedicated script engine ID. Use org.eclipse.ease.listEngines application.
09:46:56 [2021-05-18T13:46:56.955Z] 		<workspace location> is a file system path like 'C:\somefolder\myworkspace'
09:46:56 [2021-05-18T13:46:56.955Z] 			if you provide a workspace you can use workspace:// identifiers in your scripts
09:46:56 [2021-05-18T13:46:56.955Z] 			if you provide a workspace you may ask to refresh it first prior to script execution
09:46:56 [2021-05-18T13:46:56.955Z] 		<script parameters> will be passed to the script as String[] in the variable 'argv'
09:46:57 [2021-05-18T13:46:57.216Z] Hello World
09:46:57 [2021-05-18T13:46:57.216Z] ERROR: invalid command line argument
09:46:57 [2021-05-18T13:46:57.216Z] 	workspace name is missing
09:46:57 [2021-05-18T13:46:57.216Z] 
09:46:57 [2021-05-18T13:46:57.216Z] SYNTAX: [-workspace <workspace location> [-refreshWorkspace]] [-engine <engineID>]-script <script name> <script parameters>
09:46:57 [2021-05-18T13:46:57.216Z] 
09:46:57 [2021-05-18T13:46:57.216Z] 		<script name> is a path like 'file://C/myfolder/myscript.js'
09:46:57 [2021-05-18T13:46:57.217Z] 		<engineID> provides a dedicated script engine ID. Use org.eclipse.ease.listEngines application.
09:46:57 [2021-05-18T13:46:57.217Z] 		<workspace location> is a file system path like 'C:\somefolder\myworkspace'
09:46:57 [2021-05-18T13:46:57.217Z] 			if you provide a workspace you can use workspace:// identifiers in your scripts
09:46:57 [2021-05-18T13:46:57.217Z] 			if you provide a workspace you may ask to refresh it first prior to script execution
09:46:57 [2021-05-18T13:46:57.217Z] 		<script parameters> will be passed to the script as String[] in the variable 'argv'
09:46:57 [2021-05-18T13:46:57.217Z] ERROR: invalid command line argument
09:46:57 [2021-05-18T13:46:57.217Z] 	engine ID is missing
09:46:57 [2021-05-18T13:46:57.217Z] 
09:46:57 [2021-05-18T13:46:57.217Z] SYNTAX: [-workspace <workspace location> [-refreshWorkspace]] [-engine <engineID>]-script <script name> <script parameters>
09:46:57 [2021-05-18T13:46:57.217Z] 
09:46:57 [2021-05-18T13:46:57.217Z] 		<script name> is a path like 'file://C/myfolder/myscript.js'
09:46:57 [2021-05-18T13:46:57.217Z] 		<engineID> provides a dedicated script engine ID. Use org.eclipse.ease.listEngines application.
09:46:57 [2021-05-18T13:46:57.217Z] 		<workspace location> is a file system path like 'C:\somefolder\myworkspace'
09:46:57 [2021-05-18T13:46:57.217Z] 			if you provide a workspace you can use workspace:// identifiers in your scripts
09:46:57 [2021-05-18T13:46:57.217Z] 			if you provide a workspace you may ask to refresh it first prior to script execution
09:46:57 [2021-05-18T13:46:57.217Z] 		<script parameters> will be passed to the script as String[] in the variable 'argv'
09:46:57 [2021-05-18T13:46:57.217Z] Tests run: 12, Failures: 0, Errors: 0, Skipped: 0, Time elapsed: 1.781 s - in org.eclipse.ease.applications.RunHeadlessScriptTest
09:46:57 [2021-05-18T13:46:57.217Z] start_error_when_script_throws  Time elapsed: 1.433 s
09:46:57 [2021-05-18T13:46:57.217Z] start_error_when_engine_ID_is_invalid  Time elapsed: 0.002 s
09:46:57 [2021-05-18T13:46:57.217Z] start_error_when_argument_is_unknown  Time elapsed: 0.001 s
09:46:57 [2021-05-18T13:46:57.217Z] start_error_when_script_location_is_missing  Time elapsed: 0.001 s
09:46:57 [2021-05-18T13:46:57.217Z] start_error_when_help_is_set  Time elapsed: 0.001 s
09:46:57 [2021-05-18T13:46:57.217Z] start_error_when_script_location_is_invalid  Time elapsed: 0.001 s
09:46:57 [2021-05-18T13:46:57.217Z] start_script  Time elapsed: 0.001 s
09:46:57 [2021-05-18T13:46:57.217Z] start_executes_script_with_return_value  Time elapsed: 0.122 s
09:46:57 [2021-05-18T13:46:57.217Z] start_executes_hello_world  Time elapsed: 0.092 s
09:46:57 [2021-05-18T13:46:57.217Z] start_error_when_workspace_location_is_missing  Time elapsed: 0.002 s
09:46:57 [2021-05-18T13:46:57.217Z] start_executes_script_arguments  Time elapsed: 0.083 s
09:46:57 [2021-05-18T13:46:57.217Z] start_error_when_engine_ID_is_missing  Time elapsed: 0.002 s
09:46:57 [2021-05-18T13:46:57.217Z] Running org.eclipse.ease.tools.RunnableWithResultTest
09:46:57 [2021-05-18T13:46:57.217Z] Tests run: 2, Failures: 0, Errors: 0, Skipped: 0, Time elapsed: 0.003 s - in org.eclipse.ease.tools.RunnableWithResultTest
09:46:57 [2021-05-18T13:46:57.217Z] testException  Time elapsed: 0.001 s
09:46:57 [2021-05-18T13:46:57.217Z] testResult  Time elapsed: 0.001 s
09:46:57 [2021-05-18T13:46:57.217Z] Running org.eclipse.ease.tools.StringToolsTest
09:46:57 [2021-05-18T13:46:57.217Z] Tests run: 8, Failures: 0, Errors: 0, Skipped: 0, Time elapsed: 0.008 s - in org.eclipse.ease.tools.StringToolsTest
09:46:57 [2021-05-18T13:46:57.217Z] parseArgumentsNull  Time elapsed: 0 s
09:46:57 [2021-05-18T13:46:57.217Z] parseArgumentsQuotedSingle  Time elapsed: 0.001 s
09:46:57 [2021-05-18T13:46:57.217Z] parseArgumentsEmpty  Time elapsed: 0 s
09:46:57 [2021-05-18T13:46:57.217Z] parseArgumentsMixedMultiple  Time elapsed: 0 s
09:46:57 [2021-05-18T13:46:57.217Z] parseArgumentsMixedMultipleLines  Time elapsed: 0.001 s
09:46:57 [2021-05-18T13:46:57.217Z] parseArgumentsNonQuotedMultiple  Time elapsed: 0.001 s
09:46:57 [2021-05-18T13:46:57.217Z] parseArgumentsNonQuotedSingle  Time elapsed: 0.001 s
09:46:57 [2021-05-18T13:46:57.217Z] parseArgumentsQuotedMultiple  Time elapsed: 0 s
09:46:57 [2021-05-18T13:46:57.217Z] Running org.eclipse.ease.tools.ResourceToolsTest
09:46:57 [2021-05-18T13:46:57.475Z] Tests run: 47, Failures: 0, Errors: 0, Skipped: 0, Time elapsed: 0.291 s - in org.eclipse.ease.tools.ResourceToolsTest
09:46:57 [2021-05-18T13:46:57.475Z] resolveScriptLocation  Time elapsed: 0.183 s
09:46:57 [2021-05-18T13:46:57.475Z] getWorkspaceInputStream  Time elapsed: 0.001 s
09:46:57 [2021-05-18T13:46:57.475Z] resolvePlatformURI  Time elapsed: 0.001 s
09:46:57 [2021-05-18T13:46:57.475Z] resolveScriptLocationWithSpacesInPath  Time elapsed: 0.004 s
09:46:57 [2021-05-18T13:46:57.475Z] resolveURL  Time elapsed: 0.002 s
09:46:57 [2021-05-18T13:46:57.475Z] invalidIsAbsolute  Time elapsed: 0.001 s
09:46:57 [2021-05-18T13:46:57.475Z] getFilesystemInputStream  Time elapsed: 0.002 s
09:46:57 [2021-05-18T13:46:57.475Z] toRelativeLocationInWorkspace  Time elapsed: 0.001 s
09:46:57 [2021-05-18T13:46:57.476Z] checkOperatingSystem  Time elapsed: 0 s
09:46:57 [2021-05-18T13:46:57.476Z] inputStreamToString  Time elapsed: 0.001 s
09:46:57 [2021-05-18T13:46:57.476Z] fileSystemToAbsoluteLocationOnLinux  Time elapsed: 0.001 s
09:46:57 [2021-05-18T13:46:57.476Z] exists  Time elapsed: 0 s
09:46:57 [2021-05-18T13:46:57.476Z] resolveRelativeInWorkspace  Time elapsed: 0.002 s
09:46:57 [2021-05-18T13:46:57.476Z] isFile  Time elapsed: 0.001 s
09:46:57 [2021-05-18T13:46:57.476Z] invalidToFile  Time elapsed: 0.001 s
09:46:57 [2021-05-18T13:46:57.476Z] resolveAbsoluteInFileSystem  Time elapsed: 0.001 s
09:46:57 [2021-05-18T13:46:57.476Z] resolveWindowsRoot  Time elapsed: 0 s
09:46:57 [2021-05-18T13:46:57.476Z] resolveRelativeInFileSystemOnWindows  Time elapsed: 0 s
09:46:57 [2021-05-18T13:46:57.476Z] isAbsoluteFileSystemPathOnWindows  Time elapsed: 0.001 s
09:46:57 [2021-05-18T13:46:57.476Z] readerToString  Time elapsed: 0 s
09:46:57 [2021-05-18T13:46:57.476Z] workspaceFileToString  Time elapsed: 0.001 s
09:46:57 [2021-05-18T13:46:57.476Z] toFile  Time elapsed: 0 s
09:46:57 [2021-05-18T13:46:57.476Z] toProjectRelativeLocation  Time elapsed: 0 s
09:46:57 [2021-05-18T13:46:57.476Z] getInvalidInputStream  Time elapsed: 0.004 s
09:46:57 [2021-05-18T13:46:57.476Z] resolveRelativeInFileSystemOnLinux  Time elapsed: 0.001 s
09:46:57 [2021-05-18T13:46:57.476Z] isFolder  Time elapsed: 0.001 s
09:46:57 [2021-05-18T13:46:57.476Z] fileSystemToAbsoluteLocationOnWindows  Time elapsed: 0 s
09:46:57 [2021-05-18T13:46:57.476Z] isAbsoluteWorkspacePath  Time elapsed: 0 s
09:46:57 [2021-05-18T13:46:57.476Z] isAbsoluteFileSystemPathOnLinux  Time elapsed: 0.001 s
09:46:57 [2021-05-18T13:46:57.476Z] resolveInvalid  Time elapsed: 0 s
09:46:57 [2021-05-18T13:46:57.476Z] resolveAbsoluteInFileSystemOnWindows  Time elapsed: 0.001 s
09:46:57 [2021-05-18T13:46:57.476Z] resolveScriptLocationWithSpacesInDomain  Time elapsed: 0.001 s
09:46:57 [2021-05-18T13:46:57.476Z] resolveRelativefromWorkspaceToFilesystem  Time elapsed: 0.001 s
09:46:57 [2021-05-18T13:46:57.476Z] resolveRelativeWithoutBaseFile  Time elapsed: 0 s
09:46:57 [2021-05-18T13:46:57.476Z] resolveInWorkspace  Time elapsed: 0 s
09:46:57 [2021-05-18T13:46:57.476Z] resolveScriptLocationWithSpecialCharactersInPath  Time elapsed: 0.001 s
09:46:57 [2021-05-18T13:46:57.476Z] filesystemFileToString  Time elapsed: 0 s
09:46:57 [2021-05-18T13:46:57.476Z] createURI  Time elapsed: 0 s
09:46:57 [2021-05-18T13:46:57.476Z] uriToAbsoluteLocation  Time elapsed: 0.001 s
09:46:57 [2021-05-18T13:46:57.476Z] createFolder  Time elapsed: 0.005 s
09:46:57 [2021-05-18T13:46:57.476Z] workspaceToAbsoluteLocation  Time elapsed: 0 s
09:46:57 [2021-05-18T13:46:57.476Z] resolveAbsoluteInFileSystemOnLinux  Time elapsed: 0.001 s
09:46:57 [2021-05-18T13:46:57.476Z] invalidToString  Time elapsed: 0 s
09:46:57 [2021-05-18T13:46:57.476Z] resolveRelativeURIs  Time elapsed: 0.001 s
09:46:57 [2021-05-18T13:46:57.476Z] resolveRelativeInFileSystem  Time elapsed: 0.001 s
09:46:57 [2021-05-18T13:46:57.476Z] resolveScriptLocationWithSpecialCharactersInDomain  Time elapsed: 0.005 s
09:46:57 [2021-05-18T13:46:57.476Z] isAbsoluteURL  Time elapsed: 0 s
09:46:57 [2021-05-18T13:46:57.476Z] Running org.eclipse.ease.AbstractCodeParserTest
09:46:57 [2021-05-18T13:46:57.476Z] Tests run: 5, Failures: 0, Errors: 0, Skipped: 0, Time elapsed: 0.005 s - in org.eclipse.ease.AbstractCodeParserTest
09:46:57 [2021-05-18T13:46:57.476Z] parseCode  Time elapsed: 0.002 s
09:46:57 [2021-05-18T13:46:57.476Z] parseLineHeader  Time elapsed: 0.001 s
09:46:57 [2021-05-18T13:46:57.476Z] parseBlockAfterWhitespace  Time elapsed: 0.001 s
09:46:57 [2021-05-18T13:46:57.476Z] parseEmpty  Time elapsed: 0 s
09:46:57 [2021-05-18T13:46:57.476Z] parseBlockHeader  Time elapsed: 0.001 s
09:46:57 [2021-05-18T13:46:57.476Z] Running org.eclipse.ease.AbstractCodeFactoryTest
09:46:58 [2021-05-18T13:46:58.043Z] Tests run: 1, Failures: 0, Errors: 0, Skipped: 0, Time elapsed: 0.306 s - in org.eclipse.ease.AbstractCodeFactoryTest
09:46:58 [2021-05-18T13:46:58.043Z] createNewKeywordHeader  Time elapsed: 0.305 s
09:46:58 [2021-05-18T13:46:58.043Z] Running org.eclipse.ease.ScriptResultTest
09:47:02 [2021-05-18T13:47:02.229Z] Tests run: 17, Failures: 0, Errors: 0, Skipped: 0, Time elapsed: 3.772 s - in org.eclipse.ease.ScriptResultTest
09:47:02 [2021-05-18T13:47:02.229Z] setResult_after_setException_throws  Time elapsed: 0.001 s
09:47:02 [2021-05-18T13:47:02.229Z] setResult_after_setResult_throws  Time elapsed: 0.001 s
09:47:02 [2021-05-18T13:47:02.229Z] isDone_true_when_exception_was_thrown  Time elapsed: 0 s
09:47:02 [2021-05-18T13:47:02.229Z] get_returns_ready_execution_result  Time elapsed: 0.001 s
09:47:02 [2021-05-18T13:47:02.229Z] get_waits_for_execution_result  Time elapsed: 0.552 s
09:47:02 [2021-05-18T13:47:02.229Z] get_with_timeout_waits_for_execution_result  Time elapsed: 0.551 s
09:47:02 [2021-05-18T13:47:02.229Z] get_throws_execution_exception  Time elapsed: 0.001 s
09:47:02 [2021-05-18T13:47:02.229Z] get_with_milliseconds_timeout_waits_for_execution_result  Time elapsed: 0.552 s
09:47:02 [2021-05-18T13:47:02.229Z] setException_after_setException_throws  Time elapsed: 0 s
09:47:02 [2021-05-18T13:47:02.229Z] isDone_false_on_new_ScriptResult  Time elapsed: 0 s
09:47:02 [2021-05-18T13:47:02.229Z] get_milliseconds_times_out  Time elapsed: 0.501 s
09:47:02 [2021-05-18T13:47:02.229Z] get_times_out  Time elapsed: 0.501 s
09:47:02 [2021-05-18T13:47:02.229Z] get_waits_for_execution_exception  Time elapsed: 0.552 s
09:47:02 [2021-05-18T13:47:02.229Z] setException_after_setResult_throws  Time elapsed: 0.001 s
09:47:02 [2021-05-18T13:47:02.229Z] isDone_true_when_result_is_null  Time elapsed: 0.001 s
09:47:02 [2021-05-18T13:47:02.229Z] isDone_true_when_result_is_ready  Time elapsed: 0 s
09:47:02 [2021-05-18T13:47:02.230Z] get_with_timeout_waits_for_execution_exception  Time elapsed: 0.55 s
09:47:02 [2021-05-18T13:47:02.230Z] Running org.eclipse.ease.ScriptTest
09:47:02 [2021-05-18T13:47:02.230Z] Tests run: 13, Failures: 0, Errors: 0, Skipped: 0, Time elapsed: 0.016 s - in org.eclipse.ease.ScriptTest
09:47:02 [2021-05-18T13:47:02.230Z] codeFromScriptable  Time elapsed: 0.009 s
09:47:02 [2021-05-18T13:47:02.230Z] codeFromFilesystemFile  Time elapsed: 0 s
09:47:02 [2021-05-18T13:47:02.230Z] getCodeStream  Time elapsed: 0 s
09:47:02 [2021-05-18T13:47:02.230Z] getFile  Time elapsed: 0.001 s
09:47:02 [2021-05-18T13:47:02.230Z] codeFromStringBuilder  Time elapsed: 0 s
09:47:02 [2021-05-18T13:47:02.230Z] getResult  Time elapsed: 0 s
09:47:02 [2021-05-18T13:47:02.230Z] getException  Time elapsed: 0 s
09:47:02 [2021-05-18T13:47:02.230Z] codeFromWorkspaceFile  Time elapsed: 0.001 s
09:47:02 [2021-05-18T13:47:02.230Z] codeFromInputStream  Time elapsed: 0 s
09:47:02 [2021-05-18T13:47:02.230Z] getTitle  Time elapsed: 0 s
09:47:02 [2021-05-18T13:47:02.230Z] getCommand  Time elapsed: 0 s
09:47:02 [2021-05-18T13:47:02.230Z] codeFromReader  Time elapsed: 0.001 s
09:47:02 [2021-05-18T13:47:02.230Z] codeFromString  Time elapsed: 0 s
09:47:02 [2021-05-18T13:47:02.230Z] Running org.eclipse.ease.modules.EnvironmentModuleTest
09:47:02 [2021-05-18T13:47:02.230Z] Tests run: 1, Failures: 0, Errors: 0, Skipped: 0, Time elapsed: 0.003 s - in org.eclipse.ease.modules.EnvironmentModuleTest
09:47:02 [2021-05-18T13:47:02.230Z] getModuleDefinition_returns_environment_definition  Time elapsed: 0.002 s
09:47:02 [2021-05-18T13:47:02.230Z] Running org.eclipse.ease.modules.ModuleDocumentationTest
09:47:02 [2021-05-18T13:47:02.230Z] Tests run: 1, Failures: 0, Errors: 0, Skipped: 0, Time elapsed: 0.001 s - in org.eclipse.ease.modules.ModuleDocumentationTest
09:47:02 [2021-05-18T13:47:02.230Z] module_documentation_exists  Time elapsed: 0 s
09:47:02 [2021-05-18T13:47:02.230Z] Running org.eclipse.ease.modules.ScriptParameterTest
09:47:02 [2021-05-18T13:47:02.230Z] Tests run: 6, Failures: 0, Errors: 0, Skipped: 0, Time elapsed: 0.004 s - in org.eclipse.ease.modules.ScriptParameterTest
09:47:02 [2021-05-18T13:47:02.230Z] getDefaultValue_null_when_annotation_has_no_default_value  Time elapsed: 0.001 s
09:47:02 [2021-05-18T13:47:02.230Z] isOptional_false_when_annotation_is_missing  Time elapsed: 0 s
09:47:02 [2021-05-18T13:47:02.230Z] isOptional_false_when_annotation_has_no_default_value  Time elapsed: 0.001 s
09:47:02 [2021-05-18T13:47:02.230Z] getDefaultValue_has_value_when_annotation_with_default_value_exists  Time elapsed: 0.001 s
09:47:02 [2021-05-18T13:47:02.230Z] getDefaultValue_null_when_annotation_is_missing  Time elapsed: 0 s
09:47:02 [2021-05-18T13:47:02.230Z] isOptional_true_when_annotation_with_default_value_exists  Time elapsed: 0 s
09:47:02 [2021-05-18T13:47:02.230Z] Running org.eclipse.ease.modules.ModuleDefinitionTest
09:47:02 [2021-05-18T13:47:02.230Z] Tests run: 2, Failures: 0, Errors: 0, Skipped: 0, Time elapsed: 0.002 s - in org.eclipse.ease.modules.ModuleDefinitionTest
09:47:02 [2021-05-18T13:47:02.230Z] forInstance_returns_definition  Time elapsed: 0.001 s
09:47:02 [2021-05-18T13:47:02.230Z] forInstance_returns_null  Time elapsed: 0 s
09:47:02 [2021-05-18T13:47:02.230Z] Running org.eclipse.ease.adapters.ScriptableAdapterTest
09:47:02 [2021-05-18T13:47:02.230Z] Tests run: 5, Failures: 0, Errors: 0, Skipped: 0, Time elapsed: 0.012 s - in org.eclipse.ease.adapters.ScriptableAdapterTest
09:47:02 [2021-05-18T13:47:02.230Z] adaptURI  Time elapsed: 0.01 s
09:47:02 [2021-05-18T13:47:02.230Z] adaptURL  Time elapsed: 0.001 s
09:47:02 [2021-05-18T13:47:02.230Z] adaptWorkspaceFile  Time elapsed: 0 s
09:47:02 [2021-05-18T13:47:02.230Z] getAdapterList  Time elapsed: 0.001 s
09:47:02 [2021-05-18T13:47:02.230Z] adaptFilesystemFile  Time elapsed: 0 s
09:47:02 [2021-05-18T13:47:02.230Z] Running org.eclipse.ease.sign.SignatureHelperTest
09:47:02 [2021-05-18T13:47:02.230Z] Tests run: 1, Failures: 0, Errors: 0, Skipped: 0, Time elapsed: 0.019 s - in org.eclipse.ease.sign.SignatureHelperTest
09:47:02 [2021-05-18T13:47:02.230Z] certificateTest  Time elapsed: 0.018 s
09:47:02 [2021-05-18T13:47:02.230Z] Running org.eclipse.ease.sign.VerifySignatureTest
09:47:02 [2021-05-18T13:47:02.230Z] Tests run: 1, Failures: 0, Errors: 0, Skipped: 0, Time elapsed: 0.089 s - in org.eclipse.ease.sign.VerifySignatureTest
09:47:02 [2021-05-18T13:47:02.230Z] testWithNonCodeParserScriptType  Time elapsed: 0.089 s
09:47:02 [2021-05-18T13:47:02.230Z] Running org.eclipse.ease.AbstractScriptEngineTest
09:47:06 [2021-05-18T13:47:06.415Z] testorg.eclipse.ease.ScriptEngineCancellationException: Terminated on user request
09:47:06 [2021-05-18T13:47:06.415Z] 	at org.eclipse.ease.AbstractScriptEngine.checkForCancellation(AbstractScriptEngine.java:391)
09:47:06 [2021-05-18T13:47:06.415Z] 	at org.eclipse.ease.AbstractScriptEngineTest$3.execute(AbstractScriptEngineTest.java:294)
09:47:06 [2021-05-18T13:47:06.415Z] 	at org.eclipse.ease.AbstractScriptEngine.inject(AbstractScriptEngine.java:189)
09:47:06 [2021-05-18T13:47:06.415Z] 	at org.eclipse.ease.AbstractScriptEngine.run(AbstractScriptEngine.java:242)
09:47:06 [2021-05-18T13:47:06.415Z] 	at org.eclipse.core.internal.jobs.Worker.run(Worker.java:63)
09:47:06 [2021-05-18T13:47:06.672Z] java.lang.RuntimeException: ERROR
09:47:06 [2021-05-18T13:47:06.672Z] 	at org.eclipse.ease.AbstractScriptEngineTest$MockedScriptEngine.execute(AbstractScriptEngineTest.java:76)
09:47:06 [2021-05-18T13:47:06.672Z] 	at org.eclipse.ease.AbstractScriptEngine.inject(AbstractScriptEngine.java:189)
09:47:06 [2021-05-18T13:47:06.672Z] 	at org.eclipse.ease.AbstractScriptEngine.run(AbstractScriptEngine.java:242)
09:47:06 [2021-05-18T13:47:06.672Z] 	at org.eclipse.core.internal.jobs.Worker.run(Worker.java:63)
09:47:07 [2021-05-18T13:47:07.606Z] 1Tests run: 17, Failures: 0, Errors: 0, Skipped: 0, Time elapsed: 5.726 s - in org.eclipse.ease.AbstractScriptEngineTest
09:47:07 [2021-05-18T13:47:07.606Z] extractEmptyArguments  Time elapsed: 0 s
09:47:07 [2021-05-18T13:47:07.606Z] setNotNullOutputStream  Time elapsed: 0 s
09:47:07 [2021-05-18T13:47:07.606Z] terminateViaMonitorCancellation  Time elapsed: 1.202 s
09:47:07 [2021-05-18T13:47:07.606Z] inject  Time elapsed: 0.001 s
09:47:07 [2021-05-18T13:47:07.606Z] extractArguments  Time elapsed: 0 s
09:47:07 [2021-05-18T13:47:07.606Z] executeSync  Time elapsed: 1.001 s
09:47:07 [2021-05-18T13:47:07.606Z] setNotNullErrorStream  Time elapsed: 0.001 s
09:47:07 [2021-05-18T13:47:07.606Z] setNullErrorStream  Time elapsed: 0 s
09:47:07 [2021-05-18T13:47:07.606Z] isJob  Time elapsed: 0.001 s
09:47:07 [2021-05-18T13:47:07.607Z] streamsAvailable  Time elapsed: 0 s
09:47:07 [2021-05-18T13:47:07.607Z] executeValidCodeAndTerminate  Time elapsed: 1.001 s
09:47:07 [2021-05-18T13:47:07.607Z] setNullOutputStream  Time elapsed: 0 s
09:47:07 [2021-05-18T13:47:07.607Z] terminateMultipleTimes  Time elapsed: 0.303 s
09:47:07 [2021-05-18T13:47:07.607Z] engineTerminatesWhenIdle  Time elapsed: 0.001 s
09:47:07 [2021-05-18T13:47:07.607Z] terminateViaTerminateMethod  Time elapsed: 0.202 s
09:47:07 [2021-05-18T13:47:07.607Z] terminateViaMethodCallback  Time elapsed: 1.003 s
09:47:07 [2021-05-18T13:47:07.607Z] executeErrorCodeAndTerminate  Time elapsed: 1.002 s
09:47:07 [2021-05-18T13:47:07.607Z] 
09:47:07 [2021-05-18T13:47:07.607Z] Results:
09:47:07 [2021-05-18T13:47:07.607Z] 
09:47:07 [2021-05-18T13:47:07.607Z] Tests run: 159, Failures: 0, Errors: 0, Skipped: 0
09:47:07 [2021-05-18T13:47:07.607Z] 
09:47:08 [2021-05-18T13:47:08.541Z] [INFO] All tests passed!
09:47:08 [2021-05-18T13:47:08.541Z] [INFO] 
09:47:08 [2021-05-18T13:47:08.541Z] [INFO] ----< org.eclipse.ease:org.eclipse.ease.lang.javascript.rhino.test >----
09:47:08 [2021-05-18T13:47:08.541Z] [INFO] Building org.eclipse.ease.lang.javascript.rhino.test 0.8.0-SNAPSHOT [4/9]
09:47:08 [2021-05-18T13:47:08.541Z] [INFO] ------------------------[ eclipse-test-plugin ]-------------------------
09:47:08 [2021-05-18T13:47:08.541Z] [INFO] 
09:47:08 [2021-05-18T13:47:08.541Z] [INFO] --- tycho-packaging-plugin:2.2.0:build-qualifier (default-build-qualifier) @ org.eclipse.ease.lang.javascript.rhino.test ---
09:47:08 [2021-05-18T13:47:08.541Z] [INFO] The project's OSGi version is 0.8.0.I202104091518
09:47:08 [2021-05-18T13:47:08.541Z] [INFO] 
09:47:08 [2021-05-18T13:47:08.541Z] [INFO] --- tycho-packaging-plugin:2.2.0:validate-id (default-validate-id) @ org.eclipse.ease.lang.javascript.rhino.test ---
09:47:08 [2021-05-18T13:47:08.541Z] [INFO] 
09:47:08 [2021-05-18T13:47:08.541Z] [INFO] --- tycho-packaging-plugin:2.2.0:validate-version (default-validate-version) @ org.eclipse.ease.lang.javascript.rhino.test ---
09:47:08 [2021-05-18T13:47:08.541Z] [INFO] 
09:47:08 [2021-05-18T13:47:08.541Z] [INFO] --- maven-resources-plugin:2.4.3:resources (default-resources) @ org.eclipse.ease.lang.javascript.rhino.test ---
09:47:08 [2021-05-18T13:47:08.541Z] [INFO] Using 'UTF-8' encoding to copy filtered resources.
09:47:08 [2021-05-18T13:47:08.541Z] [INFO] skip non existing resourceDirectory /home/jenkins/agent/workspace/ease.verify.core.target.2019-06/tests/org.eclipse.ease.lang.javascript.rhino.test/src/main/resources
09:47:08 [2021-05-18T13:47:08.541Z] [INFO] 
09:47:08 [2021-05-18T13:47:08.541Z] [INFO] --- tycho-compiler-plugin:2.2.0:compile (default-compile) @ org.eclipse.ease.lang.javascript.rhino.test ---
09:47:08 [2021-05-18T13:47:08.541Z] [INFO] Nothing to compile - all classes are up to date
09:47:08 [2021-05-18T13:47:08.541Z] [INFO] 
09:47:08 [2021-05-18T13:47:08.541Z] [INFO] --- maven-resources-plugin:2.4.3:testResources (default-testResources) @ org.eclipse.ease.lang.javascript.rhino.test ---
09:47:08 [2021-05-18T13:47:08.541Z] [INFO] Using 'UTF-8' encoding to copy filtered resources.
09:47:08 [2021-05-18T13:47:08.541Z] [INFO] skip non existing resourceDirectory /home/jenkins/agent/workspace/ease.verify.core.target.2019-06/tests/org.eclipse.ease.lang.javascript.rhino.test/src/test/resources
09:47:08 [2021-05-18T13:47:08.541Z] [INFO] 
09:47:08 [2021-05-18T13:47:08.541Z] [INFO] --- target-platform-configuration:2.2.0:target-platform (default-target-platform) @ org.eclipse.ease.lang.javascript.rhino.test ---
09:47:08 [2021-05-18T13:47:08.541Z] [INFO] 
09:47:08 [2021-05-18T13:47:08.541Z] [INFO] --- tycho-packaging-plugin:2.2.0:package-plugin (default-package-plugin) @ org.eclipse.ease.lang.javascript.rhino.test ---
09:47:08 [2021-05-18T13:47:08.542Z] [INFO] Building jar: /home/jenkins/agent/workspace/ease.verify.core.target.2019-06/tests/org.eclipse.ease.lang.javascript.rhino.test/target/org.eclipse.ease.lang.javascript.rhino.test-0.8.0-SNAPSHOT.jar
09:47:08 [2021-05-18T13:47:08.542Z] [INFO] 
09:47:08 [2021-05-18T13:47:08.542Z] [INFO] --- tycho-p2-plugin:2.2.0:p2-metadata-default (default-p2-metadata-default) @ org.eclipse.ease.lang.javascript.rhino.test ---
09:47:08 [2021-05-18T13:47:08.818Z] [INFO] 
09:47:08 [2021-05-18T13:47:08.818Z] [INFO] --- jacoco-maven-plugin:0.8.6:prepare-agent (jacoco-initialize) @ org.eclipse.ease.lang.javascript.rhino.test ---
09:47:08 [2021-05-18T13:47:08.818Z] [INFO] tycho.testArgLine set to -javaagent:/home/jenkins/.m2/repository/org/jacoco/org.jacoco.agent/0.8.6/org.jacoco.agent-0.8.6-runtime.jar=destfile=/home/jenkins/agent/workspace/ease.verify.core.target.2019-06/tests/org.eclipse.ease.lang.javascript.rhino.test/target/jacoco.exec,output=file
09:47:08 [2021-05-18T13:47:08.818Z] [INFO] 
09:47:08 [2021-05-18T13:47:08.818Z] [INFO] --- tycho-surefire-plugin:2.2.0:test (default-test) @ org.eclipse.ease.lang.javascript.rhino.test ---
09:47:08 [2021-05-18T13:47:08.818Z] [INFO] Executing Test Runtime with timeout 0, logs (if any) will be placed at: /home/jenkins/agent/workspace/ease.verify.core.target.2019-06/tests/org.eclipse.ease.lang.javascript.rhino.test/target/work/data/.metadata/.log
09:47:08 [2021-05-18T13:47:08.818Z] [INFO] Command line:
09:47:08 [2021-05-18T13:47:08.819Z] 	[/opt/tools/java/openjdk/jdk-15/15.0.2+7/bin/java, -Dosgi.noShutdown=false, -Dosgi.os=linux, -Dosgi.ws=gtk, -Dosgi.arch=x86_64, -javaagent:/home/jenkins/.m2/repository/org/jacoco/org.jacoco.agent/0.8.6/org.jacoco.agent-0.8.6-runtime.jar=destfile=/home/jenkins/agent/workspace/ease.verify.core.target.2019-06/tests/org.eclipse.ease.lang.javascript.rhino.test/target/jacoco.exec,output=file, -Dosgi.clean=true, -jar, /home/jenkins/.m2/repository/p2/osgi/bundle/org.eclipse.equinox.launcher/1.5.400.v20190515-0925/org.eclipse.equinox.launcher-1.5.400.v20190515-0925.jar, -data, /home/jenkins/agent/workspace/ease.verify.core.target.2019-06/tests/org.eclipse.ease.lang.javascript.rhino.test/target/work/data, -install, /home/jenkins/agent/workspace/ease.verify.core.target.2019-06/tests/org.eclipse.ease.lang.javascript.rhino.test/target/work, -configuration, /home/jenkins/agent/workspace/ease.verify.core.target.2019-06/tests/org.eclipse.ease.lang.javascript.rhino.test/target/work/configuration, -application, org.eclipse.tycho.surefire.osgibooter.headlesstest, -testproperties, /home/jenkins/agent/workspace/ease.verify.core.target.2019-06/tests/org.eclipse.ease.lang.javascript.rhino.test/target/surefire.properties]
09:47:08 [2021-05-18T13:47:08.819Z] Picked up JAVA_TOOL_OPTIONS: -Dmaven.ext.class.path="/home/jenkins/agent/workspace/ease.verify.core.target.2019-06@tmp/withMaven448c5e6d/pipeline-maven-spy.jar" -Dorg.jenkinsci.plugins.pipeline.maven.reportsFolder="/home/jenkins/agent/workspace/ease.verify.core.target.2019-06@tmp/withMaven448c5e6d" 
09:47:14 [2021-05-18T13:47:14.154Z] May 18, 2021 1:47:14 PM org.junit.platform.launcher.core.DefaultLauncher handleThrowable
09:47:14 [2021-05-18T13:47:14.154Z] WARNING: TestEngine with ID 'junit-vintage' failed to discover tests
09:47:14 [2021-05-18T13:47:14.154Z] java.lang.NoClassDefFoundError: org/junit/runners/model/RunnerBuilder
09:47:14 [2021-05-18T13:47:14.154Z] 	at org.junit.vintage.engine.discovery.VintageDiscoverer.<init>(VintageDiscoverer.java:48)
09:47:14 [2021-05-18T13:47:14.154Z] 	at org.junit.vintage.engine.VintageTestEngine.discover(VintageTestEngine.java:65)
09:47:14 [2021-05-18T13:47:14.154Z] 	at org.junit.platform.launcher.core.DefaultLauncher.discoverEngineRoot(DefaultLauncher.java:130)
09:47:14 [2021-05-18T13:47:14.154Z] 	at org.junit.platform.launcher.core.DefaultLauncher.discoverRoot(DefaultLauncher.java:117)
09:47:14 [2021-05-18T13:47:14.154Z] 	at org.junit.platform.launcher.core.DefaultLauncher.discover(DefaultLauncher.java:82)
09:47:14 [2021-05-18T13:47:14.154Z] 	at org.apache.maven.surefire.junitplatform.TestPlanScannerFilter.accept(TestPlanScannerFilter.java:56)
09:47:14 [2021-05-18T13:47:14.154Z] 	at org.apache.maven.surefire.util.DefaultScanResult.applyFilter(DefaultScanResult.java:102)
09:47:14 [2021-05-18T13:47:14.154Z] 	at org.apache.maven.surefire.junitplatform.JUnitPlatformProvider.scanClasspath(JUnitPlatformProvider.java:143)
09:47:14 [2021-05-18T13:47:14.154Z] 	at org.apache.maven.surefire.junitplatform.JUnitPlatformProvider.invoke(JUnitPlatformProvider.java:124)
09:47:14 [2021-05-18T13:47:14.154Z] 	at java.base/jdk.internal.reflect.NativeMethodAccessorImpl.invoke0(Native Method)
09:47:14 [2021-05-18T13:47:14.154Z] 	at java.base/jdk.internal.reflect.NativeMethodAccessorImpl.invoke(NativeMethodAccessorImpl.java:64)
09:47:14 [2021-05-18T13:47:14.154Z] 	at java.base/jdk.internal.reflect.DelegatingMethodAccessorImpl.invoke(DelegatingMethodAccessorImpl.java:43)
09:47:14 [2021-05-18T13:47:14.154Z] 	at java.base/java.lang.reflect.Method.invoke(Method.java:564)
09:47:14 [2021-05-18T13:47:14.154Z] 	at org.apache.maven.surefire.util.ReflectionUtils.invokeMethodWithArray2(ReflectionUtils.java:206)
09:47:14 [2021-05-18T13:47:14.154Z] 	at org.apache.maven.surefire.booter.ProviderFactory$ProviderProxy.invoke(ProviderFactory.java:161)
09:47:14 [2021-05-18T13:47:14.154Z] 	at org.apache.maven.surefire.booter.ProviderFactory.invokeProvider(ProviderFactory.java:84)
09:47:14 [2021-05-18T13:47:14.154Z] 	at org.eclipse.tycho.surefire.osgibooter.OsgiSurefireBooter.run(OsgiSurefireBooter.java:116)
09:47:14 [2021-05-18T13:47:14.154Z] 	at org.eclipse.tycho.surefire.osgibooter.HeadlessTestApplication.start(HeadlessTestApplication.java:23)
09:47:14 [2021-05-18T13:47:14.154Z] 	at org.eclipse.equinox.internal.app.EclipseAppHandle.run(EclipseAppHandle.java:203)
09:47:14 [2021-05-18T13:47:14.154Z] 	at org.eclipse.core.runtime.internal.adaptor.EclipseAppLauncher.runApplication(EclipseAppLauncher.java:137)
09:47:14 [2021-05-18T13:47:14.155Z] 	at org.eclipse.core.runtime.internal.adaptor.EclipseAppLauncher.start(EclipseAppLauncher.java:107)
09:47:14 [2021-05-18T13:47:14.155Z] 	at org.eclipse.core.runtime.adaptor.EclipseStarter.run(EclipseStarter.java:400)
09:47:14 [2021-05-18T13:47:14.155Z] 	at org.eclipse.core.runtime.adaptor.EclipseStarter.run(EclipseStarter.java:255)
09:47:14 [2021-05-18T13:47:14.155Z] 	at java.base/jdk.internal.reflect.NativeMethodAccessorImpl.invoke0(Native Method)
09:47:14 [2021-05-18T13:47:14.155Z] 	at java.base/jdk.internal.reflect.NativeMethodAccessorImpl.invoke(NativeMethodAccessorImpl.java:64)
09:47:14 [2021-05-18T13:47:14.155Z] 	at java.base/jdk.internal.reflect.DelegatingMethodAccessorImpl.invoke(DelegatingMethodAccessorImpl.java:43)
09:47:14 [2021-05-18T13:47:14.155Z] 	at java.base/java.lang.reflect.Method.invoke(Method.java:564)
09:47:14 [2021-05-18T13:47:14.155Z] 	at org.eclipse.equinox.launcher.Main.invokeFramework(Main.java:660)
09:47:14 [2021-05-18T13:47:14.155Z] 	at org.eclipse.equinox.launcher.Main.basicRun(Main.java:597)
09:47:14 [2021-05-18T13:47:14.155Z] 	at org.eclipse.equinox.launcher.Main.run(Main.java:1468)
09:47:14 [2021-05-18T13:47:14.155Z] 	at org.eclipse.equinox.launcher.Main.main(Main.java:1441)
09:47:14 [2021-05-18T13:47:14.155Z] Caused by: java.lang.ClassNotFoundException: org.junit.runners.model.RunnerBuilder cannot be found by org.eclipse.tycho.surefire.osgibooter_2.2.0
09:47:14 [2021-05-18T13:47:14.155Z] 	at org.eclipse.osgi.internal.loader.BundleLoader.findClassInternal(BundleLoader.java:512)
09:47:14 [2021-05-18T13:47:14.155Z] 	at org.eclipse.osgi.internal.loader.BundleLoader.findClass(BundleLoader.java:423)
09:47:14 [2021-05-18T13:47:14.155Z] 	at org.eclipse.osgi.internal.loader.BundleLoader.findClass(BundleLoader.java:415)
09:47:14 [2021-05-18T13:47:14.155Z] 	at org.eclipse.osgi.internal.loader.ModuleClassLoader.loadClass(ModuleClassLoader.java:155)
09:47:14 [2021-05-18T13:47:14.155Z] 	at java.base/java.lang.ClassLoader.loadClass(ClassLoader.java:522)
09:47:14 [2021-05-18T13:47:14.155Z] 	... 31 more
09:47:14 [2021-05-18T13:47:14.155Z] 
09:47:14 [2021-05-18T13:47:14.155Z] May 18, 2021 1:47:14 PM org.junit.platform.launcher.core.DefaultLauncher handleThrowable
09:47:14 [2021-05-18T13:47:14.155Z] WARNING: TestEngine with ID 'junit-vintage' failed to discover tests
09:47:14 [2021-05-18T13:47:14.155Z] java.lang.NoClassDefFoundError: org/junit/runners/model/RunnerBuilder
09:47:14 [2021-05-18T13:47:14.155Z] 	at org.junit.vintage.engine.discovery.VintageDiscoverer.<init>(VintageDiscoverer.java:48)
09:47:14 [2021-05-18T13:47:14.155Z] 	at org.junit.vintage.engine.VintageTestEngine.discover(VintageTestEngine.java:65)
09:47:14 [2021-05-18T13:47:14.155Z] 	at org.junit.platform.launcher.core.DefaultLauncher.discoverEngineRoot(DefaultLauncher.java:130)
09:47:14 [2021-05-18T13:47:14.155Z] 	at org.junit.platform.launcher.core.DefaultLauncher.discoverRoot(DefaultLauncher.java:117)
09:47:14 [2021-05-18T13:47:14.155Z] 	at org.junit.platform.launcher.core.DefaultLauncher.discover(DefaultLauncher.java:82)
09:47:14 [2021-05-18T13:47:14.155Z] 	at org.apache.maven.surefire.junitplatform.TestPlanScannerFilter.accept(TestPlanScannerFilter.java:56)
09:47:14 [2021-05-18T13:47:14.155Z] 	at org.apache.maven.surefire.util.DefaultScanResult.applyFilter(DefaultScanResult.java:102)
09:47:14 [2021-05-18T13:47:14.155Z] 	at org.apache.maven.surefire.junitplatform.JUnitPlatformProvider.scanClasspath(JUnitPlatformProvider.java:143)
09:47:14 [2021-05-18T13:47:14.155Z] 	at org.apache.maven.surefire.junitplatform.JUnitPlatformProvider.invoke(JUnitPlatformProvider.java:124)
09:47:14 [2021-05-18T13:47:14.155Z] 	at java.base/jdk.internal.reflect.NativeMethodAccessorImpl.invoke0(Native Method)
09:47:14 [2021-05-18T13:47:14.155Z] 	at java.base/jdk.internal.reflect.NativeMethodAccessorImpl.invoke(NativeMethodAccessorImpl.java:64)
09:47:14 [2021-05-18T13:47:14.155Z] 	at java.base/jdk.internal.reflect.DelegatingMethodAccessorImpl.invoke(DelegatingMethodAccessorImpl.java:43)
09:47:14 [2021-05-18T13:47:14.155Z] 	at java.base/java.lang.reflect.Method.invoke(Method.java:564)
09:47:14 [2021-05-18T13:47:14.155Z] 	at org.apache.maven.surefire.util.ReflectionUtils.invokeMethodWithArray2(ReflectionUtils.java:206)
09:47:14 [2021-05-18T13:47:14.155Z] 	at org.apache.maven.surefire.booter.ProviderFactory$ProviderProxy.invoke(ProviderFactory.java:161)
09:47:14 [2021-05-18T13:47:14.155Z] 	at org.apache.maven.surefire.booter.ProviderFactory.invokeProvider(ProviderFactory.java:84)
09:47:14 [2021-05-18T13:47:14.155Z] 	at org.eclipse.tycho.surefire.osgibooter.OsgiSurefireBooter.run(OsgiSurefireBooter.java:116)
09:47:14 [2021-05-18T13:47:14.155Z] 	at org.eclipse.tycho.surefire.osgibooter.HeadlessTestApplication.start(HeadlessTestApplication.java:23)
09:47:14 [2021-05-18T13:47:14.155Z] 	at org.eclipse.equinox.internal.app.EclipseAppHandle.run(EclipseAppHandle.java:203)
09:47:14 [2021-05-18T13:47:14.155Z] 	at org.eclipse.core.runtime.internal.adaptor.EclipseAppLauncher.runApplication(EclipseAppLauncher.java:137)
09:47:14 [2021-05-18T13:47:14.155Z] 	at org.eclipse.core.runtime.internal.adaptor.EclipseAppLauncher.start(EclipseAppLauncher.java:107)
09:47:14 [2021-05-18T13:47:14.155Z] 	at org.eclipse.core.runtime.adaptor.EclipseStarter.run(EclipseStarter.java:400)
09:47:14 [2021-05-18T13:47:14.155Z] 	at org.eclipse.core.runtime.adaptor.EclipseStarter.run(EclipseStarter.java:255)
09:47:14 [2021-05-18T13:47:14.155Z] 	at java.base/jdk.internal.reflect.NativeMethodAccessorImpl.invoke0(Native Method)
09:47:14 [2021-05-18T13:47:14.155Z] 	at java.base/jdk.internal.reflect.NativeMethodAccessorImpl.invoke(NativeMethodAccessorImpl.java:64)
09:47:14 [2021-05-18T13:47:14.155Z] 	at java.base/jdk.internal.reflect.DelegatingMethodAccessorImpl.invoke(DelegatingMethodAccessorImpl.java:43)
09:47:14 [2021-05-18T13:47:14.155Z] 	at java.base/java.lang.reflect.Method.invoke(Method.java:564)
09:47:14 [2021-05-18T13:47:14.155Z] 	at org.eclipse.equinox.launcher.Main.invokeFramework(Main.java:660)
09:47:14 [2021-05-18T13:47:14.155Z] 	at org.eclipse.equinox.launcher.Main.basicRun(Main.java:597)
09:47:14 [2021-05-18T13:47:14.155Z] 	at org.eclipse.equinox.launcher.Main.run(Main.java:1468)
09:47:14 [2021-05-18T13:47:14.155Z] 	at org.eclipse.equinox.launcher.Main.main(Main.java:1441)
09:47:14 [2021-05-18T13:47:14.155Z] Caused by: java.lang.ClassNotFoundException: org.junit.runners.model.RunnerBuilder cannot be found by org.eclipse.tycho.surefire.osgibooter_2.2.0
09:47:14 [2021-05-18T13:47:14.155Z] 	at org.eclipse.osgi.internal.loader.BundleLoader.findClassInternal(BundleLoader.java:512)
09:47:14 [2021-05-18T13:47:14.155Z] 	at org.eclipse.osgi.internal.loader.BundleLoader.findClass(BundleLoader.java:423)
09:47:14 [2021-05-18T13:47:14.155Z] 	at org.eclipse.osgi.internal.loader.BundleLoader.findClass(BundleLoader.java:415)
09:47:14 [2021-05-18T13:47:14.155Z] 	at org.eclipse.osgi.internal.loader.ModuleClassLoader.loadClass(ModuleClassLoader.java:155)
09:47:14 [2021-05-18T13:47:14.156Z] 	at java.base/java.lang.ClassLoader.loadClass(ClassLoader.java:522)
09:47:14 [2021-05-18T13:47:14.156Z] 	... 31 more
09:47:14 [2021-05-18T13:47:14.156Z] 
09:47:14 [2021-05-18T13:47:14.417Z] May 18, 2021 1:47:14 PM org.junit.platform.launcher.core.DefaultLauncher handleThrowable
09:47:14 [2021-05-18T13:47:14.417Z] WARNING: TestEngine with ID 'junit-vintage' failed to discover tests
09:47:14 [2021-05-18T13:47:14.417Z] java.lang.NoClassDefFoundError: org/junit/runners/model/RunnerBuilder
09:47:14 [2021-05-18T13:47:14.417Z] 	at org.junit.vintage.engine.discovery.VintageDiscoverer.<init>(VintageDiscoverer.java:48)
09:47:14 [2021-05-18T13:47:14.417Z] 	at org.junit.vintage.engine.VintageTestEngine.discover(VintageTestEngine.java:65)
09:47:14 [2021-05-18T13:47:14.417Z] 	at org.junit.platform.launcher.core.DefaultLauncher.discoverEngineRoot(DefaultLauncher.java:130)
09:47:14 [2021-05-18T13:47:14.417Z] 	at org.junit.platform.launcher.core.DefaultLauncher.discoverRoot(DefaultLauncher.java:117)
09:47:14 [2021-05-18T13:47:14.417Z] 	at org.junit.platform.launcher.core.DefaultLauncher.discover(DefaultLauncher.java:82)
09:47:14 [2021-05-18T13:47:14.417Z] 	at org.apache.maven.surefire.junitplatform.TestPlanScannerFilter.accept(TestPlanScannerFilter.java:56)
09:47:14 [2021-05-18T13:47:14.417Z] 	at org.apache.maven.surefire.util.DefaultScanResult.applyFilter(DefaultScanResult.java:102)
09:47:14 [2021-05-18T13:47:14.417Z] 	at org.apache.maven.surefire.junitplatform.JUnitPlatformProvider.scanClasspath(JUnitPlatformProvider.java:143)
09:47:14 [2021-05-18T13:47:14.417Z] 	at org.apache.maven.surefire.junitplatform.JUnitPlatformProvider.invoke(JUnitPlatformProvider.java:124)
09:47:14 [2021-05-18T13:47:14.417Z] 	at java.base/jdk.internal.reflect.NativeMethodAccessorImpl.invoke0(Native Method)
09:47:14 [2021-05-18T13:47:14.417Z] 	at java.base/jdk.internal.reflect.NativeMethodAccessorImpl.invoke(NativeMethodAccessorImpl.java:64)
09:47:14 [2021-05-18T13:47:14.417Z] 	at java.base/jdk.internal.reflect.DelegatingMethodAccessorImpl.invoke(DelegatingMethodAccessorImpl.java:43)
09:47:14 [2021-05-18T13:47:14.417Z] 	at java.base/java.lang.reflect.Method.invoke(Method.java:564)
09:47:14 [2021-05-18T13:47:14.417Z] 	at org.apache.maven.surefire.util.ReflectionUtils.invokeMethodWithArray2(ReflectionUtils.java:206)
09:47:14 [2021-05-18T13:47:14.417Z] 	at org.apache.maven.surefire.booter.ProviderFactory$ProviderProxy.invoke(ProviderFactory.java:161)
09:47:14 [2021-05-18T13:47:14.417Z] 	at org.apache.maven.surefire.booter.ProviderFactory.invokeProvider(ProviderFactory.java:84)
09:47:14 [2021-05-18T13:47:14.417Z] 	at org.eclipse.tycho.surefire.osgibooter.OsgiSurefireBooter.run(OsgiSurefireBooter.java:116)
09:47:14 [2021-05-18T13:47:14.417Z] 	at org.eclipse.tycho.surefire.osgibooter.HeadlessTestApplication.start(HeadlessTestApplication.java:23)
09:47:14 [2021-05-18T13:47:14.417Z] 	at org.eclipse.equinox.internal.app.EclipseAppHandle.run(EclipseAppHandle.java:203)
09:47:14 [2021-05-18T13:47:14.417Z] 	at org.eclipse.core.runtime.internal.adaptor.EclipseAppLauncher.runApplication(EclipseAppLauncher.java:137)
09:47:14 [2021-05-18T13:47:14.417Z] 	at org.eclipse.core.runtime.internal.adaptor.EclipseAppLauncher.start(EclipseAppLauncher.java:107)
09:47:14 [2021-05-18T13:47:14.417Z] 	at org.eclipse.core.runtime.adaptor.EclipseStarter.run(EclipseStarter.java:400)
09:47:14 [2021-05-18T13:47:14.417Z] 	at org.eclipse.core.runtime.adaptor.EclipseStarter.run(EclipseStarter.java:255)
09:47:14 [2021-05-18T13:47:14.417Z] 	at java.base/jdk.internal.reflect.NativeMethodAccessorImpl.invoke0(Native Method)
09:47:14 [2021-05-18T13:47:14.417Z] 	at java.base/jdk.internal.reflect.NativeMethodAccessorImpl.invoke(NativeMethodAccessorImpl.java:64)
09:47:14 [2021-05-18T13:47:14.417Z] 	at java.base/jdk.internal.reflect.DelegatingMethodAccessorImpl.invoke(DelegatingMethodAccessorImpl.java:43)
09:47:14 [2021-05-18T13:47:14.417Z] 	at java.base/java.lang.reflect.Method.invoke(Method.java:564)
09:47:14 [2021-05-18T13:47:14.417Z] 	at org.eclipse.equinox.launcher.Main.invokeFramework(Main.java:660)
09:47:14 [2021-05-18T13:47:14.417Z] 	at org.eclipse.equinox.launcher.Main.basicRun(Main.java:597)
09:47:14 [2021-05-18T13:47:14.417Z] 	at org.eclipse.equinox.launcher.Main.run(Main.java:1468)
09:47:14 [2021-05-18T13:47:14.417Z] 	at org.eclipse.equinox.launcher.Main.main(Main.java:1441)
09:47:14 [2021-05-18T13:47:14.417Z] Caused by: java.lang.ClassNotFoundException: org.junit.runners.model.RunnerBuilder cannot be found by org.eclipse.tycho.surefire.osgibooter_2.2.0
09:47:14 [2021-05-18T13:47:14.417Z] 	at org.eclipse.osgi.internal.loader.BundleLoader.findClassInternal(BundleLoader.java:512)
09:47:14 [2021-05-18T13:47:14.418Z] 	at org.eclipse.osgi.internal.loader.BundleLoader.findClass(BundleLoader.java:423)
09:47:14 [2021-05-18T13:47:14.418Z] 	at org.eclipse.osgi.internal.loader.BundleLoader.findClass(BundleLoader.java:415)
09:47:14 [2021-05-18T13:47:14.418Z] 	at org.eclipse.osgi.internal.loader.ModuleClassLoader.loadClass(ModuleClassLoader.java:155)
09:47:14 [2021-05-18T13:47:14.418Z] 	at java.base/java.lang.ClassLoader.loadClass(ClassLoader.java:522)
09:47:14 [2021-05-18T13:47:14.418Z] 	... 31 more
09:47:14 [2021-05-18T13:47:14.418Z] 
09:47:14 [2021-05-18T13:47:14.418Z] May 18, 2021 1:47:14 PM org.junit.platform.launcher.core.DefaultLauncher handleThrowable
09:47:14 [2021-05-18T13:47:14.418Z] WARNING: TestEngine with ID 'junit-vintage' failed to discover tests
09:47:14 [2021-05-18T13:47:14.418Z] java.lang.NoClassDefFoundError: org/junit/runners/model/RunnerBuilder
09:47:14 [2021-05-18T13:47:14.418Z] 	at org.junit.vintage.engine.discovery.VintageDiscoverer.<init>(VintageDiscoverer.java:48)
09:47:14 [2021-05-18T13:47:14.418Z] 	at org.junit.vintage.engine.VintageTestEngine.discover(VintageTestEngine.java:65)
09:47:14 [2021-05-18T13:47:14.418Z] 	at org.junit.platform.launcher.core.DefaultLauncher.discoverEngineRoot(DefaultLauncher.java:130)
09:47:14 [2021-05-18T13:47:14.418Z] 	at org.junit.platform.launcher.core.DefaultLauncher.discoverRoot(DefaultLauncher.java:117)
09:47:14 [2021-05-18T13:47:14.418Z] 	at org.junit.platform.launcher.core.DefaultLauncher.discover(DefaultLauncher.java:82)
09:47:14 [2021-05-18T13:47:14.418Z] 	at org.apache.maven.surefire.junitplatform.TestPlanScannerFilter.accept(TestPlanScannerFilter.java:56)
09:47:14 [2021-05-18T13:47:14.418Z] 	at org.apache.maven.surefire.util.DefaultScanResult.applyFilter(DefaultScanResult.java:102)
09:47:14 [2021-05-18T13:47:14.418Z] 	at org.apache.maven.surefire.junitplatform.JUnitPlatformProvider.scanClasspath(JUnitPlatformProvider.java:143)
09:47:14 [2021-05-18T13:47:14.418Z] 	at org.apache.maven.surefire.junitplatform.JUnitPlatformProvider.invoke(JUnitPlatformProvider.java:124)
09:47:14 [2021-05-18T13:47:14.418Z] 	at java.base/jdk.internal.reflect.NativeMethodAccessorImpl.invoke0(Native Method)
09:47:14 [2021-05-18T13:47:14.418Z] 	at java.base/jdk.internal.reflect.NativeMethodAccessorImpl.invoke(NativeMethodAccessorImpl.java:64)
09:47:14 [2021-05-18T13:47:14.418Z] 	at java.base/jdk.internal.reflect.DelegatingMethodAccessorImpl.invoke(DelegatingMethodAccessorImpl.java:43)
09:47:14 [2021-05-18T13:47:14.418Z] 	at java.base/java.lang.reflect.Method.invoke(Method.java:564)
09:47:14 [2021-05-18T13:47:14.418Z] 	at org.apache.maven.surefire.util.ReflectionUtils.invokeMethodWithArray2(ReflectionUtils.java:206)
09:47:14 [2021-05-18T13:47:14.418Z] 	at org.apache.maven.surefire.booter.ProviderFactory$ProviderProxy.invoke(ProviderFactory.java:161)
09:47:14 [2021-05-18T13:47:14.418Z] 	at org.apache.maven.surefire.booter.ProviderFactory.invokeProvider(ProviderFactory.java:84)
09:47:14 [2021-05-18T13:47:14.418Z] 	at org.eclipse.tycho.surefire.osgibooter.OsgiSurefireBooter.run(OsgiSurefireBooter.java:116)
09:47:14 [2021-05-18T13:47:14.418Z] 	at org.eclipse.tycho.surefire.osgibooter.HeadlessTestApplication.start(HeadlessTestApplication.java:23)
09:47:14 [2021-05-18T13:47:14.418Z] 	at org.eclipse.equinox.internal.app.EclipseAppHandle.run(EclipseAppHandle.java:203)
09:47:14 [2021-05-18T13:47:14.418Z] 	at org.eclipse.core.runtime.internal.adaptor.EclipseAppLauncher.runApplication(EclipseAppLauncher.java:137)
09:47:14 [2021-05-18T13:47:14.418Z] 	at org.eclipse.core.runtime.internal.adaptor.EclipseAppLauncher.start(EclipseAppLauncher.java:107)
09:47:14 [2021-05-18T13:47:14.418Z] 	at org.eclipse.core.runtime.adaptor.EclipseStarter.run(EclipseStarter.java:400)
09:47:14 [2021-05-18T13:47:14.418Z] 	at org.eclipse.core.runtime.adaptor.EclipseStarter.run(EclipseStarter.java:255)
09:47:14 [2021-05-18T13:47:14.418Z] 	at java.base/jdk.internal.reflect.NativeMethodAccessorImpl.invoke0(Native Method)
09:47:14 [2021-05-18T13:47:14.418Z] 	at java.base/jdk.internal.reflect.NativeMethodAccessorImpl.invoke(NativeMethodAccessorImpl.java:64)
09:47:14 [2021-05-18T13:47:14.418Z] 	at java.base/jdk.internal.reflect.DelegatingMethodAccessorImpl.invoke(DelegatingMethodAccessorImpl.java:43)
09:47:14 [2021-05-18T13:47:14.418Z] 	at java.base/java.lang.reflect.Method.invoke(Method.java:564)
09:47:14 [2021-05-18T13:47:14.418Z] 	at org.eclipse.equinox.launcher.Main.invokeFramework(Main.java:660)
09:47:14 [2021-05-18T13:47:14.418Z] 	at org.eclipse.equinox.launcher.Main.basicRun(Main.java:597)
09:47:14 [2021-05-18T13:47:14.418Z] 	at org.eclipse.equinox.launcher.Main.run(Main.java:1468)
09:47:14 [2021-05-18T13:47:14.419Z] 	at org.eclipse.equinox.launcher.Main.main(Main.java:1441)
09:47:14 [2021-05-18T13:47:14.419Z] Caused by: java.lang.ClassNotFoundException: org.junit.runners.model.RunnerBuilder cannot be found by org.eclipse.tycho.surefire.osgibooter_2.2.0
09:47:14 [2021-05-18T13:47:14.419Z] 	at org.eclipse.osgi.internal.loader.BundleLoader.findClassInternal(BundleLoader.java:512)
09:47:14 [2021-05-18T13:47:14.419Z] 	at org.eclipse.osgi.internal.loader.BundleLoader.findClass(BundleLoader.java:423)
09:47:14 [2021-05-18T13:47:14.419Z] 	at org.eclipse.osgi.internal.loader.BundleLoader.findClass(BundleLoader.java:415)
09:47:14 [2021-05-18T13:47:14.419Z] 	at org.eclipse.osgi.internal.loader.ModuleClassLoader.loadClass(ModuleClassLoader.java:155)
09:47:14 [2021-05-18T13:47:14.419Z] 	at java.base/java.lang.ClassLoader.loadClass(ClassLoader.java:522)
09:47:14 [2021-05-18T13:47:14.419Z] 	... 31 more
09:47:14 [2021-05-18T13:47:14.419Z] 
09:47:14 [2021-05-18T13:47:14.985Z] May 18, 2021 1:47:14 PM org.junit.platform.launcher.core.DefaultLauncher handleThrowable
09:47:14 [2021-05-18T13:47:14.985Z] WARNING: TestEngine with ID 'junit-vintage' failed to discover tests
09:47:14 [2021-05-18T13:47:14.985Z] java.lang.NoClassDefFoundError: org/junit/runners/model/RunnerBuilder
09:47:14 [2021-05-18T13:47:14.986Z] 	at org.junit.vintage.engine.discovery.VintageDiscoverer.<init>(VintageDiscoverer.java:48)
09:47:14 [2021-05-18T13:47:14.986Z] 	at org.junit.vintage.engine.VintageTestEngine.discover(VintageTestEngine.java:65)
09:47:14 [2021-05-18T13:47:14.986Z] 	at org.junit.platform.launcher.core.DefaultLauncher.discoverEngineRoot(DefaultLauncher.java:130)
09:47:14 [2021-05-18T13:47:14.986Z] 	at org.junit.platform.launcher.core.DefaultLauncher.discoverRoot(DefaultLauncher.java:117)
09:47:14 [2021-05-18T13:47:14.986Z] 	at org.junit.platform.launcher.core.DefaultLauncher.discover(DefaultLauncher.java:82)
09:47:14 [2021-05-18T13:47:14.986Z] 	at org.apache.maven.surefire.junitplatform.TestPlanScannerFilter.accept(TestPlanScannerFilter.java:56)
09:47:14 [2021-05-18T13:47:14.986Z] 	at org.apache.maven.surefire.util.DefaultScanResult.applyFilter(DefaultScanResult.java:102)
09:47:14 [2021-05-18T13:47:14.986Z] 	at org.apache.maven.surefire.junitplatform.JUnitPlatformProvider.scanClasspath(JUnitPlatformProvider.java:143)
09:47:14 [2021-05-18T13:47:14.986Z] 	at org.apache.maven.surefire.junitplatform.JUnitPlatformProvider.invoke(JUnitPlatformProvider.java:124)
09:47:14 [2021-05-18T13:47:14.986Z] 	at java.base/jdk.internal.reflect.NativeMethodAccessorImpl.invoke0(Native Method)
09:47:14 [2021-05-18T13:47:14.986Z] 	at java.base/jdk.internal.reflect.NativeMethodAccessorImpl.invoke(NativeMethodAccessorImpl.java:64)
09:47:14 [2021-05-18T13:47:14.986Z] 	at java.base/jdk.internal.reflect.DelegatingMethodAccessorImpl.invoke(DelegatingMethodAccessorImpl.java:43)
09:47:14 [2021-05-18T13:47:14.986Z] 	at java.base/java.lang.reflect.Method.invoke(Method.java:564)
09:47:14 [2021-05-18T13:47:14.986Z] 	at org.apache.maven.surefire.util.ReflectionUtils.invokeMethodWithArray2(ReflectionUtils.java:206)
09:47:14 [2021-05-18T13:47:14.986Z] 	at org.apache.maven.surefire.booter.ProviderFactory$ProviderProxy.invoke(ProviderFactory.java:161)
09:47:14 [2021-05-18T13:47:14.986Z] 	at org.apache.maven.surefire.booter.ProviderFactory.invokeProvider(ProviderFactory.java:84)
09:47:14 [2021-05-18T13:47:14.986Z] 	at org.eclipse.tycho.surefire.osgibooter.OsgiSurefireBooter.run(OsgiSurefireBooter.java:116)
09:47:14 [2021-05-18T13:47:14.986Z] 	at org.eclipse.tycho.surefire.osgibooter.HeadlessTestApplication.start(HeadlessTestApplication.java:23)
09:47:14 [2021-05-18T13:47:14.986Z] 	at org.eclipse.equinox.internal.app.EclipseAppHandle.run(EclipseAppHandle.java:203)
09:47:14 [2021-05-18T13:47:14.986Z] 	at org.eclipse.core.runtime.internal.adaptor.EclipseAppLauncher.runApplication(EclipseAppLauncher.java:137)
09:47:14 [2021-05-18T13:47:14.986Z] 	at org.eclipse.core.runtime.internal.adaptor.EclipseAppLauncher.start(EclipseAppLauncher.java:107)
09:47:14 [2021-05-18T13:47:14.986Z] 	at org.eclipse.core.runtime.adaptor.EclipseStarter.run(EclipseStarter.java:400)
09:47:14 [2021-05-18T13:47:14.986Z] 	at org.eclipse.core.runtime.adaptor.EclipseStarter.run(EclipseStarter.java:255)
09:47:14 [2021-05-18T13:47:14.986Z] 	at java.base/jdk.internal.reflect.NativeMethodAccessorImpl.invoke0(Native Method)
09:47:14 [2021-05-18T13:47:14.986Z] 	at java.base/jdk.internal.reflect.NativeMethodAccessorImpl.invoke(NativeMethodAccessorImpl.java:64)
09:47:14 [2021-05-18T13:47:14.986Z] 	at java.base/jdk.internal.reflect.DelegatingMethodAccessorImpl.invoke(DelegatingMethodAccessorImpl.java:43)
09:47:14 [2021-05-18T13:47:14.986Z] 	at java.base/java.lang.reflect.Method.invoke(Method.java:564)
09:47:14 [2021-05-18T13:47:14.986Z] 	at org.eclipse.equinox.launcher.Main.invokeFramework(Main.java:660)
09:47:14 [2021-05-18T13:47:14.986Z] 	at org.eclipse.equinox.launcher.Main.basicRun(Main.java:597)
09:47:14 [2021-05-18T13:47:14.986Z] 	at org.eclipse.equinox.launcher.Main.run(Main.java:1468)
09:47:14 [2021-05-18T13:47:14.986Z] 	at org.eclipse.equinox.launcher.Main.main(Main.java:1441)
09:47:14 [2021-05-18T13:47:14.986Z] Caused by: java.lang.ClassNotFoundException: org.junit.runners.model.RunnerBuilder cannot be found by org.eclipse.tycho.surefire.osgibooter_2.2.0
09:47:14 [2021-05-18T13:47:14.986Z] 	at org.eclipse.osgi.internal.loader.BundleLoader.findClassInternal(BundleLoader.java:512)
09:47:14 [2021-05-18T13:47:14.986Z] 	at org.eclipse.osgi.internal.loader.BundleLoader.findClass(BundleLoader.java:423)
09:47:14 [2021-05-18T13:47:14.986Z] 	at org.eclipse.osgi.internal.loader.BundleLoader.findClass(BundleLoader.java:415)
09:47:14 [2021-05-18T13:47:14.986Z] 	at org.eclipse.osgi.internal.loader.ModuleClassLoader.loadClass(ModuleClassLoader.java:155)
09:47:14 [2021-05-18T13:47:14.986Z] 	at java.base/java.lang.ClassLoader.loadClass(ClassLoader.java:522)
09:47:14 [2021-05-18T13:47:14.986Z] 	... 31 more
09:47:14 [2021-05-18T13:47:14.986Z] 
09:47:14 [2021-05-18T13:47:14.986Z] May 18, 2021 1:47:14 PM org.junit.platform.launcher.core.DefaultLauncher handleThrowable
09:47:14 [2021-05-18T13:47:14.986Z] WARNING: TestEngine with ID 'junit-vintage' failed to discover tests
09:47:14 [2021-05-18T13:47:14.986Z] java.lang.NoClassDefFoundError: org/junit/runners/model/RunnerBuilder
09:47:14 [2021-05-18T13:47:14.986Z] 	at org.junit.vintage.engine.discovery.VintageDiscoverer.<init>(VintageDiscoverer.java:48)
09:47:14 [2021-05-18T13:47:14.986Z] 	at org.junit.vintage.engine.VintageTestEngine.discover(VintageTestEngine.java:65)
09:47:14 [2021-05-18T13:47:14.986Z] 	at org.junit.platform.launcher.core.DefaultLauncher.discoverEngineRoot(DefaultLauncher.java:130)
09:47:14 [2021-05-18T13:47:14.986Z] 	at org.junit.platform.launcher.core.DefaultLauncher.discoverRoot(DefaultLauncher.java:117)
09:47:14 [2021-05-18T13:47:14.986Z] 	at org.junit.platform.launcher.core.DefaultLauncher.execute(DefaultLauncher.java:90)
09:47:14 [2021-05-18T13:47:14.986Z] 	at org.apache.maven.surefire.junitplatform.JUnitPlatformProvider.invokeAllTests(JUnitPlatformProvider.java:150)
09:47:14 [2021-05-18T13:47:14.986Z] 	at org.apache.maven.surefire.junitplatform.JUnitPlatformProvider.invoke(JUnitPlatformProvider.java:124)
09:47:14 [2021-05-18T13:47:14.986Z] 	at java.base/jdk.internal.reflect.NativeMethodAccessorImpl.invoke0(Native Method)
09:47:14 [2021-05-18T13:47:14.986Z] 	at java.base/jdk.internal.reflect.NativeMethodAccessorImpl.invoke(NativeMethodAccessorImpl.java:64)
09:47:14 [2021-05-18T13:47:14.986Z] 	at java.base/jdk.internal.reflect.DelegatingMethodAccessorImpl.invoke(DelegatingMethodAccessorImpl.java:43)
09:47:14 [2021-05-18T13:47:14.986Z] 	at java.base/java.lang.reflect.Method.invoke(Method.java:564)
09:47:14 [2021-05-18T13:47:14.986Z] 	at org.apache.maven.surefire.util.ReflectionUtils.invokeMethodWithArray2(ReflectionUtils.java:206)
09:47:14 [2021-05-18T13:47:14.986Z] 	at org.apache.maven.surefire.booter.ProviderFactory$ProviderProxy.invoke(ProviderFactory.java:161)
09:47:14 [2021-05-18T13:47:14.987Z] 	at org.apache.maven.surefire.booter.ProviderFactory.invokeProvider(ProviderFactory.java:84)
09:47:14 [2021-05-18T13:47:14.987Z] 	at org.eclipse.tycho.surefire.osgibooter.OsgiSurefireBooter.run(OsgiSurefireBooter.java:116)
09:47:14 [2021-05-18T13:47:14.987Z] 	at org.eclipse.tycho.surefire.osgibooter.HeadlessTestApplication.start(HeadlessTestApplication.java:23)
09:47:14 [2021-05-18T13:47:14.987Z] 	at org.eclipse.equinox.internal.app.EclipseAppHandle.run(EclipseAppHandle.java:203)
09:47:14 [2021-05-18T13:47:14.987Z] 	at org.eclipse.core.runtime.internal.adaptor.EclipseAppLauncher.runApplication(EclipseAppLauncher.java:137)
09:47:14 [2021-05-18T13:47:14.987Z] 	at org.eclipse.core.runtime.internal.adaptor.EclipseAppLauncher.start(EclipseAppLauncher.java:107)
09:47:14 [2021-05-18T13:47:14.987Z] 	at org.eclipse.core.runtime.adaptor.EclipseStarter.run(EclipseStarter.java:400)
09:47:14 [2021-05-18T13:47:14.987Z] 	at org.eclipse.core.runtime.adaptor.EclipseStarter.run(EclipseStarter.java:255)
09:47:14 [2021-05-18T13:47:14.987Z] 	at java.base/jdk.internal.reflect.NativeMethodAccessorImpl.invoke0(Native Method)
09:47:14 [2021-05-18T13:47:14.987Z] 	at java.base/jdk.internal.reflect.NativeMethodAccessorImpl.invoke(NativeMethodAccessorImpl.java:64)
09:47:14 [2021-05-18T13:47:14.987Z] 	at java.base/jdk.internal.reflect.DelegatingMethodAccessorImpl.invoke(DelegatingMethodAccessorImpl.java:43)
09:47:14 [2021-05-18T13:47:14.987Z] 	at java.base/java.lang.reflect.Method.invoke(Method.java:564)
09:47:14 [2021-05-18T13:47:14.987Z] 	at org.eclipse.equinox.launcher.Main.invokeFramework(Main.java:660)
09:47:14 [2021-05-18T13:47:14.987Z] 	at org.eclipse.equinox.launcher.Main.basicRun(Main.java:597)
09:47:14 [2021-05-18T13:47:14.987Z] 	at org.eclipse.equinox.launcher.Main.run(Main.java:1468)
09:47:14 [2021-05-18T13:47:14.987Z] 	at org.eclipse.equinox.launcher.Main.main(Main.java:1441)
09:47:14 [2021-05-18T13:47:14.987Z] Caused by: java.lang.ClassNotFoundException: org.junit.runners.model.RunnerBuilder cannot be found by org.eclipse.tycho.surefire.osgibooter_2.2.0
09:47:14 [2021-05-18T13:47:14.987Z] 	at org.eclipse.osgi.internal.loader.BundleLoader.findClassInternal(BundleLoader.java:512)
09:47:14 [2021-05-18T13:47:14.987Z] 	at org.eclipse.osgi.internal.loader.BundleLoader.findClass(BundleLoader.java:423)
09:47:14 [2021-05-18T13:47:14.987Z] 	at org.eclipse.osgi.internal.loader.BundleLoader.findClass(BundleLoader.java:415)
09:47:14 [2021-05-18T13:47:14.987Z] 	at org.eclipse.osgi.internal.loader.ModuleClassLoader.loadClass(ModuleClassLoader.java:155)
09:47:14 [2021-05-18T13:47:14.987Z] 	at java.base/java.lang.ClassLoader.loadClass(ClassLoader.java:522)
09:47:14 [2021-05-18T13:47:14.987Z] 	... 29 more
09:47:14 [2021-05-18T13:47:14.987Z] 
09:47:14 [2021-05-18T13:47:14.987Z] Running org.eclipse.ease.lang.javascript.rhino.RhinoScriptEngineTest
09:47:15 [2021-05-18T13:47:15.923Z] org.eclipse.ease.ScriptExecutionException: JavaError: java.lang.Exception
09:47:15 [2021-05-18T13:47:15.923Z] 	at <unknown source>
09:47:15 [2021-05-18T13:47:15.923Z] 
09:47:15 [2021-05-18T13:47:15.923Z] Java Stacktrace:
09:47:15 [2021-05-18T13:47:15.923Z] java.lang.Exception
09:47:15 [2021-05-18T13:47:15.923Z] 	at java.base/jdk.internal.reflect.NativeConstructorAccessorImpl.newInstance0(Native Method)
09:47:15 [2021-05-18T13:47:15.923Z] 	at java.base/jdk.internal.reflect.NativeConstructorAccessorImpl.newInstance(NativeConstructorAccessorImpl.java:64)
09:47:15 [2021-05-18T13:47:15.923Z] 	at java.base/jdk.internal.reflect.DelegatingConstructorAccessorImpl.newInstance(DelegatingConstructorAccessorImpl.java:45)
09:47:15 [2021-05-18T13:47:15.923Z] 	at java.base/java.lang.reflect.Constructor.newInstanceWithCaller(Constructor.java:500)
09:47:15 [2021-05-18T13:47:15.923Z] 	at java.base/java.lang.reflect.Constructor.newInstance(Constructor.java:481)
09:47:15 [2021-05-18T13:47:15.923Z] 	at org.mozilla.javascript.MemberBox.newInstance(MemberBox.java:159)
09:47:15 [2021-05-18T13:47:15.923Z] 	at org.mozilla.javascript.NativeJavaClass.constructInternal(NativeJavaClass.java:266)
09:47:15 [2021-05-18T13:47:15.923Z] 	at org.mozilla.javascript.NativeJavaClass.constructSpecific(NativeJavaClass.java:205)
09:47:15 [2021-05-18T13:47:15.923Z] 	at org.mozilla.javascript.NativeJavaClass.construct(NativeJavaClass.java:166)
09:47:15 [2021-05-18T13:47:15.923Z] 	at org.mozilla.javascript.ScriptRuntime.newObject(ScriptRuntime.java:2655)
09:47:15 [2021-05-18T13:47:15.923Z] 	at org.mozilla.javascript.gen.c_9._c_script_0(Unknown Source)
09:47:15 [2021-05-18T13:47:15.923Z] 	at org.mozilla.javascript.gen.c_9.call(Unknown Source)
09:47:15 [2021-05-18T13:47:15.923Z] 	at org.mozilla.javascript.ContextFactory.doTopCall(ContextFactory.java:405)
09:47:15 [2021-05-18T13:47:15.923Z] 	at org.mozilla.javascript.ScriptRuntime.doTopCall(ScriptRuntime.java:3508)
09:47:15 [2021-05-18T13:47:15.923Z] 	at org.mozilla.javascript.gen.c_9.call(Unknown Source)
09:47:15 [2021-05-18T13:47:15.923Z] 	at org.mozilla.javascript.gen.c_9.exec(Unknown Source)
09:47:15 [2021-05-18T13:47:15.923Z] 	at org.mozilla.javascript.Context.evaluateReader(Context.java:1293)
09:47:15 [2021-05-18T13:47:15.923Z] 	at org.eclipse.ease.lang.javascript.rhino.RhinoScriptEngine.internalExecute(RhinoScriptEngine.java:224)
09:47:15 [2021-05-18T13:47:15.923Z] 	at org.eclipse.ease.lang.javascript.rhino.RhinoScriptEngine.execute(RhinoScriptEngine.java:203)
09:47:15 [2021-05-18T13:47:15.923Z] 	at org.eclipse.ease.AbstractScriptEngine.inject(AbstractScriptEngine.java:189)
09:47:15 [2021-05-18T13:47:15.923Z] 	at org.eclipse.ease.AbstractScriptEngine.run(AbstractScriptEngine.java:242)
09:47:15 [2021-05-18T13:47:15.923Z] 	at org.eclipse.core.internal.jobs.Worker.run(Worker.java:63)
09:47:16 [2021-05-18T13:47:16.181Z] org.eclipse.ease.ScriptExecutionException: ScriptException: test
09:47:16 [2021-05-18T13:47:16.181Z] 	at <unknown source>
09:47:16 [2021-05-18T13:47:16.181Z] org.eclipse.ease.ScriptExecutionException: ScriptException: JavaScript
09:47:16 [2021-05-18T13:47:16.181Z] 	at <unknown source>
09:47:16 [2021-05-18T13:47:16.181Z] org.eclipse.ease.ScriptExecutionException: SyntaxError: unterminated string literal (#1)
09:47:16 [2021-05-18T13:47:16.181Z] 'asdf
09:47:16 [2021-05-18T13:47:16.181Z]     ^
09:47:16 [2021-05-18T13:47:16.181Z] 	at <unknown source>
09:47:16 [2021-05-18T13:47:16.441Z] org.eclipse.ease.ScriptExecutionException: TypeError: Cannot call method "foobar" of undefined
09:47:16 [2021-05-18T13:47:16.441Z] 	at <unknown source>
09:47:16 [2021-05-18T13:47:16.441Z] org.eclipse.ease.ScriptExecutionException: JavaError: NotThere cannot be found by org.mozilla.javascript_1.7.10.v20190430-1943
09:47:16 [2021-05-18T13:47:16.441Z] 	at <unknown source>
09:47:16 [2021-05-18T13:47:16.441Z] 
09:47:16 [2021-05-18T13:47:16.441Z] Java Stacktrace:
09:47:16 [2021-05-18T13:47:16.441Z] java.lang.ClassNotFoundException: NotThere cannot be found by org.mozilla.javascript_1.7.10.v20190430-1943
09:47:16 [2021-05-18T13:47:16.441Z] 	at org.eclipse.osgi.internal.loader.BundleLoader.findClassInternal(BundleLoader.java:512)
09:47:16 [2021-05-18T13:47:16.441Z] 	at org.eclipse.osgi.internal.loader.BundleLoader.findClass(BundleLoader.java:423)
09:47:16 [2021-05-18T13:47:16.441Z] 	at org.eclipse.osgi.internal.loader.BundleLoader.findClass(BundleLoader.java:415)
09:47:16 [2021-05-18T13:47:16.441Z] 	at org.eclipse.osgi.internal.loader.ModuleClassLoader.loadClass(ModuleClassLoader.java:155)
09:47:16 [2021-05-18T13:47:16.441Z] 	at java.base/java.lang.ClassLoader.loadClass(ClassLoader.java:522)
09:47:16 [2021-05-18T13:47:16.441Z] 	at java.base/java.lang.Class.forName0(Native Method)
09:47:16 [2021-05-18T13:47:16.441Z] 	at java.base/java.lang.Class.forName(Class.java:377)
09:47:16 [2021-05-18T13:47:16.441Z] 	at java.base/jdk.internal.reflect.NativeMethodAccessorImpl.invoke0(Native Method)
09:47:16 [2021-05-18T13:47:16.441Z] 	at java.base/jdk.internal.reflect.NativeMethodAccessorImpl.invoke(NativeMethodAccessorImpl.java:64)
09:47:16 [2021-05-18T13:47:16.441Z] 	at java.base/jdk.internal.reflect.DelegatingMethodAccessorImpl.invoke(DelegatingMethodAccessorImpl.java:43)
09:47:16 [2021-05-18T13:47:16.441Z] 	at java.base/java.lang.reflect.Method.invoke(Method.java:564)
09:47:16 [2021-05-18T13:47:16.441Z] 	at org.mozilla.javascript.MemberBox.invoke(MemberBox.java:126)
09:47:16 [2021-05-18T13:47:16.441Z] 	at org.mozilla.javascript.NativeJavaMethod.call(NativeJavaMethod.java:225)
09:47:16 [2021-05-18T13:47:16.441Z] 	at org.mozilla.javascript.optimizer.OptRuntime.call1(OptRuntime.java:32)
09:47:16 [2021-05-18T13:47:16.441Z] 	at org.mozilla.javascript.gen.c_32._c_script_0(Unknown Source)
09:47:16 [2021-05-18T13:47:16.441Z] 	at org.mozilla.javascript.gen.c_32.call(Unknown Source)
09:47:16 [2021-05-18T13:47:16.441Z] 	at org.mozilla.javascript.ContextFactory.doTopCall(ContextFactory.java:405)
09:47:16 [2021-05-18T13:47:16.441Z] 	at org.mozilla.javascript.ScriptRuntime.doTopCall(ScriptRuntime.java:3508)
09:47:16 [2021-05-18T13:47:16.441Z] 	at org.mozilla.javascript.gen.c_32.call(Unknown Source)
09:47:16 [2021-05-18T13:47:16.441Z] 	at org.mozilla.javascript.gen.c_32.exec(Unknown Source)
09:47:16 [2021-05-18T13:47:16.442Z] 	at org.mozilla.javascript.Context.evaluateReader(Context.java:1293)
09:47:16 [2021-05-18T13:47:16.442Z] 	at org.eclipse.ease.lang.javascript.rhino.RhinoScriptEngine.internalExecute(RhinoScriptEngine.java:224)
09:47:16 [2021-05-18T13:47:16.442Z] 	at org.eclipse.ease.lang.javascript.rhino.RhinoScriptEngine.execute(RhinoScriptEngine.java:203)
09:47:16 [2021-05-18T13:47:16.442Z] 	at org.eclipse.ease.AbstractScriptEngine.inject(AbstractScriptEngine.java:189)
09:47:16 [2021-05-18T13:47:16.442Z] 	at org.eclipse.ease.AbstractScriptEngine.run(AbstractScriptEngine.java:242)
09:47:16 [2021-05-18T13:47:16.442Z] 	at org.eclipse.core.internal.jobs.Worker.run(Worker.java:63)
09:47:16 [2021-05-18T13:47:16.442Z] Tests run: 11, Failures: 0, Errors: 0, Skipped: 0, Time elapsed: 1.492 s - in org.eclipse.ease.lang.javascript.rhino.RhinoScriptEngineTest
09:47:16 [2021-05-18T13:47:16.442Z] execute_java_class_instantiation  Time elapsed: 0.777 s
09:47:16 [2021-05-18T13:47:16.442Z] execute_environment_module_code_with_optional_parameters  Time elapsed: 0.095 s
09:47:16 [2021-05-18T13:47:16.442Z] execute_throws_java_exception  Time elapsed: 0.09 s
09:47:16 [2021-05-18T13:47:16.442Z] execute_throws_java_class  Time elapsed: 0.091 s
09:47:16 [2021-05-18T13:47:16.442Z] execute_javascript_assignment  Time elapsed: 0.049 s
09:47:16 [2021-05-18T13:47:16.442Z] execute_eclipse_class_instantiation  Time elapsed: 0.073 s
09:47:16 [2021-05-18T13:47:16.442Z] execute_throws_javascript_object  Time elapsed: 0.071 s
09:47:16 [2021-05-18T13:47:16.442Z] execute_throws_syntax_error  Time elapsed: 0.049 s
09:47:16 [2021-05-18T13:47:16.442Z] execute_throws_javascript_runtime_error  Time elapsed: 0.069 s
09:47:16 [2021-05-18T13:47:16.442Z] execute_environment_module_code  Time elapsed: 0.042 s
09:47:16 [2021-05-18T13:47:16.442Z] execute_throws_wrapped_java_exception  Time elapsed: 0.073 s
09:47:16 [2021-05-18T13:47:16.442Z] Running org.eclipse.ease.lang.javascript.rhino.RhinoEnvironmentTest
09:47:18 [2021-05-18T13:47:18.347Z] Tests run: 5, Failures: 0, Errors: 0, Skipped: 0, Time elapsed: 1.053 s - in org.eclipse.ease.lang.javascript.rhino.RhinoEnvironmentTest
09:47:18 [2021-05-18T13:47:18.347Z] reloadEnvironment  Time elapsed: 0.074 s
09:47:18 [2021-05-18T13:47:18.347Z] bootstrappedEnvironment  Time elapsed: 0.058 s
09:47:18 [2021-05-18T13:47:18.347Z] postMethodCallback  Time elapsed: 0.791 s
09:47:18 [2021-05-18T13:47:18.347Z] preMethodCallback  Time elapsed: 0.039 s
09:47:18 [2021-05-18T13:47:18.347Z] reloadFunctionDefinitions  Time elapsed: 0.087 s
09:47:18 [2021-05-18T13:47:18.347Z] Running org.eclipse.ease.lang.javascript.rhino.RhinoDebuggerEngineTest
09:47:18 [2021-05-18T13:47:18.347Z] org.eclipse.ease.ScriptExecutionException: JavaError: java.lang.Exception
09:47:18 [2021-05-18T13:47:18.347Z] 
09:47:18 [2021-05-18T13:47:18.347Z] Java Stacktrace:
09:47:18 [2021-05-18T13:47:18.347Z] java.lang.Exception
09:47:18 [2021-05-18T13:47:18.347Z] 	at java.base/jdk.internal.reflect.NativeConstructorAccessorImpl.newInstance0(Native Method)
09:47:18 [2021-05-18T13:47:18.347Z] 	at java.base/jdk.internal.reflect.NativeConstructorAccessorImpl.newInstance(NativeConstructorAccessorImpl.java:64)
09:47:18 [2021-05-18T13:47:18.347Z] 	at java.base/jdk.internal.reflect.DelegatingConstructorAccessorImpl.newInstance(DelegatingConstructorAccessorImpl.java:45)
09:47:18 [2021-05-18T13:47:18.347Z] 	at java.base/java.lang.reflect.Constructor.newInstanceWithCaller(Constructor.java:500)
09:47:18 [2021-05-18T13:47:18.347Z] 	at java.base/java.lang.reflect.Constructor.newInstance(Constructor.java:481)
09:47:18 [2021-05-18T13:47:18.347Z] 	at org.mozilla.javascript.MemberBox.newInstance(MemberBox.java:159)
09:47:18 [2021-05-18T13:47:18.347Z] 	at org.mozilla.javascript.NativeJavaClass.constructInternal(NativeJavaClass.java:266)
09:47:18 [2021-05-18T13:47:18.347Z] 	at org.mozilla.javascript.NativeJavaClass.constructSpecific(NativeJavaClass.java:205)
09:47:18 [2021-05-18T13:47:18.347Z] 	at org.mozilla.javascript.NativeJavaClass.construct(NativeJavaClass.java:166)
09:47:18 [2021-05-18T13:47:18.347Z] 	at org.mozilla.javascript.Interpreter.interpretLoop(Interpreter.java:1617)
09:47:18 [2021-05-18T13:47:18.347Z] 	at org.mozilla.javascript.Interpreter.interpret(Interpreter.java:911)
09:47:18 [2021-05-18T13:47:18.347Z] 	at org.mozilla.javascript.InterpretedFunction.call(InterpretedFunction.java:109)
09:47:18 [2021-05-18T13:47:18.347Z] 	at org.mozilla.javascript.ContextFactory.doTopCall(ContextFactory.java:405)
09:47:18 [2021-05-18T13:47:18.347Z] 	at org.mozilla.javascript.ScriptRuntime.doTopCall(ScriptRuntime.java:3508)
09:47:18 [2021-05-18T13:47:18.347Z] 	at org.mozilla.javascript.InterpretedFunction.exec(InterpretedFunction.java:120)
09:47:18 [2021-05-18T13:47:18.347Z] 	at org.mozilla.javascript.Context.evaluateReader(Context.java:1293)
09:47:18 [2021-05-18T13:47:18.347Z] 	at org.eclipse.ease.lang.javascript.rhino.RhinoScriptEngine.internalExecute(RhinoScriptEngine.java:224)
09:47:18 [2021-05-18T13:47:18.347Z] 	at org.eclipse.ease.lang.javascript.rhino.RhinoScriptEngine.execute(RhinoScriptEngine.java:203)
09:47:18 [2021-05-18T13:47:18.347Z] 	at org.eclipse.ease.AbstractScriptEngine.inject(AbstractScriptEngine.java:189)
09:47:18 [2021-05-18T13:47:18.347Z] 	at org.eclipse.ease.AbstractScriptEngine.run(AbstractScriptEngine.java:242)
09:47:18 [2021-05-18T13:47:18.347Z] 	at org.eclipse.core.internal.jobs.Worker.run(Worker.java:63)
09:47:18 [2021-05-18T13:47:18.347Z] org.eclipse.ease.ScriptExecutionException: ScriptException: test
09:47:18 [2021-05-18T13:47:18.619Z] org.eclipse.ease.ScriptExecutionException: ScriptException: JavaScript
09:47:18 [2021-05-18T13:47:18.619Z] org.eclipse.ease.ScriptExecutionException: SyntaxError: unterminated string literal (#1)
09:47:18 [2021-05-18T13:47:18.619Z] 'asdf
09:47:18 [2021-05-18T13:47:18.619Z]     ^
09:47:18 [2021-05-18T13:47:18.619Z] 	at <unknown source>:1
09:47:18 [2021-05-18T13:47:18.619Z] org.eclipse.ease.ScriptExecutionException: TypeError: Cannot call method "foobar" of undefined
09:47:18 [2021-05-18T13:47:18.619Z] org.eclipse.ease.ScriptExecutionException: JavaError: NotThere cannot be found by org.mozilla.javascript_1.7.10.v20190430-1943
09:47:18 [2021-05-18T13:47:18.619Z] 
09:47:18 [2021-05-18T13:47:18.619Z] Java Stacktrace:
09:47:18 [2021-05-18T13:47:18.619Z] java.lang.ClassNotFoundException: NotThere cannot be found by org.mozilla.javascript_1.7.10.v20190430-1943
09:47:18 [2021-05-18T13:47:18.619Z] 	at org.eclipse.osgi.internal.loader.BundleLoader.findClassInternal(BundleLoader.java:512)
09:47:18 [2021-05-18T13:47:18.619Z] 	at org.eclipse.osgi.internal.loader.BundleLoader.findClass(BundleLoader.java:423)
09:47:18 [2021-05-18T13:47:18.619Z] 	at org.eclipse.osgi.internal.loader.BundleLoader.findClass(BundleLoader.java:415)
09:47:18 [2021-05-18T13:47:18.619Z] 	at org.eclipse.osgi.internal.loader.ModuleClassLoader.loadClass(ModuleClassLoader.java:155)
09:47:18 [2021-05-18T13:47:18.619Z] 	at java.base/java.lang.ClassLoader.loadClass(ClassLoader.java:522)
09:47:18 [2021-05-18T13:47:18.619Z] 	at java.base/java.lang.Class.forName0(Native Method)
09:47:18 [2021-05-18T13:47:18.619Z] 	at java.base/java.lang.Class.forName(Class.java:377)
09:47:18 [2021-05-18T13:47:18.619Z] 	at java.base/jdk.internal.reflect.NativeMethodAccessorImpl.invoke0(Native Method)
09:47:18 [2021-05-18T13:47:18.619Z] 	at java.base/jdk.internal.reflect.NativeMethodAccessorImpl.invoke(NativeMethodAccessorImpl.java:64)
09:47:18 [2021-05-18T13:47:18.619Z] 	at java.base/jdk.internal.reflect.DelegatingMethodAccessorImpl.invoke(DelegatingMethodAccessorImpl.java:43)
09:47:18 [2021-05-18T13:47:18.619Z] 	at java.base/java.lang.reflect.Method.invoke(Method.java:564)
09:47:18 [2021-05-18T13:47:18.619Z] 	at org.mozilla.javascript.MemberBox.invoke(MemberBox.java:126)
09:47:18 [2021-05-18T13:47:18.619Z] 	at org.mozilla.javascript.NativeJavaMethod.call(NativeJavaMethod.java:225)
09:47:18 [2021-05-18T13:47:18.619Z] 	at org.mozilla.javascript.Interpreter.interpretLoop(Interpreter.java:1573)
09:47:18 [2021-05-18T13:47:18.619Z] 	at org.mozilla.javascript.Interpreter.interpret(Interpreter.java:911)
09:47:18 [2021-05-18T13:47:18.619Z] 	at org.mozilla.javascript.InterpretedFunction.call(InterpretedFunction.java:109)
09:47:18 [2021-05-18T13:47:18.619Z] 	at org.mozilla.javascript.ContextFactory.doTopCall(ContextFactory.java:405)
09:47:18 [2021-05-18T13:47:18.619Z] 	at org.mozilla.javascript.ScriptRuntime.doTopCall(ScriptRuntime.java:3508)
09:47:18 [2021-05-18T13:47:18.619Z] 	at org.mozilla.javascript.InterpretedFunction.exec(InterpretedFunction.java:120)
09:47:18 [2021-05-18T13:47:18.619Z] 	at org.mozilla.javascript.Context.evaluateReader(Context.java:1293)
09:47:18 [2021-05-18T13:47:18.619Z] 	at org.eclipse.ease.lang.javascript.rhino.RhinoScriptEngine.internalExecute(RhinoScriptEngine.java:224)
09:47:18 [2021-05-18T13:47:18.619Z] 	at org.eclipse.ease.lang.javascript.rhino.RhinoScriptEngine.execute(RhinoScriptEngine.java:203)
09:47:18 [2021-05-18T13:47:18.619Z] 	at org.eclipse.ease.AbstractScriptEngine.inject(AbstractScriptEngine.java:189)
09:47:18 [2021-05-18T13:47:18.619Z] 	at org.eclipse.ease.AbstractScriptEngine.run(AbstractScriptEngine.java:242)
09:47:18 [2021-05-18T13:47:18.619Z] 	at org.eclipse.core.internal.jobs.Worker.run(Worker.java:63)
09:47:18 [2021-05-18T13:47:18.877Z] org.eclipse.ease.ScriptExecutionException: TypeError: Cannot call method "substr" of null
09:47:18 [2021-05-18T13:47:18.877Z] 	at mainFile.js,throwOnNull():4
09:47:18 [2021-05-18T13:47:18.877Z] 	at includeFile.js,subCall():2
09:47:18 [2021-05-18T13:47:18.877Z] 	at mainFile.js:7
09:47:18 [2021-05-18T13:47:18.877Z] Tests run: 12, Failures: 0, Errors: 0, Skipped: 0, Time elapsed: 0.733 s - in org.eclipse.ease.lang.javascript.rhino.RhinoDebuggerEngineTest
09:47:18 [2021-05-18T13:47:18.877Z] execute_java_class_instantiation  Time elapsed: 0.245 s
09:47:18 [2021-05-18T13:47:18.877Z] execute_environment_module_code_with_optional_parameters  Time elapsed: 0.036 s
09:47:18 [2021-05-18T13:47:18.877Z] execute_throws_java_exception  Time elapsed: 0.056 s
09:47:18 [2021-05-18T13:47:18.877Z] execute_throws_java_class  Time elapsed: 0.035 s
09:47:18 [2021-05-18T13:47:18.877Z] execute_javascript_assignment  Time elapsed: 0.062 s
09:47:18 [2021-05-18T13:47:18.877Z] execute_eclipse_class_instantiation  Time elapsed: 0.031 s
09:47:18 [2021-05-18T13:47:18.877Z] execute_throws_javascript_object  Time elapsed: 0.054 s
09:47:18 [2021-05-18T13:47:18.877Z] execute_throws_syntax_error  Time elapsed: 0.031 s
09:47:18 [2021-05-18T13:47:18.877Z] execute_throws_javascript_runtime_error  Time elapsed: 0.026 s
09:47:18 [2021-05-18T13:47:18.877Z] execute_environment_module_code  Time elapsed: 0.08 s
09:47:18 [2021-05-18T13:47:18.877Z] execute_throws_wrapped_java_exception  Time elapsed: 0.026 s
09:47:18 [2021-05-18T13:47:18.877Z] getExceptionStackTrace_returns_script_trace_over_multiple_files  Time elapsed: 0.047 s
09:47:18 [2021-05-18T13:47:18.877Z] Running org.eclipse.ease.lang.javascript.rhino.RhinoDebugTest
09:47:19 [2021-05-18T13:47:19.136Z] Start of script
09:47:19 [2021-05-18T13:47:19.136Z] include file start
09:47:19 [2021-05-18T13:47:19.136Z] Include file processed
09:47:19 [2021-05-18T13:47:19.136Z] line after include file
09:47:19 [2021-05-18T13:47:19.136Z] Result of testMethod = 5
09:47:19 [2021-05-18T13:47:19.136Z] End of script
09:47:19 [2021-05-18T13:47:19.136Z] Start of script
09:47:19 [2021-05-18T13:47:19.136Z] include file start
09:47:19 [2021-05-18T13:47:19.136Z] Include file processed
09:47:19 [2021-05-18T13:47:19.136Z] line after include file
09:47:19 [2021-05-18T13:47:19.136Z] Result of testMethod = 5
09:47:19 [2021-05-18T13:47:19.136Z] End of script
09:47:19 [2021-05-18T13:47:19.395Z] Start of script
09:47:19 [2021-05-18T13:47:19.395Z] include file start
09:47:19 [2021-05-18T13:47:19.395Z] Include file processed
09:47:19 [2021-05-18T13:47:19.395Z] line after include file
09:47:19 [2021-05-18T13:47:19.395Z] Result of testMethod = 5
09:47:19 [2021-05-18T13:47:19.653Z] org.eclipse.ease.ScriptEngineCancellationException: Terminated on user request
09:47:19 [2021-05-18T13:47:19.653Z] 	at org.eclipse.ease.debugging.AbstractEaseDebugger.handleEventsInSuspendedState(AbstractEaseDebugger.java:329)
09:47:19 [2021-05-18T13:47:19.653Z] 	at org.eclipse.ease.debugging.AbstractEaseDebugger.suspend(AbstractEaseDebugger.java:255)
09:47:19 [2021-05-18T13:47:19.653Z] 	at org.eclipse.ease.debugging.AbstractEaseDebugger.processLine(AbstractEaseDebugger.java:490)
09:47:19 [2021-05-18T13:47:19.653Z] 	at org.eclipse.ease.lang.javascript.rhino.debugger.RhinoDebugger.access$4(RhinoDebugger.java:1)
09:47:19 [2021-05-18T13:47:19.653Z] 	at org.eclipse.ease.lang.javascript.rhino.debugger.RhinoDebugger$RhinoDebugFrame.onLineChange(RhinoDebugger.java:122)
09:47:19 [2021-05-18T13:47:19.654Z] 	at org.mozilla.javascript.Interpreter.interpretLoop(Interpreter.java:1931)
09:47:19 [2021-05-18T13:47:19.654Z] 	at org.mozilla.javascript.Interpreter.interpret(Interpreter.java:911)
09:47:19 [2021-05-18T13:47:19.654Z] 	at org.mozilla.javascript.InterpretedFunction.call(InterpretedFunction.java:109)
09:47:19 [2021-05-18T13:47:19.654Z] 	at org.mozilla.javascript.ContextFactory.doTopCall(ContextFactory.java:405)
09:47:19 [2021-05-18T13:47:19.654Z] 	at org.mozilla.javascript.ScriptRuntime.doTopCall(ScriptRuntime.java:3508)
09:47:19 [2021-05-18T13:47:19.654Z] 	at org.mozilla.javascript.InterpretedFunction.exec(InterpretedFunction.java:120)
09:47:19 [2021-05-18T13:47:19.654Z] 	at org.mozilla.javascript.Context.evaluateReader(Context.java:1293)
09:47:19 [2021-05-18T13:47:19.654Z] 	at org.eclipse.ease.lang.javascript.rhino.RhinoScriptEngine.internalExecute(RhinoScriptEngine.java:224)
09:47:19 [2021-05-18T13:47:19.654Z] 	at org.eclipse.ease.lang.javascript.rhino.RhinoScriptEngine.execute(RhinoScriptEngine.java:203)
09:47:19 [2021-05-18T13:47:19.654Z] 	at org.eclipse.ease.AbstractScriptEngine.inject(AbstractScriptEngine.java:189)
09:47:19 [2021-05-18T13:47:19.654Z] 	at org.eclipse.ease.AbstractScriptEngine.run(AbstractScriptEngine.java:242)
09:47:19 [2021-05-18T13:47:19.654Z] 	at org.eclipse.core.internal.jobs.Worker.run(Worker.java:63)
09:47:19 [2021-05-18T13:47:19.654Z] Start of script
09:47:19 [2021-05-18T13:47:19.654Z] include file start
09:47:19 [2021-05-18T13:47:19.654Z] Include file processed
09:47:19 [2021-05-18T13:47:19.654Z] line after include file
09:47:19 [2021-05-18T13:47:19.912Z] Result of testMethod = 5
09:47:19 [2021-05-18T13:47:19.912Z] End of script
09:47:20 [2021-05-18T13:47:20.170Z] Start of script
09:47:20 [2021-05-18T13:47:20.170Z] include file start
09:47:20 [2021-05-18T13:47:20.170Z] Include file processed
09:47:20 [2021-05-18T13:47:20.170Z] line after include file
09:47:20 [2021-05-18T13:47:20.170Z] Result of testMethod = 5
09:47:20 [2021-05-18T13:47:20.170Z] End of script
09:47:20 [2021-05-18T13:47:20.429Z] Start of script
09:47:20 [2021-05-18T13:47:20.429Z] include file start
09:47:20 [2021-05-18T13:47:20.429Z] Include file processed
09:47:20 [2021-05-18T13:47:20.429Z] line after include file
09:47:20 [2021-05-18T13:47:20.429Z] Result of testMethod = 5
09:47:20 [2021-05-18T13:47:20.429Z] End of script
09:47:20 [2021-05-18T13:47:20.688Z] Start of script
09:47:20 [2021-05-18T13:47:20.688Z] include file start
09:47:20 [2021-05-18T13:47:20.688Z] Include file processed
09:47:20 [2021-05-18T13:47:20.688Z] line after include file
09:47:20 [2021-05-18T13:47:20.688Z] Result of testMethod = 5
09:47:20 [2021-05-18T13:47:20.688Z] org.eclipse.ease.ScriptEngineCancellationException: Terminated on user request
09:47:20 [2021-05-18T13:47:20.688Z] 	at org.eclipse.ease.debugging.AbstractEaseDebugger.handleEventsInSuspendedState(AbstractEaseDebugger.java:329)
09:47:20 [2021-05-18T13:47:20.688Z] 	at org.eclipse.ease.debugging.AbstractEaseDebugger.suspend(AbstractEaseDebugger.java:255)
09:47:20 [2021-05-18T13:47:20.688Z] 	at org.eclipse.ease.debugging.AbstractEaseDebugger.processLine(AbstractEaseDebugger.java:490)
09:47:20 [2021-05-18T13:47:20.688Z] 	at org.eclipse.ease.lang.javascript.rhino.debugger.RhinoDebugger.access$4(RhinoDebugger.java:1)
09:47:20 [2021-05-18T13:47:20.688Z] 	at org.eclipse.ease.lang.javascript.rhino.debugger.RhinoDebugger$RhinoDebugFrame.onLineChange(RhinoDebugger.java:122)
09:47:20 [2021-05-18T13:47:20.688Z] 	at org.mozilla.javascript.Interpreter.interpretLoop(Interpreter.java:1931)
09:47:20 [2021-05-18T13:47:20.688Z] 	at org.mozilla.javascript.Interpreter.interpret(Interpreter.java:911)
09:47:20 [2021-05-18T13:47:20.688Z] 	at org.mozilla.javascript.InterpretedFunction.call(InterpretedFunction.java:109)
09:47:20 [2021-05-18T13:47:20.688Z] 	at org.mozilla.javascript.ContextFactory.doTopCall(ContextFactory.java:405)
09:47:20 [2021-05-18T13:47:20.688Z] 	at org.mozilla.javascript.ScriptRuntime.doTopCall(ScriptRuntime.java:3508)
09:47:20 [2021-05-18T13:47:20.688Z] 	at org.mozilla.javascript.InterpretedFunction.exec(InterpretedFunction.java:120)
09:47:20 [2021-05-18T13:47:20.688Z] 	at org.mozilla.javascript.Context.evaluateReader(Context.java:1293)
09:47:20 [2021-05-18T13:47:20.688Z] 	at org.eclipse.ease.lang.javascript.rhino.RhinoScriptEngine.internalExecute(RhinoScriptEngine.java:224)
09:47:20 [2021-05-18T13:47:20.688Z] 	at org.eclipse.ease.lang.javascript.rhino.RhinoScriptEngine.execute(RhinoScriptEngine.java:203)
09:47:20 [2021-05-18T13:47:20.688Z] 	at org.eclipse.ease.AbstractScriptEngine.inject(AbstractScriptEngine.java:189)
09:47:20 [2021-05-18T13:47:20.688Z] 	at org.eclipse.ease.AbstractScriptEngine.run(AbstractScriptEngine.java:242)
09:47:20 [2021-05-18T13:47:20.688Z] 	at org.eclipse.core.internal.jobs.Worker.run(Worker.java:63)
09:47:20 [2021-05-18T13:47:20.946Z] Start of script
09:47:20 [2021-05-18T13:47:20.946Z] include file start
09:47:20 [2021-05-18T13:47:20.946Z] Include file processed
09:47:20 [2021-05-18T13:47:20.946Z] line after include file
09:47:20 [2021-05-18T13:47:20.946Z] java.util.ConcurrentModificationException
09:47:20 [2021-05-18T13:47:20.946Z] 	at java.base/java.util.ArrayList$Itr.checkForComodification(ArrayList.java:1013)
09:47:20 [2021-05-18T13:47:20.946Z] 	at java.base/java.util.ArrayList$Itr.next(ArrayList.java:967)
09:47:20 [2021-05-18T13:47:20.946Z] 	at org.eclipse.ease.debugging.AbstractEaseDebugger.getBreakpoint(AbstractEaseDebugger.java:409)
09:47:20 [2021-05-18T13:47:20.946Z] 	at org.eclipse.ease.debugging.AbstractEaseDebugger.isActiveBreakpoint(AbstractEaseDebugger.java:527)
09:47:20 [2021-05-18T13:47:20.946Z] 	at org.eclipse.ease.debugging.AbstractEaseDebugger.processLine(AbstractEaseDebugger.java:489)
09:47:20 [2021-05-18T13:47:20.946Z] 	at org.eclipse.ease.lang.javascript.rhino.debugger.RhinoDebugger.access$4(RhinoDebugger.java:1)
09:47:20 [2021-05-18T13:47:20.946Z] 	at org.eclipse.ease.lang.javascript.rhino.debugger.RhinoDebugger$RhinoDebugFrame.onLineChange(RhinoDebugger.java:122)
09:47:20 [2021-05-18T13:47:20.946Z] 	at org.mozilla.javascript.Interpreter.interpretLoop(Interpreter.java:1931)
09:47:20 [2021-05-18T13:47:20.946Z] 	at org.mozilla.javascript.Interpreter.interpret(Interpreter.java:911)
09:47:20 [2021-05-18T13:47:20.946Z] 	at org.mozilla.javascript.InterpretedFunction.call(InterpretedFunction.java:109)
09:47:20 [2021-05-18T13:47:20.947Z] 	at org.mozilla.javascript.ContextFactory.doTopCall(ContextFactory.java:405)
09:47:20 [2021-05-18T13:47:20.947Z] 	at org.mozilla.javascript.ScriptRuntime.doTopCall(ScriptRuntime.java:3508)
09:47:20 [2021-05-18T13:47:20.947Z] 	at org.mozilla.javascript.InterpretedFunction.exec(InterpretedFunction.java:120)
09:47:20 [2021-05-18T13:47:20.947Z] 	at org.mozilla.javascript.Context.evaluateReader(Context.java:1293)
09:47:20 [2021-05-18T13:47:20.947Z] 	at org.eclipse.ease.lang.javascript.rhino.RhinoScriptEngine.internalExecute(RhinoScriptEngine.java:224)
09:47:20 [2021-05-18T13:47:20.947Z] 	at org.eclipse.ease.lang.javascript.rhino.RhinoScriptEngine.execute(RhinoScriptEngine.java:203)
09:47:20 [2021-05-18T13:47:20.947Z] 	at org.eclipse.ease.AbstractScriptEngine.inject(AbstractScriptEngine.java:189)
09:47:20 [2021-05-18T13:47:20.947Z] 	at org.eclipse.ease.AbstractScriptEngine.run(AbstractScriptEngine.java:242)
09:47:20 [2021-05-18T13:47:20.947Z] 	at org.eclipse.core.internal.jobs.Worker.run(Worker.java:63)
09:47:21 [2021-05-18T13:47:21.206Z] Start of script
09:47:21 [2021-05-18T13:47:21.206Z] include file start
09:47:21 [2021-05-18T13:47:21.206Z] Include file processed
09:47:21 [2021-05-18T13:47:21.206Z] line after include file
09:47:21 [2021-05-18T13:47:21.206Z] Result of testMethod = 5
09:47:21 [2021-05-18T13:47:21.206Z] End of script
09:47:21 [2021-05-18T13:47:21.465Z] Start of script
09:47:21 [2021-05-18T13:47:21.465Z] include file start
09:47:21 [2021-05-18T13:47:21.465Z] Include file processed
09:47:21 [2021-05-18T13:47:21.465Z] line after include file
09:47:21 [2021-05-18T13:47:21.725Z] org.eclipse.ease.ScriptEngineCancellationException: Terminated on user request
09:47:21 [2021-05-18T13:47:21.725Z] 	at org.eclipse.ease.debugging.AbstractEaseDebugger.handleEventsInSuspendedState(AbstractEaseDebugger.java:329)
09:47:21 [2021-05-18T13:47:21.725Z] 	at org.eclipse.ease.debugging.AbstractEaseDebugger.suspend(AbstractEaseDebugger.java:255)
09:47:21 [2021-05-18T13:47:21.725Z] 	at org.eclipse.ease.debugging.AbstractEaseDebugger.processLine(AbstractEaseDebugger.java:510)
09:47:21 [2021-05-18T13:47:21.725Z] 	at org.eclipse.ease.lang.javascript.rhino.debugger.RhinoDebugger.access$4(RhinoDebugger.java:1)
09:47:21 [2021-05-18T13:47:21.725Z] 	at org.eclipse.ease.lang.javascript.rhino.debugger.RhinoDebugger$RhinoDebugFrame.onLineChange(RhinoDebugger.java:122)
09:47:21 [2021-05-18T13:47:21.725Z] 	at org.mozilla.javascript.Interpreter.interpretLoop(Interpreter.java:1931)
09:47:21 [2021-05-18T13:47:21.725Z] 	at org.mozilla.javascript.Interpreter.interpret(Interpreter.java:911)
09:47:21 [2021-05-18T13:47:21.725Z] 	at org.mozilla.javascript.InterpretedFunction.call(InterpretedFunction.java:109)
09:47:21 [2021-05-18T13:47:21.725Z] 	at org.mozilla.javascript.ContextFactory.doTopCall(ContextFactory.java:405)
09:47:21 [2021-05-18T13:47:21.725Z] 	at org.mozilla.javascript.ScriptRuntime.doTopCall(ScriptRuntime.java:3508)
09:47:21 [2021-05-18T13:47:21.725Z] 	at org.mozilla.javascript.InterpretedFunction.exec(InterpretedFunction.java:120)
09:47:21 [2021-05-18T13:47:21.725Z] 	at org.mozilla.javascript.Context.evaluateReader(Context.java:1293)
09:47:21 [2021-05-18T13:47:21.725Z] 	at org.eclipse.ease.lang.javascript.rhino.RhinoScriptEngine.internalExecute(RhinoScriptEngine.java:224)
09:47:21 [2021-05-18T13:47:21.725Z] 	at org.eclipse.ease.lang.javascript.rhino.RhinoScriptEngine.execute(RhinoScriptEngine.java:203)
09:47:21 [2021-05-18T13:47:21.725Z] 	at org.eclipse.ease.AbstractScriptEngine.inject(AbstractScriptEngine.java:189)
09:47:21 [2021-05-18T13:47:21.725Z] 	at org.eclipse.ease.AbstractScriptEngine.run(AbstractScriptEngine.java:242)
09:47:21 [2021-05-18T13:47:21.725Z] 	at org.eclipse.core.internal.jobs.Worker.run(Worker.java:63)
09:47:21 [2021-05-18T13:47:21.725Z] Start of script
09:47:21 [2021-05-18T13:47:21.725Z] include file start
09:47:21 [2021-05-18T13:47:21.983Z] Include file processed
09:47:21 [2021-05-18T13:47:21.983Z] line after include file
09:47:21 [2021-05-18T13:47:21.983Z] Result of testMethod = 5
09:47:21 [2021-05-18T13:47:21.983Z] End of script
09:47:21 [2021-05-18T13:47:21.983Z] Start of script
09:47:21 [2021-05-18T13:47:21.983Z] include file start
09:47:21 [2021-05-18T13:47:21.983Z] Include file processed
09:47:21 [2021-05-18T13:47:21.983Z] line after include file
09:47:22 [2021-05-18T13:47:22.241Z] Result of testMethod = 5
09:47:22 [2021-05-18T13:47:22.241Z] End of script
09:47:22 [2021-05-18T13:47:22.500Z] org.eclipse.ease.ScriptEngineCancellationException: Terminated on user request
09:47:22 [2021-05-18T13:47:22.501Z] 	at org.eclipse.ease.debugging.AbstractEaseDebugger.handleEventsInSuspendedState(AbstractEaseDebugger.java:329)
09:47:22 [2021-05-18T13:47:22.501Z] 	at org.eclipse.ease.debugging.AbstractEaseDebugger.suspend(AbstractEaseDebugger.java:255)
09:47:22 [2021-05-18T13:47:22.501Z] 	at org.eclipse.ease.debugging.AbstractEaseDebugger.processLine(AbstractEaseDebugger.java:490)
09:47:22 [2021-05-18T13:47:22.501Z] 	at org.eclipse.ease.lang.javascript.rhino.debugger.RhinoDebugger.access$4(RhinoDebugger.java:1)
09:47:22 [2021-05-18T13:47:22.501Z] 	at org.eclipse.ease.lang.javascript.rhino.debugger.RhinoDebugger$RhinoDebugFrame.onLineChange(RhinoDebugger.java:122)
09:47:22 [2021-05-18T13:47:22.501Z] 	at org.mozilla.javascript.Interpreter.interpretLoop(Interpreter.java:1931)
09:47:22 [2021-05-18T13:47:22.501Z] 	at org.mozilla.javascript.Interpreter.interpret(Interpreter.java:911)
09:47:22 [2021-05-18T13:47:22.501Z] 	at org.mozilla.javascript.InterpretedFunction.call(InterpretedFunction.java:109)
09:47:22 [2021-05-18T13:47:22.501Z] 	at org.mozilla.javascript.ContextFactory.doTopCall(ContextFactory.java:405)
09:47:22 [2021-05-18T13:47:22.501Z] 	at org.mozilla.javascript.ScriptRuntime.doTopCall(ScriptRuntime.java:3508)
09:47:22 [2021-05-18T13:47:22.501Z] 	at org.mozilla.javascript.InterpretedFunction.exec(InterpretedFunction.java:120)
09:47:22 [2021-05-18T13:47:22.501Z] 	at org.mozilla.javascript.Context.evaluateReader(Context.java:1293)
09:47:22 [2021-05-18T13:47:22.501Z] 	at org.eclipse.ease.lang.javascript.rhino.RhinoScriptEngine.internalExecute(RhinoScriptEngine.java:224)
09:47:22 [2021-05-18T13:47:22.501Z] 	at org.eclipse.ease.lang.javascript.rhino.RhinoScriptEngine.execute(RhinoScriptEngine.java:203)
09:47:22 [2021-05-18T13:47:22.501Z] 	at org.eclipse.ease.AbstractScriptEngine.inject(AbstractScriptEngine.java:189)
09:47:22 [2021-05-18T13:47:22.501Z] 	at org.eclipse.ease.AbstractScriptEngine.run(AbstractScriptEngine.java:242)
09:47:22 [2021-05-18T13:47:22.501Z] 	at org.eclipse.core.internal.jobs.Worker.run(Worker.java:63)
09:47:22 [2021-05-18T13:47:22.501Z] Start of script
09:47:22 [2021-05-18T13:47:22.501Z] include file start
09:47:22 [2021-05-18T13:47:22.501Z] Include file processed
09:47:22 [2021-05-18T13:47:22.501Z] line after include file
09:47:22 [2021-05-18T13:47:22.501Z] Result of testMethod = 5
09:47:22 [2021-05-18T13:47:22.501Z] End of script
09:47:22 [2021-05-18T13:47:22.759Z] Start of script
09:47:22 [2021-05-18T13:47:22.759Z] include file start
09:47:22 [2021-05-18T13:47:22.759Z] Include file processed
09:47:22 [2021-05-18T13:47:22.759Z] line after include file
09:47:23 [2021-05-18T13:47:23.017Z] Result of testMethod = 5
09:47:23 [2021-05-18T13:47:23.017Z] End of script
09:47:23 [2021-05-18T13:47:23.017Z] Start of script
09:47:23 [2021-05-18T13:47:23.017Z] include file start
09:47:23 [2021-05-18T13:47:23.017Z] Include file processed
09:47:23 [2021-05-18T13:47:23.017Z] line after include file
09:47:23 [2021-05-18T13:47:23.017Z] Result of testMethod = 5
09:47:23 [2021-05-18T13:47:23.275Z] org.eclipse.ease.ScriptEngineCancellationException: Terminated on user request
09:47:23 [2021-05-18T13:47:23.275Z] 	at org.eclipse.ease.debugging.AbstractEaseDebugger.handleEventsInSuspendedState(AbstractEaseDebugger.java:329)
09:47:23 [2021-05-18T13:47:23.275Z] 	at org.eclipse.ease.debugging.AbstractEaseDebugger.suspend(AbstractEaseDebugger.java:255)
09:47:23 [2021-05-18T13:47:23.275Z] 	at org.eclipse.ease.debugging.AbstractEaseDebugger.processLine(AbstractEaseDebugger.java:490)
09:47:23 [2021-05-18T13:47:23.276Z] 	at org.eclipse.ease.lang.javascript.rhino.debugger.RhinoDebugger.access$4(RhinoDebugger.java:1)
09:47:23 [2021-05-18T13:47:23.276Z] 	at org.eclipse.ease.lang.javascript.rhino.debugger.RhinoDebugger$RhinoDebugFrame.onLineChange(RhinoDebugger.java:122)
09:47:23 [2021-05-18T13:47:23.276Z] 	at org.mozilla.javascript.Interpreter.interpretLoop(Interpreter.java:1931)
09:47:23 [2021-05-18T13:47:23.276Z] 	at org.mozilla.javascript.Interpreter.interpret(Interpreter.java:911)
09:47:23 [2021-05-18T13:47:23.276Z] 	at org.mozilla.javascript.InterpretedFunction.call(InterpretedFunction.java:109)
09:47:23 [2021-05-18T13:47:23.276Z] 	at org.mozilla.javascript.ContextFactory.doTopCall(ContextFactory.java:405)
09:47:23 [2021-05-18T13:47:23.276Z] 	at org.mozilla.javascript.ScriptRuntime.doTopCall(ScriptRuntime.java:3508)
09:47:23 [2021-05-18T13:47:23.276Z] 	at org.mozilla.javascript.InterpretedFunction.exec(InterpretedFunction.java:120)
09:47:23 [2021-05-18T13:47:23.276Z] 	at org.mozilla.javascript.Context.evaluateReader(Context.java:1293)
09:47:23 [2021-05-18T13:47:23.276Z] 	at org.eclipse.ease.lang.javascript.rhino.RhinoScriptEngine.internalExecute(RhinoScriptEngine.java:224)
09:47:23 [2021-05-18T13:47:23.276Z] 	at org.eclipse.ease.lang.javascript.rhino.RhinoScriptEngine.execute(RhinoScriptEngine.java:203)
09:47:23 [2021-05-18T13:47:23.276Z] 	at org.eclipse.ease.AbstractScriptEngine.inject(AbstractScriptEngine.java:189)
09:47:23 [2021-05-18T13:47:23.276Z] 	at org.eclipse.ease.AbstractScriptEngine.run(AbstractScriptEngine.java:242)
09:47:23 [2021-05-18T13:47:23.276Z] 	at org.eclipse.core.internal.jobs.Worker.run(Worker.java:63)
09:47:23 [2021-05-18T13:47:23.276Z] Start of script
09:47:23 [2021-05-18T13:47:23.276Z] include file start
09:47:23 [2021-05-18T13:47:23.276Z] Include file processed
09:47:23 [2021-05-18T13:47:23.276Z] line after include file
09:47:23 [2021-05-18T13:47:23.534Z] Result of testMethod = 5
09:47:23 [2021-05-18T13:47:23.534Z] End of script
09:47:23 [2021-05-18T13:47:23.792Z] org.eclipse.ease.ScriptEngineCancellationException: Terminated on user request
09:47:23 [2021-05-18T13:47:23.793Z] 	at org.eclipse.ease.debugging.AbstractEaseDebugger.handleEventsInSuspendedState(AbstractEaseDebugger.java:329)
09:47:23 [2021-05-18T13:47:23.793Z] 	at org.eclipse.ease.debugging.AbstractEaseDebugger.suspend(AbstractEaseDebugger.java:255)
09:47:23 [2021-05-18T13:47:23.793Z] 	at org.eclipse.ease.debugging.AbstractEaseDebugger.processLine(AbstractEaseDebugger.java:490)
09:47:23 [2021-05-18T13:47:23.793Z] 	at org.eclipse.ease.lang.javascript.rhino.debugger.RhinoDebugger.access$4(RhinoDebugger.java:1)
09:47:23 [2021-05-18T13:47:23.793Z] 	at org.eclipse.ease.lang.javascript.rhino.debugger.RhinoDebugger$RhinoDebugFrame.onLineChange(RhinoDebugger.java:122)
09:47:23 [2021-05-18T13:47:23.793Z] 	at org.mozilla.javascript.Interpreter.interpretLoop(Interpreter.java:1931)
09:47:23 [2021-05-18T13:47:23.793Z] 	at org.mozilla.javascript.Interpreter.interpret(Interpreter.java:911)
09:47:23 [2021-05-18T13:47:23.793Z] 	at org.mozilla.javascript.InterpretedFunction.call(InterpretedFunction.java:109)
09:47:23 [2021-05-18T13:47:23.793Z] 	at org.mozilla.javascript.ContextFactory.doTopCall(ContextFactory.java:405)
09:47:23 [2021-05-18T13:47:23.793Z] 	at org.mozilla.javascript.ScriptRuntime.doTopCall(ScriptRuntime.java:3508)
09:47:23 [2021-05-18T13:47:23.793Z] 	at org.mozilla.javascript.InterpretedFunction.exec(InterpretedFunction.java:120)
09:47:23 [2021-05-18T13:47:23.793Z] 	at org.mozilla.javascript.Context.evaluateReader(Context.java:1293)
09:47:23 [2021-05-18T13:47:23.793Z] 	at org.eclipse.ease.lang.javascript.rhino.RhinoScriptEngine.internalExecute(RhinoScriptEngine.java:224)
09:47:23 [2021-05-18T13:47:23.793Z] 	at org.eclipse.ease.lang.javascript.rhino.RhinoScriptEngine.execute(RhinoScriptEngine.java:203)
09:47:23 [2021-05-18T13:47:23.793Z] 	at org.eclipse.ease.AbstractScriptEngine.inject(AbstractScriptEngine.java:189)
09:47:23 [2021-05-18T13:47:23.793Z] 	at org.eclipse.ease.AbstractScriptEngine.run(AbstractScriptEngine.java:242)
09:47:23 [2021-05-18T13:47:23.793Z] 	at org.eclipse.core.internal.jobs.Worker.run(Worker.java:63)
09:47:23 [2021-05-18T13:47:23.793Z] Start of script
09:47:23 [2021-05-18T13:47:23.793Z] include file start
09:47:23 [2021-05-18T13:47:23.793Z] Include file processed
09:47:23 [2021-05-18T13:47:23.793Z] line after include file
09:47:23 [2021-05-18T13:47:23.793Z] Result of testMethod = 5
09:47:24 [2021-05-18T13:47:24.051Z] End of script
09:47:24 [2021-05-18T13:47:24.051Z] Start of script
09:47:24 [2021-05-18T13:47:24.051Z] include file start
09:47:24 [2021-05-18T13:47:24.051Z] Include file processed
09:47:24 [2021-05-18T13:47:24.051Z] line after include file
09:47:24 [2021-05-18T13:47:24.310Z] Result of testMethod = 5
09:47:24 [2021-05-18T13:47:24.310Z] End of script
09:47:24 [2021-05-18T13:47:24.567Z] org.eclipse.ease.ScriptEngineCancellationException: Terminated on user request
09:47:24 [2021-05-18T13:47:24.567Z] 	at org.eclipse.ease.debugging.AbstractEaseDebugger.handleEventsInSuspendedState(AbstractEaseDebugger.java:329)
09:47:24 [2021-05-18T13:47:24.567Z] 	at org.eclipse.ease.debugging.AbstractEaseDebugger.suspend(AbstractEaseDebugger.java:255)
09:47:24 [2021-05-18T13:47:24.567Z] 	at org.eclipse.ease.debugging.AbstractEaseDebugger.processLine(AbstractEaseDebugger.java:490)
09:47:24 [2021-05-18T13:47:24.567Z] 	at org.eclipse.ease.lang.javascript.rhino.debugger.RhinoDebugger.access$4(RhinoDebugger.java:1)
09:47:24 [2021-05-18T13:47:24.567Z] 	at org.eclipse.ease.lang.javascript.rhino.debugger.RhinoDebugger$RhinoDebugFrame.onLineChange(RhinoDebugger.java:122)
09:47:24 [2021-05-18T13:47:24.567Z] 	at org.mozilla.javascript.Interpreter.interpretLoop(Interpreter.java:1931)
09:47:24 [2021-05-18T13:47:24.567Z] 	at org.mozilla.javascript.Interpreter.interpret(Interpreter.java:911)
09:47:24 [2021-05-18T13:47:24.567Z] 	at org.mozilla.javascript.InterpretedFunction.call(InterpretedFunction.java:109)
09:47:24 [2021-05-18T13:47:24.567Z] 	at org.mozilla.javascript.ContextFactory.doTopCall(ContextFactory.java:405)
09:47:24 [2021-05-18T13:47:24.567Z] 	at org.mozilla.javascript.ScriptRuntime.doTopCall(ScriptRuntime.java:3508)
09:47:24 [2021-05-18T13:47:24.568Z] 	at org.mozilla.javascript.InterpretedFunction.exec(InterpretedFunction.java:120)
09:47:24 [2021-05-18T13:47:24.568Z] 	at org.mozilla.javascript.Context.evaluateReader(Context.java:1293)
09:47:24 [2021-05-18T13:47:24.568Z] 	at org.eclipse.ease.lang.javascript.rhino.RhinoScriptEngine.internalExecute(RhinoScriptEngine.java:224)
09:47:24 [2021-05-18T13:47:24.568Z] 	at org.eclipse.ease.lang.javascript.rhino.RhinoScriptEngine.execute(RhinoScriptEngine.java:203)
09:47:24 [2021-05-18T13:47:24.568Z] 	at org.eclipse.ease.AbstractScriptEngine.inject(AbstractScriptEngine.java:189)
09:47:24 [2021-05-18T13:47:24.568Z] 	at org.eclipse.ease.AbstractScriptEngine.run(AbstractScriptEngine.java:242)
09:47:24 [2021-05-18T13:47:24.568Z] 	at org.eclipse.core.internal.jobs.Worker.run(Worker.java:63)
09:47:24 [2021-05-18T13:47:24.568Z] Start of script
09:47:24 [2021-05-18T13:47:24.568Z] include file start
09:47:24 [2021-05-18T13:47:24.568Z] Include file processed
09:47:24 [2021-05-18T13:47:24.568Z] line after include file
09:47:24 [2021-05-18T13:47:24.825Z] Result of testMethod = 5
09:47:24 [2021-05-18T13:47:24.825Z] End of script
09:47:24 [2021-05-18T13:47:24.825Z] Start of script
09:47:24 [2021-05-18T13:47:24.825Z] include file start
09:47:24 [2021-05-18T13:47:24.825Z] Include file processed
09:47:24 [2021-05-18T13:47:24.825Z] line after include file
09:47:24 [2021-05-18T13:47:24.825Z] Result of testMethod = 5
09:47:25 [2021-05-18T13:47:25.083Z] WARNING: An illegal reflective access operation has occurred
09:47:25 [2021-05-18T13:47:25.083Z] WARNING: Illegal reflective access by org.eclipse.ease.debugging.model.EaseDebugValue (file:/home/jenkins/.m2/repository/org/eclipse/ease/org.eclipse.ease/0.8.0-SNAPSHOT/org.eclipse.ease-0.8.0-SNAPSHOT.jar) to field java.lang.String.hash
09:47:25 [2021-05-18T13:47:25.083Z] WARNING: Please consider reporting this to the maintainers of org.eclipse.ease.debugging.model.EaseDebugValue
09:47:25 [2021-05-18T13:47:25.083Z] WARNING: Use --illegal-access=warn to enable warnings of further illegal reflective access operations
09:47:25 [2021-05-18T13:47:25.083Z] WARNING: All illegal access operations will be denied in a future release
09:47:25 [2021-05-18T13:47:25.083Z] org.eclipse.ease.ScriptEngineCancellationException: Terminated on user request
09:47:25 [2021-05-18T13:47:25.083Z] 	at org.eclipse.ease.debugging.AbstractEaseDebugger.handleEventsInSuspendedState(AbstractEaseDebugger.java:329)
09:47:25 [2021-05-18T13:47:25.083Z] 	at org.eclipse.ease.debugging.AbstractEaseDebugger.suspend(AbstractEaseDebugger.java:255)
09:47:25 [2021-05-18T13:47:25.083Z] 	at org.eclipse.ease.debugging.AbstractEaseDebugger.processLine(AbstractEaseDebugger.java:490)
09:47:25 [2021-05-18T13:47:25.083Z] 	at org.eclipse.ease.lang.javascript.rhino.debugger.RhinoDebugger.access$4(RhinoDebugger.java:1)
09:47:25 [2021-05-18T13:47:25.083Z] 	at org.eclipse.ease.lang.javascript.rhino.debugger.RhinoDebugger$RhinoDebugFrame.onLineChange(RhinoDebugger.java:122)
09:47:25 [2021-05-18T13:47:25.083Z] 	at org.mozilla.javascript.Interpreter.interpretLoop(Interpreter.java:1931)
09:47:25 [2021-05-18T13:47:25.083Z] 	at org.mozilla.javascript.Interpreter.interpret(Interpreter.java:911)
09:47:25 [2021-05-18T13:47:25.084Z] 	at org.mozilla.javascript.InterpretedFunction.call(InterpretedFunction.java:109)
09:47:25 [2021-05-18T13:47:25.084Z] 	at org.mozilla.javascript.ContextFactory.doTopCall(ContextFactory.java:405)
09:47:25 [2021-05-18T13:47:25.084Z] 	at org.mozilla.javascript.ScriptRuntime.doTopCall(ScriptRuntime.java:3508)
09:47:25 [2021-05-18T13:47:25.084Z] 	at org.mozilla.javascript.InterpretedFunction.exec(InterpretedFunction.java:120)
09:47:25 [2021-05-18T13:47:25.084Z] 	at org.mozilla.javascript.Context.evaluateReader(Context.java:1293)
09:47:25 [2021-05-18T13:47:25.084Z] 	at org.eclipse.ease.lang.javascript.rhino.RhinoScriptEngine.internalExecute(RhinoScriptEngine.java:224)
09:47:25 [2021-05-18T13:47:25.084Z] 	at org.eclipse.ease.lang.javascript.rhino.RhinoScriptEngine.execute(RhinoScriptEngine.java:203)
09:47:25 [2021-05-18T13:47:25.084Z] 	at org.eclipse.ease.AbstractScriptEngine.inject(AbstractScriptEngine.java:189)
09:47:25 [2021-05-18T13:47:25.084Z] 	at org.eclipse.ease.AbstractScriptEngine.run(AbstractScriptEngine.java:242)
09:47:25 [2021-05-18T13:47:25.084Z] 	at org.eclipse.core.internal.jobs.Worker.run(Worker.java:63)
09:47:25 [2021-05-18T13:47:25.342Z] Start of script
09:47:25 [2021-05-18T13:47:25.342Z] include file start
09:47:25 [2021-05-18T13:47:25.342Z] Include file processed
09:47:25 [2021-05-18T13:47:25.342Z] line after include file
09:47:25 [2021-05-18T13:47:25.342Z] Result of testMethod = 5
09:47:25 [2021-05-18T13:47:25.342Z] End of script
09:47:25 [2021-05-18T13:47:25.342Z] Start of script
09:47:25 [2021-05-18T13:47:25.342Z] include file start
09:47:25 [2021-05-18T13:47:25.342Z] Include file processed
09:47:25 [2021-05-18T13:47:25.342Z] line after include file
09:47:25 [2021-05-18T13:47:25.600Z] Result of testMethod = 5
09:47:25 [2021-05-18T13:47:25.600Z] End of script
09:47:25 [2021-05-18T13:47:25.600Z] Start of script
09:47:25 [2021-05-18T13:47:25.600Z] include file start
09:47:25 [2021-05-18T13:47:25.600Z] Include file processed
09:47:25 [2021-05-18T13:47:25.600Z] line after include file
09:47:25 [2021-05-18T13:47:25.600Z] Result of testMethod = 5
09:47:25 [2021-05-18T13:47:25.600Z] End of script
09:47:25 [2021-05-18T13:47:25.859Z] Start of script
09:47:25 [2021-05-18T13:47:25.859Z] include file start
09:47:25 [2021-05-18T13:47:25.859Z] Include file processed
09:47:26 [2021-05-18T13:47:26.118Z] line after include file
09:47:26 [2021-05-18T13:47:26.118Z] Result of testMethod = 5
09:47:26 [2021-05-18T13:47:26.118Z] End of script
09:47:26 [2021-05-18T13:47:26.118Z] Start of script
09:47:26 [2021-05-18T13:47:26.118Z] include file start
09:47:26 [2021-05-18T13:47:26.118Z] Include file processed
09:47:26 [2021-05-18T13:47:26.118Z] line after include file
09:47:26 [2021-05-18T13:47:26.376Z] org.eclipse.ease.ScriptEngineCancellationException: Terminated on user request
09:47:26 [2021-05-18T13:47:26.377Z] 	at org.eclipse.ease.debugging.AbstractEaseDebugger.handleEventsInSuspendedState(AbstractEaseDebugger.java:329)
09:47:26 [2021-05-18T13:47:26.377Z] 	at org.eclipse.ease.debugging.AbstractEaseDebugger.suspend(AbstractEaseDebugger.java:255)
09:47:26 [2021-05-18T13:47:26.377Z] 	at org.eclipse.ease.debugging.AbstractEaseDebugger.processLine(AbstractEaseDebugger.java:490)
09:47:26 [2021-05-18T13:47:26.377Z] 	at org.eclipse.ease.lang.javascript.rhino.debugger.RhinoDebugger.access$4(RhinoDebugger.java:1)
09:47:26 [2021-05-18T13:47:26.377Z] 	at org.eclipse.ease.lang.javascript.rhino.debugger.RhinoDebugger$RhinoDebugFrame.onLineChange(RhinoDebugger.java:122)
09:47:26 [2021-05-18T13:47:26.377Z] 	at org.mozilla.javascript.Interpreter.interpretLoop(Interpreter.java:1931)
09:47:26 [2021-05-18T13:47:26.377Z] 	at org.mozilla.javascript.Interpreter.interpret(Interpreter.java:911)
09:47:26 [2021-05-18T13:47:26.377Z] 	at org.mozilla.javascript.InterpretedFunction.call(InterpretedFunction.java:109)
09:47:26 [2021-05-18T13:47:26.377Z] 	at org.mozilla.javascript.ContextFactory.doTopCall(ContextFactory.java:405)
09:47:26 [2021-05-18T13:47:26.377Z] 	at org.mozilla.javascript.ScriptRuntime.doTopCall(ScriptRuntime.java:3508)
09:47:26 [2021-05-18T13:47:26.377Z] 	at org.mozilla.javascript.InterpretedFunction.exec(InterpretedFunction.java:120)
09:47:26 [2021-05-18T13:47:26.377Z] 	at org.mozilla.javascript.Context.evaluateReader(Context.java:1293)
09:47:26 [2021-05-18T13:47:26.377Z] 	at org.eclipse.ease.lang.javascript.rhino.RhinoScriptEngine.internalExecute(RhinoScriptEngine.java:224)
09:47:26 [2021-05-18T13:47:26.377Z] 	at org.eclipse.ease.lang.javascript.rhino.RhinoScriptEngine.execute(RhinoScriptEngine.java:203)
09:47:26 [2021-05-18T13:47:26.377Z] 	at org.eclipse.ease.AbstractScriptEngine.inject(AbstractScriptEngine.java:189)
09:47:26 [2021-05-18T13:47:26.377Z] 	at org.eclipse.ease.AbstractScriptEngine.run(AbstractScriptEngine.java:242)
09:47:26 [2021-05-18T13:47:26.377Z] 	at org.eclipse.core.internal.jobs.Worker.run(Worker.java:63)
09:47:26 [2021-05-18T13:47:26.377Z] Start of script
09:47:26 [2021-05-18T13:47:26.636Z] include file start
09:47:26 [2021-05-18T13:47:26.636Z] Include file processed
09:47:26 [2021-05-18T13:47:26.636Z] line after include file
09:47:26 [2021-05-18T13:47:26.636Z] Result of testMethod = 5
09:47:26 [2021-05-18T13:47:26.636Z] End of script
09:47:26 [2021-05-18T13:47:26.636Z] Start of script
09:47:26 [2021-05-18T13:47:26.636Z] include file start
09:47:26 [2021-05-18T13:47:26.636Z] Include file processed
09:47:26 [2021-05-18T13:47:26.636Z] line after include file
09:47:26 [2021-05-18T13:47:26.636Z] Result of testMethod = 5
09:47:26 [2021-05-18T13:47:26.895Z] org.eclipse.ease.ScriptEngineCancellationException: Terminated on user request
09:47:26 [2021-05-18T13:47:26.895Z] 	at org.eclipse.ease.debugging.AbstractEaseDebugger.handleEventsInSuspendedState(AbstractEaseDebugger.java:329)
09:47:26 [2021-05-18T13:47:26.895Z] 	at org.eclipse.ease.debugging.AbstractEaseDebugger.suspend(AbstractEaseDebugger.java:255)
09:47:26 [2021-05-18T13:47:26.895Z] 	at org.eclipse.ease.debugging.AbstractEaseDebugger.processLine(AbstractEaseDebugger.java:490)
09:47:26 [2021-05-18T13:47:26.895Z] 	at org.eclipse.ease.lang.javascript.rhino.debugger.RhinoDebugger.access$4(RhinoDebugger.java:1)
09:47:26 [2021-05-18T13:47:26.895Z] 	at org.eclipse.ease.lang.javascript.rhino.debugger.RhinoDebugger$RhinoDebugFrame.onLineChange(RhinoDebugger.java:122)
09:47:26 [2021-05-18T13:47:26.895Z] 	at org.mozilla.javascript.Interpreter.interpretLoop(Interpreter.java:1931)
09:47:26 [2021-05-18T13:47:26.895Z] 	at org.mozilla.javascript.Interpreter.interpret(Interpreter.java:911)
09:47:26 [2021-05-18T13:47:26.927Z] 	at org.mozilla.javascript.InterpretedFunction.call(InterpretedFunction.java:109)
09:47:26 [2021-05-18T13:47:26.927Z] 	at org.mozilla.javascript.ContextFactory.doTopCall(ContextFactory.java:405)
09:47:26 [2021-05-18T13:47:26.927Z] 	at org.mozilla.javascript.ScriptRuntime.doTopCall(ScriptRuntime.java:3508)
09:47:26 [2021-05-18T13:47:26.927Z] 	at org.mozilla.javascript.InterpretedFunction.exec(InterpretedFunction.java:120)
09:47:26 [2021-05-18T13:47:26.927Z] 	at org.mozilla.javascript.Context.evaluateReader(Context.java:1293)
09:47:26 [2021-05-18T13:47:26.927Z] 	at org.eclipse.ease.lang.javascript.rhino.RhinoScriptEngine.internalExecute(RhinoScriptEngine.java:224)
09:47:26 [2021-05-18T13:47:26.927Z] 	at org.eclipse.ease.lang.javascript.rhino.RhinoScriptEngine.execute(RhinoScriptEngine.java:203)
09:47:26 [2021-05-18T13:47:26.927Z] 	at org.eclipse.ease.AbstractScriptEngine.inject(AbstractScriptEngine.java:189)
09:47:26 [2021-05-18T13:47:26.927Z] 	at org.eclipse.ease.AbstractScriptEngine.run(AbstractScriptEngine.java:242)
09:47:26 [2021-05-18T13:47:26.927Z] 	at org.eclipse.core.internal.jobs.Worker.run(Worker.java:63)
09:47:27 [2021-05-18T13:47:27.192Z] Start of script
09:47:27 [2021-05-18T13:47:27.192Z] include file start
09:47:27 [2021-05-18T13:47:27.192Z] Include file processed
09:47:27 [2021-05-18T13:47:27.192Z] line after include file
09:47:27 [2021-05-18T13:47:27.192Z] Result of testMethod = 5
09:47:27 [2021-05-18T13:47:27.192Z] End of script
09:47:27 [2021-05-18T13:47:27.192Z] Start of script
09:47:27 [2021-05-18T13:47:27.192Z] include file start
09:47:27 [2021-05-18T13:47:27.192Z] Include file processed
09:47:27 [2021-05-18T13:47:27.192Z] line after include file
09:47:27 [2021-05-18T13:47:27.453Z] Result of testMethod = 5
09:47:27 [2021-05-18T13:47:27.453Z] End of script
09:47:27 [2021-05-18T13:47:27.712Z] Start of script
09:47:27 [2021-05-18T13:47:27.712Z] include file start
09:47:27 [2021-05-18T13:47:27.712Z] Include file processed
09:47:27 [2021-05-18T13:47:27.712Z] line after include file
09:47:27 [2021-05-18T13:47:27.712Z] Result of testMethod = 5
09:47:27 [2021-05-18T13:47:27.712Z] End of script
09:47:27 [2021-05-18T13:47:27.970Z] Start of script
09:47:27 [2021-05-18T13:47:27.970Z] include file start
09:47:27 [2021-05-18T13:47:27.970Z] Include file processed
09:47:27 [2021-05-18T13:47:27.970Z] line after include file
09:47:27 [2021-05-18T13:47:27.970Z] Result of testMethod = 5
09:47:27 [2021-05-18T13:47:27.970Z] End of script
09:47:28 [2021-05-18T13:47:28.228Z] Start of script
09:47:28 [2021-05-18T13:47:28.228Z] include file start
09:47:28 [2021-05-18T13:47:28.228Z] Include file processed
09:47:28 [2021-05-18T13:47:28.228Z] line after include file
09:47:28 [2021-05-18T13:47:28.228Z] Result of testMethod = 5
09:47:28 [2021-05-18T13:47:28.228Z] org.eclipse.ease.ScriptEngineCancellationException: Terminated on user request
09:47:28 [2021-05-18T13:47:28.228Z] 	at org.eclipse.ease.debugging.AbstractEaseDebugger.handleEventsInSuspendedState(AbstractEaseDebugger.java:329)
09:47:28 [2021-05-18T13:47:28.228Z] 	at org.eclipse.ease.debugging.AbstractEaseDebugger.suspend(AbstractEaseDebugger.java:255)
09:47:28 [2021-05-18T13:47:28.229Z] 	at org.eclipse.ease.debugging.AbstractEaseDebugger.processLine(AbstractEaseDebugger.java:490)
09:47:28 [2021-05-18T13:47:28.229Z] 	at org.eclipse.ease.lang.javascript.rhino.debugger.RhinoDebugger.access$4(RhinoDebugger.java:1)
09:47:28 [2021-05-18T13:47:28.229Z] 	at org.eclipse.ease.lang.javascript.rhino.debugger.RhinoDebugger$RhinoDebugFrame.onLineChange(RhinoDebugger.java:122)
09:47:28 [2021-05-18T13:47:28.229Z] 	at org.mozilla.javascript.Interpreter.interpretLoop(Interpreter.java:1931)
09:47:28 [2021-05-18T13:47:28.229Z] 	at org.mozilla.javascript.Interpreter.interpret(Interpreter.java:911)
09:47:28 [2021-05-18T13:47:28.229Z] 	at org.mozilla.javascript.InterpretedFunction.call(InterpretedFunction.java:109)
09:47:28 [2021-05-18T13:47:28.229Z] 	at org.mozilla.javascript.ContextFactory.doTopCall(ContextFactory.java:405)
09:47:28 [2021-05-18T13:47:28.229Z] 	at org.mozilla.javascript.ScriptRuntime.doTopCall(ScriptRuntime.java:3508)
09:47:28 [2021-05-18T13:47:28.229Z] 	at org.mozilla.javascript.InterpretedFunction.exec(InterpretedFunction.java:120)
09:47:28 [2021-05-18T13:47:28.229Z] 	at org.mozilla.javascript.Context.evaluateReader(Context.java:1293)
09:47:28 [2021-05-18T13:47:28.229Z] 	at org.eclipse.ease.lang.javascript.rhino.RhinoScriptEngine.internalExecute(RhinoScriptEngine.java:224)
09:47:28 [2021-05-18T13:47:28.229Z] 	at org.eclipse.ease.lang.javascript.rhino.RhinoScriptEngine.execute(RhinoScriptEngine.java:203)
09:47:28 [2021-05-18T13:47:28.229Z] 	at org.eclipse.ease.AbstractScriptEngine.inject(AbstractScriptEngine.java:189)
09:47:28 [2021-05-18T13:47:28.229Z] 	at org.eclipse.ease.AbstractScriptEngine.run(AbstractScriptEngine.java:242)
09:47:28 [2021-05-18T13:47:28.229Z] 	at org.eclipse.core.internal.jobs.Worker.run(Worker.java:63)
09:47:28 [2021-05-18T13:47:28.487Z] Start of script
09:47:28 [2021-05-18T13:47:28.487Z] include file start
09:47:28 [2021-05-18T13:47:28.487Z] Include file processed
09:47:28 [2021-05-18T13:47:28.487Z] line after include file
09:47:28 [2021-05-18T13:47:28.487Z] Result of testMethod = 5
09:47:28 [2021-05-18T13:47:28.487Z] End of script
09:47:28 [2021-05-18T13:47:28.746Z] Start of script
09:47:28 [2021-05-18T13:47:28.746Z] include file start
09:47:28 [2021-05-18T13:47:28.746Z] Include file processed
09:47:28 [2021-05-18T13:47:28.746Z] line after include file
09:47:28 [2021-05-18T13:47:28.746Z] Result of testMethod = 5
09:47:28 [2021-05-18T13:47:28.746Z] org.eclipse.ease.ScriptEngineCancellationException: Terminated on user request
09:47:28 [2021-05-18T13:47:28.746Z] 	at org.eclipse.ease.debugging.AbstractEaseDebugger.handleEventsInSuspendedState(AbstractEaseDebugger.java:329)
09:47:28 [2021-05-18T13:47:28.746Z] 	at org.eclipse.ease.debugging.AbstractEaseDebugger.suspend(AbstractEaseDebugger.java:255)
09:47:28 [2021-05-18T13:47:28.746Z] 	at org.eclipse.ease.debugging.AbstractEaseDebugger.processLine(AbstractEaseDebugger.java:490)
09:47:28 [2021-05-18T13:47:28.746Z] 	at org.eclipse.ease.lang.javascript.rhino.debugger.RhinoDebugger.access$4(RhinoDebugger.java:1)
09:47:28 [2021-05-18T13:47:28.746Z] 	at org.eclipse.ease.lang.javascript.rhino.debugger.RhinoDebugger$RhinoDebugFrame.onLineChange(RhinoDebugger.java:122)
09:47:28 [2021-05-18T13:47:28.746Z] 	at org.mozilla.javascript.Interpreter.interpretLoop(Interpreter.java:1931)
09:47:28 [2021-05-18T13:47:28.746Z] 	at org.mozilla.javascript.Interpreter.interpret(Interpreter.java:911)
09:47:28 [2021-05-18T13:47:28.746Z] 	at org.mozilla.javascript.InterpretedFunction.call(InterpretedFunction.java:109)
09:47:28 [2021-05-18T13:47:28.746Z] 	at org.mozilla.javascript.ContextFactory.doTopCall(ContextFactory.java:405)
09:47:28 [2021-05-18T13:47:28.746Z] 	at org.mozilla.javascript.ScriptRuntime.doTopCall(ScriptRuntime.java:3508)
09:47:28 [2021-05-18T13:47:28.746Z] 	at org.mozilla.javascript.InterpretedFunction.exec(InterpretedFunction.java:120)
09:47:28 [2021-05-18T13:47:28.746Z] 	at org.mozilla.javascript.Context.evaluateReader(Context.java:1293)
09:47:28 [2021-05-18T13:47:28.746Z] 	at org.eclipse.ease.lang.javascript.rhino.RhinoScriptEngine.internalExecute(RhinoScriptEngine.java:224)
09:47:28 [2021-05-18T13:47:28.746Z] 	at org.eclipse.ease.lang.javascript.rhino.RhinoScriptEngine.execute(RhinoScriptEngine.java:203)
09:47:28 [2021-05-18T13:47:28.746Z] 	at org.eclipse.ease.AbstractScriptEngine.inject(AbstractScriptEngine.java:189)
09:47:28 [2021-05-18T13:47:28.746Z] 	at org.eclipse.ease.AbstractScriptEngine.run(AbstractScriptEngine.java:242)
09:47:28 [2021-05-18T13:47:28.746Z] 	at org.eclipse.core.internal.jobs.Worker.run(Worker.java:63)
09:47:29 [2021-05-18T13:47:29.006Z] org.eclipse.ease.ScriptEngineCancellationException: Terminated on user request
09:47:29 [2021-05-18T13:47:29.006Z] 	at org.eclipse.ease.debugging.AbstractEaseDebugger.handleEventsInSuspendedState(AbstractEaseDebugger.java:329)
09:47:29 [2021-05-18T13:47:29.006Z] 	at org.eclipse.ease.debugging.AbstractEaseDebugger.suspend(AbstractEaseDebugger.java:255)
09:47:29 [2021-05-18T13:47:29.006Z] 	at org.eclipse.ease.debugging.AbstractEaseDebugger.processLine(AbstractEaseDebugger.java:490)
09:47:29 [2021-05-18T13:47:29.006Z] 	at org.eclipse.ease.lang.javascript.rhino.debugger.RhinoDebugger.access$4(RhinoDebugger.java:1)
09:47:29 [2021-05-18T13:47:29.006Z] 	at org.eclipse.ease.lang.javascript.rhino.debugger.RhinoDebugger$RhinoDebugFrame.onLineChange(RhinoDebugger.java:122)
09:47:29 [2021-05-18T13:47:29.006Z] 	at org.mozilla.javascript.Interpreter.interpretLoop(Interpreter.java:1931)
09:47:29 [2021-05-18T13:47:29.006Z] 	at org.mozilla.javascript.Interpreter.interpret(Interpreter.java:911)
09:47:29 [2021-05-18T13:47:29.006Z] 	at org.mozilla.javascript.InterpretedFunction.call(InterpretedFunction.java:109)
09:47:29 [2021-05-18T13:47:29.006Z] 	at org.mozilla.javascript.ContextFactory.doTopCall(ContextFactory.java:405)
09:47:29 [2021-05-18T13:47:29.006Z] 	at org.mozilla.javascript.ScriptRuntime.doTopCall(ScriptRuntime.java:3508)
09:47:29 [2021-05-18T13:47:29.006Z] 	at org.mozilla.javascript.InterpretedFunction.exec(InterpretedFunction.java:120)
09:47:29 [2021-05-18T13:47:29.006Z] 	at org.mozilla.javascript.Context.evaluateReader(Context.java:1293)
09:47:29 [2021-05-18T13:47:29.006Z] 	at org.eclipse.ease.lang.javascript.rhino.RhinoScriptEngine.internalExecute(RhinoScriptEngine.java:224)
09:47:29 [2021-05-18T13:47:29.006Z] 	at org.eclipse.ease.lang.javascript.rhino.RhinoScriptEngine.execute(RhinoScriptEngine.java:203)
09:47:29 [2021-05-18T13:47:29.006Z] 	at org.eclipse.ease.AbstractScriptEngine.inject(AbstractScriptEngine.java:189)
09:47:29 [2021-05-18T13:47:29.006Z] 	at org.eclipse.ease.AbstractScriptEngine.run(AbstractScriptEngine.java:242)
09:47:29 [2021-05-18T13:47:29.006Z] 	at org.eclipse.core.internal.jobs.Worker.run(Worker.java:63)
09:47:29 [2021-05-18T13:47:29.264Z] Start of script
09:47:29 [2021-05-18T13:47:29.264Z] include file start
09:47:29 [2021-05-18T13:47:29.264Z] Include file processed
09:47:29 [2021-05-18T13:47:29.264Z] line after include file
09:47:29 [2021-05-18T13:47:29.264Z] Result of testMethod = 5
09:47:29 [2021-05-18T13:47:29.264Z] End of script
09:47:29 [2021-05-18T13:47:29.264Z] Start of script
09:47:29 [2021-05-18T13:47:29.264Z] include file start
09:47:29 [2021-05-18T13:47:29.264Z] Include file processed
09:47:29 [2021-05-18T13:47:29.264Z] line after include file
09:47:29 [2021-05-18T13:47:29.522Z] Result of testMethod = 5
09:47:29 [2021-05-18T13:47:29.523Z] End of script
09:47:29 [2021-05-18T13:47:29.781Z] Start of script
09:47:29 [2021-05-18T13:47:29.781Z] include file start
09:47:29 [2021-05-18T13:47:29.781Z] Include file processed
09:47:29 [2021-05-18T13:47:29.781Z] line after include file
09:47:29 [2021-05-18T13:47:29.781Z] Result of testMethod = 5
09:47:29 [2021-05-18T13:47:29.781Z] End of script
09:47:29 [2021-05-18T13:47:29.781Z] Tests run: 42, Failures: 1, Errors: 0, Skipped: 0, Time elapsed: 11.105 s <<< FAILURE! - in org.eclipse.ease.lang.javascript.rhino.RhinoDebugTest
09:47:29 [2021-05-18T13:47:29.781Z] disconnectProcessInSuspendedState  Time elapsed: 0.35 s
09:47:29 [2021-05-18T13:47:29.781Z] stepReturnIncludeCommand  Time elapsed: 0.217 s
09:47:29 [2021-05-18T13:47:29.781Z] arrayVariableSorting  Time elapsed: 0.31 s
09:47:29 [2021-05-18T13:47:29.781Z] stepOverOnDebugTarget  Time elapsed: 0.312 s
09:47:29 [2021-05-18T13:47:29.781Z] hasDebugTarget  Time elapsed: 0.106 s
09:47:29 [2021-05-18T13:47:29.781Z] disconnectThreadInSuspendedState  Time elapsed: 0.208 s
09:47:29 [2021-05-18T13:47:29.781Z] stepReturnOnDebugTarget  Time elapsed: 0.318 s
09:47:29 [2021-05-18T13:47:29.781Z] nullVariable  Time elapsed: 0.313 s
09:47:29 [2021-05-18T13:47:29.781Z] stepOverOnStackFrame  Time elapsed: 0.217 s  <<< FAILURE!
09:47:29 [2021-05-18T13:47:29.781Z] org.opentest4j.AssertionFailedError: expected: <2> but was: <1>
09:47:29 [2021-05-18T13:47:29.781Z] 	at org.eclipse.ease.testhelper.AbstractDebugTest.stepOverTestTemplate(AbstractDebugTest.java:188)
09:47:29 [2021-05-18T13:47:29.781Z] 	at org.eclipse.ease.testhelper.AbstractDebugTest.stepOverOnStackFrame(AbstractDebugTest.java:212)
09:47:29 [2021-05-18T13:47:29.781Z] 
09:47:29 [2021-05-18T13:47:29.781Z] resumeOnDebugTarget  Time elapsed: 0.209 s
09:47:29 [2021-05-18T13:47:29.781Z] modifyVariableKeepingType  Time elapsed: 0.412 s
09:47:29 [2021-05-18T13:47:29.781Z] resumeOnLastIncludeLine  Time elapsed: 0.209 s
09:47:29 [2021-05-18T13:47:29.781Z] stepReturnOnStackFrame  Time elapsed: 0.31 s
09:47:29 [2021-05-18T13:47:29.781Z] terminateStackFrameInSuspendedState  Time elapsed: 0.21 s
09:47:29 [2021-05-18T13:47:29.781Z] breakpointLocation  Time elapsed: 0.209 s
09:47:29 [2021-05-18T13:47:29.781Z] stepReturnOnThread  Time elapsed: 0.311 s
09:47:29 [2021-05-18T13:47:29.781Z] javaClassVariable  Time elapsed: 0.312 s
09:47:29 [2021-05-18T13:47:29.781Z] stepIntoOnThread  Time elapsed: 0.309 s
09:47:29 [2021-05-18T13:47:29.781Z] terminateThreadInSuspendedState  Time elapsed: 0.209 s
09:47:29 [2021-05-18T13:47:29.781Z] resumeOnThread  Time elapsed: 0.209 s
09:47:29 [2021-05-18T13:47:29.781Z] stepIntoOnStackFrame  Time elapsed: 0.309 s
09:47:29 [2021-05-18T13:47:29.781Z] terminateProcessInSuspendedState  Time elapsed: 0.209 s
09:47:29 [2021-05-18T13:47:29.781Z] stepOverOnProcess  Time elapsed: 0.31 s
09:47:29 [2021-05-18T13:47:29.781Z] nativeArrayVariable  Time elapsed: 0.31 s
09:47:29 [2021-05-18T13:47:29.781Z] disconnectDebugTargetInSuspendedState  Time elapsed: 0.209 s
09:47:29 [2021-05-18T13:47:29.781Z] stepIntoOnProcess  Time elapsed: 0.313 s
09:47:29 [2021-05-18T13:47:29.781Z] terminatedState  Time elapsed: 0.106 s
09:47:29 [2021-05-18T13:47:29.781Z] stepOverIncludeCommand  Time elapsed: 0.31 s
09:47:29 [2021-05-18T13:47:29.781Z] innerScopeVariableBeforeOuterScopeVariable  Time elapsed: 0.309 s
09:47:29 [2021-05-18T13:47:29.781Z] stepIntoIncludeCommand  Time elapsed: 0.309 s
09:47:29 [2021-05-18T13:47:29.782Z] primitiveStringVariable  Time elapsed: 0.308 s
09:47:29 [2021-05-18T13:47:29.782Z] resumeOnProcess  Time elapsed: 0.208 s
09:47:29 [2021-05-18T13:47:29.782Z] stepIntoOnDebugTarget  Time elapsed: 0.309 s
09:47:29 [2021-05-18T13:47:29.782Z] stepOverOnThread  Time elapsed: 0.309 s
09:47:29 [2021-05-18T13:47:29.782Z] suspendedState  Time elapsed: 0.208 s
09:47:29 [2021-05-18T13:47:29.782Z] primitiveDoubleVariable  Time elapsed: 0.308 s
09:47:29 [2021-05-18T13:47:29.782Z] resumeOnStackFrame  Time elapsed: 0.207 s
09:47:29 [2021-05-18T13:47:29.782Z] nativeObjectVariable  Time elapsed: 0.308 s
09:47:29 [2021-05-18T13:47:29.782Z] terminateDebugTargetInSuspendedState  Time elapsed: 0.208 s
09:47:29 [2021-05-18T13:47:29.782Z] disconnectStackFrameInSuspendedState  Time elapsed: 0.21 s
09:47:29 [2021-05-18T13:47:29.782Z] stepReturnOnProcess  Time elapsed: 0.308 s
09:47:29 [2021-05-18T13:47:29.782Z] evaluateWatchExpression  Time elapsed: 0.237 s
09:47:29 [2021-05-18T13:47:29.782Z] 
09:47:29 [2021-05-18T13:47:29.782Z] Results:
09:47:29 [2021-05-18T13:47:29.782Z] 
09:47:29 [2021-05-18T13:47:29.782Z] Failures: 
09:47:29 [2021-05-18T13:47:29.782Z]   AbstractDebugTest.stepOverOnStackFrame:212->stepOverTestTemplate:188 expected: <2> but was: <1>
09:47:29 [2021-05-18T13:47:29.782Z] 
09:47:29 [2021-05-18T13:47:29.782Z] Tests run: 70, Failures: 1, Errors: 0, Skipped: 0
09:47:29 [2021-05-18T13:47:29.782Z] 
09:47:30 [2021-05-18T13:47:30.715Z] [INFO] ------------------------------------------------------------------------
09:47:30 [2021-05-18T13:47:30.715Z] [INFO] Reactor Summary for org.eclipse.ease.releng 0.8.0-SNAPSHOT:
09:47:30 [2021-05-18T13:47:30.716Z] [INFO] 
09:47:30 [2021-05-18T13:47:30.716Z] [INFO] org.eclipse.ease.releng ............................ SUCCESS [  0.003 s]
09:47:30 [2021-05-18T13:47:30.716Z] [INFO] org.eclipse.ease.releng.target ..................... SUCCESS [  0.262 s]
09:47:30 [2021-05-18T13:47:30.716Z] [INFO] org.eclipse.ease.test .............................. SUCCESS [ 28.990 s]
09:47:30 [2021-05-18T13:47:30.716Z] [INFO] org.eclipse.ease.lang.javascript.rhino.test ........ FAILURE [ 22.159 s]
09:47:30 [2021-05-18T13:47:30.716Z] [INFO] org.eclipse.ease.lang.javascript.test .............. SKIPPED
09:47:30 [2021-05-18T13:47:30.716Z] [INFO] org.eclipse.ease.lang.python.test .................. SKIPPED
09:47:30 [2021-05-18T13:47:30.716Z] [INFO] org.eclipse.ease.lang.python.jython.test ........... SKIPPED
09:47:30 [2021-05-18T13:47:30.716Z] [INFO] org.eclipse.ease.lang.scriptarchive.test ........... SKIPPED
09:47:30 [2021-05-18T13:47:30.716Z] [INFO] org.eclipse.ease.ui.test ........................... SKIPPED
09:47:30 [2021-05-18T13:47:30.716Z] [INFO] ------------------------------------------------------------------------
09:47:30 [2021-05-18T13:47:30.716Z] [INFO] BUILD FAILURE
09:47:30 [2021-05-18T13:47:30.716Z] [INFO] ------------------------------------------------------------------------
09:47:30 [2021-05-18T13:47:30.716Z] [INFO] Total time:  01:47 min
09:47:30 [2021-05-18T13:47:30.716Z] [INFO] Finished at: 2021-05-18T13:47:30Z
09:47:30 [2021-05-18T13:47:30.716Z] [INFO] ------------------------------------------------------------------------
09:47:30 [2021-05-18T13:47:30.716Z] [WARNING] [jenkins-event-spy] Unexpected Maven project file name 'target-tests-pom.xml', problems may occur
09:47:30 [2021-05-18T13:47:30.716Z] [INFO] [jenkins-event-spy] Generated /home/jenkins/agent/workspace/ease.verify.core.target.2019-06@tmp/withMaven448c5e6d/maven-spy-20210518-134543-9218291235873447602607.log
09:47:30 [2021-05-18T13:47:30.716Z] [ERROR] Failed to execute goal org.eclipse.tycho:tycho-surefire-plugin:2.2.0:test (default-test) on project org.eclipse.ease.lang.javascript.rhino.test: There are test failures.
09:47:30 [2021-05-18T13:47:30.716Z] [ERROR] 
09:47:30 [2021-05-18T13:47:30.716Z] [ERROR] Please refer to /home/jenkins/agent/workspace/ease.verify.core.target.2019-06/tests/org.eclipse.ease.lang.javascript.rhino.test/target/surefire-reports for the individual test results.
09:47:30 [2021-05-18T13:47:30.716Z] [ERROR] -> [Help 1]
09:47:30 [2021-05-18T13:47:30.716Z] [ERROR] 
09:47:30 [2021-05-18T13:47:30.716Z] [ERROR] To see the full stack trace of the errors, re-run Maven with the -e switch.
09:47:30 [2021-05-18T13:47:30.716Z] [ERROR] Re-run Maven using the -X switch to enable full debug logging.
09:47:30 [2021-05-18T13:47:30.716Z] [ERROR] 
09:47:30 [2021-05-18T13:47:30.716Z] [ERROR] For more information about the errors and possible solutions, please read the following articles:
09:47:30 [2021-05-18T13:47:30.716Z] [ERROR] [Help 1] http://cwiki.apache.org/confluence/display/MAVEN/MojoFailureException
09:47:30 [2021-05-18T13:47:30.716Z] [ERROR] 
09:47:30 [2021-05-18T13:47:30.716Z] [ERROR] After correcting the problems, you can resume the build with the command
09:47:30 [2021-05-18T13:47:30.716Z] [ERROR]   mvn <args> -rf :org.eclipse.ease.lang.javascript.rhino.test
[Pipeline] }
09:47:31 [2021-05-18T13:47:31.312Z] [withMaven] junitPublisher - Archive test results for Maven artifact org.eclipse.ease:org.eclipse.ease.test:eclipse-test-plugin:0.8.0-SNAPSHOT generated by tycho-surefire-plugin:test (default-test): tests/org.eclipse.ease.test/target/surefire-reports/*.xml
09:47:31 [2021-05-18T13:47:31.312Z] [withMaven] junitPublisher - Archive test results for Maven artifact org.eclipse.ease:org.eclipse.ease.lang.javascript.rhino.test:eclipse-test-plugin:0.8.0-SNAPSHOT generated by tycho-surefire-plugin:test (default-test): tests/org.eclipse.ease.lang.javascript.rhino.test/target/surefire-reports/*.xml
09:47:31 [2021-05-18T13:47:31.314Z] [withMaven] junitPublisher - Jenkins JUnit Attachments Plugin not found, can't publish test attachments.Recording test results
09:47:32 [2021-05-18T13:47:32.242Z] [withMaven] Jenkins JaCoCo Plugin not found, don't display org.jacoco:jacoco-maven-plugin:prepare-agent[-integration] results in pipeline screen.
09:47:32 [2021-05-18T13:47:32.246Z] [withMaven] Publishers: Pipeline Graph Publisher: 2 ms, Junit Publisher: 917 ms, Jacoco Publisher: 1 ms
[Pipeline] // withMaven
[Pipeline] }
[Pipeline] // stage
[Pipeline] stage
[Pipeline] { (Declarative: Post Actions)
[Pipeline] archiveArtifacts
09:47:32 [2021-05-18T13:47:32.341Z] Archiving artifacts
[Pipeline] emailext
09:47:55 [2021-05-18T13:47:55.623Z] Sending email to: christian.pontesegger@web.de
[Pipeline] }
[Pipeline] // stage
[Pipeline] }
[Pipeline] // timeout
[Pipeline] }
[Pipeline] // timestamps
[Pipeline] }
[Pipeline] // node
[Pipeline] End of Pipeline
ERROR: script returned exit code 1
Finished: FAILURE