FailedConsole Output

Skipping 831 KB.. Full Log
09:42:02 [2021-05-04T13:42:02.666Z] Result of testMethod = 5
09:42:02 [2021-05-04T13:42:02.924Z] End of script
09:42:02 [2021-05-04T13:42:02.924Z] Start of script
09:42:02 [2021-05-04T13:42:02.924Z] include file start
09:42:02 [2021-05-04T13:42:02.924Z] Include file processed
09:42:02 [2021-05-04T13:42:02.924Z] line after include file
09:42:03 [2021-05-04T13:42:03.184Z] org.eclipse.ease.ScriptEngineCancellationException: Terminated on user request
09:42:03 [2021-05-04T13:42:03.184Z] 	at org.eclipse.ease.debugging.AbstractEaseDebugger.handleEventsInSuspendedState(AbstractEaseDebugger.java:329)
09:42:03 [2021-05-04T13:42:03.184Z] 	at org.eclipse.ease.debugging.AbstractEaseDebugger.suspend(AbstractEaseDebugger.java:255)
09:42:03 [2021-05-04T13:42:03.184Z] 	at org.eclipse.ease.debugging.AbstractEaseDebugger.processLine(AbstractEaseDebugger.java:510)
09:42:03 [2021-05-04T13:42:03.184Z] 	at org.eclipse.ease.lang.javascript.rhino.debugger.RhinoDebugger.access$4(RhinoDebugger.java:1)
09:42:03 [2021-05-04T13:42:03.184Z] 	at org.eclipse.ease.lang.javascript.rhino.debugger.RhinoDebugger$RhinoDebugFrame.onLineChange(RhinoDebugger.java:122)
09:42:03 [2021-05-04T13:42:03.184Z] 	at org.mozilla.javascript.Interpreter.interpretLoop(Interpreter.java:1931)
09:42:03 [2021-05-04T13:42:03.184Z] 	at org.mozilla.javascript.Interpreter.interpret(Interpreter.java:911)
09:42:03 [2021-05-04T13:42:03.184Z] 	at org.mozilla.javascript.InterpretedFunction.call(InterpretedFunction.java:109)
09:42:03 [2021-05-04T13:42:03.184Z] 	at org.mozilla.javascript.ContextFactory.doTopCall(ContextFactory.java:405)
09:42:03 [2021-05-04T13:42:03.184Z] 	at org.mozilla.javascript.ScriptRuntime.doTopCall(ScriptRuntime.java:3508)
09:42:03 [2021-05-04T13:42:03.184Z] 	at org.mozilla.javascript.InterpretedFunction.exec(InterpretedFunction.java:120)
09:42:03 [2021-05-04T13:42:03.184Z] 	at org.mozilla.javascript.Context.evaluateReader(Context.java:1293)
09:42:03 [2021-05-04T13:42:03.184Z] 	at org.eclipse.ease.lang.javascript.rhino.RhinoScriptEngine.internalExecute(RhinoScriptEngine.java:224)
09:42:03 [2021-05-04T13:42:03.184Z] 	at org.eclipse.ease.lang.javascript.rhino.RhinoScriptEngine.execute(RhinoScriptEngine.java:203)
09:42:03 [2021-05-04T13:42:03.184Z] 	at org.eclipse.ease.AbstractScriptEngine.inject(AbstractScriptEngine.java:189)
09:42:03 [2021-05-04T13:42:03.184Z] 	at org.eclipse.ease.AbstractScriptEngine.run(AbstractScriptEngine.java:242)
09:42:03 [2021-05-04T13:42:03.184Z] 	at org.eclipse.core.internal.jobs.Worker.run(Worker.java:63)
09:42:03 [2021-05-04T13:42:03.443Z] Start of script
09:42:03 [2021-05-04T13:42:03.443Z] include file start
09:42:03 [2021-05-04T13:42:03.443Z] Include file processed
09:42:03 [2021-05-04T13:42:03.443Z] line after include file
09:42:03 [2021-05-04T13:42:03.443Z] Result of testMethod = 5
09:42:03 [2021-05-04T13:42:03.443Z] End of script
09:42:03 [2021-05-04T13:42:03.701Z] Start of script
09:42:03 [2021-05-04T13:42:03.702Z] include file start
09:42:03 [2021-05-04T13:42:03.702Z] Include file processed
09:42:03 [2021-05-04T13:42:03.702Z] line after include file
09:42:03 [2021-05-04T13:42:03.702Z] Result of testMethod = 5
09:42:03 [2021-05-04T13:42:03.702Z] End of script
09:42:03 [2021-05-04T13:42:03.960Z] org.eclipse.ease.ScriptEngineCancellationException: Terminated on user request
09:42:03 [2021-05-04T13:42:03.960Z] 	at org.eclipse.ease.debugging.AbstractEaseDebugger.handleEventsInSuspendedState(AbstractEaseDebugger.java:329)
09:42:03 [2021-05-04T13:42:03.960Z] 	at org.eclipse.ease.debugging.AbstractEaseDebugger.suspend(AbstractEaseDebugger.java:255)
09:42:03 [2021-05-04T13:42:03.960Z] 	at org.eclipse.ease.debugging.AbstractEaseDebugger.processLine(AbstractEaseDebugger.java:490)
09:42:03 [2021-05-04T13:42:03.960Z] 	at org.eclipse.ease.lang.javascript.rhino.debugger.RhinoDebugger.access$4(RhinoDebugger.java:1)
09:42:03 [2021-05-04T13:42:03.960Z] 	at org.eclipse.ease.lang.javascript.rhino.debugger.RhinoDebugger$RhinoDebugFrame.onLineChange(RhinoDebugger.java:122)
09:42:03 [2021-05-04T13:42:03.960Z] 	at org.mozilla.javascript.Interpreter.interpretLoop(Interpreter.java:1931)
09:42:03 [2021-05-04T13:42:03.960Z] 	at org.mozilla.javascript.Interpreter.interpret(Interpreter.java:911)
09:42:03 [2021-05-04T13:42:03.960Z] 	at org.mozilla.javascript.InterpretedFunction.call(InterpretedFunction.java:109)
09:42:03 [2021-05-04T13:42:03.960Z] 	at org.mozilla.javascript.ContextFactory.doTopCall(ContextFactory.java:405)
09:42:03 [2021-05-04T13:42:03.960Z] 	at org.mozilla.javascript.ScriptRuntime.doTopCall(ScriptRuntime.java:3508)
09:42:03 [2021-05-04T13:42:03.960Z] 	at org.mozilla.javascript.InterpretedFunction.exec(InterpretedFunction.java:120)
09:42:03 [2021-05-04T13:42:03.960Z] 	at org.mozilla.javascript.Context.evaluateReader(Context.java:1293)
09:42:03 [2021-05-04T13:42:03.960Z] 	at org.eclipse.ease.lang.javascript.rhino.RhinoScriptEngine.internalExecute(RhinoScriptEngine.java:224)
09:42:03 [2021-05-04T13:42:03.960Z] 	at org.eclipse.ease.lang.javascript.rhino.RhinoScriptEngine.execute(RhinoScriptEngine.java:203)
09:42:03 [2021-05-04T13:42:03.960Z] 	at org.eclipse.ease.AbstractScriptEngine.inject(AbstractScriptEngine.java:189)
09:42:03 [2021-05-04T13:42:03.960Z] 	at org.eclipse.ease.AbstractScriptEngine.run(AbstractScriptEngine.java:242)
09:42:03 [2021-05-04T13:42:03.960Z] 	at org.eclipse.core.internal.jobs.Worker.run(Worker.java:63)
09:42:04 [2021-05-04T13:42:04.218Z] Start of script
09:42:04 [2021-05-04T13:42:04.218Z] include file start
09:42:04 [2021-05-04T13:42:04.218Z] Include file processed
09:42:04 [2021-05-04T13:42:04.219Z] line after include file
09:42:04 [2021-05-04T13:42:04.219Z] Result of testMethod = 5
09:42:04 [2021-05-04T13:42:04.219Z] End of script
09:42:04 [2021-05-04T13:42:04.219Z] Start of script
09:42:04 [2021-05-04T13:42:04.219Z] include file start
09:42:04 [2021-05-04T13:42:04.219Z] Include file processed
09:42:04 [2021-05-04T13:42:04.219Z] line after include file
09:42:04 [2021-05-04T13:42:04.477Z] Result of testMethod = 5
09:42:04 [2021-05-04T13:42:04.477Z] End of script
09:42:04 [2021-05-04T13:42:04.735Z] Start of script
09:42:04 [2021-05-04T13:42:04.735Z] include file start
09:42:04 [2021-05-04T13:42:04.735Z] Include file processed
09:42:04 [2021-05-04T13:42:04.735Z] line after include file
09:42:04 [2021-05-04T13:42:04.735Z] Result of testMethod = 5
09:42:04 [2021-05-04T13:42:04.735Z] org.eclipse.ease.ScriptEngineCancellationException: Terminated on user request
09:42:04 [2021-05-04T13:42:04.735Z] 	at org.eclipse.ease.debugging.AbstractEaseDebugger.handleEventsInSuspendedState(AbstractEaseDebugger.java:329)
09:42:04 [2021-05-04T13:42:04.735Z] 	at org.eclipse.ease.debugging.AbstractEaseDebugger.suspend(AbstractEaseDebugger.java:255)
09:42:04 [2021-05-04T13:42:04.736Z] 	at org.eclipse.ease.debugging.AbstractEaseDebugger.processLine(AbstractEaseDebugger.java:490)
09:42:04 [2021-05-04T13:42:04.736Z] 	at org.eclipse.ease.lang.javascript.rhino.debugger.RhinoDebugger.access$4(RhinoDebugger.java:1)
09:42:04 [2021-05-04T13:42:04.736Z] 	at org.eclipse.ease.lang.javascript.rhino.debugger.RhinoDebugger$RhinoDebugFrame.onLineChange(RhinoDebugger.java:122)
09:42:04 [2021-05-04T13:42:04.736Z] 	at org.mozilla.javascript.Interpreter.interpretLoop(Interpreter.java:1931)
09:42:04 [2021-05-04T13:42:04.736Z] 	at org.mozilla.javascript.Interpreter.interpret(Interpreter.java:911)
09:42:04 [2021-05-04T13:42:04.736Z] 	at org.mozilla.javascript.InterpretedFunction.call(InterpretedFunction.java:109)
09:42:04 [2021-05-04T13:42:04.736Z] 	at org.mozilla.javascript.ContextFactory.doTopCall(ContextFactory.java:405)
09:42:04 [2021-05-04T13:42:04.736Z] 	at org.mozilla.javascript.ScriptRuntime.doTopCall(ScriptRuntime.java:3508)
09:42:04 [2021-05-04T13:42:04.736Z] 	at org.mozilla.javascript.InterpretedFunction.exec(InterpretedFunction.java:120)
09:42:04 [2021-05-04T13:42:04.736Z] 	at org.mozilla.javascript.Context.evaluateReader(Context.java:1293)
09:42:04 [2021-05-04T13:42:04.736Z] 	at org.eclipse.ease.lang.javascript.rhino.RhinoScriptEngine.internalExecute(RhinoScriptEngine.java:224)
09:42:04 [2021-05-04T13:42:04.736Z] 	at org.eclipse.ease.lang.javascript.rhino.RhinoScriptEngine.execute(RhinoScriptEngine.java:203)
09:42:04 [2021-05-04T13:42:04.736Z] 	at org.eclipse.ease.AbstractScriptEngine.inject(AbstractScriptEngine.java:189)
09:42:04 [2021-05-04T13:42:04.736Z] 	at org.eclipse.ease.AbstractScriptEngine.run(AbstractScriptEngine.java:242)
09:42:04 [2021-05-04T13:42:04.736Z] 	at org.eclipse.core.internal.jobs.Worker.run(Worker.java:63)
09:42:04 [2021-05-04T13:42:04.993Z] Start of script
09:42:04 [2021-05-04T13:42:04.994Z] include file start
09:42:04 [2021-05-04T13:42:04.994Z] Include file processed
09:42:04 [2021-05-04T13:42:04.994Z] line after include file
09:42:05 [2021-05-04T13:42:05.252Z] Result of testMethod = 5
09:42:05 [2021-05-04T13:42:05.252Z] End of script
09:42:05 [2021-05-04T13:42:05.252Z] org.eclipse.ease.ScriptEngineCancellationException: Terminated on user request
09:42:05 [2021-05-04T13:42:05.252Z] 	at org.eclipse.ease.debugging.AbstractEaseDebugger.handleEventsInSuspendedState(AbstractEaseDebugger.java:329)
09:42:05 [2021-05-04T13:42:05.252Z] 	at org.eclipse.ease.debugging.AbstractEaseDebugger.suspend(AbstractEaseDebugger.java:255)
09:42:05 [2021-05-04T13:42:05.252Z] 	at org.eclipse.ease.debugging.AbstractEaseDebugger.processLine(AbstractEaseDebugger.java:490)
09:42:05 [2021-05-04T13:42:05.252Z] 	at org.eclipse.ease.lang.javascript.rhino.debugger.RhinoDebugger.access$4(RhinoDebugger.java:1)
09:42:05 [2021-05-04T13:42:05.252Z] 	at org.eclipse.ease.lang.javascript.rhino.debugger.RhinoDebugger$RhinoDebugFrame.onLineChange(RhinoDebugger.java:122)
09:42:05 [2021-05-04T13:42:05.252Z] 	at org.mozilla.javascript.Interpreter.interpretLoop(Interpreter.java:1931)
09:42:05 [2021-05-04T13:42:05.253Z] 	at org.mozilla.javascript.Interpreter.interpret(Interpreter.java:911)
09:42:05 [2021-05-04T13:42:05.253Z] 	at org.mozilla.javascript.InterpretedFunction.call(InterpretedFunction.java:109)
09:42:05 [2021-05-04T13:42:05.253Z] 	at org.mozilla.javascript.ContextFactory.doTopCall(ContextFactory.java:405)
09:42:05 [2021-05-04T13:42:05.253Z] 	at org.mozilla.javascript.ScriptRuntime.doTopCall(ScriptRuntime.java:3508)
09:42:05 [2021-05-04T13:42:05.253Z] 	at org.mozilla.javascript.InterpretedFunction.exec(InterpretedFunction.java:120)
09:42:05 [2021-05-04T13:42:05.253Z] 	at org.mozilla.javascript.Context.evaluateReader(Context.java:1293)
09:42:05 [2021-05-04T13:42:05.253Z] 	at org.eclipse.ease.lang.javascript.rhino.RhinoScriptEngine.internalExecute(RhinoScriptEngine.java:224)
09:42:05 [2021-05-04T13:42:05.253Z] 	at org.eclipse.ease.lang.javascript.rhino.RhinoScriptEngine.execute(RhinoScriptEngine.java:203)
09:42:05 [2021-05-04T13:42:05.253Z] 	at org.eclipse.ease.AbstractScriptEngine.inject(AbstractScriptEngine.java:189)
09:42:05 [2021-05-04T13:42:05.253Z] 	at org.eclipse.ease.AbstractScriptEngine.run(AbstractScriptEngine.java:242)
09:42:05 [2021-05-04T13:42:05.253Z] 	at org.eclipse.core.internal.jobs.Worker.run(Worker.java:63)
09:42:05 [2021-05-04T13:42:05.511Z] Start of script
09:42:05 [2021-05-04T13:42:05.511Z] include file start
09:42:05 [2021-05-04T13:42:05.511Z] Include file processed
09:42:05 [2021-05-04T13:42:05.511Z] line after include file
09:42:05 [2021-05-04T13:42:05.511Z] Result of testMethod = 5
09:42:05 [2021-05-04T13:42:05.511Z] End of script
09:42:05 [2021-05-04T13:42:05.769Z] Start of script
09:42:05 [2021-05-04T13:42:05.769Z] include file start
09:42:05 [2021-05-04T13:42:05.769Z] Include file processed
09:42:05 [2021-05-04T13:42:05.769Z] line after include file
09:42:05 [2021-05-04T13:42:05.769Z] Result of testMethod = 5
09:42:05 [2021-05-04T13:42:05.769Z] End of script
09:42:06 [2021-05-04T13:42:06.027Z] org.eclipse.ease.ScriptEngineCancellationException: Terminated on user request
09:42:06 [2021-05-04T13:42:06.027Z] 	at org.eclipse.ease.debugging.AbstractEaseDebugger.handleEventsInSuspendedState(AbstractEaseDebugger.java:329)
09:42:06 [2021-05-04T13:42:06.027Z] 	at org.eclipse.ease.debugging.AbstractEaseDebugger.suspend(AbstractEaseDebugger.java:255)
09:42:06 [2021-05-04T13:42:06.027Z] 	at org.eclipse.ease.debugging.AbstractEaseDebugger.processLine(AbstractEaseDebugger.java:490)
09:42:06 [2021-05-04T13:42:06.028Z] 	at org.eclipse.ease.lang.javascript.rhino.debugger.RhinoDebugger.access$4(RhinoDebugger.java:1)
09:42:06 [2021-05-04T13:42:06.028Z] 	at org.eclipse.ease.lang.javascript.rhino.debugger.RhinoDebugger$RhinoDebugFrame.onLineChange(RhinoDebugger.java:122)
09:42:06 [2021-05-04T13:42:06.028Z] 	at org.mozilla.javascript.Interpreter.interpretLoop(Interpreter.java:1931)
09:42:06 [2021-05-04T13:42:06.028Z] 	at org.mozilla.javascript.Interpreter.interpret(Interpreter.java:911)
09:42:06 [2021-05-04T13:42:06.028Z] 	at org.mozilla.javascript.InterpretedFunction.call(InterpretedFunction.java:109)
09:42:06 [2021-05-04T13:42:06.028Z] 	at org.mozilla.javascript.ContextFactory.doTopCall(ContextFactory.java:405)
09:42:06 [2021-05-04T13:42:06.028Z] 	at org.mozilla.javascript.ScriptRuntime.doTopCall(ScriptRuntime.java:3508)
09:42:06 [2021-05-04T13:42:06.028Z] 	at org.mozilla.javascript.InterpretedFunction.exec(InterpretedFunction.java:120)
09:42:06 [2021-05-04T13:42:06.028Z] 	at org.mozilla.javascript.Context.evaluateReader(Context.java:1293)
09:42:06 [2021-05-04T13:42:06.028Z] 	at org.eclipse.ease.lang.javascript.rhino.RhinoScriptEngine.internalExecute(RhinoScriptEngine.java:224)
09:42:06 [2021-05-04T13:42:06.028Z] 	at org.eclipse.ease.lang.javascript.rhino.RhinoScriptEngine.execute(RhinoScriptEngine.java:203)
09:42:06 [2021-05-04T13:42:06.028Z] 	at org.eclipse.ease.AbstractScriptEngine.inject(AbstractScriptEngine.java:189)
09:42:06 [2021-05-04T13:42:06.028Z] 	at org.eclipse.ease.AbstractScriptEngine.run(AbstractScriptEngine.java:242)
09:42:06 [2021-05-04T13:42:06.028Z] 	at org.eclipse.core.internal.jobs.Worker.run(Worker.java:63)
09:42:06 [2021-05-04T13:42:06.286Z] Start of script
09:42:06 [2021-05-04T13:42:06.286Z] include file start
09:42:06 [2021-05-04T13:42:06.286Z] Include file processed
09:42:06 [2021-05-04T13:42:06.286Z] line after include file
09:42:06 [2021-05-04T13:42:06.286Z] Result of testMethod = 5
09:42:06 [2021-05-04T13:42:06.286Z] End of script
09:42:06 [2021-05-04T13:42:06.544Z] Start of script
09:42:06 [2021-05-04T13:42:06.544Z] include file start
09:42:06 [2021-05-04T13:42:06.544Z] Include file processed
09:42:06 [2021-05-04T13:42:06.544Z] line after include file
09:42:06 [2021-05-04T13:42:06.544Z] Result of testMethod = 5
09:42:06 [2021-05-04T13:42:06.803Z] WARNING: An illegal reflective access operation has occurred
09:42:06 [2021-05-04T13:42:06.803Z] WARNING: Illegal reflective access by org.eclipse.ease.debugging.model.EaseDebugValue (file:/home/jenkins/agent/workspace/ease.verify.core.target.2019-06/plugins/org.eclipse.ease/target/org.eclipse.ease-0.8.0-SNAPSHOT.jar) to field java.lang.String.hash
09:42:06 [2021-05-04T13:42:06.803Z] WARNING: Please consider reporting this to the maintainers of org.eclipse.ease.debugging.model.EaseDebugValue
09:42:06 [2021-05-04T13:42:06.803Z] WARNING: Use --illegal-access=warn to enable warnings of further illegal reflective access operations
09:42:06 [2021-05-04T13:42:06.803Z] WARNING: All illegal access operations will be denied in a future release
09:42:06 [2021-05-04T13:42:06.803Z] org.eclipse.ease.ScriptEngineCancellationException: Terminated on user request
09:42:06 [2021-05-04T13:42:06.803Z] 	at org.eclipse.ease.debugging.AbstractEaseDebugger.handleEventsInSuspendedState(AbstractEaseDebugger.java:329)
09:42:06 [2021-05-04T13:42:06.803Z] 	at org.eclipse.ease.debugging.AbstractEaseDebugger.suspend(AbstractEaseDebugger.java:255)
09:42:06 [2021-05-04T13:42:06.803Z] 	at org.eclipse.ease.debugging.AbstractEaseDebugger.processLine(AbstractEaseDebugger.java:490)
09:42:06 [2021-05-04T13:42:06.803Z] 	at org.eclipse.ease.lang.javascript.rhino.debugger.RhinoDebugger.access$4(RhinoDebugger.java:1)
09:42:06 [2021-05-04T13:42:06.803Z] 	at org.eclipse.ease.lang.javascript.rhino.debugger.RhinoDebugger$RhinoDebugFrame.onLineChange(RhinoDebugger.java:122)
09:42:06 [2021-05-04T13:42:06.803Z] 	at org.mozilla.javascript.Interpreter.interpretLoop(Interpreter.java:1931)
09:42:06 [2021-05-04T13:42:06.803Z] 	at org.mozilla.javascript.Interpreter.interpret(Interpreter.java:911)
09:42:06 [2021-05-04T13:42:06.803Z] 	at org.mozilla.javascript.InterpretedFunction.call(InterpretedFunction.java:109)
09:42:06 [2021-05-04T13:42:06.803Z] 	at org.mozilla.javascript.ContextFactory.doTopCall(ContextFactory.java:405)
09:42:06 [2021-05-04T13:42:06.803Z] 	at org.mozilla.javascript.ScriptRuntime.doTopCall(ScriptRuntime.java:3508)
09:42:06 [2021-05-04T13:42:06.803Z] 	at org.mozilla.javascript.InterpretedFunction.exec(InterpretedFunction.java:120)
09:42:06 [2021-05-04T13:42:06.803Z] 	at org.mozilla.javascript.Context.evaluateReader(Context.java:1293)
09:42:06 [2021-05-04T13:42:06.803Z] 	at org.eclipse.ease.lang.javascript.rhino.RhinoScriptEngine.internalExecute(RhinoScriptEngine.java:224)
09:42:06 [2021-05-04T13:42:06.803Z] 	at org.eclipse.ease.lang.javascript.rhino.RhinoScriptEngine.execute(RhinoScriptEngine.java:203)
09:42:06 [2021-05-04T13:42:06.803Z] 	at org.eclipse.ease.AbstractScriptEngine.inject(AbstractScriptEngine.java:189)
09:42:06 [2021-05-04T13:42:06.803Z] 	at org.eclipse.ease.AbstractScriptEngine.run(AbstractScriptEngine.java:242)
09:42:06 [2021-05-04T13:42:06.803Z] 	at org.eclipse.core.internal.jobs.Worker.run(Worker.java:63)
09:42:06 [2021-05-04T13:42:06.803Z] Start of script
09:42:06 [2021-05-04T13:42:06.803Z] include file start
09:42:06 [2021-05-04T13:42:06.803Z] Include file processed
09:42:06 [2021-05-04T13:42:06.803Z] line after include file
09:42:06 [2021-05-04T13:42:06.803Z] Result of testMethod = 5
09:42:06 [2021-05-04T13:42:06.803Z] End of script
09:42:07 [2021-05-04T13:42:07.061Z] Start of script
09:42:07 [2021-05-04T13:42:07.061Z] include file start
09:42:07 [2021-05-04T13:42:07.061Z] Include file processed
09:42:07 [2021-05-04T13:42:07.061Z] line after include file
09:42:07 [2021-05-04T13:42:07.319Z] Result of testMethod = 5
09:42:07 [2021-05-04T13:42:07.320Z] End of script
09:42:07 [2021-05-04T13:42:07.320Z] Start of script
09:42:07 [2021-05-04T13:42:07.320Z] include file start
09:42:07 [2021-05-04T13:42:07.320Z] Include file processed
09:42:07 [2021-05-04T13:42:07.320Z] line after include file
09:42:07 [2021-05-04T13:42:07.320Z] Result of testMethod = 5
09:42:07 [2021-05-04T13:42:07.320Z] End of script
09:42:07 [2021-05-04T13:42:07.584Z] Start of script
09:42:07 [2021-05-04T13:42:07.584Z] include file start
09:42:07 [2021-05-04T13:42:07.584Z] Include file processed
09:42:07 [2021-05-04T13:42:07.584Z] line after include file
09:42:07 [2021-05-04T13:42:07.584Z] Result of testMethod = 5
09:42:07 [2021-05-04T13:42:07.584Z] End of script
09:42:07 [2021-05-04T13:42:07.843Z] Start of script
09:42:07 [2021-05-04T13:42:07.843Z] include file start
09:42:07 [2021-05-04T13:42:07.843Z] Include file processed
09:42:07 [2021-05-04T13:42:07.843Z] line after include file
09:42:07 [2021-05-04T13:42:07.843Z] org.eclipse.ease.ScriptEngineCancellationException: Terminated on user request
09:42:07 [2021-05-04T13:42:07.843Z] 	at org.eclipse.ease.debugging.AbstractEaseDebugger.handleEventsInSuspendedState(AbstractEaseDebugger.java:329)
09:42:07 [2021-05-04T13:42:07.843Z] 	at org.eclipse.ease.debugging.AbstractEaseDebugger.suspend(AbstractEaseDebugger.java:255)
09:42:07 [2021-05-04T13:42:07.843Z] 	at org.eclipse.ease.debugging.AbstractEaseDebugger.processLine(AbstractEaseDebugger.java:490)
09:42:07 [2021-05-04T13:42:07.843Z] 	at org.eclipse.ease.lang.javascript.rhino.debugger.RhinoDebugger.access$4(RhinoDebugger.java:1)
09:42:07 [2021-05-04T13:42:07.843Z] 	at org.eclipse.ease.lang.javascript.rhino.debugger.RhinoDebugger$RhinoDebugFrame.onLineChange(RhinoDebugger.java:122)
09:42:07 [2021-05-04T13:42:07.843Z] 	at org.mozilla.javascript.Interpreter.interpretLoop(Interpreter.java:1931)
09:42:07 [2021-05-04T13:42:07.843Z] 	at org.mozilla.javascript.Interpreter.interpret(Interpreter.java:911)
09:42:07 [2021-05-04T13:42:07.843Z] 	at org.mozilla.javascript.InterpretedFunction.call(InterpretedFunction.java:109)
09:42:07 [2021-05-04T13:42:07.843Z] 	at org.mozilla.javascript.ContextFactory.doTopCall(ContextFactory.java:405)
09:42:07 [2021-05-04T13:42:07.843Z] 	at org.mozilla.javascript.ScriptRuntime.doTopCall(ScriptRuntime.java:3508)
09:42:07 [2021-05-04T13:42:07.843Z] 	at org.mozilla.javascript.InterpretedFunction.exec(InterpretedFunction.java:120)
09:42:07 [2021-05-04T13:42:07.843Z] 	at org.mozilla.javascript.Context.evaluateReader(Context.java:1293)
09:42:07 [2021-05-04T13:42:07.843Z] 	at org.eclipse.ease.lang.javascript.rhino.RhinoScriptEngine.internalExecute(RhinoScriptEngine.java:224)
09:42:07 [2021-05-04T13:42:07.843Z] 	at org.eclipse.ease.lang.javascript.rhino.RhinoScriptEngine.execute(RhinoScriptEngine.java:203)
09:42:07 [2021-05-04T13:42:07.843Z] 	at org.eclipse.ease.AbstractScriptEngine.inject(AbstractScriptEngine.java:189)
09:42:07 [2021-05-04T13:42:07.843Z] 	at org.eclipse.ease.AbstractScriptEngine.run(AbstractScriptEngine.java:242)
09:42:07 [2021-05-04T13:42:07.843Z] 	at org.eclipse.core.internal.jobs.Worker.run(Worker.java:63)
09:42:08 [2021-05-04T13:42:08.102Z] Start of script
09:42:08 [2021-05-04T13:42:08.361Z] include file start
09:42:08 [2021-05-04T13:42:08.361Z] Include file processed
09:42:08 [2021-05-04T13:42:08.361Z] line after include file
09:42:08 [2021-05-04T13:42:08.361Z] Result of testMethod = 5
09:42:08 [2021-05-04T13:42:08.361Z] End of script
09:42:08 [2021-05-04T13:42:08.361Z] Start of script
09:42:08 [2021-05-04T13:42:08.361Z] include file start
09:42:08 [2021-05-04T13:42:08.361Z] Include file processed
09:42:08 [2021-05-04T13:42:08.361Z] line after include file
09:42:08 [2021-05-04T13:42:08.361Z] Result of testMethod = 5
09:42:08 [2021-05-04T13:42:08.621Z] org.eclipse.ease.ScriptEngineCancellationException: Terminated on user request
09:42:08 [2021-05-04T13:42:08.621Z] 	at org.eclipse.ease.debugging.AbstractEaseDebugger.handleEventsInSuspendedState(AbstractEaseDebugger.java:329)
09:42:08 [2021-05-04T13:42:08.621Z] 	at org.eclipse.ease.debugging.AbstractEaseDebugger.suspend(AbstractEaseDebugger.java:255)
09:42:08 [2021-05-04T13:42:08.621Z] 	at org.eclipse.ease.debugging.AbstractEaseDebugger.processLine(AbstractEaseDebugger.java:490)
09:42:08 [2021-05-04T13:42:08.621Z] 	at org.eclipse.ease.lang.javascript.rhino.debugger.RhinoDebugger.access$4(RhinoDebugger.java:1)
09:42:08 [2021-05-04T13:42:08.621Z] 	at org.eclipse.ease.lang.javascript.rhino.debugger.RhinoDebugger$RhinoDebugFrame.onLineChange(RhinoDebugger.java:122)
09:42:08 [2021-05-04T13:42:08.621Z] 	at org.mozilla.javascript.Interpreter.interpretLoop(Interpreter.java:1931)
09:42:08 [2021-05-04T13:42:08.621Z] 	at org.mozilla.javascript.Interpreter.interpret(Interpreter.java:911)
09:42:08 [2021-05-04T13:42:08.621Z] 	at org.mozilla.javascript.InterpretedFunction.call(InterpretedFunction.java:109)
09:42:08 [2021-05-04T13:42:08.621Z] 	at org.mozilla.javascript.ContextFactory.doTopCall(ContextFactory.java:405)
09:42:08 [2021-05-04T13:42:08.621Z] 	at org.mozilla.javascript.ScriptRuntime.doTopCall(ScriptRuntime.java:3508)
09:42:08 [2021-05-04T13:42:08.621Z] 	at org.mozilla.javascript.InterpretedFunction.exec(InterpretedFunction.java:120)
09:42:08 [2021-05-04T13:42:08.621Z] 	at org.mozilla.javascript.Context.evaluateReader(Context.java:1293)
09:42:08 [2021-05-04T13:42:08.621Z] 	at org.eclipse.ease.lang.javascript.rhino.RhinoScriptEngine.internalExecute(RhinoScriptEngine.java:224)
09:42:08 [2021-05-04T13:42:08.621Z] 	at org.eclipse.ease.lang.javascript.rhino.RhinoScriptEngine.execute(RhinoScriptEngine.java:203)
09:42:08 [2021-05-04T13:42:08.621Z] 	at org.eclipse.ease.AbstractScriptEngine.inject(AbstractScriptEngine.java:189)
09:42:08 [2021-05-04T13:42:08.621Z] 	at org.eclipse.ease.AbstractScriptEngine.run(AbstractScriptEngine.java:242)
09:42:08 [2021-05-04T13:42:08.621Z] 	at org.eclipse.core.internal.jobs.Worker.run(Worker.java:63)
09:42:08 [2021-05-04T13:42:08.621Z] Start of script
09:42:08 [2021-05-04T13:42:08.621Z] include file start
09:42:08 [2021-05-04T13:42:08.621Z] Include file processed
09:42:08 [2021-05-04T13:42:08.621Z] line after include file
09:42:08 [2021-05-04T13:42:08.621Z] Result of testMethod = 5
09:42:08 [2021-05-04T13:42:08.881Z] End of script
09:42:08 [2021-05-04T13:42:08.881Z] Start of script
09:42:08 [2021-05-04T13:42:08.881Z] include file start
09:42:08 [2021-05-04T13:42:08.881Z] Include file processed
09:42:08 [2021-05-04T13:42:08.881Z] line after include file
09:42:09 [2021-05-04T13:42:09.145Z] Result of testMethod = 5
09:42:09 [2021-05-04T13:42:09.145Z] End of script
09:42:09 [2021-05-04T13:42:09.145Z] Start of script
09:42:09 [2021-05-04T13:42:09.145Z] include file start
09:42:09 [2021-05-04T13:42:09.145Z] Include file processed
09:42:09 [2021-05-04T13:42:09.145Z] line after include file
09:42:09 [2021-05-04T13:42:09.406Z] Result of testMethod = 5
09:42:09 [2021-05-04T13:42:09.406Z] End of script
09:42:09 [2021-05-04T13:42:09.665Z] Start of script
09:42:09 [2021-05-04T13:42:09.665Z] include file start
09:42:09 [2021-05-04T13:42:09.665Z] Include file processed
09:42:09 [2021-05-04T13:42:09.665Z] line after include file
09:42:09 [2021-05-04T13:42:09.665Z] Result of testMethod = 5
09:42:09 [2021-05-04T13:42:09.665Z] End of script
09:42:09 [2021-05-04T13:42:09.665Z] Start of script
09:42:09 [2021-05-04T13:42:09.665Z] include file start
09:42:09 [2021-05-04T13:42:09.665Z] Include file processed
09:42:09 [2021-05-04T13:42:09.665Z] line after include file
09:42:09 [2021-05-04T13:42:09.665Z] Result of testMethod = 5
09:42:09 [2021-05-04T13:42:09.923Z] org.eclipse.ease.ScriptEngineCancellationException: Terminated on user request
09:42:09 [2021-05-04T13:42:09.923Z] 	at org.eclipse.ease.debugging.AbstractEaseDebugger.handleEventsInSuspendedState(AbstractEaseDebugger.java:329)
09:42:09 [2021-05-04T13:42:09.923Z] 	at org.eclipse.ease.debugging.AbstractEaseDebugger.suspend(AbstractEaseDebugger.java:255)
09:42:09 [2021-05-04T13:42:09.923Z] 	at org.eclipse.ease.debugging.AbstractEaseDebugger.processLine(AbstractEaseDebugger.java:490)
09:42:09 [2021-05-04T13:42:09.923Z] 	at org.eclipse.ease.lang.javascript.rhino.debugger.RhinoDebugger.access$4(RhinoDebugger.java:1)
09:42:09 [2021-05-04T13:42:09.923Z] 	at org.eclipse.ease.lang.javascript.rhino.debugger.RhinoDebugger$RhinoDebugFrame.onLineChange(RhinoDebugger.java:122)
09:42:09 [2021-05-04T13:42:09.923Z] 	at org.mozilla.javascript.Interpreter.interpretLoop(Interpreter.java:1931)
09:42:09 [2021-05-04T13:42:09.923Z] 	at org.mozilla.javascript.Interpreter.interpret(Interpreter.java:911)
09:42:09 [2021-05-04T13:42:09.923Z] 	at org.mozilla.javascript.InterpretedFunction.call(InterpretedFunction.java:109)
09:42:09 [2021-05-04T13:42:09.923Z] 	at org.mozilla.javascript.ContextFactory.doTopCall(ContextFactory.java:405)
09:42:09 [2021-05-04T13:42:09.923Z] 	at org.mozilla.javascript.ScriptRuntime.doTopCall(ScriptRuntime.java:3508)
09:42:09 [2021-05-04T13:42:09.923Z] 	at org.mozilla.javascript.InterpretedFunction.exec(InterpretedFunction.java:120)
09:42:09 [2021-05-04T13:42:09.923Z] 	at org.mozilla.javascript.Context.evaluateReader(Context.java:1293)
09:42:09 [2021-05-04T13:42:09.923Z] 	at org.eclipse.ease.lang.javascript.rhino.RhinoScriptEngine.internalExecute(RhinoScriptEngine.java:224)
09:42:09 [2021-05-04T13:42:09.923Z] 	at org.eclipse.ease.lang.javascript.rhino.RhinoScriptEngine.execute(RhinoScriptEngine.java:203)
09:42:09 [2021-05-04T13:42:09.923Z] 	at org.eclipse.ease.AbstractScriptEngine.inject(AbstractScriptEngine.java:189)
09:42:09 [2021-05-04T13:42:09.924Z] 	at org.eclipse.ease.AbstractScriptEngine.run(AbstractScriptEngine.java:242)
09:42:09 [2021-05-04T13:42:09.924Z] 	at org.eclipse.core.internal.jobs.Worker.run(Worker.java:63)
09:42:10 [2021-05-04T13:42:10.182Z] Start of script
09:42:10 [2021-05-04T13:42:10.182Z] include file start
09:42:10 [2021-05-04T13:42:10.182Z] Include file processed
09:42:10 [2021-05-04T13:42:10.182Z] line after include file
09:42:10 [2021-05-04T13:42:10.182Z] Result of testMethod = 5
09:42:10 [2021-05-04T13:42:10.182Z] End of script
09:42:10 [2021-05-04T13:42:10.182Z] Start of script
09:42:10 [2021-05-04T13:42:10.182Z] include file start
09:42:10 [2021-05-04T13:42:10.182Z] Include file processed
09:42:10 [2021-05-04T13:42:10.182Z] line after include file
09:42:10 [2021-05-04T13:42:10.182Z] Result of testMethod = 5
09:42:10 [2021-05-04T13:42:10.440Z] org.eclipse.ease.ScriptEngineCancellationException: Terminated on user request
09:42:10 [2021-05-04T13:42:10.440Z] 	at org.eclipse.ease.debugging.AbstractEaseDebugger.handleEventsInSuspendedState(AbstractEaseDebugger.java:329)
09:42:10 [2021-05-04T13:42:10.440Z] 	at org.eclipse.ease.debugging.AbstractEaseDebugger.suspend(AbstractEaseDebugger.java:255)
09:42:10 [2021-05-04T13:42:10.440Z] 	at org.eclipse.ease.debugging.AbstractEaseDebugger.processLine(AbstractEaseDebugger.java:490)
09:42:10 [2021-05-04T13:42:10.440Z] 	at org.eclipse.ease.lang.javascript.rhino.debugger.RhinoDebugger.access$4(RhinoDebugger.java:1)
09:42:10 [2021-05-04T13:42:10.440Z] 	at org.eclipse.ease.lang.javascript.rhino.debugger.RhinoDebugger$RhinoDebugFrame.onLineChange(RhinoDebugger.java:122)
09:42:10 [2021-05-04T13:42:10.440Z] 	at org.mozilla.javascript.Interpreter.interpretLoop(Interpreter.java:1931)
09:42:10 [2021-05-04T13:42:10.440Z] 	at org.mozilla.javascript.Interpreter.interpret(Interpreter.java:911)
09:42:10 [2021-05-04T13:42:10.440Z] 	at org.mozilla.javascript.InterpretedFunction.call(InterpretedFunction.java:109)
09:42:10 [2021-05-04T13:42:10.440Z] 	at org.mozilla.javascript.ContextFactory.doTopCall(ContextFactory.java:405)
09:42:10 [2021-05-04T13:42:10.440Z] 	at org.mozilla.javascript.ScriptRuntime.doTopCall(ScriptRuntime.java:3508)
09:42:10 [2021-05-04T13:42:10.440Z] 	at org.mozilla.javascript.InterpretedFunction.exec(InterpretedFunction.java:120)
09:42:10 [2021-05-04T13:42:10.440Z] 	at org.mozilla.javascript.Context.evaluateReader(Context.java:1293)
09:42:10 [2021-05-04T13:42:10.440Z] 	at org.eclipse.ease.lang.javascript.rhino.RhinoScriptEngine.internalExecute(RhinoScriptEngine.java:224)
09:42:10 [2021-05-04T13:42:10.440Z] 	at org.eclipse.ease.lang.javascript.rhino.RhinoScriptEngine.execute(RhinoScriptEngine.java:203)
09:42:10 [2021-05-04T13:42:10.440Z] 	at org.eclipse.ease.AbstractScriptEngine.inject(AbstractScriptEngine.java:189)
09:42:10 [2021-05-04T13:42:10.440Z] 	at org.eclipse.ease.AbstractScriptEngine.run(AbstractScriptEngine.java:242)
09:42:10 [2021-05-04T13:42:10.440Z] 	at org.eclipse.core.internal.jobs.Worker.run(Worker.java:63)
09:42:10 [2021-05-04T13:42:10.698Z] org.eclipse.ease.ScriptEngineCancellationException: Terminated on user request
09:42:10 [2021-05-04T13:42:10.698Z] 	at org.eclipse.ease.debugging.AbstractEaseDebugger.handleEventsInSuspendedState(AbstractEaseDebugger.java:329)
09:42:10 [2021-05-04T13:42:10.698Z] 	at org.eclipse.ease.debugging.AbstractEaseDebugger.suspend(AbstractEaseDebugger.java:255)
09:42:10 [2021-05-04T13:42:10.699Z] 	at org.eclipse.ease.debugging.AbstractEaseDebugger.processLine(AbstractEaseDebugger.java:490)
09:42:10 [2021-05-04T13:42:10.699Z] 	at org.eclipse.ease.lang.javascript.rhino.debugger.RhinoDebugger.access$4(RhinoDebugger.java:1)
09:42:10 [2021-05-04T13:42:10.699Z] 	at org.eclipse.ease.lang.javascript.rhino.debugger.RhinoDebugger$RhinoDebugFrame.onLineChange(RhinoDebugger.java:122)
09:42:10 [2021-05-04T13:42:10.699Z] 	at org.mozilla.javascript.Interpreter.interpretLoop(Interpreter.java:1931)
09:42:10 [2021-05-04T13:42:10.699Z] 	at org.mozilla.javascript.Interpreter.interpret(Interpreter.java:911)
09:42:10 [2021-05-04T13:42:10.699Z] 	at org.mozilla.javascript.InterpretedFunction.call(InterpretedFunction.java:109)
09:42:10 [2021-05-04T13:42:10.699Z] 	at org.mozilla.javascript.ContextFactory.doTopCall(ContextFactory.java:405)
09:42:10 [2021-05-04T13:42:10.699Z] 	at org.mozilla.javascript.ScriptRuntime.doTopCall(ScriptRuntime.java:3508)
09:42:10 [2021-05-04T13:42:10.699Z] 	at org.mozilla.javascript.InterpretedFunction.exec(InterpretedFunction.java:120)
09:42:10 [2021-05-04T13:42:10.699Z] 	at org.mozilla.javascript.Context.evaluateReader(Context.java:1293)
09:42:10 [2021-05-04T13:42:10.699Z] 	at org.eclipse.ease.lang.javascript.rhino.RhinoScriptEngine.internalExecute(RhinoScriptEngine.java:224)
09:42:10 [2021-05-04T13:42:10.699Z] 	at org.eclipse.ease.lang.javascript.rhino.RhinoScriptEngine.execute(RhinoScriptEngine.java:203)
09:42:10 [2021-05-04T13:42:10.699Z] 	at org.eclipse.ease.AbstractScriptEngine.inject(AbstractScriptEngine.java:189)
09:42:10 [2021-05-04T13:42:10.699Z] 	at org.eclipse.ease.AbstractScriptEngine.run(AbstractScriptEngine.java:242)
09:42:10 [2021-05-04T13:42:10.699Z] 	at org.eclipse.core.internal.jobs.Worker.run(Worker.java:63)
09:42:10 [2021-05-04T13:42:10.957Z] Start of script
09:42:10 [2021-05-04T13:42:10.957Z] include file start
09:42:10 [2021-05-04T13:42:10.957Z] Include file processed
09:42:10 [2021-05-04T13:42:10.957Z] line after include file
09:42:10 [2021-05-04T13:42:10.957Z] Result of testMethod = 5
09:42:10 [2021-05-04T13:42:10.957Z] End of script
09:42:10 [2021-05-04T13:42:10.957Z] Start of script
09:42:10 [2021-05-04T13:42:10.957Z] include file start
09:42:10 [2021-05-04T13:42:10.957Z] Include file processed
09:42:10 [2021-05-04T13:42:10.957Z] line after include file
09:42:11 [2021-05-04T13:42:11.215Z] Result of testMethod = 5
09:42:11 [2021-05-04T13:42:11.215Z] End of script
09:42:11 [2021-05-04T13:42:11.215Z] Start of script
09:42:11 [2021-05-04T13:42:11.215Z] include file start
09:42:11 [2021-05-04T13:42:11.215Z] Include file processed
09:42:11 [2021-05-04T13:42:11.215Z] line after include file
09:42:11 [2021-05-04T13:42:11.215Z] Result of testMethod = 5
09:42:11 [2021-05-04T13:42:11.474Z] End of script
09:42:11 [2021-05-04T13:42:11.474Z] Tests run: 42, Failures: 0, Errors: 0, Skipped: 0, Time elapsed: 11.243 s - in org.eclipse.ease.lang.javascript.rhino.RhinoDebugTest
09:42:11 [2021-05-04T13:42:11.474Z] disconnectProcessInSuspendedState  Time elapsed: 0.379 s
09:42:11 [2021-05-04T13:42:11.474Z] stepReturnIncludeCommand  Time elapsed: 0.216 s
09:42:11 [2021-05-04T13:42:11.474Z] arrayVariableSorting  Time elapsed: 0.31 s
09:42:11 [2021-05-04T13:42:11.474Z] stepOverOnDebugTarget  Time elapsed: 0.314 s
09:42:11 [2021-05-04T13:42:11.474Z] hasDebugTarget  Time elapsed: 0.107 s
09:42:11 [2021-05-04T13:42:11.474Z] disconnectThreadInSuspendedState  Time elapsed: 0.21 s
09:42:11 [2021-05-04T13:42:11.474Z] stepReturnOnDebugTarget  Time elapsed: 0.312 s
09:42:11 [2021-05-04T13:42:11.474Z] nullVariable  Time elapsed: 0.31 s
09:42:11 [2021-05-04T13:42:11.474Z] stepOverOnStackFrame  Time elapsed: 0.311 s
09:42:11 [2021-05-04T13:42:11.474Z] resumeOnDebugTarget  Time elapsed: 0.21 s
09:42:11 [2021-05-04T13:42:11.474Z] modifyVariableKeepingType  Time elapsed: 0.411 s
09:42:11 [2021-05-04T13:42:11.474Z] resumeOnLastIncludeLine  Time elapsed: 0.212 s
09:42:11 [2021-05-04T13:42:11.474Z] stepReturnOnStackFrame  Time elapsed: 0.31 s
09:42:11 [2021-05-04T13:42:11.474Z] terminateStackFrameInSuspendedState  Time elapsed: 0.209 s
09:42:11 [2021-05-04T13:42:11.474Z] breakpointLocation  Time elapsed: 0.21 s
09:42:11 [2021-05-04T13:42:11.474Z] stepReturnOnThread  Time elapsed: 0.311 s
09:42:11 [2021-05-04T13:42:11.474Z] javaClassVariable  Time elapsed: 0.313 s
09:42:11 [2021-05-04T13:42:11.474Z] stepIntoOnThread  Time elapsed: 0.311 s
09:42:11 [2021-05-04T13:42:11.474Z] terminateThreadInSuspendedState  Time elapsed: 0.209 s
09:42:11 [2021-05-04T13:42:11.474Z] resumeOnThread  Time elapsed: 0.209 s
09:42:11 [2021-05-04T13:42:11.474Z] stepIntoOnStackFrame  Time elapsed: 0.31 s
09:42:11 [2021-05-04T13:42:11.474Z] terminateProcessInSuspendedState  Time elapsed: 0.209 s
09:42:11 [2021-05-04T13:42:11.474Z] stepOverOnProcess  Time elapsed: 0.31 s
09:42:11 [2021-05-04T13:42:11.474Z] nativeArrayVariable  Time elapsed: 0.311 s
09:42:11 [2021-05-04T13:42:11.474Z] disconnectDebugTargetInSuspendedState  Time elapsed: 0.209 s
09:42:11 [2021-05-04T13:42:11.474Z] stepIntoOnProcess  Time elapsed: 0.31 s
09:42:11 [2021-05-04T13:42:11.474Z] terminatedState  Time elapsed: 0.106 s
09:42:11 [2021-05-04T13:42:11.474Z] stepOverIncludeCommand  Time elapsed: 0.31 s
09:42:11 [2021-05-04T13:42:11.474Z] innerScopeVariableBeforeOuterScopeVariable  Time elapsed: 0.312 s
09:42:11 [2021-05-04T13:42:11.474Z] stepIntoIncludeCommand  Time elapsed: 0.309 s
09:42:11 [2021-05-04T13:42:11.474Z] primitiveStringVariable  Time elapsed: 0.308 s
09:42:11 [2021-05-04T13:42:11.474Z] resumeOnProcess  Time elapsed: 0.21 s
09:42:11 [2021-05-04T13:42:11.474Z] stepIntoOnDebugTarget  Time elapsed: 0.309 s
09:42:11 [2021-05-04T13:42:11.474Z] stepOverOnThread  Time elapsed: 0.312 s
09:42:11 [2021-05-04T13:42:11.474Z] suspendedState  Time elapsed: 0.212 s
09:42:11 [2021-05-04T13:42:11.474Z] primitiveDoubleVariable  Time elapsed: 0.31 s
09:42:11 [2021-05-04T13:42:11.475Z] resumeOnStackFrame  Time elapsed: 0.207 s
09:42:11 [2021-05-04T13:42:11.475Z] nativeObjectVariable  Time elapsed: 0.308 s
09:42:11 [2021-05-04T13:42:11.475Z] terminateDebugTargetInSuspendedState  Time elapsed: 0.208 s
09:42:11 [2021-05-04T13:42:11.475Z] disconnectStackFrameInSuspendedState  Time elapsed: 0.209 s
09:42:11 [2021-05-04T13:42:11.475Z] stepReturnOnProcess  Time elapsed: 0.31 s
09:42:11 [2021-05-04T13:42:11.475Z] evaluateWatchExpression  Time elapsed: 0.24 s
09:42:11 [2021-05-04T13:42:11.475Z] 
09:42:11 [2021-05-04T13:42:11.475Z] Results:
09:42:11 [2021-05-04T13:42:11.475Z] 
09:42:11 [2021-05-04T13:42:11.475Z] Tests run: 70, Failures: 0, Errors: 0, Skipped: 0
09:42:11 [2021-05-04T13:42:11.475Z] 
09:42:18 [2021-05-04T13:42:18.035Z] [INFO] All tests passed!
09:42:18 [2021-05-04T13:42:18.035Z] [INFO] 
09:42:18 [2021-05-04T13:42:18.035Z] [INFO] --- maven-pmd-plugin:3.14.0:pmd (pmd-integration) @ org.eclipse.ease.lang.javascript.rhino.test ---
09:42:18 [2021-05-04T13:42:18.035Z] [INFO] 
09:42:18 [2021-05-04T13:42:18.035Z] [INFO] --- maven-pmd-plugin:3.14.0:cpd (pmd-integration) @ org.eclipse.ease.lang.javascript.rhino.test ---
09:42:18 [2021-05-04T13:42:18.035Z] [INFO] 
09:42:18 [2021-05-04T13:42:18.035Z] [INFO] --- spotbugs-maven-plugin:4.1.4:spotbugs (spotbugs-integration) @ org.eclipse.ease.lang.javascript.rhino.test ---
09:42:18 [2021-05-04T13:42:18.036Z] [INFO] Fork Value is false
09:42:18 [2021-05-04T13:42:18.036Z]      [java] JVM args ignored when same JVM is used.
09:42:24 [2021-05-04T13:42:24.663Z] [INFO] Done SpotBugs Analysis....
09:42:24 [2021-05-04T13:42:24.663Z] [INFO] 
09:42:24 [2021-05-04T13:42:24.663Z] [INFO] --- maven-checkstyle-plugin:3.1.1:check (checkstyle-integration) @ org.eclipse.ease.lang.javascript.rhino.test ---
09:42:24 [2021-05-04T13:42:24.663Z] [INFO] You have 0 Checkstyle violations.
09:42:24 [2021-05-04T13:42:24.663Z] [INFO] 
09:42:24 [2021-05-04T13:42:24.663Z] [INFO] --- maven-install-plugin:2.3.1:install (default-install) @ org.eclipse.ease.lang.javascript.rhino.test ---
09:42:24 [2021-05-04T13:42:24.664Z] [INFO] Installing /home/jenkins/agent/workspace/ease.verify.core.target.2019-06/tests/org.eclipse.ease.lang.javascript.rhino.test/target/org.eclipse.ease.lang.javascript.rhino.test-0.8.0-SNAPSHOT.jar to /home/jenkins/.m2/repository/org/eclipse/ease/org.eclipse.ease.lang.javascript.rhino.test/0.8.0-SNAPSHOT/org.eclipse.ease.lang.javascript.rhino.test-0.8.0-SNAPSHOT.jar
09:42:24 [2021-05-04T13:42:24.664Z] [INFO] Installing /home/jenkins/agent/workspace/ease.verify.core.target.2019-06/tests/org.eclipse.ease.lang.javascript.rhino.test/pom.xml to /home/jenkins/.m2/repository/org/eclipse/ease/org.eclipse.ease.lang.javascript.rhino.test/0.8.0-SNAPSHOT/org.eclipse.ease.lang.javascript.rhino.test-0.8.0-SNAPSHOT.pom
09:42:24 [2021-05-04T13:42:24.664Z] [INFO] Installing /home/jenkins/agent/workspace/ease.verify.core.target.2019-06/tests/org.eclipse.ease.lang.javascript.rhino.test/target/p2content.xml to /home/jenkins/.m2/repository/org/eclipse/ease/org.eclipse.ease.lang.javascript.rhino.test/0.8.0-SNAPSHOT/org.eclipse.ease.lang.javascript.rhino.test-0.8.0-SNAPSHOT-p2metadata.xml
09:42:24 [2021-05-04T13:42:24.664Z] [INFO] Installing /home/jenkins/agent/workspace/ease.verify.core.target.2019-06/tests/org.eclipse.ease.lang.javascript.rhino.test/target/p2artifacts.xml to /home/jenkins/.m2/repository/org/eclipse/ease/org.eclipse.ease.lang.javascript.rhino.test/0.8.0-SNAPSHOT/org.eclipse.ease.lang.javascript.rhino.test-0.8.0-SNAPSHOT-p2artifacts.xml
09:42:24 [2021-05-04T13:42:24.664Z] [INFO] 
09:42:24 [2021-05-04T13:42:24.664Z] [INFO] --- tycho-p2-plugin:2.2.0:update-local-index (default-update-local-index) @ org.eclipse.ease.lang.javascript.rhino.test ---
09:42:24 [2021-05-04T13:42:24.664Z] [INFO] 
09:42:24 [2021-05-04T13:42:24.664Z] [INFO] -------< org.eclipse.ease:org.eclipse.ease.lang.javascript.test >-------
09:42:24 [2021-05-04T13:42:24.664Z] [INFO] Building org.eclipse.ease.lang.javascript.test 0.8.0-SNAPSHOT    [40/48]
09:42:24 [2021-05-04T13:42:24.664Z] [INFO] ------------------------[ eclipse-test-plugin ]-------------------------
09:42:24 [2021-05-04T13:42:24.664Z] [INFO] 
09:42:24 [2021-05-04T13:42:24.664Z] [INFO] --- maven-clean-plugin:2.5:clean (default-clean) @ org.eclipse.ease.lang.javascript.test ---
09:42:24 [2021-05-04T13:42:24.664Z] [INFO] 
09:42:24 [2021-05-04T13:42:24.664Z] [INFO] --- tycho-packaging-plugin:2.2.0:build-qualifier (default-build-qualifier) @ org.eclipse.ease.lang.javascript.test ---
09:42:24 [2021-05-04T13:42:24.664Z] [INFO] The project's OSGi version is 0.8.0.I202104091518
09:42:24 [2021-05-04T13:42:24.664Z] [INFO] 
09:42:24 [2021-05-04T13:42:24.664Z] [INFO] --- tycho-packaging-plugin:2.2.0:validate-id (default-validate-id) @ org.eclipse.ease.lang.javascript.test ---
09:42:24 [2021-05-04T13:42:24.664Z] [INFO] 
09:42:24 [2021-05-04T13:42:24.664Z] [INFO] --- tycho-packaging-plugin:2.2.0:validate-version (default-validate-version) @ org.eclipse.ease.lang.javascript.test ---
09:42:24 [2021-05-04T13:42:24.664Z] [INFO] 
09:42:24 [2021-05-04T13:42:24.664Z] [INFO] --- maven-resources-plugin:2.4.3:resources (default-resources) @ org.eclipse.ease.lang.javascript.test ---
09:42:24 [2021-05-04T13:42:24.664Z] [INFO] Using 'UTF-8' encoding to copy filtered resources.
09:42:24 [2021-05-04T13:42:24.664Z] [INFO] skip non existing resourceDirectory /home/jenkins/agent/workspace/ease.verify.core.target.2019-06/tests/org.eclipse.ease.lang.javascript.test/src/main/resources
09:42:24 [2021-05-04T13:42:24.664Z] [INFO] 
09:42:24 [2021-05-04T13:42:24.664Z] [INFO] --- tycho-compiler-plugin:2.2.0:compile (default-compile) @ org.eclipse.ease.lang.javascript.test ---
09:42:24 [2021-05-04T13:42:24.664Z] [INFO] Compiling 2 source files to /home/jenkins/agent/workspace/ease.verify.core.target.2019-06/tests/org.eclipse.ease.lang.javascript.test/target/classes
09:42:25 [2021-05-04T13:42:25.243Z] [INFO] 
09:42:25 [2021-05-04T13:42:25.243Z] [INFO] --- maven-resources-plugin:2.4.3:testResources (default-testResources) @ org.eclipse.ease.lang.javascript.test ---
09:42:25 [2021-05-04T13:42:25.243Z] [INFO] Using 'UTF-8' encoding to copy filtered resources.
09:42:25 [2021-05-04T13:42:25.243Z] [INFO] skip non existing resourceDirectory /home/jenkins/agent/workspace/ease.verify.core.target.2019-06/tests/org.eclipse.ease.lang.javascript.test/src/test/resources
09:42:25 [2021-05-04T13:42:25.243Z] [INFO] 
09:42:25 [2021-05-04T13:42:25.243Z] [INFO] --- target-platform-configuration:2.2.0:target-platform (default-target-platform) @ org.eclipse.ease.lang.javascript.test ---
09:42:25 [2021-05-04T13:42:25.243Z] [INFO] 
09:42:25 [2021-05-04T13:42:25.243Z] [INFO] --- tycho-packaging-plugin:2.2.0:package-plugin (default-package-plugin) @ org.eclipse.ease.lang.javascript.test ---
09:42:25 [2021-05-04T13:42:25.243Z] [INFO] Building jar: /home/jenkins/agent/workspace/ease.verify.core.target.2019-06/tests/org.eclipse.ease.lang.javascript.test/target/org.eclipse.ease.lang.javascript.test-0.8.0-SNAPSHOT.jar
09:42:25 [2021-05-04T13:42:25.243Z] [INFO] 
09:42:25 [2021-05-04T13:42:25.243Z] [INFO] --- tycho-p2-plugin:2.2.0:p2-metadata-default (default-p2-metadata-default) @ org.eclipse.ease.lang.javascript.test ---
09:42:25 [2021-05-04T13:42:25.243Z] [INFO] 
09:42:25 [2021-05-04T13:42:25.243Z] [INFO] --- jacoco-maven-plugin:0.8.6:prepare-agent (jacoco-initialize) @ org.eclipse.ease.lang.javascript.test ---
09:42:25 [2021-05-04T13:42:25.243Z] [INFO] tycho.testArgLine set to -javaagent:/home/jenkins/.m2/repository/org/jacoco/org.jacoco.agent/0.8.6/org.jacoco.agent-0.8.6-runtime.jar=destfile=/home/jenkins/agent/workspace/ease.verify.core.target.2019-06/tests/org.eclipse.ease.lang.javascript.test/target/jacoco.exec,output=file
09:42:25 [2021-05-04T13:42:25.243Z] [INFO] 
09:42:25 [2021-05-04T13:42:25.243Z] [INFO] --- tycho-surefire-plugin:2.2.0:test (default-test) @ org.eclipse.ease.lang.javascript.test ---
09:42:25 [2021-05-04T13:42:25.243Z] [INFO] Executing Test Runtime with timeout 0, logs (if any) will be placed at: /home/jenkins/agent/workspace/ease.verify.core.target.2019-06/tests/org.eclipse.ease.lang.javascript.test/target/work/data/.metadata/.log
09:42:25 [2021-05-04T13:42:25.243Z] [INFO] Command line:
09:42:25 [2021-05-04T13:42:25.244Z] 	[/opt/tools/java/openjdk/jdk-15/15.0.2+7/bin/java, -Dosgi.noShutdown=false, -Dosgi.os=linux, -Dosgi.ws=gtk, -Dosgi.arch=x86_64, -javaagent:/home/jenkins/.m2/repository/org/jacoco/org.jacoco.agent/0.8.6/org.jacoco.agent-0.8.6-runtime.jar=destfile=/home/jenkins/agent/workspace/ease.verify.core.target.2019-06/tests/org.eclipse.ease.lang.javascript.test/target/jacoco.exec,output=file, -Dosgi.clean=true, -jar, /home/jenkins/.m2/repository/p2/osgi/bundle/org.eclipse.equinox.launcher/1.6.0.v20200915-1508/org.eclipse.equinox.launcher-1.6.0.v20200915-1508.jar, -data, /home/jenkins/agent/workspace/ease.verify.core.target.2019-06/tests/org.eclipse.ease.lang.javascript.test/target/work/data, -install, /home/jenkins/agent/workspace/ease.verify.core.target.2019-06/tests/org.eclipse.ease.lang.javascript.test/target/work, -configuration, /home/jenkins/agent/workspace/ease.verify.core.target.2019-06/tests/org.eclipse.ease.lang.javascript.test/target/work/configuration, -application, org.eclipse.tycho.surefire.osgibooter.headlesstest, -testproperties, /home/jenkins/agent/workspace/ease.verify.core.target.2019-06/tests/org.eclipse.ease.lang.javascript.test/target/surefire.properties]
09:42:25 [2021-05-04T13:42:25.244Z] Picked up JAVA_TOOL_OPTIONS: -Dmaven.ext.class.path="/home/jenkins/agent/workspace/ease.verify.core.target.2019-06@tmp/withMavencbe230fa/pipeline-maven-spy.jar" -Dorg.jenkinsci.plugins.pipeline.maven.reportsFolder="/home/jenkins/agent/workspace/ease.verify.core.target.2019-06@tmp/withMavencbe230fa" 
09:42:30 [2021-05-04T13:42:30.572Z] May 04, 2021 1:42:30 PM org.junit.platform.launcher.core.DefaultLauncher handleThrowable
09:42:30 [2021-05-04T13:42:30.572Z] WARNING: TestEngine with ID 'junit-vintage' failed to discover tests
09:42:30 [2021-05-04T13:42:30.572Z] java.lang.NoClassDefFoundError: org/junit/runners/model/RunnerBuilder
09:42:30 [2021-05-04T13:42:30.572Z] 	at org.junit.vintage.engine.discovery.VintageDiscoverer.<init>(VintageDiscoverer.java:48)
09:42:30 [2021-05-04T13:42:30.572Z] 	at org.junit.vintage.engine.VintageTestEngine.discover(VintageTestEngine.java:65)
09:42:30 [2021-05-04T13:42:30.572Z] 	at org.junit.platform.launcher.core.DefaultLauncher.discoverEngineRoot(DefaultLauncher.java:130)
09:42:30 [2021-05-04T13:42:30.572Z] 	at org.junit.platform.launcher.core.DefaultLauncher.discoverRoot(DefaultLauncher.java:117)
09:42:30 [2021-05-04T13:42:30.572Z] 	at org.junit.platform.launcher.core.DefaultLauncher.discover(DefaultLauncher.java:82)
09:42:30 [2021-05-04T13:42:30.572Z] 	at org.apache.maven.surefire.junitplatform.TestPlanScannerFilter.accept(TestPlanScannerFilter.java:56)
09:42:30 [2021-05-04T13:42:30.572Z] 	at org.apache.maven.surefire.util.DefaultScanResult.applyFilter(DefaultScanResult.java:102)
09:42:30 [2021-05-04T13:42:30.572Z] 	at org.apache.maven.surefire.junitplatform.JUnitPlatformProvider.scanClasspath(JUnitPlatformProvider.java:143)
09:42:30 [2021-05-04T13:42:30.572Z] 	at org.apache.maven.surefire.junitplatform.JUnitPlatformProvider.invoke(JUnitPlatformProvider.java:124)
09:42:30 [2021-05-04T13:42:30.572Z] 	at java.base/jdk.internal.reflect.NativeMethodAccessorImpl.invoke0(Native Method)
09:42:30 [2021-05-04T13:42:30.572Z] 	at java.base/jdk.internal.reflect.NativeMethodAccessorImpl.invoke(NativeMethodAccessorImpl.java:64)
09:42:30 [2021-05-04T13:42:30.572Z] 	at java.base/jdk.internal.reflect.DelegatingMethodAccessorImpl.invoke(DelegatingMethodAccessorImpl.java:43)
09:42:30 [2021-05-04T13:42:30.572Z] 	at java.base/java.lang.reflect.Method.invoke(Method.java:564)
09:42:30 [2021-05-04T13:42:30.572Z] 	at org.apache.maven.surefire.util.ReflectionUtils.invokeMethodWithArray2(ReflectionUtils.java:206)
09:42:30 [2021-05-04T13:42:30.572Z] 	at org.apache.maven.surefire.booter.ProviderFactory$ProviderProxy.invoke(ProviderFactory.java:161)
09:42:30 [2021-05-04T13:42:30.572Z] 	at org.apache.maven.surefire.booter.ProviderFactory.invokeProvider(ProviderFactory.java:84)
09:42:30 [2021-05-04T13:42:30.572Z] 	at org.eclipse.tycho.surefire.osgibooter.OsgiSurefireBooter.run(OsgiSurefireBooter.java:116)
09:42:30 [2021-05-04T13:42:30.572Z] 	at org.eclipse.tycho.surefire.osgibooter.HeadlessTestApplication.start(HeadlessTestApplication.java:23)
09:42:30 [2021-05-04T13:42:30.572Z] 	at org.eclipse.equinox.internal.app.EclipseAppHandle.run(EclipseAppHandle.java:203)
09:42:30 [2021-05-04T13:42:30.572Z] 	at org.eclipse.core.runtime.internal.adaptor.EclipseAppLauncher.runApplication(EclipseAppLauncher.java:134)
09:42:30 [2021-05-04T13:42:30.572Z] 	at org.eclipse.core.runtime.internal.adaptor.EclipseAppLauncher.start(EclipseAppLauncher.java:104)
09:42:30 [2021-05-04T13:42:30.572Z] 	at org.eclipse.core.runtime.adaptor.EclipseStarter.run(EclipseStarter.java:401)
09:42:30 [2021-05-04T13:42:30.572Z] 	at org.eclipse.core.runtime.adaptor.EclipseStarter.run(EclipseStarter.java:255)
09:42:30 [2021-05-04T13:42:30.572Z] 	at java.base/jdk.internal.reflect.NativeMethodAccessorImpl.invoke0(Native Method)
09:42:30 [2021-05-04T13:42:30.572Z] 	at java.base/jdk.internal.reflect.NativeMethodAccessorImpl.invoke(NativeMethodAccessorImpl.java:64)
09:42:30 [2021-05-04T13:42:30.572Z] 	at java.base/jdk.internal.reflect.DelegatingMethodAccessorImpl.invoke(DelegatingMethodAccessorImpl.java:43)
09:42:30 [2021-05-04T13:42:30.572Z] 	at java.base/java.lang.reflect.Method.invoke(Method.java:564)
09:42:30 [2021-05-04T13:42:30.572Z] 	at org.eclipse.equinox.launcher.Main.invokeFramework(Main.java:653)
09:42:30 [2021-05-04T13:42:30.572Z] 	at org.eclipse.equinox.launcher.Main.basicRun(Main.java:590)
09:42:30 [2021-05-04T13:42:30.573Z] 	at org.eclipse.equinox.launcher.Main.run(Main.java:1461)
09:42:30 [2021-05-04T13:42:30.573Z] 	at org.eclipse.equinox.launcher.Main.main(Main.java:1434)
09:42:30 [2021-05-04T13:42:30.573Z] Caused by: java.lang.ClassNotFoundException: org.junit.runners.model.RunnerBuilder cannot be found by org.eclipse.tycho.surefire.osgibooter_2.2.0
09:42:30 [2021-05-04T13:42:30.573Z] 	at org.eclipse.osgi.internal.loader.BundleLoader.findClass(BundleLoader.java:516)
09:42:30 [2021-05-04T13:42:30.573Z] 	at org.eclipse.osgi.internal.loader.ModuleClassLoader.loadClass(ModuleClassLoader.java:171)
09:42:30 [2021-05-04T13:42:30.573Z] 	at java.base/java.lang.ClassLoader.loadClass(ClassLoader.java:522)
09:42:30 [2021-05-04T13:42:30.573Z] 	... 31 more
09:42:30 [2021-05-04T13:42:30.573Z] 
09:42:30 [2021-05-04T13:42:30.573Z] May 04, 2021 1:42:30 PM org.junit.platform.launcher.core.DefaultLauncher handleThrowable
09:42:30 [2021-05-04T13:42:30.573Z] WARNING: TestEngine with ID 'junit-vintage' failed to discover tests
09:42:30 [2021-05-04T13:42:30.573Z] java.lang.NoClassDefFoundError: org/junit/runners/model/RunnerBuilder
09:42:30 [2021-05-04T13:42:30.573Z] 	at org.junit.vintage.engine.discovery.VintageDiscoverer.<init>(VintageDiscoverer.java:48)
09:42:30 [2021-05-04T13:42:30.573Z] 	at org.junit.vintage.engine.VintageTestEngine.discover(VintageTestEngine.java:65)
09:42:30 [2021-05-04T13:42:30.573Z] 	at org.junit.platform.launcher.core.DefaultLauncher.discoverEngineRoot(DefaultLauncher.java:130)
09:42:30 [2021-05-04T13:42:30.573Z] 	at org.junit.platform.launcher.core.DefaultLauncher.discoverRoot(DefaultLauncher.java:117)
09:42:30 [2021-05-04T13:42:30.573Z] 	at org.junit.platform.launcher.core.DefaultLauncher.discover(DefaultLauncher.java:82)
09:42:30 [2021-05-04T13:42:30.573Z] 	at org.apache.maven.surefire.junitplatform.TestPlanScannerFilter.accept(TestPlanScannerFilter.java:56)
09:42:30 [2021-05-04T13:42:30.573Z] 	at org.apache.maven.surefire.util.DefaultScanResult.applyFilter(DefaultScanResult.java:102)
09:42:30 [2021-05-04T13:42:30.573Z] 	at org.apache.maven.surefire.junitplatform.JUnitPlatformProvider.scanClasspath(JUnitPlatformProvider.java:143)
09:42:30 [2021-05-04T13:42:30.573Z] 	at org.apache.maven.surefire.junitplatform.JUnitPlatformProvider.invoke(JUnitPlatformProvider.java:124)
09:42:30 [2021-05-04T13:42:30.573Z] 	at java.base/jdk.internal.reflect.NativeMethodAccessorImpl.invoke0(Native Method)
09:42:30 [2021-05-04T13:42:30.573Z] 	at java.base/jdk.internal.reflect.NativeMethodAccessorImpl.invoke(NativeMethodAccessorImpl.java:64)
09:42:30 [2021-05-04T13:42:30.573Z] 	at java.base/jdk.internal.reflect.DelegatingMethodAccessorImpl.invoke(DelegatingMethodAccessorImpl.java:43)
09:42:30 [2021-05-04T13:42:30.573Z] 	at java.base/java.lang.reflect.Method.invoke(Method.java:564)
09:42:30 [2021-05-04T13:42:30.573Z] 	at org.apache.maven.surefire.util.ReflectionUtils.invokeMethodWithArray2(ReflectionUtils.java:206)
09:42:30 [2021-05-04T13:42:30.573Z] 	at org.apache.maven.surefire.booter.ProviderFactory$ProviderProxy.invoke(ProviderFactory.java:161)
09:42:30 [2021-05-04T13:42:30.573Z] 	at org.apache.maven.surefire.booter.ProviderFactory.invokeProvider(ProviderFactory.java:84)
09:42:30 [2021-05-04T13:42:30.573Z] 	at org.eclipse.tycho.surefire.osgibooter.OsgiSurefireBooter.run(OsgiSurefireBooter.java:116)
09:42:30 [2021-05-04T13:42:30.573Z] 	at org.eclipse.tycho.surefire.osgibooter.HeadlessTestApplication.start(HeadlessTestApplication.java:23)
09:42:30 [2021-05-04T13:42:30.573Z] 	at org.eclipse.equinox.internal.app.EclipseAppHandle.run(EclipseAppHandle.java:203)
09:42:30 [2021-05-04T13:42:30.573Z] 	at org.eclipse.core.runtime.internal.adaptor.EclipseAppLauncher.runApplication(EclipseAppLauncher.java:134)
09:42:30 [2021-05-04T13:42:30.573Z] 	at org.eclipse.core.runtime.internal.adaptor.EclipseAppLauncher.start(EclipseAppLauncher.java:104)
09:42:30 [2021-05-04T13:42:30.573Z] 	at org.eclipse.core.runtime.adaptor.EclipseStarter.run(EclipseStarter.java:401)
09:42:30 [2021-05-04T13:42:30.573Z] 	at org.eclipse.core.runtime.adaptor.EclipseStarter.run(EclipseStarter.java:255)
09:42:30 [2021-05-04T13:42:30.573Z] 	at java.base/jdk.internal.reflect.NativeMethodAccessorImpl.invoke0(Native Method)
09:42:30 [2021-05-04T13:42:30.573Z] 	at java.base/jdk.internal.reflect.NativeMethodAccessorImpl.invoke(NativeMethodAccessorImpl.java:64)
09:42:30 [2021-05-04T13:42:30.573Z] 	at java.base/jdk.internal.reflect.DelegatingMethodAccessorImpl.invoke(DelegatingMethodAccessorImpl.java:43)
09:42:30 [2021-05-04T13:42:30.573Z] 	at java.base/java.lang.reflect.Method.invoke(Method.java:564)
09:42:30 [2021-05-04T13:42:30.573Z] 	at org.eclipse.equinox.launcher.Main.invokeFramework(Main.java:653)
09:42:30 [2021-05-04T13:42:30.573Z] 	at org.eclipse.equinox.launcher.Main.basicRun(Main.java:590)
09:42:30 [2021-05-04T13:42:30.573Z] 	at org.eclipse.equinox.launcher.Main.run(Main.java:1461)
09:42:30 [2021-05-04T13:42:30.573Z] 	at org.eclipse.equinox.launcher.Main.main(Main.java:1434)
09:42:30 [2021-05-04T13:42:30.573Z] Caused by: java.lang.ClassNotFoundException: org.junit.runners.model.RunnerBuilder cannot be found by org.eclipse.tycho.surefire.osgibooter_2.2.0
09:42:30 [2021-05-04T13:42:30.573Z] 	at org.eclipse.osgi.internal.loader.BundleLoader.findClass(BundleLoader.java:516)
09:42:30 [2021-05-04T13:42:30.573Z] 	at org.eclipse.osgi.internal.loader.ModuleClassLoader.loadClass(ModuleClassLoader.java:171)
09:42:30 [2021-05-04T13:42:30.573Z] 	at java.base/java.lang.ClassLoader.loadClass(ClassLoader.java:522)
09:42:30 [2021-05-04T13:42:30.573Z] 	... 31 more
09:42:30 [2021-05-04T13:42:30.573Z] 
09:42:30 [2021-05-04T13:42:30.573Z] May 04, 2021 1:42:30 PM org.junit.platform.launcher.core.DefaultLauncher handleThrowable
09:42:30 [2021-05-04T13:42:30.573Z] WARNING: TestEngine with ID 'junit-vintage' failed to discover tests
09:42:30 [2021-05-04T13:42:30.573Z] java.lang.NoClassDefFoundError: org/junit/runners/model/RunnerBuilder
09:42:30 [2021-05-04T13:42:30.573Z] 	at org.junit.vintage.engine.discovery.VintageDiscoverer.<init>(VintageDiscoverer.java:48)
09:42:30 [2021-05-04T13:42:30.573Z] 	at org.junit.vintage.engine.VintageTestEngine.discover(VintageTestEngine.java:65)
09:42:30 [2021-05-04T13:42:30.573Z] 	at org.junit.platform.launcher.core.DefaultLauncher.discoverEngineRoot(DefaultLauncher.java:130)
09:42:30 [2021-05-04T13:42:30.573Z] 	at org.junit.platform.launcher.core.DefaultLauncher.discoverRoot(DefaultLauncher.java:117)
09:42:30 [2021-05-04T13:42:30.573Z] 	at org.junit.platform.launcher.core.DefaultLauncher.execute(DefaultLauncher.java:90)
09:42:30 [2021-05-04T13:42:30.573Z] 	at org.apache.maven.surefire.junitplatform.JUnitPlatformProvider.invokeAllTests(JUnitPlatformProvider.java:150)
09:42:30 [2021-05-04T13:42:30.573Z] 	at org.apache.maven.surefire.junitplatform.JUnitPlatformProvider.invoke(JUnitPlatformProvider.java:124)
09:42:30 [2021-05-04T13:42:30.573Z] 	at java.base/jdk.internal.reflect.NativeMethodAccessorImpl.invoke0(Native Method)
09:42:30 [2021-05-04T13:42:30.573Z] 	at java.base/jdk.internal.reflect.NativeMethodAccessorImpl.invoke(NativeMethodAccessorImpl.java:64)
09:42:30 [2021-05-04T13:42:30.573Z] 	at java.base/jdk.internal.reflect.DelegatingMethodAccessorImpl.invoke(DelegatingMethodAccessorImpl.java:43)
09:42:30 [2021-05-04T13:42:30.573Z] 	at java.base/java.lang.reflect.Method.invoke(Method.java:564)
09:42:30 [2021-05-04T13:42:30.573Z] 	at org.apache.maven.surefire.util.ReflectionUtils.invokeMethodWithArray2(ReflectionUtils.java:206)
09:42:30 [2021-05-04T13:42:30.574Z] 	at org.apache.maven.surefire.booter.ProviderFactory$ProviderProxy.invoke(ProviderFactory.java:161)
09:42:30 [2021-05-04T13:42:30.574Z] 	at org.apache.maven.surefire.booter.ProviderFactory.invokeProvider(ProviderFactory.java:84)
09:42:30 [2021-05-04T13:42:30.574Z] 	at org.eclipse.tycho.surefire.osgibooter.OsgiSurefireBooter.run(OsgiSurefireBooter.java:116)
09:42:30 [2021-05-04T13:42:30.574Z] 	at org.eclipse.tycho.surefire.osgibooter.HeadlessTestApplication.start(HeadlessTestApplication.java:23)
09:42:30 [2021-05-04T13:42:30.574Z] 	at org.eclipse.equinox.internal.app.EclipseAppHandle.run(EclipseAppHandle.java:203)
09:42:30 [2021-05-04T13:42:30.574Z] 	at org.eclipse.core.runtime.internal.adaptor.EclipseAppLauncher.runApplication(EclipseAppLauncher.java:134)
09:42:30 [2021-05-04T13:42:30.574Z] 	at org.eclipse.core.runtime.internal.adaptor.EclipseAppLauncher.start(EclipseAppLauncher.java:104)
09:42:30 [2021-05-04T13:42:30.574Z] 	at org.eclipse.core.runtime.adaptor.EclipseStarter.run(EclipseStarter.java:401)
09:42:30 [2021-05-04T13:42:30.574Z] 	at org.eclipse.core.runtime.adaptor.EclipseStarter.run(EclipseStarter.java:255)
09:42:30 [2021-05-04T13:42:30.574Z] 	at java.base/jdk.internal.reflect.NativeMethodAccessorImpl.invoke0(Native Method)
09:42:30 [2021-05-04T13:42:30.574Z] 	at java.base/jdk.internal.reflect.NativeMethodAccessorImpl.invoke(NativeMethodAccessorImpl.java:64)
09:42:30 [2021-05-04T13:42:30.574Z] 	at java.base/jdk.internal.reflect.DelegatingMethodAccessorImpl.invoke(DelegatingMethodAccessorImpl.java:43)
09:42:30 [2021-05-04T13:42:30.574Z] 	at java.base/java.lang.reflect.Method.invoke(Method.java:564)
09:42:30 [2021-05-04T13:42:30.574Z] 	at org.eclipse.equinox.launcher.Main.invokeFramework(Main.java:653)
09:42:30 [2021-05-04T13:42:30.574Z] 	at org.eclipse.equinox.launcher.Main.basicRun(Main.java:590)
09:42:30 [2021-05-04T13:42:30.574Z] 	at org.eclipse.equinox.launcher.Main.run(Main.java:1461)
09:42:30 [2021-05-04T13:42:30.574Z] 	at org.eclipse.equinox.launcher.Main.main(Main.java:1434)
09:42:30 [2021-05-04T13:42:30.574Z] Caused by: java.lang.ClassNotFoundException: org.junit.runners.model.RunnerBuilder cannot be found by org.eclipse.tycho.surefire.osgibooter_2.2.0
09:42:30 [2021-05-04T13:42:30.574Z] 	at org.eclipse.osgi.internal.loader.BundleLoader.findClass(BundleLoader.java:516)
09:42:30 [2021-05-04T13:42:30.574Z] 	at org.eclipse.osgi.internal.loader.ModuleClassLoader.loadClass(ModuleClassLoader.java:171)
09:42:30 [2021-05-04T13:42:30.574Z] 	at java.base/java.lang.ClassLoader.loadClass(ClassLoader.java:522)
09:42:30 [2021-05-04T13:42:30.574Z] 	... 29 more
09:42:30 [2021-05-04T13:42:30.574Z] 
09:42:30 [2021-05-04T13:42:30.574Z] Running org.eclipse.ease.lang.javascript.JavaScriptCompletionContextTest
09:42:31 [2021-05-04T13:42:31.510Z] Tests run: 8, Failures: 0, Errors: 0, Skipped: 0, Time elapsed: 0.992 s - in org.eclipse.ease.lang.javascript.JavaScriptCompletionContextTest
09:42:31 [2021-05-04T13:42:31.511Z] verifyStaticClassTypes  Time elapsed: 0.31 s
09:42:31 [2021-05-04T13:42:31.511Z] verifyClassInstanceTypes  Time elapsed: 0.085 s
09:42:31 [2021-05-04T13:42:31.511Z] verifyTypesForScriptEngine  Time elapsed: 0.577 s
09:42:31 [2021-05-04T13:42:31.511Z] verifyPackageTypes  Time elapsed: 0.001 s
09:42:31 [2021-05-04T13:42:31.511Z] definedVariableTypes  Time elapsed: 0.001 s
09:42:31 [2021-05-04T13:42:31.511Z] verifyStringLiteralTypes  Time elapsed: 0.001 s
09:42:31 [2021-05-04T13:42:31.511Z] verifyUnknownTypes  Time elapsed: 0.001 s
09:42:31 [2021-05-04T13:42:31.511Z] verifyNoneTypes  Time elapsed: 0.001 s
09:42:31 [2021-05-04T13:42:31.511Z] Running org.eclipse.ease.lang.javascript.JavaScriptCodeFactoryTest
09:42:31 [2021-05-04T13:42:31.511Z] Tests run: 1, Failures: 0, Errors: 0, Skipped: 0, Time elapsed: 0.004 s - in org.eclipse.ease.lang.javascript.JavaScriptCodeFactoryTest
09:42:31 [2021-05-04T13:42:31.511Z] testCommentCreator  Time elapsed: 0.003 s
09:42:31 [2021-05-04T13:42:31.511Z] 
09:42:31 [2021-05-04T13:42:31.511Z] Results:
09:42:31 [2021-05-04T13:42:31.511Z] 
09:42:31 [2021-05-04T13:42:31.511Z] Tests run: 9, Failures: 0, Errors: 0, Skipped: 0
09:42:31 [2021-05-04T13:42:31.511Z] 
09:42:38 [2021-05-04T13:42:38.072Z] [INFO] All tests passed!
09:42:38 [2021-05-04T13:42:38.072Z] [INFO] 
09:42:38 [2021-05-04T13:42:38.072Z] [INFO] --- maven-pmd-plugin:3.14.0:pmd (pmd-integration) @ org.eclipse.ease.lang.javascript.test ---
09:42:38 [2021-05-04T13:42:38.072Z] [INFO] 
09:42:38 [2021-05-04T13:42:38.072Z] [INFO] --- maven-pmd-plugin:3.14.0:cpd (pmd-integration) @ org.eclipse.ease.lang.javascript.test ---
09:42:38 [2021-05-04T13:42:38.072Z] [INFO] 
09:42:38 [2021-05-04T13:42:38.072Z] [INFO] --- spotbugs-maven-plugin:4.1.4:spotbugs (spotbugs-integration) @ org.eclipse.ease.lang.javascript.test ---
09:42:38 [2021-05-04T13:42:38.072Z] [INFO] Fork Value is false
09:42:38 [2021-05-04T13:42:38.331Z]      [java] JVM args ignored when same JVM is used.
09:42:43 [2021-05-04T13:42:43.712Z] [INFO] Done SpotBugs Analysis....
09:42:43 [2021-05-04T13:42:43.712Z] [INFO] 
09:42:43 [2021-05-04T13:42:43.712Z] [INFO] --- maven-checkstyle-plugin:3.1.1:check (checkstyle-integration) @ org.eclipse.ease.lang.javascript.test ---
09:42:43 [2021-05-04T13:42:43.712Z] [INFO] You have 0 Checkstyle violations.
09:42:43 [2021-05-04T13:42:43.712Z] [INFO] 
09:42:43 [2021-05-04T13:42:43.712Z] [INFO] --- maven-install-plugin:2.3.1:install (default-install) @ org.eclipse.ease.lang.javascript.test ---
09:42:43 [2021-05-04T13:42:43.712Z] [INFO] Installing /home/jenkins/agent/workspace/ease.verify.core.target.2019-06/tests/org.eclipse.ease.lang.javascript.test/target/org.eclipse.ease.lang.javascript.test-0.8.0-SNAPSHOT.jar to /home/jenkins/.m2/repository/org/eclipse/ease/org.eclipse.ease.lang.javascript.test/0.8.0-SNAPSHOT/org.eclipse.ease.lang.javascript.test-0.8.0-SNAPSHOT.jar
09:42:43 [2021-05-04T13:42:43.712Z] [INFO] Installing /home/jenkins/agent/workspace/ease.verify.core.target.2019-06/tests/org.eclipse.ease.lang.javascript.test/pom.xml to /home/jenkins/.m2/repository/org/eclipse/ease/org.eclipse.ease.lang.javascript.test/0.8.0-SNAPSHOT/org.eclipse.ease.lang.javascript.test-0.8.0-SNAPSHOT.pom
09:42:43 [2021-05-04T13:42:43.712Z] [INFO] Installing /home/jenkins/agent/workspace/ease.verify.core.target.2019-06/tests/org.eclipse.ease.lang.javascript.test/target/p2content.xml to /home/jenkins/.m2/repository/org/eclipse/ease/org.eclipse.ease.lang.javascript.test/0.8.0-SNAPSHOT/org.eclipse.ease.lang.javascript.test-0.8.0-SNAPSHOT-p2metadata.xml
09:42:43 [2021-05-04T13:42:43.971Z] [INFO] Installing /home/jenkins/agent/workspace/ease.verify.core.target.2019-06/tests/org.eclipse.ease.lang.javascript.test/target/p2artifacts.xml to /home/jenkins/.m2/repository/org/eclipse/ease/org.eclipse.ease.lang.javascript.test/0.8.0-SNAPSHOT/org.eclipse.ease.lang.javascript.test-0.8.0-SNAPSHOT-p2artifacts.xml
09:42:43 [2021-05-04T13:42:43.971Z] [INFO] 
09:42:43 [2021-05-04T13:42:43.971Z] [INFO] --- tycho-p2-plugin:2.2.0:update-local-index (default-update-local-index) @ org.eclipse.ease.lang.javascript.test ---
09:42:43 [2021-05-04T13:42:43.971Z] [INFO] 
09:42:43 [2021-05-04T13:42:43.971Z] [INFO] ---------< org.eclipse.ease:org.eclipse.ease.lang.python.test >---------
09:42:43 [2021-05-04T13:42:43.971Z] [INFO] Building org.eclipse.ease.lang.python.test 0.8.0-SNAPSHOT        [41/48]
09:42:43 [2021-05-04T13:42:43.971Z] [INFO] ------------------------[ eclipse-test-plugin ]-------------------------
09:42:43 [2021-05-04T13:42:43.971Z] [INFO] 
09:42:43 [2021-05-04T13:42:43.971Z] [INFO] --- maven-clean-plugin:2.5:clean (default-clean) @ org.eclipse.ease.lang.python.test ---
09:42:43 [2021-05-04T13:42:43.971Z] [INFO] 
09:42:43 [2021-05-04T13:42:43.972Z] [INFO] --- tycho-packaging-plugin:2.2.0:build-qualifier (default-build-qualifier) @ org.eclipse.ease.lang.python.test ---
09:42:43 [2021-05-04T13:42:43.972Z] [INFO] The project's OSGi version is 0.8.0.I202104091518
09:42:43 [2021-05-04T13:42:43.972Z] [INFO] 
09:42:43 [2021-05-04T13:42:43.972Z] [INFO] --- tycho-packaging-plugin:2.2.0:validate-id (default-validate-id) @ org.eclipse.ease.lang.python.test ---
09:42:43 [2021-05-04T13:42:43.972Z] [INFO] 
09:42:43 [2021-05-04T13:42:43.972Z] [INFO] --- tycho-packaging-plugin:2.2.0:validate-version (default-validate-version) @ org.eclipse.ease.lang.python.test ---
09:42:43 [2021-05-04T13:42:43.972Z] [INFO] 
09:42:43 [2021-05-04T13:42:43.972Z] [INFO] --- maven-resources-plugin:2.4.3:resources (default-resources) @ org.eclipse.ease.lang.python.test ---
09:42:43 [2021-05-04T13:42:43.972Z] [INFO] Using 'UTF-8' encoding to copy filtered resources.
09:42:43 [2021-05-04T13:42:43.972Z] [INFO] skip non existing resourceDirectory /home/jenkins/agent/workspace/ease.verify.core.target.2019-06/tests/org.eclipse.ease.lang.python.test/src/main/resources
09:42:43 [2021-05-04T13:42:43.972Z] [INFO] 
09:42:43 [2021-05-04T13:42:43.972Z] [INFO] --- tycho-compiler-plugin:2.2.0:compile (default-compile) @ org.eclipse.ease.lang.python.test ---
09:42:43 [2021-05-04T13:42:43.972Z] [INFO] Compiling 1 source file to /home/jenkins/agent/workspace/ease.verify.core.target.2019-06/tests/org.eclipse.ease.lang.python.test/target/classes
09:42:44 [2021-05-04T13:42:44.234Z] [INFO] 
09:42:44 [2021-05-04T13:42:44.235Z] [INFO] --- maven-resources-plugin:2.4.3:testResources (default-testResources) @ org.eclipse.ease.lang.python.test ---
09:42:44 [2021-05-04T13:42:44.235Z] [INFO] Using 'UTF-8' encoding to copy filtered resources.
09:42:44 [2021-05-04T13:42:44.235Z] [INFO] skip non existing resourceDirectory /home/jenkins/agent/workspace/ease.verify.core.target.2019-06/tests/org.eclipse.ease.lang.python.test/src/test/resources
09:42:44 [2021-05-04T13:42:44.235Z] [INFO] 
09:42:44 [2021-05-04T13:42:44.235Z] [INFO] --- target-platform-configuration:2.2.0:target-platform (default-target-platform) @ org.eclipse.ease.lang.python.test ---
09:42:44 [2021-05-04T13:42:44.235Z] [INFO] 
09:42:44 [2021-05-04T13:42:44.235Z] [INFO] --- tycho-packaging-plugin:2.2.0:package-plugin (default-package-plugin) @ org.eclipse.ease.lang.python.test ---
09:42:44 [2021-05-04T13:42:44.235Z] [INFO] Building jar: /home/jenkins/agent/workspace/ease.verify.core.target.2019-06/tests/org.eclipse.ease.lang.python.test/target/org.eclipse.ease.lang.python.test-0.8.0-SNAPSHOT.jar
09:42:44 [2021-05-04T13:42:44.492Z] [INFO] 
09:42:44 [2021-05-04T13:42:44.492Z] [INFO] --- tycho-p2-plugin:2.2.0:p2-metadata-default (default-p2-metadata-default) @ org.eclipse.ease.lang.python.test ---
09:42:44 [2021-05-04T13:42:44.492Z] [INFO] 
09:42:44 [2021-05-04T13:42:44.492Z] [INFO] --- jacoco-maven-plugin:0.8.6:prepare-agent (jacoco-initialize) @ org.eclipse.ease.lang.python.test ---
09:42:44 [2021-05-04T13:42:44.493Z] [INFO] tycho.testArgLine set to -javaagent:/home/jenkins/.m2/repository/org/jacoco/org.jacoco.agent/0.8.6/org.jacoco.agent-0.8.6-runtime.jar=destfile=/home/jenkins/agent/workspace/ease.verify.core.target.2019-06/tests/org.eclipse.ease.lang.python.test/target/jacoco.exec,output=file
09:42:44 [2021-05-04T13:42:44.493Z] [INFO] 
09:42:44 [2021-05-04T13:42:44.493Z] [INFO] --- tycho-surefire-plugin:2.2.0:test (default-test) @ org.eclipse.ease.lang.python.test ---
09:42:44 [2021-05-04T13:42:44.493Z] [INFO] Executing Test Runtime with timeout 0, logs (if any) will be placed at: /home/jenkins/agent/workspace/ease.verify.core.target.2019-06/tests/org.eclipse.ease.lang.python.test/target/work/data/.metadata/.log
09:42:44 [2021-05-04T13:42:44.493Z] [INFO] Command line:
09:42:44 [2021-05-04T13:42:44.493Z] 	[/opt/tools/java/openjdk/jdk-15/15.0.2+7/bin/java, -Dosgi.noShutdown=false, -Dosgi.os=linux, -Dosgi.ws=gtk, -Dosgi.arch=x86_64, -javaagent:/home/jenkins/.m2/repository/org/jacoco/org.jacoco.agent/0.8.6/org.jacoco.agent-0.8.6-runtime.jar=destfile=/home/jenkins/agent/workspace/ease.verify.core.target.2019-06/tests/org.eclipse.ease.lang.python.test/target/jacoco.exec,output=file, -Dosgi.clean=true, -jar, /home/jenkins/.m2/repository/p2/osgi/bundle/org.eclipse.equinox.launcher/1.6.0.v20200915-1508/org.eclipse.equinox.launcher-1.6.0.v20200915-1508.jar, -data, /home/jenkins/agent/workspace/ease.verify.core.target.2019-06/tests/org.eclipse.ease.lang.python.test/target/work/data, -install, /home/jenkins/agent/workspace/ease.verify.core.target.2019-06/tests/org.eclipse.ease.lang.python.test/target/work, -configuration, /home/jenkins/agent/workspace/ease.verify.core.target.2019-06/tests/org.eclipse.ease.lang.python.test/target/work/configuration, -application, org.eclipse.tycho.surefire.osgibooter.headlesstest, -testproperties, /home/jenkins/agent/workspace/ease.verify.core.target.2019-06/tests/org.eclipse.ease.lang.python.test/target/surefire.properties]
09:42:44 [2021-05-04T13:42:44.493Z] Picked up JAVA_TOOL_OPTIONS: -Dmaven.ext.class.path="/home/jenkins/agent/workspace/ease.verify.core.target.2019-06@tmp/withMavencbe230fa/pipeline-maven-spy.jar" -Dorg.jenkinsci.plugins.pipeline.maven.reportsFolder="/home/jenkins/agent/workspace/ease.verify.core.target.2019-06@tmp/withMavencbe230fa" 
09:42:49 [2021-05-04T13:42:49.868Z] May 04, 2021 1:42:49 PM org.junit.platform.launcher.core.DefaultLauncher handleThrowable
09:42:49 [2021-05-04T13:42:49.868Z] WARNING: TestEngine with ID 'junit-vintage' failed to discover tests
09:42:49 [2021-05-04T13:42:49.868Z] java.lang.NoClassDefFoundError: org/junit/runners/model/RunnerBuilder
09:42:49 [2021-05-04T13:42:49.869Z] 	at org.junit.vintage.engine.discovery.VintageDiscoverer.<init>(VintageDiscoverer.java:48)
09:42:49 [2021-05-04T13:42:49.869Z] 	at org.junit.vintage.engine.VintageTestEngine.discover(VintageTestEngine.java:65)
09:42:49 [2021-05-04T13:42:49.869Z] 	at org.junit.platform.launcher.core.DefaultLauncher.discoverEngineRoot(DefaultLauncher.java:130)
09:42:49 [2021-05-04T13:42:49.869Z] 	at org.junit.platform.launcher.core.DefaultLauncher.discoverRoot(DefaultLauncher.java:117)
09:42:49 [2021-05-04T13:42:49.869Z] 	at org.junit.platform.launcher.core.DefaultLauncher.discover(DefaultLauncher.java:82)
09:42:49 [2021-05-04T13:42:49.869Z] 	at org.apache.maven.surefire.junitplatform.TestPlanScannerFilter.accept(TestPlanScannerFilter.java:56)
09:42:49 [2021-05-04T13:42:49.869Z] 	at org.apache.maven.surefire.util.DefaultScanResult.applyFilter(DefaultScanResult.java:102)
09:42:49 [2021-05-04T13:42:49.869Z] 	at org.apache.maven.surefire.junitplatform.JUnitPlatformProvider.scanClasspath(JUnitPlatformProvider.java:143)
09:42:49 [2021-05-04T13:42:49.869Z] 	at org.apache.maven.surefire.junitplatform.JUnitPlatformProvider.invoke(JUnitPlatformProvider.java:124)
09:42:49 [2021-05-04T13:42:49.869Z] 	at java.base/jdk.internal.reflect.NativeMethodAccessorImpl.invoke0(Native Method)
09:42:49 [2021-05-04T13:42:49.869Z] 	at java.base/jdk.internal.reflect.NativeMethodAccessorImpl.invoke(NativeMethodAccessorImpl.java:64)
09:42:49 [2021-05-04T13:42:49.869Z] 	at java.base/jdk.internal.reflect.DelegatingMethodAccessorImpl.invoke(DelegatingMethodAccessorImpl.java:43)
09:42:49 [2021-05-04T13:42:49.869Z] 	at java.base/java.lang.reflect.Method.invoke(Method.java:564)
09:42:49 [2021-05-04T13:42:49.869Z] 	at org.apache.maven.surefire.util.ReflectionUtils.invokeMethodWithArray2(ReflectionUtils.java:206)
09:42:49 [2021-05-04T13:42:49.869Z] 	at org.apache.maven.surefire.booter.ProviderFactory$ProviderProxy.invoke(ProviderFactory.java:161)
09:42:49 [2021-05-04T13:42:49.869Z] 	at org.apache.maven.surefire.booter.ProviderFactory.invokeProvider(ProviderFactory.java:84)
09:42:49 [2021-05-04T13:42:49.869Z] 	at org.eclipse.tycho.surefire.osgibooter.OsgiSurefireBooter.run(OsgiSurefireBooter.java:116)
09:42:49 [2021-05-04T13:42:49.869Z] 	at org.eclipse.tycho.surefire.osgibooter.HeadlessTestApplication.start(HeadlessTestApplication.java:23)
09:42:49 [2021-05-04T13:42:49.869Z] 	at org.eclipse.equinox.internal.app.EclipseAppHandle.run(EclipseAppHandle.java:203)
09:42:49 [2021-05-04T13:42:49.869Z] 	at org.eclipse.core.runtime.internal.adaptor.EclipseAppLauncher.runApplication(EclipseAppLauncher.java:134)
09:42:49 [2021-05-04T13:42:49.869Z] 	at org.eclipse.core.runtime.internal.adaptor.EclipseAppLauncher.start(EclipseAppLauncher.java:104)
09:42:49 [2021-05-04T13:42:49.869Z] 	at org.eclipse.core.runtime.adaptor.EclipseStarter.run(EclipseStarter.java:401)
09:42:49 [2021-05-04T13:42:49.869Z] 	at org.eclipse.core.runtime.adaptor.EclipseStarter.run(EclipseStarter.java:255)
09:42:49 [2021-05-04T13:42:49.869Z] 	at java.base/jdk.internal.reflect.NativeMethodAccessorImpl.invoke0(Native Method)
09:42:49 [2021-05-04T13:42:49.869Z] 	at java.base/jdk.internal.reflect.NativeMethodAccessorImpl.invoke(NativeMethodAccessorImpl.java:64)
09:42:49 [2021-05-04T13:42:49.869Z] 	at java.base/jdk.internal.reflect.DelegatingMethodAccessorImpl.invoke(DelegatingMethodAccessorImpl.java:43)
09:42:49 [2021-05-04T13:42:49.869Z] 	at java.base/java.lang.reflect.Method.invoke(Method.java:564)
09:42:49 [2021-05-04T13:42:49.869Z] 	at org.eclipse.equinox.launcher.Main.invokeFramework(Main.java:653)
09:42:49 [2021-05-04T13:42:49.869Z] 	at org.eclipse.equinox.launcher.Main.basicRun(Main.java:590)
09:42:49 [2021-05-04T13:42:49.869Z] 	at org.eclipse.equinox.launcher.Main.run(Main.java:1461)
09:42:49 [2021-05-04T13:42:49.869Z] 	at org.eclipse.equinox.launcher.Main.main(Main.java:1434)
09:42:49 [2021-05-04T13:42:49.869Z] Caused by: java.lang.ClassNotFoundException: org.junit.runners.model.RunnerBuilder cannot be found by org.eclipse.tycho.surefire.osgibooter_2.2.0
09:42:49 [2021-05-04T13:42:49.869Z] 	at org.eclipse.osgi.internal.loader.BundleLoader.findClass(BundleLoader.java:516)
09:42:49 [2021-05-04T13:42:49.869Z] 	at org.eclipse.osgi.internal.loader.ModuleClassLoader.loadClass(ModuleClassLoader.java:171)
09:42:49 [2021-05-04T13:42:49.869Z] 	at java.base/java.lang.ClassLoader.loadClass(ClassLoader.java:522)
09:42:49 [2021-05-04T13:42:49.869Z] 	... 31 more
09:42:49 [2021-05-04T13:42:49.869Z] 
09:42:49 [2021-05-04T13:42:49.869Z] May 04, 2021 1:42:49 PM org.junit.platform.launcher.core.DefaultLauncher handleThrowable
09:42:49 [2021-05-04T13:42:49.869Z] WARNING: TestEngine with ID 'junit-vintage' failed to discover tests
09:42:49 [2021-05-04T13:42:49.869Z] java.lang.NoClassDefFoundError: org/junit/runners/model/RunnerBuilder
09:42:49 [2021-05-04T13:42:49.869Z] 	at org.junit.vintage.engine.discovery.VintageDiscoverer.<init>(VintageDiscoverer.java:48)
09:42:49 [2021-05-04T13:42:49.869Z] 	at org.junit.vintage.engine.VintageTestEngine.discover(VintageTestEngine.java:65)
09:42:49 [2021-05-04T13:42:49.869Z] 	at org.junit.platform.launcher.core.DefaultLauncher.discoverEngineRoot(DefaultLauncher.java:130)
09:42:49 [2021-05-04T13:42:49.869Z] 	at org.junit.platform.launcher.core.DefaultLauncher.discoverRoot(DefaultLauncher.java:117)
09:42:49 [2021-05-04T13:42:49.869Z] 	at org.junit.platform.launcher.core.DefaultLauncher.execute(DefaultLauncher.java:90)
09:42:49 [2021-05-04T13:42:49.869Z] 	at org.apache.maven.surefire.junitplatform.JUnitPlatformProvider.invokeAllTests(JUnitPlatformProvider.java:150)
09:42:49 [2021-05-04T13:42:49.869Z] 	at org.apache.maven.surefire.junitplatform.JUnitPlatformProvider.invoke(JUnitPlatformProvider.java:124)
09:42:49 [2021-05-04T13:42:49.869Z] 	at java.base/jdk.internal.reflect.NativeMethodAccessorImpl.invoke0(Native Method)
09:42:49 [2021-05-04T13:42:49.869Z] 	at java.base/jdk.internal.reflect.NativeMethodAccessorImpl.invoke(NativeMethodAccessorImpl.java:64)
09:42:49 [2021-05-04T13:42:49.869Z] 	at java.base/jdk.internal.reflect.DelegatingMethodAccessorImpl.invoke(DelegatingMethodAccessorImpl.java:43)
09:42:49 [2021-05-04T13:42:49.869Z] 	at java.base/java.lang.reflect.Method.invoke(Method.java:564)
09:42:49 [2021-05-04T13:42:49.869Z] 	at org.apache.maven.surefire.util.ReflectionUtils.invokeMethodWithArray2(ReflectionUtils.java:206)
09:42:49 [2021-05-04T13:42:49.869Z] 	at org.apache.maven.surefire.booter.ProviderFactory$ProviderProxy.invoke(ProviderFactory.java:161)
09:42:49 [2021-05-04T13:42:49.869Z] 	at org.apache.maven.surefire.booter.ProviderFactory.invokeProvider(ProviderFactory.java:84)
09:42:49 [2021-05-04T13:42:49.869Z] 	at org.eclipse.tycho.surefire.osgibooter.OsgiSurefireBooter.run(OsgiSurefireBooter.java:116)
09:42:49 [2021-05-04T13:42:49.869Z] 	at org.eclipse.tycho.surefire.osgibooter.HeadlessTestApplication.start(HeadlessTestApplication.java:23)
09:42:49 [2021-05-04T13:42:49.869Z] 	at org.eclipse.equinox.internal.app.EclipseAppHandle.run(EclipseAppHandle.java:203)
09:42:49 [2021-05-04T13:42:49.869Z] 	at org.eclipse.core.runtime.internal.adaptor.EclipseAppLauncher.runApplication(EclipseAppLauncher.java:134)
09:42:49 [2021-05-04T13:42:49.870Z] 	at org.eclipse.core.runtime.internal.adaptor.EclipseAppLauncher.start(EclipseAppLauncher.java:104)
09:42:49 [2021-05-04T13:42:49.870Z] 	at org.eclipse.core.runtime.adaptor.EclipseStarter.run(EclipseStarter.java:401)
09:42:49 [2021-05-04T13:42:49.870Z] 	at org.eclipse.core.runtime.adaptor.EclipseStarter.run(EclipseStarter.java:255)
09:42:49 [2021-05-04T13:42:49.870Z] 	at java.base/jdk.internal.reflect.NativeMethodAccessorImpl.invoke0(Native Method)
09:42:49 [2021-05-04T13:42:49.870Z] 	at java.base/jdk.internal.reflect.NativeMethodAccessorImpl.invoke(NativeMethodAccessorImpl.java:64)
09:42:49 [2021-05-04T13:42:49.870Z] 	at java.base/jdk.internal.reflect.DelegatingMethodAccessorImpl.invoke(DelegatingMethodAccessorImpl.java:43)
09:42:49 [2021-05-04T13:42:49.870Z] 	at java.base/java.lang.reflect.Method.invoke(Method.java:564)
09:42:49 [2021-05-04T13:42:49.870Z] 	at org.eclipse.equinox.launcher.Main.invokeFramework(Main.java:653)
09:42:49 [2021-05-04T13:42:49.870Z] 	at org.eclipse.equinox.launcher.Main.basicRun(Main.java:590)
09:42:49 [2021-05-04T13:42:49.870Z] 	at org.eclipse.equinox.launcher.Main.run(Main.java:1461)
09:42:49 [2021-05-04T13:42:49.870Z] 	at org.eclipse.equinox.launcher.Main.main(Main.java:1434)
09:42:49 [2021-05-04T13:42:49.870Z] Caused by: java.lang.ClassNotFoundException: org.junit.runners.model.RunnerBuilder cannot be found by org.eclipse.tycho.surefire.osgibooter_2.2.0
09:42:49 [2021-05-04T13:42:49.870Z] 	at org.eclipse.osgi.internal.loader.BundleLoader.findClass(BundleLoader.java:516)
09:42:49 [2021-05-04T13:42:49.870Z] 	at org.eclipse.osgi.internal.loader.ModuleClassLoader.loadClass(ModuleClassLoader.java:171)
09:42:49 [2021-05-04T13:42:49.870Z] 	at java.base/java.lang.ClassLoader.loadClass(ClassLoader.java:522)
09:42:49 [2021-05-04T13:42:49.870Z] 	... 29 more
09:42:49 [2021-05-04T13:42:49.870Z] 
09:42:49 [2021-05-04T13:42:49.870Z] Running org.eclipse.ease.lang.python.PythonCodeFactoryTest
09:42:51 [2021-05-04T13:42:51.778Z] Tests run: 3, Failures: 0, Errors: 0, Skipped: 0, Time elapsed: 1.55 s - in org.eclipse.ease.lang.python.PythonCodeFactoryTest
09:42:51 [2021-05-04T13:42:51.778Z] createFunctionWrapper_creates_return_andParameters_for_Py4J  Time elapsed: 1.533 s
09:42:51 [2021-05-04T13:42:51.778Z] testCommentCreator  Time elapsed: 0.001 s
09:42:51 [2021-05-04T13:42:51.778Z] createFunctionWrapper_creates_void_return_types_for_Py4J  Time elapsed: 0.003 s
09:42:51 [2021-05-04T13:42:51.778Z] 
09:42:51 [2021-05-04T13:42:51.778Z] Results:
09:42:51 [2021-05-04T13:42:51.778Z] 
09:42:51 [2021-05-04T13:42:51.778Z] Tests run: 3, Failures: 0, Errors: 0, Skipped: 0
09:42:51 [2021-05-04T13:42:51.778Z] 
09:42:53 [2021-05-04T13:42:53.157Z] [INFO] All tests passed!
09:42:53 [2021-05-04T13:42:53.157Z] [INFO] 
09:42:53 [2021-05-04T13:42:53.157Z] [INFO] --- maven-pmd-plugin:3.14.0:pmd (pmd-integration) @ org.eclipse.ease.lang.python.test ---
09:42:53 [2021-05-04T13:42:53.745Z] [INFO] 
09:42:53 [2021-05-04T13:42:53.745Z] [INFO] --- maven-pmd-plugin:3.14.0:cpd (pmd-integration) @ org.eclipse.ease.lang.python.test ---
09:42:53 [2021-05-04T13:42:53.745Z] [INFO] 
09:42:53 [2021-05-04T13:42:53.745Z] [INFO] --- spotbugs-maven-plugin:4.1.4:spotbugs (spotbugs-integration) @ org.eclipse.ease.lang.python.test ---
09:42:53 [2021-05-04T13:42:53.745Z] [INFO] Fork Value is false
09:42:53 [2021-05-04T13:42:53.745Z]      [java] JVM args ignored when same JVM is used.
09:42:58 [2021-05-04T13:42:58.036Z] [INFO] Done SpotBugs Analysis....
09:42:58 [2021-05-04T13:42:58.036Z] [INFO] 
09:42:58 [2021-05-04T13:42:58.036Z] [INFO] --- maven-checkstyle-plugin:3.1.1:check (checkstyle-integration) @ org.eclipse.ease.lang.python.test ---
09:42:58 [2021-05-04T13:42:58.036Z] [INFO] You have 0 Checkstyle violations.
09:42:58 [2021-05-04T13:42:58.036Z] [INFO] 
09:42:58 [2021-05-04T13:42:58.036Z] [INFO] --- maven-install-plugin:2.3.1:install (default-install) @ org.eclipse.ease.lang.python.test ---
09:42:58 [2021-05-04T13:42:58.036Z] [INFO] Installing /home/jenkins/agent/workspace/ease.verify.core.target.2019-06/tests/org.eclipse.ease.lang.python.test/target/org.eclipse.ease.lang.python.test-0.8.0-SNAPSHOT.jar to /home/jenkins/.m2/repository/org/eclipse/ease/org.eclipse.ease.lang.python.test/0.8.0-SNAPSHOT/org.eclipse.ease.lang.python.test-0.8.0-SNAPSHOT.jar
09:42:58 [2021-05-04T13:42:58.036Z] [INFO] Installing /home/jenkins/agent/workspace/ease.verify.core.target.2019-06/tests/org.eclipse.ease.lang.python.test/pom.xml to /home/jenkins/.m2/repository/org/eclipse/ease/org.eclipse.ease.lang.python.test/0.8.0-SNAPSHOT/org.eclipse.ease.lang.python.test-0.8.0-SNAPSHOT.pom
09:42:58 [2021-05-04T13:42:58.036Z] [INFO] Installing /home/jenkins/agent/workspace/ease.verify.core.target.2019-06/tests/org.eclipse.ease.lang.python.test/target/p2content.xml to /home/jenkins/.m2/repository/org/eclipse/ease/org.eclipse.ease.lang.python.test/0.8.0-SNAPSHOT/org.eclipse.ease.lang.python.test-0.8.0-SNAPSHOT-p2metadata.xml
09:42:58 [2021-05-04T13:42:58.036Z] [INFO] Installing /home/jenkins/agent/workspace/ease.verify.core.target.2019-06/tests/org.eclipse.ease.lang.python.test/target/p2artifacts.xml to /home/jenkins/.m2/repository/org/eclipse/ease/org.eclipse.ease.lang.python.test/0.8.0-SNAPSHOT/org.eclipse.ease.lang.python.test-0.8.0-SNAPSHOT-p2artifacts.xml
09:42:58 [2021-05-04T13:42:58.036Z] [INFO] 
09:42:58 [2021-05-04T13:42:58.036Z] [INFO] --- tycho-p2-plugin:2.2.0:update-local-index (default-update-local-index) @ org.eclipse.ease.lang.python.test ---
09:42:58 [2021-05-04T13:42:58.036Z] [INFO] 
09:42:58 [2021-05-04T13:42:58.036Z] [INFO] -----< org.eclipse.ease:org.eclipse.ease.lang.python.jython.test >------
09:42:58 [2021-05-04T13:42:58.036Z] [INFO] Building org.eclipse.ease.lang.python.jython.test 0.8.0-SNAPSHOT [42/48]
09:42:58 [2021-05-04T13:42:58.036Z] [INFO] ------------------------[ eclipse-test-plugin ]-------------------------
09:42:58 [2021-05-04T13:42:58.036Z] [INFO] 
09:42:58 [2021-05-04T13:42:58.036Z] [INFO] --- maven-clean-plugin:2.5:clean (default-clean) @ org.eclipse.ease.lang.python.jython.test ---
09:42:58 [2021-05-04T13:42:58.036Z] [INFO] 
09:42:58 [2021-05-04T13:42:58.036Z] [INFO] --- tycho-packaging-plugin:2.2.0:build-qualifier (default-build-qualifier) @ org.eclipse.ease.lang.python.jython.test ---
09:42:58 [2021-05-04T13:42:58.036Z] [INFO] The project's OSGi version is 0.8.0.I202104091518
09:42:58 [2021-05-04T13:42:58.036Z] [INFO] 
09:42:58 [2021-05-04T13:42:58.036Z] [INFO] --- tycho-packaging-plugin:2.2.0:validate-id (default-validate-id) @ org.eclipse.ease.lang.python.jython.test ---
09:42:58 [2021-05-04T13:42:58.036Z] [INFO] 
09:42:58 [2021-05-04T13:42:58.036Z] [INFO] --- tycho-packaging-plugin:2.2.0:validate-version (default-validate-version) @ org.eclipse.ease.lang.python.jython.test ---
09:42:58 [2021-05-04T13:42:58.036Z] [INFO] 
09:42:58 [2021-05-04T13:42:58.036Z] [INFO] --- maven-resources-plugin:2.4.3:resources (default-resources) @ org.eclipse.ease.lang.python.jython.test ---
09:42:58 [2021-05-04T13:42:58.036Z] [INFO] Using 'UTF-8' encoding to copy filtered resources.
09:42:58 [2021-05-04T13:42:58.036Z] [INFO] skip non existing resourceDirectory /home/jenkins/agent/workspace/ease.verify.core.target.2019-06/tests/org.eclipse.ease.lang.python.jython.test/src/main/resources
09:42:58 [2021-05-04T13:42:58.036Z] [INFO] 
09:42:58 [2021-05-04T13:42:58.036Z] [INFO] --- tycho-compiler-plugin:2.2.0:compile (default-compile) @ org.eclipse.ease.lang.python.jython.test ---
09:42:58 [2021-05-04T13:42:58.036Z] [INFO] Compiling 1 source file to /home/jenkins/agent/workspace/ease.verify.core.target.2019-06/tests/org.eclipse.ease.lang.python.jython.test/target/classes
09:42:58 [2021-05-04T13:42:58.332Z] [INFO] 
09:42:58 [2021-05-04T13:42:58.332Z] [INFO] --- maven-resources-plugin:2.4.3:testResources (default-testResources) @ org.eclipse.ease.lang.python.jython.test ---
09:42:58 [2021-05-04T13:42:58.332Z] [INFO] Using 'UTF-8' encoding to copy filtered resources.
09:42:58 [2021-05-04T13:42:58.332Z] [INFO] skip non existing resourceDirectory /home/jenkins/agent/workspace/ease.verify.core.target.2019-06/tests/org.eclipse.ease.lang.python.jython.test/src/test/resources
09:42:58 [2021-05-04T13:42:58.332Z] [INFO] 
09:42:58 [2021-05-04T13:42:58.332Z] [INFO] --- target-platform-configuration:2.2.0:target-platform (default-target-platform) @ org.eclipse.ease.lang.python.jython.test ---
09:42:58 [2021-05-04T13:42:58.332Z] [INFO] 
09:42:58 [2021-05-04T13:42:58.332Z] [INFO] --- tycho-packaging-plugin:2.2.0:package-plugin (default-package-plugin) @ org.eclipse.ease.lang.python.jython.test ---
09:42:58 [2021-05-04T13:42:58.332Z] [INFO] Building jar: /home/jenkins/agent/workspace/ease.verify.core.target.2019-06/tests/org.eclipse.ease.lang.python.jython.test/target/org.eclipse.ease.lang.python.jython.test-0.8.0-SNAPSHOT.jar
09:42:58 [2021-05-04T13:42:58.332Z] [INFO] 
09:42:58 [2021-05-04T13:42:58.332Z] [INFO] --- tycho-p2-plugin:2.2.0:p2-metadata-default (default-p2-metadata-default) @ org.eclipse.ease.lang.python.jython.test ---
09:42:58 [2021-05-04T13:42:58.332Z] [INFO] 
09:42:58 [2021-05-04T13:42:58.332Z] [INFO] --- jacoco-maven-plugin:0.8.6:prepare-agent (jacoco-initialize) @ org.eclipse.ease.lang.python.jython.test ---
09:42:58 [2021-05-04T13:42:58.332Z] [INFO] tycho.testArgLine set to -javaagent:/home/jenkins/.m2/repository/org/jacoco/org.jacoco.agent/0.8.6/org.jacoco.agent-0.8.6-runtime.jar=destfile=/home/jenkins/agent/workspace/ease.verify.core.target.2019-06/tests/org.eclipse.ease.lang.python.jython.test/target/jacoco.exec,output=file
09:42:58 [2021-05-04T13:42:58.332Z] [INFO] 
09:42:58 [2021-05-04T13:42:58.332Z] [INFO] --- tycho-surefire-plugin:2.2.0:test (default-test) @ org.eclipse.ease.lang.python.jython.test ---
09:42:59 [2021-05-04T13:42:59.268Z] [INFO] Executing Test Runtime with timeout 0, logs (if any) will be placed at: /home/jenkins/agent/workspace/ease.verify.core.target.2019-06/tests/org.eclipse.ease.lang.python.jython.test/target/work/data/.metadata/.log
09:42:59 [2021-05-04T13:42:59.268Z] [INFO] Command line:
09:42:59 [2021-05-04T13:42:59.268Z] 	[/opt/tools/java/openjdk/jdk-15/15.0.2+7/bin/java, -Dosgi.noShutdown=false, -Dosgi.os=linux, -Dosgi.ws=gtk, -Dosgi.arch=x86_64, -javaagent:/home/jenkins/.m2/repository/org/jacoco/org.jacoco.agent/0.8.6/org.jacoco.agent-0.8.6-runtime.jar=destfile=/home/jenkins/agent/workspace/ease.verify.core.target.2019-06/tests/org.eclipse.ease.lang.python.jython.test/target/jacoco.exec,output=file, -Dosgi.clean=true, -jar, /home/jenkins/.m2/repository/p2/osgi/bundle/org.eclipse.equinox.launcher/1.6.0.v20200915-1508/org.eclipse.equinox.launcher-1.6.0.v20200915-1508.jar, -data, /home/jenkins/agent/workspace/ease.verify.core.target.2019-06/tests/org.eclipse.ease.lang.python.jython.test/target/work/data, -install, /home/jenkins/agent/workspace/ease.verify.core.target.2019-06/tests/org.eclipse.ease.lang.python.jython.test/target/work, -configuration, /home/jenkins/agent/workspace/ease.verify.core.target.2019-06/tests/org.eclipse.ease.lang.python.jython.test/target/work/configuration, -application, org.eclipse.tycho.surefire.osgibooter.headlesstest, -testproperties, /home/jenkins/agent/workspace/ease.verify.core.target.2019-06/tests/org.eclipse.ease.lang.python.jython.test/target/surefire.properties]
09:42:59 [2021-05-04T13:42:59.268Z] Picked up JAVA_TOOL_OPTIONS: -Dmaven.ext.class.path="/home/jenkins/agent/workspace/ease.verify.core.target.2019-06@tmp/withMavencbe230fa/pipeline-maven-spy.jar" -Dorg.jenkinsci.plugins.pipeline.maven.reportsFolder="/home/jenkins/agent/workspace/ease.verify.core.target.2019-06@tmp/withMavencbe230fa" 
09:43:04 [2021-05-04T13:43:04.572Z] WARNING: An illegal reflective access operation has occurred
09:43:04 [2021-05-04T13:43:04.572Z] WARNING: Illegal reflective access by org.python.core.PySystemState (file:/home/jenkins/agent/workspace/ease.verify.core.target.2019-06/tests/org.eclipse.ease.lang.python.jython.test/target/work/plugins/org.jython_2.7.0.I202104151016/jython.jar) to method java.io.Console.encoding()
09:43:04 [2021-05-04T13:43:04.572Z] WARNING: Please consider reporting this to the maintainers of org.python.core.PySystemState
09:43:04 [2021-05-04T13:43:04.572Z] WARNING: Use --illegal-access=warn to enable warnings of further illegal reflective access operations
09:43:04 [2021-05-04T13:43:04.572Z] WARNING: All illegal access operations will be denied in a future release
09:43:05 [2021-05-04T13:43:05.951Z] May 04, 2021 1:43:05 PM org.junit.platform.launcher.core.DefaultLauncher handleThrowable
09:43:05 [2021-05-04T13:43:05.951Z] WARNING: TestEngine with ID 'junit-vintage' failed to discover tests
09:43:05 [2021-05-04T13:43:05.951Z] java.lang.NoClassDefFoundError: org/junit/runners/model/RunnerBuilder
09:43:05 [2021-05-04T13:43:05.951Z] 	at org.junit.vintage.engine.discovery.VintageDiscoverer.<init>(VintageDiscoverer.java:48)
09:43:05 [2021-05-04T13:43:05.952Z] 	at org.junit.vintage.engine.VintageTestEngine.discover(VintageTestEngine.java:65)
09:43:05 [2021-05-04T13:43:05.952Z] 	at org.junit.platform.launcher.core.DefaultLauncher.discoverEngineRoot(DefaultLauncher.java:130)
09:43:05 [2021-05-04T13:43:05.952Z] 	at org.junit.platform.launcher.core.DefaultLauncher.discoverRoot(DefaultLauncher.java:117)
09:43:05 [2021-05-04T13:43:05.952Z] 	at org.junit.platform.launcher.core.DefaultLauncher.discover(DefaultLauncher.java:82)
09:43:05 [2021-05-04T13:43:05.952Z] 	at org.apache.maven.surefire.junitplatform.TestPlanScannerFilter.accept(TestPlanScannerFilter.java:56)
09:43:05 [2021-05-04T13:43:05.952Z] 	at org.apache.maven.surefire.util.DefaultScanResult.applyFilter(DefaultScanResult.java:102)
09:43:05 [2021-05-04T13:43:05.952Z] 	at org.apache.maven.surefire.junitplatform.JUnitPlatformProvider.scanClasspath(JUnitPlatformProvider.java:143)
09:43:05 [2021-05-04T13:43:05.952Z] 	at org.apache.maven.surefire.junitplatform.JUnitPlatformProvider.invoke(JUnitPlatformProvider.java:124)
09:43:05 [2021-05-04T13:43:05.952Z] 	at java.base/jdk.internal.reflect.NativeMethodAccessorImpl.invoke0(Native Method)
09:43:05 [2021-05-04T13:43:05.952Z] 	at java.base/jdk.internal.reflect.NativeMethodAccessorImpl.invoke(NativeMethodAccessorImpl.java:64)
09:43:05 [2021-05-04T13:43:05.952Z] 	at java.base/jdk.internal.reflect.DelegatingMethodAccessorImpl.invoke(DelegatingMethodAccessorImpl.java:43)
09:43:05 [2021-05-04T13:43:05.952Z] 	at java.base/java.lang.reflect.Method.invoke(Method.java:564)
09:43:05 [2021-05-04T13:43:05.952Z] 	at org.apache.maven.surefire.util.ReflectionUtils.invokeMethodWithArray2(ReflectionUtils.java:206)
09:43:05 [2021-05-04T13:43:05.952Z] 	at org.apache.maven.surefire.booter.ProviderFactory$ProviderProxy.invoke(ProviderFactory.java:161)
09:43:05 [2021-05-04T13:43:05.952Z] 	at org.apache.maven.surefire.booter.ProviderFactory.invokeProvider(ProviderFactory.java:84)
09:43:05 [2021-05-04T13:43:05.952Z] 	at org.eclipse.tycho.surefire.osgibooter.OsgiSurefireBooter.run(OsgiSurefireBooter.java:116)
09:43:05 [2021-05-04T13:43:05.952Z] 	at org.eclipse.tycho.surefire.osgibooter.HeadlessTestApplication.start(HeadlessTestApplication.java:23)
09:43:05 [2021-05-04T13:43:05.952Z] 	at org.eclipse.equinox.internal.app.EclipseAppHandle.run(EclipseAppHandle.java:203)
09:43:05 [2021-05-04T13:43:05.952Z] 	at org.eclipse.core.runtime.internal.adaptor.EclipseAppLauncher.runApplication(EclipseAppLauncher.java:134)
09:43:05 [2021-05-04T13:43:05.952Z] 	at org.eclipse.core.runtime.internal.adaptor.EclipseAppLauncher.start(EclipseAppLauncher.java:104)
09:43:05 [2021-05-04T13:43:05.952Z] 	at org.eclipse.core.runtime.adaptor.EclipseStarter.run(EclipseStarter.java:401)
09:43:05 [2021-05-04T13:43:05.952Z] 	at org.eclipse.core.runtime.adaptor.EclipseStarter.run(EclipseStarter.java:255)
09:43:05 [2021-05-04T13:43:05.952Z] 	at java.base/jdk.internal.reflect.NativeMethodAccessorImpl.invoke0(Native Method)
09:43:05 [2021-05-04T13:43:05.952Z] 	at java.base/jdk.internal.reflect.NativeMethodAccessorImpl.invoke(NativeMethodAccessorImpl.java:64)
09:43:05 [2021-05-04T13:43:05.952Z] 	at java.base/jdk.internal.reflect.DelegatingMethodAccessorImpl.invoke(DelegatingMethodAccessorImpl.java:43)
09:43:05 [2021-05-04T13:43:05.952Z] 	at java.base/java.lang.reflect.Method.invoke(Method.java:564)
09:43:05 [2021-05-04T13:43:05.952Z] 	at org.eclipse.equinox.launcher.Main.invokeFramework(Main.java:653)
09:43:05 [2021-05-04T13:43:05.952Z] 	at org.eclipse.equinox.launcher.Main.basicRun(Main.java:590)
09:43:05 [2021-05-04T13:43:05.952Z] 	at org.eclipse.equinox.launcher.Main.run(Main.java:1461)
09:43:05 [2021-05-04T13:43:05.952Z] 	at org.eclipse.equinox.launcher.Main.main(Main.java:1434)
09:43:05 [2021-05-04T13:43:05.952Z] Caused by: java.lang.ClassNotFoundException: org.junit.runners.model.RunnerBuilder cannot be found by org.eclipse.tycho.surefire.osgibooter_2.2.0
09:43:05 [2021-05-04T13:43:05.952Z] 	at org.eclipse.osgi.internal.loader.BundleLoader.findClass(BundleLoader.java:516)
09:43:05 [2021-05-04T13:43:05.952Z] 	at org.eclipse.osgi.internal.loader.ModuleClassLoader.loadClass(ModuleClassLoader.java:171)
09:43:05 [2021-05-04T13:43:05.952Z] 	at java.base/java.lang.ClassLoader.loadClass(ClassLoader.java:522)
09:43:05 [2021-05-04T13:43:05.952Z] 	... 31 more
09:43:05 [2021-05-04T13:43:05.952Z] 
09:43:05 [2021-05-04T13:43:05.952Z] May 04, 2021 1:43:05 PM org.junit.platform.launcher.core.DefaultLauncher handleThrowable
09:43:05 [2021-05-04T13:43:05.952Z] WARNING: TestEngine with ID 'junit-vintage' failed to discover tests
09:43:05 [2021-05-04T13:43:05.952Z] java.lang.NoClassDefFoundError: org/junit/runners/model/RunnerBuilder
09:43:05 [2021-05-04T13:43:05.952Z] 	at org.junit.vintage.engine.discovery.VintageDiscoverer.<init>(VintageDiscoverer.java:48)
09:43:05 [2021-05-04T13:43:05.952Z] 	at org.junit.vintage.engine.VintageTestEngine.discover(VintageTestEngine.java:65)
09:43:05 [2021-05-04T13:43:05.952Z] 	at org.junit.platform.launcher.core.DefaultLauncher.discoverEngineRoot(DefaultLauncher.java:130)
09:43:05 [2021-05-04T13:43:05.952Z] 	at org.junit.platform.launcher.core.DefaultLauncher.discoverRoot(DefaultLauncher.java:117)
09:43:05 [2021-05-04T13:43:05.952Z] 	at org.junit.platform.launcher.core.DefaultLauncher.execute(DefaultLauncher.java:90)
09:43:05 [2021-05-04T13:43:05.952Z] 	at org.apache.maven.surefire.junitplatform.JUnitPlatformProvider.invokeAllTests(JUnitPlatformProvider.java:150)
09:43:05 [2021-05-04T13:43:05.952Z] 	at org.apache.maven.surefire.junitplatform.JUnitPlatformProvider.invoke(JUnitPlatformProvider.java:124)
09:43:05 [2021-05-04T13:43:05.952Z] 	at java.base/jdk.internal.reflect.NativeMethodAccessorImpl.invoke0(Native Method)
09:43:05 [2021-05-04T13:43:05.952Z] 	at java.base/jdk.internal.reflect.NativeMethodAccessorImpl.invoke(NativeMethodAccessorImpl.java:64)
09:43:05 [2021-05-04T13:43:05.952Z] 	at java.base/jdk.internal.reflect.DelegatingMethodAccessorImpl.invoke(DelegatingMethodAccessorImpl.java:43)
09:43:05 [2021-05-04T13:43:05.952Z] 	at java.base/java.lang.reflect.Method.invoke(Method.java:564)
09:43:05 [2021-05-04T13:43:05.952Z] 	at org.apache.maven.surefire.util.ReflectionUtils.invokeMethodWithArray2(ReflectionUtils.java:206)
09:43:05 [2021-05-04T13:43:05.952Z] 	at org.apache.maven.surefire.booter.ProviderFactory$ProviderProxy.invoke(ProviderFactory.java:161)
09:43:05 [2021-05-04T13:43:05.952Z] 	at org.apache.maven.surefire.booter.ProviderFactory.invokeProvider(ProviderFactory.java:84)
09:43:05 [2021-05-04T13:43:05.952Z] 	at org.eclipse.tycho.surefire.osgibooter.OsgiSurefireBooter.run(OsgiSurefireBooter.java:116)
09:43:05 [2021-05-04T13:43:05.952Z] 	at org.eclipse.tycho.surefire.osgibooter.HeadlessTestApplication.start(HeadlessTestApplication.java:23)
09:43:05 [2021-05-04T13:43:05.952Z] 	at org.eclipse.equinox.internal.app.EclipseAppHandle.run(EclipseAppHandle.java:203)
09:43:05 [2021-05-04T13:43:05.953Z] 	at org.eclipse.core.runtime.internal.adaptor.EclipseAppLauncher.runApplication(EclipseAppLauncher.java:134)
09:43:05 [2021-05-04T13:43:05.953Z] 	at org.eclipse.core.runtime.internal.adaptor.EclipseAppLauncher.start(EclipseAppLauncher.java:104)
09:43:05 [2021-05-04T13:43:05.953Z] 	at org.eclipse.core.runtime.adaptor.EclipseStarter.run(EclipseStarter.java:401)
09:43:05 [2021-05-04T13:43:05.953Z] 	at org.eclipse.core.runtime.adaptor.EclipseStarter.run(EclipseStarter.java:255)
09:43:05 [2021-05-04T13:43:05.953Z] 	at java.base/jdk.internal.reflect.NativeMethodAccessorImpl.invoke0(Native Method)
09:43:05 [2021-05-04T13:43:05.953Z] 	at java.base/jdk.internal.reflect.NativeMethodAccessorImpl.invoke(NativeMethodAccessorImpl.java:64)
09:43:05 [2021-05-04T13:43:05.953Z] 	at java.base/jdk.internal.reflect.DelegatingMethodAccessorImpl.invoke(DelegatingMethodAccessorImpl.java:43)
09:43:05 [2021-05-04T13:43:05.953Z] 	at java.base/java.lang.reflect.Method.invoke(Method.java:564)
09:43:05 [2021-05-04T13:43:05.953Z] 	at org.eclipse.equinox.launcher.Main.invokeFramework(Main.java:653)
09:43:05 [2021-05-04T13:43:05.953Z] 	at org.eclipse.equinox.launcher.Main.basicRun(Main.java:590)
09:43:05 [2021-05-04T13:43:05.953Z] 	at org.eclipse.equinox.launcher.Main.run(Main.java:1461)
09:43:05 [2021-05-04T13:43:05.953Z] 	at org.eclipse.equinox.launcher.Main.main(Main.java:1434)
09:43:05 [2021-05-04T13:43:05.953Z] Caused by: java.lang.ClassNotFoundException: org.junit.runners.model.RunnerBuilder cannot be found by org.eclipse.tycho.surefire.osgibooter_2.2.0
09:43:05 [2021-05-04T13:43:05.953Z] 	at org.eclipse.osgi.internal.loader.BundleLoader.findClass(BundleLoader.java:516)
09:43:05 [2021-05-04T13:43:05.953Z] 	at org.eclipse.osgi.internal.loader.ModuleClassLoader.loadClass(ModuleClassLoader.java:171)
09:43:05 [2021-05-04T13:43:05.953Z] 	at java.base/java.lang.ClassLoader.loadClass(ClassLoader.java:522)
09:43:05 [2021-05-04T13:43:05.953Z] 	... 29 more
09:43:05 [2021-05-04T13:43:05.953Z] 
09:43:05 [2021-05-04T13:43:05.953Z] Running org.eclipse.ease.lang.python.jython.debugger.JythonDebugTest
09:43:14 [2021-05-04T13:43:14.082Z] Start of script
09:43:14 [2021-05-04T13:43:14.082Z] include file start
09:43:14 [2021-05-04T13:43:14.082Z] include file processed
09:43:14 [2021-05-04T13:43:14.082Z] Result of testMethod = 5
09:43:14 [2021-05-04T13:43:14.082Z] End of script
09:43:14 [2021-05-04T13:43:14.082Z] Start of script
09:43:14 [2021-05-04T13:43:14.082Z] include file start
09:43:14 [2021-05-04T13:43:14.082Z] include file processed
09:43:14 [2021-05-04T13:43:14.082Z] Result of testMethod = 5
09:43:14 [2021-05-04T13:43:14.082Z] End of script
09:43:14 [2021-05-04T13:43:14.082Z] Start of script
09:43:14 [2021-05-04T13:43:14.082Z] include file start
09:43:14 [2021-05-04T13:43:14.082Z] include file processed
09:43:14 [2021-05-04T13:43:14.082Z] Result of testMethod = 5
09:43:14 [2021-05-04T13:43:14.082Z] Traceback (most recent call last):
09:43:14 [2021-05-04T13:43:14.082Z]   File "(none)", line 184, in run
09:43:14 [2021-05-04T13:43:14.082Z]   File "__ref_L/Debug Test/Main.py_iyowocvqig", line 23, in <module>
09:43:14 [2021-05-04T13:43:14.082Z]   File "(none)", line 161, in trace_dispatch
09:43:14 [2021-05-04T13:43:14.082Z] 	at org.eclipse.ease.debugging.AbstractEaseDebugger.handleEventsInSuspendedState(AbstractEaseDebugger.java:329)
09:43:14 [2021-05-04T13:43:14.082Z] 	at org.eclipse.ease.debugging.AbstractEaseDebugger.suspend(AbstractEaseDebugger.java:255)
09:43:14 [2021-05-04T13:43:14.082Z] 	at org.eclipse.ease.debugging.AbstractEaseDebugger.processLine(AbstractEaseDebugger.java:490)
09:43:14 [2021-05-04T13:43:14.082Z] 	at org.eclipse.ease.lang.python.debugger.PythonDebugger.traceDispatch(PythonDebugger.java:177)
09:43:14 [2021-05-04T13:43:14.082Z] 	at org.eclipse.ease.lang.python.jython.debugger.JythonDebugger.traceDispatch(JythonDebugger.java:44)
09:43:14 [2021-05-04T13:43:14.082Z] 	at jdk.internal.reflect.GeneratedMethodAccessor25.invoke(Unknown Source)
09:43:14 [2021-05-04T13:43:14.082Z] 	at java.base/jdk.internal.reflect.DelegatingMethodAccessorImpl.invoke(DelegatingMethodAccessorImpl.java:43)
09:43:14 [2021-05-04T13:43:14.082Z] 	at java.base/java.lang.reflect.Method.invoke(Method.java:564)
09:43:14 [2021-05-04T13:43:14.082Z] 
09:43:14 [2021-05-04T13:43:14.082Z] org.eclipse.ease.ScriptEngineCancellationException: org.eclipse.ease.ScriptEngineCancellationException: Terminated on user request
09:43:14 [2021-05-04T13:43:14.082Z] Start of script
09:43:14 [2021-05-04T13:43:14.082Z] include file start
09:43:14 [2021-05-04T13:43:14.340Z] include file processed
09:43:14 [2021-05-04T13:43:14.340Z] Result of testMethod = 5
09:43:14 [2021-05-04T13:43:14.340Z] End of script
09:43:14 [2021-05-04T13:43:14.940Z] Start of script
09:43:14 [2021-05-04T13:43:14.940Z] include file start
09:43:14 [2021-05-04T13:43:14.940Z] include file processed
09:43:14 [2021-05-04T13:43:14.940Z] Result of testMethod = 5
09:43:14 [2021-05-04T13:43:14.940Z] End of script
09:43:15 [2021-05-04T13:43:15.507Z] Start of script
09:43:15 [2021-05-04T13:43:15.507Z] include file start
09:43:15 [2021-05-04T13:43:15.507Z] include file processed
09:43:15 [2021-05-04T13:43:15.507Z] Result of testMethod = 5
09:43:15 [2021-05-04T13:43:15.507Z] End of script
09:43:15 [2021-05-04T13:43:15.766Z] Start of script
09:43:16 [2021-05-04T13:43:16.024Z] include file start
09:43:16 [2021-05-04T13:43:16.024Z] include file processed
09:43:16 [2021-05-04T13:43:16.024Z] Result of testMethod = 5
09:43:16 [2021-05-04T13:43:16.024Z] Traceback (most recent call last):
09:43:16 [2021-05-04T13:43:16.024Z]   File "(none)", line 184, in run
09:43:16 [2021-05-04T13:43:16.024Z]   File "__ref_L/Debug Test/Main.py_evhvqkgkrc", line 23, in <module>
09:43:16 [2021-05-04T13:43:16.024Z]   File "(none)", line 161, in trace_dispatch
09:43:16 [2021-05-04T13:43:16.024Z] 	at org.eclipse.ease.debugging.AbstractEaseDebugger.handleEventsInSuspendedState(AbstractEaseDebugger.java:329)
09:43:16 [2021-05-04T13:43:16.024Z] 	at org.eclipse.ease.debugging.AbstractEaseDebugger.suspend(AbstractEaseDebugger.java:255)
09:43:16 [2021-05-04T13:43:16.024Z] 	at org.eclipse.ease.debugging.AbstractEaseDebugger.processLine(AbstractEaseDebugger.java:490)
09:43:16 [2021-05-04T13:43:16.024Z] 	at org.eclipse.ease.lang.python.debugger.PythonDebugger.traceDispatch(PythonDebugger.java:177)
09:43:16 [2021-05-04T13:43:16.024Z] 	at org.eclipse.ease.lang.python.jython.debugger.JythonDebugger.traceDispatch(JythonDebugger.java:44)
09:43:16 [2021-05-04T13:43:16.024Z] 	at jdk.internal.reflect.GeneratedMethodAccessor25.invoke(Unknown Source)
09:43:16 [2021-05-04T13:43:16.025Z] 	at java.base/jdk.internal.reflect.DelegatingMethodAccessorImpl.invoke(DelegatingMethodAccessorImpl.java:43)
09:43:16 [2021-05-04T13:43:16.025Z] 	at java.base/java.lang.reflect.Method.invoke(Method.java:564)
09:43:16 [2021-05-04T13:43:16.025Z] 
09:43:16 [2021-05-04T13:43:16.025Z] org.eclipse.ease.ScriptEngineCancellationException: org.eclipse.ease.ScriptEngineCancellationException: Terminated on user request
09:43:16 [2021-05-04T13:43:16.283Z] Start of script
09:43:16 [2021-05-04T13:43:16.283Z] include file start
09:43:16 [2021-05-04T13:43:16.283Z] include file processed
09:43:16 [2021-05-04T13:43:16.541Z] Result of testMethod = 5
09:43:16 [2021-05-04T13:43:16.541Z] End of script
09:43:16 [2021-05-04T13:43:16.799Z] Start of script
09:43:16 [2021-05-04T13:43:16.799Z] include file start
09:43:16 [2021-05-04T13:43:16.799Z] include file processed
09:43:16 [2021-05-04T13:43:16.799Z] Result of testMethod = 5
09:43:16 [2021-05-04T13:43:16.799Z] End of script
09:43:17 [2021-05-04T13:43:17.057Z] Start of script
09:43:17 [2021-05-04T13:43:17.057Z] include file start
09:43:17 [2021-05-04T13:43:17.057Z] include file processed
09:43:17 [2021-05-04T13:43:17.623Z] Traceback (most recent call last):
09:43:17 [2021-05-04T13:43:17.623Z]   File "(none)", line 184, in run
09:43:17 [2021-05-04T13:43:17.623Z]   File "__ref_L/Debug Test/Main.py_tvctxvsftq", line 22, in <module>
09:43:17 [2021-05-04T13:43:17.623Z]   File "(none)", line 161, in trace_dispatch
09:43:17 [2021-05-04T13:43:17.623Z] 	at org.eclipse.ease.debugging.AbstractEaseDebugger.handleEventsInSuspendedState(AbstractEaseDebugger.java:329)
09:43:17 [2021-05-04T13:43:17.623Z] 	at org.eclipse.ease.debugging.AbstractEaseDebugger.suspend(AbstractEaseDebugger.java:255)
09:43:17 [2021-05-04T13:43:17.623Z] 	at org.eclipse.ease.debugging.AbstractEaseDebugger.processLine(AbstractEaseDebugger.java:510)
09:43:17 [2021-05-04T13:43:17.623Z] 	at org.eclipse.ease.lang.python.debugger.PythonDebugger.traceDispatch(PythonDebugger.java:177)
09:43:17 [2021-05-04T13:43:17.623Z] 	at org.eclipse.ease.lang.python.jython.debugger.JythonDebugger.traceDispatch(JythonDebugger.java:44)
09:43:17 [2021-05-04T13:43:17.623Z] 	at jdk.internal.reflect.GeneratedMethodAccessor25.invoke(Unknown Source)
09:43:17 [2021-05-04T13:43:17.623Z] 	at java.base/jdk.internal.reflect.DelegatingMethodAccessorImpl.invoke(DelegatingMethodAccessorImpl.java:43)
09:43:17 [2021-05-04T13:43:17.623Z] 	at java.base/java.lang.reflect.Method.invoke(Method.java:564)
09:43:17 [2021-05-04T13:43:17.623Z] 
09:43:17 [2021-05-04T13:43:17.623Z] org.eclipse.ease.ScriptEngineCancellationException: org.eclipse.ease.ScriptEngineCancellationException: Terminated on user request
09:43:17 [2021-05-04T13:43:17.623Z] Start of script
09:43:17 [2021-05-04T13:43:17.623Z] include file start
09:43:17 [2021-05-04T13:43:17.882Z] include file processed
09:43:17 [2021-05-04T13:43:17.882Z] Result of testMethod = 5
09:43:17 [2021-05-04T13:43:17.882Z] End of script
09:43:17 [2021-05-04T13:43:17.882Z] Start of script
09:43:17 [2021-05-04T13:43:17.882Z] include file start
09:43:17 [2021-05-04T13:43:17.882Z] include file processed
09:43:18 [2021-05-04T13:43:18.140Z] Result of testMethod = 5
09:43:18 [2021-05-04T13:43:18.140Z] End of script
09:43:18 [2021-05-04T13:43:18.397Z] Traceback (most recent call last):
09:43:18 [2021-05-04T13:43:18.397Z]   File "(none)", line 184, in run
09:43:18 [2021-05-04T13:43:18.397Z]   File "__ref_L/Debug Test/Main.py_gfzdrelicn", line 1, in <module>
09:43:18 [2021-05-04T13:43:18.397Z]   File "(none)", line 161, in trace_dispatch
09:43:18 [2021-05-04T13:43:18.397Z] 	at org.eclipse.ease.debugging.AbstractEaseDebugger.handleEventsInSuspendedState(AbstractEaseDebugger.java:329)
09:43:18 [2021-05-04T13:43:18.397Z] 	at org.eclipse.ease.debugging.AbstractEaseDebugger.suspend(AbstractEaseDebugger.java:255)
09:43:18 [2021-05-04T13:43:18.397Z] 	at org.eclipse.ease.debugging.AbstractEaseDebugger.processLine(AbstractEaseDebugger.java:490)
09:43:18 [2021-05-04T13:43:18.397Z] 	at org.eclipse.ease.lang.python.debugger.PythonDebugger.traceDispatch(PythonDebugger.java:177)
09:43:18 [2021-05-04T13:43:18.397Z] 	at org.eclipse.ease.lang.python.jython.debugger.JythonDebugger.traceDispatch(JythonDebugger.java:44)
09:43:18 [2021-05-04T13:43:18.397Z] 	at jdk.internal.reflect.GeneratedMethodAccessor25.invoke(Unknown Source)
09:43:18 [2021-05-04T13:43:18.398Z] 	at java.base/jdk.internal.reflect.DelegatingMethodAccessorImpl.invoke(DelegatingMethodAccessorImpl.java:43)
09:43:18 [2021-05-04T13:43:18.398Z] 	at java.base/java.lang.reflect.Method.invoke(Method.java:564)
09:43:18 [2021-05-04T13:43:18.398Z] 
09:43:18 [2021-05-04T13:43:18.398Z] org.eclipse.ease.ScriptEngineCancellationException: org.eclipse.ease.ScriptEngineCancellationException: Terminated on user request
09:43:18 [2021-05-04T13:43:18.964Z] Start of script
09:43:18 [2021-05-04T13:43:18.964Z] include file start
09:43:18 [2021-05-04T13:43:18.964Z] include file processed
09:43:18 [2021-05-04T13:43:18.964Z] Result of testMethod = 5
09:43:18 [2021-05-04T13:43:18.964Z] End of script
09:43:18 [2021-05-04T13:43:18.964Z] Start of script
09:43:18 [2021-05-04T13:43:18.964Z] include file start
09:43:18 [2021-05-04T13:43:18.964Z] include file processed
09:43:19 [2021-05-04T13:43:19.222Z] Result of testMethod = 5
09:43:19 [2021-05-04T13:43:19.222Z] End of script
09:43:19 [2021-05-04T13:43:19.481Z] Start of script
09:43:19 [2021-05-04T13:43:19.481Z] include file start
09:43:19 [2021-05-04T13:43:19.481Z] include file processed
09:43:19 [2021-05-04T13:43:19.481Z] Result of testMethod = 5
09:43:19 [2021-05-04T13:43:19.739Z] Traceback (most recent call last):
09:43:19 [2021-05-04T13:43:19.739Z]   File "(none)", line 184, in run
09:43:19 [2021-05-04T13:43:19.739Z]   File "__ref_L/Debug Test/Main.py_soutsbfibt", line 23, in <module>
09:43:19 [2021-05-04T13:43:19.739Z]   File "(none)", line 161, in trace_dispatch
09:43:19 [2021-05-04T13:43:19.739Z] 	at org.eclipse.ease.debugging.AbstractEaseDebugger.handleEventsInSuspendedState(AbstractEaseDebugger.java:329)
09:43:19 [2021-05-04T13:43:19.739Z] 	at org.eclipse.ease.debugging.AbstractEaseDebugger.suspend(AbstractEaseDebugger.java:255)
09:43:19 [2021-05-04T13:43:19.739Z] 	at org.eclipse.ease.debugging.AbstractEaseDebugger.processLine(AbstractEaseDebugger.java:490)
09:43:19 [2021-05-04T13:43:19.739Z] 	at org.eclipse.ease.lang.python.debugger.PythonDebugger.traceDispatch(PythonDebugger.java:177)
09:43:19 [2021-05-04T13:43:19.739Z] 	at org.eclipse.ease.lang.python.jython.debugger.JythonDebugger.traceDispatch(JythonDebugger.java:44)
09:43:19 [2021-05-04T13:43:19.739Z] 	at jdk.internal.reflect.GeneratedMethodAccessor25.invoke(Unknown Source)
09:43:19 [2021-05-04T13:43:19.739Z] 	at java.base/jdk.internal.reflect.DelegatingMethodAccessorImpl.invoke(DelegatingMethodAccessorImpl.java:43)
09:43:19 [2021-05-04T13:43:19.739Z] 	at java.base/java.lang.reflect.Method.invoke(Method.java:564)
09:43:19 [2021-05-04T13:43:19.739Z] 
09:43:19 [2021-05-04T13:43:19.739Z] org.eclipse.ease.ScriptEngineCancellationException: org.eclipse.ease.ScriptEngineCancellationException: Terminated on user request
09:43:19 [2021-05-04T13:43:19.997Z] Start of script
09:43:19 [2021-05-04T13:43:19.997Z] include file start
09:43:19 [2021-05-04T13:43:19.997Z] include file processed
09:43:19 [2021-05-04T13:43:19.998Z] Result of testMethod = 5
09:43:19 [2021-05-04T13:43:19.998Z] End of script
09:43:20 [2021-05-04T13:43:20.255Z] Traceback (most recent call last):
09:43:20 [2021-05-04T13:43:20.255Z]   File "(none)", line 184, in run
09:43:20 [2021-05-04T13:43:20.255Z]   File "__ref_L/Debug Test/Main.py_tnjvoaxotd", line 1, in <module>
09:43:20 [2021-05-04T13:43:20.255Z]   File "(none)", line 161, in trace_dispatch
09:43:20 [2021-05-04T13:43:20.255Z] 	at org.eclipse.ease.debugging.AbstractEaseDebugger.handleEventsInSuspendedState(AbstractEaseDebugger.java:329)
09:43:20 [2021-05-04T13:43:20.255Z] 	at org.eclipse.ease.debugging.AbstractEaseDebugger.suspend(AbstractEaseDebugger.java:255)
09:43:20 [2021-05-04T13:43:20.255Z] 	at org.eclipse.ease.debugging.AbstractEaseDebugger.processLine(AbstractEaseDebugger.java:490)
09:43:20 [2021-05-04T13:43:20.255Z] 	at org.eclipse.ease.lang.python.debugger.PythonDebugger.traceDispatch(PythonDebugger.java:177)
09:43:20 [2021-05-04T13:43:20.255Z] 	at org.eclipse.ease.lang.python.jython.debugger.JythonDebugger.traceDispatch(JythonDebugger.java:44)
09:43:20 [2021-05-04T13:43:20.255Z] 	at jdk.internal.reflect.GeneratedMethodAccessor25.invoke(Unknown Source)
09:43:20 [2021-05-04T13:43:20.255Z] 	at java.base/jdk.internal.reflect.DelegatingMethodAccessorImpl.invoke(DelegatingMethodAccessorImpl.java:43)
09:43:20 [2021-05-04T13:43:20.255Z] 	at java.base/java.lang.reflect.Method.invoke(Method.java:564)
09:43:20 [2021-05-04T13:43:20.255Z] 
09:43:20 [2021-05-04T13:43:20.255Z] org.eclipse.ease.ScriptEngineCancellationException: org.eclipse.ease.ScriptEngineCancellationException: Terminated on user request
09:43:20 [2021-05-04T13:43:20.513Z] Start of script
09:43:20 [2021-05-04T13:43:20.513Z] include file start
09:43:20 [2021-05-04T13:43:20.513Z] include file processed
09:43:20 [2021-05-04T13:43:20.513Z] Result of testMethod = 5
09:43:20 [2021-05-04T13:43:20.513Z] End of script
09:43:20 [2021-05-04T13:43:20.771Z] Start of script
09:43:20 [2021-05-04T13:43:20.771Z] include file start
09:43:20 [2021-05-04T13:43:20.771Z] include file processed
09:43:21 [2021-05-04T13:43:21.029Z] Result of testMethod = 5
09:43:21 [2021-05-04T13:43:21.029Z] End of script
09:43:21 [2021-05-04T13:43:21.287Z] Traceback (most recent call last):
09:43:21 [2021-05-04T13:43:21.287Z]   File "(none)", line 184, in run
09:43:21 [2021-05-04T13:43:21.287Z]   File "__ref_L/Debug Test/Main.py_xyvznqxvbd", line 1, in <module>
09:43:21 [2021-05-04T13:43:21.287Z]   File "(none)", line 161, in trace_dispatch
09:43:21 [2021-05-04T13:43:21.287Z] 	at org.eclipse.ease.debugging.AbstractEaseDebugger.handleEventsInSuspendedState(AbstractEaseDebugger.java:329)
09:43:21 [2021-05-04T13:43:21.287Z] 	at org.eclipse.ease.debugging.AbstractEaseDebugger.suspend(AbstractEaseDebugger.java:255)
09:43:21 [2021-05-04T13:43:21.287Z] 	at org.eclipse.ease.debugging.AbstractEaseDebugger.processLine(AbstractEaseDebugger.java:490)
09:43:21 [2021-05-04T13:43:21.287Z] 	at org.eclipse.ease.lang.python.debugger.PythonDebugger.traceDispatch(PythonDebugger.java:177)
09:43:21 [2021-05-04T13:43:21.287Z] 	at org.eclipse.ease.lang.python.jython.debugger.JythonDebugger.traceDispatch(JythonDebugger.java:44)
09:43:21 [2021-05-04T13:43:21.287Z] 	at jdk.internal.reflect.GeneratedMethodAccessor25.invoke(Unknown Source)
09:43:21 [2021-05-04T13:43:21.287Z] 	at java.base/jdk.internal.reflect.DelegatingMethodAccessorImpl.invoke(DelegatingMethodAccessorImpl.java:43)
09:43:21 [2021-05-04T13:43:21.287Z] 	at java.base/java.lang.reflect.Method.invoke(Method.java:564)
09:43:21 [2021-05-04T13:43:21.287Z] 
09:43:21 [2021-05-04T13:43:21.287Z] org.eclipse.ease.ScriptEngineCancellationException: org.eclipse.ease.ScriptEngineCancellationException: Terminated on user request
09:43:21 [2021-05-04T13:43:21.546Z] Start of script
09:43:21 [2021-05-04T13:43:21.546Z] include file start
09:43:21 [2021-05-04T13:43:21.546Z] include file processed
09:43:21 [2021-05-04T13:43:21.804Z] Result of testMethod = 5
09:43:21 [2021-05-04T13:43:21.804Z] End of script
09:43:21 [2021-05-04T13:43:21.804Z] Start of script
09:43:21 [2021-05-04T13:43:21.804Z] include file start
09:43:21 [2021-05-04T13:43:21.804Z] include file processed
09:43:21 [2021-05-04T13:43:21.804Z] Result of testMethod = 5
09:43:22 [2021-05-04T13:43:22.062Z] Traceback (most recent call last):
09:43:22 [2021-05-04T13:43:22.062Z]   File "(none)", line 184, in run
09:43:22 [2021-05-04T13:43:22.062Z]   File "__ref_L/Debug Test/Main.py_prejbijpmb", line 23, in <module>
09:43:22 [2021-05-04T13:43:22.062Z]   File "(none)", line 161, in trace_dispatch
09:43:22 [2021-05-04T13:43:22.062Z] 	at org.eclipse.ease.debugging.AbstractEaseDebugger.handleEventsInSuspendedState(AbstractEaseDebugger.java:329)
09:43:22 [2021-05-04T13:43:22.062Z] 	at org.eclipse.ease.debugging.AbstractEaseDebugger.suspend(AbstractEaseDebugger.java:255)
09:43:22 [2021-05-04T13:43:22.062Z] 	at org.eclipse.ease.debugging.AbstractEaseDebugger.processLine(AbstractEaseDebugger.java:490)
09:43:22 [2021-05-04T13:43:22.062Z] 	at org.eclipse.ease.lang.python.debugger.PythonDebugger.traceDispatch(PythonDebugger.java:177)
09:43:22 [2021-05-04T13:43:22.062Z] 	at org.eclipse.ease.lang.python.jython.debugger.JythonDebugger.traceDispatch(JythonDebugger.java:44)
09:43:22 [2021-05-04T13:43:22.062Z] 	at jdk.internal.reflect.GeneratedMethodAccessor25.invoke(Unknown Source)
09:43:22 [2021-05-04T13:43:22.062Z] 	at java.base/jdk.internal.reflect.DelegatingMethodAccessorImpl.invoke(DelegatingMethodAccessorImpl.java:43)
09:43:22 [2021-05-04T13:43:22.062Z] 	at java.base/java.lang.reflect.Method.invoke(Method.java:564)
09:43:22 [2021-05-04T13:43:22.062Z] 
09:43:22 [2021-05-04T13:43:22.062Z] org.eclipse.ease.ScriptEngineCancellationException: org.eclipse.ease.ScriptEngineCancellationException: Terminated on user request
09:43:22 [2021-05-04T13:43:22.335Z] Start of script
09:43:22 [2021-05-04T13:43:22.335Z] include file start
09:43:22 [2021-05-04T13:43:22.335Z] include file processed
09:43:22 [2021-05-04T13:43:22.335Z] Result of testMethod = 5
09:43:22 [2021-05-04T13:43:22.335Z] End of script
09:43:22 [2021-05-04T13:43:22.593Z] Start of script
09:43:22 [2021-05-04T13:43:22.593Z] include file start
09:43:22 [2021-05-04T13:43:22.593Z] include file processed
09:43:22 [2021-05-04T13:43:22.593Z] Result of testMethod = 5
09:43:22 [2021-05-04T13:43:22.593Z] End of script
09:43:22 [2021-05-04T13:43:22.851Z] Start of script
09:43:22 [2021-05-04T13:43:22.851Z] include file start
09:43:22 [2021-05-04T13:43:22.851Z] include file processed
09:43:22 [2021-05-04T13:43:22.851Z] Result of testMethod = 5
09:43:22 [2021-05-04T13:43:22.851Z] End of script
09:43:23 [2021-05-04T13:43:23.111Z] Start of script
09:43:23 [2021-05-04T13:43:23.111Z] include file start
09:43:23 [2021-05-04T13:43:23.111Z] include file processed
09:43:23 [2021-05-04T13:43:23.111Z] Result of testMethod = 5
09:43:23 [2021-05-04T13:43:23.111Z] End of script
09:43:23 [2021-05-04T13:43:23.372Z] Start of script
09:43:23 [2021-05-04T13:43:23.372Z] include file start
09:43:23 [2021-05-04T13:43:23.372Z] include file processed
09:43:23 [2021-05-04T13:43:23.632Z] Traceback (most recent call last):
09:43:23 [2021-05-04T13:43:23.632Z]   File "(none)", line 184, in run
09:43:23 [2021-05-04T13:43:23.632Z]   File "__ref_L/Debug Test/Main.py_litrggvgyz", line 21, in <module>
09:43:23 [2021-05-04T13:43:23.632Z]   File "__ref_L/Debug Test/Main.py_litrggvgyz", line 18, in testMethod
09:43:23 [2021-05-04T13:43:23.632Z]   File "(none)", line 161, in trace_dispatch
09:43:23 [2021-05-04T13:43:23.632Z] 	at org.eclipse.ease.debugging.AbstractEaseDebugger.handleEventsInSuspendedState(AbstractEaseDebugger.java:329)
09:43:23 [2021-05-04T13:43:23.632Z] 	at org.eclipse.ease.debugging.AbstractEaseDebugger.suspend(AbstractEaseDebugger.java:255)
09:43:23 [2021-05-04T13:43:23.632Z] 	at org.eclipse.ease.debugging.AbstractEaseDebugger.processLine(AbstractEaseDebugger.java:490)
09:43:23 [2021-05-04T13:43:23.633Z] 	at org.eclipse.ease.lang.python.debugger.PythonDebugger.traceDispatch(PythonDebugger.java:177)
09:43:23 [2021-05-04T13:43:23.633Z] 	at org.eclipse.ease.lang.python.jython.debugger.JythonDebugger.traceDispatch(JythonDebugger.java:44)
09:43:23 [2021-05-04T13:43:23.633Z] 	at jdk.internal.reflect.GeneratedMethodAccessor25.invoke(Unknown Source)
09:43:23 [2021-05-04T13:43:23.633Z] 	at java.base/jdk.internal.reflect.DelegatingMethodAccessorImpl.invoke(DelegatingMethodAccessorImpl.java:43)
09:43:23 [2021-05-04T13:43:23.633Z] 	at java.base/java.lang.reflect.Method.invoke(Method.java:564)
09:43:23 [2021-05-04T13:43:23.633Z] 
09:43:23 [2021-05-04T13:43:23.633Z] org.eclipse.ease.ScriptEngineCancellationException: org.eclipse.ease.ScriptEngineCancellationException: Terminated on user request
09:43:23 [2021-05-04T13:43:23.891Z] Start of script
09:43:23 [2021-05-04T13:43:23.891Z] include file start
09:43:23 [2021-05-04T13:43:23.891Z] include file processed
09:43:23 [2021-05-04T13:43:23.891Z] Result of testMethod = 5
09:43:23 [2021-05-04T13:43:23.891Z] End of script
09:43:24 [2021-05-04T13:43:24.150Z] Start of script
09:43:24 [2021-05-04T13:43:24.150Z] include file start
09:43:24 [2021-05-04T13:43:24.150Z] include file processed
09:43:24 [2021-05-04T13:43:24.150Z] Result of testMethod = 5
09:43:24 [2021-05-04T13:43:24.408Z] Traceback (most recent call last):
09:43:24 [2021-05-04T13:43:24.408Z]   File "(none)", line 184, in run
09:43:24 [2021-05-04T13:43:24.408Z]   File "__ref_L/Debug Test/Main.py_fefbqheovk", line 23, in <module>
09:43:24 [2021-05-04T13:43:24.408Z]   File "(none)", line 161, in trace_dispatch
09:43:24 [2021-05-04T13:43:24.408Z] 	at org.eclipse.ease.debugging.AbstractEaseDebugger.handleEventsInSuspendedState(AbstractEaseDebugger.java:329)
09:43:24 [2021-05-04T13:43:24.408Z] 	at org.eclipse.ease.debugging.AbstractEaseDebugger.suspend(AbstractEaseDebugger.java:255)
09:43:24 [2021-05-04T13:43:24.408Z] 	at org.eclipse.ease.debugging.AbstractEaseDebugger.processLine(AbstractEaseDebugger.java:490)
09:43:24 [2021-05-04T13:43:24.408Z] 	at org.eclipse.ease.lang.python.debugger.PythonDebugger.traceDispatch(PythonDebugger.java:177)
09:43:24 [2021-05-04T13:43:24.408Z] 	at org.eclipse.ease.lang.python.jython.debugger.JythonDebugger.traceDispatch(JythonDebugger.java:44)
09:43:24 [2021-05-04T13:43:24.408Z] 	at jdk.internal.reflect.GeneratedMethodAccessor25.invoke(Unknown Source)
09:43:24 [2021-05-04T13:43:24.408Z] 	at java.base/jdk.internal.reflect.DelegatingMethodAccessorImpl.invoke(DelegatingMethodAccessorImpl.java:43)
09:43:24 [2021-05-04T13:43:24.408Z] 	at java.base/java.lang.reflect.Method.invoke(Method.java:564)
09:43:24 [2021-05-04T13:43:24.408Z] 
09:43:24 [2021-05-04T13:43:24.408Z] org.eclipse.ease.ScriptEngineCancellationException: org.eclipse.ease.ScriptEngineCancellationException: Terminated on user request
09:43:24 [2021-05-04T13:43:24.666Z] Start of script
09:43:24 [2021-05-04T13:43:24.666Z] include file start
09:43:24 [2021-05-04T13:43:24.666Z] include file processed
09:43:24 [2021-05-04T13:43:24.666Z] Result of testMethod = 5
09:43:24 [2021-05-04T13:43:24.666Z] End of script
09:43:24 [2021-05-04T13:43:24.926Z] Start of script
09:43:24 [2021-05-04T13:43:24.926Z] include file start
09:43:24 [2021-05-04T13:43:24.926Z] include file processed
09:43:24 [2021-05-04T13:43:24.926Z] Result of testMethod = 5
09:43:24 [2021-05-04T13:43:24.926Z] End of script
09:43:25 [2021-05-04T13:43:25.185Z] Start of script
09:43:25 [2021-05-04T13:43:25.185Z] include file start
09:43:25 [2021-05-04T13:43:25.185Z] include file processed
09:43:25 [2021-05-04T13:43:25.444Z] Result of testMethod = 5
09:43:25 [2021-05-04T13:43:25.444Z] End of script
09:43:25 [2021-05-04T13:43:25.702Z] Start of script
09:43:25 [2021-05-04T13:43:25.702Z] include file start
09:43:25 [2021-05-04T13:43:25.702Z] include file processed
09:43:25 [2021-05-04T13:43:25.702Z] Result of testMethod = 5
09:43:25 [2021-05-04T13:43:25.702Z] End of script
09:43:25 [2021-05-04T13:43:25.960Z] Start of script
09:43:25 [2021-05-04T13:43:25.960Z] include file start
09:43:25 [2021-05-04T13:43:25.960Z] include file processed
09:43:25 [2021-05-04T13:43:25.960Z] Result of testMethod = 5
09:43:25 [2021-05-04T13:43:25.960Z] Traceback (most recent call last):
09:43:25 [2021-05-04T13:43:25.960Z]   File "(none)", line 184, in run
09:43:25 [2021-05-04T13:43:25.960Z]   File "__ref_L/Debug Test/Main.py_lvvjvfpxqb", line 23, in <module>
09:43:25 [2021-05-04T13:43:25.961Z]   File "(none)", line 161, in trace_dispatch
09:43:25 [2021-05-04T13:43:25.961Z] 	at org.eclipse.ease.debugging.AbstractEaseDebugger.handleEventsInSuspendedState(AbstractEaseDebugger.java:329)
09:43:25 [2021-05-04T13:43:25.961Z] 	at org.eclipse.ease.debugging.AbstractEaseDebugger.suspend(AbstractEaseDebugger.java:255)
09:43:25 [2021-05-04T13:43:25.961Z] 	at org.eclipse.ease.debugging.AbstractEaseDebugger.processLine(AbstractEaseDebugger.java:490)
09:43:25 [2021-05-04T13:43:25.961Z] 	at org.eclipse.ease.lang.python.debugger.PythonDebugger.traceDispatch(PythonDebugger.java:177)
09:43:25 [2021-05-04T13:43:25.961Z] 	at org.eclipse.ease.lang.python.jython.debugger.JythonDebugger.traceDispatch(JythonDebugger.java:44)
09:43:25 [2021-05-04T13:43:25.961Z] 	at jdk.internal.reflect.GeneratedMethodAccessor25.invoke(Unknown Source)
09:43:25 [2021-05-04T13:43:25.961Z] 	at java.base/jdk.internal.reflect.DelegatingMethodAccessorImpl.invoke(DelegatingMethodAccessorImpl.java:43)
09:43:25 [2021-05-04T13:43:25.961Z] 	at java.base/java.lang.reflect.Method.invoke(Method.java:564)
09:43:25 [2021-05-04T13:43:25.961Z] 
09:43:25 [2021-05-04T13:43:25.961Z] org.eclipse.ease.ScriptEngineCancellationException: org.eclipse.ease.ScriptEngineCancellationException: Terminated on user request
09:43:26 [2021-05-04T13:43:26.540Z] Start of script
09:43:26 [2021-05-04T13:43:26.540Z] include file start
09:43:26 [2021-05-04T13:43:26.540Z] include file processed
09:43:26 [2021-05-04T13:43:26.540Z] Result of testMethod = 5
09:43:26 [2021-05-04T13:43:26.540Z] End of script
09:43:26 [2021-05-04T13:43:26.540Z] Start of script
09:43:26 [2021-05-04T13:43:26.540Z] include file start
09:43:26 [2021-05-04T13:43:26.540Z] include file processed
09:43:26 [2021-05-04T13:43:26.540Z] Result of testMethod = 5
09:43:26 [2021-05-04T13:43:26.797Z] Traceback (most recent call last):
09:43:26 [2021-05-04T13:43:26.797Z]   File "(none)", line 184, in run
09:43:26 [2021-05-04T13:43:26.797Z]   File "__ref_L/Debug Test/Main.py_kkfopqtssb", line 23, in <module>
09:43:26 [2021-05-04T13:43:26.797Z]   File "(none)", line 161, in trace_dispatch
09:43:26 [2021-05-04T13:43:26.797Z] 	at org.eclipse.ease.debugging.AbstractEaseDebugger.handleEventsInSuspendedState(AbstractEaseDebugger.java:329)
09:43:26 [2021-05-04T13:43:26.797Z] 	at org.eclipse.ease.debugging.AbstractEaseDebugger.suspend(AbstractEaseDebugger.java:255)
09:43:26 [2021-05-04T13:43:26.797Z] 	at org.eclipse.ease.debugging.AbstractEaseDebugger.processLine(AbstractEaseDebugger.java:490)
09:43:26 [2021-05-04T13:43:26.797Z] 	at org.eclipse.ease.lang.python.debugger.PythonDebugger.traceDispatch(PythonDebugger.java:177)
09:43:26 [2021-05-04T13:43:26.797Z] 	at org.eclipse.ease.lang.python.jython.debugger.JythonDebugger.traceDispatch(JythonDebugger.java:44)
09:43:26 [2021-05-04T13:43:26.798Z] 	at jdk.internal.reflect.GeneratedMethodAccessor25.invoke(Unknown Source)
09:43:26 [2021-05-04T13:43:26.798Z] 	at java.base/jdk.internal.reflect.DelegatingMethodAccessorImpl.invoke(DelegatingMethodAccessorImpl.java:43)
09:43:26 [2021-05-04T13:43:26.798Z] 	at java.base/java.lang.reflect.Method.invoke(Method.java:564)
09:43:26 [2021-05-04T13:43:26.798Z] 
09:43:26 [2021-05-04T13:43:26.798Z] org.eclipse.ease.ScriptEngineCancellationException: org.eclipse.ease.ScriptEngineCancellationException: Terminated on user request
09:43:26 [2021-05-04T13:43:26.798Z] Traceback (most recent call last):
09:43:26 [2021-05-04T13:43:26.798Z]   File "(none)", line 184, in run
09:43:26 [2021-05-04T13:43:26.798Z]   File "__ref_L/Debug Test/Main.py_vylyxzlsir", line 1, in <module>
09:43:26 [2021-05-04T13:43:26.798Z]   File "(none)", line 161, in trace_dispatch
09:43:26 [2021-05-04T13:43:26.798Z] 	at org.eclipse.ease.debugging.AbstractEaseDebugger.handleEventsInSuspendedState(AbstractEaseDebugger.java:329)
09:43:26 [2021-05-04T13:43:26.798Z] 	at org.eclipse.ease.debugging.AbstractEaseDebugger.suspend(AbstractEaseDebugger.java:255)
09:43:26 [2021-05-04T13:43:26.798Z] 	at org.eclipse.ease.debugging.AbstractEaseDebugger.processLine(AbstractEaseDebugger.java:490)
09:43:26 [2021-05-04T13:43:26.798Z] 	at org.eclipse.ease.lang.python.debugger.PythonDebugger.traceDispatch(PythonDebugger.java:177)
09:43:26 [2021-05-04T13:43:26.798Z] 	at org.eclipse.ease.lang.python.jython.debugger.JythonDebugger.traceDispatch(JythonDebugger.java:44)
09:43:26 [2021-05-04T13:43:26.798Z] 	at jdk.internal.reflect.GeneratedMethodAccessor25.invoke(Unknown Source)
09:43:26 [2021-05-04T13:43:26.798Z] 	at java.base/jdk.internal.reflect.DelegatingMethodAccessorImpl.invoke(DelegatingMethodAccessorImpl.java:43)
09:43:26 [2021-05-04T13:43:26.798Z] 	at java.base/java.lang.reflect.Method.invoke(Method.java:564)
09:43:26 [2021-05-04T13:43:26.798Z] 
09:43:26 [2021-05-04T13:43:26.798Z] org.eclipse.ease.ScriptEngineCancellationException: org.eclipse.ease.ScriptEngineCancellationException: Terminated on user request
09:43:27 [2021-05-04T13:43:27.056Z] Start of script
09:43:27 [2021-05-04T13:43:27.056Z] include file start
09:43:27 [2021-05-04T13:43:27.056Z] include file processed
09:43:27 [2021-05-04T13:43:27.056Z] Result of testMethod = 5
09:43:27 [2021-05-04T13:43:27.056Z] End of script
09:43:27 [2021-05-04T13:43:27.314Z] Start of script
09:43:27 [2021-05-04T13:43:27.314Z] include file start
09:43:27 [2021-05-04T13:43:27.314Z] include file processed
09:43:27 [2021-05-04T13:43:27.314Z] Result of testMethod = 5
09:43:27 [2021-05-04T13:43:27.314Z] End of script
09:43:27 [2021-05-04T13:43:27.572Z] Start of script
09:43:27 [2021-05-04T13:43:27.832Z] include file start
09:43:27 [2021-05-04T13:43:27.832Z] include file processed
09:43:27 [2021-05-04T13:43:27.832Z] Result of testMethod = 5
09:43:27 [2021-05-04T13:43:27.833Z] End of script
09:43:27 [2021-05-04T13:43:27.833Z] Tests run: 42, Failures: 1, Errors: 0, Skipped: 0, Time elapsed: 21.889 s <<< FAILURE! - in org.eclipse.ease.lang.python.jython.debugger.JythonDebugTest
09:43:27 [2021-05-04T13:43:27.833Z] disconnectProcessInSuspendedState  Time elapsed: 7.081 s
09:43:27 [2021-05-04T13:43:27.833Z] stepReturnIncludeCommand  Time elapsed: 0.366 s
09:43:27 [2021-05-04T13:43:27.833Z] arrayVariableSorting  Time elapsed: 0.419 s
09:43:27 [2021-05-04T13:43:27.833Z] stepOverOnDebugTarget  Time elapsed: 0.606 s
09:43:27 [2021-05-04T13:43:27.833Z] hasDebugTarget  Time elapsed: 0.325 s
09:43:27 [2021-05-04T13:43:27.833Z] disconnectThreadInSuspendedState  Time elapsed: 0.314 s
09:43:27 [2021-05-04T13:43:27.833Z] stepReturnOnDebugTarget  Time elapsed: 0.577 s
09:43:27 [2021-05-04T13:43:27.833Z] nullVariable  Time elapsed: 0.44 s
09:43:27 [2021-05-04T13:43:27.833Z] stepOverOnStackFrame  Time elapsed: 0.411 s
09:43:27 [2021-05-04T13:43:27.833Z] resumeOnDebugTarget  Time elapsed: 0.421 s
09:43:27 [2021-05-04T13:43:27.833Z] modifyVariableKeepingType  Time elapsed: 0.612 s
09:43:27 [2021-05-04T13:43:27.833Z] resumeOnLastIncludeLine  Time elapsed: 0.312 s
09:43:27 [2021-05-04T13:43:27.833Z] stepReturnOnStackFrame  Time elapsed: 0.413 s
09:43:27 [2021-05-04T13:43:27.833Z] terminateStackFrameInSuspendedState  Time elapsed: 0.21 s
09:43:27 [2021-05-04T13:43:27.833Z] breakpointLocation  Time elapsed: 0.411 s
09:43:27 [2021-05-04T13:43:27.833Z] stepReturnOnThread  Time elapsed: 0.412 s
09:43:27 [2021-05-04T13:43:27.833Z] javaClassVariable  Time elapsed: 0.42 s
09:43:27 [2021-05-04T13:43:27.833Z] stepIntoOnThread  Time elapsed: 0.411 s
09:43:27 [2021-05-04T13:43:27.833Z] terminateThreadInSuspendedState  Time elapsed: 0.209 s
09:43:27 [2021-05-04T13:43:27.833Z] resumeOnThread  Time elapsed: 0.209 s
09:43:27 [2021-05-04T13:43:27.833Z] stepIntoOnStackFrame  Time elapsed: 0.538 s
09:43:27 [2021-05-04T13:43:27.833Z] terminateProcessInSuspendedState  Time elapsed: 0.212 s
09:43:27 [2021-05-04T13:43:27.833Z] stepOverOnProcess  Time elapsed: 0.414 s
09:43:27 [2021-05-04T13:43:27.833Z] nativeArrayVariable  Time elapsed: 0.31 s
09:43:27 [2021-05-04T13:43:27.833Z] disconnectDebugTargetInSuspendedState  Time elapsed: 0.208 s
09:43:27 [2021-05-04T13:43:27.833Z] stepIntoOnProcess  Time elapsed: 0.453 s
09:43:27 [2021-05-04T13:43:27.833Z] terminatedState  Time elapsed: 0.206 s
09:43:27 [2021-05-04T13:43:27.833Z] stepOverIncludeCommand  Time elapsed: 0.31 s
09:43:27 [2021-05-04T13:43:27.833Z] innerScopeVariableBeforeOuterScopeVariable  Time elapsed: 0.408 s
09:43:27 [2021-05-04T13:43:27.833Z] stepIntoIncludeCommand  Time elapsed: 0.309 s
09:43:27 [2021-05-04T13:43:27.833Z] primitiveStringVariable  Time elapsed: 0.41 s
09:43:27 [2021-05-04T13:43:27.833Z] resumeOnProcess  Time elapsed: 0.311 s
09:43:27 [2021-05-04T13:43:27.833Z] stepIntoOnDebugTarget  Time elapsed: 0.409 s
09:43:27 [2021-05-04T13:43:27.833Z] stepOverOnThread  Time elapsed: 0.434 s
09:43:27 [2021-05-04T13:43:27.833Z] suspendedState  Time elapsed: 0.207 s
09:43:27 [2021-05-04T13:43:27.833Z] primitiveDoubleVariable  Time elapsed: 0.307 s
09:43:27 [2021-05-04T13:43:27.833Z] resumeOnStackFrame  Time elapsed: 0.415 s  <<< FAILURE!
09:43:27 [2021-05-04T13:43:27.833Z] org.opentest4j.AssertionFailedError: expected: <1> but was: <0>
09:43:27 [2021-05-04T13:43:27.833Z] 	at org.eclipse.ease.testhelper.AbstractDebugTest.resumeTestTemplate(AbstractDebugTest.java:449)
09:43:27 [2021-05-04T13:43:27.833Z] 	at org.eclipse.ease.testhelper.AbstractDebugTest.resumeOnStackFrame(AbstractDebugTest.java:473)
09:43:27 [2021-05-04T13:43:27.833Z] 
09:43:27 [2021-05-04T13:43:27.833Z] nativeObjectVariable  Time elapsed: 0.308 s
09:43:27 [2021-05-04T13:43:27.833Z] terminateDebugTargetInSuspendedState  Time elapsed: 0.208 s
09:43:27 [2021-05-04T13:43:27.833Z] disconnectStackFrameInSuspendedState  Time elapsed: 0.208 s
09:43:27 [2021-05-04T13:43:27.833Z] stepReturnOnProcess  Time elapsed: 0.309 s
09:43:27 [2021-05-04T13:43:27.833Z] evaluateWatchExpression  Time elapsed: 0.342 s
09:43:27 [2021-05-04T13:43:27.833Z] 
09:43:27 [2021-05-04T13:43:27.833Z] Results:
09:43:27 [2021-05-04T13:43:27.833Z] 
09:43:27 [2021-05-04T13:43:27.833Z] Failures: 
09:43:27 [2021-05-04T13:43:27.833Z]   AbstractDebugTest.resumeOnStackFrame:473->resumeTestTemplate:449 expected: <1> but was: <0>
09:43:27 [2021-05-04T13:43:27.833Z] 
09:43:27 [2021-05-04T13:43:27.833Z] Tests run: 42, Failures: 1, Errors: 0, Skipped: 0
09:43:27 [2021-05-04T13:43:27.833Z] 
09:43:29 [2021-05-04T13:43:29.732Z] [INFO] ------------------------------------------------------------------------
09:43:29 [2021-05-04T13:43:29.732Z] [INFO] Reactor Summary:
09:43:29 [2021-05-04T13:43:29.732Z] [INFO] 
09:43:29 [2021-05-04T13:43:29.732Z] [INFO] org.eclipse.ease.classloader 0.8.0-SNAPSHOT ........ SUCCESS [01:22 min]
09:43:29 [2021-05-04T13:43:29.732Z] [INFO] org.eclipse.ease 0.8.0-SNAPSHOT .................... SUCCESS [ 31.985 s]
09:43:29 [2021-05-04T13:43:29.732Z] [INFO] org.eclipse.ease.ui 0.8.0-SNAPSHOT ................. SUCCESS [ 41.095 s]
09:43:29 [2021-05-04T13:43:29.732Z] [INFO] org.eclipse.ease.ui.completions.java 0.8.0-SNAPSHOT  SUCCESS [ 14.799 s]
09:43:29 [2021-05-04T13:43:29.733Z] [INFO] org.eclipse.ease.ui.scripts 0.8.0-SNAPSHOT ......... SUCCESS [ 31.466 s]
09:43:29 [2021-05-04T13:43:29.733Z] [INFO] org.eclipse.ease.releng 0.8.0-SNAPSHOT ............. SUCCESS [  1.047 s]
09:43:29 [2021-05-04T13:43:29.733Z] [INFO] org.eclipse.ease.lang.javascript 0.8.0-SNAPSHOT .... SUCCESS [ 10.484 s]
09:43:29 [2021-05-04T13:43:29.733Z] [INFO] org.eclipse.ease.lang.scriptarchive 0.8.0-SNAPSHOT . SUCCESS [  8.891 s]
09:43:29 [2021-05-04T13:43:29.733Z] [INFO] org.eclipse.ease.lang.python 0.8.0-SNAPSHOT ........ SUCCESS [ 12.667 s]
09:43:29 [2021-05-04T13:43:29.733Z] [INFO] org.eclipse.ease.lang.python.py4j 0.8.0-SNAPSHOT ... SUCCESS [ 11.847 s]
09:43:29 [2021-05-04T13:43:29.733Z] [INFO] org.eclipse.ease.lang.groovy 0.8.0-SNAPSHOT ........ SUCCESS [  8.185 s]
09:43:29 [2021-05-04T13:43:29.733Z] [INFO] org.eclipse.ease.lang.groovy.interpreter 0.8.0-SNAPSHOT SUCCESS [  8.523 s]
09:43:29 [2021-05-04T13:43:29.733Z] [INFO] org.eclipse.ease.lang.unittest 0.8.0-SNAPSHOT ...... SUCCESS [ 19.273 s]
09:43:29 [2021-05-04T13:43:29.733Z] [INFO] org.eclipse.ease.lang.unittest.ui 0.8.0-SNAPSHOT ... SUCCESS [ 24.187 s]
09:43:29 [2021-05-04T13:43:29.733Z] [INFO] org.eclipse.ease.lang.ruby 0.8.0-SNAPSHOT .......... SUCCESS [  8.909 s]
09:43:29 [2021-05-04T13:43:29.733Z] [INFO] org.eclipse.ease.lang.ruby.jruby 0.8.0-SNAPSHOT .... SUCCESS [  7.452 s]
09:43:29 [2021-05-04T13:43:29.733Z] [INFO] org.eclipse.ease.lang.javascript.nashorn 0.8.0-SNAPSHOT SUCCESS [  9.256 s]
09:43:29 [2021-05-04T13:43:29.733Z] [INFO] org.eclipse.ease.lang.javascript.rhino 0.8.0-SNAPSHOT SUCCESS [ 13.346 s]
09:43:29 [2021-05-04T13:43:29.733Z] [INFO] org.eclipse.ease.lang.python.jython 0.8.0-SNAPSHOT . SUCCESS [ 14.434 s]
09:43:29 [2021-05-04T13:43:29.733Z] [INFO] org.eclipse.ease.lang.javascript.ui 0.8.0-SNAPSHOT . SUCCESS [ 10.109 s]
09:43:29 [2021-05-04T13:43:29.733Z] [INFO] org.eclipse.ease.lang.jvm.compiled 0.8.0-SNAPSHOT .. SUCCESS [  9.235 s]
09:43:29 [2021-05-04T13:43:29.733Z] [INFO] org.eclipse.ease.lang.scriptarchive.ui 0.8.0-SNAPSHOT SUCCESS [ 12.827 s]
09:43:29 [2021-05-04T13:43:29.733Z] [INFO] org.eclipse.ease.help 0.8.0-SNAPSHOT ............... SUCCESS [ 16.662 s]
09:43:29 [2021-05-04T13:43:29.733Z] [INFO] org.eclipse.ease.feature 0.8.0-SNAPSHOT ............ SUCCESS [  0.554 s]
09:43:29 [2021-05-04T13:43:29.733Z] [INFO] org.eclipse.ease.ui.feature 0.8.0-SNAPSHOT ......... SUCCESS [  0.231 s]
09:43:29 [2021-05-04T13:43:29.733Z] [INFO] org.eclipse.ease.lang.javascript.feature 0.8.0-SNAPSHOT SUCCESS [  0.211 s]
09:43:29 [2021-05-04T13:43:29.733Z] [INFO] org.eclipse.ease.lang.python.feature 0.8.0-SNAPSHOT  SUCCESS [  0.219 s]
09:43:29 [2021-05-04T13:43:29.733Z] [INFO] org.eclipse.ease.python.jython.feature 0.8.0-SNAPSHOT SUCCESS [  0.253 s]
09:43:29 [2021-05-04T13:43:29.733Z] [INFO] org.eclipse.ease.lang.python.py4j.feature 0.8.0-SNAPSHOT SUCCESS [  0.134 s]
09:43:29 [2021-05-04T13:43:29.733Z] [INFO] org.eclipse.ease.lang.jvm.feature 0.8.0-SNAPSHOT ... SUCCESS [  0.180 s]
09:43:29 [2021-05-04T13:43:29.733Z] [INFO] org.eclipse.ease.lang.groovy.feature 0.8.0-SNAPSHOT  SUCCESS [  0.396 s]
09:43:29 [2021-05-04T13:43:29.733Z] [INFO] org.eclipse.ease.lang.ruby.feature 0.8.0-SNAPSHOT .. SUCCESS [  0.226 s]
09:43:29 [2021-05-04T13:43:29.733Z] [INFO] org.eclipse.ease.lang.scriptarchive.feature 0.8.0-SNAPSHOT SUCCESS [  0.195 s]
09:43:29 [2021-05-04T13:43:29.733Z] [INFO] org.eclipse.ease.lang.unittest.feature 0.8.0-SNAPSHOT SUCCESS [  0.178 s]
09:43:29 [2021-05-04T13:43:29.733Z] [INFO] org.eclipse.ease.releng.target 0.8.0-SNAPSHOT ...... SUCCESS [  0.009 s]
09:43:29 [2021-05-04T13:43:29.733Z] [INFO] org.eclipse.ease.releng.p2 0.8.0-SNAPSHOT .......... SUCCESS [ 15.516 s]
09:43:29 [2021-05-04T13:43:29.733Z] [INFO] org.eclipse.ease.testhelper 0.8.0-SNAPSHOT ......... SUCCESS [ 20.919 s]
09:43:29 [2021-05-04T13:43:29.733Z] [INFO] org.eclipse.ease.test 0.8.0-SNAPSHOT ............... SUCCESS [ 43.232 s]
09:43:29 [2021-05-04T13:43:29.733Z] [INFO] org.eclipse.ease.lang.javascript.rhino.test 0.8.0-SNAPSHOT SUCCESS [ 35.062 s]
09:43:29 [2021-05-04T13:43:29.733Z] [INFO] org.eclipse.ease.lang.javascript.test 0.8.0-SNAPSHOT SUCCESS [ 19.310 s]
09:43:29 [2021-05-04T13:43:29.733Z] [INFO] org.eclipse.ease.lang.python.test 0.8.0-SNAPSHOT ... SUCCESS [ 13.748 s]
09:43:29 [2021-05-04T13:43:29.733Z] [INFO] org.eclipse.ease.lang.python.jython.test 0.8.0-SNAPSHOT FAILURE [ 31.904 s]
09:43:29 [2021-05-04T13:43:29.733Z] [INFO] org.eclipse.ease.lang.scriptarchive.test 0.8.0-SNAPSHOT SKIPPED
09:43:29 [2021-05-04T13:43:29.733Z] [INFO] org.eclipse.ease.lang.unittest.test 0.8.0-SNAPSHOT . SKIPPED
09:43:29 [2021-05-04T13:43:29.733Z] [INFO] org.eclipse.ease.ui.scripts.test 0.8.0-SNAPSHOT .... SKIPPED
09:43:29 [2021-05-04T13:43:29.733Z] [INFO] org.eclipse.ease.ui.test 0.8.0-SNAPSHOT ............ SKIPPED
09:43:29 [2021-05-04T13:43:29.733Z] [INFO] org.eclipse.ease.releng.coverage 0.8.0-SNAPSHOT .... SKIPPED
09:43:29 [2021-05-04T13:43:29.733Z] [INFO] EASE (Incubation) 0.4.0-SNAPSHOT ................... SKIPPED
09:43:29 [2021-05-04T13:43:29.733Z] [INFO] ------------------------------------------------------------------------
09:43:29 [2021-05-04T13:43:29.733Z] [INFO] BUILD FAILURE
09:43:29 [2021-05-04T13:43:29.733Z] [INFO] ------------------------------------------------------------------------
09:43:29 [2021-05-04T13:43:29.733Z] [INFO] Total time:  13:40 min
09:43:29 [2021-05-04T13:43:29.733Z] [INFO] Finished at: 2021-05-04T13:43:29Z
09:43:29 [2021-05-04T13:43:29.733Z] [INFO] ------------------------------------------------------------------------
09:43:29 [2021-05-04T13:43:29.733Z] [INFO] [jenkins-event-spy] Generated /home/jenkins/agent/workspace/ease.verify.core.target.2019-06@tmp/withMavencbe230fa/maven-spy-20210504-132948-2538436574942508209929.log
09:43:29 [2021-05-04T13:43:29.733Z] [ERROR] Failed to execute goal org.eclipse.tycho:tycho-surefire-plugin:2.2.0:test (default-test) on project org.eclipse.ease.lang.python.jython.test: There are test failures.
09:43:29 [2021-05-04T13:43:29.733Z] [ERROR] 
09:43:29 [2021-05-04T13:43:29.733Z] [ERROR] Please refer to /home/jenkins/agent/workspace/ease.verify.core.target.2019-06/tests/org.eclipse.ease.lang.python.jython.test/target/surefire-reports for the individual test results.
09:43:29 [2021-05-04T13:43:29.733Z] [ERROR] -> [Help 1]
09:43:29 [2021-05-04T13:43:29.734Z] [ERROR] 
09:43:29 [2021-05-04T13:43:29.734Z] [ERROR] To see the full stack trace of the errors, re-run Maven with the -e switch.
09:43:29 [2021-05-04T13:43:29.734Z] [ERROR] Re-run Maven using the -X switch to enable full debug logging.
09:43:29 [2021-05-04T13:43:29.734Z] [ERROR] 
09:43:29 [2021-05-04T13:43:29.734Z] [ERROR] For more information about the errors and possible solutions, please read the following articles:
09:43:29 [2021-05-04T13:43:29.734Z] [ERROR] [Help 1] http://cwiki.apache.org/confluence/display/MAVEN/MojoFailureException
09:43:29 [2021-05-04T13:43:29.734Z] [ERROR] 
09:43:29 [2021-05-04T13:43:29.734Z] [ERROR] After correcting the problems, you can resume the build with the command
09:43:29 [2021-05-04T13:43:29.734Z] [ERROR]   mvn <args> -rf :org.eclipse.ease.lang.python.jython.test
[Pipeline] }
09:43:38 [2021-05-04T13:43:38.260Z] [withMaven] junitPublisher - Archive test results for Maven artifact org.eclipse.ease:org.eclipse.ease.test:eclipse-test-plugin:0.8.0-SNAPSHOT generated by tycho-surefire-plugin:test (default-test): tests/org.eclipse.ease.test/target/surefire-reports/*.xml
09:43:38 [2021-05-04T13:43:38.260Z] [withMaven] junitPublisher - Archive test results for Maven artifact org.eclipse.ease:org.eclipse.ease.lang.javascript.rhino.test:eclipse-test-plugin:0.8.0-SNAPSHOT generated by tycho-surefire-plugin:test (default-test): tests/org.eclipse.ease.lang.javascript.rhino.test/target/surefire-reports/*.xml
09:43:38 [2021-05-04T13:43:38.260Z] [withMaven] junitPublisher - Archive test results for Maven artifact org.eclipse.ease:org.eclipse.ease.lang.javascript.test:eclipse-test-plugin:0.8.0-SNAPSHOT generated by tycho-surefire-plugin:test (default-test): tests/org.eclipse.ease.lang.javascript.test/target/surefire-reports/*.xml
09:43:38 [2021-05-04T13:43:38.260Z] [withMaven] junitPublisher - Archive test results for Maven artifact org.eclipse.ease:org.eclipse.ease.lang.python.test:eclipse-test-plugin:0.8.0-SNAPSHOT generated by tycho-surefire-plugin:test (default-test): tests/org.eclipse.ease.lang.python.test/target/surefire-reports/*.xml
09:43:38 [2021-05-04T13:43:38.260Z] [withMaven] junitPublisher - Archive test results for Maven artifact org.eclipse.ease:org.eclipse.ease.lang.python.jython.test:eclipse-test-plugin:0.8.0-SNAPSHOT generated by tycho-surefire-plugin:test (default-test): tests/org.eclipse.ease.lang.python.jython.test/target/surefire-reports/*.xml
09:43:38 [2021-05-04T13:43:38.262Z] [withMaven] junitPublisher - Jenkins JUnit Attachments Plugin not found, can't publish test attachments.Recording test results
09:43:40 [2021-05-04T13:43:40.950Z] [withMaven] Jenkins JaCoCo Plugin not found, don't display org.jacoco:jacoco-maven-plugin:prepare-agent[-integration] results in pipeline screen.
09:43:40 [2021-05-04T13:43:40.953Z] [withMaven] Jenkins FindBugs Plugin not found, don't display com.github.spotbugs:spotbugs-maven-plugin:spotbugs results in pipeline screen.
09:43:40 [2021-05-04T13:43:40.956Z] [withMaven] Publishers: Pipeline Graph Publisher: 66 ms, Invoker Publisher: 1 ms, Junit Publisher: 549 ms, Concordion Publisher: 1 ms, Dependencies Fingerprint Publisher: 2124 ms, Findbugs Publisher: 1 ms, Jacoco Publisher: 2 ms, SpotBugs Publisher: 1 ms
[Pipeline] // withMaven
[Pipeline] }
[Pipeline] // stage
[Pipeline] stage
[Pipeline] { (Test)
Stage "Test" skipped due to earlier failure(s)
[Pipeline] }
[Pipeline] // stage
[Pipeline] stage
[Pipeline] { (Declarative: Post Actions)
[Pipeline] archiveArtifacts
09:43:41 [2021-05-04T13:43:41.133Z] Archiving artifacts
[Pipeline] emailext
09:43:58 [2021-05-04T13:43:58.737Z] Sending email to: christian.pontesegger@web.de
[Pipeline] }
[Pipeline] // stage
[Pipeline] }
[Pipeline] // timeout
[Pipeline] }
[Pipeline] // timestamps
[Pipeline] }
[Pipeline] // node
[Pipeline] End of Pipeline
ERROR: script returned exit code 1
Finished: FAILURE