SuccessConsole Output

Skipping 203 KB.. Full Log
29T14:37:02.442Z] hasDebugTarget(org.eclipse.ease.lang.python.jython.debugger.JythonDebugTest)  Time elapsed: 0.105 s
09:37:02 [2020-12-29T14:37:02.442Z] disconnectThreadInSuspendedState(org.eclipse.ease.lang.python.jython.debugger.JythonDebugTest)  Time elapsed: 0.207 s
09:37:02 [2020-12-29T14:37:02.442Z] stepReturnOnDebugTarget(org.eclipse.ease.lang.python.jython.debugger.JythonDebugTest)  Time elapsed: 0.308 s
09:37:02 [2020-12-29T14:37:02.442Z] nullVariable(org.eclipse.ease.lang.python.jython.debugger.JythonDebugTest)  Time elapsed: 0.307 s
09:37:02 [2020-12-29T14:37:02.442Z] stepOverOnStackFrame(org.eclipse.ease.lang.python.jython.debugger.JythonDebugTest)  Time elapsed: 0.308 s
09:37:02 [2020-12-29T14:37:02.442Z] resumeOnDebugTarget(org.eclipse.ease.lang.python.jython.debugger.JythonDebugTest)  Time elapsed: 0.207 s
09:37:02 [2020-12-29T14:37:02.442Z] modifyVariableKeepingType(org.eclipse.ease.lang.python.jython.debugger.JythonDebugTest)  Time elapsed: 0.506 s
09:37:02 [2020-12-29T14:37:02.442Z] resumeOnLastIncludeLine(org.eclipse.ease.lang.python.jython.debugger.JythonDebugTest)  Time elapsed: 0.207 s
09:37:02 [2020-12-29T14:37:02.442Z] stepReturnOnStackFrame(org.eclipse.ease.lang.python.jython.debugger.JythonDebugTest)  Time elapsed: 0.308 s
09:37:02 [2020-12-29T14:37:02.442Z] terminateStackFrameInSuspendedState(org.eclipse.ease.lang.python.jython.debugger.JythonDebugTest)  Time elapsed: 0.208 s
09:37:02 [2020-12-29T14:37:02.442Z] breakpointLocation(org.eclipse.ease.lang.python.jython.debugger.JythonDebugTest)  Time elapsed: 0.207 s
09:37:02 [2020-12-29T14:37:02.442Z] stepReturnOnThread(org.eclipse.ease.lang.python.jython.debugger.JythonDebugTest)  Time elapsed: 0.309 s
09:37:02 [2020-12-29T14:37:02.442Z] javaClassVariable(org.eclipse.ease.lang.python.jython.debugger.JythonDebugTest)  Time elapsed: 0.308 s
09:37:02 [2020-12-29T14:37:02.442Z] stepIntoOnThread(org.eclipse.ease.lang.python.jython.debugger.JythonDebugTest)  Time elapsed: 0.307 s
09:37:02 [2020-12-29T14:37:02.442Z] terminateThreadInSuspendedState(org.eclipse.ease.lang.python.jython.debugger.JythonDebugTest)  Time elapsed: 0.207 s
09:37:02 [2020-12-29T14:37:02.442Z] resumeOnThread(org.eclipse.ease.lang.python.jython.debugger.JythonDebugTest)  Time elapsed: 0.206 s
09:37:02 [2020-12-29T14:37:02.442Z] stepIntoOnStackFrame(org.eclipse.ease.lang.python.jython.debugger.JythonDebugTest)  Time elapsed: 0.306 s
09:37:02 [2020-12-29T14:37:02.442Z] terminateProcessInSuspendedState(org.eclipse.ease.lang.python.jython.debugger.JythonDebugTest)  Time elapsed: 0.207 s
09:37:02 [2020-12-29T14:37:02.442Z] stepOverOnProcess(org.eclipse.ease.lang.python.jython.debugger.JythonDebugTest)  Time elapsed: 0.306 s
09:37:02 [2020-12-29T14:37:02.442Z] nativeArrayVariable(org.eclipse.ease.lang.python.jython.debugger.JythonDebugTest)  Time elapsed: 0.306 s
09:37:02 [2020-12-29T14:37:02.442Z] disconnectDebugTargetInSuspendedState(org.eclipse.ease.lang.python.jython.debugger.JythonDebugTest)  Time elapsed: 0.206 s
09:37:02 [2020-12-29T14:37:02.442Z] stepIntoOnProcess(org.eclipse.ease.lang.python.jython.debugger.JythonDebugTest)  Time elapsed: 0.307 s
09:37:02 [2020-12-29T14:37:02.442Z] terminatedState(org.eclipse.ease.lang.python.jython.debugger.JythonDebugTest)  Time elapsed: 0.104 s
09:37:02 [2020-12-29T14:37:02.443Z] stepOverIncludeCommand(org.eclipse.ease.lang.python.jython.debugger.JythonDebugTest)  Time elapsed: 0.304 s
09:37:02 [2020-12-29T14:37:02.443Z] innerScopeVariableBeforeOuterScopeVariable(org.eclipse.ease.lang.python.jython.debugger.JythonDebugTest)  Time elapsed: 0.307 s
09:37:02 [2020-12-29T14:37:02.443Z] stepIntoIncludeCommand(org.eclipse.ease.lang.python.jython.debugger.JythonDebugTest)  Time elapsed: 0.305 s
09:37:02 [2020-12-29T14:37:02.443Z] primitiveStringVariable(org.eclipse.ease.lang.python.jython.debugger.JythonDebugTest)  Time elapsed: 0.307 s
09:37:02 [2020-12-29T14:37:02.443Z] resumeOnProcess(org.eclipse.ease.lang.python.jython.debugger.JythonDebugTest)  Time elapsed: 0.205 s
09:37:02 [2020-12-29T14:37:02.443Z] stepIntoOnDebugTarget(org.eclipse.ease.lang.python.jython.debugger.JythonDebugTest)  Time elapsed: 0.307 s
09:37:02 [2020-12-29T14:37:02.443Z] stepOverOnThread(org.eclipse.ease.lang.python.jython.debugger.JythonDebugTest)  Time elapsed: 0.306 s
09:37:02 [2020-12-29T14:37:02.443Z] suspendedState(org.eclipse.ease.lang.python.jython.debugger.JythonDebugTest)  Time elapsed: 0.206 s
09:37:02 [2020-12-29T14:37:02.443Z] primitiveDoubleVariable(org.eclipse.ease.lang.python.jython.debugger.JythonDebugTest)  Time elapsed: 0.306 s
09:37:02 [2020-12-29T14:37:02.443Z] resumeOnStackFrame(org.eclipse.ease.lang.python.jython.debugger.JythonDebugTest)  Time elapsed: 0.205 s
09:37:02 [2020-12-29T14:37:02.443Z] nativeObjectVariable(org.eclipse.ease.lang.python.jython.debugger.JythonDebugTest)  Time elapsed: 0.305 s
09:37:02 [2020-12-29T14:37:02.443Z] terminateDebugTargetInSuspendedState(org.eclipse.ease.lang.python.jython.debugger.JythonDebugTest)  Time elapsed: 0.205 s
09:37:02 [2020-12-29T14:37:02.443Z] disconnectStackFrameInSuspendedState(org.eclipse.ease.lang.python.jython.debugger.JythonDebugTest)  Time elapsed: 0.205 s
09:37:02 [2020-12-29T14:37:02.443Z] stepReturnOnProcess(org.eclipse.ease.lang.python.jython.debugger.JythonDebugTest)  Time elapsed: 0.307 s
09:37:02 [2020-12-29T14:37:02.443Z] evaluateWatchExpression(org.eclipse.ease.lang.python.jython.debugger.JythonDebugTest)  Time elapsed: 0.208 s
09:37:02 [2020-12-29T14:37:02.443Z] 
09:37:02 [2020-12-29T14:37:02.443Z] Results:
09:37:02 [2020-12-29T14:37:02.443Z] 
09:37:02 [2020-12-29T14:37:02.443Z] Tests run: 42, Failures: 0, Errors: 0, Skipped: 0
09:37:02 [2020-12-29T14:37:02.443Z] 
09:37:03 [2020-12-29T14:37:03.004Z] [INFO] All tests passed!
09:37:03 [2020-12-29T14:37:03.004Z] [INFO] 
09:37:03 [2020-12-29T14:37:03.004Z] [INFO] ------< org.eclipse.ease:org.eclipse.ease.lang.python.py4j.test >-------
09:37:03 [2020-12-29T14:37:03.004Z] [INFO] Building org.eclipse.ease.lang.python.py4j.test 0.8.0-SNAPSHOT    [9/11]
09:37:03 [2020-12-29T14:37:03.004Z] [INFO] ------------------------[ eclipse-test-plugin ]-------------------------
09:37:03 [2020-12-29T14:37:03.004Z] [INFO] 
09:37:03 [2020-12-29T14:37:03.004Z] [INFO] --- tycho-packaging-plugin:1.5.0:build-qualifier (default-build-qualifier) @ org.eclipse.ease.lang.python.py4j.test ---
09:37:03 [2020-12-29T14:37:03.004Z] [INFO] The project's OSGi version is 0.8.0.I201912021001
09:37:03 [2020-12-29T14:37:03.004Z] [INFO] 
09:37:03 [2020-12-29T14:37:03.004Z] [INFO] --- tycho-packaging-plugin:1.5.0:validate-id (default-validate-id) @ org.eclipse.ease.lang.python.py4j.test ---
09:37:03 [2020-12-29T14:37:03.004Z] [INFO] 
09:37:03 [2020-12-29T14:37:03.004Z] [INFO] --- tycho-packaging-plugin:1.5.0:validate-version (default-validate-version) @ org.eclipse.ease.lang.python.py4j.test ---
09:37:03 [2020-12-29T14:37:03.004Z] [INFO] 
09:37:03 [2020-12-29T14:37:03.004Z] [INFO] --- maven-resources-plugin:2.4.3:resources (default-resources) @ org.eclipse.ease.lang.python.py4j.test ---
09:37:03 [2020-12-29T14:37:03.004Z] [INFO] Using 'UTF-8' encoding to copy filtered resources.
09:37:03 [2020-12-29T14:37:03.004Z] [INFO] skip non existing resourceDirectory /home/jenkins/agent/workspace/ease.verify.core.target.2019-06/tests/org.eclipse.ease.lang.python.py4j.test/src/main/resources
09:37:03 [2020-12-29T14:37:03.004Z] [INFO] 
09:37:03 [2020-12-29T14:37:03.004Z] [INFO] --- tycho-compiler-plugin:1.5.0:compile (default-compile) @ org.eclipse.ease.lang.python.py4j.test ---
09:37:03 [2020-12-29T14:37:03.005Z] [INFO] Compiling 10 source files to /home/jenkins/agent/workspace/ease.verify.core.target.2019-06/tests/org.eclipse.ease.lang.python.py4j.test/target/classes
09:37:04 [2020-12-29T14:37:04.438Z] [INFO] 
09:37:04 [2020-12-29T14:37:04.438Z] [INFO] --- maven-resources-plugin:2.4.3:testResources (default-testResources) @ org.eclipse.ease.lang.python.py4j.test ---
09:37:04 [2020-12-29T14:37:04.438Z] [INFO] Using 'UTF-8' encoding to copy filtered resources.
09:37:04 [2020-12-29T14:37:04.438Z] [INFO] skip non existing resourceDirectory /home/jenkins/agent/workspace/ease.verify.core.target.2019-06/tests/org.eclipse.ease.lang.python.py4j.test/src/test/resources
09:37:04 [2020-12-29T14:37:04.438Z] [INFO] 
09:37:04 [2020-12-29T14:37:04.438Z] [INFO] --- tycho-source-plugin:1.5.0:plugin-source (plugin-source) @ org.eclipse.ease.lang.python.py4j.test ---
09:37:04 [2020-12-29T14:37:04.438Z] [INFO] Building jar: /home/jenkins/agent/workspace/ease.verify.core.target.2019-06/tests/org.eclipse.ease.lang.python.py4j.test/target/org.eclipse.ease.lang.python.py4j.test-0.8.0-SNAPSHOT-sources.jar
09:37:04 [2020-12-29T14:37:04.438Z] [INFO] 
09:37:04 [2020-12-29T14:37:04.438Z] [INFO] --- target-platform-configuration:1.5.0:target-platform (default-target-platform) @ org.eclipse.ease.lang.python.py4j.test ---
09:37:04 [2020-12-29T14:37:04.438Z] [INFO] 
09:37:04 [2020-12-29T14:37:04.438Z] [INFO] --- tycho-packaging-plugin:1.5.0:package-plugin (default-package-plugin) @ org.eclipse.ease.lang.python.py4j.test ---
09:37:04 [2020-12-29T14:37:04.438Z] [INFO] Building jar: /home/jenkins/agent/workspace/ease.verify.core.target.2019-06/tests/org.eclipse.ease.lang.python.py4j.test/target/org.eclipse.ease.lang.python.py4j.test-0.8.0-SNAPSHOT.jar
09:37:04 [2020-12-29T14:37:04.438Z] [INFO] 
09:37:04 [2020-12-29T14:37:04.438Z] [INFO] --- tycho-p2-plugin:1.5.0:p2-metadata-default (default-p2-metadata-default) @ org.eclipse.ease.lang.python.py4j.test ---
09:37:04 [2020-12-29T14:37:04.438Z] [INFO] 
09:37:04 [2020-12-29T14:37:04.439Z] [INFO] --- tycho-source-feature-plugin:1.5.0:source-feature (source-feature) @ org.eclipse.ease.lang.python.py4j.test ---
09:37:04 [2020-12-29T14:37:04.439Z] [INFO] 
09:37:04 [2020-12-29T14:37:04.439Z] [INFO] --- tycho-p2-plugin:1.5.0:p2-metadata (attached-p2-metadata) @ org.eclipse.ease.lang.python.py4j.test ---
09:37:04 [2020-12-29T14:37:04.439Z] [INFO] 
09:37:04 [2020-12-29T14:37:04.439Z] [INFO] --- tycho-surefire-plugin:1.5.0:test (default-test) @ org.eclipse.ease.lang.python.py4j.test ---
09:37:04 [2020-12-29T14:37:04.439Z] [INFO] Expected eclipse log file: /home/jenkins/agent/workspace/ease.verify.core.target.2019-06/tests/org.eclipse.ease.lang.python.py4j.test/target/work/data/.metadata/.log
09:37:04 [2020-12-29T14:37:04.439Z] [INFO] Command line:
09:37:04 [2020-12-29T14:37:04.439Z] 	[/opt/tools/java/openjdk/jdk-11/11.0.2+9/bin/java, -Dosgi.noShutdown=false, -Dosgi.os=linux, -Dosgi.ws=gtk, -Dosgi.arch=x86_64, -Dosgi.clean=true, -jar, /home/jenkins/.m2/repository/p2/osgi/bundle/org.eclipse.equinox.launcher/1.5.400.v20190515-0925/org.eclipse.equinox.launcher-1.5.400.v20190515-0925.jar, -data, /home/jenkins/agent/workspace/ease.verify.core.target.2019-06/tests/org.eclipse.ease.lang.python.py4j.test/target/work/data, -install, /home/jenkins/agent/workspace/ease.verify.core.target.2019-06/tests/org.eclipse.ease.lang.python.py4j.test/target/work, -configuration, /home/jenkins/agent/workspace/ease.verify.core.target.2019-06/tests/org.eclipse.ease.lang.python.py4j.test/target/work/configuration, -application, org.eclipse.tycho.surefire.osgibooter.headlesstest, -testproperties, /home/jenkins/agent/workspace/ease.verify.core.target.2019-06/tests/org.eclipse.ease.lang.python.py4j.test/target/surefire.properties]
09:37:04 [2020-12-29T14:37:04.439Z] Picked up JAVA_TOOL_OPTIONS: -Dmaven.ext.class.path="/home/jenkins/agent/workspace/ease.verify.core.target.2019-06@tmp/withMaven0cc4c26d/pipeline-maven-spy.jar" -Dorg.jenkinsci.plugins.pipeline.maven.reportsFolder="/home/jenkins/agent/workspace/ease.verify.core.target.2019-06@tmp/withMaven0cc4c26d" 
09:37:06 [2020-12-29T14:37:06.359Z] Running org.eclipse.ease.lang.python.py4j.StartStopTest
09:37:06 [2020-12-29T14:37:06.359Z] ----------------------------------------------
09:37:06 [2020-12-29T14:37:06.359Z] Starting test: startStop(org.eclipse.ease.lang.python.py4j.StartStopTest)
09:37:06 [2020-12-29T14:37:06.359Z] 
09:37:06 [2020-12-29T14:37:06.359Z] Finished test: startStop(org.eclipse.ease.lang.python.py4j.StartStopTest)
09:37:06 [2020-12-29T14:37:06.359Z] ----------------------------------------------
09:37:06 [2020-12-29T14:37:06.359Z] ----------------------------------------------
09:37:06 [2020-12-29T14:37:06.359Z] Starting test: startStopShellNoBootstrap(org.eclipse.ease.lang.python.py4j.StartStopTest)
09:37:06 [2020-12-29T14:37:06.617Z] 
09:37:06 [2020-12-29T14:37:06.617Z] Finished test: startStopShellNoBootstrap(org.eclipse.ease.lang.python.py4j.StartStopTest)
09:37:06 [2020-12-29T14:37:06.617Z] ----------------------------------------------
09:37:06 [2020-12-29T14:37:06.617Z] ----------------------------------------------
09:37:06 [2020-12-29T14:37:06.617Z] Starting test: multiStartStop(org.eclipse.ease.lang.python.py4j.StartStopTest)
09:37:06 [2020-12-29T14:37:06.873Z] 
09:37:06 [2020-12-29T14:37:06.873Z] Finished test: multiStartStop(org.eclipse.ease.lang.python.py4j.StartStopTest)
09:37:06 [2020-12-29T14:37:06.873Z] ----------------------------------------------
09:37:06 [2020-12-29T14:37:06.873Z] Tests run: 3, Failures: 0, Errors: 0, Skipped: 0, Time elapsed: 0.639 s - in org.eclipse.ease.lang.python.py4j.StartStopTest
09:37:06 [2020-12-29T14:37:06.873Z] startStop(org.eclipse.ease.lang.python.py4j.StartStopTest)  Time elapsed: 0.215 s
09:37:06 [2020-12-29T14:37:06.873Z] startStopShellNoBootstrap(org.eclipse.ease.lang.python.py4j.StartStopTest)  Time elapsed: 0.202 s
09:37:06 [2020-12-29T14:37:06.873Z] multiStartStop(org.eclipse.ease.lang.python.py4j.StartStopTest)  Time elapsed: 0.202 s
09:37:06 [2020-12-29T14:37:06.873Z] Running org.eclipse.ease.lang.python.py4j.ScriptModeEngineTest
09:37:06 [2020-12-29T14:37:06.873Z] ----------------------------------------------
09:37:06 [2020-12-29T14:37:06.873Z] Starting test: invalidSyntax(org.eclipse.ease.lang.python.py4j.ScriptModeEngineTest)
09:37:07 [2020-12-29T14:37:07.129Z] org.eclipse.ease.ScriptExecutionException: Traceback (most recent call last):
09:37:07 [2020-12-29T14:37:07.129Z]   File "/usr/lib64/python2.7/ast.py", line 37, in parse
09:37:07 [2020-12-29T14:37:07.129Z]     return compile(source, filename, mode, PyCF_ONLY_AST)
09:37:07 [2020-12-29T14:37:07.129Z]   File "<unknown>", line 1
09:37:07 [2020-12-29T14:37:07.129Z]     1++
09:37:07 [2020-12-29T14:37:07.129Z]       ^
09:37:07 [2020-12-29T14:37:07.129Z] SyntaxError: invalid syntax
09:37:07 [2020-12-29T14:37:07.129Z] 
09:37:07 [2020-12-29T14:37:07.129Z] 
09:37:07 [2020-12-29T14:37:07.129Z] Finished test: invalidSyntax(org.eclipse.ease.lang.python.py4j.ScriptModeEngineTest)
09:37:07 [2020-12-29T14:37:07.129Z] ----------------------------------------------
09:37:07 [2020-12-29T14:37:07.129Z] ----------------------------------------------
09:37:07 [2020-12-29T14:37:07.129Z] Starting test: getScriptEngine(org.eclipse.ease.lang.python.py4j.ScriptModeEngineTest)
09:37:08 [2020-12-29T14:37:08.493Z] 23379565
09:37:08 [2020-12-29T14:37:08.493Z] Finished test: getScriptEngine(org.eclipse.ease.lang.python.py4j.ScriptModeEngineTest)
09:37:08 [2020-12-29T14:37:08.493Z] ----------------------------------------------
09:37:08 [2020-12-29T14:37:08.493Z] ----------------------------------------------
09:37:08 [2020-12-29T14:37:08.493Z] Starting test: incompleteStatement(org.eclipse.ease.lang.python.py4j.ScriptModeEngineTest)
09:37:08 [2020-12-29T14:37:08.493Z] org.eclipse.ease.ScriptExecutionException: Traceback (most recent call last):
09:37:08 [2020-12-29T14:37:08.493Z]   File "/usr/lib64/python2.7/ast.py", line 37, in parse
09:37:08 [2020-12-29T14:37:08.493Z]     return compile(source, filename, mode, PyCF_ONLY_AST)
09:37:08 [2020-12-29T14:37:08.493Z]   File "<unknown>", line 1
09:37:08 [2020-12-29T14:37:08.493Z]     def a():
09:37:08 [2020-12-29T14:37:08.493Z]            ^
09:37:08 [2020-12-29T14:37:08.493Z] SyntaxError: unexpected EOF while parsing
09:37:08 [2020-12-29T14:37:08.493Z] 
09:37:08 [2020-12-29T14:37:08.493Z] 
09:37:08 [2020-12-29T14:37:08.493Z] Finished test: incompleteStatement(org.eclipse.ease.lang.python.py4j.ScriptModeEngineTest)
09:37:08 [2020-12-29T14:37:08.493Z] ----------------------------------------------
09:37:08 [2020-12-29T14:37:08.493Z] ----------------------------------------------
09:37:08 [2020-12-29T14:37:08.493Z] Starting test: multiLineStatement(org.eclipse.ease.lang.python.py4j.ScriptModeEngineTest)
09:37:08 [2020-12-29T14:37:08.748Z] 
09:37:08 [2020-12-29T14:37:08.748Z] Finished test: multiLineStatement(org.eclipse.ease.lang.python.py4j.ScriptModeEngineTest)
09:37:08 [2020-12-29T14:37:08.748Z] ----------------------------------------------
09:37:08 [2020-12-29T14:37:08.748Z] ----------------------------------------------
09:37:08 [2020-12-29T14:37:08.748Z] Starting test: runtimeError(org.eclipse.ease.lang.python.py4j.ScriptModeEngineTest)
09:37:08 [2020-12-29T14:37:08.748Z] org.eclipse.ease.ScriptExecutionException: Traceback (most recent call last):
09:37:08 [2020-12-29T14:37:08.748Z]   File "<...>", line 1, in <module>
09:37:08 [2020-12-29T14:37:08.748Z] NameError: name 'a' is not defined
09:37:08 [2020-12-29T14:37:08.748Z] 
09:37:09 [2020-12-29T14:37:09.004Z] 
09:37:09 [2020-12-29T14:37:09.004Z] Finished test: runtimeError(org.eclipse.ease.lang.python.py4j.ScriptModeEngineTest)
09:37:09 [2020-12-29T14:37:09.004Z] ----------------------------------------------
09:37:09 [2020-12-29T14:37:09.004Z] ----------------------------------------------
09:37:09 [2020-12-29T14:37:09.004Z] Starting test: javaIntArray(org.eclipse.ease.lang.python.py4j.ScriptModeEngineTest)
09:37:09 [2020-12-29T14:37:09.344Z] 
09:37:09 [2020-12-29T14:37:09.344Z] Finished test: javaIntArray(org.eclipse.ease.lang.python.py4j.ScriptModeEngineTest)
09:37:09 [2020-12-29T14:37:09.344Z] ----------------------------------------------
09:37:09 [2020-12-29T14:37:09.344Z] ----------------------------------------------
09:37:09 [2020-12-29T14:37:09.344Z] Starting test: javaDoubleArray(org.eclipse.ease.lang.python.py4j.ScriptModeEngineTest)
09:37:09 [2020-12-29T14:37:09.344Z] 
09:37:09 [2020-12-29T14:37:09.344Z] Finished test: javaDoubleArray(org.eclipse.ease.lang.python.py4j.ScriptModeEngineTest)
09:37:09 [2020-12-29T14:37:09.344Z] ----------------------------------------------
09:37:09 [2020-12-29T14:37:09.344Z] ----------------------------------------------
09:37:09 [2020-12-29T14:37:09.344Z] Starting test: pythonSet(org.eclipse.ease.lang.python.py4j.ScriptModeEngineTest)
09:37:09 [2020-12-29T14:37:09.600Z] 
09:37:09 [2020-12-29T14:37:09.600Z] Finished test: pythonSet(org.eclipse.ease.lang.python.py4j.ScriptModeEngineTest)
09:37:09 [2020-12-29T14:37:09.600Z] ----------------------------------------------
09:37:09 [2020-12-29T14:37:09.600Z] ----------------------------------------------
09:37:09 [2020-12-29T14:37:09.600Z] Starting test: javaStringArray(org.eclipse.ease.lang.python.py4j.ScriptModeEngineTest)
09:37:09 [2020-12-29T14:37:09.855Z] 
09:37:09 [2020-12-29T14:37:09.855Z] Finished test: javaStringArray(org.eclipse.ease.lang.python.py4j.ScriptModeEngineTest)
09:37:09 [2020-12-29T14:37:09.855Z] ----------------------------------------------
09:37:09 [2020-12-29T14:37:09.855Z] ----------------------------------------------
09:37:09 [2020-12-29T14:37:09.855Z] Starting test: javaShortArray(org.eclipse.ease.lang.python.py4j.ScriptModeEngineTest)
09:37:09 [2020-12-29T14:37:09.855Z] 
09:37:09 [2020-12-29T14:37:09.855Z] Finished test: javaShortArray(org.eclipse.ease.lang.python.py4j.ScriptModeEngineTest)
09:37:09 [2020-12-29T14:37:09.855Z] ----------------------------------------------
09:37:09 [2020-12-29T14:37:09.855Z] ----------------------------------------------
09:37:09 [2020-12-29T14:37:09.855Z] Starting test: javaBooleanArray(org.eclipse.ease.lang.python.py4j.ScriptModeEngineTest)
09:37:10 [2020-12-29T14:37:10.111Z] 
09:37:10 [2020-12-29T14:37:10.111Z] Finished test: javaBooleanArray(org.eclipse.ease.lang.python.py4j.ScriptModeEngineTest)
09:37:10 [2020-12-29T14:37:10.111Z] ----------------------------------------------
09:37:10 [2020-12-29T14:37:10.111Z] ----------------------------------------------
09:37:10 [2020-12-29T14:37:10.111Z] Starting test: javaObjectArray(org.eclipse.ease.lang.python.py4j.ScriptModeEngineTest)
09:37:10 [2020-12-29T14:37:10.366Z] 
09:37:10 [2020-12-29T14:37:10.366Z] Finished test: javaObjectArray(org.eclipse.ease.lang.python.py4j.ScriptModeEngineTest)
09:37:10 [2020-12-29T14:37:10.366Z] ----------------------------------------------
09:37:10 [2020-12-29T14:37:10.366Z] ----------------------------------------------
09:37:10 [2020-12-29T14:37:10.366Z] Starting test: javaIntegerArray(org.eclipse.ease.lang.python.py4j.ScriptModeEngineTest)
09:37:10 [2020-12-29T14:37:10.621Z] 
09:37:10 [2020-12-29T14:37:10.621Z] Finished test: javaIntegerArray(org.eclipse.ease.lang.python.py4j.ScriptModeEngineTest)
09:37:10 [2020-12-29T14:37:10.621Z] ----------------------------------------------
09:37:10 [2020-12-29T14:37:10.621Z] ----------------------------------------------
09:37:10 [2020-12-29T14:37:10.621Z] Starting test: javaInteger(org.eclipse.ease.lang.python.py4j.ScriptModeEngineTest)
09:37:10 [2020-12-29T14:37:10.877Z] 
09:37:10 [2020-12-29T14:37:10.877Z] Finished test: javaInteger(org.eclipse.ease.lang.python.py4j.ScriptModeEngineTest)
09:37:10 [2020-12-29T14:37:10.877Z] ----------------------------------------------
09:37:10 [2020-12-29T14:37:10.877Z] ----------------------------------------------
09:37:10 [2020-12-29T14:37:10.877Z] Starting test: javaString(org.eclipse.ease.lang.python.py4j.ScriptModeEngineTest)
09:37:10 [2020-12-29T14:37:10.877Z] 
09:37:10 [2020-12-29T14:37:10.877Z] Finished test: javaString(org.eclipse.ease.lang.python.py4j.ScriptModeEngineTest)
09:37:10 [2020-12-29T14:37:10.877Z] ----------------------------------------------
09:37:10 [2020-12-29T14:37:10.877Z] ----------------------------------------------
09:37:10 [2020-12-29T14:37:10.877Z] Starting test: javaByteArray(org.eclipse.ease.lang.python.py4j.ScriptModeEngineTest)
09:37:11 [2020-12-29T14:37:11.133Z] 
09:37:11 [2020-12-29T14:37:11.133Z] Finished test: javaByteArray(org.eclipse.ease.lang.python.py4j.ScriptModeEngineTest)
09:37:11 [2020-12-29T14:37:11.133Z] ----------------------------------------------
09:37:11 [2020-12-29T14:37:11.133Z] ----------------------------------------------
09:37:11 [2020-12-29T14:37:11.133Z] Starting test: createEclipseClass(org.eclipse.ease.lang.python.py4j.ScriptModeEngineTest)
09:37:11 [2020-12-29T14:37:11.388Z] 
09:37:11 [2020-12-29T14:37:11.388Z] Finished test: createEclipseClass(org.eclipse.ease.lang.python.py4j.ScriptModeEngineTest)
09:37:11 [2020-12-29T14:37:11.388Z] ----------------------------------------------
09:37:11 [2020-12-29T14:37:11.388Z] ----------------------------------------------
09:37:11 [2020-12-29T14:37:11.388Z] Starting test: pythonString(org.eclipse.ease.lang.python.py4j.ScriptModeEngineTest)
09:37:11 [2020-12-29T14:37:11.644Z] 
09:37:11 [2020-12-29T14:37:11.644Z] Finished test: pythonString(org.eclipse.ease.lang.python.py4j.ScriptModeEngineTest)
09:37:11 [2020-12-29T14:37:11.644Z] ----------------------------------------------
09:37:11 [2020-12-29T14:37:11.644Z] ----------------------------------------------
09:37:11 [2020-12-29T14:37:11.644Z] Starting test: varargs(org.eclipse.ease.lang.python.py4j.ScriptModeEngineTest)
09:37:11 [2020-12-29T14:37:11.900Z] 
09:37:11 [2020-12-29T14:37:11.900Z] Finished test: varargs(org.eclipse.ease.lang.python.py4j.ScriptModeEngineTest)
09:37:11 [2020-12-29T14:37:11.900Z] ----------------------------------------------
09:37:11 [2020-12-29T14:37:11.900Z] ----------------------------------------------
09:37:11 [2020-12-29T14:37:11.900Z] Starting test: createJavaType(org.eclipse.ease.lang.python.py4j.ScriptModeEngineTest)
09:37:11 [2020-12-29T14:37:11.900Z] 
09:37:11 [2020-12-29T14:37:11.900Z] Finished test: createJavaType(org.eclipse.ease.lang.python.py4j.ScriptModeEngineTest)
09:37:11 [2020-12-29T14:37:11.900Z] ----------------------------------------------
09:37:11 [2020-12-29T14:37:11.900Z] ----------------------------------------------
09:37:11 [2020-12-29T14:37:11.900Z] Starting test: javaFloatArray(org.eclipse.ease.lang.python.py4j.ScriptModeEngineTest)
09:37:12 [2020-12-29T14:37:12.155Z] 
09:37:12 [2020-12-29T14:37:12.155Z] Finished test: javaFloatArray(org.eclipse.ease.lang.python.py4j.ScriptModeEngineTest)
09:37:12 [2020-12-29T14:37:12.155Z] ----------------------------------------------
09:37:12 [2020-12-29T14:37:12.155Z] ----------------------------------------------
09:37:12 [2020-12-29T14:37:12.155Z] Starting test: implementJavaInterface(org.eclipse.ease.lang.python.py4j.ScriptModeEngineTest)
09:37:12 [2020-12-29T14:37:12.411Z] 
09:37:12 [2020-12-29T14:37:12.411Z] Finished test: implementJavaInterface(org.eclipse.ease.lang.python.py4j.ScriptModeEngineTest)
09:37:12 [2020-12-29T14:37:12.411Z] ----------------------------------------------
09:37:12 [2020-12-29T14:37:12.411Z] ----------------------------------------------
09:37:12 [2020-12-29T14:37:12.411Z] Starting test: pythonDict(org.eclipse.ease.lang.python.py4j.ScriptModeEngineTest)
09:37:12 [2020-12-29T14:37:12.667Z] 
09:37:12 [2020-12-29T14:37:12.667Z] Finished test: pythonDict(org.eclipse.ease.lang.python.py4j.ScriptModeEngineTest)
09:37:12 [2020-12-29T14:37:12.667Z] ----------------------------------------------
09:37:12 [2020-12-29T14:37:12.667Z] ----------------------------------------------
09:37:12 [2020-12-29T14:37:12.667Z] Starting test: pythonList(org.eclipse.ease.lang.python.py4j.ScriptModeEngineTest)
09:37:12 [2020-12-29T14:37:12.923Z] 
09:37:12 [2020-12-29T14:37:12.923Z] Finished test: pythonList(org.eclipse.ease.lang.python.py4j.ScriptModeEngineTest)
09:37:12 [2020-12-29T14:37:12.923Z] ----------------------------------------------
09:37:12 [2020-12-29T14:37:12.923Z] ----------------------------------------------
09:37:12 [2020-12-29T14:37:12.923Z] Starting test: testMultiple(org.eclipse.ease.lang.python.py4j.ScriptModeEngineTest)
09:37:12 [2020-12-29T14:37:12.923Z] 
09:37:12 [2020-12-29T14:37:12.923Z] Finished test: testMultiple(org.eclipse.ease.lang.python.py4j.ScriptModeEngineTest)
09:37:12 [2020-12-29T14:37:12.923Z] ----------------------------------------------
09:37:12 [2020-12-29T14:37:12.923Z] ----------------------------------------------
09:37:12 [2020-12-29T14:37:12.923Z] Starting test: javaLongArray(org.eclipse.ease.lang.python.py4j.ScriptModeEngineTest)
09:37:13 [2020-12-29T14:37:13.178Z] 
09:37:13 [2020-12-29T14:37:13.178Z] Finished test: javaLongArray(org.eclipse.ease.lang.python.py4j.ScriptModeEngineTest)
09:37:13 [2020-12-29T14:37:13.178Z] ----------------------------------------------
09:37:13 [2020-12-29T14:37:13.178Z] ----------------------------------------------
09:37:13 [2020-12-29T14:37:13.178Z] Starting test: createPythonObject(org.eclipse.ease.lang.python.py4j.ScriptModeEngineTest)
09:37:13 [2020-12-29T14:37:13.434Z] 
09:37:13 [2020-12-29T14:37:13.434Z] Finished test: createPythonObject(org.eclipse.ease.lang.python.py4j.ScriptModeEngineTest)
09:37:13 [2020-12-29T14:37:13.434Z] ----------------------------------------------
09:37:13 [2020-12-29T14:37:13.434Z] ----------------------------------------------
09:37:13 [2020-12-29T14:37:13.434Z] Starting test: pythonInteger(org.eclipse.ease.lang.python.py4j.ScriptModeEngineTest)
09:37:13 [2020-12-29T14:37:13.690Z] 
09:37:13 [2020-12-29T14:37:13.690Z] Finished test: pythonInteger(org.eclipse.ease.lang.python.py4j.ScriptModeEngineTest)
09:37:13 [2020-12-29T14:37:13.690Z] ----------------------------------------------
09:37:13 [2020-12-29T14:37:13.690Z] Tests run: 30, Failures: 0, Errors: 0, Skipped: 2, Time elapsed: 6.723 s - in org.eclipse.ease.lang.python.py4j.ScriptModeEngineTest
09:37:13 [2020-12-29T14:37:13.690Z] invalidSyntax(org.eclipse.ease.lang.python.py4j.ScriptModeEngineTest)  Time elapsed: 0.208 s
09:37:13 [2020-12-29T14:37:13.691Z] getScriptEngine(org.eclipse.ease.lang.python.py4j.ScriptModeEngineTest)  Time elapsed: 1.213 s
09:37:13 [2020-12-29T14:37:13.691Z] callExit(org.eclipse.ease.lang.python.py4j.ScriptModeEngineTest) skipped
09:37:13 [2020-12-29T14:37:13.691Z] multiLinesOfCode(org.eclipse.ease.lang.python.py4j.ScriptModeEngineTest) skipped
09:37:13 [2020-12-29T14:37:13.691Z] incompleteStatement(org.eclipse.ease.lang.python.py4j.ScriptModeEngineTest)  Time elapsed: 0.205 s
09:37:13 [2020-12-29T14:37:13.691Z] multiLineStatement(org.eclipse.ease.lang.python.py4j.ScriptModeEngineTest)  Time elapsed: 0.21 s
09:37:13 [2020-12-29T14:37:13.691Z] runtimeError(org.eclipse.ease.lang.python.py4j.ScriptModeEngineTest)  Time elapsed: 0.207 s
09:37:13 [2020-12-29T14:37:13.691Z] javaIntArray(org.eclipse.ease.lang.python.py4j.ScriptModeEngineTest)  Time elapsed: 0.207 s
09:37:13 [2020-12-29T14:37:13.691Z] javaDoubleArray(org.eclipse.ease.lang.python.py4j.ScriptModeEngineTest)  Time elapsed: 0.204 s
09:37:13 [2020-12-29T14:37:13.691Z] pythonSet(org.eclipse.ease.lang.python.py4j.ScriptModeEngineTest)  Time elapsed: 0.204 s
09:37:13 [2020-12-29T14:37:13.691Z] javaStringArray(org.eclipse.ease.lang.python.py4j.ScriptModeEngineTest)  Time elapsed: 0.201 s
09:37:13 [2020-12-29T14:37:13.691Z] javaShortArray(org.eclipse.ease.lang.python.py4j.ScriptModeEngineTest)  Time elapsed: 0.201 s
09:37:13 [2020-12-29T14:37:13.691Z] javaBooleanArray(org.eclipse.ease.lang.python.py4j.ScriptModeEngineTest)  Time elapsed: 0.202 s
09:37:13 [2020-12-29T14:37:13.691Z] javaObjectArray(org.eclipse.ease.lang.python.py4j.ScriptModeEngineTest)  Time elapsed: 0.217 s
09:37:13 [2020-12-29T14:37:13.691Z] javaIntegerArray(org.eclipse.ease.lang.python.py4j.ScriptModeEngineTest)  Time elapsed: 0.204 s
09:37:13 [2020-12-29T14:37:13.691Z] javaInteger(org.eclipse.ease.lang.python.py4j.ScriptModeEngineTest)  Time elapsed: 0.202 s
09:37:13 [2020-12-29T14:37:13.691Z] javaString(org.eclipse.ease.lang.python.py4j.ScriptModeEngineTest)  Time elapsed: 0.201 s
09:37:13 [2020-12-29T14:37:13.691Z] javaByteArray(org.eclipse.ease.lang.python.py4j.ScriptModeEngineTest)  Time elapsed: 0.203 s
09:37:13 [2020-12-29T14:37:13.691Z] createEclipseClass(org.eclipse.ease.lang.python.py4j.ScriptModeEngineTest)  Time elapsed: 0.202 s
09:37:13 [2020-12-29T14:37:13.691Z] pythonString(org.eclipse.ease.lang.python.py4j.ScriptModeEngineTest)  Time elapsed: 0.204 s
09:37:13 [2020-12-29T14:37:13.691Z] varargs(org.eclipse.ease.lang.python.py4j.ScriptModeEngineTest)  Time elapsed: 0.201 s
09:37:13 [2020-12-29T14:37:13.691Z] createJavaType(org.eclipse.ease.lang.python.py4j.ScriptModeEngineTest)  Time elapsed: 0.2 s
09:37:13 [2020-12-29T14:37:13.691Z] javaFloatArray(org.eclipse.ease.lang.python.py4j.ScriptModeEngineTest)  Time elapsed: 0.205 s
09:37:13 [2020-12-29T14:37:13.691Z] implementJavaInterface(org.eclipse.ease.lang.python.py4j.ScriptModeEngineTest)  Time elapsed: 0.202 s
09:37:13 [2020-12-29T14:37:13.691Z] pythonDict(org.eclipse.ease.lang.python.py4j.ScriptModeEngineTest)  Time elapsed: 0.201 s
09:37:13 [2020-12-29T14:37:13.691Z] pythonList(org.eclipse.ease.lang.python.py4j.ScriptModeEngineTest)  Time elapsed: 0.203 s
09:37:13 [2020-12-29T14:37:13.691Z] testMultiple(org.eclipse.ease.lang.python.py4j.ScriptModeEngineTest)  Time elapsed: 0.207 s
09:37:13 [2020-12-29T14:37:13.691Z] javaLongArray(org.eclipse.ease.lang.python.py4j.ScriptModeEngineTest)  Time elapsed: 0.203 s
09:37:13 [2020-12-29T14:37:13.691Z] createPythonObject(org.eclipse.ease.lang.python.py4j.ScriptModeEngineTest)  Time elapsed: 0.201 s
09:37:13 [2020-12-29T14:37:13.691Z] pythonInteger(org.eclipse.ease.lang.python.py4j.ScriptModeEngineTest)  Time elapsed: 0.2 s
09:37:13 [2020-12-29T14:37:13.691Z] Running org.eclipse.ease.lang.python.py4j.ShellModeEngineTest
09:37:13 [2020-12-29T14:37:13.691Z] ----------------------------------------------
09:37:13 [2020-12-29T14:37:13.691Z] Starting test: invalidSyntax(org.eclipse.ease.lang.python.py4j.ShellModeEngineTest)
09:37:13 [2020-12-29T14:37:13.691Z] org.eclipse.ease.ScriptExecutionException:   File "<console>", line 1
09:37:13 [2020-12-29T14:37:13.691Z]     1++
09:37:13 [2020-12-29T14:37:13.691Z]       ^
09:37:13 [2020-12-29T14:37:13.691Z] SyntaxError: invalid syntax
09:37:13 [2020-12-29T14:37:13.691Z] 
09:37:13 [2020-12-29T14:37:13.947Z] 
09:37:13 [2020-12-29T14:37:13.947Z] Finished test: invalidSyntax(org.eclipse.ease.lang.python.py4j.ShellModeEngineTest)
09:37:13 [2020-12-29T14:37:13.947Z] ----------------------------------------------
09:37:13 [2020-12-29T14:37:13.947Z] ----------------------------------------------
09:37:13 [2020-12-29T14:37:13.947Z] Starting test: optionalModuleParameters(org.eclipse.ease.lang.python.py4j.ShellModeEngineTest)
09:37:13 [2020-12-29T14:37:13.947Z] 
09:37:13 [2020-12-29T14:37:13.947Z] Finished test: optionalModuleParameters(org.eclipse.ease.lang.python.py4j.ShellModeEngineTest)
09:37:13 [2020-12-29T14:37:13.947Z] ----------------------------------------------
09:37:13 [2020-12-29T14:37:13.947Z] ----------------------------------------------
09:37:13 [2020-12-29T14:37:13.947Z] Starting test: getScriptEngine(org.eclipse.ease.lang.python.py4j.ShellModeEngineTest)
09:37:14 [2020-12-29T14:37:14.203Z] 
09:37:14 [2020-12-29T14:37:14.203Z] Finished test: getScriptEngine(org.eclipse.ease.lang.python.py4j.ShellModeEngineTest)
09:37:14 [2020-12-29T14:37:14.203Z] ----------------------------------------------
09:37:14 [2020-12-29T14:37:14.203Z] ----------------------------------------------
09:37:14 [2020-12-29T14:37:14.203Z] Starting test: callModuleCode(org.eclipse.ease.lang.python.py4j.ShellModeEngineTest)
09:37:14 [2020-12-29T14:37:14.459Z] 
09:37:14 [2020-12-29T14:37:14.459Z] Finished test: callModuleCode(org.eclipse.ease.lang.python.py4j.ShellModeEngineTest)
09:37:14 [2020-12-29T14:37:14.459Z] ----------------------------------------------
09:37:14 [2020-12-29T14:37:14.459Z] ----------------------------------------------
09:37:14 [2020-12-29T14:37:14.459Z] Starting test: incompleteStatement(org.eclipse.ease.lang.python.py4j.ShellModeEngineTest)
09:37:14 [2020-12-29T14:37:14.714Z] 
09:37:14 [2020-12-29T14:37:14.714Z] Finished test: incompleteStatement(org.eclipse.ease.lang.python.py4j.ShellModeEngineTest)
09:37:14 [2020-12-29T14:37:14.714Z] ----------------------------------------------
09:37:14 [2020-12-29T14:37:14.714Z] ----------------------------------------------
09:37:14 [2020-12-29T14:37:14.714Z] Starting test: multiLineStatement(org.eclipse.ease.lang.python.py4j.ShellModeEngineTest)
09:37:14 [2020-12-29T14:37:14.714Z] 
09:37:14 [2020-12-29T14:37:14.714Z] Finished test: multiLineStatement(org.eclipse.ease.lang.python.py4j.ShellModeEngineTest)
09:37:14 [2020-12-29T14:37:14.714Z] ----------------------------------------------
09:37:14 [2020-12-29T14:37:14.714Z] ----------------------------------------------
09:37:14 [2020-12-29T14:37:14.714Z] Starting test: runtimeError(org.eclipse.ease.lang.python.py4j.ShellModeEngineTest)
09:37:14 [2020-12-29T14:37:14.972Z] org.eclipse.ease.ScriptExecutionException: Traceback (most recent call last):
09:37:14 [2020-12-29T14:37:14.972Z]   File "<console>", line 1, in <module>
09:37:14 [2020-12-29T14:37:14.972Z] NameError: name 'x' is not defined
09:37:14 [2020-12-29T14:37:14.972Z] 
09:37:14 [2020-12-29T14:37:14.972Z] 
09:37:14 [2020-12-29T14:37:14.972Z] Finished test: runtimeError(org.eclipse.ease.lang.python.py4j.ShellModeEngineTest)
09:37:14 [2020-12-29T14:37:14.972Z] ----------------------------------------------
09:37:14 [2020-12-29T14:37:14.972Z] ----------------------------------------------
09:37:14 [2020-12-29T14:37:14.972Z] Starting test: javaIntArray(org.eclipse.ease.lang.python.py4j.ShellModeEngineTest)
09:37:15 [2020-12-29T14:37:15.230Z] 
09:37:15 [2020-12-29T14:37:15.230Z] Finished test: javaIntArray(org.eclipse.ease.lang.python.py4j.ShellModeEngineTest)
09:37:15 [2020-12-29T14:37:15.230Z] ----------------------------------------------
09:37:15 [2020-12-29T14:37:15.230Z] ----------------------------------------------
09:37:15 [2020-12-29T14:37:15.230Z] Starting test: javaDoubleArray(org.eclipse.ease.lang.python.py4j.ShellModeEngineTest)
09:37:15 [2020-12-29T14:37:15.485Z] 
09:37:15 [2020-12-29T14:37:15.485Z] Finished test: javaDoubleArray(org.eclipse.ease.lang.python.py4j.ShellModeEngineTest)
09:37:15 [2020-12-29T14:37:15.485Z] ----------------------------------------------
09:37:15 [2020-12-29T14:37:15.485Z] ----------------------------------------------
09:37:15 [2020-12-29T14:37:15.485Z] Starting test: pythonSet(org.eclipse.ease.lang.python.py4j.ShellModeEngineTest)
09:37:15 [2020-12-29T14:37:15.741Z] 
09:37:15 [2020-12-29T14:37:15.741Z] Finished test: pythonSet(org.eclipse.ease.lang.python.py4j.ShellModeEngineTest)
09:37:15 [2020-12-29T14:37:15.741Z] ----------------------------------------------
09:37:15 [2020-12-29T14:37:15.741Z] ----------------------------------------------
09:37:15 [2020-12-29T14:37:15.741Z] Starting test: javaStringArray(org.eclipse.ease.lang.python.py4j.ShellModeEngineTest)
09:37:15 [2020-12-29T14:37:15.741Z] 
09:37:15 [2020-12-29T14:37:15.741Z] Finished test: javaStringArray(org.eclipse.ease.lang.python.py4j.ShellModeEngineTest)
09:37:15 [2020-12-29T14:37:15.741Z] ----------------------------------------------
09:37:15 [2020-12-29T14:37:15.741Z] ----------------------------------------------
09:37:15 [2020-12-29T14:37:15.741Z] Starting test: javaShortArray(org.eclipse.ease.lang.python.py4j.ShellModeEngineTest)
09:37:15 [2020-12-29T14:37:15.997Z] 
09:37:15 [2020-12-29T14:37:15.997Z] Finished test: javaShortArray(org.eclipse.ease.lang.python.py4j.ShellModeEngineTest)
09:37:15 [2020-12-29T14:37:15.997Z] ----------------------------------------------
09:37:15 [2020-12-29T14:37:15.997Z] ----------------------------------------------
09:37:15 [2020-12-29T14:37:15.997Z] Starting test: javaBooleanArray(org.eclipse.ease.lang.python.py4j.ShellModeEngineTest)
09:37:16 [2020-12-29T14:37:16.253Z] 
09:37:16 [2020-12-29T14:37:16.253Z] Finished test: javaBooleanArray(org.eclipse.ease.lang.python.py4j.ShellModeEngineTest)
09:37:16 [2020-12-29T14:37:16.253Z] ----------------------------------------------
09:37:16 [2020-12-29T14:37:16.253Z] ----------------------------------------------
09:37:16 [2020-12-29T14:37:16.253Z] Starting test: javaObjectArray(org.eclipse.ease.lang.python.py4j.ShellModeEngineTest)
09:37:16 [2020-12-29T14:37:16.509Z] 
09:37:16 [2020-12-29T14:37:16.509Z] Finished test: javaObjectArray(org.eclipse.ease.lang.python.py4j.ShellModeEngineTest)
09:37:16 [2020-12-29T14:37:16.509Z] ----------------------------------------------
09:37:16 [2020-12-29T14:37:16.509Z] ----------------------------------------------
09:37:16 [2020-12-29T14:37:16.509Z] Starting test: javaIntegerArray(org.eclipse.ease.lang.python.py4j.ShellModeEngineTest)
09:37:16 [2020-12-29T14:37:16.509Z] 
09:37:16 [2020-12-29T14:37:16.509Z] Finished test: javaIntegerArray(org.eclipse.ease.lang.python.py4j.ShellModeEngineTest)
09:37:16 [2020-12-29T14:37:16.509Z] ----------------------------------------------
09:37:16 [2020-12-29T14:37:16.509Z] ----------------------------------------------
09:37:16 [2020-12-29T14:37:16.509Z] Starting test: javaInteger(org.eclipse.ease.lang.python.py4j.ShellModeEngineTest)
09:37:16 [2020-12-29T14:37:16.764Z] 
09:37:16 [2020-12-29T14:37:16.764Z] Finished test: javaInteger(org.eclipse.ease.lang.python.py4j.ShellModeEngineTest)
09:37:16 [2020-12-29T14:37:16.764Z] ----------------------------------------------
09:37:16 [2020-12-29T14:37:16.764Z] ----------------------------------------------
09:37:16 [2020-12-29T14:37:16.764Z] Starting test: javaString(org.eclipse.ease.lang.python.py4j.ShellModeEngineTest)
09:37:17 [2020-12-29T14:37:17.019Z] 
09:37:17 [2020-12-29T14:37:17.019Z] Finished test: javaString(org.eclipse.ease.lang.python.py4j.ShellModeEngineTest)
09:37:17 [2020-12-29T14:37:17.019Z] ----------------------------------------------
09:37:17 [2020-12-29T14:37:17.019Z] ----------------------------------------------
09:37:17 [2020-12-29T14:37:17.019Z] Starting test: javaByteArray(org.eclipse.ease.lang.python.py4j.ShellModeEngineTest)
09:37:17 [2020-12-29T14:37:17.275Z] 
09:37:17 [2020-12-29T14:37:17.275Z] Finished test: javaByteArray(org.eclipse.ease.lang.python.py4j.ShellModeEngineTest)
09:37:17 [2020-12-29T14:37:17.275Z] ----------------------------------------------
09:37:17 [2020-12-29T14:37:17.275Z] ----------------------------------------------
09:37:17 [2020-12-29T14:37:17.275Z] Starting test: createEclipseClass(org.eclipse.ease.lang.python.py4j.ShellModeEngineTest)
09:37:17 [2020-12-29T14:37:17.530Z] 
09:37:17 [2020-12-29T14:37:17.530Z] Finished test: createEclipseClass(org.eclipse.ease.lang.python.py4j.ShellModeEngineTest)
09:37:17 [2020-12-29T14:37:17.530Z] ----------------------------------------------
09:37:17 [2020-12-29T14:37:17.530Z] ----------------------------------------------
09:37:17 [2020-12-29T14:37:17.530Z] Starting test: pythonString(org.eclipse.ease.lang.python.py4j.ShellModeEngineTest)
09:37:17 [2020-12-29T14:37:17.530Z] 
09:37:17 [2020-12-29T14:37:17.530Z] Finished test: pythonString(org.eclipse.ease.lang.python.py4j.ShellModeEngineTest)
09:37:17 [2020-12-29T14:37:17.530Z] ----------------------------------------------
09:37:17 [2020-12-29T14:37:17.530Z] ----------------------------------------------
09:37:17 [2020-12-29T14:37:17.530Z] Starting test: varargs(org.eclipse.ease.lang.python.py4j.ShellModeEngineTest)
09:37:17 [2020-12-29T14:37:17.785Z] 
09:37:17 [2020-12-29T14:37:17.785Z] Finished test: varargs(org.eclipse.ease.lang.python.py4j.ShellModeEngineTest)
09:37:17 [2020-12-29T14:37:17.785Z] ----------------------------------------------
09:37:17 [2020-12-29T14:37:17.785Z] ----------------------------------------------
09:37:17 [2020-12-29T14:37:17.785Z] Starting test: createJavaType(org.eclipse.ease.lang.python.py4j.ShellModeEngineTest)
09:37:18 [2020-12-29T14:37:18.041Z] 
09:37:18 [2020-12-29T14:37:18.041Z] Finished test: createJavaType(org.eclipse.ease.lang.python.py4j.ShellModeEngineTest)
09:37:18 [2020-12-29T14:37:18.041Z] ----------------------------------------------
09:37:18 [2020-12-29T14:37:18.041Z] ----------------------------------------------
09:37:18 [2020-12-29T14:37:18.041Z] Starting test: javaFloatArray(org.eclipse.ease.lang.python.py4j.ShellModeEngineTest)
09:37:18 [2020-12-29T14:37:18.297Z] 
09:37:18 [2020-12-29T14:37:18.297Z] Finished test: javaFloatArray(org.eclipse.ease.lang.python.py4j.ShellModeEngineTest)
09:37:18 [2020-12-29T14:37:18.297Z] ----------------------------------------------
09:37:18 [2020-12-29T14:37:18.297Z] ----------------------------------------------
09:37:18 [2020-12-29T14:37:18.297Z] Starting test: implementJavaInterface(org.eclipse.ease.lang.python.py4j.ShellModeEngineTest)
09:37:18 [2020-12-29T14:37:18.553Z] 
09:37:18 [2020-12-29T14:37:18.553Z] Finished test: implementJavaInterface(org.eclipse.ease.lang.python.py4j.ShellModeEngineTest)
09:37:18 [2020-12-29T14:37:18.553Z] ----------------------------------------------
09:37:18 [2020-12-29T14:37:18.553Z] ----------------------------------------------
09:37:18 [2020-12-29T14:37:18.553Z] Starting test: pythonDict(org.eclipse.ease.lang.python.py4j.ShellModeEngineTest)
09:37:18 [2020-12-29T14:37:18.553Z] 
09:37:18 [2020-12-29T14:37:18.553Z] Finished test: pythonDict(org.eclipse.ease.lang.python.py4j.ShellModeEngineTest)
09:37:18 [2020-12-29T14:37:18.553Z] ----------------------------------------------
09:37:18 [2020-12-29T14:37:18.553Z] ----------------------------------------------
09:37:18 [2020-12-29T14:37:18.553Z] Starting test: pythonList(org.eclipse.ease.lang.python.py4j.ShellModeEngineTest)
09:37:18 [2020-12-29T14:37:18.808Z] 
09:37:18 [2020-12-29T14:37:18.808Z] Finished test: pythonList(org.eclipse.ease.lang.python.py4j.ShellModeEngineTest)
09:37:18 [2020-12-29T14:37:18.808Z] ----------------------------------------------
09:37:18 [2020-12-29T14:37:18.808Z] ----------------------------------------------
09:37:18 [2020-12-29T14:37:18.808Z] Starting test: testMultiple(org.eclipse.ease.lang.python.py4j.ShellModeEngineTest)
09:37:19 [2020-12-29T14:37:19.064Z] 
09:37:19 [2020-12-29T14:37:19.064Z] Finished test: testMultiple(org.eclipse.ease.lang.python.py4j.ShellModeEngineTest)
09:37:19 [2020-12-29T14:37:19.064Z] ----------------------------------------------
09:37:19 [2020-12-29T14:37:19.064Z] ----------------------------------------------
09:37:19 [2020-12-29T14:37:19.064Z] Starting test: javaLongArray(org.eclipse.ease.lang.python.py4j.ShellModeEngineTest)
09:37:19 [2020-12-29T14:37:19.320Z] 
09:37:19 [2020-12-29T14:37:19.320Z] Finished test: javaLongArray(org.eclipse.ease.lang.python.py4j.ShellModeEngineTest)
09:37:19 [2020-12-29T14:37:19.320Z] ----------------------------------------------
09:37:19 [2020-12-29T14:37:19.320Z] ----------------------------------------------
09:37:19 [2020-12-29T14:37:19.320Z] Starting test: createPythonObject(org.eclipse.ease.lang.python.py4j.ShellModeEngineTest)
09:37:19 [2020-12-29T14:37:19.320Z] 
09:37:19 [2020-12-29T14:37:19.320Z] Finished test: createPythonObject(org.eclipse.ease.lang.python.py4j.ShellModeEngineTest)
09:37:19 [2020-12-29T14:37:19.320Z] ----------------------------------------------
09:37:19 [2020-12-29T14:37:19.320Z] ----------------------------------------------
09:37:19 [2020-12-29T14:37:19.320Z] Starting test: pythonInteger(org.eclipse.ease.lang.python.py4j.ShellModeEngineTest)
09:37:19 [2020-12-29T14:37:19.575Z] 
09:37:19 [2020-12-29T14:37:19.575Z] Finished test: pythonInteger(org.eclipse.ease.lang.python.py4j.ShellModeEngineTest)
09:37:19 [2020-12-29T14:37:19.575Z] ----------------------------------------------
09:37:19 [2020-12-29T14:37:19.575Z] Tests run: 34, Failures: 0, Errors: 0, Skipped: 4, Time elapsed: 5.996 s - in org.eclipse.ease.lang.python.py4j.ShellModeEngineTest
09:37:19 [2020-12-29T14:37:19.575Z] invalidSyntax(org.eclipse.ease.lang.python.py4j.ShellModeEngineTest)  Time elapsed: 0.198 s
09:37:19 [2020-12-29T14:37:19.575Z] print_(org.eclipse.ease.lang.python.py4j.ShellModeEngineTest) skipped
09:37:19 [2020-12-29T14:37:19.575Z] optionalModuleParameters(org.eclipse.ease.lang.python.py4j.ShellModeEngineTest)  Time elapsed: 0.199 s
09:37:19 [2020-12-29T14:37:19.575Z] print_TextNoNewline(org.eclipse.ease.lang.python.py4j.ShellModeEngineTest) skipped
09:37:19 [2020-12-29T14:37:19.575Z] getScriptEngine(org.eclipse.ease.lang.python.py4j.ShellModeEngineTest)  Time elapsed: 0.2 s
09:37:19 [2020-12-29T14:37:19.575Z] print_Text(org.eclipse.ease.lang.python.py4j.ShellModeEngineTest) skipped
09:37:19 [2020-12-29T14:37:19.575Z] callModuleCode(org.eclipse.ease.lang.python.py4j.ShellModeEngineTest)  Time elapsed: 0.199 s
09:37:19 [2020-12-29T14:37:19.575Z] print_NoNewline(org.eclipse.ease.lang.python.py4j.ShellModeEngineTest) skipped
09:37:19 [2020-12-29T14:37:19.575Z] incompleteStatement(org.eclipse.ease.lang.python.py4j.ShellModeEngineTest)  Time elapsed: 0.201 s
09:37:19 [2020-12-29T14:37:19.575Z] multiLineStatement(org.eclipse.ease.lang.python.py4j.ShellModeEngineTest)  Time elapsed: 0.201 s
09:37:19 [2020-12-29T14:37:19.576Z] runtimeError(org.eclipse.ease.lang.python.py4j.ShellModeEngineTest)  Time elapsed: 0.202 s
09:37:19 [2020-12-29T14:37:19.576Z] javaIntArray(org.eclipse.ease.lang.python.py4j.ShellModeEngineTest)  Time elapsed: 0.201 s
09:37:19 [2020-12-29T14:37:19.576Z] javaDoubleArray(org.eclipse.ease.lang.python.py4j.ShellModeEngineTest)  Time elapsed: 0.199 s
09:37:19 [2020-12-29T14:37:19.576Z] pythonSet(org.eclipse.ease.lang.python.py4j.ShellModeEngineTest)  Time elapsed: 0.199 s
09:37:19 [2020-12-29T14:37:19.576Z] javaStringArray(org.eclipse.ease.lang.python.py4j.ShellModeEngineTest)  Time elapsed: 0.201 s
09:37:19 [2020-12-29T14:37:19.576Z] javaShortArray(org.eclipse.ease.lang.python.py4j.ShellModeEngineTest)  Time elapsed: 0.2 s
09:37:19 [2020-12-29T14:37:19.576Z] javaBooleanArray(org.eclipse.ease.lang.python.py4j.ShellModeEngineTest)  Time elapsed: 0.2 s
09:37:19 [2020-12-29T14:37:19.576Z] javaObjectArray(org.eclipse.ease.lang.python.py4j.ShellModeEngineTest)  Time elapsed: 0.202 s
09:37:19 [2020-12-29T14:37:19.576Z] javaIntegerArray(org.eclipse.ease.lang.python.py4j.ShellModeEngineTest)  Time elapsed: 0.198 s
09:37:19 [2020-12-29T14:37:19.576Z] javaInteger(org.eclipse.ease.lang.python.py4j.ShellModeEngineTest)  Time elapsed: 0.198 s
09:37:19 [2020-12-29T14:37:19.576Z] javaString(org.eclipse.ease.lang.python.py4j.ShellModeEngineTest)  Time elapsed: 0.201 s
09:37:19 [2020-12-29T14:37:19.576Z] javaByteArray(org.eclipse.ease.lang.python.py4j.ShellModeEngineTest)  Time elapsed: 0.199 s
09:37:19 [2020-12-29T14:37:19.576Z] createEclipseClass(org.eclipse.ease.lang.python.py4j.ShellModeEngineTest)  Time elapsed: 0.203 s
09:37:19 [2020-12-29T14:37:19.576Z] pythonString(org.eclipse.ease.lang.python.py4j.ShellModeEngineTest)  Time elapsed: 0.197 s
09:37:19 [2020-12-29T14:37:19.576Z] varargs(org.eclipse.ease.lang.python.py4j.ShellModeEngineTest)  Time elapsed: 0.201 s
09:37:19 [2020-12-29T14:37:19.576Z] createJavaType(org.eclipse.ease.lang.python.py4j.ShellModeEngineTest)  Time elapsed: 0.198 s
09:37:19 [2020-12-29T14:37:19.576Z] javaFloatArray(org.eclipse.ease.lang.python.py4j.ShellModeEngineTest)  Time elapsed: 0.198 s
09:37:19 [2020-12-29T14:37:19.576Z] implementJavaInterface(org.eclipse.ease.lang.python.py4j.ShellModeEngineTest)  Time elapsed: 0.199 s
09:37:19 [2020-12-29T14:37:19.576Z] pythonDict(org.eclipse.ease.lang.python.py4j.ShellModeEngineTest)  Time elapsed: 0.199 s
09:37:19 [2020-12-29T14:37:19.576Z] pythonList(org.eclipse.ease.lang.python.py4j.ShellModeEngineTest)  Time elapsed: 0.199 s
09:37:19 [2020-12-29T14:37:19.576Z] testMultiple(org.eclipse.ease.lang.python.py4j.ShellModeEngineTest)  Time elapsed: 0.202 s
09:37:19 [2020-12-29T14:37:19.576Z] javaLongArray(org.eclipse.ease.lang.python.py4j.ShellModeEngineTest)  Time elapsed: 0.199 s
09:37:19 [2020-12-29T14:37:19.576Z] createPythonObject(org.eclipse.ease.lang.python.py4j.ShellModeEngineTest)  Time elapsed: 0.198 s
09:37:19 [2020-12-29T14:37:19.576Z] pythonInteger(org.eclipse.ease.lang.python.py4j.ShellModeEngineTest)  Time elapsed: 0.197 s
09:37:19 [2020-12-29T14:37:19.576Z] Running org.eclipse.ease.lang.python.py4j.Py4JPep302ModuleLoadingTest
09:37:20 [2020-12-29T14:37:20.136Z] org.eclipse.ease.ScriptExecutionException: Traceback (most recent call last):
09:37:20 [2020-12-29T14:37:20.136Z]   File "<...>", line 1, in <module>
09:37:20 [2020-12-29T14:37:20.136Z]   File "<...>", line 81, in load_module
09:37:20 [2020-12-29T14:37:20.136Z] ImportError: No EASE module named 'eclipse.test.notthere'
09:37:20 [2020-12-29T14:37:20.136Z] 
09:37:20 [2020-12-29T14:37:20.136Z] Tests run: 8, Failures: 0, Errors: 0, Skipped: 0, Time elapsed: 0.452 s - in org.eclipse.ease.lang.python.py4j.Py4JPep302ModuleLoadingTest
09:37:20 [2020-12-29T14:37:20.136Z] loadSimpleModule(org.eclipse.ease.lang.python.py4j.Py4JPep302ModuleLoadingTest)  Time elapsed: 0.063 s
09:37:20 [2020-12-29T14:37:20.136Z] loadModuleWithDependencies(org.eclipse.ease.lang.python.py4j.Py4JPep302ModuleLoadingTest)  Time elapsed: 0.057 s
09:37:20 [2020-12-29T14:37:20.136Z] accessAdvancedModule(org.eclipse.ease.lang.python.py4j.Py4JPep302ModuleLoadingTest)  Time elapsed: 0.055 s
09:37:20 [2020-12-29T14:37:20.136Z] importAs(org.eclipse.ease.lang.python.py4j.Py4JPep302ModuleLoadingTest)  Time elapsed: 0.055 s
09:37:20 [2020-12-29T14:37:20.137Z] fromBasicImportMethod(org.eclipse.ease.lang.python.py4j.Py4JPep302ModuleLoadingTest)  Time elapsed: 0.054 s
09:37:20 [2020-12-29T14:37:20.137Z] loadNotExistingModule(org.eclipse.ease.lang.python.py4j.Py4JPep302ModuleLoadingTest)  Time elapsed: 0.055 s
09:37:20 [2020-12-29T14:37:20.137Z] fromBasicImportAll(org.eclipse.ease.lang.python.py4j.Py4JPep302ModuleLoadingTest)  Time elapsed: 0.056 s
09:37:20 [2020-12-29T14:37:20.137Z] accessModule(org.eclipse.ease.lang.python.py4j.Py4JPep302ModuleLoadingTest)  Time elapsed: 0.055 s
09:37:20 [2020-12-29T14:37:20.137Z] Running org.eclipse.ease.lang.python.py4j.Py4jDebugTest
09:37:20 [2020-12-29T14:37:20.137Z] WARNING: An illegal reflective access operation has occurred
09:37:20 [2020-12-29T14:37:20.137Z] WARNING: Illegal reflective access by org.mockito.cglib.core.ReflectUtils$2 (file:/home/jenkins/.m2/repository/p2/osgi/bundle/org.mockito/1.9.5.v201605172210/org.mockito-1.9.5.v201605172210.jar) to method java.lang.ClassLoader.defineClass(java.lang.String,byte[],int,int,java.security.ProtectionDomain)
09:37:20 [2020-12-29T14:37:20.137Z] WARNING: Please consider reporting this to the maintainers of org.mockito.cglib.core.ReflectUtils$2
09:37:20 [2020-12-29T14:37:20.137Z] WARNING: Use --illegal-access=warn to enable warnings of further illegal reflective access operations
09:37:20 [2020-12-29T14:37:20.137Z] WARNING: All illegal access operations will be denied in a future release
09:37:20 [2020-12-29T14:37:20.393Z] Start of script
09:37:20 [2020-12-29T14:37:20.393Z] include file start
09:37:20 [2020-12-29T14:37:20.393Z] include file processed
09:37:20 [2020-12-29T14:37:20.393Z] Result of testMethod = 5
09:37:20 [2020-12-29T14:37:20.393Z] End of script
09:37:20 [2020-12-29T14:37:20.648Z] Start of script
09:37:20 [2020-12-29T14:37:20.648Z] include file start
09:37:20 [2020-12-29T14:37:20.648Z] include file processed
09:37:20 [2020-12-29T14:37:20.648Z] Result of testMethod = 5
09:37:20 [2020-12-29T14:37:20.648Z] End of script
09:37:20 [2020-12-29T14:37:20.905Z] Start of script
09:37:20 [2020-12-29T14:37:20.905Z] include file start
09:37:20 [2020-12-29T14:37:20.905Z] include file processed
09:37:20 [2020-12-29T14:37:20.905Z] Result of testMethod = 5
09:37:21 [2020-12-29T14:37:21.163Z] py4j.Py4JException: An exception was raised by the Python Proxy. Return Message: Traceback (most recent call last):
09:37:21 [2020-12-29T14:37:21.163Z]   File "/home/jenkins/agent/workspace/ease.verify.core.target.2019-06/tests/org.eclipse.ease.lang.python.py4j.test/target/work/plugins/py4j-python_0.10.8.1-bnd-2odeag/src/py4j/clientserver.py", line 581, in _call_proxy
09:37:21 [2020-12-29T14:37:21.163Z]     return_value = getattr(self.pool[obj_id], method)(*params)
09:37:21 [2020-12-29T14:37:21.163Z]   File "<...>", line 424, in run
09:37:21 [2020-12-29T14:37:21.163Z]   File "/usr/lib64/python2.7/bdb.py", line 400, in run
09:37:21 [2020-12-29T14:37:21.163Z]     exec cmd in globals, locals
09:37:21 [2020-12-29T14:37:21.163Z]   File "__ref_L/Debug Test/Main.py_xwantudqme", line 23, in <module>
09:37:21 [2020-12-29T14:37:21.163Z]   File "__ref_L/Debug Test/Main.py_xwantudqme", line 23, in <module>
09:37:21 [2020-12-29T14:37:21.163Z]   File "<...>", line 231, in trace_dispatch
09:37:21 [2020-12-29T14:37:21.163Z]   File "/usr/lib64/python2.7/bdb.py", line 49, in trace_dispatch
09:37:21 [2020-12-29T14:37:21.163Z]     return self.dispatch_line(frame)
09:37:21 [2020-12-29T14:37:21.163Z]   File "/usr/lib64/python2.7/bdb.py", line 67, in dispatch_line
09:37:21 [2020-12-29T14:37:21.163Z]     self.user_line(frame)
09:37:21 [2020-12-29T14:37:21.163Z]   File "<...>", line 241, in user_line
09:37:21 [2020-12-29T14:37:21.163Z]   File "<...>", line 296, in dispatch
09:37:21 [2020-12-29T14:37:21.163Z]   File "/home/jenkins/agent/workspace/ease.verify.core.target.2019-06/tests/org.eclipse.ease.lang.python.py4j.test/target/work/plugins/py4j-python_0.10.8.1-bnd-2odeag/src/py4j/java_gateway.py", line 1286, in __call__
09:37:21 [2020-12-29T14:37:21.163Z]     answer, self.gateway_client, self.target_id, self.name)
09:37:21 [2020-12-29T14:37:21.163Z]   File "/home/jenkins/agent/workspace/ease.verify.core.target.2019-06/tests/org.eclipse.ease.lang.python.py4j.test/target/work/plugins/py4j-python_0.10.8.1-bnd-2odeag/src/py4j/protocol.py", line 328, in get_return_value
09:37:21 [2020-12-29T14:37:21.163Z]     format(target_id, ".", name), value)
09:37:21 [2020-12-29T14:37:21.163Z] Py4JJavaError: An error occurred while calling o0.traceDispatch.
09:37:21 [2020-12-29T14:37:21.163Z] : org.eclipse.ease.ExitException: 
09:37:21 [2020-12-29T14:37:21.163Z] 	at org.eclipse.ease.debugging.AbstractEaseDebugger.handleEventsInSuspendedState(AbstractEaseDebugger.java:329)
09:37:21 [2020-12-29T14:37:21.163Z] 	at org.eclipse.ease.debugging.AbstractEaseDebugger.suspend(AbstractEaseDebugger.java:255)
09:37:21 [2020-12-29T14:37:21.163Z] 	at org.eclipse.ease.lang.python.py4j.internal.Py4jDebugger.suspend(Py4jDebugger.java:87)
09:37:21 [2020-12-29T14:37:21.163Z] 	at org.eclipse.ease.debugging.AbstractEaseDebugger.processLine(AbstractEaseDebugger.java:490)
09:37:21 [2020-12-29T14:37:21.163Z] 	at org.eclipse.ease.lang.python.debugger.PythonDebugger.traceDispatch(PythonDebugger.java:177)
09:37:21 [2020-12-29T14:37:21.163Z] 	at jdk.internal.reflect.GeneratedMethodAccessor18.invoke(Unknown Source)
09:37:21 [2020-12-29T14:37:21.163Z] 	at java.base/jdk.internal.reflect.DelegatingMethodAccessorImpl.invoke(DelegatingMethodAccessorImpl.java:43)
09:37:21 [2020-12-29T14:37:21.163Z] 	at java.base/java.lang.reflect.Method.invoke(Method.java:566)
09:37:21 [2020-12-29T14:37:21.163Z] 	at py4j.reflection.MethodInvoker.invoke(MethodInvoker.java:244)
09:37:21 [2020-12-29T14:37:21.163Z] 	at py4j.reflection.ReflectionEngine.invoke(ReflectionEngine.java:357)
09:37:21 [2020-12-29T14:37:21.163Z] 	at py4j.Gateway.invoke(Gateway.java:282)
09:37:21 [2020-12-29T14:37:21.163Z] 	at py4j.commands.AbstractCommand.invokeMethod(AbstractCommand.java:132)
09:37:21 [2020-12-29T14:37:21.163Z] 	at py4j.commands.CallCommand.execute(CallCommand.java:79)
09:37:21 [2020-12-29T14:37:21.163Z] 	at py4j.ClientServerConnection.sendCommand(ClientServerConnection.java:244)
09:37:21 [2020-12-29T14:37:21.163Z] 	at py4j.CallbackClient.sendCommand(CallbackClient.java:384)
09:37:21 [2020-12-29T14:37:21.163Z] 	at py4j.CallbackClient.sendCommand(CallbackClient.java:356)
09:37:21 [2020-12-29T14:37:21.163Z] 	at py4j.reflection.PythonProxyHandler.invoke(PythonProxyHandler.java:106)
09:37:21 [2020-12-29T14:37:21.163Z] 	at com.sun.proxy.$Proxy18.run(Unknown Source)
09:37:21 [2020-12-29T14:37:21.164Z] 	at org.eclipse.ease.lang.python.py4j.internal.Py4jDebugger.execute(Py4jDebugger.java:106)
09:37:21 [2020-12-29T14:37:21.164Z] 	at org.eclipse.ease.lang.python.py4j.internal.Py4jDebuggerEngine.internalExecute(Py4jDebuggerEngine.java:85)
09:37:21 [2020-12-29T14:37:21.164Z] 	at org.eclipse.ease.lang.python.py4j.internal.Py4jScriptEngine.execute(Py4jScriptEngine.java:226)
09:37:21 [2020-12-29T14:37:21.164Z] 	at org.eclipse.ease.AbstractScriptEngine.inject(AbstractScriptEngine.java:224)
09:37:21 [2020-12-29T14:37:21.164Z] 	at org.eclipse.ease.AbstractScriptEngine.run(AbstractScriptEngine.java:274)
09:37:21 [2020-12-29T14:37:21.164Z] 	at org.eclipse.core.internal.jobs.Worker.run(Worker.java:63)
09:37:21 [2020-12-29T14:37:21.164Z] 
09:37:21 [2020-12-29T14:37:21.164Z] 
09:37:21 [2020-12-29T14:37:21.164Z] 	at py4j.Protocol.getReturnValue(Protocol.java:476)
09:37:21 [2020-12-29T14:37:21.164Z] 	at py4j.reflection.PythonProxyHandler.invoke(PythonProxyHandler.java:108)
09:37:21 [2020-12-29T14:37:21.164Z] 	at com.sun.proxy.$Proxy18.run(Unknown Source)
09:37:21 [2020-12-29T14:37:21.164Z] 	at org.eclipse.ease.lang.python.py4j.internal.Py4jDebugger.execute(Py4jDebugger.java:106)
09:37:21 [2020-12-29T14:37:21.164Z] 	at org.eclipse.ease.lang.python.py4j.internal.Py4jDebuggerEngine.internalExecute(Py4jDebuggerEngine.java:85)
09:37:21 [2020-12-29T14:37:21.164Z] 	at org.eclipse.ease.lang.python.py4j.internal.Py4jScriptEngine.execute(Py4jScriptEngine.java:226)
09:37:21 [2020-12-29T14:37:21.164Z] 	at org.eclipse.ease.AbstractScriptEngine.inject(AbstractScriptEngine.java:224)
09:37:21 [2020-12-29T14:37:21.164Z] 	at org.eclipse.ease.AbstractScriptEngine.run(AbstractScriptEngine.java:274)
09:37:21 [2020-12-29T14:37:21.164Z] 	at org.eclipse.core.internal.jobs.Worker.run(Worker.java:63)
09:37:21 [2020-12-29T14:37:21.164Z] Start of script
09:37:21 [2020-12-29T14:37:21.164Z] include file start
09:37:21 [2020-12-29T14:37:21.164Z] include file processed
09:37:21 [2020-12-29T14:37:21.420Z] Result of testMethod = 5
09:37:21 [2020-12-29T14:37:21.420Z] End of script
09:37:21 [2020-12-29T14:37:21.676Z] Start of script
09:37:21 [2020-12-29T14:37:21.676Z] include file start
09:37:21 [2020-12-29T14:37:21.676Z] include file processed
09:37:21 [2020-12-29T14:37:21.676Z] Result of testMethod = 5
09:37:21 [2020-12-29T14:37:21.676Z] End of script
09:37:21 [2020-12-29T14:37:21.932Z] Start of script
09:37:21 [2020-12-29T14:37:21.932Z] include file start
09:37:21 [2020-12-29T14:37:21.932Z] include file processed
09:37:22 [2020-12-29T14:37:22.187Z] Result of testMethod = 5
09:37:22 [2020-12-29T14:37:22.187Z] End of script
09:37:22 [2020-12-29T14:37:22.443Z] Start of script
09:37:22 [2020-12-29T14:37:22.443Z] include file start
09:37:22 [2020-12-29T14:37:22.443Z] include file processed
09:37:22 [2020-12-29T14:37:22.443Z] Result of testMethod = 5
09:37:22 [2020-12-29T14:37:22.443Z] py4j.Py4JException: An exception was raised by the Python Proxy. Return Message: Traceback (most recent call last):
09:37:22 [2020-12-29T14:37:22.443Z]   File "/home/jenkins/agent/workspace/ease.verify.core.target.2019-06/tests/org.eclipse.ease.lang.python.py4j.test/target/work/plugins/py4j-python_0.10.8.1-bnd-2odeag/src/py4j/clientserver.py", line 581, in _call_proxy
09:37:22 [2020-12-29T14:37:22.443Z]     return_value = getattr(self.pool[obj_id], method)(*params)
09:37:22 [2020-12-29T14:37:22.443Z]   File "<...>", line 424, in run
09:37:22 [2020-12-29T14:37:22.443Z]   File "/usr/lib64/python2.7/bdb.py", line 400, in run
09:37:22 [2020-12-29T14:37:22.443Z]     exec cmd in globals, locals
09:37:22 [2020-12-29T14:37:22.443Z]   File "__ref_L/Debug Test/Main.py_ukptowhzxi", line 23, in <module>
09:37:22 [2020-12-29T14:37:22.443Z]   File "__ref_L/Debug Test/Main.py_ukptowhzxi", line 23, in <module>
09:37:22 [2020-12-29T14:37:22.443Z]   File "<...>", line 231, in trace_dispatch
09:37:22 [2020-12-29T14:37:22.443Z]   File "/usr/lib64/python2.7/bdb.py", line 49, in trace_dispatch
09:37:22 [2020-12-29T14:37:22.443Z]     return self.dispatch_line(frame)
09:37:22 [2020-12-29T14:37:22.443Z]   File "/usr/lib64/python2.7/bdb.py", line 67, in dispatch_line
09:37:22 [2020-12-29T14:37:22.443Z]     self.user_line(frame)
09:37:22 [2020-12-29T14:37:22.443Z]   File "<...>", line 241, in user_line
09:37:22 [2020-12-29T14:37:22.443Z]   File "<...>", line 296, in dispatch
09:37:22 [2020-12-29T14:37:22.443Z]   File "/home/jenkins/agent/workspace/ease.verify.core.target.2019-06/tests/org.eclipse.ease.lang.python.py4j.test/target/work/plugins/py4j-python_0.10.8.1-bnd-2odeag/src/py4j/java_gateway.py", line 1286, in __call__
09:37:22 [2020-12-29T14:37:22.443Z]     answer, self.gateway_client, self.target_id, self.name)
09:37:22 [2020-12-29T14:37:22.443Z]   File "/home/jenkins/agent/workspace/ease.verify.core.target.2019-06/tests/org.eclipse.ease.lang.python.py4j.test/target/work/plugins/py4j-python_0.10.8.1-bnd-2odeag/src/py4j/protocol.py", line 328, in get_return_value
09:37:22 [2020-12-29T14:37:22.443Z]     format(target_id, ".", name), value)
09:37:22 [2020-12-29T14:37:22.443Z] Py4JJavaError: An error occurred while calling o0.traceDispatch.
09:37:22 [2020-12-29T14:37:22.443Z] : org.eclipse.ease.ExitException: 
09:37:22 [2020-12-29T14:37:22.443Z] 	at org.eclipse.ease.debugging.AbstractEaseDebugger.handleEventsInSuspendedState(AbstractEaseDebugger.java:329)
09:37:22 [2020-12-29T14:37:22.443Z] 	at org.eclipse.ease.debugging.AbstractEaseDebugger.suspend(AbstractEaseDebugger.java:255)
09:37:22 [2020-12-29T14:37:22.443Z] 	at org.eclipse.ease.lang.python.py4j.internal.Py4jDebugger.suspend(Py4jDebugger.java:87)
09:37:22 [2020-12-29T14:37:22.443Z] 	at org.eclipse.ease.debugging.AbstractEaseDebugger.processLine(AbstractEaseDebugger.java:490)
09:37:22 [2020-12-29T14:37:22.443Z] 	at org.eclipse.ease.lang.python.debugger.PythonDebugger.traceDispatch(PythonDebugger.java:177)
09:37:22 [2020-12-29T14:37:22.443Z] 	at jdk.internal.reflect.GeneratedMethodAccessor18.invoke(Unknown Source)
09:37:22 [2020-12-29T14:37:22.443Z] 	at java.base/jdk.internal.reflect.DelegatingMethodAccessorImpl.invoke(DelegatingMethodAccessorImpl.java:43)
09:37:22 [2020-12-29T14:37:22.443Z] 	at java.base/java.lang.reflect.Method.invoke(Method.java:566)
09:37:22 [2020-12-29T14:37:22.443Z] 	at py4j.reflection.MethodInvoker.invoke(MethodInvoker.java:244)
09:37:22 [2020-12-29T14:37:22.443Z] 	at py4j.reflection.ReflectionEngine.invoke(ReflectionEngine.java:357)
09:37:22 [2020-12-29T14:37:22.443Z] 	at py4j.Gateway.invoke(Gateway.java:282)
09:37:22 [2020-12-29T14:37:22.443Z] 	at py4j.commands.AbstractCommand.invokeMethod(AbstractCommand.java:132)
09:37:22 [2020-12-29T14:37:22.443Z] 	at py4j.commands.CallCommand.execute(CallCommand.java:79)
09:37:22 [2020-12-29T14:37:22.443Z] 	at py4j.ClientServerConnection.sendCommand(ClientServerConnection.java:244)
09:37:22 [2020-12-29T14:37:22.443Z] 	at py4j.CallbackClient.sendCommand(CallbackClient.java:384)
09:37:22 [2020-12-29T14:37:22.443Z] 	at py4j.CallbackClient.sendCommand(CallbackClient.java:356)
09:37:22 [2020-12-29T14:37:22.443Z] 	at py4j.reflection.PythonProxyHandler.invoke(PythonProxyHandler.java:106)
09:37:22 [2020-12-29T14:37:22.443Z] 	at com.sun.proxy.$Proxy18.run(Unknown Source)
09:37:22 [2020-12-29T14:37:22.443Z] 	at org.eclipse.ease.lang.python.py4j.internal.Py4jDebugger.execute(Py4jDebugger.java:106)
09:37:22 [2020-12-29T14:37:22.443Z] 	at org.eclipse.ease.lang.python.py4j.internal.Py4jDebuggerEngine.internalExecute(Py4jDebuggerEngine.java:85)
09:37:22 [2020-12-29T14:37:22.443Z] 	at org.eclipse.ease.lang.python.py4j.internal.Py4jScriptEngine.execute(Py4jScriptEngine.java:226)
09:37:22 [2020-12-29T14:37:22.443Z] 	at org.eclipse.ease.AbstractScriptEngine.inject(AbstractScriptEngine.java:224)
09:37:22 [2020-12-29T14:37:22.443Z] 	at org.eclipse.ease.AbstractScriptEngine.run(AbstractScriptEngine.java:274)
09:37:22 [2020-12-29T14:37:22.443Z] 	at org.eclipse.core.internal.jobs.Worker.run(Worker.java:63)
09:37:22 [2020-12-29T14:37:22.443Z] 
09:37:22 [2020-12-29T14:37:22.443Z] 
09:37:22 [2020-12-29T14:37:22.443Z] 	at py4j.Protocol.getReturnValue(Protocol.java:476)
09:37:22 [2020-12-29T14:37:22.443Z] 	at py4j.reflection.PythonProxyHandler.invoke(PythonProxyHandler.java:108)
09:37:22 [2020-12-29T14:37:22.443Z] 	at com.sun.proxy.$Proxy18.run(Unknown Source)
09:37:22 [2020-12-29T14:37:22.443Z] 	at org.eclipse.ease.lang.python.py4j.internal.Py4jDebugger.execute(Py4jDebugger.java:106)
09:37:22 [2020-12-29T14:37:22.443Z] 	at org.eclipse.ease.lang.python.py4j.internal.Py4jDebuggerEngine.internalExecute(Py4jDebuggerEngine.java:85)
09:37:22 [2020-12-29T14:37:22.444Z] 	at org.eclipse.ease.lang.python.py4j.internal.Py4jScriptEngine.execute(Py4jScriptEngine.java:226)
09:37:22 [2020-12-29T14:37:22.444Z] 	at org.eclipse.ease.AbstractScriptEngine.inject(AbstractScriptEngine.java:224)
09:37:22 [2020-12-29T14:37:22.444Z] 	at org.eclipse.ease.AbstractScriptEngine.run(AbstractScriptEngine.java:274)
09:37:22 [2020-12-29T14:37:22.444Z] 	at org.eclipse.core.internal.jobs.Worker.run(Worker.java:63)
09:37:22 [2020-12-29T14:37:22.699Z] Start of script
09:37:22 [2020-12-29T14:37:22.699Z] include file start
09:37:22 [2020-12-29T14:37:22.699Z] include file processed
09:37:22 [2020-12-29T14:37:22.954Z] Result of testMethod = 5
09:37:22 [2020-12-29T14:37:22.955Z] End of script
09:37:22 [2020-12-29T14:37:22.955Z] Start of script
09:37:22 [2020-12-29T14:37:22.955Z] include file start
09:37:22 [2020-12-29T14:37:22.955Z] include file processed
09:37:22 [2020-12-29T14:37:22.955Z] Result of testMethod = 5
09:37:23 [2020-12-29T14:37:23.210Z] End of script
09:37:23 [2020-12-29T14:37:23.465Z] Start of script
09:37:23 [2020-12-29T14:37:23.465Z] include file start
09:37:23 [2020-12-29T14:37:23.465Z] include file processed
09:37:23 [2020-12-29T14:37:23.721Z] py4j.Py4JException: An exception was raised by the Python Proxy. Return Message: Traceback (most recent call last):
09:37:23 [2020-12-29T14:37:23.721Z]   File "/home/jenkins/agent/workspace/ease.verify.core.target.2019-06/tests/org.eclipse.ease.lang.python.py4j.test/target/work/plugins/py4j-python_0.10.8.1-bnd-2odeag/src/py4j/clientserver.py", line 581, in _call_proxy
09:37:23 [2020-12-29T14:37:23.721Z]     return_value = getattr(self.pool[obj_id], method)(*params)
09:37:23 [2020-12-29T14:37:23.721Z]   File "<...>", line 424, in run
09:37:23 [2020-12-29T14:37:23.721Z]   File "/usr/lib64/python2.7/bdb.py", line 400, in run
09:37:23 [2020-12-29T14:37:23.721Z]     exec cmd in globals, locals
09:37:23 [2020-12-29T14:37:23.721Z]   File "__ref_L/Debug Test/Main.py_fjuriynzkl", line 22, in <module>
09:37:23 [2020-12-29T14:37:23.721Z]   File "__ref_L/Debug Test/Main.py_fjuriynzkl", line 22, in <module>
09:37:23 [2020-12-29T14:37:23.721Z]   File "<...>", line 231, in trace_dispatch
09:37:23 [2020-12-29T14:37:23.721Z]   File "/usr/lib64/python2.7/bdb.py", line 49, in trace_dispatch
09:37:23 [2020-12-29T14:37:23.721Z]     return self.dispatch_line(frame)
09:37:23 [2020-12-29T14:37:23.721Z]   File "/usr/lib64/python2.7/bdb.py", line 67, in dispatch_line
09:37:23 [2020-12-29T14:37:23.721Z]     self.user_line(frame)
09:37:23 [2020-12-29T14:37:23.721Z]   File "<...>", line 241, in user_line
09:37:23 [2020-12-29T14:37:23.721Z]   File "<...>", line 296, in dispatch
09:37:23 [2020-12-29T14:37:23.721Z]   File "/home/jenkins/agent/workspace/ease.verify.core.target.2019-06/tests/org.eclipse.ease.lang.python.py4j.test/target/work/plugins/py4j-python_0.10.8.1-bnd-2odeag/src/py4j/java_gateway.py", line 1286, in __call__
09:37:23 [2020-12-29T14:37:23.721Z]     answer, self.gateway_client, self.target_id, self.name)
09:37:23 [2020-12-29T14:37:23.721Z]   File "/home/jenkins/agent/workspace/ease.verify.core.target.2019-06/tests/org.eclipse.ease.lang.python.py4j.test/target/work/plugins/py4j-python_0.10.8.1-bnd-2odeag/src/py4j/protocol.py", line 328, in get_return_value
09:37:23 [2020-12-29T14:37:23.721Z]     format(target_id, ".", name), value)
09:37:23 [2020-12-29T14:37:23.721Z] Py4JJavaError: An error occurred while calling o0.traceDispatch.
09:37:23 [2020-12-29T14:37:23.721Z] : org.eclipse.ease.ExitException: 
09:37:23 [2020-12-29T14:37:23.721Z] 	at org.eclipse.ease.debugging.AbstractEaseDebugger.handleEventsInSuspendedState(AbstractEaseDebugger.java:329)
09:37:23 [2020-12-29T14:37:23.721Z] 	at org.eclipse.ease.debugging.AbstractEaseDebugger.suspend(AbstractEaseDebugger.java:255)
09:37:23 [2020-12-29T14:37:23.721Z] 	at org.eclipse.ease.lang.python.py4j.internal.Py4jDebugger.suspend(Py4jDebugger.java:87)
09:37:23 [2020-12-29T14:37:23.721Z] 	at org.eclipse.ease.debugging.AbstractEaseDebugger.processLine(AbstractEaseDebugger.java:510)
09:37:23 [2020-12-29T14:37:23.721Z] 	at org.eclipse.ease.lang.python.debugger.PythonDebugger.traceDispatch(PythonDebugger.java:177)
09:37:23 [2020-12-29T14:37:23.722Z] 	at jdk.internal.reflect.GeneratedMethodAccessor18.invoke(Unknown Source)
09:37:23 [2020-12-29T14:37:23.722Z] 	at java.base/jdk.internal.reflect.DelegatingMethodAccessorImpl.invoke(DelegatingMethodAccessorImpl.java:43)
09:37:23 [2020-12-29T14:37:23.722Z] 	at java.base/java.lang.reflect.Method.invoke(Method.java:566)
09:37:23 [2020-12-29T14:37:23.722Z] 	at py4j.reflection.MethodInvoker.invoke(MethodInvoker.java:244)
09:37:23 [2020-12-29T14:37:23.722Z] 	at py4j.reflection.ReflectionEngine.invoke(ReflectionEngine.java:357)
09:37:23 [2020-12-29T14:37:23.722Z] 	at py4j.Gateway.invoke(Gateway.java:282)
09:37:23 [2020-12-29T14:37:23.722Z] 	at py4j.commands.AbstractCommand.invokeMethod(AbstractCommand.java:132)
09:37:23 [2020-12-29T14:37:23.722Z] 	at py4j.commands.CallCommand.execute(CallCommand.java:79)
09:37:23 [2020-12-29T14:37:23.722Z] 	at py4j.ClientServerConnection.sendCommand(ClientServerConnection.java:244)
09:37:23 [2020-12-29T14:37:23.722Z] 	at py4j.CallbackClient.sendCommand(CallbackClient.java:384)
09:37:23 [2020-12-29T14:37:23.722Z] 	at py4j.CallbackClient.sendCommand(CallbackClient.java:356)
09:37:23 [2020-12-29T14:37:23.722Z] 	at py4j.reflection.PythonProxyHandler.invoke(PythonProxyHandler.java:106)
09:37:23 [2020-12-29T14:37:23.722Z] 	at com.sun.proxy.$Proxy18.run(Unknown Source)
09:37:23 [2020-12-29T14:37:23.722Z] 	at org.eclipse.ease.lang.python.py4j.internal.Py4jDebugger.execute(Py4jDebugger.java:106)
09:37:23 [2020-12-29T14:37:23.722Z] 	at org.eclipse.ease.lang.python.py4j.internal.Py4jDebuggerEngine.internalExecute(Py4jDebuggerEngine.java:85)
09:37:23 [2020-12-29T14:37:23.722Z] 	at org.eclipse.ease.lang.python.py4j.internal.Py4jScriptEngine.execute(Py4jScriptEngine.java:226)
09:37:23 [2020-12-29T14:37:23.722Z] 	at org.eclipse.ease.AbstractScriptEngine.inject(AbstractScriptEngine.java:224)
09:37:23 [2020-12-29T14:37:23.722Z] 	at org.eclipse.ease.AbstractScriptEngine.run(AbstractScriptEngine.java:274)
09:37:23 [2020-12-29T14:37:23.722Z] 	at org.eclipse.core.internal.jobs.Worker.run(Worker.java:63)
09:37:23 [2020-12-29T14:37:23.722Z] 
09:37:23 [2020-12-29T14:37:23.722Z] 
09:37:23 [2020-12-29T14:37:23.722Z] 	at py4j.Protocol.getReturnValue(Protocol.java:476)
09:37:23 [2020-12-29T14:37:23.722Z] 	at py4j.reflection.PythonProxyHandler.invoke(PythonProxyHandler.java:108)
09:37:23 [2020-12-29T14:37:23.722Z] 	at com.sun.proxy.$Proxy18.run(Unknown Source)
09:37:23 [2020-12-29T14:37:23.722Z] 	at org.eclipse.ease.lang.python.py4j.internal.Py4jDebugger.execute(Py4jDebugger.java:106)
09:37:23 [2020-12-29T14:37:23.722Z] 	at org.eclipse.ease.lang.python.py4j.internal.Py4jDebuggerEngine.internalExecute(Py4jDebuggerEngine.java:85)
09:37:23 [2020-12-29T14:37:23.722Z] 	at org.eclipse.ease.lang.python.py4j.internal.Py4jScriptEngine.execute(Py4jScriptEngine.java:226)
09:37:23 [2020-12-29T14:37:23.722Z] 	at org.eclipse.ease.AbstractScriptEngine.inject(AbstractScriptEngine.java:224)
09:37:23 [2020-12-29T14:37:23.722Z] 	at org.eclipse.ease.AbstractScriptEngine.run(AbstractScriptEngine.java:274)
09:37:23 [2020-12-29T14:37:23.722Z] 	at org.eclipse.core.internal.jobs.Worker.run(Worker.java:63)
09:37:23 [2020-12-29T14:37:23.978Z] Start of script
09:37:23 [2020-12-29T14:37:23.978Z] include file start
09:37:23 [2020-12-29T14:37:23.978Z] include file processed
09:37:24 [2020-12-29T14:37:24.235Z] Result of testMethod = 5
09:37:24 [2020-12-29T14:37:24.235Z] End of script
09:37:24 [2020-12-29T14:37:24.492Z] py4j.Py4JException: An exception was raised by the Python Proxy. Return Message: Traceback (most recent call last):
09:37:24 [2020-12-29T14:37:24.492Z]   File "/home/jenkins/agent/workspace/ease.verify.core.target.2019-06/tests/org.eclipse.ease.lang.python.py4j.test/target/work/plugins/py4j-python_0.10.8.1-bnd-2odeag/src/py4j/clientserver.py", line 581, in _call_proxy
09:37:24 [2020-12-29T14:37:24.492Z]     return_value = getattr(self.pool[obj_id], method)(*params)
09:37:24 [2020-12-29T14:37:24.492Z]   File "<...>", line 424, in run
09:37:24 [2020-12-29T14:37:24.492Z]   File "/usr/lib64/python2.7/bdb.py", line 400, in run
09:37:24 [2020-12-29T14:37:24.492Z]     exec cmd in globals, locals
09:37:24 [2020-12-29T14:37:24.492Z]   File "__ref_L/Debug Test/Main.py_fgcblekhyf", line 1, in <module>
09:37:24 [2020-12-29T14:37:24.492Z]   File "__ref_L/Debug Test/Main.py_fgcblekhyf", line 1, in <module>
09:37:24 [2020-12-29T14:37:24.492Z]   File "<...>", line 231, in trace_dispatch
09:37:24 [2020-12-29T14:37:24.492Z]   File "/usr/lib64/python2.7/bdb.py", line 49, in trace_dispatch
09:37:24 [2020-12-29T14:37:24.492Z]     return self.dispatch_line(frame)
09:37:24 [2020-12-29T14:37:24.492Z]   File "/usr/lib64/python2.7/bdb.py", line 67, in dispatch_line
09:37:24 [2020-12-29T14:37:24.492Z]     self.user_line(frame)
09:37:24 [2020-12-29T14:37:24.492Z]   File "<...>", line 241, in user_line
09:37:24 [2020-12-29T14:37:24.492Z]   File "<...>", line 296, in dispatch
09:37:24 [2020-12-29T14:37:24.492Z]   File "/home/jenkins/agent/workspace/ease.verify.core.target.2019-06/tests/org.eclipse.ease.lang.python.py4j.test/target/work/plugins/py4j-python_0.10.8.1-bnd-2odeag/src/py4j/java_gateway.py", line 1286, in __call__
09:37:24 [2020-12-29T14:37:24.492Z]     answer, self.gateway_client, self.target_id, self.name)
09:37:24 [2020-12-29T14:37:24.492Z]   File "/home/jenkins/agent/workspace/ease.verify.core.target.2019-06/tests/org.eclipse.ease.lang.python.py4j.test/target/work/plugins/py4j-python_0.10.8.1-bnd-2odeag/src/py4j/protocol.py", line 328, in get_return_value
09:37:24 [2020-12-29T14:37:24.492Z]     format(target_id, ".", name), value)
09:37:24 [2020-12-29T14:37:24.492Z] Py4JJavaError: An error occurred while calling o0.traceDispatch.
09:37:24 [2020-12-29T14:37:24.492Z] : org.eclipse.ease.ExitException: 
09:37:24 [2020-12-29T14:37:24.492Z] 	at org.eclipse.ease.debugging.AbstractEaseDebugger.handleEventsInSuspendedState(AbstractEaseDebugger.java:329)
09:37:24 [2020-12-29T14:37:24.492Z] 	at org.eclipse.ease.debugging.AbstractEaseDebugger.suspend(AbstractEaseDebugger.java:255)
09:37:24 [2020-12-29T14:37:24.492Z] 	at org.eclipse.ease.lang.python.py4j.internal.Py4jDebugger.suspend(Py4jDebugger.java:87)
09:37:24 [2020-12-29T14:37:24.492Z] 	at org.eclipse.ease.debugging.AbstractEaseDebugger.processLine(AbstractEaseDebugger.java:490)
09:37:24 [2020-12-29T14:37:24.492Z] 	at org.eclipse.ease.lang.python.debugger.PythonDebugger.traceDispatch(PythonDebugger.java:177)
09:37:24 [2020-12-29T14:37:24.492Z] 	at jdk.internal.reflect.GeneratedMethodAccessor18.invoke(Unknown Source)
09:37:24 [2020-12-29T14:37:24.492Z] 	at java.base/jdk.internal.reflect.DelegatingMethodAccessorImpl.invoke(DelegatingMethodAccessorImpl.java:43)
09:37:24 [2020-12-29T14:37:24.492Z] 	at java.base/java.lang.reflect.Method.invoke(Method.java:566)
09:37:24 [2020-12-29T14:37:24.492Z] 	at py4j.reflection.MethodInvoker.invoke(MethodInvoker.java:244)
09:37:24 [2020-12-29T14:37:24.492Z] 	at py4j.reflection.ReflectionEngine.invoke(ReflectionEngine.java:357)
09:37:24 [2020-12-29T14:37:24.492Z] 	at py4j.Gateway.invoke(Gateway.java:282)
09:37:24 [2020-12-29T14:37:24.492Z] 	at py4j.commands.AbstractCommand.invokeMethod(AbstractCommand.java:132)
09:37:24 [2020-12-29T14:37:24.492Z] 	at py4j.commands.CallCommand.execute(CallCommand.java:79)
09:37:24 [2020-12-29T14:37:24.492Z] 	at py4j.ClientServerConnection.sendCommand(ClientServerConnection.java:244)
09:37:24 [2020-12-29T14:37:24.492Z] 	at py4j.CallbackClient.sendCommand(CallbackClient.java:384)
09:37:24 [2020-12-29T14:37:24.492Z] 	at py4j.CallbackClient.sendCommand(CallbackClient.java:356)
09:37:24 [2020-12-29T14:37:24.492Z] 	at py4j.reflection.PythonProxyHandler.invoke(PythonProxyHandler.java:106)
09:37:24 [2020-12-29T14:37:24.492Z] 	at com.sun.proxy.$Proxy18.run(Unknown Source)
09:37:24 [2020-12-29T14:37:24.492Z] 	at org.eclipse.ease.lang.python.py4j.internal.Py4jDebugger.execute(Py4jDebugger.java:106)
09:37:24 [2020-12-29T14:37:24.492Z] 	at org.eclipse.ease.lang.python.py4j.internal.Py4jDebuggerEngine.internalExecute(Py4jDebuggerEngine.java:85)
09:37:24 [2020-12-29T14:37:24.492Z] 	at org.eclipse.ease.lang.python.py4j.internal.Py4jScriptEngine.execute(Py4jScriptEngine.java:226)
09:37:24 [2020-12-29T14:37:24.492Z] 	at org.eclipse.ease.AbstractScriptEngine.inject(AbstractScriptEngine.java:224)
09:37:24 [2020-12-29T14:37:24.492Z] 	at org.eclipse.ease.AbstractScriptEngine.run(AbstractScriptEngine.java:274)
09:37:24 [2020-12-29T14:37:24.492Z] 	at org.eclipse.core.internal.jobs.Worker.run(Worker.java:63)
09:37:24 [2020-12-29T14:37:24.492Z] 
09:37:24 [2020-12-29T14:37:24.492Z] 
09:37:24 [2020-12-29T14:37:24.492Z] 	at py4j.Protocol.getReturnValue(Protocol.java:476)
09:37:24 [2020-12-29T14:37:24.492Z] 	at py4j.reflection.PythonProxyHandler.invoke(PythonProxyHandler.java:108)
09:37:24 [2020-12-29T14:37:24.492Z] 	at com.sun.proxy.$Proxy18.run(Unknown Source)
09:37:24 [2020-12-29T14:37:24.492Z] 	at org.eclipse.ease.lang.python.py4j.internal.Py4jDebugger.execute(Py4jDebugger.java:106)
09:37:24 [2020-12-29T14:37:24.492Z] 	at org.eclipse.ease.lang.python.py4j.internal.Py4jDebuggerEngine.internalExecute(Py4jDebuggerEngine.java:85)
09:37:24 [2020-12-29T14:37:24.492Z] 	at org.eclipse.ease.lang.python.py4j.internal.Py4jScriptEngine.execute(Py4jScriptEngine.java:226)
09:37:24 [2020-12-29T14:37:24.492Z] 	at org.eclipse.ease.AbstractScriptEngine.inject(AbstractScriptEngine.java:224)
09:37:24 [2020-12-29T14:37:24.492Z] 	at org.eclipse.ease.AbstractScriptEngine.run(AbstractScriptEngine.java:274)
09:37:24 [2020-12-29T14:37:24.492Z] 	at org.eclipse.core.internal.jobs.Worker.run(Worker.java:63)
09:37:24 [2020-12-29T14:37:24.492Z] Start of script
09:37:24 [2020-12-29T14:37:24.492Z] include file start
09:37:24 [2020-12-29T14:37:24.492Z] include file processed
09:37:24 [2020-12-29T14:37:24.492Z] Result of testMethod = 5
09:37:24 [2020-12-29T14:37:24.492Z] End of script
09:37:24 [2020-12-29T14:37:24.748Z] Start of script
09:37:24 [2020-12-29T14:37:24.748Z] include file start
09:37:24 [2020-12-29T14:37:24.748Z] include file processed
09:37:25 [2020-12-29T14:37:25.004Z] Result of testMethod = 5
09:37:25 [2020-12-29T14:37:25.004Z] End of script
09:37:25 [2020-12-29T14:37:25.004Z] Start of script
09:37:25 [2020-12-29T14:37:25.004Z] include file start
09:37:25 [2020-12-29T14:37:25.004Z] include file processed
09:37:25 [2020-12-29T14:37:25.004Z] Result of testMethod = 5
09:37:25 [2020-12-29T14:37:25.260Z] py4j.Py4JException: An exception was raised by the Python Proxy. Return Message: Traceback (most recent call last):
09:37:25 [2020-12-29T14:37:25.260Z]   File "/home/jenkins/agent/workspace/ease.verify.core.target.2019-06/tests/org.eclipse.ease.lang.python.py4j.test/target/work/plugins/py4j-python_0.10.8.1-bnd-2odeag/src/py4j/clientserver.py", line 581, in _call_proxy
09:37:25 [2020-12-29T14:37:25.260Z]     return_value = getattr(self.pool[obj_id], method)(*params)
09:37:25 [2020-12-29T14:37:25.260Z]   File "<...>", line 424, in run
09:37:25 [2020-12-29T14:37:25.260Z]   File "/usr/lib64/python2.7/bdb.py", line 400, in run
09:37:25 [2020-12-29T14:37:25.260Z]     exec cmd in globals, locals
09:37:25 [2020-12-29T14:37:25.260Z]   File "__ref_L/Debug Test/Main.py_cdteooytiw", line 23, in <module>
09:37:25 [2020-12-29T14:37:25.260Z]   File "__ref_L/Debug Test/Main.py_cdteooytiw", line 23, in <module>
09:37:25 [2020-12-29T14:37:25.260Z]   File "<...>", line 231, in trace_dispatch
09:37:25 [2020-12-29T14:37:25.260Z]   File "/usr/lib64/python2.7/bdb.py", line 49, in trace_dispatch
09:37:25 [2020-12-29T14:37:25.260Z]     return self.dispatch_line(frame)
09:37:25 [2020-12-29T14:37:25.260Z]   File "/usr/lib64/python2.7/bdb.py", line 67, in dispatch_line
09:37:25 [2020-12-29T14:37:25.260Z]     self.user_line(frame)
09:37:25 [2020-12-29T14:37:25.260Z]   File "<...>", line 241, in user_line
09:37:25 [2020-12-29T14:37:25.260Z]   File "<...>", line 296, in dispatch
09:37:25 [2020-12-29T14:37:25.260Z]   File "/home/jenkins/agent/workspace/ease.verify.core.target.2019-06/tests/org.eclipse.ease.lang.python.py4j.test/target/work/plugins/py4j-python_0.10.8.1-bnd-2odeag/src/py4j/java_gateway.py", line 1286, in __call__
09:37:25 [2020-12-29T14:37:25.260Z]     answer, self.gateway_client, self.target_id, self.name)
09:37:25 [2020-12-29T14:37:25.260Z]   File "/home/jenkins/agent/workspace/ease.verify.core.target.2019-06/tests/org.eclipse.ease.lang.python.py4j.test/target/work/plugins/py4j-python_0.10.8.1-bnd-2odeag/src/py4j/protocol.py", line 328, in get_return_value
09:37:25 [2020-12-29T14:37:25.260Z]     format(target_id, ".", name), value)
09:37:25 [2020-12-29T14:37:25.260Z] Py4JJavaError: An error occurred while calling o0.traceDispatch.
09:37:25 [2020-12-29T14:37:25.260Z] : org.eclipse.ease.ExitException: 
09:37:25 [2020-12-29T14:37:25.260Z] 	at org.eclipse.ease.debugging.AbstractEaseDebugger.handleEventsInSuspendedState(AbstractEaseDebugger.java:329)
09:37:25 [2020-12-29T14:37:25.260Z] 	at org.eclipse.ease.debugging.AbstractEaseDebugger.suspend(AbstractEaseDebugger.java:255)
09:37:25 [2020-12-29T14:37:25.260Z] 	at org.eclipse.ease.lang.python.py4j.internal.Py4jDebugger.suspend(Py4jDebugger.java:87)
09:37:25 [2020-12-29T14:37:25.260Z] 	at org.eclipse.ease.debugging.AbstractEaseDebugger.processLine(AbstractEaseDebugger.java:490)
09:37:25 [2020-12-29T14:37:25.260Z] 	at org.eclipse.ease.lang.python.debugger.PythonDebugger.traceDispatch(PythonDebugger.java:177)
09:37:25 [2020-12-29T14:37:25.260Z] 	at jdk.internal.reflect.GeneratedMethodAccessor18.invoke(Unknown Source)
09:37:25 [2020-12-29T14:37:25.260Z] 	at java.base/jdk.internal.reflect.DelegatingMethodAccessorImpl.invoke(DelegatingMethodAccessorImpl.java:43)
09:37:25 [2020-12-29T14:37:25.260Z] 	at java.base/java.lang.reflect.Method.invoke(Method.java:566)
09:37:25 [2020-12-29T14:37:25.260Z] 	at py4j.reflection.MethodInvoker.invoke(MethodInvoker.java:244)
09:37:25 [2020-12-29T14:37:25.260Z] 	at py4j.reflection.ReflectionEngine.invoke(ReflectionEngine.java:357)
09:37:25 [2020-12-29T14:37:25.260Z] 	at py4j.Gateway.invoke(Gateway.java:282)
09:37:25 [2020-12-29T14:37:25.260Z] 	at py4j.commands.AbstractCommand.invokeMethod(AbstractCommand.java:132)
09:37:25 [2020-12-29T14:37:25.260Z] 	at py4j.commands.CallCommand.execute(CallCommand.java:79)
09:37:25 [2020-12-29T14:37:25.260Z] 	at py4j.ClientServerConnection.sendCommand(ClientServerConnection.java:244)
09:37:25 [2020-12-29T14:37:25.260Z] 	at py4j.CallbackClient.sendCommand(CallbackClient.java:384)
09:37:25 [2020-12-29T14:37:25.260Z] 	at py4j.CallbackClient.sendCommand(CallbackClient.java:356)
09:37:25 [2020-12-29T14:37:25.260Z] 	at py4j.reflection.PythonProxyHandler.invoke(PythonProxyHandler.java:106)
09:37:25 [2020-12-29T14:37:25.260Z] 	at com.sun.proxy.$Proxy18.run(Unknown Source)
09:37:25 [2020-12-29T14:37:25.260Z] 	at org.eclipse.ease.lang.python.py4j.internal.Py4jDebugger.execute(Py4jDebugger.java:106)
09:37:25 [2020-12-29T14:37:25.260Z] 	at org.eclipse.ease.lang.python.py4j.internal.Py4jDebuggerEngine.internalExecute(Py4jDebuggerEngine.java:85)
09:37:25 [2020-12-29T14:37:25.260Z] 	at org.eclipse.ease.lang.python.py4j.internal.Py4jScriptEngine.execute(Py4jScriptEngine.java:226)
09:37:25 [2020-12-29T14:37:25.260Z] 	at org.eclipse.ease.AbstractScriptEngine.inject(AbstractScriptEngine.java:224)
09:37:25 [2020-12-29T14:37:25.260Z] 	at org.eclipse.ease.AbstractScriptEngine.run(AbstractScriptEngine.java:274)
09:37:25 [2020-12-29T14:37:25.260Z] 	at org.eclipse.core.internal.jobs.Worker.run(Worker.java:63)
09:37:25 [2020-12-29T14:37:25.260Z] 
09:37:25 [2020-12-29T14:37:25.260Z] 
09:37:25 [2020-12-29T14:37:25.260Z] 	at py4j.Protocol.getReturnValue(Protocol.java:476)
09:37:25 [2020-12-29T14:37:25.260Z] 	at py4j.reflection.PythonProxyHandler.invoke(PythonProxyHandler.java:108)
09:37:25 [2020-12-29T14:37:25.260Z] 	at com.sun.proxy.$Proxy18.run(Unknown Source)
09:37:25 [2020-12-29T14:37:25.260Z] 	at org.eclipse.ease.lang.python.py4j.internal.Py4jDebugger.execute(Py4jDebugger.java:106)
09:37:25 [2020-12-29T14:37:25.260Z] 	at org.eclipse.ease.lang.python.py4j.internal.Py4jDebuggerEngine.internalExecute(Py4jDebuggerEngine.java:85)
09:37:25 [2020-12-29T14:37:25.260Z] 	at org.eclipse.ease.lang.python.py4j.internal.Py4jScriptEngine.execute(Py4jScriptEngine.java:226)
09:37:25 [2020-12-29T14:37:25.260Z] 	at org.eclipse.ease.AbstractScriptEngine.inject(AbstractScriptEngine.java:224)
09:37:25 [2020-12-29T14:37:25.260Z] 	at org.eclipse.ease.AbstractScriptEngine.run(AbstractScriptEngine.java:274)
09:37:25 [2020-12-29T14:37:25.260Z] 	at org.eclipse.core.internal.jobs.Worker.run(Worker.java:63)
09:37:25 [2020-12-29T14:37:25.516Z] Start of script
09:37:25 [2020-12-29T14:37:25.516Z] include file start
09:37:25 [2020-12-29T14:37:25.516Z] include file processed
09:37:25 [2020-12-29T14:37:25.516Z] Result of testMethod = 5
09:37:25 [2020-12-29T14:37:25.516Z] End of script
09:37:25 [2020-12-29T14:37:25.771Z] py4j.Py4JException: An exception was raised by the Python Proxy. Return Message: Traceback (most recent call last):
09:37:25 [2020-12-29T14:37:25.771Z]   File "/home/jenkins/agent/workspace/ease.verify.core.target.2019-06/tests/org.eclipse.ease.lang.python.py4j.test/target/work/plugins/py4j-python_0.10.8.1-bnd-2odeag/src/py4j/clientserver.py", line 581, in _call_proxy
09:37:25 [2020-12-29T14:37:25.771Z]     return_value = getattr(self.pool[obj_id], method)(*params)
09:37:25 [2020-12-29T14:37:25.771Z]   File "<...>", line 424, in run
09:37:25 [2020-12-29T14:37:25.771Z]   File "/usr/lib64/python2.7/bdb.py", line 400, in run
09:37:25 [2020-12-29T14:37:25.771Z]     exec cmd in globals, locals
09:37:25 [2020-12-29T14:37:25.771Z]   File "__ref_L/Debug Test/Main.py_rwlyhhaldo", line 1, in <module>
09:37:25 [2020-12-29T14:37:25.771Z]   File "__ref_L/Debug Test/Main.py_rwlyhhaldo", line 1, in <module>
09:37:25 [2020-12-29T14:37:25.771Z]   File "<...>", line 231, in trace_dispatch
09:37:25 [2020-12-29T14:37:25.771Z]   File "/usr/lib64/python2.7/bdb.py", line 49, in trace_dispatch
09:37:25 [2020-12-29T14:37:25.771Z]     return self.dispatch_line(frame)
09:37:25 [2020-12-29T14:37:25.771Z]   File "/usr/lib64/python2.7/bdb.py", line 67, in dispatch_line
09:37:25 [2020-12-29T14:37:25.771Z]     self.user_line(frame)
09:37:25 [2020-12-29T14:37:25.771Z]   File "<...>", line 241, in user_line
09:37:25 [2020-12-29T14:37:25.771Z]   File "<...>", line 296, in dispatch
09:37:25 [2020-12-29T14:37:25.771Z]   File "/home/jenkins/agent/workspace/ease.verify.core.target.2019-06/tests/org.eclipse.ease.lang.python.py4j.test/target/work/plugins/py4j-python_0.10.8.1-bnd-2odeag/src/py4j/java_gateway.py", line 1286, in __call__
09:37:25 [2020-12-29T14:37:25.771Z]     answer, self.gateway_client, self.target_id, self.name)
09:37:25 [2020-12-29T14:37:25.771Z]   File "/home/jenkins/agent/workspace/ease.verify.core.target.2019-06/tests/org.eclipse.ease.lang.python.py4j.test/target/work/plugins/py4j-python_0.10.8.1-bnd-2odeag/src/py4j/protocol.py", line 328, in get_return_value
09:37:25 [2020-12-29T14:37:25.771Z]     format(target_id, ".", name), value)
09:37:25 [2020-12-29T14:37:25.771Z] Py4JJavaError: An error occurred while calling o0.traceDispatch.
09:37:25 [2020-12-29T14:37:25.771Z] : org.eclipse.ease.ExitException: 
09:37:25 [2020-12-29T14:37:25.771Z] 	at org.eclipse.ease.debugging.AbstractEaseDebugger.handleEventsInSuspendedState(AbstractEaseDebugger.java:329)
09:37:25 [2020-12-29T14:37:25.771Z] 	at org.eclipse.ease.debugging.AbstractEaseDebugger.suspend(AbstractEaseDebugger.java:255)
09:37:25 [2020-12-29T14:37:25.771Z] 	at org.eclipse.ease.lang.python.py4j.internal.Py4jDebugger.suspend(Py4jDebugger.java:87)
09:37:25 [2020-12-29T14:37:25.771Z] 	at org.eclipse.ease.debugging.AbstractEaseDebugger.processLine(AbstractEaseDebugger.java:490)
09:37:25 [2020-12-29T14:37:25.771Z] 	at org.eclipse.ease.lang.python.debugger.PythonDebugger.traceDispatch(PythonDebugger.java:177)
09:37:25 [2020-12-29T14:37:25.771Z] 	at jdk.internal.reflect.GeneratedMethodAccessor18.invoke(Unknown Source)
09:37:25 [2020-12-29T14:37:25.771Z] 	at java.base/jdk.internal.reflect.DelegatingMethodAccessorImpl.invoke(DelegatingMethodAccessorImpl.java:43)
09:37:25 [2020-12-29T14:37:25.771Z] 	at java.base/java.lang.reflect.Method.invoke(Method.java:566)
09:37:25 [2020-12-29T14:37:25.771Z] 	at py4j.reflection.MethodInvoker.invoke(MethodInvoker.java:244)
09:37:25 [2020-12-29T14:37:25.771Z] 	at py4j.reflection.ReflectionEngine.invoke(ReflectionEngine.java:357)
09:37:25 [2020-12-29T14:37:25.771Z] 	at py4j.Gateway.invoke(Gateway.java:282)
09:37:25 [2020-12-29T14:37:25.771Z] 	at py4j.commands.AbstractCommand.invokeMethod(AbstractCommand.java:132)
09:37:25 [2020-12-29T14:37:25.771Z] 	at py4j.commands.CallCommand.execute(CallCommand.java:79)
09:37:25 [2020-12-29T14:37:25.771Z] 	at py4j.ClientServerConnection.sendCommand(ClientServerConnection.java:244)
09:37:25 [2020-12-29T14:37:25.771Z] 	at py4j.CallbackClient.sendCommand(CallbackClient.java:384)
09:37:25 [2020-12-29T14:37:25.771Z] 	at py4j.CallbackClient.sendCommand(CallbackClient.java:356)
09:37:25 [2020-12-29T14:37:25.771Z] 	at py4j.reflection.PythonProxyHandler.invoke(PythonProxyHandler.java:106)
09:37:25 [2020-12-29T14:37:25.771Z] 	at com.sun.proxy.$Proxy18.run(Unknown Source)
09:37:25 [2020-12-29T14:37:25.771Z] 	at org.eclipse.ease.lang.python.py4j.internal.Py4jDebugger.execute(Py4jDebugger.java:106)
09:37:25 [2020-12-29T14:37:25.771Z] 	at org.eclipse.ease.lang.python.py4j.internal.Py4jDebuggerEngine.internalExecute(Py4jDebuggerEngine.java:85)
09:37:25 [2020-12-29T14:37:25.772Z] 	at org.eclipse.ease.lang.python.py4j.internal.Py4jScriptEngine.execute(Py4jScriptEngine.java:226)
09:37:25 [2020-12-29T14:37:25.772Z] 	at org.eclipse.ease.AbstractScriptEngine.inject(AbstractScriptEngine.java:224)
09:37:25 [2020-12-29T14:37:25.772Z] 	at org.eclipse.ease.AbstractScriptEngine.run(AbstractScriptEngine.java:274)
09:37:25 [2020-12-29T14:37:25.772Z] 	at org.eclipse.core.internal.jobs.Worker.run(Worker.java:63)
09:37:25 [2020-12-29T14:37:25.772Z] 
09:37:25 [2020-12-29T14:37:25.772Z] 
09:37:25 [2020-12-29T14:37:25.772Z] 	at py4j.Protocol.getReturnValue(Protocol.java:476)
09:37:25 [2020-12-29T14:37:25.772Z] 	at py4j.reflection.PythonProxyHandler.invoke(PythonProxyHandler.java:108)
09:37:25 [2020-12-29T14:37:25.772Z] 	at com.sun.proxy.$Proxy18.run(Unknown Source)
09:37:25 [2020-12-29T14:37:25.772Z] 	at org.eclipse.ease.lang.python.py4j.internal.Py4jDebugger.execute(Py4jDebugger.java:106)
09:37:25 [2020-12-29T14:37:25.772Z] 	at org.eclipse.ease.lang.python.py4j.internal.Py4jDebuggerEngine.internalExecute(Py4jDebuggerEngine.java:85)
09:37:25 [2020-12-29T14:37:25.772Z] 	at org.eclipse.ease.lang.python.py4j.internal.Py4jScriptEngine.execute(Py4jScriptEngine.java:226)
09:37:25 [2020-12-29T14:37:25.772Z] 	at org.eclipse.ease.AbstractScriptEngine.inject(AbstractScriptEngine.java:224)
09:37:25 [2020-12-29T14:37:25.772Z] 	at org.eclipse.ease.AbstractScriptEngine.run(AbstractScriptEngine.java:274)
09:37:25 [2020-12-29T14:37:25.772Z] 	at org.eclipse.core.internal.jobs.Worker.run(Worker.java:63)
09:37:26 [2020-12-29T14:37:26.027Z] Start of script
09:37:26 [2020-12-29T14:37:26.027Z] include file start
09:37:26 [2020-12-29T14:37:26.027Z] include file processed
09:37:26 [2020-12-29T14:37:26.027Z] Result of testMethod = 5
09:37:26 [2020-12-29T14:37:26.027Z] End of script
09:37:26 [2020-12-29T14:37:26.282Z] Start of script
09:37:26 [2020-12-29T14:37:26.282Z] include file start
09:37:26 [2020-12-29T14:37:26.282Z] include file processed
09:37:26 [2020-12-29T14:37:26.283Z] Result of testMethod = 5
09:37:26 [2020-12-29T14:37:26.283Z] End of script
09:37:26 [2020-12-29T14:37:26.538Z] py4j.Py4JException: An exception was raised by the Python Proxy. Return Message: Traceback (most recent call last):
09:37:26 [2020-12-29T14:37:26.538Z]   File "/home/jenkins/agent/workspace/ease.verify.core.target.2019-06/tests/org.eclipse.ease.lang.python.py4j.test/target/work/plugins/py4j-python_0.10.8.1-bnd-2odeag/src/py4j/clientserver.py", line 581, in _call_proxy
09:37:26 [2020-12-29T14:37:26.538Z]     return_value = getattr(self.pool[obj_id], method)(*params)
09:37:26 [2020-12-29T14:37:26.538Z]   File "<...>", line 424, in run
09:37:26 [2020-12-29T14:37:26.538Z]   File "/usr/lib64/python2.7/bdb.py", line 400, in run
09:37:26 [2020-12-29T14:37:26.538Z]     exec cmd in globals, locals
09:37:26 [2020-12-29T14:37:26.538Z]   File "__ref_L/Debug Test/Main.py_klqskswtvj", line 1, in <module>
09:37:26 [2020-12-29T14:37:26.538Z]   File "__ref_L/Debug Test/Main.py_klqskswtvj", line 1, in <module>
09:37:26 [2020-12-29T14:37:26.538Z]   File "<...>", line 231, in trace_dispatch
09:37:26 [2020-12-29T14:37:26.538Z]   File "/usr/lib64/python2.7/bdb.py", line 49, in trace_dispatch
09:37:26 [2020-12-29T14:37:26.538Z]     return self.dispatch_line(frame)
09:37:26 [2020-12-29T14:37:26.538Z]   File "/usr/lib64/python2.7/bdb.py", line 67, in dispatch_line
09:37:26 [2020-12-29T14:37:26.538Z]     self.user_line(frame)
09:37:26 [2020-12-29T14:37:26.538Z]   File "<...>", line 241, in user_line
09:37:26 [2020-12-29T14:37:26.538Z]   File "<...>", line 296, in dispatch
09:37:26 [2020-12-29T14:37:26.538Z]   File "/home/jenkins/agent/workspace/ease.verify.core.target.2019-06/tests/org.eclipse.ease.lang.python.py4j.test/target/work/plugins/py4j-python_0.10.8.1-bnd-2odeag/src/py4j/java_gateway.py", line 1286, in __call__
09:37:26 [2020-12-29T14:37:26.538Z]     answer, self.gateway_client, self.target_id, self.name)
09:37:26 [2020-12-29T14:37:26.538Z]   File "/home/jenkins/agent/workspace/ease.verify.core.target.2019-06/tests/org.eclipse.ease.lang.python.py4j.test/target/work/plugins/py4j-python_0.10.8.1-bnd-2odeag/src/py4j/protocol.py", line 328, in get_return_value
09:37:26 [2020-12-29T14:37:26.538Z]     format(target_id, ".", name), value)
09:37:26 [2020-12-29T14:37:26.538Z] Py4JJavaError: An error occurred while calling o0.traceDispatch.
09:37:26 [2020-12-29T14:37:26.538Z] : org.eclipse.ease.ExitException: 
09:37:26 [2020-12-29T14:37:26.538Z] 	at org.eclipse.ease.debugging.AbstractEaseDebugger.handleEventsInSuspendedState(AbstractEaseDebugger.java:329)
09:37:26 [2020-12-29T14:37:26.539Z] 	at org.eclipse.ease.debugging.AbstractEaseDebugger.suspend(AbstractEaseDebugger.java:255)
09:37:26 [2020-12-29T14:37:26.539Z] 	at org.eclipse.ease.lang.python.py4j.internal.Py4jDebugger.suspend(Py4jDebugger.java:87)
09:37:26 [2020-12-29T14:37:26.539Z] 	at org.eclipse.ease.debugging.AbstractEaseDebugger.processLine(AbstractEaseDebugger.java:490)
09:37:26 [2020-12-29T14:37:26.539Z] 	at org.eclipse.ease.lang.python.debugger.PythonDebugger.traceDispatch(PythonDebugger.java:177)
09:37:26 [2020-12-29T14:37:26.539Z] 	at jdk.internal.reflect.GeneratedMethodAccessor18.invoke(Unknown Source)
09:37:26 [2020-12-29T14:37:26.539Z] 	at java.base/jdk.internal.reflect.DelegatingMethodAccessorImpl.invoke(DelegatingMethodAccessorImpl.java:43)
09:37:26 [2020-12-29T14:37:26.539Z] 	at java.base/java.lang.reflect.Method.invoke(Method.java:566)
09:37:26 [2020-12-29T14:37:26.539Z] 	at py4j.reflection.MethodInvoker.invoke(MethodInvoker.java:244)
09:37:26 [2020-12-29T14:37:26.539Z] 	at py4j.reflection.ReflectionEngine.invoke(ReflectionEngine.java:357)
09:37:26 [2020-12-29T14:37:26.539Z] 	at py4j.Gateway.invoke(Gateway.java:282)
09:37:26 [2020-12-29T14:37:26.539Z] 	at py4j.commands.AbstractCommand.invokeMethod(AbstractCommand.java:132)
09:37:26 [2020-12-29T14:37:26.539Z] 	at py4j.commands.CallCommand.execute(CallCommand.java:79)
09:37:26 [2020-12-29T14:37:26.539Z] 	at py4j.ClientServerConnection.sendCommand(ClientServerConnection.java:244)
09:37:26 [2020-12-29T14:37:26.539Z] 	at py4j.CallbackClient.sendCommand(CallbackClient.java:384)
09:37:26 [2020-12-29T14:37:26.539Z] 	at py4j.CallbackClient.sendCommand(CallbackClient.java:356)
09:37:26 [2020-12-29T14:37:26.539Z] 	at py4j.reflection.PythonProxyHandler.invoke(PythonProxyHandler.java:106)
09:37:26 [2020-12-29T14:37:26.539Z] 	at com.sun.proxy.$Proxy18.run(Unknown Source)
09:37:26 [2020-12-29T14:37:26.539Z] 	at org.eclipse.ease.lang.python.py4j.internal.Py4jDebugger.execute(Py4jDebugger.java:106)
09:37:26 [2020-12-29T14:37:26.539Z] 	at org.eclipse.ease.lang.python.py4j.internal.Py4jDebuggerEngine.internalExecute(Py4jDebuggerEngine.java:85)
09:37:26 [2020-12-29T14:37:26.539Z] 	at org.eclipse.ease.lang.python.py4j.internal.Py4jScriptEngine.execute(Py4jScriptEngine.java:226)
09:37:26 [2020-12-29T14:37:26.539Z] 	at org.eclipse.ease.AbstractScriptEngine.inject(AbstractScriptEngine.java:224)
09:37:26 [2020-12-29T14:37:26.539Z] 	at org.eclipse.ease.AbstractScriptEngine.run(AbstractScriptEngine.java:274)
09:37:26 [2020-12-29T14:37:26.539Z] 	at org.eclipse.core.internal.jobs.Worker.run(Worker.java:63)
09:37:26 [2020-12-29T14:37:26.539Z] 
09:37:26 [2020-12-29T14:37:26.539Z] 
09:37:26 [2020-12-29T14:37:26.539Z] 	at py4j.Protocol.getReturnValue(Protocol.java:476)
09:37:26 [2020-12-29T14:37:26.539Z] 	at py4j.reflection.PythonProxyHandler.invoke(PythonProxyHandler.java:108)
09:37:26 [2020-12-29T14:37:26.539Z] 	at com.sun.proxy.$Proxy18.run(Unknown Source)
09:37:26 [2020-12-29T14:37:26.539Z] 	at org.eclipse.ease.lang.python.py4j.internal.Py4jDebugger.execute(Py4jDebugger.java:106)
09:37:26 [2020-12-29T14:37:26.539Z] 	at org.eclipse.ease.lang.python.py4j.internal.Py4jDebuggerEngine.internalExecute(Py4jDebuggerEngine.java:85)
09:37:26 [2020-12-29T14:37:26.539Z] 	at org.eclipse.ease.lang.python.py4j.internal.Py4jScriptEngine.execute(Py4jScriptEngine.java:226)
09:37:26 [2020-12-29T14:37:26.539Z] 	at org.eclipse.ease.AbstractScriptEngine.inject(AbstractScriptEngine.java:224)
09:37:26 [2020-12-29T14:37:26.539Z] 	at org.eclipse.ease.AbstractScriptEngine.run(AbstractScriptEngine.java:274)
09:37:26 [2020-12-29T14:37:26.539Z] 	at org.eclipse.core.internal.jobs.Worker.run(Worker.java:63)
09:37:26 [2020-12-29T14:37:26.794Z] Start of script
09:37:26 [2020-12-29T14:37:26.794Z] include file start
09:37:26 [2020-12-29T14:37:26.794Z] include file processed
09:37:27 [2020-12-29T14:37:27.050Z] Result of testMethod = 5
09:37:27 [2020-12-29T14:37:27.050Z] End of script
09:37:27 [2020-12-29T14:37:27.050Z] Start of script
09:37:27 [2020-12-29T14:37:27.050Z] include file start
09:37:27 [2020-12-29T14:37:27.050Z] include file processed
09:37:27 [2020-12-29T14:37:27.050Z] Result of testMethod = 5
09:37:27 [2020-12-29T14:37:27.050Z] End of script
09:37:27 [2020-12-29T14:37:27.306Z] Start of script
09:37:27 [2020-12-29T14:37:27.306Z] include file start
09:37:27 [2020-12-29T14:37:27.306Z] include file processed
09:37:27 [2020-12-29T14:37:27.562Z] Result of testMethod = 5
09:37:27 [2020-12-29T14:37:27.562Z] End of script
09:37:27 [2020-12-29T14:37:27.562Z] Start of script
09:37:27 [2020-12-29T14:37:27.562Z] include file start
09:37:27 [2020-12-29T14:37:27.562Z] include file processed
09:37:27 [2020-12-29T14:37:27.562Z] Result of testMethod = 5
09:37:27 [2020-12-29T14:37:27.562Z] End of script
09:37:27 [2020-12-29T14:37:27.817Z] Start of script
09:37:27 [2020-12-29T14:37:27.817Z] include file start
09:37:27 [2020-12-29T14:37:27.817Z] include file processed
09:37:27 [2020-12-29T14:37:27.817Z] Result of testMethod = 5
09:37:27 [2020-12-29T14:37:27.817Z] End of script
09:37:28 [2020-12-29T14:37:28.072Z] Start of script
09:37:28 [2020-12-29T14:37:28.072Z] include file start
09:37:28 [2020-12-29T14:37:28.072Z] include file processed
09:37:28 [2020-12-29T14:37:28.072Z] py4j.Py4JException: An exception was raised by the Python Proxy. Return Message: Traceback (most recent call last):
09:37:28 [2020-12-29T14:37:28.072Z]   File "/home/jenkins/agent/workspace/ease.verify.core.target.2019-06/tests/org.eclipse.ease.lang.python.py4j.test/target/work/plugins/py4j-python_0.10.8.1-bnd-2odeag/src/py4j/clientserver.py", line 581, in _call_proxy
09:37:28 [2020-12-29T14:37:28.072Z]     return_value = getattr(self.pool[obj_id], method)(*params)
09:37:28 [2020-12-29T14:37:28.072Z]   File "<...>", line 424, in run
09:37:28 [2020-12-29T14:37:28.072Z]   File "/usr/lib64/python2.7/bdb.py", line 400, in run
09:37:28 [2020-12-29T14:37:28.072Z]     exec cmd in globals, locals
09:37:28 [2020-12-29T14:37:28.072Z]   File "__ref_L/Debug Test/Main.py_bsklnruwvb", line 21, in <module>
09:37:28 [2020-12-29T14:37:28.072Z]   File "__ref_L/Debug Test/Main.py_bsklnruwvb", line 18, in testMethod
09:37:28 [2020-12-29T14:37:28.072Z]   File "__ref_L/Debug Test/Main.py_bsklnruwvb", line 18, in testMethod
09:37:28 [2020-12-29T14:37:28.072Z]   File "<...>", line 231, in trace_dispatch
09:37:28 [2020-12-29T14:37:28.072Z]   File "/usr/lib64/python2.7/bdb.py", line 49, in trace_dispatch
09:37:28 [2020-12-29T14:37:28.072Z]     return self.dispatch_line(frame)
09:37:28 [2020-12-29T14:37:28.072Z]   File "/usr/lib64/python2.7/bdb.py", line 67, in dispatch_line
09:37:28 [2020-12-29T14:37:28.072Z]     self.user_line(frame)
09:37:28 [2020-12-29T14:37:28.072Z]   File "<...>", line 241, in user_line
09:37:28 [2020-12-29T14:37:28.072Z]   File "<...>", line 296, in dispatch
09:37:28 [2020-12-29T14:37:28.072Z]   File "/home/jenkins/agent/workspace/ease.verify.core.target.2019-06/tests/org.eclipse.ease.lang.python.py4j.test/target/work/plugins/py4j-python_0.10.8.1-bnd-2odeag/src/py4j/java_gateway.py", line 1286, in __call__
09:37:28 [2020-12-29T14:37:28.072Z]     answer, self.gateway_client, self.target_id, self.name)
09:37:28 [2020-12-29T14:37:28.073Z]   File "/home/jenkins/agent/workspace/ease.verify.core.target.2019-06/tests/org.eclipse.ease.lang.python.py4j.test/target/work/plugins/py4j-python_0.10.8.1-bnd-2odeag/src/py4j/protocol.py", line 328, in get_return_value
09:37:28 [2020-12-29T14:37:28.073Z]     format(target_id, ".", name), value)
09:37:28 [2020-12-29T14:37:28.073Z] Py4JJavaError: An error occurred while calling o0.traceDispatch.
09:37:28 [2020-12-29T14:37:28.073Z] : org.eclipse.ease.ExitException: 
09:37:28 [2020-12-29T14:37:28.073Z] 	at org.eclipse.ease.debugging.AbstractEaseDebugger.handleEventsInSuspendedState(AbstractEaseDebugger.java:329)
09:37:28 [2020-12-29T14:37:28.073Z] 	at org.eclipse.ease.debugging.AbstractEaseDebugger.suspend(AbstractEaseDebugger.java:255)
09:37:28 [2020-12-29T14:37:28.073Z] 	at org.eclipse.ease.lang.python.py4j.internal.Py4jDebugger.suspend(Py4jDebugger.java:87)
09:37:28 [2020-12-29T14:37:28.073Z] 	at org.eclipse.ease.debugging.AbstractEaseDebugger.processLine(AbstractEaseDebugger.java:490)
09:37:28 [2020-12-29T14:37:28.073Z] 	at org.eclipse.ease.lang.python.debugger.PythonDebugger.traceDispatch(PythonDebugger.java:177)
09:37:28 [2020-12-29T14:37:28.073Z] 	at jdk.internal.reflect.GeneratedMethodAccessor18.invoke(Unknown Source)
09:37:28 [2020-12-29T14:37:28.073Z] 	at java.base/jdk.internal.reflect.DelegatingMethodAccessorImpl.invoke(DelegatingMethodAccessorImpl.java:43)
09:37:28 [2020-12-29T14:37:28.073Z] 	at java.base/java.lang.reflect.Method.invoke(Method.java:566)
09:37:28 [2020-12-29T14:37:28.073Z] 	at py4j.reflection.MethodInvoker.invoke(MethodInvoker.java:244)
09:37:28 [2020-12-29T14:37:28.073Z] 	at py4j.reflection.ReflectionEngine.invoke(ReflectionEngine.java:357)
09:37:28 [2020-12-29T14:37:28.073Z] 	at py4j.Gateway.invoke(Gateway.java:282)
09:37:28 [2020-12-29T14:37:28.073Z] 	at py4j.commands.AbstractCommand.invokeMethod(AbstractCommand.java:132)
09:37:28 [2020-12-29T14:37:28.073Z] 	at py4j.commands.CallCommand.execute(CallCommand.java:79)
09:37:28 [2020-12-29T14:37:28.073Z] 	at py4j.ClientServerConnection.sendCommand(ClientServerConnection.java:244)
09:37:28 [2020-12-29T14:37:28.073Z] 	at py4j.CallbackClient.sendCommand(CallbackClient.java:384)
09:37:28 [2020-12-29T14:37:28.073Z] 	at py4j.CallbackClient.sendCommand(CallbackClient.java:356)
09:37:28 [2020-12-29T14:37:28.073Z] 	at py4j.reflection.PythonProxyHandler.invoke(PythonProxyHandler.java:106)
09:37:28 [2020-12-29T14:37:28.073Z] 	at com.sun.proxy.$Proxy18.run(Unknown Source)
09:37:28 [2020-12-29T14:37:28.073Z] 	at org.eclipse.ease.lang.python.py4j.internal.Py4jDebugger.execute(Py4jDebugger.java:106)
09:37:28 [2020-12-29T14:37:28.073Z] 	at org.eclipse.ease.lang.python.py4j.internal.Py4jDebuggerEngine.internalExecute(Py4jDebuggerEngine.java:85)
09:37:28 [2020-12-29T14:37:28.073Z] 	at org.eclipse.ease.lang.python.py4j.internal.Py4jScriptEngine.execute(Py4jScriptEngine.java:226)
09:37:28 [2020-12-29T14:37:28.073Z] 	at org.eclipse.ease.AbstractScriptEngine.inject(AbstractScriptEngine.java:224)
09:37:28 [2020-12-29T14:37:28.073Z] 	at org.eclipse.ease.AbstractScriptEngine.run(AbstractScriptEngine.java:274)
09:37:28 [2020-12-29T14:37:28.073Z] 	at org.eclipse.core.internal.jobs.Worker.run(Worker.java:63)
09:37:28 [2020-12-29T14:37:28.073Z] 
09:37:28 [2020-12-29T14:37:28.073Z] 
09:37:28 [2020-12-29T14:37:28.073Z] 	at py4j.Protocol.getReturnValue(Protocol.java:476)
09:37:28 [2020-12-29T14:37:28.073Z] 	at py4j.reflection.PythonProxyHandler.invoke(PythonProxyHandler.java:108)
09:37:28 [2020-12-29T14:37:28.073Z] 	at com.sun.proxy.$Proxy18.run(Unknown Source)
09:37:28 [2020-12-29T14:37:28.073Z] 	at org.eclipse.ease.lang.python.py4j.internal.Py4jDebugger.execute(Py4jDebugger.java:106)
09:37:28 [2020-12-29T14:37:28.073Z] 	at org.eclipse.ease.lang.python.py4j.internal.Py4jDebuggerEngine.internalExecute(Py4jDebuggerEngine.java:85)
09:37:28 [2020-12-29T14:37:28.073Z] 	at org.eclipse.ease.lang.python.py4j.internal.Py4jScriptEngine.execute(Py4jScriptEngine.java:226)
09:37:28 [2020-12-29T14:37:28.073Z] 	at org.eclipse.ease.AbstractScriptEngine.inject(AbstractScriptEngine.java:224)
09:37:28 [2020-12-29T14:37:28.073Z] 	at org.eclipse.ease.AbstractScriptEngine.run(AbstractScriptEngine.java:274)
09:37:28 [2020-12-29T14:37:28.073Z] 	at org.eclipse.core.internal.jobs.Worker.run(Worker.java:63)
09:37:28 [2020-12-29T14:37:28.328Z] Start of script
09:37:28 [2020-12-29T14:37:28.328Z] include file start
09:37:28 [2020-12-29T14:37:28.328Z] include file processed
09:37:28 [2020-12-29T14:37:28.328Z] Result of testMethod = 5
09:37:28 [2020-12-29T14:37:28.584Z] py4j.Py4JException: An exception was raised by the Python Proxy. Return Message: Traceback (most recent call last):
09:37:28 [2020-12-29T14:37:28.584Z]   File "/home/jenkins/agent/workspace/ease.verify.core.target.2019-06/tests/org.eclipse.ease.lang.python.py4j.test/target/work/plugins/py4j-python_0.10.8.1-bnd-2odeag/src/py4j/clientserver.py", line 581, in _call_proxy
09:37:28 [2020-12-29T14:37:28.584Z]     return_value = getattr(self.pool[obj_id], method)(*params)
09:37:28 [2020-12-29T14:37:28.584Z]   File "<...>", line 424, in run
09:37:28 [2020-12-29T14:37:28.584Z]   File "/usr/lib64/python2.7/bdb.py", line 400, in run
09:37:28 [2020-12-29T14:37:28.584Z]     exec cmd in globals, locals
09:37:28 [2020-12-29T14:37:28.584Z]   File "__ref_L/Debug Test/Main.py_idmlxlkggi", line 23, in <module>
09:37:28 [2020-12-29T14:37:28.584Z]   File "__ref_L/Debug Test/Main.py_idmlxlkggi", line 23, in <module>
09:37:28 [2020-12-29T14:37:28.584Z]   File "<...>", line 231, in trace_dispatch
09:37:28 [2020-12-29T14:37:28.584Z]   File "/usr/lib64/python2.7/bdb.py", line 49, in trace_dispatch
09:37:28 [2020-12-29T14:37:28.584Z]     return self.dispatch_line(frame)
09:37:28 [2020-12-29T14:37:28.584Z]   File "/usr/lib64/python2.7/bdb.py", line 67, in dispatch_line
09:37:28 [2020-12-29T14:37:28.584Z]     self.user_line(frame)
09:37:28 [2020-12-29T14:37:28.584Z]   File "<...>", line 241, in user_line
09:37:28 [2020-12-29T14:37:28.584Z]   File "<...>", line 296, in dispatch
09:37:28 [2020-12-29T14:37:28.584Z]   File "/home/jenkins/agent/workspace/ease.verify.core.target.2019-06/tests/org.eclipse.ease.lang.python.py4j.test/target/work/plugins/py4j-python_0.10.8.1-bnd-2odeag/src/py4j/java_gateway.py", line 1286, in __call__
09:37:28 [2020-12-29T14:37:28.584Z]     answer, self.gateway_client, self.target_id, self.name)
09:37:28 [2020-12-29T14:37:28.584Z]   File "/home/jenkins/agent/workspace/ease.verify.core.target.2019-06/tests/org.eclipse.ease.lang.python.py4j.test/target/work/plugins/py4j-python_0.10.8.1-bnd-2odeag/src/py4j/protocol.py", line 328, in get_return_value
09:37:28 [2020-12-29T14:37:28.584Z]     format(target_id, ".", name), value)
09:37:28 [2020-12-29T14:37:28.584Z] Py4JJavaError: An error occurred while calling o0.traceDispatch.
09:37:28 [2020-12-29T14:37:28.584Z] : org.eclipse.ease.ExitException: 
09:37:28 [2020-12-29T14:37:28.584Z] 	at org.eclipse.ease.debugging.AbstractEaseDebugger.handleEventsInSuspendedState(AbstractEaseDebugger.java:329)
09:37:28 [2020-12-29T14:37:28.584Z] 	at org.eclipse.ease.debugging.AbstractEaseDebugger.suspend(AbstractEaseDebugger.java:255)
09:37:28 [2020-12-29T14:37:28.584Z] 	at org.eclipse.ease.lang.python.py4j.internal.Py4jDebugger.suspend(Py4jDebugger.java:87)
09:37:28 [2020-12-29T14:37:28.584Z] 	at org.eclipse.ease.debugging.AbstractEaseDebugger.processLine(AbstractEaseDebugger.java:490)
09:37:28 [2020-12-29T14:37:28.584Z] 	at org.eclipse.ease.lang.python.debugger.PythonDebugger.traceDispatch(PythonDebugger.java:177)
09:37:28 [2020-12-29T14:37:28.584Z] 	at jdk.internal.reflect.GeneratedMethodAccessor18.invoke(Unknown Source)
09:37:28 [2020-12-29T14:37:28.584Z] 	at java.base/jdk.internal.reflect.DelegatingMethodAccessorImpl.invoke(DelegatingMethodAccessorImpl.java:43)
09:37:28 [2020-12-29T14:37:28.584Z] 	at java.base/java.lang.reflect.Method.invoke(Method.java:566)
09:37:28 [2020-12-29T14:37:28.584Z] 	at py4j.reflection.MethodInvoker.invoke(MethodInvoker.java:244)
09:37:28 [2020-12-29T14:37:28.584Z] 	at py4j.reflection.ReflectionEngine.invoke(ReflectionEngine.java:357)
09:37:28 [2020-12-29T14:37:28.584Z] 	at py4j.Gateway.invoke(Gateway.java:282)
09:37:28 [2020-12-29T14:37:28.584Z] 	at py4j.commands.AbstractCommand.invokeMethod(AbstractCommand.java:132)
09:37:28 [2020-12-29T14:37:28.584Z] 	at py4j.commands.CallCommand.execute(CallCommand.java:79)
09:37:28 [2020-12-29T14:37:28.584Z] 	at py4j.ClientServerConnection.sendCommand(ClientServerConnection.java:244)
09:37:28 [2020-12-29T14:37:28.584Z] 	at py4j.CallbackClient.sendCommand(CallbackClient.java:384)
09:37:28 [2020-12-29T14:37:28.584Z] 	at py4j.CallbackClient.sendCommand(CallbackClient.java:356)
09:37:28 [2020-12-29T14:37:28.584Z] 	at py4j.reflection.PythonProxyHandler.invoke(PythonProxyHandler.java:106)
09:37:28 [2020-12-29T14:37:28.584Z] 	at com.sun.proxy.$Proxy18.run(Unknown Source)
09:37:28 [2020-12-29T14:37:28.584Z] 	at org.eclipse.ease.lang.python.py4j.internal.Py4jDebugger.execute(Py4jDebugger.java:106)
09:37:28 [2020-12-29T14:37:28.584Z] 	at org.eclipse.ease.lang.python.py4j.internal.Py4jDebuggerEngine.internalExecute(Py4jDebuggerEngine.java:85)
09:37:28 [2020-12-29T14:37:28.584Z] 	at org.eclipse.ease.lang.python.py4j.internal.Py4jScriptEngine.execute(Py4jScriptEngine.java:226)
09:37:28 [2020-12-29T14:37:28.584Z] 	at org.eclipse.ease.AbstractScriptEngine.inject(AbstractScriptEngine.java:224)
09:37:28 [2020-12-29T14:37:28.584Z] 	at org.eclipse.ease.AbstractScriptEngine.run(AbstractScriptEngine.java:274)
09:37:28 [2020-12-29T14:37:28.584Z] 	at org.eclipse.core.internal.jobs.Worker.run(Worker.java:63)
09:37:28 [2020-12-29T14:37:28.584Z] 
09:37:28 [2020-12-29T14:37:28.584Z] 
09:37:28 [2020-12-29T14:37:28.584Z] 	at py4j.Protocol.getReturnValue(Protocol.java:476)
09:37:28 [2020-12-29T14:37:28.584Z] 	at py4j.reflection.PythonProxyHandler.invoke(PythonProxyHandler.java:108)
09:37:28 [2020-12-29T14:37:28.584Z] 	at com.sun.proxy.$Proxy18.run(Unknown Source)
09:37:28 [2020-12-29T14:37:28.584Z] 	at org.eclipse.ease.lang.python.py4j.internal.Py4jDebugger.execute(Py4jDebugger.java:106)
09:37:28 [2020-12-29T14:37:28.585Z] 	at org.eclipse.ease.lang.python.py4j.internal.Py4jDebuggerEngine.internalExecute(Py4jDebuggerEngine.java:85)
09:37:28 [2020-12-29T14:37:28.585Z] 	at org.eclipse.ease.lang.python.py4j.internal.Py4jScriptEngine.execute(Py4jScriptEngine.java:226)
09:37:28 [2020-12-29T14:37:28.585Z] 	at org.eclipse.ease.AbstractScriptEngine.inject(AbstractScriptEngine.java:224)
09:37:28 [2020-12-29T14:37:28.585Z] 	at org.eclipse.ease.AbstractScriptEngine.run(AbstractScriptEngine.java:274)
09:37:28 [2020-12-29T14:37:28.585Z] 	at org.eclipse.core.internal.jobs.Worker.run(Worker.java:63)
09:37:28 [2020-12-29T14:37:28.585Z] Start of script
09:37:28 [2020-12-29T14:37:28.585Z] include file start
09:37:28 [2020-12-29T14:37:28.585Z] include file processed
09:37:28 [2020-12-29T14:37:28.585Z] Result of testMethod = 5
09:37:28 [2020-12-29T14:37:28.840Z] End of script
09:37:29 [2020-12-29T14:37:29.095Z] Start of script
09:37:29 [2020-12-29T14:37:29.095Z] include file start
09:37:29 [2020-12-29T14:37:29.095Z] include file processed
09:37:29 [2020-12-29T14:37:29.095Z] Result of testMethod = 5
09:37:29 [2020-12-29T14:37:29.095Z] End of script
09:37:29 [2020-12-29T14:37:29.351Z] Start of script
09:37:29 [2020-12-29T14:37:29.351Z] include file start
09:37:29 [2020-12-29T14:37:29.351Z] include file processed
09:37:29 [2020-12-29T14:37:29.606Z] Result of testMethod = 5
09:37:29 [2020-12-29T14:37:29.606Z] End of script
09:37:29 [2020-12-29T14:37:29.606Z] Start of script
09:37:29 [2020-12-29T14:37:29.606Z] include file start
09:37:29 [2020-12-29T14:37:29.606Z] include file processed
09:37:29 [2020-12-29T14:37:29.606Z] Result of testMethod = 5
09:37:29 [2020-12-29T14:37:29.606Z] End of script
09:37:29 [2020-12-29T14:37:29.861Z] Start of script
09:37:29 [2020-12-29T14:37:29.861Z] include file start
09:37:29 [2020-12-29T14:37:29.861Z] include file processed
09:37:29 [2020-12-29T14:37:29.861Z] Result of testMethod = 5
09:37:30 [2020-12-29T14:37:30.117Z] py4j.Py4JException: An exception was raised by the Python Proxy. Return Message: Traceback (most recent call last):
09:37:30 [2020-12-29T14:37:30.117Z]   File "/home/jenkins/agent/workspace/ease.verify.core.target.2019-06/tests/org.eclipse.ease.lang.python.py4j.test/target/work/plugins/py4j-python_0.10.8.1-bnd-2odeag/src/py4j/clientserver.py", line 581, in _call_proxy
09:37:30 [2020-12-29T14:37:30.117Z]     return_value = getattr(self.pool[obj_id], method)(*params)
09:37:30 [2020-12-29T14:37:30.117Z]   File "<...>", line 424, in run
09:37:30 [2020-12-29T14:37:30.117Z]   File "/usr/lib64/python2.7/bdb.py", line 400, in run
09:37:30 [2020-12-29T14:37:30.117Z]     exec cmd in globals, locals
09:37:30 [2020-12-29T14:37:30.117Z]   File "__ref_L/Debug Test/Main.py_jblnykbqni", line 23, in <module>
09:37:30 [2020-12-29T14:37:30.117Z]   File "__ref_L/Debug Test/Main.py_jblnykbqni", line 23, in <module>
09:37:30 [2020-12-29T14:37:30.117Z]   File "<...>", line 231, in trace_dispatch
09:37:30 [2020-12-29T14:37:30.117Z]   File "/usr/lib64/python2.7/bdb.py", line 49, in trace_dispatch
09:37:30 [2020-12-29T14:37:30.117Z]     return self.dispatch_line(frame)
09:37:30 [2020-12-29T14:37:30.117Z]   File "/usr/lib64/python2.7/bdb.py", line 67, in dispatch_line
09:37:30 [2020-12-29T14:37:30.117Z]     self.user_line(frame)
09:37:30 [2020-12-29T14:37:30.117Z]   File "<...>", line 241, in user_line
09:37:30 [2020-12-29T14:37:30.117Z]   File "<...>", line 296, in dispatch
09:37:30 [2020-12-29T14:37:30.117Z]   File "/home/jenkins/agent/workspace/ease.verify.core.target.2019-06/tests/org.eclipse.ease.lang.python.py4j.test/target/work/plugins/py4j-python_0.10.8.1-bnd-2odeag/src/py4j/java_gateway.py", line 1286, in __call__
09:37:30 [2020-12-29T14:37:30.117Z]     answer, self.gateway_client, self.target_id, self.name)
09:37:30 [2020-12-29T14:37:30.117Z]   File "/home/jenkins/agent/workspace/ease.verify.core.target.2019-06/tests/org.eclipse.ease.lang.python.py4j.test/target/work/plugins/py4j-python_0.10.8.1-bnd-2odeag/src/py4j/protocol.py", line 328, in get_return_value
09:37:30 [2020-12-29T14:37:30.117Z]     format(target_id, ".", name), value)
09:37:30 [2020-12-29T14:37:30.117Z] Py4JJavaError: An error occurred while calling o0.traceDispatch.
09:37:30 [2020-12-29T14:37:30.117Z] : org.eclipse.ease.ExitException: 
09:37:30 [2020-12-29T14:37:30.117Z] 	at org.eclipse.ease.debugging.AbstractEaseDebugger.handleEventsInSuspendedState(AbstractEaseDebugger.java:329)
09:37:30 [2020-12-29T14:37:30.117Z] 	at org.eclipse.ease.debugging.AbstractEaseDebugger.suspend(AbstractEaseDebugger.java:255)
09:37:30 [2020-12-29T14:37:30.117Z] 	at org.eclipse.ease.lang.python.py4j.internal.Py4jDebugger.suspend(Py4jDebugger.java:87)
09:37:30 [2020-12-29T14:37:30.117Z] 	at org.eclipse.ease.debugging.AbstractEaseDebugger.processLine(AbstractEaseDebugger.java:490)
09:37:30 [2020-12-29T14:37:30.117Z] 	at org.eclipse.ease.lang.python.debugger.PythonDebugger.traceDispatch(PythonDebugger.java:177)
09:37:30 [2020-12-29T14:37:30.117Z] 	at jdk.internal.reflect.GeneratedMethodAccessor18.invoke(Unknown Source)
09:37:30 [2020-12-29T14:37:30.117Z] 	at java.base/jdk.internal.reflect.DelegatingMethodAccessorImpl.invoke(DelegatingMethodAccessorImpl.java:43)
09:37:30 [2020-12-29T14:37:30.117Z] 	at java.base/java.lang.reflect.Method.invoke(Method.java:566)
09:37:30 [2020-12-29T14:37:30.117Z] 	at py4j.reflection.MethodInvoker.invoke(MethodInvoker.java:244)
09:37:30 [2020-12-29T14:37:30.117Z] 	at py4j.reflection.ReflectionEngine.invoke(ReflectionEngine.java:357)
09:37:30 [2020-12-29T14:37:30.117Z] 	at py4j.Gateway.invoke(Gateway.java:282)
09:37:30 [2020-12-29T14:37:30.117Z] 	at py4j.commands.AbstractCommand.invokeMethod(AbstractCommand.java:132)
09:37:30 [2020-12-29T14:37:30.117Z] 	at py4j.commands.CallCommand.execute(CallCommand.java:79)
09:37:30 [2020-12-29T14:37:30.117Z] 	at py4j.ClientServerConnection.sendCommand(ClientServerConnection.java:244)
09:37:30 [2020-12-29T14:37:30.117Z] 	at py4j.CallbackClient.sendCommand(CallbackClient.java:384)
09:37:30 [2020-12-29T14:37:30.117Z] 	at py4j.CallbackClient.sendCommand(CallbackClient.java:356)
09:37:30 [2020-12-29T14:37:30.117Z] 	at py4j.reflection.PythonProxyHandler.invoke(PythonProxyHandler.java:106)
09:37:30 [2020-12-29T14:37:30.117Z] 	at com.sun.proxy.$Proxy18.run(Unknown Source)
09:37:30 [2020-12-29T14:37:30.117Z] 	at org.eclipse.ease.lang.python.py4j.internal.Py4jDebugger.execute(Py4jDebugger.java:106)
09:37:30 [2020-12-29T14:37:30.117Z] 	at org.eclipse.ease.lang.python.py4j.internal.Py4jDebuggerEngine.internalExecute(Py4jDebuggerEngine.java:85)
09:37:30 [2020-12-29T14:37:30.117Z] 	at org.eclipse.ease.lang.python.py4j.internal.Py4jScriptEngine.execute(Py4jScriptEngine.java:226)
09:37:30 [2020-12-29T14:37:30.117Z] 	at org.eclipse.ease.AbstractScriptEngine.inject(AbstractScriptEngine.java:224)
09:37:30 [2020-12-29T14:37:30.117Z] 	at org.eclipse.ease.AbstractScriptEngine.run(AbstractScriptEngine.java:274)
09:37:30 [2020-12-29T14:37:30.117Z] 	at org.eclipse.core.internal.jobs.Worker.run(Worker.java:63)
09:37:30 [2020-12-29T14:37:30.117Z] 
09:37:30 [2020-12-29T14:37:30.117Z] 
09:37:30 [2020-12-29T14:37:30.117Z] 	at py4j.Protocol.getReturnValue(Protocol.java:476)
09:37:30 [2020-12-29T14:37:30.117Z] 	at py4j.reflection.PythonProxyHandler.invoke(PythonProxyHandler.java:108)
09:37:30 [2020-12-29T14:37:30.117Z] 	at com.sun.proxy.$Proxy18.run(Unknown Source)
09:37:30 [2020-12-29T14:37:30.117Z] 	at org.eclipse.ease.lang.python.py4j.internal.Py4jDebugger.execute(Py4jDebugger.java:106)
09:37:30 [2020-12-29T14:37:30.117Z] 	at org.eclipse.ease.lang.python.py4j.internal.Py4jDebuggerEngine.internalExecute(Py4jDebuggerEngine.java:85)
09:37:30 [2020-12-29T14:37:30.117Z] 	at org.eclipse.ease.lang.python.py4j.internal.Py4jScriptEngine.execute(Py4jScriptEngine.java:226)
09:37:30 [2020-12-29T14:37:30.118Z] 	at org.eclipse.ease.AbstractScriptEngine.inject(AbstractScriptEngine.java:224)
09:37:30 [2020-12-29T14:37:30.118Z] 	at org.eclipse.ease.AbstractScriptEngine.run(AbstractScriptEngine.java:274)
09:37:30 [2020-12-29T14:37:30.118Z] 	at org.eclipse.core.internal.jobs.Worker.run(Worker.java:63)
09:37:30 [2020-12-29T14:37:30.373Z] Start of script
09:37:30 [2020-12-29T14:37:30.373Z] include file start
09:37:30 [2020-12-29T14:37:30.373Z] include file processed
09:37:30 [2020-12-29T14:37:30.373Z] Result of testMethod = 5
09:37:30 [2020-12-29T14:37:30.373Z] End of script
09:37:30 [2020-12-29T14:37:30.629Z] py4j.Py4JException: An exception was raised by the Python Proxy. Return Message: Traceback (most recent call last):
09:37:30 [2020-12-29T14:37:30.629Z]   File "/home/jenkins/agent/workspace/ease.verify.core.target.2019-06/tests/org.eclipse.ease.lang.python.py4j.test/target/work/plugins/py4j-python_0.10.8.1-bnd-2odeag/src/py4j/clientserver.py", line 581, in _call_proxy
09:37:30 [2020-12-29T14:37:30.629Z]     return_value = getattr(self.pool[obj_id], method)(*params)
09:37:30 [2020-12-29T14:37:30.629Z]   File "<...>", line 424, in run
09:37:30 [2020-12-29T14:37:30.629Z]   File "/usr/lib64/python2.7/bdb.py", line 400, in run
09:37:30 [2020-12-29T14:37:30.629Z]     exec cmd in globals, locals
09:37:30 [2020-12-29T14:37:30.629Z]   File "__ref_L/Debug Test/Main.py_gyjqanpznt", line 1, in <module>
09:37:30 [2020-12-29T14:37:30.629Z]   File "__ref_L/Debug Test/Main.py_gyjqanpznt", line 1, in <module>
09:37:30 [2020-12-29T14:37:30.629Z]   File "<...>", line 231, in trace_dispatch
09:37:30 [2020-12-29T14:37:30.629Z]   File "/usr/lib64/python2.7/bdb.py", line 49, in trace_dispatch
09:37:30 [2020-12-29T14:37:30.629Z]     return self.dispatch_line(frame)
09:37:30 [2020-12-29T14:37:30.629Z]   File "/usr/lib64/python2.7/bdb.py", line 67, in dispatch_line
09:37:30 [2020-12-29T14:37:30.629Z]     self.user_line(frame)
09:37:30 [2020-12-29T14:37:30.629Z]   File "<...>", line 241, in user_line
09:37:30 [2020-12-29T14:37:30.629Z]   File "<...>", line 296, in dispatch
09:37:30 [2020-12-29T14:37:30.629Z]   File "/home/jenkins/agent/workspace/ease.verify.core.target.2019-06/tests/org.eclipse.ease.lang.python.py4j.test/target/work/plugins/py4j-python_0.10.8.1-bnd-2odeag/src/py4j/java_gateway.py", line 1286, in __call__
09:37:30 [2020-12-29T14:37:30.629Z]     answer, self.gateway_client, self.target_id, self.name)
09:37:30 [2020-12-29T14:37:30.629Z]   File "/home/jenkins/agent/workspace/ease.verify.core.target.2019-06/tests/org.eclipse.ease.lang.python.py4j.test/target/work/plugins/py4j-python_0.10.8.1-bnd-2odeag/src/py4j/protocol.py", line 328, in get_return_value
09:37:30 [2020-12-29T14:37:30.629Z]     format(target_id, ".", name), value)
09:37:30 [2020-12-29T14:37:30.629Z] Py4JJavaError: An error occurred while calling o0.traceDispatch.
09:37:30 [2020-12-29T14:37:30.629Z] : org.eclipse.ease.ExitException: 
09:37:30 [2020-12-29T14:37:30.629Z] 	at org.eclipse.ease.debugging.AbstractEaseDebugger.handleEventsInSuspendedState(AbstractEaseDebugger.java:329)
09:37:30 [2020-12-29T14:37:30.629Z] 	at org.eclipse.ease.debugging.AbstractEaseDebugger.suspend(AbstractEaseDebugger.java:255)
09:37:30 [2020-12-29T14:37:30.629Z] 	at org.eclipse.ease.lang.python.py4j.internal.Py4jDebugger.suspend(Py4jDebugger.java:87)
09:37:30 [2020-12-29T14:37:30.629Z] 	at org.eclipse.ease.debugging.AbstractEaseDebugger.processLine(AbstractEaseDebugger.java:490)
09:37:30 [2020-12-29T14:37:30.629Z] 	at org.eclipse.ease.lang.python.debugger.PythonDebugger.traceDispatch(PythonDebugger.java:177)
09:37:30 [2020-12-29T14:37:30.629Z] 	at jdk.internal.reflect.GeneratedMethodAccessor18.invoke(Unknown Source)
09:37:30 [2020-12-29T14:37:30.629Z] 	at java.base/jdk.internal.reflect.DelegatingMethodAccessorImpl.invoke(DelegatingMethodAccessorImpl.java:43)
09:37:30 [2020-12-29T14:37:30.630Z] 	at java.base/java.lang.reflect.Method.invoke(Method.java:566)
09:37:30 [2020-12-29T14:37:30.630Z] 	at py4j.reflection.MethodInvoker.invoke(MethodInvoker.java:244)
09:37:30 [2020-12-29T14:37:30.630Z] 	at py4j.reflection.ReflectionEngine.invoke(ReflectionEngine.java:357)
09:37:30 [2020-12-29T14:37:30.630Z] 	at py4j.Gateway.invoke(Gateway.java:282)
09:37:30 [2020-12-29T14:37:30.630Z] 	at py4j.commands.AbstractCommand.invokeMethod(AbstractCommand.java:132)
09:37:30 [2020-12-29T14:37:30.630Z] 	at py4j.commands.CallCommand.execute(CallCommand.java:79)
09:37:30 [2020-12-29T14:37:30.630Z] 	at py4j.ClientServerConnection.sendCommand(ClientServerConnection.java:244)
09:37:30 [2020-12-29T14:37:30.630Z] 	at py4j.CallbackClient.sendCommand(CallbackClient.java:384)
09:37:30 [2020-12-29T14:37:30.630Z] 	at py4j.CallbackClient.sendCommand(CallbackClient.java:356)
09:37:30 [2020-12-29T14:37:30.630Z] 	at py4j.reflection.PythonProxyHandler.invoke(PythonProxyHandler.java:106)
09:37:30 [2020-12-29T14:37:30.630Z] 	at com.sun.proxy.$Proxy18.run(Unknown Source)
09:37:30 [2020-12-29T14:37:30.630Z] 	at org.eclipse.ease.lang.python.py4j.internal.Py4jDebugger.execute(Py4jDebugger.java:106)
09:37:30 [2020-12-29T14:37:30.630Z] 	at org.eclipse.ease.lang.python.py4j.internal.Py4jDebuggerEngine.internalExecute(Py4jDebuggerEngine.java:85)
09:37:30 [2020-12-29T14:37:30.630Z] 	at org.eclipse.ease.lang.python.py4j.internal.Py4jScriptEngine.execute(Py4jScriptEngine.java:226)
09:37:30 [2020-12-29T14:37:30.630Z] 	at org.eclipse.ease.AbstractScriptEngine.inject(AbstractScriptEngine.java:224)
09:37:30 [2020-12-29T14:37:30.630Z] 	at org.eclipse.ease.AbstractScriptEngine.run(AbstractScriptEngine.java:274)
09:37:30 [2020-12-29T14:37:30.630Z] 	at org.eclipse.core.internal.jobs.Worker.run(Worker.java:63)
09:37:30 [2020-12-29T14:37:30.630Z] 
09:37:30 [2020-12-29T14:37:30.630Z] 
09:37:30 [2020-12-29T14:37:30.630Z] 	at py4j.Protocol.getReturnValue(Protocol.java:476)
09:37:30 [2020-12-29T14:37:30.630Z] 	at py4j.reflection.PythonProxyHandler.invoke(PythonProxyHandler.java:108)
09:37:30 [2020-12-29T14:37:30.630Z] 	at com.sun.proxy.$Proxy18.run(Unknown Source)
09:37:30 [2020-12-29T14:37:30.630Z] 	at org.eclipse.ease.lang.python.py4j.internal.Py4jDebugger.execute(Py4jDebugger.java:106)
09:37:30 [2020-12-29T14:37:30.630Z] 	at org.eclipse.ease.lang.python.py4j.internal.Py4jDebuggerEngine.internalExecute(Py4jDebuggerEngine.java:85)
09:37:30 [2020-12-29T14:37:30.630Z] 	at org.eclipse.ease.lang.python.py4j.internal.Py4jScriptEngine.execute(Py4jScriptEngine.java:226)
09:37:30 [2020-12-29T14:37:30.630Z] 	at org.eclipse.ease.AbstractScriptEngine.inject(AbstractScriptEngine.java:224)
09:37:30 [2020-12-29T14:37:30.630Z] 	at org.eclipse.ease.AbstractScriptEngine.run(AbstractScriptEngine.java:274)
09:37:30 [2020-12-29T14:37:30.630Z] 	at org.eclipse.core.internal.jobs.Worker.run(Worker.java:63)
09:37:30 [2020-12-29T14:37:30.885Z] Start of script
09:37:30 [2020-12-29T14:37:30.885Z] include file start
09:37:30 [2020-12-29T14:37:30.885Z] include file processed
09:37:30 [2020-12-29T14:37:30.885Z] Result of testMethod = 5
09:37:30 [2020-12-29T14:37:30.885Z] End of script
09:37:31 [2020-12-29T14:37:31.142Z] Start of script
09:37:31 [2020-12-29T14:37:31.142Z] include file start
09:37:31 [2020-12-29T14:37:31.142Z] include file processed
09:37:31 [2020-12-29T14:37:31.142Z] Result of testMethod = 5
09:37:31 [2020-12-29T14:37:31.142Z] End of script
09:37:31 [2020-12-29T14:37:31.397Z] Start of script
09:37:31 [2020-12-29T14:37:31.397Z] include file start
09:37:31 [2020-12-29T14:37:31.397Z] include file processed
09:37:31 [2020-12-29T14:37:31.397Z] Result of testMethod = 5
09:37:31 [2020-12-29T14:37:31.653Z] End of script
09:37:31 [2020-12-29T14:37:31.653Z] Tests run: 42, Failures: 0, Errors: 0, Skipped: 4, Time elapsed: 11.569 s - in org.eclipse.ease.lang.python.py4j.Py4jDebugTest
09:37:31 [2020-12-29T14:37:31.653Z] resumeOnLastIncludeLine(org.eclipse.ease.lang.python.py4j.Py4jDebugTest) skipped
09:37:31 [2020-12-29T14:37:31.653Z] nativeArrayVariable(org.eclipse.ease.lang.python.py4j.Py4jDebugTest) skipped
09:37:31 [2020-12-29T14:37:31.653Z] stepIntoIncludeCommand(org.eclipse.ease.lang.python.py4j.Py4jDebugTest) skipped
09:37:31 [2020-12-29T14:37:31.653Z] nativeObjectVariable(org.eclipse.ease.lang.python.py4j.Py4jDebugTest) skipped
09:37:31 [2020-12-29T14:37:31.653Z] disconnectProcessInSuspendedState(org.eclipse.ease.lang.python.py4j.Py4jDebugTest)  Time elapsed: 0.406 s
09:37:31 [2020-12-29T14:37:31.653Z] stepReturnIncludeCommand(org.eclipse.ease.lang.python.py4j.Py4jDebugTest)  Time elapsed: 0.209 s
09:37:31 [2020-12-29T14:37:31.653Z] arrayVariableSorting(org.eclipse.ease.lang.python.py4j.Py4jDebugTest)  Time elapsed: 0.41 s
09:37:31 [2020-12-29T14:37:31.653Z] stepOverOnDebugTarget(org.eclipse.ease.lang.python.py4j.Py4jDebugTest)  Time elapsed: 0.314 s
09:37:31 [2020-12-29T14:37:31.653Z] hasDebugTarget(org.eclipse.ease.lang.python.py4j.Py4jDebugTest)  Time elapsed: 0.205 s
09:37:31 [2020-12-29T14:37:31.653Z] disconnectThreadInSuspendedState(org.eclipse.ease.lang.python.py4j.Py4jDebugTest)  Time elapsed: 0.207 s
09:37:31 [2020-12-29T14:37:31.653Z] stepReturnOnDebugTarget(org.eclipse.ease.lang.python.py4j.Py4jDebugTest)  Time elapsed: 0.409 s
09:37:31 [2020-12-29T14:37:31.653Z] nullVariable(org.eclipse.ease.lang.python.py4j.Py4jDebugTest)  Time elapsed: 0.306 s
09:37:31 [2020-12-29T14:37:31.653Z] stepOverOnStackFrame(org.eclipse.ease.lang.python.py4j.Py4jDebugTest)  Time elapsed: 0.408 s
09:37:31 [2020-12-29T14:37:31.653Z] resumeOnDebugTarget(org.eclipse.ease.lang.python.py4j.Py4jDebugTest)  Time elapsed: 0.307 s
09:37:31 [2020-12-29T14:37:31.653Z] modifyVariableKeepingType(org.eclipse.ease.lang.python.py4j.Py4jDebugTest)  Time elapsed: 0.606 s
09:37:31 [2020-12-29T14:37:31.654Z] stepReturnOnStackFrame(org.eclipse.ease.lang.python.py4j.Py4jDebugTest)  Time elapsed: 0.408 s
09:37:31 [2020-12-29T14:37:31.654Z] terminateStackFrameInSuspendedState(org.eclipse.ease.lang.python.py4j.Py4jDebugTest)  Time elapsed: 0.207 s
09:37:31 [2020-12-29T14:37:31.654Z] breakpointLocation(org.eclipse.ease.lang.python.py4j.Py4jDebugTest)  Time elapsed: 0.208 s
09:37:31 [2020-12-29T14:37:31.654Z] stepReturnOnThread(org.eclipse.ease.lang.python.py4j.Py4jDebugTest)  Time elapsed: 0.306 s
09:37:31 [2020-12-29T14:37:31.654Z] javaClassVariable(org.eclipse.ease.lang.python.py4j.Py4jDebugTest)  Time elapsed: 0.308 s
09:37:31 [2020-12-29T14:37:31.654Z] stepIntoOnThread(org.eclipse.ease.lang.python.py4j.Py4jDebugTest)  Time elapsed: 0.307 s
09:37:31 [2020-12-29T14:37:31.654Z] terminateThreadInSuspendedState(org.eclipse.ease.lang.python.py4j.Py4jDebugTest)  Time elapsed: 0.206 s
09:37:31 [2020-12-29T14:37:31.654Z] resumeOnThread(org.eclipse.ease.lang.python.py4j.Py4jDebugTest)  Time elapsed: 0.306 s
09:37:31 [2020-12-29T14:37:31.654Z] stepIntoOnStackFrame(org.eclipse.ease.lang.python.py4j.Py4jDebugTest)  Time elapsed: 0.306 s
09:37:31 [2020-12-29T14:37:31.654Z] terminateProcessInSuspendedState(org.eclipse.ease.lang.python.py4j.Py4jDebugTest)  Time elapsed: 0.206 s
09:37:31 [2020-12-29T14:37:31.654Z] stepOverOnProcess(org.eclipse.ease.lang.python.py4j.Py4jDebugTest)  Time elapsed: 0.407 s
09:37:31 [2020-12-29T14:37:31.654Z] disconnectDebugTargetInSuspendedState(org.eclipse.ease.lang.python.py4j.Py4jDebugTest)  Time elapsed: 0.206 s
09:37:31 [2020-12-29T14:37:31.654Z] stepIntoOnProcess(org.eclipse.ease.lang.python.py4j.Py4jDebugTest)  Time elapsed: 0.306 s
09:37:31 [2020-12-29T14:37:31.654Z] terminatedState(org.eclipse.ease.lang.python.py4j.Py4jDebugTest)  Time elapsed: 0.104 s
09:37:31 [2020-12-29T14:37:31.654Z] stepOverIncludeCommand(org.eclipse.ease.lang.python.py4j.Py4jDebugTest)  Time elapsed: 0.306 s
09:37:31 [2020-12-29T14:37:31.654Z] innerScopeVariableBeforeOuterScopeVariable(org.eclipse.ease.lang.python.py4j.Py4jDebugTest)  Time elapsed: 0.306 s
09:37:31 [2020-12-29T14:37:31.654Z] primitiveStringVariable(org.eclipse.ease.lang.python.py4j.Py4jDebugTest)  Time elapsed: 0.307 s
09:37:31 [2020-12-29T14:37:31.654Z] resumeOnProcess(org.eclipse.ease.lang.python.py4j.Py4jDebugTest)  Time elapsed: 0.305 s
09:37:31 [2020-12-29T14:37:31.654Z] stepIntoOnDebugTarget(org.eclipse.ease.lang.python.py4j.Py4jDebugTest)  Time elapsed: 0.306 s
09:37:31 [2020-12-29T14:37:31.654Z] stepOverOnThread(org.eclipse.ease.lang.python.py4j.Py4jDebugTest)  Time elapsed: 0.407 s
09:37:31 [2020-12-29T14:37:31.654Z] suspendedState(org.eclipse.ease.lang.python.py4j.Py4jDebugTest)  Time elapsed: 0.205 s
09:37:31 [2020-12-29T14:37:31.654Z] primitiveDoubleVariable(org.eclipse.ease.lang.python.py4j.Py4jDebugTest)  Time elapsed: 0.413 s
09:37:31 [2020-12-29T14:37:31.654Z] resumeOnStackFrame(org.eclipse.ease.lang.python.py4j.Py4jDebugTest)  Time elapsed: 0.306 s
09:37:31 [2020-12-29T14:37:31.654Z] terminateDebugTargetInSuspendedState(org.eclipse.ease.lang.python.py4j.Py4jDebugTest)  Time elapsed: 0.206 s
09:37:31 [2020-12-29T14:37:31.654Z] disconnectStackFrameInSuspendedState(org.eclipse.ease.lang.python.py4j.Py4jDebugTest)  Time elapsed: 0.206 s
09:37:31 [2020-12-29T14:37:31.654Z] stepReturnOnProcess(org.eclipse.ease.lang.python.py4j.Py4jDebugTest)  Time elapsed: 0.407 s
09:37:31 [2020-12-29T14:37:31.654Z] evaluateWatchExpression(org.eclipse.ease.lang.python.py4j.Py4jDebugTest)  Time elapsed: 0.308 s
09:37:31 [2020-12-29T14:37:31.654Z] Running org.eclipse.ease.lang.python.py4j.Py4JEngineTest
09:37:31 [2020-12-29T14:37:31.654Z] Tests run: 3, Failures: 0, Errors: 0, Skipped: 3, Time elapsed: 0.001 s - in org.eclipse.ease.lang.python.py4j.Py4JEngineTest
09:37:31 [2020-12-29T14:37:31.654Z] print(org.eclipse.ease.lang.python.py4j.Py4JEngineTest) skipped
09:37:31 [2020-12-29T14:37:31.654Z] mixedMode(org.eclipse.ease.lang.python.py4j.Py4JEngineTest) skipped
09:37:31 [2020-12-29T14:37:31.654Z] cleanShutdown(org.eclipse.ease.lang.python.py4j.Py4JEngineTest) skipped
09:37:31 [2020-12-29T14:37:31.654Z] 
09:37:31 [2020-12-29T14:37:31.654Z] Results:
09:37:31 [2020-12-29T14:37:31.654Z] 
09:37:31 [2020-12-29T14:37:31.654Z] Tests run: 120, Failures: 0, Errors: 0, Skipped: 13
09:37:31 [2020-12-29T14:37:31.654Z] 
09:37:32 [2020-12-29T14:37:32.217Z] [INFO] All tests passed!
09:37:32 [2020-12-29T14:37:32.217Z] [INFO] 
09:37:32 [2020-12-29T14:37:32.217Z] [INFO] -----< org.eclipse.ease:org.eclipse.ease.lang.scriptarchive.test >------
09:37:32 [2020-12-29T14:37:32.217Z] [INFO] Building org.eclipse.ease.lang.scriptarchive.test 0.8.0-SNAPSHOT [10/11]
09:37:32 [2020-12-29T14:37:32.217Z] [INFO] ------------------------[ eclipse-test-plugin ]-------------------------
09:37:32 [2020-12-29T14:37:32.217Z] [INFO] 
09:37:32 [2020-12-29T14:37:32.217Z] [INFO] --- tycho-packaging-plugin:1.5.0:build-qualifier (default-build-qualifier) @ org.eclipse.ease.lang.scriptarchive.test ---
09:37:32 [2020-12-29T14:37:32.217Z] [INFO] The project's OSGi version is 0.8.0.I201910171213
09:37:32 [2020-12-29T14:37:32.217Z] [INFO] 
09:37:32 [2020-12-29T14:37:32.217Z] [INFO] --- tycho-packaging-plugin:1.5.0:validate-id (default-validate-id) @ org.eclipse.ease.lang.scriptarchive.test ---
09:37:32 [2020-12-29T14:37:32.217Z] [INFO] 
09:37:32 [2020-12-29T14:37:32.217Z] [INFO] --- tycho-packaging-plugin:1.5.0:validate-version (default-validate-version) @ org.eclipse.ease.lang.scriptarchive.test ---
09:37:32 [2020-12-29T14:37:32.217Z] [INFO] 
09:37:32 [2020-12-29T14:37:32.217Z] [INFO] --- maven-resources-plugin:2.4.3:resources (default-resources) @ org.eclipse.ease.lang.scriptarchive.test ---
09:37:32 [2020-12-29T14:37:32.217Z] [INFO] Using 'UTF-8' encoding to copy filtered resources.
09:37:32 [2020-12-29T14:37:32.217Z] [INFO] skip non existing resourceDirectory /home/jenkins/agent/workspace/ease.verify.core.target.2019-06/tests/org.eclipse.ease.lang.scriptarchive.test/src/main/resources
09:37:32 [2020-12-29T14:37:32.217Z] [INFO] 
09:37:32 [2020-12-29T14:37:32.217Z] [INFO] --- tycho-compiler-plugin:1.5.0:compile (default-compile) @ org.eclipse.ease.lang.scriptarchive.test ---
09:37:32 [2020-12-29T14:37:32.217Z] [INFO] Nothing to compile - all classes are up to date
09:37:32 [2020-12-29T14:37:32.217Z] [INFO] 
09:37:32 [2020-12-29T14:37:32.217Z] [INFO] --- maven-resources-plugin:2.4.3:testResources (default-testResources) @ org.eclipse.ease.lang.scriptarchive.test ---
09:37:32 [2020-12-29T14:37:32.217Z] [INFO] Using 'UTF-8' encoding to copy filtered resources.
09:37:32 [2020-12-29T14:37:32.217Z] [INFO] skip non existing resourceDirectory /home/jenkins/agent/workspace/ease.verify.core.target.2019-06/tests/org.eclipse.ease.lang.scriptarchive.test/src/test/resources
09:37:32 [2020-12-29T14:37:32.217Z] [INFO] 
09:37:32 [2020-12-29T14:37:32.217Z] [INFO] --- tycho-source-plugin:1.5.0:plugin-source (plugin-source) @ org.eclipse.ease.lang.scriptarchive.test ---
09:37:32 [2020-12-29T14:37:32.218Z] [INFO] Building jar: /home/jenkins/agent/workspace/ease.verify.core.target.2019-06/tests/org.eclipse.ease.lang.scriptarchive.test/target/org.eclipse.ease.lang.scriptarchive.test-0.8.0-SNAPSHOT-sources.jar
09:37:32 [2020-12-29T14:37:32.218Z] [INFO] 
09:37:32 [2020-12-29T14:37:32.218Z] [INFO] --- target-platform-configuration:1.5.0:target-platform (default-target-platform) @ org.eclipse.ease.lang.scriptarchive.test ---
09:37:32 [2020-12-29T14:37:32.218Z] [INFO] 
09:37:32 [2020-12-29T14:37:32.218Z] [INFO] --- tycho-packaging-plugin:1.5.0:package-plugin (default-package-plugin) @ org.eclipse.ease.lang.scriptarchive.test ---
09:37:32 [2020-12-29T14:37:32.218Z] [INFO] Building jar: /home/jenkins/agent/workspace/ease.verify.core.target.2019-06/tests/org.eclipse.ease.lang.scriptarchive.test/target/org.eclipse.ease.lang.scriptarchive.test-0.8.0-SNAPSHOT.jar
09:37:32 [2020-12-29T14:37:32.218Z] [INFO] 
09:37:32 [2020-12-29T14:37:32.218Z] [INFO] --- tycho-p2-plugin:1.5.0:p2-metadata-default (default-p2-metadata-default) @ org.eclipse.ease.lang.scriptarchive.test ---
09:37:32 [2020-12-29T14:37:32.218Z] [INFO] 
09:37:32 [2020-12-29T14:37:32.218Z] [INFO] --- tycho-source-feature-plugin:1.5.0:source-feature (source-feature) @ org.eclipse.ease.lang.scriptarchive.test ---
09:37:32 [2020-12-29T14:37:32.218Z] [INFO] 
09:37:32 [2020-12-29T14:37:32.218Z] [INFO] --- tycho-p2-plugin:1.5.0:p2-metadata (attached-p2-metadata) @ org.eclipse.ease.lang.scriptarchive.test ---
09:37:32 [2020-12-29T14:37:32.218Z] [INFO] 
09:37:32 [2020-12-29T14:37:32.218Z] [INFO] --- tycho-surefire-plugin:1.5.0:test (default-test) @ org.eclipse.ease.lang.scriptarchive.test ---
09:37:32 [2020-12-29T14:37:32.496Z] [INFO] Expected eclipse log file: /home/jenkins/agent/workspace/ease.verify.core.target.2019-06/tests/org.eclipse.ease.lang.scriptarchive.test/target/work/data/.metadata/.log
09:37:32 [2020-12-29T14:37:32.496Z] [INFO] Command line:
09:37:32 [2020-12-29T14:37:32.496Z] 	[/opt/tools/java/openjdk/jdk-11/11.0.2+9/bin/java, -Dosgi.noShutdown=false, -Dosgi.os=linux, -Dosgi.ws=gtk, -Dosgi.arch=x86_64, -Dosgi.clean=true, -jar, /home/jenkins/.m2/repository/p2/osgi/bundle/org.eclipse.equinox.launcher/1.5.400.v20190515-0925/org.eclipse.equinox.launcher-1.5.400.v20190515-0925.jar, -data, /home/jenkins/agent/workspace/ease.verify.core.target.2019-06/tests/org.eclipse.ease.lang.scriptarchive.test/target/work/data, -install, /home/jenkins/agent/workspace/ease.verify.core.target.2019-06/tests/org.eclipse.ease.lang.scriptarchive.test/target/work, -configuration, /home/jenkins/agent/workspace/ease.verify.core.target.2019-06/tests/org.eclipse.ease.lang.scriptarchive.test/target/work/configuration, -application, org.eclipse.tycho.surefire.osgibooter.headlesstest, -testproperties, /home/jenkins/agent/workspace/ease.verify.core.target.2019-06/tests/org.eclipse.ease.lang.scriptarchive.test/target/surefire.properties]
09:37:32 [2020-12-29T14:37:32.496Z] Picked up JAVA_TOOL_OPTIONS: -Dmaven.ext.class.path="/home/jenkins/agent/workspace/ease.verify.core.target.2019-06@tmp/withMaven0cc4c26d/pipeline-maven-spy.jar" -Dorg.jenkinsci.plugins.pipeline.maven.reportsFolder="/home/jenkins/agent/workspace/ease.verify.core.target.2019-06@tmp/withMaven0cc4c26d" 
09:37:34 [2020-12-29T14:37:34.400Z] Running org.eclipse.ease.lang.scriptarchive.ArchiveEngineTest
09:37:34 [2020-12-29T14:37:34.400Z] We are running from a zip file!
09:37:34 [2020-12-29T14:37:34.658Z] org.eclipse.ease.ScriptExecutionException: SyntaxError: missing ; before statement (workspace://__EASE_ScriptArchive_1/scripts/Master.js#3)
09:37:34 [2020-12-29T14:37:34.658Z] this is an error
09:37:34 [2020-12-29T14:37:34.658Z]        ^
09:37:34 [2020-12-29T14:37:34.658Z] 	at Master.js,workspace://__EASE_ScriptArchive_1/scripts/Master.js
09:37:34 [2020-12-29T14:37:34.658Z] org.eclipse.ease.ScriptExecutionException: SyntaxError: missing ; before statement (workspace://__EASE_ScriptArchive_1/scripts/Master.js#3)
09:37:34 [2020-12-29T14:37:34.658Z] this is an error
09:37:34 [2020-12-29T14:37:34.658Z]        ^
09:37:34 [2020-12-29T14:37:34.658Z] 	at Master.js,workspace://__EASE_ScriptArchive_1/scripts/Master.js
09:37:34 [2020-12-29T14:37:34.658Z] Tests run: 7, Failures: 0, Errors: 0, Skipped: 0, Time elapsed: 0.499 s - in org.eclipse.ease.lang.scriptarchive.ArchiveEngineTest
09:37:34 [2020-12-29T14:37:34.658Z] executeWithManifest(org.eclipse.ease.lang.scriptarchive.ArchiveEngineTest)  Time elapsed: 0.301 s
09:37:34 [2020-12-29T14:37:34.658Z] zipFileRegistration(org.eclipse.ease.lang.scriptarchive.ArchiveEngineTest)  Time elapsed: 0.006 s
09:37:34 [2020-12-29T14:37:34.658Z] engineIdRegistration(org.eclipse.ease.lang.scriptarchive.ArchiveEngineTest)  Time elapsed: 0 s
09:37:34 [2020-12-29T14:37:34.658Z] jarFileRegistration(org.eclipse.ease.lang.scriptarchive.ArchiveEngineTest)  Time elapsed: 0 s
09:37:34 [2020-12-29T14:37:34.658Z] sarFileRegistration(org.eclipse.ease.lang.scriptarchive.ArchiveEngineTest)  Time elapsed: 0 s
09:37:34 [2020-12-29T14:37:34.658Z] executeWithErrors(org.eclipse.ease.lang.scriptarchive.ArchiveEngineTest)  Time elapsed: 0.094 s
09:37:34 [2020-12-29T14:37:34.658Z] executeWithIncludes(org.eclipse.ease.lang.scriptarchive.ArchiveEngineTest)  Time elapsed: 0.042 s
09:37:34 [2020-12-29T14:37:34.658Z] 
09:37:34 [2020-12-29T14:37:34.658Z] Results:
09:37:34 [2020-12-29T14:37:34.658Z] 
09:37:34 [2020-12-29T14:37:34.658Z] Tests run: 7, Failures: 0, Errors: 0, Skipped: 0
09:37:34 [2020-12-29T14:37:34.658Z] 
09:37:35 [2020-12-29T14:37:35.219Z] [INFO] All tests passed!
09:37:35 [2020-12-29T14:37:35.219Z] [INFO] 
09:37:35 [2020-12-29T14:37:35.219Z] [INFO] -------------< org.eclipse.ease:org.eclipse.ease.ui.test >--------------
09:37:35 [2020-12-29T14:37:35.219Z] [INFO] Building org.eclipse.ease.ui.test 0.8.0-SNAPSHOT                 [11/11]
09:37:35 [2020-12-29T14:37:35.219Z] [INFO] ------------------------[ eclipse-test-plugin ]-------------------------
09:37:35 [2020-12-29T14:37:35.219Z] [INFO] 
09:37:35 [2020-12-29T14:37:35.219Z] [INFO] --- tycho-packaging-plugin:1.5.0:build-qualifier (default-build-qualifier) @ org.eclipse.ease.ui.test ---
09:37:35 [2020-12-29T14:37:35.219Z] [INFO] The project's OSGi version is 0.8.0.I201910171213
09:37:35 [2020-12-29T14:37:35.219Z] [INFO] 
09:37:35 [2020-12-29T14:37:35.219Z] [INFO] --- tycho-packaging-plugin:1.5.0:validate-id (default-validate-id) @ org.eclipse.ease.ui.test ---
09:37:35 [2020-12-29T14:37:35.219Z] [INFO] 
09:37:35 [2020-12-29T14:37:35.219Z] [INFO] --- tycho-packaging-plugin:1.5.0:validate-version (default-validate-version) @ org.eclipse.ease.ui.test ---
09:37:35 [2020-12-29T14:37:35.219Z] [INFO] 
09:37:35 [2020-12-29T14:37:35.219Z] [INFO] --- maven-resources-plugin:2.4.3:resources (default-resources) @ org.eclipse.ease.ui.test ---
09:37:35 [2020-12-29T14:37:35.219Z] [INFO] Using 'UTF-8' encoding to copy filtered resources.
09:37:35 [2020-12-29T14:37:35.219Z] [INFO] skip non existing resourceDirectory /home/jenkins/agent/workspace/ease.verify.core.target.2019-06/tests/org.eclipse.ease.ui.test/src/main/resources
09:37:35 [2020-12-29T14:37:35.219Z] [INFO] 
09:37:35 [2020-12-29T14:37:35.219Z] [INFO] --- tycho-compiler-plugin:1.5.0:compile (default-compile) @ org.eclipse.ease.ui.test ---
09:37:35 [2020-12-29T14:37:35.219Z] [INFO] Nothing to compile - all classes are up to date
09:37:35 [2020-12-29T14:37:35.219Z] [INFO] 
09:37:35 [2020-12-29T14:37:35.219Z] [INFO] --- maven-resources-plugin:2.4.3:testResources (default-testResources) @ org.eclipse.ease.ui.test ---
09:37:35 [2020-12-29T14:37:35.219Z] [INFO] Using 'UTF-8' encoding to copy filtered resources.
09:37:35 [2020-12-29T14:37:35.219Z] [INFO] skip non existing resourceDirectory /home/jenkins/agent/workspace/ease.verify.core.target.2019-06/tests/org.eclipse.ease.ui.test/src/test/resources
09:37:35 [2020-12-29T14:37:35.219Z] [INFO] 
09:37:35 [2020-12-29T14:37:35.219Z] [INFO] --- tycho-source-plugin:1.5.0:plugin-source (plugin-source) @ org.eclipse.ease.ui.test ---
09:37:35 [2020-12-29T14:37:35.219Z] [WARNING] Bundle-Vendor header not found in /home/jenkins/agent/workspace/ease.verify.core.target.2019-06/tests/org.eclipse.ease.ui.test/META-INF/MANIFEST.MF, fallback to 'unknown' for source bundle
09:37:35 [2020-12-29T14:37:35.219Z] [INFO] Building jar: /home/jenkins/agent/workspace/ease.verify.core.target.2019-06/tests/org.eclipse.ease.ui.test/target/org.eclipse.ease.ui.test-0.8.0-SNAPSHOT-sources.jar
09:37:35 [2020-12-29T14:37:35.219Z] [INFO] 
09:37:35 [2020-12-29T14:37:35.219Z] [INFO] --- target-platform-configuration:1.5.0:target-platform (default-target-platform) @ org.eclipse.ease.ui.test ---
09:37:35 [2020-12-29T14:37:35.219Z] [INFO] 
09:37:35 [2020-12-29T14:37:35.219Z] [INFO] --- tycho-packaging-plugin:1.5.0:package-plugin (default-package-plugin) @ org.eclipse.ease.ui.test ---
09:37:35 [2020-12-29T14:37:35.219Z] [INFO] Building jar: /home/jenkins/agent/workspace/ease.verify.core.target.2019-06/tests/org.eclipse.ease.ui.test/target/org.eclipse.ease.ui.test-0.8.0-SNAPSHOT.jar
09:37:35 [2020-12-29T14:37:35.219Z] [INFO] 
09:37:35 [2020-12-29T14:37:35.219Z] [INFO] --- tycho-p2-plugin:1.5.0:p2-metadata-default (default-p2-metadata-default) @ org.eclipse.ease.ui.test ---
09:37:35 [2020-12-29T14:37:35.220Z] [INFO] 
09:37:35 [2020-12-29T14:37:35.220Z] [INFO] --- tycho-source-feature-plugin:1.5.0:source-feature (source-feature) @ org.eclipse.ease.ui.test ---
09:37:35 [2020-12-29T14:37:35.220Z] [INFO] 
09:37:35 [2020-12-29T14:37:35.220Z] [INFO] --- tycho-p2-plugin:1.5.0:p2-metadata (attached-p2-metadata) @ org.eclipse.ease.ui.test ---
09:37:35 [2020-12-29T14:37:35.220Z] [INFO] 
09:37:35 [2020-12-29T14:37:35.220Z] [INFO] --- tycho-surefire-plugin:1.5.0:test (default-test) @ org.eclipse.ease.ui.test ---
09:37:35 [2020-12-29T14:37:35.220Z] [INFO] Expected eclipse log file: /home/jenkins/agent/workspace/ease.verify.core.target.2019-06/tests/org.eclipse.ease.ui.test/target/work/data/.metadata/.log
09:37:35 [2020-12-29T14:37:35.220Z] [INFO] Command line:
09:37:35 [2020-12-29T14:37:35.220Z] 	[/opt/tools/java/openjdk/jdk-11/11.0.2+9/bin/java, -Dosgi.noShutdown=false, -Dosgi.os=linux, -Dosgi.ws=gtk, -Dosgi.arch=x86_64, -Dosgi.clean=true, -jar, /home/jenkins/.m2/repository/p2/osgi/bundle/org.eclipse.equinox.launcher/1.5.400.v20190515-0925/org.eclipse.equinox.launcher-1.5.400.v20190515-0925.jar, -data, /home/jenkins/agent/workspace/ease.verify.core.target.2019-06/tests/org.eclipse.ease.ui.test/target/work/data, -install, /home/jenkins/agent/workspace/ease.verify.core.target.2019-06/tests/org.eclipse.ease.ui.test/target/work, -configuration, /home/jenkins/agent/workspace/ease.verify.core.target.2019-06/tests/org.eclipse.ease.ui.test/target/work/configuration, -application, org.eclipse.tycho.surefire.osgibooter.headlesstest, -testproperties, /home/jenkins/agent/workspace/ease.verify.core.target.2019-06/tests/org.eclipse.ease.ui.test/target/surefire.properties]
09:37:35 [2020-12-29T14:37:35.475Z] Picked up JAVA_TOOL_OPTIONS: -Dmaven.ext.class.path="/home/jenkins/agent/workspace/ease.verify.core.target.2019-06@tmp/withMaven0cc4c26d/pipeline-maven-spy.jar" -Dorg.jenkinsci.plugins.pipeline.maven.reportsFolder="/home/jenkins/agent/workspace/ease.verify.core.target.2019-06@tmp/withMaven0cc4c26d" 
09:37:37 [2020-12-29T14:37:37.362Z] Running org.eclipse.ease.ui.completion.CompletionContextTest
09:37:37 [2020-12-29T14:37:37.362Z] Tests run: 9, Failures: 0, Errors: 0, Skipped: 0, Time elapsed: 0.023 s - in org.eclipse.ease.ui.completion.CompletionContextTest
09:37:37 [2020-12-29T14:37:37.362Z] resolveStaticClass(org.eclipse.ease.ui.completion.CompletionContextTest)  Time elapsed: 0.002 s
09:37:37 [2020-12-29T14:37:37.362Z] resolveClassWithFilter(org.eclipse.ease.ui.completion.CompletionContextTest)  Time elapsed: 0 s
09:37:37 [2020-12-29T14:37:37.363Z] simplifyCalls(org.eclipse.ease.ui.completion.CompletionContextTest)  Time elapsed: 0 s
09:37:37 [2020-12-29T14:37:37.363Z] resolveClass(org.eclipse.ease.ui.completion.CompletionContextTest)  Time elapsed: 0.001 s
09:37:37 [2020-12-29T14:37:37.363Z] replaceEscapedStringLiterals(org.eclipse.ease.ui.completion.CompletionContextTest)  Time elapsed: 0 s
09:37:37 [2020-12-29T14:37:37.363Z] replaceSimpleStringLiterals(org.eclipse.ease.ui.completion.CompletionContextTest)  Time elapsed: 0 s
09:37:37 [2020-12-29T14:37:37.363Z] resolveStaticClassWithFilter(org.eclipse.ease.ui.completion.CompletionContextTest)  Time elapsed: 0 s
09:37:37 [2020-12-29T14:37:37.363Z] resolveClassWithParameters(org.eclipse.ease.ui.completion.CompletionContextTest)  Time elapsed: 0 s
09:37:37 [2020-12-29T14:37:37.363Z] replaceMultipleStringLiterals(org.eclipse.ease.ui.completion.CompletionContextTest)  Time elapsed: 0 s
09:37:37 [2020-12-29T14:37:37.363Z] Running org.eclipse.ease.ui.completion.provider.AbstractFileLocationCompletionProviderTest
09:37:37 [2020-12-29T14:37:37.363Z] Tests run: 8, Failures: 0, Errors: 0, Skipped: 8, Time elapsed: 0.071 s - in org.eclipse.ease.ui.completion.provider.AbstractFileLocationCompletionProviderTest
09:37:37 [2020-12-29T14:37:37.363Z] workspaceProjectProposals(org.eclipse.ease.ui.completion.provider.AbstractFileLocationCompletionProviderTest) skipped
09:37:37 [2020-12-29T14:37:37.363Z] checkOperatingSystem(org.eclipse.ease.ui.completion.provider.AbstractFileLocationCompletionProviderTest) skipped
09:37:37 [2020-12-29T14:37:37.363Z] absoluteRootWorkspaceProposals(org.eclipse.ease.ui.completion.provider.AbstractFileLocationCompletionProviderTest) skipped
09:37:37 [2020-12-29T14:37:37.363Z] workspaceFolderProposals(org.eclipse.ease.ui.completion.provider.AbstractFileLocationCompletionProviderTest) skipped
09:37:37 [2020-12-29T14:37:37.363Z] fileSystemFolderProposals(org.eclipse.ease.ui.completion.provider.AbstractFileLocationCompletionProviderTest) skipped
09:37:37 [2020-12-29T14:37:37.363Z] workspaceProposals(org.eclipse.ease.ui.completion.provider.AbstractFileLocationCompletionProviderTest) skipped
09:37:37 [2020-12-29T14:37:37.363Z] relativeRootWorkspaceProposals(org.eclipse.ease.ui.completion.provider.AbstractFileLocationCompletionProviderTest) skipped
09:37:37 [2020-12-29T14:37:37.363Z] fileSystemRootProposals(org.eclipse.ease.ui.completion.provider.AbstractFileLocationCompletionProviderTest) skipped
09:37:37 [2020-12-29T14:37:37.363Z] Running org.eclipse.ease.ui.help.hovers.ModuleHelpTest
09:37:37 [2020-12-29T14:37:37.363Z] Tests run: 4, Failures: 0, Errors: 0, Skipped: 4, Time elapsed: 0.001 s - in org.eclipse.ease.ui.help.hovers.ModuleHelpTest
09:37:37 [2020-12-29T14:37:37.363Z] getModuleHelpLocation(org.eclipse.ease.ui.help.hovers.ModuleHelpTest) skipped
09:37:37 [2020-12-29T14:37:37.363Z] getModuleHelp(org.eclipse.ease.ui.help.hovers.ModuleHelpTest) skipped
09:37:37 [2020-12-29T14:37:37.363Z] getMethodHelp(org.eclipse.ease.ui.help.hovers.ModuleHelpTest) skipped
09:37:37 [2020-12-29T14:37:37.363Z] getConstantHelp(org.eclipse.ease.ui.help.hovers.ModuleHelpTest) skipped
09:37:37 [2020-12-29T14:37:37.363Z] Running org.eclipse.ease.ui.completions.java.provider.JavaPackagesCompletionsProviderTest
09:37:37 [2020-12-29T14:37:37.363Z] WARNING: An illegal reflective access operation has occurred
09:37:37 [2020-12-29T14:37:37.363Z] WARNING: Illegal reflective access by org.mockito.cglib.core.ReflectUtils$2 (file:/home/jenkins/.m2/repository/p2/osgi/bundle/org.mockito/1.9.5.v201605172210/org.mockito-1.9.5.v201605172210.jar) to method java.lang.ClassLoader.defineClass(java.lang.String,byte[],int,int,java.security.ProtectionDomain)
09:37:37 [2020-12-29T14:37:37.363Z] WARNING: Please consider reporting this to the maintainers of org.mockito.cglib.core.ReflectUtils$2
09:37:37 [2020-12-29T14:37:37.363Z] WARNING: Use --illegal-access=warn to enable warnings of further illegal reflective access operations
09:37:37 [2020-12-29T14:37:37.363Z] WARNING: All illegal access operations will be denied in a future release
09:37:43 [2020-12-29T14:37:43.897Z] Tests run: 4, Failures: 0, Errors: 0, Skipped: 0, Time elapsed: 5.776 s - in org.eclipse.ease.ui.completions.java.provider.JavaPackagesCompletionsProviderTest
09:37:43 [2020-12-29T14:37:43.897Z] containsJavaLangPackageProposal(org.eclipse.ease.ui.completions.java.provider.JavaPackagesCompletionsProviderTest)  Time elapsed: 0.393 s
09:37:43 [2020-12-29T14:37:43.897Z] containsOrgRootPackageProposal(org.eclipse.ease.ui.completions.java.provider.JavaPackagesCompletionsProviderTest)  Time elapsed: 0.008 s
09:37:43 [2020-12-29T14:37:43.897Z] containsJavaRootPackageProposal(org.eclipse.ease.ui.completions.java.provider.JavaPackagesCompletionsProviderTest)  Time elapsed: 0.007 s
09:37:43 [2020-12-29T14:37:43.897Z] containsOrgEclipsePackageProposal(org.eclipse.ease.ui.completions.java.provider.JavaPackagesCompletionsProviderTest)  Time elapsed: 0.063 s
09:37:43 [2020-12-29T14:37:43.897Z] Running org.eclipse.ease.ui.completions.java.provider.JavaClassCompletionsProviderTest
09:37:49 [2020-12-29T14:37:49.142Z] Tests run: 6, Failures: 0, Errors: 0, Skipped: 0, Time elapsed: 5.173 s - in org.eclipse.ease.ui.completions.java.provider.JavaClassCompletionsProviderTest
09:37:49 [2020-12-29T14:37:49.142Z] containsPackageFileCompletion(org.eclipse.ease.ui.completions.java.provider.JavaClassCompletionsProviderTest)  Time elapsed: 0.008 s
09:37:49 [2020-12-29T14:37:49.142Z] containsGlobalFileCompletion(org.eclipse.ease.ui.completions.java.provider.JavaClassCompletionsProviderTest)  Time elapsed: 0.032 s
09:37:49 [2020-12-29T14:37:49.142Z] containsJavaLangPackageProposal(org.eclipse.ease.ui.completions.java.provider.JavaClassCompletionsProviderTest)  Time elapsed: 0.073 s
09:37:49 [2020-12-29T14:37:49.142Z] containsOrgRootPackageProposal(org.eclipse.ease.ui.completions.java.provider.JavaClassCompletionsProviderTest)  Time elapsed: 0.006 s
09:37:49 [2020-12-29T14:37:49.142Z] containsJavaRootPackageProposal(org.eclipse.ease.ui.completions.java.provider.JavaClassCompletionsProviderTest)  Time elapsed: 0.004 s
09:37:49 [2020-12-29T14:37:49.142Z] containsOrgEclipsePackageProposal(org.eclipse.ease.ui.completions.java.provider.JavaClassCompletionsProviderTest)  Time elapsed: 0.043 s
09:37:49 [2020-12-29T14:37:49.142Z] 
09:37:49 [2020-12-29T14:37:49.142Z] Results:
09:37:49 [2020-12-29T14:37:49.142Z] 
09:37:49 [2020-12-29T14:37:49.142Z] Tests run: 31, Failures: 0, Errors: 0, Skipped: 12
09:37:49 [2020-12-29T14:37:49.142Z] 
09:37:49 [2020-12-29T14:37:49.142Z] [INFO] All tests passed!
09:37:49 [2020-12-29T14:37:49.142Z] [INFO] ------------------------------------------------------------------------
09:37:49 [2020-12-29T14:37:49.142Z] [INFO] Reactor Summary for org.eclipse.ease.releng 0.8.0-SNAPSHOT:
09:37:49 [2020-12-29T14:37:49.142Z] [INFO] 
09:37:49 [2020-12-29T14:37:49.142Z] [INFO] org.eclipse.ease.releng ............................ SUCCESS [  0.001 s]
09:37:49 [2020-12-29T14:37:49.142Z] [INFO] org.eclipse.ease.releng.target ..................... SUCCESS [  0.223 s]
09:37:49 [2020-12-29T14:37:49.142Z] [INFO] org.eclipse.ease.test .............................. SUCCESS [ 12.681 s]
09:37:49 [2020-12-29T14:37:49.142Z] [INFO] org.eclipse.ease.lang.javascript.nashorn.test ...... SUCCESS [  3.053 s]
09:37:49 [2020-12-29T14:37:49.142Z] [INFO] org.eclipse.ease.lang.javascript.rhino.test ........ SUCCESS [ 14.185 s]
09:37:49 [2020-12-29T14:37:49.142Z] [INFO] org.eclipse.ease.lang.javascript.test .............. SUCCESS [  2.449 s]
09:37:49 [2020-12-29T14:37:49.142Z] [INFO] org.eclipse.ease.lang.python.test .................. SUCCESS [  2.486 s]
09:37:49 [2020-12-29T14:37:49.142Z] [INFO] org.eclipse.ease.lang.python.jython.test ........... SUCCESS [ 15.321 s]
09:37:49 [2020-12-29T14:37:49.142Z] [INFO] org.eclipse.ease.lang.python.py4j.test ............. SUCCESS [ 29.336 s]
09:37:49 [2020-12-29T14:37:49.142Z] [INFO] org.eclipse.ease.lang.scriptarchive.test ........... SUCCESS [  2.883 s]
09:37:49 [2020-12-29T14:37:49.142Z] [INFO] org.eclipse.ease.ui.test ........................... SUCCESS [ 13.922 s]
09:37:49 [2020-12-29T14:37:49.142Z] [INFO] ------------------------------------------------------------------------
09:37:49 [2020-12-29T14:37:49.142Z] [INFO] BUILD SUCCESS
09:37:49 [2020-12-29T14:37:49.142Z] [INFO] ------------------------------------------------------------------------
09:37:49 [2020-12-29T14:37:49.142Z] [INFO] Total time:  02:20 min
09:37:49 [2020-12-29T14:37:49.142Z] [INFO] Finished at: 2020-12-29T14:37:48Z
09:37:49 [2020-12-29T14:37:49.142Z] [INFO] ------------------------------------------------------------------------
09:37:49 [2020-12-29T14:37:49.142Z] [WARNING] [jenkins-event-spy] Unexpected Maven project file name 'target-tests-pom.xml', problems may occur
09:37:49 [2020-12-29T14:37:49.142Z] [INFO] [jenkins-event-spy] Generated /home/jenkins/agent/workspace/ease.verify.core.target.2019-06@tmp/withMaven0cc4c26d/maven-spy-20201229-143528-75416122954684766071012.log