SuccessConsole Output

Skipping 719 KB.. Full Log
t-test) @ org.eclipse.ease.lang.javascript.test ---
09:33:35 [2020-12-29T14:33:35.500Z] [INFO] Expected eclipse log file: /home/jenkins/agent/workspace/ease.verify.core.target.2019-06/tests/org.eclipse.ease.lang.javascript.test/target/work/data/.metadata/.log
09:33:35 [2020-12-29T14:33:35.500Z] [INFO] Command line:
09:33:35 [2020-12-29T14:33:35.500Z] 	[/opt/tools/java/openjdk/jdk-11/11.0.2+9/bin/java, -Dosgi.noShutdown=false, -Dosgi.os=linux, -Dosgi.ws=gtk, -Dosgi.arch=x86_64, -Dosgi.clean=true, -jar, /home/jenkins/.m2/repository/p2/osgi/bundle/org.eclipse.equinox.launcher/1.5.800.v20200727-1323/org.eclipse.equinox.launcher-1.5.800.v20200727-1323.jar, -data, /home/jenkins/agent/workspace/ease.verify.core.target.2019-06/tests/org.eclipse.ease.lang.javascript.test/target/work/data, -install, /home/jenkins/agent/workspace/ease.verify.core.target.2019-06/tests/org.eclipse.ease.lang.javascript.test/target/work, -configuration, /home/jenkins/agent/workspace/ease.verify.core.target.2019-06/tests/org.eclipse.ease.lang.javascript.test/target/work/configuration, -application, org.eclipse.tycho.surefire.osgibooter.headlesstest, -testproperties, /home/jenkins/agent/workspace/ease.verify.core.target.2019-06/tests/org.eclipse.ease.lang.javascript.test/target/surefire.properties]
09:33:35 [2020-12-29T14:33:35.500Z] Picked up JAVA_TOOL_OPTIONS: -Dmaven.ext.class.path="/home/jenkins/agent/workspace/ease.verify.core.target.2019-06@tmp/withMaven52a3c32c/pipeline-maven-spy.jar" -Dorg.jenkinsci.plugins.pipeline.maven.reportsFolder="/home/jenkins/agent/workspace/ease.verify.core.target.2019-06@tmp/withMaven52a3c32c" 
09:33:37 [2020-12-29T14:33:37.459Z] Running org.eclipse.ease.lang.javascript.JavaScriptCompletionContextTest
09:33:37 [2020-12-29T14:33:37.459Z] Tests run: 8, Failures: 0, Errors: 0, Skipped: 0, Time elapsed: 0.239 s - in org.eclipse.ease.lang.javascript.JavaScriptCompletionContextTest
09:33:37 [2020-12-29T14:33:37.459Z] verifyStaticClassTypes(org.eclipse.ease.lang.javascript.JavaScriptCompletionContextTest)  Time elapsed: 0.004 s
09:33:37 [2020-12-29T14:33:37.459Z] verifyClassInstanceTypes(org.eclipse.ease.lang.javascript.JavaScriptCompletionContextTest)  Time elapsed: 0.005 s
09:33:37 [2020-12-29T14:33:37.459Z] verifyTypesForScriptEngine(org.eclipse.ease.lang.javascript.JavaScriptCompletionContextTest)  Time elapsed: 0.105 s
09:33:37 [2020-12-29T14:33:37.459Z] verifyPackageTypes(org.eclipse.ease.lang.javascript.JavaScriptCompletionContextTest)  Time elapsed: 0 s
09:33:37 [2020-12-29T14:33:37.459Z] definedVariableTypes(org.eclipse.ease.lang.javascript.JavaScriptCompletionContextTest)  Time elapsed: 0.001 s
09:33:37 [2020-12-29T14:33:37.459Z] verifyStringLiteralTypes(org.eclipse.ease.lang.javascript.JavaScriptCompletionContextTest)  Time elapsed: 0 s
09:33:37 [2020-12-29T14:33:37.459Z] verifyUnknownTypes(org.eclipse.ease.lang.javascript.JavaScriptCompletionContextTest)  Time elapsed: 0.001 s
09:33:37 [2020-12-29T14:33:37.459Z] verifyNoneTypes(org.eclipse.ease.lang.javascript.JavaScriptCompletionContextTest)  Time elapsed: 0 s
09:33:37 [2020-12-29T14:33:37.459Z] Running org.eclipse.ease.lang.javascript.JavaScriptCodeFactoryTest
09:33:37 [2020-12-29T14:33:37.459Z] Tests run: 1, Failures: 0, Errors: 0, Skipped: 0, Time elapsed: 0.002 s - in org.eclipse.ease.lang.javascript.JavaScriptCodeFactoryTest
09:33:37 [2020-12-29T14:33:37.459Z] testCommentCreator(org.eclipse.ease.lang.javascript.JavaScriptCodeFactoryTest)  Time elapsed: 0.001 s
09:33:37 [2020-12-29T14:33:37.459Z] 
09:33:37 [2020-12-29T14:33:37.459Z] Results:
09:33:37 [2020-12-29T14:33:37.459Z] 
09:33:37 [2020-12-29T14:33:37.459Z] Tests run: 9, Failures: 0, Errors: 0, Skipped: 0
09:33:37 [2020-12-29T14:33:37.459Z] 
09:33:38 [2020-12-29T14:33:38.020Z] [INFO] All tests passed!
09:33:38 [2020-12-29T14:33:38.020Z] [INFO] 
09:33:38 [2020-12-29T14:33:38.020Z] [INFO] --- maven-install-plugin:2.3.1:install (default-install) @ org.eclipse.ease.lang.javascript.test ---
09:33:38 [2020-12-29T14:33:38.020Z] [INFO] Installing /home/jenkins/agent/workspace/ease.verify.core.target.2019-06/tests/org.eclipse.ease.lang.javascript.test/target/org.eclipse.ease.lang.javascript.test-0.8.0-SNAPSHOT.jar to /home/jenkins/.m2/repository/org/eclipse/ease/org.eclipse.ease.lang.javascript.test/0.8.0-SNAPSHOT/org.eclipse.ease.lang.javascript.test-0.8.0-SNAPSHOT.jar
09:33:38 [2020-12-29T14:33:38.020Z] [INFO] Installing /home/jenkins/agent/workspace/ease.verify.core.target.2019-06/tests/org.eclipse.ease.lang.javascript.test/pom.xml to /home/jenkins/.m2/repository/org/eclipse/ease/org.eclipse.ease.lang.javascript.test/0.8.0-SNAPSHOT/org.eclipse.ease.lang.javascript.test-0.8.0-SNAPSHOT.pom
09:33:38 [2020-12-29T14:33:38.020Z] [INFO] Installing /home/jenkins/agent/workspace/ease.verify.core.target.2019-06/tests/org.eclipse.ease.lang.javascript.test/target/org.eclipse.ease.lang.javascript.test-0.8.0-SNAPSHOT-sources.jar to /home/jenkins/.m2/repository/org/eclipse/ease/org.eclipse.ease.lang.javascript.test/0.8.0-SNAPSHOT/org.eclipse.ease.lang.javascript.test-0.8.0-SNAPSHOT-sources.jar
09:33:38 [2020-12-29T14:33:38.020Z] [INFO] Installing /home/jenkins/agent/workspace/ease.verify.core.target.2019-06/tests/org.eclipse.ease.lang.javascript.test/target/p2content.xml to /home/jenkins/.m2/repository/org/eclipse/ease/org.eclipse.ease.lang.javascript.test/0.8.0-SNAPSHOT/org.eclipse.ease.lang.javascript.test-0.8.0-SNAPSHOT-p2metadata.xml
09:33:38 [2020-12-29T14:33:38.020Z] [INFO] Installing /home/jenkins/agent/workspace/ease.verify.core.target.2019-06/tests/org.eclipse.ease.lang.javascript.test/target/p2artifacts.xml to /home/jenkins/.m2/repository/org/eclipse/ease/org.eclipse.ease.lang.javascript.test/0.8.0-SNAPSHOT/org.eclipse.ease.lang.javascript.test-0.8.0-SNAPSHOT-p2artifacts.xml
09:33:38 [2020-12-29T14:33:38.020Z] [INFO] Installing /home/jenkins/agent/workspace/ease.verify.core.target.2019-06/tests/org.eclipse.ease.lang.javascript.test/target/p2content.xml to /home/jenkins/.m2/repository/org/eclipse/ease/org.eclipse.ease.lang.javascript.test/0.8.0-SNAPSHOT/org.eclipse.ease.lang.javascript.test-0.8.0-SNAPSHOT-p2metadata.xml
09:33:38 [2020-12-29T14:33:38.020Z] [INFO] Installing /home/jenkins/agent/workspace/ease.verify.core.target.2019-06/tests/org.eclipse.ease.lang.javascript.test/target/p2artifacts.xml to /home/jenkins/.m2/repository/org/eclipse/ease/org.eclipse.ease.lang.javascript.test/0.8.0-SNAPSHOT/org.eclipse.ease.lang.javascript.test-0.8.0-SNAPSHOT-p2artifacts.xml
09:33:38 [2020-12-29T14:33:38.020Z] [INFO] 
09:33:38 [2020-12-29T14:33:38.020Z] [INFO] --- tycho-p2-plugin:1.5.0:update-local-index (default-update-local-index) @ org.eclipse.ease.lang.javascript.test ---
09:33:38 [2020-12-29T14:33:38.020Z] [INFO] 
09:33:38 [2020-12-29T14:33:38.020Z] [INFO] ---------< org.eclipse.ease:org.eclipse.ease.lang.python.test >---------
09:33:38 [2020-12-29T14:33:38.020Z] [INFO] Building org.eclipse.ease.lang.python.test 0.8.0-SNAPSHOT        [42/48]
09:33:38 [2020-12-29T14:33:38.020Z] [INFO] ------------------------[ eclipse-test-plugin ]-------------------------
09:33:38 [2020-12-29T14:33:38.020Z] [INFO] 
09:33:38 [2020-12-29T14:33:38.020Z] [INFO] --- maven-clean-plugin:2.5:clean (default-clean) @ org.eclipse.ease.lang.python.test ---
09:33:38 [2020-12-29T14:33:38.020Z] [INFO] 
09:33:38 [2020-12-29T14:33:38.020Z] [INFO] --- tycho-packaging-plugin:1.5.0:build-qualifier (default-build-qualifier) @ org.eclipse.ease.lang.python.test ---
09:33:38 [2020-12-29T14:33:38.020Z] [INFO] The project's OSGi version is 0.8.0.I201910171213
09:33:38 [2020-12-29T14:33:38.020Z] [INFO] 
09:33:38 [2020-12-29T14:33:38.020Z] [INFO] --- tycho-packaging-plugin:1.5.0:validate-id (default-validate-id) @ org.eclipse.ease.lang.python.test ---
09:33:38 [2020-12-29T14:33:38.021Z] [INFO] 
09:33:38 [2020-12-29T14:33:38.021Z] [INFO] --- tycho-packaging-plugin:1.5.0:validate-version (default-validate-version) @ org.eclipse.ease.lang.python.test ---
09:33:38 [2020-12-29T14:33:38.021Z] [INFO] 
09:33:38 [2020-12-29T14:33:38.021Z] [INFO] >>> maven-javadoc-plugin:2.9.1:javadoc (build-docs) > generate-sources @ org.eclipse.ease.lang.python.test >>>
09:33:38 [2020-12-29T14:33:38.021Z] [INFO] 
09:33:38 [2020-12-29T14:33:38.021Z] [INFO] --- tycho-packaging-plugin:1.5.0:build-qualifier (default-build-qualifier) @ org.eclipse.ease.lang.python.test ---
09:33:38 [2020-12-29T14:33:38.021Z] [INFO] The project's OSGi version is 0.8.0.I201910171213
09:33:38 [2020-12-29T14:33:38.021Z] [INFO] 
09:33:38 [2020-12-29T14:33:38.021Z] [INFO] --- tycho-packaging-plugin:1.5.0:validate-id (default-validate-id) @ org.eclipse.ease.lang.python.test ---
09:33:38 [2020-12-29T14:33:38.021Z] [INFO] 
09:33:38 [2020-12-29T14:33:38.021Z] [INFO] --- tycho-packaging-plugin:1.5.0:validate-version (default-validate-version) @ org.eclipse.ease.lang.python.test ---
09:33:38 [2020-12-29T14:33:38.021Z] [INFO] 
09:33:38 [2020-12-29T14:33:38.021Z] [INFO] <<< maven-javadoc-plugin:2.9.1:javadoc (build-docs) < generate-sources @ org.eclipse.ease.lang.python.test <<<
09:33:38 [2020-12-29T14:33:38.021Z] [INFO] 
09:33:38 [2020-12-29T14:33:38.021Z] [INFO] 
09:33:38 [2020-12-29T14:33:38.021Z] [INFO] --- maven-javadoc-plugin:2.9.1:javadoc (build-docs) @ org.eclipse.ease.lang.python.test ---
09:33:38 [2020-12-29T14:33:38.276Z] [ERROR] Error fetching link: http://help.eclipse.org/oxygen/topic/org.eclipse.platform.doc.isv/reference/api/package-list. Ignored it.
09:33:38 [2020-12-29T14:33:38.276Z] [ERROR] Error fetching link: https://ci.eclipse.org/ease/job/ease.build.core/JavaDoc/package-list. Ignored it.
09:33:39 [2020-12-29T14:33:39.202Z] [INFO] 
09:33:39 [2020-12-29T14:33:39.202Z] Loading source files for package org.eclipse.ease.lang.python...
09:33:39 [2020-12-29T14:33:39.202Z] Constructing Javadoc information...
09:33:39 [2020-12-29T14:33:39.202Z] No plugin definition found, skipping
09:33:39 [2020-12-29T14:33:39.202Z] No plugin definition found, skipping
09:33:39 [2020-12-29T14:33:39.202Z] [WARNING] Javadoc Warnings
09:33:39 [2020-12-29T14:33:39.202Z] [WARNING] Picked up JAVA_TOOL_OPTIONS: -Dmaven.ext.class.path="/home/jenkins/agent/workspace/ease.verify.core.target.2019-06@tmp/withMaven52a3c32c/pipeline-maven-spy.jar" -Dorg.jenkinsci.plugins.pipeline.maven.reportsFolder="/home/jenkins/agent/workspace/ease.verify.core.target.2019-06@tmp/withMaven52a3c32c"
09:33:39 [2020-12-29T14:33:39.202Z] [WARNING] javadoc: warning - The old Doclet and Taglet APIs in the packages
09:33:39 [2020-12-29T14:33:39.203Z] [WARNING] com.sun.javadoc, com.sun.tools.doclets and their implementations
09:33:39 [2020-12-29T14:33:39.203Z] [WARNING] are planned to be removed in a future JDK release. These
09:33:39 [2020-12-29T14:33:39.203Z] [WARNING] components have been superseded by the new APIs in jdk.javadoc.doclet.
09:33:39 [2020-12-29T14:33:39.203Z] [WARNING] Users are strongly recommended to migrate to the new APIs.
09:33:39 [2020-12-29T14:33:39.203Z] [INFO] 
09:33:39 [2020-12-29T14:33:39.203Z] [INFO] --- build-helper-maven-plugin:1.9.1:add-resource (add_help) @ org.eclipse.ease.lang.python.test ---
09:33:39 [2020-12-29T14:33:39.203Z] [INFO] 
09:33:39 [2020-12-29T14:33:39.203Z] [INFO] --- maven-resources-plugin:2.4.3:resources (default-resources) @ org.eclipse.ease.lang.python.test ---
09:33:39 [2020-12-29T14:33:39.203Z] [INFO] Using 'UTF-8' encoding to copy filtered resources.
09:33:39 [2020-12-29T14:33:39.203Z] [INFO] skip non existing resourceDirectory /home/jenkins/agent/workspace/ease.verify.core.target.2019-06/tests/org.eclipse.ease.lang.python.test/src/main/resources
09:33:39 [2020-12-29T14:33:39.203Z] [INFO] skip non existing resourceDirectory /home/jenkins/agent/workspace/ease.verify.core.target.2019-06/tests/org.eclipse.ease.lang.python.test/help
09:33:39 [2020-12-29T14:33:39.203Z] [INFO] 
09:33:39 [2020-12-29T14:33:39.203Z] [INFO] --- tycho-compiler-plugin:1.5.0:compile (default-compile) @ org.eclipse.ease.lang.python.test ---
09:33:39 [2020-12-29T14:33:39.203Z] [INFO] Compiling 1 source file to /home/jenkins/agent/workspace/ease.verify.core.target.2019-06/tests/org.eclipse.ease.lang.python.test/target/classes
09:33:39 [2020-12-29T14:33:39.203Z] [INFO] 
09:33:39 [2020-12-29T14:33:39.205Z] [INFO] --- maven-resources-plugin:2.4.3:testResources (default-testResources) @ org.eclipse.ease.lang.python.test ---
09:33:39 [2020-12-29T14:33:39.205Z] [INFO] Using 'UTF-8' encoding to copy filtered resources.
09:33:39 [2020-12-29T14:33:39.205Z] [INFO] skip non existing resourceDirectory /home/jenkins/agent/workspace/ease.verify.core.target.2019-06/tests/org.eclipse.ease.lang.python.test/src/test/resources
09:33:39 [2020-12-29T14:33:39.205Z] [INFO] 
09:33:39 [2020-12-29T14:33:39.205Z] [INFO] --- tycho-source-plugin:1.5.0:plugin-source (plugin-source) @ org.eclipse.ease.lang.python.test ---
09:33:39 [2020-12-29T14:33:39.205Z] [WARNING] Bundle-Vendor header not found in /home/jenkins/agent/workspace/ease.verify.core.target.2019-06/tests/org.eclipse.ease.lang.python.test/META-INF/MANIFEST.MF, fallback to 'unknown' for source bundle
09:33:39 [2020-12-29T14:33:39.206Z] [INFO] Building jar: /home/jenkins/agent/workspace/ease.verify.core.target.2019-06/tests/org.eclipse.ease.lang.python.test/target/org.eclipse.ease.lang.python.test-0.8.0-SNAPSHOT-sources.jar
09:33:39 [2020-12-29T14:33:39.206Z] [INFO] 
09:33:39 [2020-12-29T14:33:39.206Z] [INFO] --- target-platform-configuration:1.5.0:target-platform (default-target-platform) @ org.eclipse.ease.lang.python.test ---
09:33:39 [2020-12-29T14:33:39.206Z] [INFO] 
09:33:39 [2020-12-29T14:33:39.206Z] [INFO] --- tycho-packaging-plugin:1.5.0:package-plugin (default-package-plugin) @ org.eclipse.ease.lang.python.test ---
09:33:39 [2020-12-29T14:33:39.206Z] [INFO] Building jar: /home/jenkins/agent/workspace/ease.verify.core.target.2019-06/tests/org.eclipse.ease.lang.python.test/target/org.eclipse.ease.lang.python.test-0.8.0-SNAPSHOT.jar
09:33:39 [2020-12-29T14:33:39.206Z] [INFO] 
09:33:39 [2020-12-29T14:33:39.206Z] [INFO] --- tycho-p2-plugin:1.5.0:p2-metadata-default (default-p2-metadata-default) @ org.eclipse.ease.lang.python.test ---
09:33:39 [2020-12-29T14:33:39.206Z] [INFO] 
09:33:39 [2020-12-29T14:33:39.206Z] [INFO] --- tycho-source-feature-plugin:1.5.0:source-feature (source-feature) @ org.eclipse.ease.lang.python.test ---
09:33:39 [2020-12-29T14:33:39.206Z] [INFO] 
09:33:39 [2020-12-29T14:33:39.206Z] [INFO] --- tycho-p2-plugin:1.5.0:p2-metadata (attached-p2-metadata) @ org.eclipse.ease.lang.python.test ---
09:33:39 [2020-12-29T14:33:39.206Z] [INFO] 
09:33:39 [2020-12-29T14:33:39.206Z] [INFO] --- tycho-surefire-plugin:1.5.0:test (default-test) @ org.eclipse.ease.lang.python.test ---
09:33:39 [2020-12-29T14:33:39.499Z] [INFO] Expected eclipse log file: /home/jenkins/agent/workspace/ease.verify.core.target.2019-06/tests/org.eclipse.ease.lang.python.test/target/work/data/.metadata/.log
09:33:39 [2020-12-29T14:33:39.499Z] [INFO] Command line:
09:33:39 [2020-12-29T14:33:39.499Z] 	[/opt/tools/java/openjdk/jdk-11/11.0.2+9/bin/java, -Dosgi.noShutdown=false, -Dosgi.os=linux, -Dosgi.ws=gtk, -Dosgi.arch=x86_64, -Dosgi.clean=true, -jar, /home/jenkins/.m2/repository/p2/osgi/bundle/org.eclipse.equinox.launcher/1.5.800.v20200727-1323/org.eclipse.equinox.launcher-1.5.800.v20200727-1323.jar, -data, /home/jenkins/agent/workspace/ease.verify.core.target.2019-06/tests/org.eclipse.ease.lang.python.test/target/work/data, -install, /home/jenkins/agent/workspace/ease.verify.core.target.2019-06/tests/org.eclipse.ease.lang.python.test/target/work, -configuration, /home/jenkins/agent/workspace/ease.verify.core.target.2019-06/tests/org.eclipse.ease.lang.python.test/target/work/configuration, -application, org.eclipse.tycho.surefire.osgibooter.headlesstest, -testproperties, /home/jenkins/agent/workspace/ease.verify.core.target.2019-06/tests/org.eclipse.ease.lang.python.test/target/surefire.properties]
09:33:39 [2020-12-29T14:33:39.499Z] Picked up JAVA_TOOL_OPTIONS: -Dmaven.ext.class.path="/home/jenkins/agent/workspace/ease.verify.core.target.2019-06@tmp/withMaven52a3c32c/pipeline-maven-spy.jar" -Dorg.jenkinsci.plugins.pipeline.maven.reportsFolder="/home/jenkins/agent/workspace/ease.verify.core.target.2019-06@tmp/withMaven52a3c32c" 
09:33:40 [2020-12-29T14:33:40.903Z] Running org.eclipse.ease.lang.python.PythonCodeFactoryTest
09:33:40 [2020-12-29T14:33:40.903Z] Tests run: 1, Failures: 0, Errors: 0, Skipped: 0, Time elapsed: 0.08 s - in org.eclipse.ease.lang.python.PythonCodeFactoryTest
09:33:40 [2020-12-29T14:33:40.903Z] testCommentCreator(org.eclipse.ease.lang.python.PythonCodeFactoryTest)  Time elapsed: 0.004 s
09:33:40 [2020-12-29T14:33:40.903Z] 
09:33:40 [2020-12-29T14:33:40.903Z] Results:
09:33:40 [2020-12-29T14:33:40.903Z] 
09:33:40 [2020-12-29T14:33:40.903Z] Tests run: 1, Failures: 0, Errors: 0, Skipped: 0
09:33:40 [2020-12-29T14:33:40.903Z] 
09:33:41 [2020-12-29T14:33:41.465Z] [INFO] All tests passed!
09:33:41 [2020-12-29T14:33:41.465Z] [INFO] 
09:33:41 [2020-12-29T14:33:41.465Z] [INFO] --- maven-install-plugin:2.3.1:install (default-install) @ org.eclipse.ease.lang.python.test ---
09:33:41 [2020-12-29T14:33:41.465Z] [INFO] Installing /home/jenkins/agent/workspace/ease.verify.core.target.2019-06/tests/org.eclipse.ease.lang.python.test/target/org.eclipse.ease.lang.python.test-0.8.0-SNAPSHOT.jar to /home/jenkins/.m2/repository/org/eclipse/ease/org.eclipse.ease.lang.python.test/0.8.0-SNAPSHOT/org.eclipse.ease.lang.python.test-0.8.0-SNAPSHOT.jar
09:33:41 [2020-12-29T14:33:41.465Z] [INFO] Installing /home/jenkins/agent/workspace/ease.verify.core.target.2019-06/tests/org.eclipse.ease.lang.python.test/pom.xml to /home/jenkins/.m2/repository/org/eclipse/ease/org.eclipse.ease.lang.python.test/0.8.0-SNAPSHOT/org.eclipse.ease.lang.python.test-0.8.0-SNAPSHOT.pom
09:33:41 [2020-12-29T14:33:41.465Z] [INFO] Installing /home/jenkins/agent/workspace/ease.verify.core.target.2019-06/tests/org.eclipse.ease.lang.python.test/target/org.eclipse.ease.lang.python.test-0.8.0-SNAPSHOT-sources.jar to /home/jenkins/.m2/repository/org/eclipse/ease/org.eclipse.ease.lang.python.test/0.8.0-SNAPSHOT/org.eclipse.ease.lang.python.test-0.8.0-SNAPSHOT-sources.jar
09:33:41 [2020-12-29T14:33:41.465Z] [INFO] Installing /home/jenkins/agent/workspace/ease.verify.core.target.2019-06/tests/org.eclipse.ease.lang.python.test/target/p2content.xml to /home/jenkins/.m2/repository/org/eclipse/ease/org.eclipse.ease.lang.python.test/0.8.0-SNAPSHOT/org.eclipse.ease.lang.python.test-0.8.0-SNAPSHOT-p2metadata.xml
09:33:41 [2020-12-29T14:33:41.465Z] [INFO] Installing /home/jenkins/agent/workspace/ease.verify.core.target.2019-06/tests/org.eclipse.ease.lang.python.test/target/p2artifacts.xml to /home/jenkins/.m2/repository/org/eclipse/ease/org.eclipse.ease.lang.python.test/0.8.0-SNAPSHOT/org.eclipse.ease.lang.python.test-0.8.0-SNAPSHOT-p2artifacts.xml
09:33:41 [2020-12-29T14:33:41.465Z] [INFO] Installing /home/jenkins/agent/workspace/ease.verify.core.target.2019-06/tests/org.eclipse.ease.lang.python.test/target/p2content.xml to /home/jenkins/.m2/repository/org/eclipse/ease/org.eclipse.ease.lang.python.test/0.8.0-SNAPSHOT/org.eclipse.ease.lang.python.test-0.8.0-SNAPSHOT-p2metadata.xml
09:33:41 [2020-12-29T14:33:41.465Z] [INFO] Installing /home/jenkins/agent/workspace/ease.verify.core.target.2019-06/tests/org.eclipse.ease.lang.python.test/target/p2artifacts.xml to /home/jenkins/.m2/repository/org/eclipse/ease/org.eclipse.ease.lang.python.test/0.8.0-SNAPSHOT/org.eclipse.ease.lang.python.test-0.8.0-SNAPSHOT-p2artifacts.xml
09:33:41 [2020-12-29T14:33:41.465Z] [INFO] 
09:33:41 [2020-12-29T14:33:41.465Z] [INFO] --- tycho-p2-plugin:1.5.0:update-local-index (default-update-local-index) @ org.eclipse.ease.lang.python.test ---
09:33:41 [2020-12-29T14:33:41.465Z] [INFO] 
09:33:41 [2020-12-29T14:33:41.465Z] [INFO] -----< org.eclipse.ease:org.eclipse.ease.lang.python.jython.test >------
09:33:41 [2020-12-29T14:33:41.465Z] [INFO] Building org.eclipse.ease.lang.python.jython.test 0.8.0-SNAPSHOT [43/48]
09:33:41 [2020-12-29T14:33:41.465Z] [INFO] ------------------------[ eclipse-test-plugin ]-------------------------
09:33:41 [2020-12-29T14:33:41.465Z] [INFO] 
09:33:41 [2020-12-29T14:33:41.465Z] [INFO] --- maven-clean-plugin:2.5:clean (default-clean) @ org.eclipse.ease.lang.python.jython.test ---
09:33:41 [2020-12-29T14:33:41.465Z] [INFO] 
09:33:41 [2020-12-29T14:33:41.465Z] [INFO] --- tycho-packaging-plugin:1.5.0:build-qualifier (default-build-qualifier) @ org.eclipse.ease.lang.python.jython.test ---
09:33:41 [2020-12-29T14:33:41.465Z] [INFO] The project's OSGi version is 0.8.0.I201911291239
09:33:41 [2020-12-29T14:33:41.465Z] [INFO] 
09:33:41 [2020-12-29T14:33:41.465Z] [INFO] --- tycho-packaging-plugin:1.5.0:validate-id (default-validate-id) @ org.eclipse.ease.lang.python.jython.test ---
09:33:41 [2020-12-29T14:33:41.465Z] [INFO] 
09:33:41 [2020-12-29T14:33:41.465Z] [INFO] --- tycho-packaging-plugin:1.5.0:validate-version (default-validate-version) @ org.eclipse.ease.lang.python.jython.test ---
09:33:41 [2020-12-29T14:33:41.465Z] [INFO] 
09:33:41 [2020-12-29T14:33:41.465Z] [INFO] >>> maven-javadoc-plugin:2.9.1:javadoc (build-docs) > generate-sources @ org.eclipse.ease.lang.python.jython.test >>>
09:33:41 [2020-12-29T14:33:41.465Z] [INFO] 
09:33:41 [2020-12-29T14:33:41.465Z] [INFO] --- tycho-packaging-plugin:1.5.0:build-qualifier (default-build-qualifier) @ org.eclipse.ease.lang.python.jython.test ---
09:33:41 [2020-12-29T14:33:41.465Z] [INFO] The project's OSGi version is 0.8.0.I201911291239
09:33:41 [2020-12-29T14:33:41.465Z] [INFO] 
09:33:41 [2020-12-29T14:33:41.465Z] [INFO] --- tycho-packaging-plugin:1.5.0:validate-id (default-validate-id) @ org.eclipse.ease.lang.python.jython.test ---
09:33:41 [2020-12-29T14:33:41.465Z] [INFO] 
09:33:41 [2020-12-29T14:33:41.465Z] [INFO] --- tycho-packaging-plugin:1.5.0:validate-version (default-validate-version) @ org.eclipse.ease.lang.python.jython.test ---
09:33:41 [2020-12-29T14:33:41.465Z] [INFO] 
09:33:41 [2020-12-29T14:33:41.465Z] [INFO] <<< maven-javadoc-plugin:2.9.1:javadoc (build-docs) < generate-sources @ org.eclipse.ease.lang.python.jython.test <<<
09:33:41 [2020-12-29T14:33:41.465Z] [INFO] 
09:33:41 [2020-12-29T14:33:41.465Z] [INFO] 
09:33:41 [2020-12-29T14:33:41.465Z] [INFO] --- maven-javadoc-plugin:2.9.1:javadoc (build-docs) @ org.eclipse.ease.lang.python.jython.test ---
09:33:41 [2020-12-29T14:33:41.721Z] [ERROR] Error fetching link: http://help.eclipse.org/oxygen/topic/org.eclipse.platform.doc.isv/reference/api/package-list. Ignored it.
09:33:41 [2020-12-29T14:33:41.721Z] [ERROR] Error fetching link: https://ci.eclipse.org/ease/job/ease.build.core/JavaDoc/package-list. Ignored it.
09:33:42 [2020-12-29T14:33:42.669Z] [INFO] 
09:33:42 [2020-12-29T14:33:42.669Z] Loading source files for package org.eclipse.ease.lang.python.jython.debugger...
09:33:42 [2020-12-29T14:33:42.669Z] Constructing Javadoc information...
09:33:42 [2020-12-29T14:33:42.669Z] No plugin definition found, skipping
09:33:42 [2020-12-29T14:33:42.669Z] No plugin definition found, skipping
09:33:42 [2020-12-29T14:33:42.669Z] [WARNING] Javadoc Warnings
09:33:42 [2020-12-29T14:33:42.669Z] [WARNING] Picked up JAVA_TOOL_OPTIONS: -Dmaven.ext.class.path="/home/jenkins/agent/workspace/ease.verify.core.target.2019-06@tmp/withMaven52a3c32c/pipeline-maven-spy.jar" -Dorg.jenkinsci.plugins.pipeline.maven.reportsFolder="/home/jenkins/agent/workspace/ease.verify.core.target.2019-06@tmp/withMaven52a3c32c"
09:33:42 [2020-12-29T14:33:42.669Z] [WARNING] javadoc: warning - The old Doclet and Taglet APIs in the packages
09:33:42 [2020-12-29T14:33:42.669Z] [WARNING] com.sun.javadoc, com.sun.tools.doclets and their implementations
09:33:42 [2020-12-29T14:33:42.669Z] [WARNING] are planned to be removed in a future JDK release. These
09:33:42 [2020-12-29T14:33:42.669Z] [WARNING] components have been superseded by the new APIs in jdk.javadoc.doclet.
09:33:42 [2020-12-29T14:33:42.669Z] [WARNING] Users are strongly recommended to migrate to the new APIs.
09:33:42 [2020-12-29T14:33:42.669Z] [INFO] 
09:33:42 [2020-12-29T14:33:42.669Z] [INFO] --- build-helper-maven-plugin:1.9.1:add-resource (add_help) @ org.eclipse.ease.lang.python.jython.test ---
09:33:42 [2020-12-29T14:33:42.669Z] [INFO] 
09:33:42 [2020-12-29T14:33:42.669Z] [INFO] --- maven-resources-plugin:2.4.3:resources (default-resources) @ org.eclipse.ease.lang.python.jython.test ---
09:33:42 [2020-12-29T14:33:42.669Z] [INFO] Using 'UTF-8' encoding to copy filtered resources.
09:33:42 [2020-12-29T14:33:42.669Z] [INFO] skip non existing resourceDirectory /home/jenkins/agent/workspace/ease.verify.core.target.2019-06/tests/org.eclipse.ease.lang.python.jython.test/src/main/resources
09:33:42 [2020-12-29T14:33:42.670Z] [INFO] skip non existing resourceDirectory /home/jenkins/agent/workspace/ease.verify.core.target.2019-06/tests/org.eclipse.ease.lang.python.jython.test/help
09:33:42 [2020-12-29T14:33:42.670Z] [INFO] 
09:33:42 [2020-12-29T14:33:42.670Z] [INFO] --- tycho-compiler-plugin:1.5.0:compile (default-compile) @ org.eclipse.ease.lang.python.jython.test ---
09:33:42 [2020-12-29T14:33:42.670Z] [INFO] Compiling 1 source file to /home/jenkins/agent/workspace/ease.verify.core.target.2019-06/tests/org.eclipse.ease.lang.python.jython.test/target/classes
09:33:42 [2020-12-29T14:33:42.926Z] [INFO] 
09:33:42 [2020-12-29T14:33:42.926Z] [INFO] --- maven-resources-plugin:2.4.3:testResources (default-testResources) @ org.eclipse.ease.lang.python.jython.test ---
09:33:42 [2020-12-29T14:33:42.926Z] [INFO] Using 'UTF-8' encoding to copy filtered resources.
09:33:42 [2020-12-29T14:33:42.926Z] [INFO] skip non existing resourceDirectory /home/jenkins/agent/workspace/ease.verify.core.target.2019-06/tests/org.eclipse.ease.lang.python.jython.test/src/test/resources
09:33:42 [2020-12-29T14:33:42.926Z] [INFO] 
09:33:42 [2020-12-29T14:33:42.926Z] [INFO] --- tycho-source-plugin:1.5.0:plugin-source (plugin-source) @ org.eclipse.ease.lang.python.jython.test ---
09:33:42 [2020-12-29T14:33:42.926Z] [WARNING] Bundle-Vendor header not found in /home/jenkins/agent/workspace/ease.verify.core.target.2019-06/tests/org.eclipse.ease.lang.python.jython.test/META-INF/MANIFEST.MF, fallback to 'unknown' for source bundle
09:33:42 [2020-12-29T14:33:42.926Z] [INFO] Building jar: /home/jenkins/agent/workspace/ease.verify.core.target.2019-06/tests/org.eclipse.ease.lang.python.jython.test/target/org.eclipse.ease.lang.python.jython.test-0.8.0-SNAPSHOT-sources.jar
09:33:42 [2020-12-29T14:33:42.926Z] [INFO] 
09:33:42 [2020-12-29T14:33:42.926Z] [INFO] --- target-platform-configuration:1.5.0:target-platform (default-target-platform) @ org.eclipse.ease.lang.python.jython.test ---
09:33:42 [2020-12-29T14:33:42.926Z] [INFO] 
09:33:42 [2020-12-29T14:33:42.926Z] [INFO] --- tycho-packaging-plugin:1.5.0:package-plugin (default-package-plugin) @ org.eclipse.ease.lang.python.jython.test ---
09:33:42 [2020-12-29T14:33:42.926Z] [INFO] Building jar: /home/jenkins/agent/workspace/ease.verify.core.target.2019-06/tests/org.eclipse.ease.lang.python.jython.test/target/org.eclipse.ease.lang.python.jython.test-0.8.0-SNAPSHOT.jar
09:33:42 [2020-12-29T14:33:42.926Z] [INFO] 
09:33:42 [2020-12-29T14:33:42.926Z] [INFO] --- tycho-p2-plugin:1.5.0:p2-metadata-default (default-p2-metadata-default) @ org.eclipse.ease.lang.python.jython.test ---
09:33:42 [2020-12-29T14:33:42.926Z] [INFO] 
09:33:42 [2020-12-29T14:33:42.926Z] [INFO] --- tycho-source-feature-plugin:1.5.0:source-feature (source-feature) @ org.eclipse.ease.lang.python.jython.test ---
09:33:42 [2020-12-29T14:33:42.926Z] [INFO] 
09:33:42 [2020-12-29T14:33:42.926Z] [INFO] --- tycho-p2-plugin:1.5.0:p2-metadata (attached-p2-metadata) @ org.eclipse.ease.lang.python.jython.test ---
09:33:42 [2020-12-29T14:33:42.926Z] [INFO] 
09:33:42 [2020-12-29T14:33:42.926Z] [INFO] --- tycho-surefire-plugin:1.5.0:test (default-test) @ org.eclipse.ease.lang.python.jython.test ---
09:33:43 [2020-12-29T14:33:43.487Z] [INFO] Expected eclipse log file: /home/jenkins/agent/workspace/ease.verify.core.target.2019-06/tests/org.eclipse.ease.lang.python.jython.test/target/work/data/.metadata/.log
09:33:43 [2020-12-29T14:33:43.487Z] [INFO] Command line:
09:33:43 [2020-12-29T14:33:43.487Z] 	[/opt/tools/java/openjdk/jdk-11/11.0.2+9/bin/java, -Dosgi.noShutdown=false, -Dosgi.os=linux, -Dosgi.ws=gtk, -Dosgi.arch=x86_64, -Dosgi.clean=true, -jar, /home/jenkins/.m2/repository/p2/osgi/bundle/org.eclipse.equinox.launcher/1.5.800.v20200727-1323/org.eclipse.equinox.launcher-1.5.800.v20200727-1323.jar, -data, /home/jenkins/agent/workspace/ease.verify.core.target.2019-06/tests/org.eclipse.ease.lang.python.jython.test/target/work/data, -install, /home/jenkins/agent/workspace/ease.verify.core.target.2019-06/tests/org.eclipse.ease.lang.python.jython.test/target/work, -configuration, /home/jenkins/agent/workspace/ease.verify.core.target.2019-06/tests/org.eclipse.ease.lang.python.jython.test/target/work/configuration, -application, org.eclipse.tycho.surefire.osgibooter.headlesstest, -testproperties, /home/jenkins/agent/workspace/ease.verify.core.target.2019-06/tests/org.eclipse.ease.lang.python.jython.test/target/surefire.properties]
09:33:43 [2020-12-29T14:33:43.487Z] Picked up JAVA_TOOL_OPTIONS: -Dmaven.ext.class.path="/home/jenkins/agent/workspace/ease.verify.core.target.2019-06@tmp/withMaven52a3c32c/pipeline-maven-spy.jar" -Dorg.jenkinsci.plugins.pipeline.maven.reportsFolder="/home/jenkins/agent/workspace/ease.verify.core.target.2019-06@tmp/withMaven52a3c32c" 
09:33:45 [2020-12-29T14:33:45.419Z] WARNING: An illegal reflective access operation has occurred
09:33:45 [2020-12-29T14:33:45.419Z] WARNING: Illegal reflective access by org.python.core.PySystemState (file:/home/jenkins/agent/workspace/ease.verify.core.target.2019-06/tests/org.eclipse.ease.lang.python.jython.test/target/work/plugins/org.jython_2.7.0.I201609090924/jython.jar) to method java.io.Console.encoding()
09:33:45 [2020-12-29T14:33:45.419Z] WARNING: Please consider reporting this to the maintainers of org.python.core.PySystemState
09:33:45 [2020-12-29T14:33:45.419Z] WARNING: Use --illegal-access=warn to enable warnings of further illegal reflective access operations
09:33:45 [2020-12-29T14:33:45.419Z] WARNING: All illegal access operations will be denied in a future release
09:33:45 [2020-12-29T14:33:45.419Z] Running org.eclipse.ease.lang.python.jython.debugger.JythonDebugTest
09:33:46 [2020-12-29T14:33:46.837Z] Start of script
09:33:46 [2020-12-29T14:33:46.837Z] include file start
09:33:46 [2020-12-29T14:33:46.837Z] include file processed
09:33:46 [2020-12-29T14:33:46.837Z] Result of testMethod = 5
09:33:46 [2020-12-29T14:33:46.837Z] End of script
09:33:47 [2020-12-29T14:33:47.093Z] Start of script
09:33:47 [2020-12-29T14:33:47.093Z] include file start
09:33:47 [2020-12-29T14:33:47.093Z] include file processed
09:33:47 [2020-12-29T14:33:47.093Z] Result of testMethod = 5
09:33:47 [2020-12-29T14:33:47.093Z] End of script
09:33:47 [2020-12-29T14:33:47.349Z] Start of script
09:33:47 [2020-12-29T14:33:47.349Z] include file start
09:33:47 [2020-12-29T14:33:47.349Z] include file processed
09:33:47 [2020-12-29T14:33:47.349Z] Result of testMethod = 5
09:33:47 [2020-12-29T14:33:47.349Z] Traceback (most recent call last):
09:33:47 [2020-12-29T14:33:47.349Z]   File "(none)", line 184, in run
09:33:47 [2020-12-29T14:33:47.349Z]   File "__ref_L/Debug Test/Main.py_dzrjfteeki", line 23, in <module>
09:33:47 [2020-12-29T14:33:47.349Z]   File "(none)", line 161, in trace_dispatch
09:33:47 [2020-12-29T14:33:47.349Z] org.eclipse.ease.ExitException: 
09:33:47 [2020-12-29T14:33:47.349Z] 
09:33:47 [2020-12-29T14:33:47.349Z] org.eclipse.ease.ExitException: org.eclipse.ease.ExitException: 
09:33:47 [2020-12-29T14:33:47.604Z] Start of script
09:33:47 [2020-12-29T14:33:47.604Z] include file start
09:33:47 [2020-12-29T14:33:47.604Z] include file processed
09:33:47 [2020-12-29T14:33:47.861Z] Result of testMethod = 5
09:33:47 [2020-12-29T14:33:47.861Z] End of script
09:33:48 [2020-12-29T14:33:48.116Z] Start of script
09:33:48 [2020-12-29T14:33:48.116Z] include file start
09:33:48 [2020-12-29T14:33:48.116Z] include file processed
09:33:48 [2020-12-29T14:33:48.116Z] Result of testMethod = 5
09:33:48 [2020-12-29T14:33:48.116Z] End of script
09:33:48 [2020-12-29T14:33:48.116Z] Start of script
09:33:48 [2020-12-29T14:33:48.116Z] include file start
09:33:48 [2020-12-29T14:33:48.116Z] include file processed
09:33:48 [2020-12-29T14:33:48.372Z] Result of testMethod = 5
09:33:48 [2020-12-29T14:33:48.372Z] End of script
09:33:48 [2020-12-29T14:33:48.628Z] Start of script
09:33:48 [2020-12-29T14:33:48.628Z] include file start
09:33:48 [2020-12-29T14:33:48.628Z] include file processed
09:33:48 [2020-12-29T14:33:48.628Z] Result of testMethod = 5
09:33:48 [2020-12-29T14:33:48.628Z] Traceback (most recent call last):
09:33:48 [2020-12-29T14:33:48.628Z]   File "(none)", line 184, in run
09:33:48 [2020-12-29T14:33:48.628Z]   File "__ref_L/Debug Test/Main.py_pakkogqqbq", line 23, in <module>
09:33:48 [2020-12-29T14:33:48.628Z]   File "(none)", line 161, in trace_dispatch
09:33:48 [2020-12-29T14:33:48.628Z] org.eclipse.ease.ExitException: 
09:33:48 [2020-12-29T14:33:48.628Z] 
09:33:48 [2020-12-29T14:33:48.628Z] org.eclipse.ease.ExitException: org.eclipse.ease.ExitException: 
09:33:48 [2020-12-29T14:33:48.884Z] Start of script
09:33:48 [2020-12-29T14:33:48.884Z] include file start
09:33:48 [2020-12-29T14:33:48.884Z] include file processed
09:33:48 [2020-12-29T14:33:48.884Z] Result of testMethod = 5
09:33:48 [2020-12-29T14:33:48.884Z] End of script
09:33:49 [2020-12-29T14:33:49.140Z] Start of script
09:33:49 [2020-12-29T14:33:49.140Z] include file start
09:33:49 [2020-12-29T14:33:49.140Z] include file processed
09:33:49 [2020-12-29T14:33:49.140Z] Result of testMethod = 5
09:33:49 [2020-12-29T14:33:49.140Z] End of script
09:33:49 [2020-12-29T14:33:49.396Z] Start of script
09:33:49 [2020-12-29T14:33:49.396Z] include file start
09:33:49 [2020-12-29T14:33:49.396Z] include file processed
09:33:49 [2020-12-29T14:33:49.652Z] Traceback (most recent call last):
09:33:49 [2020-12-29T14:33:49.652Z]   File "(none)", line 184, in run
09:33:49 [2020-12-29T14:33:49.652Z]   File "__ref_L/Debug Test/Main.py_vsjiwaplpc", line 22, in <module>
09:33:49 [2020-12-29T14:33:49.652Z]   File "(none)", line 161, in trace_dispatch
09:33:49 [2020-12-29T14:33:49.652Z] org.eclipse.ease.ExitException: 
09:33:49 [2020-12-29T14:33:49.652Z] 
09:33:49 [2020-12-29T14:33:49.652Z] org.eclipse.ease.ExitException: org.eclipse.ease.ExitException: 
09:33:49 [2020-12-29T14:33:49.908Z] Start of script
09:33:49 [2020-12-29T14:33:49.908Z] include file start
09:33:49 [2020-12-29T14:33:49.908Z] include file processed
09:33:49 [2020-12-29T14:33:49.908Z] Result of testMethod = 5
09:33:49 [2020-12-29T14:33:49.908Z] End of script
09:33:50 [2020-12-29T14:33:50.163Z] Start of script
09:33:50 [2020-12-29T14:33:50.164Z] include file start
09:33:50 [2020-12-29T14:33:50.164Z] include file processed
09:33:50 [2020-12-29T14:33:50.164Z] Result of testMethod = 5
09:33:50 [2020-12-29T14:33:50.164Z] End of script
09:33:50 [2020-12-29T14:33:50.419Z] Traceback (most recent call last):
09:33:50 [2020-12-29T14:33:50.419Z]   File "(none)", line 184, in run
09:33:50 [2020-12-29T14:33:50.419Z]   File "__ref_L/Debug Test/Main.py_qubleocgyu", line 1, in <module>
09:33:50 [2020-12-29T14:33:50.419Z]   File "(none)", line 161, in trace_dispatch
09:33:50 [2020-12-29T14:33:50.419Z] org.eclipse.ease.ExitException: 
09:33:50 [2020-12-29T14:33:50.419Z] 
09:33:50 [2020-12-29T14:33:50.419Z] org.eclipse.ease.ExitException: org.eclipse.ease.ExitException: 
09:33:50 [2020-12-29T14:33:50.675Z] Start of script
09:33:50 [2020-12-29T14:33:50.675Z] include file start
09:33:50 [2020-12-29T14:33:50.675Z] include file processed
09:33:50 [2020-12-29T14:33:50.675Z] Result of testMethod = 5
09:33:50 [2020-12-29T14:33:50.675Z] End of script
09:33:50 [2020-12-29T14:33:50.675Z] Start of script
09:33:50 [2020-12-29T14:33:50.675Z] include file start
09:33:50 [2020-12-29T14:33:50.675Z] include file processed
09:33:50 [2020-12-29T14:33:50.931Z] Result of testMethod = 5
09:33:50 [2020-12-29T14:33:50.931Z] End of script
09:33:51 [2020-12-29T14:33:51.187Z] Start of script
09:33:51 [2020-12-29T14:33:51.187Z] include file start
09:33:51 [2020-12-29T14:33:51.187Z] include file processed
09:33:51 [2020-12-29T14:33:51.187Z] Result of testMethod = 5
09:33:51 [2020-12-29T14:33:51.187Z] Traceback (most recent call last):
09:33:51 [2020-12-29T14:33:51.187Z]   File "(none)", line 184, in run
09:33:51 [2020-12-29T14:33:51.187Z]   File "__ref_L/Debug Test/Main.py_rgwuvtycgo", line 23, in <module>
09:33:51 [2020-12-29T14:33:51.187Z]   File "(none)", line 161, in trace_dispatch
09:33:51 [2020-12-29T14:33:51.187Z] org.eclipse.ease.ExitException: 
09:33:51 [2020-12-29T14:33:51.187Z] 
09:33:51 [2020-12-29T14:33:51.187Z] org.eclipse.ease.ExitException: org.eclipse.ease.ExitException: 
09:33:51 [2020-12-29T14:33:51.443Z] Start of script
09:33:51 [2020-12-29T14:33:51.443Z] include file start
09:33:51 [2020-12-29T14:33:51.443Z] include file processed
09:33:51 [2020-12-29T14:33:51.443Z] Result of testMethod = 5
09:33:51 [2020-12-29T14:33:51.443Z] End of script
09:33:51 [2020-12-29T14:33:51.699Z] Traceback (most recent call last):
09:33:51 [2020-12-29T14:33:51.699Z]   File "(none)", line 184, in run
09:33:51 [2020-12-29T14:33:51.699Z]   File "__ref_L/Debug Test/Main.py_dutvhaivgy", line 1, in <module>
09:33:51 [2020-12-29T14:33:51.699Z]   File "(none)", line 161, in trace_dispatch
09:33:51 [2020-12-29T14:33:51.699Z] org.eclipse.ease.ExitException: 
09:33:51 [2020-12-29T14:33:51.699Z] 
09:33:51 [2020-12-29T14:33:51.699Z] org.eclipse.ease.ExitException: org.eclipse.ease.ExitException: 
09:33:51 [2020-12-29T14:33:51.955Z] Start of script
09:33:51 [2020-12-29T14:33:51.955Z] include file start
09:33:51 [2020-12-29T14:33:51.955Z] include file processed
09:33:51 [2020-12-29T14:33:51.955Z] Result of testMethod = 5
09:33:51 [2020-12-29T14:33:51.955Z] End of script
09:33:52 [2020-12-29T14:33:52.211Z] Start of script
09:33:52 [2020-12-29T14:33:52.211Z] include file start
09:33:52 [2020-12-29T14:33:52.211Z] include file processed
09:33:52 [2020-12-29T14:33:52.211Z] Result of testMethod = 5
09:33:52 [2020-12-29T14:33:52.211Z] End of script
09:33:52 [2020-12-29T14:33:52.467Z] Traceback (most recent call last):
09:33:52 [2020-12-29T14:33:52.467Z]   File "(none)", line 184, in run
09:33:52 [2020-12-29T14:33:52.467Z]   File "__ref_L/Debug Test/Main.py_wuqpedqqcc", line 1, in <module>
09:33:52 [2020-12-29T14:33:52.467Z]   File "(none)", line 161, in trace_dispatch
09:33:52 [2020-12-29T14:33:52.467Z] org.eclipse.ease.ExitException: 
09:33:52 [2020-12-29T14:33:52.467Z] 
09:33:52 [2020-12-29T14:33:52.467Z] org.eclipse.ease.ExitException: org.eclipse.ease.ExitException: 
09:33:52 [2020-12-29T14:33:52.723Z] Start of script
09:33:52 [2020-12-29T14:33:52.723Z] include file start
09:33:52 [2020-12-29T14:33:52.723Z] include file processed
09:33:52 [2020-12-29T14:33:52.723Z] Result of testMethod = 5
09:33:52 [2020-12-29T14:33:52.723Z] End of script
09:33:52 [2020-12-29T14:33:52.979Z] Start of script
09:33:52 [2020-12-29T14:33:52.979Z] include file start
09:33:52 [2020-12-29T14:33:52.979Z] include file processed
09:33:52 [2020-12-29T14:33:52.979Z] Result of testMethod = 5
09:33:53 [2020-12-29T14:33:53.235Z] Traceback (most recent call last):
09:33:53 [2020-12-29T14:33:53.235Z]   File "(none)", line 184, in run
09:33:53 [2020-12-29T14:33:53.235Z]   File "__ref_L/Debug Test/Main.py_ibeakqxvfe", line 23, in <module>
09:33:53 [2020-12-29T14:33:53.235Z]   File "(none)", line 161, in trace_dispatch
09:33:53 [2020-12-29T14:33:53.235Z] org.eclipse.ease.ExitException: 
09:33:53 [2020-12-29T14:33:53.235Z] 
09:33:53 [2020-12-29T14:33:53.235Z] org.eclipse.ease.ExitException: org.eclipse.ease.ExitException: 
09:33:53 [2020-12-29T14:33:53.235Z] Start of script
09:33:53 [2020-12-29T14:33:53.235Z] include file start
09:33:53 [2020-12-29T14:33:53.235Z] include file processed
09:33:53 [2020-12-29T14:33:53.235Z] Result of testMethod = 5
09:33:53 [2020-12-29T14:33:53.235Z] End of script
09:33:53 [2020-12-29T14:33:53.491Z] Start of script
09:33:53 [2020-12-29T14:33:53.491Z] include file start
09:33:53 [2020-12-29T14:33:53.491Z] include file processed
09:33:53 [2020-12-29T14:33:53.747Z] Result of testMethod = 5
09:33:53 [2020-12-29T14:33:53.747Z] End of script
09:33:53 [2020-12-29T14:33:53.747Z] Start of script
09:33:53 [2020-12-29T14:33:53.747Z] include file start
09:33:53 [2020-12-29T14:33:53.747Z] include file processed
09:33:53 [2020-12-29T14:33:53.747Z] Result of testMethod = 5
09:33:53 [2020-12-29T14:33:53.747Z] End of script
09:33:53 [2020-12-29T14:33:53.747Z] Start of script
09:33:54 [2020-12-29T14:33:54.004Z] include file start
09:33:54 [2020-12-29T14:33:54.004Z] include file processed
09:33:54 [2020-12-29T14:33:54.004Z] Result of testMethod = 5
09:33:54 [2020-12-29T14:33:54.004Z] End of script
09:33:54 [2020-12-29T14:33:54.259Z] Start of script
09:33:54 [2020-12-29T14:33:54.259Z] include file start
09:33:54 [2020-12-29T14:33:54.259Z] include file processed
09:33:54 [2020-12-29T14:33:54.259Z] Traceback (most recent call last):
09:33:54 [2020-12-29T14:33:54.259Z]   File "(none)", line 184, in run
09:33:54 [2020-12-29T14:33:54.259Z]   File "__ref_L/Debug Test/Main.py_qclwhgpyky", line 21, in <module>
09:33:54 [2020-12-29T14:33:54.260Z]   File "__ref_L/Debug Test/Main.py_qclwhgpyky", line 18, in testMethod
09:33:54 [2020-12-29T14:33:54.260Z]   File "(none)", line 161, in trace_dispatch
09:33:54 [2020-12-29T14:33:54.260Z] org.eclipse.ease.ExitException: 
09:33:54 [2020-12-29T14:33:54.260Z] 
09:33:54 [2020-12-29T14:33:54.260Z] org.eclipse.ease.ExitException: org.eclipse.ease.ExitException: 
09:33:54 [2020-12-29T14:33:54.515Z] Start of script
09:33:54 [2020-12-29T14:33:54.515Z] include file start
09:33:54 [2020-12-29T14:33:54.515Z] include file processed
09:33:54 [2020-12-29T14:33:54.771Z] Result of testMethod = 5
09:33:54 [2020-12-29T14:33:54.771Z] End of script
09:33:54 [2020-12-29T14:33:54.771Z] Start of script
09:33:54 [2020-12-29T14:33:54.771Z] include file start
09:33:54 [2020-12-29T14:33:54.771Z] include file processed
09:33:54 [2020-12-29T14:33:54.771Z] Result of testMethod = 5
09:33:55 [2020-12-29T14:33:55.027Z] Traceback (most recent call last):
09:33:55 [2020-12-29T14:33:55.027Z]   File "(none)", line 184, in run
09:33:55 [2020-12-29T14:33:55.027Z]   File "__ref_L/Debug Test/Main.py_hszzkcwypg", line 23, in <module>
09:33:55 [2020-12-29T14:33:55.027Z]   File "(none)", line 161, in trace_dispatch
09:33:55 [2020-12-29T14:33:55.027Z] org.eclipse.ease.ExitException: 
09:33:55 [2020-12-29T14:33:55.027Z] 
09:33:55 [2020-12-29T14:33:55.027Z] org.eclipse.ease.ExitException: org.eclipse.ease.ExitException: 
09:33:55 [2020-12-29T14:33:55.027Z] Start of script
09:33:55 [2020-12-29T14:33:55.027Z] include file start
09:33:55 [2020-12-29T14:33:55.027Z] include file processed
09:33:55 [2020-12-29T14:33:55.027Z] Result of testMethod = 5
09:33:55 [2020-12-29T14:33:55.027Z] End of script
09:33:55 [2020-12-29T14:33:55.283Z] Start of script
09:33:55 [2020-12-29T14:33:55.283Z] include file start
09:33:55 [2020-12-29T14:33:55.283Z] include file processed
09:33:55 [2020-12-29T14:33:55.540Z] Result of testMethod = 5
09:33:55 [2020-12-29T14:33:55.540Z] End of script
09:33:55 [2020-12-29T14:33:55.540Z] Start of script
09:33:55 [2020-12-29T14:33:55.540Z] include file start
09:33:55 [2020-12-29T14:33:55.540Z] include file processed
09:33:55 [2020-12-29T14:33:55.795Z] Result of testMethod = 5
09:33:55 [2020-12-29T14:33:55.795Z] End of script
09:33:55 [2020-12-29T14:33:55.795Z] Start of script
09:33:55 [2020-12-29T14:33:55.795Z] include file start
09:33:55 [2020-12-29T14:33:55.795Z] include file processed
09:33:55 [2020-12-29T14:33:55.795Z] Result of testMethod = 5
09:33:56 [2020-12-29T14:33:56.052Z] End of script
09:33:56 [2020-12-29T14:33:56.052Z] Start of script
09:33:56 [2020-12-29T14:33:56.052Z] include file start
09:33:56 [2020-12-29T14:33:56.052Z] include file processed
09:33:56 [2020-12-29T14:33:56.052Z] Result of testMethod = 5
09:33:56 [2020-12-29T14:33:56.307Z] Traceback (most recent call last):
09:33:56 [2020-12-29T14:33:56.307Z]   File "(none)", line 184, in run
09:33:56 [2020-12-29T14:33:56.307Z]   File "__ref_L/Debug Test/Main.py_imprfzyvjf", line 23, in <module>
09:33:56 [2020-12-29T14:33:56.307Z]   File "(none)", line 161, in trace_dispatch
09:33:56 [2020-12-29T14:33:56.307Z] org.eclipse.ease.ExitException: 
09:33:56 [2020-12-29T14:33:56.307Z] 
09:33:56 [2020-12-29T14:33:56.307Z] org.eclipse.ease.ExitException: org.eclipse.ease.ExitException: 
09:33:56 [2020-12-29T14:33:56.307Z] Start of script
09:33:56 [2020-12-29T14:33:56.307Z] include file start
09:33:56 [2020-12-29T14:33:56.307Z] include file processed
09:33:56 [2020-12-29T14:33:56.307Z] Result of testMethod = 5
09:33:56 [2020-12-29T14:33:56.563Z] End of script
09:33:56 [2020-12-29T14:33:56.563Z] Start of script
09:33:56 [2020-12-29T14:33:56.563Z] include file start
09:33:56 [2020-12-29T14:33:56.563Z] include file processed
09:33:56 [2020-12-29T14:33:56.563Z] Result of testMethod = 5
09:33:56 [2020-12-29T14:33:56.819Z] Traceback (most recent call last):
09:33:56 [2020-12-29T14:33:56.819Z]   File "(none)", line 184, in run
09:33:56 [2020-12-29T14:33:56.819Z]   File "__ref_L/Debug Test/Main.py_oocgpcpsfw", line 23, in <module>
09:33:56 [2020-12-29T14:33:56.819Z]   File "(none)", line 161, in trace_dispatch
09:33:56 [2020-12-29T14:33:56.819Z] org.eclipse.ease.ExitException: 
09:33:56 [2020-12-29T14:33:56.819Z] 
09:33:56 [2020-12-29T14:33:56.819Z] org.eclipse.ease.ExitException: org.eclipse.ease.ExitException: 
09:33:57 [2020-12-29T14:33:57.075Z] Traceback (most recent call last):
09:33:57 [2020-12-29T14:33:57.075Z]   File "(none)", line 184, in run
09:33:57 [2020-12-29T14:33:57.075Z]   File "__ref_L/Debug Test/Main.py_jvouxpgvbz", line 1, in <module>
09:33:57 [2020-12-29T14:33:57.075Z]   File "(none)", line 161, in trace_dispatch
09:33:57 [2020-12-29T14:33:57.075Z] org.eclipse.ease.ExitException: 
09:33:57 [2020-12-29T14:33:57.075Z] 
09:33:57 [2020-12-29T14:33:57.075Z] org.eclipse.ease.ExitException: org.eclipse.ease.ExitException: 
09:33:57 [2020-12-29T14:33:57.075Z] Start of script
09:33:57 [2020-12-29T14:33:57.331Z] include file start
09:33:57 [2020-12-29T14:33:57.331Z] include file processed
09:33:57 [2020-12-29T14:33:57.331Z] Result of testMethod = 5
09:33:57 [2020-12-29T14:33:57.331Z] End of script
09:33:57 [2020-12-29T14:33:57.331Z] Start of script
09:33:57 [2020-12-29T14:33:57.331Z] include file start
09:33:57 [2020-12-29T14:33:57.331Z] include file processed
09:33:57 [2020-12-29T14:33:57.587Z] Result of testMethod = 5
09:33:57 [2020-12-29T14:33:57.587Z] End of script
09:33:57 [2020-12-29T14:33:57.587Z] Start of script
09:33:57 [2020-12-29T14:33:57.587Z] include file start
09:33:57 [2020-12-29T14:33:57.587Z] include file processed
09:33:57 [2020-12-29T14:33:57.587Z] Result of testMethod = 5
09:33:57 [2020-12-29T14:33:57.843Z] End of script
09:33:57 [2020-12-29T14:33:57.843Z] Tests run: 42, Failures: 0, Errors: 0, Skipped: 0, Time elapsed: 12.499 s - in org.eclipse.ease.lang.python.jython.debugger.JythonDebugTest
09:33:57 [2020-12-29T14:33:57.843Z] disconnectProcessInSuspendedState(org.eclipse.ease.lang.python.jython.debugger.JythonDebugTest)  Time elapsed: 1.682 s
09:33:57 [2020-12-29T14:33:57.843Z] stepReturnIncludeCommand(org.eclipse.ease.lang.python.jython.debugger.JythonDebugTest)  Time elapsed: 0.213 s
09:33:57 [2020-12-29T14:33:57.843Z] arrayVariableSorting(org.eclipse.ease.lang.python.jython.debugger.JythonDebugTest)  Time elapsed: 0.309 s
09:33:57 [2020-12-29T14:33:57.843Z] stepOverOnDebugTarget(org.eclipse.ease.lang.python.jython.debugger.JythonDebugTest)  Time elapsed: 0.311 s
09:33:57 [2020-12-29T14:33:57.843Z] hasDebugTarget(org.eclipse.ease.lang.python.jython.debugger.JythonDebugTest)  Time elapsed: 0.105 s
09:33:57 [2020-12-29T14:33:57.843Z] disconnectThreadInSuspendedState(org.eclipse.ease.lang.python.jython.debugger.JythonDebugTest)  Time elapsed: 0.208 s
09:33:57 [2020-12-29T14:33:57.843Z] stepReturnOnDebugTarget(org.eclipse.ease.lang.python.jython.debugger.JythonDebugTest)  Time elapsed: 0.309 s
09:33:57 [2020-12-29T14:33:57.843Z] nullVariable(org.eclipse.ease.lang.python.jython.debugger.JythonDebugTest)  Time elapsed: 0.308 s
09:33:57 [2020-12-29T14:33:57.843Z] stepOverOnStackFrame(org.eclipse.ease.lang.python.jython.debugger.JythonDebugTest)  Time elapsed: 0.308 s
09:33:57 [2020-12-29T14:33:57.843Z] resumeOnDebugTarget(org.eclipse.ease.lang.python.jython.debugger.JythonDebugTest)  Time elapsed: 0.207 s
09:33:57 [2020-12-29T14:33:57.843Z] modifyVariableKeepingType(org.eclipse.ease.lang.python.jython.debugger.JythonDebugTest)  Time elapsed: 0.506 s
09:33:57 [2020-12-29T14:33:57.843Z] resumeOnLastIncludeLine(org.eclipse.ease.lang.python.jython.debugger.JythonDebugTest)  Time elapsed: 0.208 s
09:33:57 [2020-12-29T14:33:57.844Z] stepReturnOnStackFrame(org.eclipse.ease.lang.python.jython.debugger.JythonDebugTest)  Time elapsed: 0.307 s
09:33:57 [2020-12-29T14:33:57.844Z] terminateStackFrameInSuspendedState(org.eclipse.ease.lang.python.jython.debugger.JythonDebugTest)  Time elapsed: 0.207 s
09:33:57 [2020-12-29T14:33:57.844Z] breakpointLocation(org.eclipse.ease.lang.python.jython.debugger.JythonDebugTest)  Time elapsed: 0.207 s
09:33:57 [2020-12-29T14:33:57.844Z] stepReturnOnThread(org.eclipse.ease.lang.python.jython.debugger.JythonDebugTest)  Time elapsed: 0.308 s
09:33:57 [2020-12-29T14:33:57.844Z] javaClassVariable(org.eclipse.ease.lang.python.jython.debugger.JythonDebugTest)  Time elapsed: 0.308 s
09:33:57 [2020-12-29T14:33:57.844Z] stepIntoOnThread(org.eclipse.ease.lang.python.jython.debugger.JythonDebugTest)  Time elapsed: 0.308 s
09:33:57 [2020-12-29T14:33:57.844Z] terminateThreadInSuspendedState(org.eclipse.ease.lang.python.jython.debugger.JythonDebugTest)  Time elapsed: 0.206 s
09:33:57 [2020-12-29T14:33:57.844Z] resumeOnThread(org.eclipse.ease.lang.python.jython.debugger.JythonDebugTest)  Time elapsed: 0.206 s
09:33:57 [2020-12-29T14:33:57.844Z] stepIntoOnStackFrame(org.eclipse.ease.lang.python.jython.debugger.JythonDebugTest)  Time elapsed: 0.308 s
09:33:57 [2020-12-29T14:33:57.844Z] terminateProcessInSuspendedState(org.eclipse.ease.lang.python.jython.debugger.JythonDebugTest)  Time elapsed: 0.207 s
09:33:57 [2020-12-29T14:33:57.844Z] stepOverOnProcess(org.eclipse.ease.lang.python.jython.debugger.JythonDebugTest)  Time elapsed: 0.308 s
09:33:57 [2020-12-29T14:33:57.844Z] nativeArrayVariable(org.eclipse.ease.lang.python.jython.debugger.JythonDebugTest)  Time elapsed: 0.308 s
09:33:57 [2020-12-29T14:33:57.844Z] disconnectDebugTargetInSuspendedState(org.eclipse.ease.lang.python.jython.debugger.JythonDebugTest)  Time elapsed: 0.206 s
09:33:57 [2020-12-29T14:33:57.844Z] stepIntoOnProcess(org.eclipse.ease.lang.python.jython.debugger.JythonDebugTest)  Time elapsed: 0.307 s
09:33:57 [2020-12-29T14:33:57.844Z] terminatedState(org.eclipse.ease.lang.python.jython.debugger.JythonDebugTest)  Time elapsed: 0.105 s
09:33:57 [2020-12-29T14:33:57.844Z] stepOverIncludeCommand(org.eclipse.ease.lang.python.jython.debugger.JythonDebugTest)  Time elapsed: 0.305 s
09:33:57 [2020-12-29T14:33:57.844Z] innerScopeVariableBeforeOuterScopeVariable(org.eclipse.ease.lang.python.jython.debugger.JythonDebugTest)  Time elapsed: 0.306 s
09:33:57 [2020-12-29T14:33:57.844Z] stepIntoIncludeCommand(org.eclipse.ease.lang.python.jython.debugger.JythonDebugTest)  Time elapsed: 0.305 s
09:33:57 [2020-12-29T14:33:57.844Z] primitiveStringVariable(org.eclipse.ease.lang.python.jython.debugger.JythonDebugTest)  Time elapsed: 0.306 s
09:33:57 [2020-12-29T14:33:57.844Z] resumeOnProcess(org.eclipse.ease.lang.python.jython.debugger.JythonDebugTest)  Time elapsed: 0.205 s
09:33:57 [2020-12-29T14:33:57.844Z] stepIntoOnDebugTarget(org.eclipse.ease.lang.python.jython.debugger.JythonDebugTest)  Time elapsed: 0.306 s
09:33:57 [2020-12-29T14:33:57.844Z] stepOverOnThread(org.eclipse.ease.lang.python.jython.debugger.JythonDebugTest)  Time elapsed: 0.306 s
09:33:57 [2020-12-29T14:33:57.844Z] suspendedState(org.eclipse.ease.lang.python.jython.debugger.JythonDebugTest)  Time elapsed: 0.206 s
09:33:57 [2020-12-29T14:33:57.844Z] primitiveDoubleVariable(org.eclipse.ease.lang.python.jython.debugger.JythonDebugTest)  Time elapsed: 0.305 s
09:33:57 [2020-12-29T14:33:57.844Z] resumeOnStackFrame(org.eclipse.ease.lang.python.jython.debugger.JythonDebugTest)  Time elapsed: 0.206 s
09:33:57 [2020-12-29T14:33:57.844Z] nativeObjectVariable(org.eclipse.ease.lang.python.jython.debugger.JythonDebugTest)  Time elapsed: 0.306 s
09:33:57 [2020-12-29T14:33:57.844Z] terminateDebugTargetInSuspendedState(org.eclipse.ease.lang.python.jython.debugger.JythonDebugTest)  Time elapsed: 0.206 s
09:33:57 [2020-12-29T14:33:57.844Z] disconnectStackFrameInSuspendedState(org.eclipse.ease.lang.python.jython.debugger.JythonDebugTest)  Time elapsed: 0.206 s
09:33:57 [2020-12-29T14:33:57.844Z] stepReturnOnProcess(org.eclipse.ease.lang.python.jython.debugger.JythonDebugTest)  Time elapsed: 0.306 s
09:33:57 [2020-12-29T14:33:57.844Z] evaluateWatchExpression(org.eclipse.ease.lang.python.jython.debugger.JythonDebugTest)  Time elapsed: 0.207 s
09:33:57 [2020-12-29T14:33:57.844Z] 
09:33:57 [2020-12-29T14:33:57.844Z] Results:
09:33:57 [2020-12-29T14:33:57.844Z] 
09:33:57 [2020-12-29T14:33:57.844Z] Tests run: 42, Failures: 0, Errors: 0, Skipped: 0
09:33:57 [2020-12-29T14:33:57.844Z] 
09:33:58 [2020-12-29T14:33:58.405Z] [INFO] All tests passed!
09:33:58 [2020-12-29T14:33:58.405Z] [INFO] 
09:33:58 [2020-12-29T14:33:58.405Z] [INFO] --- maven-install-plugin:2.3.1:install (default-install) @ org.eclipse.ease.lang.python.jython.test ---
09:33:58 [2020-12-29T14:33:58.406Z] [INFO] Installing /home/jenkins/agent/workspace/ease.verify.core.target.2019-06/tests/org.eclipse.ease.lang.python.jython.test/target/org.eclipse.ease.lang.python.jython.test-0.8.0-SNAPSHOT.jar to /home/jenkins/.m2/repository/org/eclipse/ease/org.eclipse.ease.lang.python.jython.test/0.8.0-SNAPSHOT/org.eclipse.ease.lang.python.jython.test-0.8.0-SNAPSHOT.jar
09:33:58 [2020-12-29T14:33:58.406Z] [INFO] Installing /home/jenkins/agent/workspace/ease.verify.core.target.2019-06/tests/org.eclipse.ease.lang.python.jython.test/pom.xml to /home/jenkins/.m2/repository/org/eclipse/ease/org.eclipse.ease.lang.python.jython.test/0.8.0-SNAPSHOT/org.eclipse.ease.lang.python.jython.test-0.8.0-SNAPSHOT.pom
09:33:58 [2020-12-29T14:33:58.406Z] [INFO] Installing /home/jenkins/agent/workspace/ease.verify.core.target.2019-06/tests/org.eclipse.ease.lang.python.jython.test/target/org.eclipse.ease.lang.python.jython.test-0.8.0-SNAPSHOT-sources.jar to /home/jenkins/.m2/repository/org/eclipse/ease/org.eclipse.ease.lang.python.jython.test/0.8.0-SNAPSHOT/org.eclipse.ease.lang.python.jython.test-0.8.0-SNAPSHOT-sources.jar
09:33:58 [2020-12-29T14:33:58.406Z] [INFO] Installing /home/jenkins/agent/workspace/ease.verify.core.target.2019-06/tests/org.eclipse.ease.lang.python.jython.test/target/p2content.xml to /home/jenkins/.m2/repository/org/eclipse/ease/org.eclipse.ease.lang.python.jython.test/0.8.0-SNAPSHOT/org.eclipse.ease.lang.python.jython.test-0.8.0-SNAPSHOT-p2metadata.xml
09:33:58 [2020-12-29T14:33:58.406Z] [INFO] Installing /home/jenkins/agent/workspace/ease.verify.core.target.2019-06/tests/org.eclipse.ease.lang.python.jython.test/target/p2artifacts.xml to /home/jenkins/.m2/repository/org/eclipse/ease/org.eclipse.ease.lang.python.jython.test/0.8.0-SNAPSHOT/org.eclipse.ease.lang.python.jython.test-0.8.0-SNAPSHOT-p2artifacts.xml
09:33:58 [2020-12-29T14:33:58.406Z] [INFO] Installing /home/jenkins/agent/workspace/ease.verify.core.target.2019-06/tests/org.eclipse.ease.lang.python.jython.test/target/p2content.xml to /home/jenkins/.m2/repository/org/eclipse/ease/org.eclipse.ease.lang.python.jython.test/0.8.0-SNAPSHOT/org.eclipse.ease.lang.python.jython.test-0.8.0-SNAPSHOT-p2metadata.xml
09:33:58 [2020-12-29T14:33:58.406Z] [INFO] Installing /home/jenkins/agent/workspace/ease.verify.core.target.2019-06/tests/org.eclipse.ease.lang.python.jython.test/target/p2artifacts.xml to /home/jenkins/.m2/repository/org/eclipse/ease/org.eclipse.ease.lang.python.jython.test/0.8.0-SNAPSHOT/org.eclipse.ease.lang.python.jython.test-0.8.0-SNAPSHOT-p2artifacts.xml
09:33:58 [2020-12-29T14:33:58.406Z] [INFO] 
09:33:58 [2020-12-29T14:33:58.406Z] [INFO] --- tycho-p2-plugin:1.5.0:update-local-index (default-update-local-index) @ org.eclipse.ease.lang.python.jython.test ---
09:33:58 [2020-12-29T14:33:58.406Z] [INFO] 
09:33:58 [2020-12-29T14:33:58.406Z] [INFO] -----< org.eclipse.ease:org.eclipse.ease.lang.scriptarchive.test >------
09:33:58 [2020-12-29T14:33:58.406Z] [INFO] Building org.eclipse.ease.lang.scriptarchive.test 0.8.0-SNAPSHOT [44/48]
09:33:58 [2020-12-29T14:33:58.406Z] [INFO] ------------------------[ eclipse-test-plugin ]-------------------------
09:33:58 [2020-12-29T14:33:58.406Z] [INFO] 
09:33:58 [2020-12-29T14:33:58.406Z] [INFO] --- maven-clean-plugin:2.5:clean (default-clean) @ org.eclipse.ease.lang.scriptarchive.test ---
09:33:58 [2020-12-29T14:33:58.406Z] [INFO] 
09:33:58 [2020-12-29T14:33:58.406Z] [INFO] --- tycho-packaging-plugin:1.5.0:build-qualifier (default-build-qualifier) @ org.eclipse.ease.lang.scriptarchive.test ---
09:33:58 [2020-12-29T14:33:58.406Z] [INFO] The project's OSGi version is 0.8.0.I201910171213
09:33:58 [2020-12-29T14:33:58.406Z] [INFO] 
09:33:58 [2020-12-29T14:33:58.406Z] [INFO] --- tycho-packaging-plugin:1.5.0:validate-id (default-validate-id) @ org.eclipse.ease.lang.scriptarchive.test ---
09:33:58 [2020-12-29T14:33:58.406Z] [INFO] 
09:33:58 [2020-12-29T14:33:58.406Z] [INFO] --- tycho-packaging-plugin:1.5.0:validate-version (default-validate-version) @ org.eclipse.ease.lang.scriptarchive.test ---
09:33:58 [2020-12-29T14:33:58.406Z] [INFO] 
09:33:58 [2020-12-29T14:33:58.406Z] [INFO] >>> maven-javadoc-plugin:2.9.1:javadoc (build-docs) > generate-sources @ org.eclipse.ease.lang.scriptarchive.test >>>
09:33:58 [2020-12-29T14:33:58.406Z] [INFO] 
09:33:58 [2020-12-29T14:33:58.406Z] [INFO] --- tycho-packaging-plugin:1.5.0:build-qualifier (default-build-qualifier) @ org.eclipse.ease.lang.scriptarchive.test ---
09:33:58 [2020-12-29T14:33:58.406Z] [INFO] The project's OSGi version is 0.8.0.I201910171213
09:33:58 [2020-12-29T14:33:58.406Z] [INFO] 
09:33:58 [2020-12-29T14:33:58.406Z] [INFO] --- tycho-packaging-plugin:1.5.0:validate-id (default-validate-id) @ org.eclipse.ease.lang.scriptarchive.test ---
09:33:58 [2020-12-29T14:33:58.406Z] [INFO] 
09:33:58 [2020-12-29T14:33:58.406Z] [INFO] --- tycho-packaging-plugin:1.5.0:validate-version (default-validate-version) @ org.eclipse.ease.lang.scriptarchive.test ---
09:33:58 [2020-12-29T14:33:58.406Z] [INFO] 
09:33:58 [2020-12-29T14:33:58.406Z] [INFO] <<< maven-javadoc-plugin:2.9.1:javadoc (build-docs) < generate-sources @ org.eclipse.ease.lang.scriptarchive.test <<<
09:33:58 [2020-12-29T14:33:58.406Z] [INFO] 
09:33:58 [2020-12-29T14:33:58.406Z] [INFO] 
09:33:58 [2020-12-29T14:33:58.406Z] [INFO] --- maven-javadoc-plugin:2.9.1:javadoc (build-docs) @ org.eclipse.ease.lang.scriptarchive.test ---
09:33:58 [2020-12-29T14:33:58.663Z] [ERROR] Error fetching link: http://help.eclipse.org/oxygen/topic/org.eclipse.platform.doc.isv/reference/api/package-list. Ignored it.
09:33:58 [2020-12-29T14:33:58.663Z] [ERROR] Error fetching link: https://ci.eclipse.org/ease/job/ease.build.core/JavaDoc/package-list. Ignored it.
09:33:59 [2020-12-29T14:33:59.599Z] [INFO] 
09:33:59 [2020-12-29T14:33:59.599Z] Loading source files for package org.eclipse.ease.lang.scriptarchive...
09:33:59 [2020-12-29T14:33:59.599Z] Constructing Javadoc information...
09:33:59 [2020-12-29T14:33:59.599Z] No plugin definition found, skipping
09:33:59 [2020-12-29T14:33:59.599Z] No plugin definition found, skipping
09:33:59 [2020-12-29T14:33:59.599Z] [WARNING] Javadoc Warnings
09:33:59 [2020-12-29T14:33:59.599Z] [WARNING] Picked up JAVA_TOOL_OPTIONS: -Dmaven.ext.class.path="/home/jenkins/agent/workspace/ease.verify.core.target.2019-06@tmp/withMaven52a3c32c/pipeline-maven-spy.jar" -Dorg.jenkinsci.plugins.pipeline.maven.reportsFolder="/home/jenkins/agent/workspace/ease.verify.core.target.2019-06@tmp/withMaven52a3c32c"
09:33:59 [2020-12-29T14:33:59.599Z] [WARNING] javadoc: warning - The old Doclet and Taglet APIs in the packages
09:33:59 [2020-12-29T14:33:59.599Z] [WARNING] com.sun.javadoc, com.sun.tools.doclets and their implementations
09:33:59 [2020-12-29T14:33:59.599Z] [WARNING] are planned to be removed in a future JDK release. These
09:33:59 [2020-12-29T14:33:59.599Z] [WARNING] components have been superseded by the new APIs in jdk.javadoc.doclet.
09:33:59 [2020-12-29T14:33:59.599Z] [WARNING] Users are strongly recommended to migrate to the new APIs.
09:33:59 [2020-12-29T14:33:59.599Z] [INFO] 
09:33:59 [2020-12-29T14:33:59.600Z] [INFO] --- build-helper-maven-plugin:1.9.1:add-resource (add_help) @ org.eclipse.ease.lang.scriptarchive.test ---
09:33:59 [2020-12-29T14:33:59.600Z] [INFO] 
09:33:59 [2020-12-29T14:33:59.600Z] [INFO] --- maven-resources-plugin:2.4.3:resources (default-resources) @ org.eclipse.ease.lang.scriptarchive.test ---
09:33:59 [2020-12-29T14:33:59.600Z] [INFO] Using 'UTF-8' encoding to copy filtered resources.
09:33:59 [2020-12-29T14:33:59.600Z] [INFO] skip non existing resourceDirectory /home/jenkins/agent/workspace/ease.verify.core.target.2019-06/tests/org.eclipse.ease.lang.scriptarchive.test/src/main/resources
09:33:59 [2020-12-29T14:33:59.600Z] [INFO] skip non existing resourceDirectory /home/jenkins/agent/workspace/ease.verify.core.target.2019-06/tests/org.eclipse.ease.lang.scriptarchive.test/help
09:33:59 [2020-12-29T14:33:59.600Z] [INFO] 
09:33:59 [2020-12-29T14:33:59.600Z] [INFO] --- tycho-compiler-plugin:1.5.0:compile (default-compile) @ org.eclipse.ease.lang.scriptarchive.test ---
09:33:59 [2020-12-29T14:33:59.600Z] [INFO] Compiling 1 source file to /home/jenkins/agent/workspace/ease.verify.core.target.2019-06/tests/org.eclipse.ease.lang.scriptarchive.test/target/classes
09:33:59 [2020-12-29T14:33:59.899Z] [INFO] 
09:33:59 [2020-12-29T14:33:59.899Z] [INFO] --- maven-resources-plugin:2.4.3:testResources (default-testResources) @ org.eclipse.ease.lang.scriptarchive.test ---
09:33:59 [2020-12-29T14:33:59.899Z] [INFO] Using 'UTF-8' encoding to copy filtered resources.
09:33:59 [2020-12-29T14:33:59.899Z] [INFO] skip non existing resourceDirectory /home/jenkins/agent/workspace/ease.verify.core.target.2019-06/tests/org.eclipse.ease.lang.scriptarchive.test/src/test/resources
09:33:59 [2020-12-29T14:33:59.899Z] [INFO] 
09:33:59 [2020-12-29T14:33:59.900Z] [INFO] --- tycho-source-plugin:1.5.0:plugin-source (plugin-source) @ org.eclipse.ease.lang.scriptarchive.test ---
09:33:59 [2020-12-29T14:33:59.900Z] [INFO] Building jar: /home/jenkins/agent/workspace/ease.verify.core.target.2019-06/tests/org.eclipse.ease.lang.scriptarchive.test/target/org.eclipse.ease.lang.scriptarchive.test-0.8.0-SNAPSHOT-sources.jar
09:33:59 [2020-12-29T14:33:59.900Z] [INFO] 
09:33:59 [2020-12-29T14:33:59.900Z] [INFO] --- target-platform-configuration:1.5.0:target-platform (default-target-platform) @ org.eclipse.ease.lang.scriptarchive.test ---
09:33:59 [2020-12-29T14:33:59.900Z] [INFO] 
09:33:59 [2020-12-29T14:33:59.900Z] [INFO] --- tycho-packaging-plugin:1.5.0:package-plugin (default-package-plugin) @ org.eclipse.ease.lang.scriptarchive.test ---
09:33:59 [2020-12-29T14:33:59.900Z] [INFO] Building jar: /home/jenkins/agent/workspace/ease.verify.core.target.2019-06/tests/org.eclipse.ease.lang.scriptarchive.test/target/org.eclipse.ease.lang.scriptarchive.test-0.8.0-SNAPSHOT.jar
09:33:59 [2020-12-29T14:33:59.900Z] [INFO] 
09:33:59 [2020-12-29T14:33:59.900Z] [INFO] --- tycho-p2-plugin:1.5.0:p2-metadata-default (default-p2-metadata-default) @ org.eclipse.ease.lang.scriptarchive.test ---
09:33:59 [2020-12-29T14:33:59.900Z] [INFO] 
09:33:59 [2020-12-29T14:33:59.900Z] [INFO] --- tycho-source-feature-plugin:1.5.0:source-feature (source-feature) @ org.eclipse.ease.lang.scriptarchive.test ---
09:33:59 [2020-12-29T14:33:59.900Z] [INFO] 
09:33:59 [2020-12-29T14:33:59.900Z] [INFO] --- tycho-p2-plugin:1.5.0:p2-metadata (attached-p2-metadata) @ org.eclipse.ease.lang.scriptarchive.test ---
09:33:59 [2020-12-29T14:33:59.900Z] [INFO] 
09:33:59 [2020-12-29T14:33:59.900Z] [INFO] --- tycho-surefire-plugin:1.5.0:test (default-test) @ org.eclipse.ease.lang.scriptarchive.test ---
09:33:59 [2020-12-29T14:33:59.900Z] [INFO] Expected eclipse log file: /home/jenkins/agent/workspace/ease.verify.core.target.2019-06/tests/org.eclipse.ease.lang.scriptarchive.test/target/work/data/.metadata/.log
09:33:59 [2020-12-29T14:33:59.900Z] [INFO] Command line:
09:33:59 [2020-12-29T14:33:59.900Z] 	[/opt/tools/java/openjdk/jdk-11/11.0.2+9/bin/java, -Dosgi.noShutdown=false, -Dosgi.os=linux, -Dosgi.ws=gtk, -Dosgi.arch=x86_64, -Dosgi.clean=true, -jar, /home/jenkins/.m2/repository/p2/osgi/bundle/org.eclipse.equinox.launcher/1.5.800.v20200727-1323/org.eclipse.equinox.launcher-1.5.800.v20200727-1323.jar, -data, /home/jenkins/agent/workspace/ease.verify.core.target.2019-06/tests/org.eclipse.ease.lang.scriptarchive.test/target/work/data, -install, /home/jenkins/agent/workspace/ease.verify.core.target.2019-06/tests/org.eclipse.ease.lang.scriptarchive.test/target/work, -configuration, /home/jenkins/agent/workspace/ease.verify.core.target.2019-06/tests/org.eclipse.ease.lang.scriptarchive.test/target/work/configuration, -application, org.eclipse.tycho.surefire.osgibooter.headlesstest, -testproperties, /home/jenkins/agent/workspace/ease.verify.core.target.2019-06/tests/org.eclipse.ease.lang.scriptarchive.test/target/surefire.properties]
09:33:59 [2020-12-29T14:33:59.900Z] Picked up JAVA_TOOL_OPTIONS: -Dmaven.ext.class.path="/home/jenkins/agent/workspace/ease.verify.core.target.2019-06@tmp/withMaven52a3c32c/pipeline-maven-spy.jar" -Dorg.jenkinsci.plugins.pipeline.maven.reportsFolder="/home/jenkins/agent/workspace/ease.verify.core.target.2019-06@tmp/withMaven52a3c32c" 
09:34:01 [2020-12-29T14:34:01.861Z] Running org.eclipse.ease.lang.scriptarchive.ArchiveEngineTest
09:34:02 [2020-12-29T14:34:02.117Z] We are running from a zip file!
09:34:02 [2020-12-29T14:34:02.117Z] org.eclipse.ease.ScriptExecutionException: SyntaxError: missing ; before statement (workspace://__EASE_ScriptArchive_1/scripts/Master.js#3)
09:34:02 [2020-12-29T14:34:02.117Z] this is an error
09:34:02 [2020-12-29T14:34:02.117Z]        ^
09:34:02 [2020-12-29T14:34:02.117Z] 	at Master.js,workspace://__EASE_ScriptArchive_1/scripts/Master.js
09:34:02 [2020-12-29T14:34:02.117Z] org.eclipse.ease.ScriptExecutionException: SyntaxError: missing ; before statement (workspace://__EASE_ScriptArchive_1/scripts/Master.js#3)
09:34:02 [2020-12-29T14:34:02.117Z] this is an error
09:34:02 [2020-12-29T14:34:02.117Z]        ^
09:34:02 [2020-12-29T14:34:02.117Z] 	at Master.js,workspace://__EASE_ScriptArchive_1/scripts/Master.js
09:34:02 [2020-12-29T14:34:02.117Z] Tests run: 7, Failures: 0, Errors: 0, Skipped: 0, Time elapsed: 0.422 s - in org.eclipse.ease.lang.scriptarchive.ArchiveEngineTest
09:34:02 [2020-12-29T14:34:02.117Z] executeWithManifest(org.eclipse.ease.lang.scriptarchive.ArchiveEngineTest)  Time elapsed: 0.281 s
09:34:02 [2020-12-29T14:34:02.117Z] zipFileRegistration(org.eclipse.ease.lang.scriptarchive.ArchiveEngineTest)  Time elapsed: 0.007 s
09:34:02 [2020-12-29T14:34:02.117Z] engineIdRegistration(org.eclipse.ease.lang.scriptarchive.ArchiveEngineTest)  Time elapsed: 0.001 s
09:34:02 [2020-12-29T14:34:02.117Z] jarFileRegistration(org.eclipse.ease.lang.scriptarchive.ArchiveEngineTest)  Time elapsed: 0 s
09:34:02 [2020-12-29T14:34:02.117Z] sarFileRegistration(org.eclipse.ease.lang.scriptarchive.ArchiveEngineTest)  Time elapsed: 0 s
09:34:02 [2020-12-29T14:34:02.117Z] executeWithErrors(org.eclipse.ease.lang.scriptarchive.ArchiveEngineTest)  Time elapsed: 0.07 s
09:34:02 [2020-12-29T14:34:02.117Z] executeWithIncludes(org.eclipse.ease.lang.scriptarchive.ArchiveEngineTest)  Time elapsed: 0.039 s
09:34:02 [2020-12-29T14:34:02.117Z] 
09:34:02 [2020-12-29T14:34:02.117Z] Results:
09:34:02 [2020-12-29T14:34:02.117Z] 
09:34:02 [2020-12-29T14:34:02.117Z] Tests run: 7, Failures: 0, Errors: 0, Skipped: 0
09:34:02 [2020-12-29T14:34:02.117Z] 
09:34:03 [2020-12-29T14:34:03.044Z] [INFO] All tests passed!
09:34:03 [2020-12-29T14:34:03.044Z] [INFO] 
09:34:03 [2020-12-29T14:34:03.044Z] [INFO] --- maven-install-plugin:2.3.1:install (default-install) @ org.eclipse.ease.lang.scriptarchive.test ---
09:34:03 [2020-12-29T14:34:03.044Z] [INFO] Installing /home/jenkins/agent/workspace/ease.verify.core.target.2019-06/tests/org.eclipse.ease.lang.scriptarchive.test/target/org.eclipse.ease.lang.scriptarchive.test-0.8.0-SNAPSHOT.jar to /home/jenkins/.m2/repository/org/eclipse/ease/org.eclipse.ease.lang.scriptarchive.test/0.8.0-SNAPSHOT/org.eclipse.ease.lang.scriptarchive.test-0.8.0-SNAPSHOT.jar
09:34:03 [2020-12-29T14:34:03.044Z] [INFO] Installing /home/jenkins/agent/workspace/ease.verify.core.target.2019-06/tests/org.eclipse.ease.lang.scriptarchive.test/pom.xml to /home/jenkins/.m2/repository/org/eclipse/ease/org.eclipse.ease.lang.scriptarchive.test/0.8.0-SNAPSHOT/org.eclipse.ease.lang.scriptarchive.test-0.8.0-SNAPSHOT.pom
09:34:03 [2020-12-29T14:34:03.044Z] [INFO] Installing /home/jenkins/agent/workspace/ease.verify.core.target.2019-06/tests/org.eclipse.ease.lang.scriptarchive.test/target/org.eclipse.ease.lang.scriptarchive.test-0.8.0-SNAPSHOT-sources.jar to /home/jenkins/.m2/repository/org/eclipse/ease/org.eclipse.ease.lang.scriptarchive.test/0.8.0-SNAPSHOT/org.eclipse.ease.lang.scriptarchive.test-0.8.0-SNAPSHOT-sources.jar
09:34:03 [2020-12-29T14:34:03.044Z] [INFO] Installing /home/jenkins/agent/workspace/ease.verify.core.target.2019-06/tests/org.eclipse.ease.lang.scriptarchive.test/target/p2content.xml to /home/jenkins/.m2/repository/org/eclipse/ease/org.eclipse.ease.lang.scriptarchive.test/0.8.0-SNAPSHOT/org.eclipse.ease.lang.scriptarchive.test-0.8.0-SNAPSHOT-p2metadata.xml
09:34:03 [2020-12-29T14:34:03.044Z] [INFO] Installing /home/jenkins/agent/workspace/ease.verify.core.target.2019-06/tests/org.eclipse.ease.lang.scriptarchive.test/target/p2artifacts.xml to /home/jenkins/.m2/repository/org/eclipse/ease/org.eclipse.ease.lang.scriptarchive.test/0.8.0-SNAPSHOT/org.eclipse.ease.lang.scriptarchive.test-0.8.0-SNAPSHOT-p2artifacts.xml
09:34:03 [2020-12-29T14:34:03.044Z] [INFO] Installing /home/jenkins/agent/workspace/ease.verify.core.target.2019-06/tests/org.eclipse.ease.lang.scriptarchive.test/target/p2content.xml to /home/jenkins/.m2/repository/org/eclipse/ease/org.eclipse.ease.lang.scriptarchive.test/0.8.0-SNAPSHOT/org.eclipse.ease.lang.scriptarchive.test-0.8.0-SNAPSHOT-p2metadata.xml
09:34:03 [2020-12-29T14:34:03.044Z] [INFO] Installing /home/jenkins/agent/workspace/ease.verify.core.target.2019-06/tests/org.eclipse.ease.lang.scriptarchive.test/target/p2artifacts.xml to /home/jenkins/.m2/repository/org/eclipse/ease/org.eclipse.ease.lang.scriptarchive.test/0.8.0-SNAPSHOT/org.eclipse.ease.lang.scriptarchive.test-0.8.0-SNAPSHOT-p2artifacts.xml
09:34:03 [2020-12-29T14:34:03.044Z] [INFO] 
09:34:03 [2020-12-29T14:34:03.044Z] [INFO] --- tycho-p2-plugin:1.5.0:update-local-index (default-update-local-index) @ org.eclipse.ease.lang.scriptarchive.test ---
09:34:03 [2020-12-29T14:34:03.044Z] [INFO] 
09:34:03 [2020-12-29T14:34:03.044Z] [INFO] --------< org.eclipse.ease:org.eclipse.ease.lang.unittest.test >--------
09:34:03 [2020-12-29T14:34:03.044Z] [INFO] Building org.eclipse.ease.lang.unittest.test 0.8.0-SNAPSHOT      [45/48]
09:34:03 [2020-12-29T14:34:03.044Z] [INFO] ------------------------[ eclipse-test-plugin ]-------------------------
09:34:03 [2020-12-29T14:34:03.044Z] [INFO] 
09:34:03 [2020-12-29T14:34:03.044Z] [INFO] --- maven-clean-plugin:2.5:clean (default-clean) @ org.eclipse.ease.lang.unittest.test ---
09:34:03 [2020-12-29T14:34:03.044Z] [INFO] 
09:34:03 [2020-12-29T14:34:03.044Z] [INFO] --- tycho-packaging-plugin:1.5.0:build-qualifier (default-build-qualifier) @ org.eclipse.ease.lang.unittest.test ---
09:34:03 [2020-12-29T14:34:03.044Z] [INFO] The project's OSGi version is 0.8.0.I202009240747
09:34:03 [2020-12-29T14:34:03.044Z] [INFO] 
09:34:03 [2020-12-29T14:34:03.044Z] [INFO] --- tycho-packaging-plugin:1.5.0:validate-id (default-validate-id) @ org.eclipse.ease.lang.unittest.test ---
09:34:03 [2020-12-29T14:34:03.044Z] [INFO] 
09:34:03 [2020-12-29T14:34:03.044Z] [INFO] --- tycho-packaging-plugin:1.5.0:validate-version (default-validate-version) @ org.eclipse.ease.lang.unittest.test ---
09:34:03 [2020-12-29T14:34:03.044Z] [INFO] 
09:34:03 [2020-12-29T14:34:03.044Z] [INFO] >>> maven-javadoc-plugin:2.9.1:javadoc (build-docs) > generate-sources @ org.eclipse.ease.lang.unittest.test >>>
09:34:03 [2020-12-29T14:34:03.044Z] [INFO] 
09:34:03 [2020-12-29T14:34:03.044Z] [INFO] --- tycho-packaging-plugin:1.5.0:build-qualifier (default-build-qualifier) @ org.eclipse.ease.lang.unittest.test ---
09:34:03 [2020-12-29T14:34:03.044Z] [INFO] The project's OSGi version is 0.8.0.I202009240747
09:34:03 [2020-12-29T14:34:03.044Z] [INFO] 
09:34:03 [2020-12-29T14:34:03.045Z] [INFO] --- tycho-packaging-plugin:1.5.0:validate-id (default-validate-id) @ org.eclipse.ease.lang.unittest.test ---
09:34:03 [2020-12-29T14:34:03.045Z] [INFO] 
09:34:03 [2020-12-29T14:34:03.045Z] [INFO] --- tycho-packaging-plugin:1.5.0:validate-version (default-validate-version) @ org.eclipse.ease.lang.unittest.test ---
09:34:03 [2020-12-29T14:34:03.045Z] [INFO] 
09:34:03 [2020-12-29T14:34:03.045Z] [INFO] <<< maven-javadoc-plugin:2.9.1:javadoc (build-docs) < generate-sources @ org.eclipse.ease.lang.unittest.test <<<
09:34:03 [2020-12-29T14:34:03.045Z] [INFO] 
09:34:03 [2020-12-29T14:34:03.045Z] [INFO] 
09:34:03 [2020-12-29T14:34:03.045Z] [INFO] --- maven-javadoc-plugin:2.9.1:javadoc (build-docs) @ org.eclipse.ease.lang.unittest.test ---
09:34:03 [2020-12-29T14:34:03.045Z] [ERROR] Error fetching link: http://help.eclipse.org/oxygen/topic/org.eclipse.platform.doc.isv/reference/api/package-list. Ignored it.
09:34:03 [2020-12-29T14:34:03.045Z] [ERROR] Error fetching link: https://ci.eclipse.org/ease/job/ease.build.core/JavaDoc/package-list. Ignored it.
09:34:03 [2020-12-29T14:34:03.972Z] [INFO] 
09:34:03 [2020-12-29T14:34:03.972Z] Loading source files for package org.eclipse.ease.lang.unittest...
09:34:03 [2020-12-29T14:34:03.972Z] Constructing Javadoc information...
09:34:03 [2020-12-29T14:34:03.972Z] No plugin definition found, skipping
09:34:03 [2020-12-29T14:34:03.972Z] No plugin definition found, skipping
09:34:03 [2020-12-29T14:34:03.972Z] [WARNING] Javadoc Warnings
09:34:03 [2020-12-29T14:34:03.972Z] [WARNING] Picked up JAVA_TOOL_OPTIONS: -Dmaven.ext.class.path="/home/jenkins/agent/workspace/ease.verify.core.target.2019-06@tmp/withMaven52a3c32c/pipeline-maven-spy.jar" -Dorg.jenkinsci.plugins.pipeline.maven.reportsFolder="/home/jenkins/agent/workspace/ease.verify.core.target.2019-06@tmp/withMaven52a3c32c"
09:34:03 [2020-12-29T14:34:03.972Z] [WARNING] javadoc: warning - The old Doclet and Taglet APIs in the packages
09:34:03 [2020-12-29T14:34:03.972Z] [WARNING] com.sun.javadoc, com.sun.tools.doclets and their implementations
09:34:03 [2020-12-29T14:34:03.972Z] [WARNING] are planned to be removed in a future JDK release. These
09:34:03 [2020-12-29T14:34:03.972Z] [WARNING] components have been superseded by the new APIs in jdk.javadoc.doclet.
09:34:03 [2020-12-29T14:34:03.972Z] [WARNING] Users are strongly recommended to migrate to the new APIs.
09:34:03 [2020-12-29T14:34:03.972Z] [INFO] 
09:34:03 [2020-12-29T14:34:03.972Z] [INFO] --- build-helper-maven-plugin:1.9.1:add-resource (add_help) @ org.eclipse.ease.lang.unittest.test ---
09:34:03 [2020-12-29T14:34:03.972Z] [INFO] 
09:34:03 [2020-12-29T14:34:03.972Z] [INFO] --- maven-resources-plugin:2.4.3:resources (default-resources) @ org.eclipse.ease.lang.unittest.test ---
09:34:03 [2020-12-29T14:34:03.972Z] [INFO] Using 'UTF-8' encoding to copy filtered resources.
09:34:03 [2020-12-29T14:34:03.972Z] [INFO] skip non existing resourceDirectory /home/jenkins/agent/workspace/ease.verify.core.target.2019-06/tests/org.eclipse.ease.lang.unittest.test/src/main/resources
09:34:03 [2020-12-29T14:34:03.972Z] [INFO] skip non existing resourceDirectory /home/jenkins/agent/workspace/ease.verify.core.target.2019-06/tests/org.eclipse.ease.lang.unittest.test/help
09:34:03 [2020-12-29T14:34:03.972Z] [INFO] 
09:34:03 [2020-12-29T14:34:03.972Z] [INFO] --- tycho-compiler-plugin:1.5.0:compile (default-compile) @ org.eclipse.ease.lang.unittest.test ---
09:34:03 [2020-12-29T14:34:03.972Z] [INFO] Compiling 3 source files to /home/jenkins/agent/workspace/ease.verify.core.target.2019-06/tests/org.eclipse.ease.lang.unittest.test/target/classes
09:34:04 [2020-12-29T14:34:04.228Z] [INFO] 
09:34:04 [2020-12-29T14:34:04.228Z] [INFO] --- maven-resources-plugin:2.4.3:testResources (default-testResources) @ org.eclipse.ease.lang.unittest.test ---
09:34:04 [2020-12-29T14:34:04.228Z] [INFO] Using 'UTF-8' encoding to copy filtered resources.
09:34:04 [2020-12-29T14:34:04.228Z] [INFO] skip non existing resourceDirectory /home/jenkins/agent/workspace/ease.verify.core.target.2019-06/tests/org.eclipse.ease.lang.unittest.test/src/test/resources
09:34:04 [2020-12-29T14:34:04.228Z] [INFO] 
09:34:04 [2020-12-29T14:34:04.228Z] [INFO] --- tycho-source-plugin:1.5.0:plugin-source (plugin-source) @ org.eclipse.ease.lang.unittest.test ---
09:34:04 [2020-12-29T14:34:04.228Z] [WARNING] Bundle-Name header not found in /home/jenkins/agent/workspace/ease.verify.core.target.2019-06/tests/org.eclipse.ease.lang.unittest.test/META-INF/MANIFEST.MF, fallback to Bundle-SymbolicName for source bundle
09:34:04 [2020-12-29T14:34:04.228Z] [WARNING] Bundle-Vendor header not found in /home/jenkins/agent/workspace/ease.verify.core.target.2019-06/tests/org.eclipse.ease.lang.unittest.test/META-INF/MANIFEST.MF, fallback to 'unknown' for source bundle
09:34:04 [2020-12-29T14:34:04.228Z] [INFO] Building jar: /home/jenkins/agent/workspace/ease.verify.core.target.2019-06/tests/org.eclipse.ease.lang.unittest.test/target/org.eclipse.ease.lang.unittest.test-0.8.0-SNAPSHOT-sources.jar
09:34:04 [2020-12-29T14:34:04.228Z] [INFO] 
09:34:04 [2020-12-29T14:34:04.228Z] [INFO] --- target-platform-configuration:1.5.0:target-platform (default-target-platform) @ org.eclipse.ease.lang.unittest.test ---
09:34:04 [2020-12-29T14:34:04.228Z] [INFO] 
09:34:04 [2020-12-29T14:34:04.228Z] [INFO] --- tycho-packaging-plugin:1.5.0:package-plugin (default-package-plugin) @ org.eclipse.ease.lang.unittest.test ---
09:34:04 [2020-12-29T14:34:04.228Z] [INFO] Building jar: /home/jenkins/agent/workspace/ease.verify.core.target.2019-06/tests/org.eclipse.ease.lang.unittest.test/target/org.eclipse.ease.lang.unittest.test-0.8.0-SNAPSHOT.jar
09:34:04 [2020-12-29T14:34:04.228Z] [INFO] 
09:34:04 [2020-12-29T14:34:04.228Z] [INFO] --- tycho-p2-plugin:1.5.0:p2-metadata-default (default-p2-metadata-default) @ org.eclipse.ease.lang.unittest.test ---
09:34:04 [2020-12-29T14:34:04.228Z] [INFO] 
09:34:04 [2020-12-29T14:34:04.228Z] [INFO] --- tycho-source-feature-plugin:1.5.0:source-feature (source-feature) @ org.eclipse.ease.lang.unittest.test ---
09:34:04 [2020-12-29T14:34:04.228Z] [INFO] 
09:34:04 [2020-12-29T14:34:04.228Z] [INFO] --- tycho-p2-plugin:1.5.0:p2-metadata (attached-p2-metadata) @ org.eclipse.ease.lang.unittest.test ---
09:34:04 [2020-12-29T14:34:04.228Z] [INFO] 
09:34:04 [2020-12-29T14:34:04.228Z] [INFO] --- tycho-surefire-plugin:1.5.0:test (default-test) @ org.eclipse.ease.lang.unittest.test ---
09:34:04 [2020-12-29T14:34:04.228Z] [INFO] Expected eclipse log file: /home/jenkins/agent/workspace/ease.verify.core.target.2019-06/tests/org.eclipse.ease.lang.unittest.test/target/work/data/.metadata/.log
09:34:04 [2020-12-29T14:34:04.228Z] [INFO] Command line:
09:34:04 [2020-12-29T14:34:04.228Z] 	[/opt/tools/java/openjdk/jdk-11/11.0.2+9/bin/java, -Dosgi.noShutdown=false, -Dosgi.os=linux, -Dosgi.ws=gtk, -Dosgi.arch=x86_64, -Dosgi.clean=true, -jar, /home/jenkins/.m2/repository/p2/osgi/bundle/org.eclipse.equinox.launcher/1.5.800.v20200727-1323/org.eclipse.equinox.launcher-1.5.800.v20200727-1323.jar, -data, /home/jenkins/agent/workspace/ease.verify.core.target.2019-06/tests/org.eclipse.ease.lang.unittest.test/target/work/data, -install, /home/jenkins/agent/workspace/ease.verify.core.target.2019-06/tests/org.eclipse.ease.lang.unittest.test/target/work, -configuration, /home/jenkins/agent/workspace/ease.verify.core.target.2019-06/tests/org.eclipse.ease.lang.unittest.test/target/work/configuration, -application, org.eclipse.tycho.surefire.osgibooter.headlesstest, -testproperties, /home/jenkins/agent/workspace/ease.verify.core.target.2019-06/tests/org.eclipse.ease.lang.unittest.test/target/surefire.properties]
09:34:04 [2020-12-29T14:34:04.229Z] Picked up JAVA_TOOL_OPTIONS: -Dmaven.ext.class.path="/home/jenkins/agent/workspace/ease.verify.core.target.2019-06@tmp/withMaven52a3c32c/pipeline-maven-spy.jar" -Dorg.jenkinsci.plugins.pipeline.maven.reportsFolder="/home/jenkins/agent/workspace/ease.verify.core.target.2019-06@tmp/withMaven52a3c32c" 
09:34:06 [2020-12-29T14:34:06.799Z] Running org.eclipse.ease.lang.unittest.ClassicJavaScriptTest
09:34:07 [2020-12-29T14:34:07.766Z] Tests run: 7, Failures: 0, Errors: 0, Skipped: 0, Time elapsed: 1.445 s - in org.eclipse.ease.lang.unittest.ClassicJavaScriptTest
09:34:07 [2020-12-29T14:34:07.766Z] folderStatus(org.eclipse.ease.lang.unittest.ClassicJavaScriptTest)  Time elapsed: 0.603 s
09:34:07 [2020-12-29T14:34:07.766Z] errorTestStatus(org.eclipse.ease.lang.unittest.ClassicJavaScriptTest)  Time elapsed: 0.125 s
09:34:07 [2020-12-29T14:34:07.766Z] failureTestStatus(org.eclipse.ease.lang.unittest.ClassicJavaScriptTest)  Time elapsed: 0.141 s
09:34:07 [2020-12-29T14:34:07.766Z] verifyOutput(org.eclipse.ease.lang.unittest.ClassicJavaScriptTest)  Time elapsed: 0.147 s
09:34:07 [2020-12-29T14:34:07.766Z] suiteStatus(org.eclipse.ease.lang.unittest.ClassicJavaScriptTest)  Time elapsed: 0.109 s
09:34:07 [2020-12-29T14:34:07.766Z] ignoreTestStatus(org.eclipse.ease.lang.unittest.ClassicJavaScriptTest)  Time elapsed: 0.156 s
09:34:07 [2020-12-29T14:34:07.766Z] passTestStatus(org.eclipse.ease.lang.unittest.ClassicJavaScriptTest)  Time elapsed: 0.093 s
09:34:07 [2020-12-29T14:34:07.766Z] Running org.eclipse.ease.lang.unittest.ModernJavaScriptTest
09:34:08 [2020-12-29T14:34:08.722Z] Tests run: 8, Failures: 0, Errors: 0, Skipped: 0, Time elapsed: 0.756 s - in org.eclipse.ease.lang.unittest.ModernJavaScriptTest
09:34:08 [2020-12-29T14:34:08.722Z] folderStatus(org.eclipse.ease.lang.unittest.ModernJavaScriptTest)  Time elapsed: 0.118 s
09:34:08 [2020-12-29T14:34:08.722Z] verifyOutput(org.eclipse.ease.lang.unittest.ModernJavaScriptTest)  Time elapsed: 0.116 s
09:34:08 [2020-12-29T14:34:08.722Z] suiteStatus(org.eclipse.ease.lang.unittest.ModernJavaScriptTest)  Time elapsed: 0.108 s
09:34:08 [2020-12-29T14:34:08.722Z] ignoreTestStatus(org.eclipse.ease.lang.unittest.ModernJavaScriptTest)  Time elapsed: 0.093 s
09:34:08 [2020-12-29T14:34:08.722Z] ignoreTestClassStatus(org.eclipse.ease.lang.unittest.ModernJavaScriptTest)  Time elapsed: 0.089 s
09:34:08 [2020-12-29T14:34:08.722Z] failureTestClassStatus(org.eclipse.ease.lang.unittest.ModernJavaScriptTest)  Time elapsed: 0.088 s
09:34:08 [2020-12-29T14:34:08.722Z] errorTestClassStatus(org.eclipse.ease.lang.unittest.ModernJavaScriptTest)  Time elapsed: 0.084 s
09:34:08 [2020-12-29T14:34:08.722Z] passTestClassStatus(org.eclipse.ease.lang.unittest.ModernJavaScriptTest)  Time elapsed: 0.057 s
09:34:08 [2020-12-29T14:34:08.722Z] 
09:34:08 [2020-12-29T14:34:08.722Z] Results:
09:34:08 [2020-12-29T14:34:08.722Z] 
09:34:08 [2020-12-29T14:34:08.722Z] Tests run: 15, Failures: 0, Errors: 0, Skipped: 0
09:34:08 [2020-12-29T14:34:08.722Z] 
09:34:08 [2020-12-29T14:34:08.978Z] [INFO] All tests passed!
09:34:08 [2020-12-29T14:34:08.978Z] [INFO] 
09:34:08 [2020-12-29T14:34:08.978Z] [INFO] --- maven-install-plugin:2.3.1:install (default-install) @ org.eclipse.ease.lang.unittest.test ---
09:34:08 [2020-12-29T14:34:08.978Z] [INFO] Installing /home/jenkins/agent/workspace/ease.verify.core.target.2019-06/tests/org.eclipse.ease.lang.unittest.test/target/org.eclipse.ease.lang.unittest.test-0.8.0-SNAPSHOT.jar to /home/jenkins/.m2/repository/org/eclipse/ease/org.eclipse.ease.lang.unittest.test/0.8.0-SNAPSHOT/org.eclipse.ease.lang.unittest.test-0.8.0-SNAPSHOT.jar
09:34:09 [2020-12-29T14:34:09.233Z] [INFO] Installing /home/jenkins/agent/workspace/ease.verify.core.target.2019-06/tests/org.eclipse.ease.lang.unittest.test/pom.xml to /home/jenkins/.m2/repository/org/eclipse/ease/org.eclipse.ease.lang.unittest.test/0.8.0-SNAPSHOT/org.eclipse.ease.lang.unittest.test-0.8.0-SNAPSHOT.pom
09:34:09 [2020-12-29T14:34:09.233Z] [INFO] Installing /home/jenkins/agent/workspace/ease.verify.core.target.2019-06/tests/org.eclipse.ease.lang.unittest.test/target/org.eclipse.ease.lang.unittest.test-0.8.0-SNAPSHOT-sources.jar to /home/jenkins/.m2/repository/org/eclipse/ease/org.eclipse.ease.lang.unittest.test/0.8.0-SNAPSHOT/org.eclipse.ease.lang.unittest.test-0.8.0-SNAPSHOT-sources.jar
09:34:09 [2020-12-29T14:34:09.233Z] [INFO] Installing /home/jenkins/agent/workspace/ease.verify.core.target.2019-06/tests/org.eclipse.ease.lang.unittest.test/target/p2content.xml to /home/jenkins/.m2/repository/org/eclipse/ease/org.eclipse.ease.lang.unittest.test/0.8.0-SNAPSHOT/org.eclipse.ease.lang.unittest.test-0.8.0-SNAPSHOT-p2metadata.xml
09:34:09 [2020-12-29T14:34:09.233Z] [INFO] Installing /home/jenkins/agent/workspace/ease.verify.core.target.2019-06/tests/org.eclipse.ease.lang.unittest.test/target/p2artifacts.xml to /home/jenkins/.m2/repository/org/eclipse/ease/org.eclipse.ease.lang.unittest.test/0.8.0-SNAPSHOT/org.eclipse.ease.lang.unittest.test-0.8.0-SNAPSHOT-p2artifacts.xml
09:34:09 [2020-12-29T14:34:09.234Z] [INFO] Installing /home/jenkins/agent/workspace/ease.verify.core.target.2019-06/tests/org.eclipse.ease.lang.unittest.test/target/p2content.xml to /home/jenkins/.m2/repository/org/eclipse/ease/org.eclipse.ease.lang.unittest.test/0.8.0-SNAPSHOT/org.eclipse.ease.lang.unittest.test-0.8.0-SNAPSHOT-p2metadata.xml
09:34:09 [2020-12-29T14:34:09.234Z] [INFO] Installing /home/jenkins/agent/workspace/ease.verify.core.target.2019-06/tests/org.eclipse.ease.lang.unittest.test/target/p2artifacts.xml to /home/jenkins/.m2/repository/org/eclipse/ease/org.eclipse.ease.lang.unittest.test/0.8.0-SNAPSHOT/org.eclipse.ease.lang.unittest.test-0.8.0-SNAPSHOT-p2artifacts.xml
09:34:09 [2020-12-29T14:34:09.234Z] [INFO] 
09:34:09 [2020-12-29T14:34:09.234Z] [INFO] --- tycho-p2-plugin:1.5.0:update-local-index (default-update-local-index) @ org.eclipse.ease.lang.unittest.test ---
09:34:09 [2020-12-29T14:34:09.234Z] [INFO] 
09:34:09 [2020-12-29T14:34:09.234Z] [INFO] ---------< org.eclipse.ease:org.eclipse.ease.ui.scripts.test >----------
09:34:09 [2020-12-29T14:34:09.234Z] [INFO] Building org.eclipse.ease.ui.scripts.test 0.8.0-SNAPSHOT         [46/48]
09:34:09 [2020-12-29T14:34:09.234Z] [INFO] ------------------------[ eclipse-test-plugin ]-------------------------
09:34:09 [2020-12-29T14:34:09.234Z] [INFO] 
09:34:09 [2020-12-29T14:34:09.234Z] [INFO] --- maven-clean-plugin:2.5:clean (default-clean) @ org.eclipse.ease.ui.scripts.test ---
09:34:09 [2020-12-29T14:34:09.234Z] [INFO] 
09:34:09 [2020-12-29T14:34:09.234Z] [INFO] --- tycho-packaging-plugin:1.5.0:build-qualifier (default-build-qualifier) @ org.eclipse.ease.ui.scripts.test ---
09:34:09 [2020-12-29T14:34:09.234Z] [INFO] The project's OSGi version is 0.8.0.I202009240747
09:34:09 [2020-12-29T14:34:09.234Z] [INFO] 
09:34:09 [2020-12-29T14:34:09.234Z] [INFO] --- tycho-packaging-plugin:1.5.0:validate-id (default-validate-id) @ org.eclipse.ease.ui.scripts.test ---
09:34:09 [2020-12-29T14:34:09.234Z] [INFO] 
09:34:09 [2020-12-29T14:34:09.234Z] [INFO] --- tycho-packaging-plugin:1.5.0:validate-version (default-validate-version) @ org.eclipse.ease.ui.scripts.test ---
09:34:09 [2020-12-29T14:34:09.234Z] [INFO] 
09:34:09 [2020-12-29T14:34:09.234Z] [INFO] >>> maven-javadoc-plugin:2.9.1:javadoc (build-docs) > generate-sources @ org.eclipse.ease.ui.scripts.test >>>
09:34:09 [2020-12-29T14:34:09.234Z] [INFO] 
09:34:09 [2020-12-29T14:34:09.234Z] [INFO] --- tycho-packaging-plugin:1.5.0:build-qualifier (default-build-qualifier) @ org.eclipse.ease.ui.scripts.test ---
09:34:09 [2020-12-29T14:34:09.234Z] [INFO] The project's OSGi version is 0.8.0.I202009240747
09:34:09 [2020-12-29T14:34:09.234Z] [INFO] 
09:34:09 [2020-12-29T14:34:09.234Z] [INFO] --- tycho-packaging-plugin:1.5.0:validate-id (default-validate-id) @ org.eclipse.ease.ui.scripts.test ---
09:34:09 [2020-12-29T14:34:09.234Z] [INFO] 
09:34:09 [2020-12-29T14:34:09.234Z] [INFO] --- tycho-packaging-plugin:1.5.0:validate-version (default-validate-version) @ org.eclipse.ease.ui.scripts.test ---
09:34:09 [2020-12-29T14:34:09.234Z] [INFO] 
09:34:09 [2020-12-29T14:34:09.234Z] [INFO] <<< maven-javadoc-plugin:2.9.1:javadoc (build-docs) < generate-sources @ org.eclipse.ease.ui.scripts.test <<<
09:34:09 [2020-12-29T14:34:09.234Z] [INFO] 
09:34:09 [2020-12-29T14:34:09.234Z] [INFO] 
09:34:09 [2020-12-29T14:34:09.234Z] [INFO] --- maven-javadoc-plugin:2.9.1:javadoc (build-docs) @ org.eclipse.ease.ui.scripts.test ---
09:34:09 [2020-12-29T14:34:09.234Z] [ERROR] Error fetching link: http://help.eclipse.org/oxygen/topic/org.eclipse.platform.doc.isv/reference/api/package-list. Ignored it.
09:34:09 [2020-12-29T14:34:09.234Z] [ERROR] Error fetching link: https://ci.eclipse.org/ease/job/ease.build.core/JavaDoc/package-list. Ignored it.
09:34:10 [2020-12-29T14:34:10.170Z] [INFO] 
09:34:10 [2020-12-29T14:34:10.170Z] Loading source files for package org.eclipse.ease.ui.scripts.expressions.definitions...
09:34:10 [2020-12-29T14:34:10.170Z] Constructing Javadoc information...
09:34:10 [2020-12-29T14:34:10.170Z] No plugin definition found, skipping
09:34:10 [2020-12-29T14:34:10.170Z] No plugin definition found, skipping
09:34:10 [2020-12-29T14:34:10.170Z] [WARNING] Javadoc Warnings
09:34:10 [2020-12-29T14:34:10.170Z] [WARNING] Picked up JAVA_TOOL_OPTIONS: -Dmaven.ext.class.path="/home/jenkins/agent/workspace/ease.verify.core.target.2019-06@tmp/withMaven52a3c32c/pipeline-maven-spy.jar" -Dorg.jenkinsci.plugins.pipeline.maven.reportsFolder="/home/jenkins/agent/workspace/ease.verify.core.target.2019-06@tmp/withMaven52a3c32c"
09:34:10 [2020-12-29T14:34:10.170Z] [WARNING] javadoc: warning - The old Doclet and Taglet APIs in the packages
09:34:10 [2020-12-29T14:34:10.170Z] [WARNING] com.sun.javadoc, com.sun.tools.doclets and their implementations
09:34:10 [2020-12-29T14:34:10.170Z] [WARNING] are planned to be removed in a future JDK release. These
09:34:10 [2020-12-29T14:34:10.170Z] [WARNING] components have been superseded by the new APIs in jdk.javadoc.doclet.
09:34:10 [2020-12-29T14:34:10.171Z] [WARNING] Users are strongly recommended to migrate to the new APIs.
09:34:10 [2020-12-29T14:34:10.171Z] [INFO] 
09:34:10 [2020-12-29T14:34:10.171Z] [INFO] --- build-helper-maven-plugin:1.9.1:add-resource (add_help) @ org.eclipse.ease.ui.scripts.test ---
09:34:10 [2020-12-29T14:34:10.171Z] [INFO] 
09:34:10 [2020-12-29T14:34:10.171Z] [INFO] --- maven-resources-plugin:2.4.3:resources (default-resources) @ org.eclipse.ease.ui.scripts.test ---
09:34:10 [2020-12-29T14:34:10.171Z] [INFO] Using 'UTF-8' encoding to copy filtered resources.
09:34:10 [2020-12-29T14:34:10.171Z] [INFO] skip non existing resourceDirectory /home/jenkins/agent/workspace/ease.verify.core.target.2019-06/tests/org.eclipse.ease.ui.scripts.test/src/main/resources
09:34:10 [2020-12-29T14:34:10.171Z] [INFO] skip non existing resourceDirectory /home/jenkins/agent/workspace/ease.verify.core.target.2019-06/tests/org.eclipse.ease.ui.scripts.test/help
09:34:10 [2020-12-29T14:34:10.171Z] [INFO] 
09:34:10 [2020-12-29T14:34:10.171Z] [INFO] --- tycho-compiler-plugin:1.5.0:compile (default-compile) @ org.eclipse.ease.ui.scripts.test ---
09:34:10 [2020-12-29T14:34:10.171Z] [INFO] Compiling 1 source file to /home/jenkins/agent/workspace/ease.verify.core.target.2019-06/tests/org.eclipse.ease.ui.scripts.test/target/classes
09:34:10 [2020-12-29T14:34:10.171Z] [INFO] 
09:34:10 [2020-12-29T14:34:10.171Z] [INFO] --- maven-resources-plugin:2.4.3:testResources (default-testResources) @ org.eclipse.ease.ui.scripts.test ---
09:34:10 [2020-12-29T14:34:10.171Z] [INFO] Using 'UTF-8' encoding to copy filtered resources.
09:34:10 [2020-12-29T14:34:10.171Z] [INFO] skip non existing resourceDirectory /home/jenkins/agent/workspace/ease.verify.core.target.2019-06/tests/org.eclipse.ease.ui.scripts.test/src/test/resources
09:34:10 [2020-12-29T14:34:10.171Z] [INFO] 
09:34:10 [2020-12-29T14:34:10.171Z] [INFO] --- tycho-source-plugin:1.5.0:plugin-source (plugin-source) @ org.eclipse.ease.ui.scripts.test ---
09:34:10 [2020-12-29T14:34:10.171Z] [INFO] Building jar: /home/jenkins/agent/workspace/ease.verify.core.target.2019-06/tests/org.eclipse.ease.ui.scripts.test/target/org.eclipse.ease.ui.scripts.test-0.8.0-SNAPSHOT-sources.jar
09:34:10 [2020-12-29T14:34:10.426Z] [INFO] 
09:34:10 [2020-12-29T14:34:10.426Z] [INFO] --- target-platform-configuration:1.5.0:target-platform (default-target-platform) @ org.eclipse.ease.ui.scripts.test ---
09:34:10 [2020-12-29T14:34:10.426Z] [INFO] 
09:34:10 [2020-12-29T14:34:10.426Z] [INFO] --- tycho-packaging-plugin:1.5.0:package-plugin (default-package-plugin) @ org.eclipse.ease.ui.scripts.test ---
09:34:10 [2020-12-29T14:34:10.426Z] [INFO] Building jar: /home/jenkins/agent/workspace/ease.verify.core.target.2019-06/tests/org.eclipse.ease.ui.scripts.test/target/org.eclipse.ease.ui.scripts.test-0.8.0-SNAPSHOT.jar
09:34:10 [2020-12-29T14:34:10.426Z] [INFO] 
09:34:10 [2020-12-29T14:34:10.426Z] [INFO] --- tycho-p2-plugin:1.5.0:p2-metadata-default (default-p2-metadata-default) @ org.eclipse.ease.ui.scripts.test ---
09:34:10 [2020-12-29T14:34:10.426Z] [INFO] 
09:34:10 [2020-12-29T14:34:10.427Z] [INFO] --- tycho-source-feature-plugin:1.5.0:source-feature (source-feature) @ org.eclipse.ease.ui.scripts.test ---
09:34:10 [2020-12-29T14:34:10.427Z] [INFO] 
09:34:10 [2020-12-29T14:34:10.427Z] [INFO] --- tycho-p2-plugin:1.5.0:p2-metadata (attached-p2-metadata) @ org.eclipse.ease.ui.scripts.test ---
09:34:10 [2020-12-29T14:34:10.427Z] [INFO] 
09:34:10 [2020-12-29T14:34:10.427Z] [INFO] --- tycho-surefire-plugin:1.5.0:test (default-test) @ org.eclipse.ease.ui.scripts.test ---
09:34:10 [2020-12-29T14:34:10.427Z] [INFO] Expected eclipse log file: /home/jenkins/agent/workspace/ease.verify.core.target.2019-06/tests/org.eclipse.ease.ui.scripts.test/target/work/data/.metadata/.log
09:34:10 [2020-12-29T14:34:10.427Z] [INFO] Command line:
09:34:10 [2020-12-29T14:34:10.427Z] 	[/opt/tools/java/openjdk/jdk-11/11.0.2+9/bin/java, -Dosgi.noShutdown=false, -Dosgi.os=linux, -Dosgi.ws=gtk, -Dosgi.arch=x86_64, -Dosgi.clean=true, -jar, /home/jenkins/.m2/repository/p2/osgi/bundle/org.eclipse.equinox.launcher/1.5.800.v20200727-1323/org.eclipse.equinox.launcher-1.5.800.v20200727-1323.jar, -data, /home/jenkins/agent/workspace/ease.verify.core.target.2019-06/tests/org.eclipse.ease.ui.scripts.test/target/work/data, -install, /home/jenkins/agent/workspace/ease.verify.core.target.2019-06/tests/org.eclipse.ease.ui.scripts.test/target/work, -configuration, /home/jenkins/agent/workspace/ease.verify.core.target.2019-06/tests/org.eclipse.ease.ui.scripts.test/target/work/configuration, -application, org.eclipse.tycho.surefire.osgibooter.headlesstest, -testproperties, /home/jenkins/agent/workspace/ease.verify.core.target.2019-06/tests/org.eclipse.ease.ui.scripts.test/target/surefire.properties]
09:34:10 [2020-12-29T14:34:10.427Z] Picked up JAVA_TOOL_OPTIONS: -Dmaven.ext.class.path="/home/jenkins/agent/workspace/ease.verify.core.target.2019-06@tmp/withMaven52a3c32c/pipeline-maven-spy.jar" -Dorg.jenkinsci.plugins.pipeline.maven.reportsFolder="/home/jenkins/agent/workspace/ease.verify.core.target.2019-06@tmp/withMaven52a3c32c" 
09:34:12 [2020-12-29T14:34:12.329Z] Running org.eclipse.ease.ui.scripts.expressions.definitions.ExpressionFactoryTest
09:34:12 [2020-12-29T14:34:12.329Z] Tests run: 14, Failures: 0, Errors: 0, Skipped: 0, Time elapsed: 0.021 s - in org.eclipse.ease.ui.scripts.expressions.definitions.ExpressionFactoryTest
09:34:12 [2020-12-29T14:34:12.329Z] loadClassWithExpression  Time elapsed: 0.008 s
09:34:12 [2020-12-29T14:34:12.329Z] createWithExpression  Time elapsed: 0.001 s
09:34:12 [2020-12-29T14:34:12.329Z] createReferenceExpression  Time elapsed: 0 s
09:34:12 [2020-12-29T14:34:12.329Z] loadClassReferenceExpression  Time elapsed: 0 s
09:34:12 [2020-12-29T14:34:12.329Z] loadClassTestExpression  Time elapsed: 0.001 s
09:34:12 [2020-12-29T14:34:12.329Z] createEqualsExpression  Time elapsed: 0.001 s
09:34:12 [2020-12-29T14:34:12.329Z] loadClassCountExpression  Time elapsed: 0 s
09:34:12 [2020-12-29T14:34:12.329Z] loadClassOrExpression  Time elapsed: 0 s
09:34:12 [2020-12-29T14:34:12.329Z] createTestExpression  Time elapsed: 0.002 s
09:34:12 [2020-12-29T14:34:12.329Z] createOrExpression  Time elapsed: 0.001 s
09:34:12 [2020-12-29T14:34:12.329Z] loadClassAndExpression  Time elapsed: 0.001 s
09:34:12 [2020-12-29T14:34:12.329Z] createAndExpression  Time elapsed: 0 s
09:34:12 [2020-12-29T14:34:12.329Z] loadClassEqualsExpression  Time elapsed: 0.001 s
09:34:12 [2020-12-29T14:34:12.329Z] createCountExpression  Time elapsed: 0.001 s
09:34:12 [2020-12-29T14:34:12.329Z] 
09:34:12 [2020-12-29T14:34:12.329Z] Results:
09:34:12 [2020-12-29T14:34:12.329Z] 
09:34:12 [2020-12-29T14:34:12.329Z] Tests run: 14, Failures: 0, Errors: 0, Skipped: 0
09:34:12 [2020-12-29T14:34:12.329Z] 
09:34:12 [2020-12-29T14:34:12.899Z] [INFO] All tests passed!
09:34:12 [2020-12-29T14:34:12.899Z] [INFO] 
09:34:12 [2020-12-29T14:34:12.899Z] [INFO] --- maven-install-plugin:2.3.1:install (default-install) @ org.eclipse.ease.ui.scripts.test ---
09:34:12 [2020-12-29T14:34:12.899Z] [INFO] Installing /home/jenkins/agent/workspace/ease.verify.core.target.2019-06/tests/org.eclipse.ease.ui.scripts.test/target/org.eclipse.ease.ui.scripts.test-0.8.0-SNAPSHOT.jar to /home/jenkins/.m2/repository/org/eclipse/ease/org.eclipse.ease.ui.scripts.test/0.8.0-SNAPSHOT/org.eclipse.ease.ui.scripts.test-0.8.0-SNAPSHOT.jar
09:34:12 [2020-12-29T14:34:12.899Z] [INFO] Installing /home/jenkins/agent/workspace/ease.verify.core.target.2019-06/tests/org.eclipse.ease.ui.scripts.test/pom.xml to /home/jenkins/.m2/repository/org/eclipse/ease/org.eclipse.ease.ui.scripts.test/0.8.0-SNAPSHOT/org.eclipse.ease.ui.scripts.test-0.8.0-SNAPSHOT.pom
09:34:12 [2020-12-29T14:34:12.899Z] [INFO] Installing /home/jenkins/agent/workspace/ease.verify.core.target.2019-06/tests/org.eclipse.ease.ui.scripts.test/target/org.eclipse.ease.ui.scripts.test-0.8.0-SNAPSHOT-sources.jar to /home/jenkins/.m2/repository/org/eclipse/ease/org.eclipse.ease.ui.scripts.test/0.8.0-SNAPSHOT/org.eclipse.ease.ui.scripts.test-0.8.0-SNAPSHOT-sources.jar
09:34:12 [2020-12-29T14:34:12.899Z] [INFO] Installing /home/jenkins/agent/workspace/ease.verify.core.target.2019-06/tests/org.eclipse.ease.ui.scripts.test/target/p2content.xml to /home/jenkins/.m2/repository/org/eclipse/ease/org.eclipse.ease.ui.scripts.test/0.8.0-SNAPSHOT/org.eclipse.ease.ui.scripts.test-0.8.0-SNAPSHOT-p2metadata.xml
09:34:12 [2020-12-29T14:34:12.899Z] [INFO] Installing /home/jenkins/agent/workspace/ease.verify.core.target.2019-06/tests/org.eclipse.ease.ui.scripts.test/target/p2artifacts.xml to /home/jenkins/.m2/repository/org/eclipse/ease/org.eclipse.ease.ui.scripts.test/0.8.0-SNAPSHOT/org.eclipse.ease.ui.scripts.test-0.8.0-SNAPSHOT-p2artifacts.xml
09:34:12 [2020-12-29T14:34:12.899Z] [INFO] Installing /home/jenkins/agent/workspace/ease.verify.core.target.2019-06/tests/org.eclipse.ease.ui.scripts.test/target/p2content.xml to /home/jenkins/.m2/repository/org/eclipse/ease/org.eclipse.ease.ui.scripts.test/0.8.0-SNAPSHOT/org.eclipse.ease.ui.scripts.test-0.8.0-SNAPSHOT-p2metadata.xml
09:34:12 [2020-12-29T14:34:12.899Z] [INFO] Installing /home/jenkins/agent/workspace/ease.verify.core.target.2019-06/tests/org.eclipse.ease.ui.scripts.test/target/p2artifacts.xml to /home/jenkins/.m2/repository/org/eclipse/ease/org.eclipse.ease.ui.scripts.test/0.8.0-SNAPSHOT/org.eclipse.ease.ui.scripts.test-0.8.0-SNAPSHOT-p2artifacts.xml
09:34:12 [2020-12-29T14:34:12.899Z] [INFO] 
09:34:12 [2020-12-29T14:34:12.899Z] [INFO] --- tycho-p2-plugin:1.5.0:update-local-index (default-update-local-index) @ org.eclipse.ease.ui.scripts.test ---
09:34:12 [2020-12-29T14:34:12.899Z] [INFO] 
09:34:12 [2020-12-29T14:34:12.899Z] [INFO] -------------< org.eclipse.ease:org.eclipse.ease.ui.test >--------------
09:34:12 [2020-12-29T14:34:12.899Z] [INFO] Building org.eclipse.ease.ui.test 0.8.0-SNAPSHOT                 [47/48]
09:34:12 [2020-12-29T14:34:12.899Z] [INFO] ------------------------[ eclipse-test-plugin ]-------------------------
09:34:12 [2020-12-29T14:34:12.899Z] [INFO] 
09:34:12 [2020-12-29T14:34:12.899Z] [INFO] --- maven-clean-plugin:2.5:clean (default-clean) @ org.eclipse.ease.ui.test ---
09:34:12 [2020-12-29T14:34:12.899Z] [INFO] 
09:34:12 [2020-12-29T14:34:12.899Z] [INFO] --- tycho-packaging-plugin:1.5.0:build-qualifier (default-build-qualifier) @ org.eclipse.ease.ui.test ---
09:34:12 [2020-12-29T14:34:12.899Z] [INFO] The project's OSGi version is 0.8.0.I201910171213
09:34:12 [2020-12-29T14:34:12.899Z] [INFO] 
09:34:12 [2020-12-29T14:34:12.899Z] [INFO] --- tycho-packaging-plugin:1.5.0:validate-id (default-validate-id) @ org.eclipse.ease.ui.test ---
09:34:12 [2020-12-29T14:34:12.899Z] [INFO] 
09:34:12 [2020-12-29T14:34:12.899Z] [INFO] --- tycho-packaging-plugin:1.5.0:validate-version (default-validate-version) @ org.eclipse.ease.ui.test ---
09:34:12 [2020-12-29T14:34:12.899Z] [INFO] 
09:34:12 [2020-12-29T14:34:12.899Z] [INFO] >>> maven-javadoc-plugin:2.9.1:javadoc (build-docs) > generate-sources @ org.eclipse.ease.ui.test >>>
09:34:12 [2020-12-29T14:34:12.899Z] [INFO] 
09:34:12 [2020-12-29T14:34:12.899Z] [INFO] --- tycho-packaging-plugin:1.5.0:build-qualifier (default-build-qualifier) @ org.eclipse.ease.ui.test ---
09:34:12 [2020-12-29T14:34:12.899Z] [INFO] The project's OSGi version is 0.8.0.I201910171213
09:34:12 [2020-12-29T14:34:12.899Z] [INFO] 
09:34:12 [2020-12-29T14:34:12.899Z] [INFO] --- tycho-packaging-plugin:1.5.0:validate-id (default-validate-id) @ org.eclipse.ease.ui.test ---
09:34:12 [2020-12-29T14:34:12.899Z] [INFO] 
09:34:12 [2020-12-29T14:34:12.900Z] [INFO] --- tycho-packaging-plugin:1.5.0:validate-version (default-validate-version) @ org.eclipse.ease.ui.test ---
09:34:12 [2020-12-29T14:34:12.900Z] [INFO] 
09:34:12 [2020-12-29T14:34:12.900Z] [INFO] <<< maven-javadoc-plugin:2.9.1:javadoc (build-docs) < generate-sources @ org.eclipse.ease.ui.test <<<
09:34:12 [2020-12-29T14:34:12.900Z] [INFO] 
09:34:12 [2020-12-29T14:34:12.900Z] [INFO] 
09:34:12 [2020-12-29T14:34:12.900Z] [INFO] --- maven-javadoc-plugin:2.9.1:javadoc (build-docs) @ org.eclipse.ease.ui.test ---
09:34:13 [2020-12-29T14:34:13.155Z] [ERROR] Error fetching link: http://help.eclipse.org/oxygen/topic/org.eclipse.platform.doc.isv/reference/api/package-list. Ignored it.
09:34:13 [2020-12-29T14:34:13.155Z] [ERROR] Error fetching link: https://ci.eclipse.org/ease/job/ease.build.core/JavaDoc/package-list. Ignored it.
09:34:14 [2020-12-29T14:34:14.520Z] [INFO] 
09:34:14 [2020-12-29T14:34:14.520Z] Loading source files for package org.eclipse.ease.ui.completion...
09:34:14 [2020-12-29T14:34:14.520Z] Loading source files for package org.eclipse.ease.ui.completion.provider...
09:34:14 [2020-12-29T14:34:14.520Z] Loading source files for package org.eclipse.ease.ui.completions.java.provider...
09:34:14 [2020-12-29T14:34:14.520Z] Loading source files for package org.eclipse.ease.ui.help.hovers...
09:34:14 [2020-12-29T14:34:14.520Z] Constructing Javadoc information...
09:34:14 [2020-12-29T14:34:14.520Z] [WARNING] Javadoc Warnings
09:34:14 [2020-12-29T14:34:14.520Z] [WARNING] Picked up JAVA_TOOL_OPTIONS: -Dmaven.ext.class.path="/home/jenkins/agent/workspace/ease.verify.core.target.2019-06@tmp/withMaven52a3c32c/pipeline-maven-spy.jar" -Dorg.jenkinsci.plugins.pipeline.maven.reportsFolder="/home/jenkins/agent/workspace/ease.verify.core.target.2019-06@tmp/withMaven52a3c32c"
09:34:14 [2020-12-29T14:34:14.520Z] [WARNING] javadoc: warning - The old Doclet and Taglet APIs in the packages
09:34:14 [2020-12-29T14:34:14.520Z] [WARNING] com.sun.javadoc, com.sun.tools.doclets and their implementations
09:34:14 [2020-12-29T14:34:14.520Z] [WARNING] are planned to be removed in a future JDK release. These
09:34:14 [2020-12-29T14:34:14.520Z] [WARNING] components have been superseded by the new APIs in jdk.javadoc.doclet.
09:34:14 [2020-12-29T14:34:14.520Z] [WARNING] Users are strongly recommended to migrate to the new APIs.
09:34:14 [2020-12-29T14:34:14.520Z] [INFO] 
09:34:14 [2020-12-29T14:34:14.520Z] [INFO] --- build-helper-maven-plugin:1.9.1:add-resource (add_help) @ org.eclipse.ease.ui.test ---
09:34:14 [2020-12-29T14:34:14.520Z] [INFO] 
09:34:14 [2020-12-29T14:34:14.520Z] [INFO] --- maven-resources-plugin:2.4.3:resources (default-resources) @ org.eclipse.ease.ui.test ---
09:34:14 [2020-12-29T14:34:14.520Z] [INFO] Using 'UTF-8' encoding to copy filtered resources.
09:34:14 [2020-12-29T14:34:14.520Z] [INFO] skip non existing resourceDirectory /home/jenkins/agent/workspace/ease.verify.core.target.2019-06/tests/org.eclipse.ease.ui.test/src/main/resources
09:34:14 [2020-12-29T14:34:14.520Z] [INFO] Copying 2 resources to help
09:34:14 [2020-12-29T14:34:14.520Z] [INFO] 
09:34:14 [2020-12-29T14:34:14.520Z] [INFO] --- tycho-compiler-plugin:1.5.0:compile (default-compile) @ org.eclipse.ease.ui.test ---
09:34:14 [2020-12-29T14:34:14.520Z] [INFO] Compiling 6 source files to /home/jenkins/agent/workspace/ease.verify.core.target.2019-06/tests/org.eclipse.ease.ui.test/target/classes
09:34:14 [2020-12-29T14:34:14.520Z] [INFO] 
09:34:14 [2020-12-29T14:34:14.520Z] [INFO] --- maven-resources-plugin:2.4.3:testResources (default-testResources) @ org.eclipse.ease.ui.test ---
09:34:14 [2020-12-29T14:34:14.520Z] [INFO] Using 'UTF-8' encoding to copy filtered resources.
09:34:14 [2020-12-29T14:34:14.520Z] [INFO] skip non existing resourceDirectory /home/jenkins/agent/workspace/ease.verify.core.target.2019-06/tests/org.eclipse.ease.ui.test/src/test/resources
09:34:14 [2020-12-29T14:34:14.520Z] [INFO] 
09:34:14 [2020-12-29T14:34:14.521Z] [INFO] --- tycho-source-plugin:1.5.0:plugin-source (plugin-source) @ org.eclipse.ease.ui.test ---
09:34:14 [2020-12-29T14:34:14.521Z] [WARNING] Bundle-Vendor header not found in /home/jenkins/agent/workspace/ease.verify.core.target.2019-06/tests/org.eclipse.ease.ui.test/META-INF/MANIFEST.MF, fallback to 'unknown' for source bundle
09:34:14 [2020-12-29T14:34:14.521Z] [INFO] Building jar: /home/jenkins/agent/workspace/ease.verify.core.target.2019-06/tests/org.eclipse.ease.ui.test/target/org.eclipse.ease.ui.test-0.8.0-SNAPSHOT-sources.jar
09:34:14 [2020-12-29T14:34:14.521Z] [INFO] 
09:34:14 [2020-12-29T14:34:14.521Z] [INFO] --- target-platform-configuration:1.5.0:target-platform (default-target-platform) @ org.eclipse.ease.ui.test ---
09:34:14 [2020-12-29T14:34:14.521Z] [INFO] 
09:34:14 [2020-12-29T14:34:14.521Z] [INFO] --- tycho-packaging-plugin:1.5.0:package-plugin (default-package-plugin) @ org.eclipse.ease.ui.test ---
09:34:14 [2020-12-29T14:34:14.521Z] [INFO] Building jar: /home/jenkins/agent/workspace/ease.verify.core.target.2019-06/tests/org.eclipse.ease.ui.test/target/org.eclipse.ease.ui.test-0.8.0-SNAPSHOT.jar
09:34:14 [2020-12-29T14:34:14.521Z] [INFO] 
09:34:14 [2020-12-29T14:34:14.521Z] [INFO] --- tycho-p2-plugin:1.5.0:p2-metadata-default (default-p2-metadata-default) @ org.eclipse.ease.ui.test ---
09:34:14 [2020-12-29T14:34:14.521Z] [INFO] 
09:34:14 [2020-12-29T14:34:14.521Z] [INFO] --- tycho-source-feature-plugin:1.5.0:source-feature (source-feature) @ org.eclipse.ease.ui.test ---
09:34:14 [2020-12-29T14:34:14.521Z] [INFO] 
09:34:14 [2020-12-29T14:34:14.521Z] [INFO] --- tycho-p2-plugin:1.5.0:p2-metadata (attached-p2-metadata) @ org.eclipse.ease.ui.test ---
09:34:14 [2020-12-29T14:34:14.521Z] [INFO] 
09:34:14 [2020-12-29T14:34:14.521Z] [INFO] --- tycho-surefire-plugin:1.5.0:test (default-test) @ org.eclipse.ease.ui.test ---
09:34:14 [2020-12-29T14:34:14.521Z] [INFO] Expected eclipse log file: /home/jenkins/agent/workspace/ease.verify.core.target.2019-06/tests/org.eclipse.ease.ui.test/target/work/data/.metadata/.log
09:34:14 [2020-12-29T14:34:14.521Z] [INFO] Command line:
09:34:14 [2020-12-29T14:34:14.521Z] 	[/opt/tools/java/openjdk/jdk-11/11.0.2+9/bin/java, -Dosgi.noShutdown=false, -Dosgi.os=linux, -Dosgi.ws=gtk, -Dosgi.arch=x86_64, -Dosgi.clean=true, -jar, /home/jenkins/.m2/repository/p2/osgi/bundle/org.eclipse.equinox.launcher/1.5.800.v20200727-1323/org.eclipse.equinox.launcher-1.5.800.v20200727-1323.jar, -data, /home/jenkins/agent/workspace/ease.verify.core.target.2019-06/tests/org.eclipse.ease.ui.test/target/work/data, -install, /home/jenkins/agent/workspace/ease.verify.core.target.2019-06/tests/org.eclipse.ease.ui.test/target/work, -configuration, /home/jenkins/agent/workspace/ease.verify.core.target.2019-06/tests/org.eclipse.ease.ui.test/target/work/configuration, -application, org.eclipse.tycho.surefire.osgibooter.headlesstest, -testproperties, /home/jenkins/agent/workspace/ease.verify.core.target.2019-06/tests/org.eclipse.ease.ui.test/target/surefire.properties]
09:34:14 [2020-12-29T14:34:14.521Z] Picked up JAVA_TOOL_OPTIONS: -Dmaven.ext.class.path="/home/jenkins/agent/workspace/ease.verify.core.target.2019-06@tmp/withMaven52a3c32c/pipeline-maven-spy.jar" -Dorg.jenkinsci.plugins.pipeline.maven.reportsFolder="/home/jenkins/agent/workspace/ease.verify.core.target.2019-06@tmp/withMaven52a3c32c" 
09:34:16 [2020-12-29T14:34:16.461Z] Running org.eclipse.ease.ui.completion.CompletionContextTest
09:34:16 [2020-12-29T14:34:16.461Z] Tests run: 9, Failures: 0, Errors: 0, Skipped: 0, Time elapsed: 0.066 s - in org.eclipse.ease.ui.completion.CompletionContextTest
09:34:16 [2020-12-29T14:34:16.461Z] resolveStaticClass(org.eclipse.ease.ui.completion.CompletionContextTest)  Time elapsed: 0.004 s
09:34:16 [2020-12-29T14:34:16.461Z] resolveClassWithFilter(org.eclipse.ease.ui.completion.CompletionContextTest)  Time elapsed: 0 s
09:34:16 [2020-12-29T14:34:16.461Z] simplifyCalls(org.eclipse.ease.ui.completion.CompletionContextTest)  Time elapsed: 0 s
09:34:16 [2020-12-29T14:34:16.461Z] resolveClass(org.eclipse.ease.ui.completion.CompletionContextTest)  Time elapsed: 0 s
09:34:16 [2020-12-29T14:34:16.461Z] replaceEscapedStringLiterals(org.eclipse.ease.ui.completion.CompletionContextTest)  Time elapsed: 0 s
09:34:16 [2020-12-29T14:34:16.461Z] replaceSimpleStringLiterals(org.eclipse.ease.ui.completion.CompletionContextTest)  Time elapsed: 0.001 s
09:34:16 [2020-12-29T14:34:16.461Z] resolveStaticClassWithFilter(org.eclipse.ease.ui.completion.CompletionContextTest)  Time elapsed: 0 s
09:34:16 [2020-12-29T14:34:16.461Z] resolveClassWithParameters(org.eclipse.ease.ui.completion.CompletionContextTest)  Time elapsed: 0 s
09:34:16 [2020-12-29T14:34:16.461Z] replaceMultipleStringLiterals(org.eclipse.ease.ui.completion.CompletionContextTest)  Time elapsed: 0 s
09:34:16 [2020-12-29T14:34:16.461Z] Running org.eclipse.ease.ui.completion.provider.AbstractFileLocationCompletionProviderTest
09:34:16 [2020-12-29T14:34:16.462Z] Tests run: 8, Failures: 0, Errors: 0, Skipped: 8, Time elapsed: 0.078 s - in org.eclipse.ease.ui.completion.provider.AbstractFileLocationCompletionProviderTest
09:34:16 [2020-12-29T14:34:16.462Z] workspaceProjectProposals(org.eclipse.ease.ui.completion.provider.AbstractFileLocationCompletionProviderTest) skipped
09:34:16 [2020-12-29T14:34:16.462Z] checkOperatingSystem(org.eclipse.ease.ui.completion.provider.AbstractFileLocationCompletionProviderTest) skipped
09:34:16 [2020-12-29T14:34:16.462Z] absoluteRootWorkspaceProposals(org.eclipse.ease.ui.completion.provider.AbstractFileLocationCompletionProviderTest) skipped
09:34:16 [2020-12-29T14:34:16.462Z] workspaceFolderProposals(org.eclipse.ease.ui.completion.provider.AbstractFileLocationCompletionProviderTest) skipped
09:34:16 [2020-12-29T14:34:16.462Z] fileSystemFolderProposals(org.eclipse.ease.ui.completion.provider.AbstractFileLocationCompletionProviderTest) skipped
09:34:16 [2020-12-29T14:34:16.462Z] workspaceProposals(org.eclipse.ease.ui.completion.provider.AbstractFileLocationCompletionProviderTest) skipped
09:34:16 [2020-12-29T14:34:16.462Z] relativeRootWorkspaceProposals(org.eclipse.ease.ui.completion.provider.AbstractFileLocationCompletionProviderTest) skipped
09:34:16 [2020-12-29T14:34:16.462Z] fileSystemRootProposals(org.eclipse.ease.ui.completion.provider.AbstractFileLocationCompletionProviderTest) skipped
09:34:16 [2020-12-29T14:34:16.462Z] Running org.eclipse.ease.ui.help.hovers.ModuleHelpTest
09:34:16 [2020-12-29T14:34:16.462Z] Tests run: 4, Failures: 0, Errors: 0, Skipped: 4, Time elapsed: 0.001 s - in org.eclipse.ease.ui.help.hovers.ModuleHelpTest
09:34:16 [2020-12-29T14:34:16.462Z] getModuleHelpLocation(org.eclipse.ease.ui.help.hovers.ModuleHelpTest) skipped
09:34:16 [2020-12-29T14:34:16.462Z] getModuleHelp(org.eclipse.ease.ui.help.hovers.ModuleHelpTest) skipped
09:34:16 [2020-12-29T14:34:16.462Z] getMethodHelp(org.eclipse.ease.ui.help.hovers.ModuleHelpTest) skipped
09:34:16 [2020-12-29T14:34:16.462Z] getConstantHelp(org.eclipse.ease.ui.help.hovers.ModuleHelpTest) skipped
09:34:16 [2020-12-29T14:34:16.462Z] Running org.eclipse.ease.ui.completions.java.provider.JavaPackagesCompletionsProviderTest
09:34:16 [2020-12-29T14:34:16.462Z] WARNING: An illegal reflective access operation has occurred
09:34:16 [2020-12-29T14:34:16.462Z] WARNING: Illegal reflective access by org.mockito.cglib.core.ReflectUtils$2 (file:/home/jenkins/.m2/repository/p2/osgi/bundle/org.mockito/1.9.5.v201605172210/org.mockito-1.9.5.v201605172210.jar) to method java.lang.ClassLoader.defineClass(java.lang.String,byte[],int,int,java.security.ProtectionDomain)
09:34:16 [2020-12-29T14:34:16.462Z] WARNING: Please consider reporting this to the maintainers of org.mockito.cglib.core.ReflectUtils$2
09:34:16 [2020-12-29T14:34:16.462Z] WARNING: Use --illegal-access=warn to enable warnings of further illegal reflective access operations
09:34:16 [2020-12-29T14:34:16.462Z] WARNING: All illegal access operations will be denied in a future release
09:34:23 [2020-12-29T14:34:23.003Z] Tests run: 4, Failures: 0, Errors: 0, Skipped: 0, Time elapsed: 5.871 s - in org.eclipse.ease.ui.completions.java.provider.JavaPackagesCompletionsProviderTest
09:34:23 [2020-12-29T14:34:23.003Z] containsJavaLangPackageProposal(org.eclipse.ease.ui.completions.java.provider.JavaPackagesCompletionsProviderTest)  Time elapsed: 0.456 s
09:34:23 [2020-12-29T14:34:23.003Z] containsOrgRootPackageProposal(org.eclipse.ease.ui.completions.java.provider.JavaPackagesCompletionsProviderTest)  Time elapsed: 0.008 s
09:34:23 [2020-12-29T14:34:23.003Z] containsJavaRootPackageProposal(org.eclipse.ease.ui.completions.java.provider.JavaPackagesCompletionsProviderTest)  Time elapsed: 0.007 s
09:34:23 [2020-12-29T14:34:23.003Z] containsOrgEclipsePackageProposal(org.eclipse.ease.ui.completions.java.provider.JavaPackagesCompletionsProviderTest)  Time elapsed: 0.079 s
09:34:23 [2020-12-29T14:34:23.003Z] Running org.eclipse.ease.ui.completions.java.provider.JavaClassCompletionsProviderTest
09:34:28 [2020-12-29T14:34:28.253Z] Tests run: 6, Failures: 0, Errors: 0, Skipped: 0, Time elapsed: 5.157 s - in org.eclipse.ease.ui.completions.java.provider.JavaClassCompletionsProviderTest
09:34:28 [2020-12-29T14:34:28.253Z] containsPackageFileCompletion(org.eclipse.ease.ui.completions.java.provider.JavaClassCompletionsProviderTest)  Time elapsed: 0.008 s
09:34:28 [2020-12-29T14:34:28.253Z] containsGlobalFileCompletion(org.eclipse.ease.ui.completions.java.provider.JavaClassCompletionsProviderTest)  Time elapsed: 0.035 s
09:34:28 [2020-12-29T14:34:28.253Z] containsJavaLangPackageProposal(org.eclipse.ease.ui.completions.java.provider.JavaClassCompletionsProviderTest)  Time elapsed: 0.047 s
09:34:28 [2020-12-29T14:34:28.253Z] containsOrgRootPackageProposal(org.eclipse.ease.ui.completions.java.provider.JavaClassCompletionsProviderTest)  Time elapsed: 0.005 s
09:34:28 [2020-12-29T14:34:28.253Z] containsJavaRootPackageProposal(org.eclipse.ease.ui.completions.java.provider.JavaClassCompletionsProviderTest)  Time elapsed: 0.005 s
09:34:28 [2020-12-29T14:34:28.253Z] containsOrgEclipsePackageProposal(org.eclipse.ease.ui.completions.java.provider.JavaClassCompletionsProviderTest)  Time elapsed: 0.051 s
09:34:28 [2020-12-29T14:34:28.253Z] 
09:34:28 [2020-12-29T14:34:28.253Z] Results:
09:34:28 [2020-12-29T14:34:28.253Z] 
09:34:28 [2020-12-29T14:34:28.253Z] Tests run: 31, Failures: 0, Errors: 0, Skipped: 12
09:34:28 [2020-12-29T14:34:28.253Z] 
09:34:28 [2020-12-29T14:34:28.816Z] [INFO] All tests passed!
09:34:28 [2020-12-29T14:34:28.816Z] [INFO] 
09:34:28 [2020-12-29T14:34:28.817Z] [INFO] --- maven-install-plugin:2.3.1:install (default-install) @ org.eclipse.ease.ui.test ---
09:34:28 [2020-12-29T14:34:28.817Z] [INFO] Installing /home/jenkins/agent/workspace/ease.verify.core.target.2019-06/tests/org.eclipse.ease.ui.test/target/org.eclipse.ease.ui.test-0.8.0-SNAPSHOT.jar to /home/jenkins/.m2/repository/org/eclipse/ease/org.eclipse.ease.ui.test/0.8.0-SNAPSHOT/org.eclipse.ease.ui.test-0.8.0-SNAPSHOT.jar
09:34:28 [2020-12-29T14:34:28.817Z] [INFO] Installing /home/jenkins/agent/workspace/ease.verify.core.target.2019-06/tests/org.eclipse.ease.ui.test/pom.xml to /home/jenkins/.m2/repository/org/eclipse/ease/org.eclipse.ease.ui.test/0.8.0-SNAPSHOT/org.eclipse.ease.ui.test-0.8.0-SNAPSHOT.pom
09:34:28 [2020-12-29T14:34:28.817Z] [INFO] Installing /home/jenkins/agent/workspace/ease.verify.core.target.2019-06/tests/org.eclipse.ease.ui.test/target/org.eclipse.ease.ui.test-0.8.0-SNAPSHOT-sources.jar to /home/jenkins/.m2/repository/org/eclipse/ease/org.eclipse.ease.ui.test/0.8.0-SNAPSHOT/org.eclipse.ease.ui.test-0.8.0-SNAPSHOT-sources.jar
09:34:28 [2020-12-29T14:34:28.817Z] [INFO] Installing /home/jenkins/agent/workspace/ease.verify.core.target.2019-06/tests/org.eclipse.ease.ui.test/target/p2content.xml to /home/jenkins/.m2/repository/org/eclipse/ease/org.eclipse.ease.ui.test/0.8.0-SNAPSHOT/org.eclipse.ease.ui.test-0.8.0-SNAPSHOT-p2metadata.xml
09:34:28 [2020-12-29T14:34:28.817Z] [INFO] Installing /home/jenkins/agent/workspace/ease.verify.core.target.2019-06/tests/org.eclipse.ease.ui.test/target/p2artifacts.xml to /home/jenkins/.m2/repository/org/eclipse/ease/org.eclipse.ease.ui.test/0.8.0-SNAPSHOT/org.eclipse.ease.ui.test-0.8.0-SNAPSHOT-p2artifacts.xml
09:34:28 [2020-12-29T14:34:28.817Z] [INFO] Installing /home/jenkins/agent/workspace/ease.verify.core.target.2019-06/tests/org.eclipse.ease.ui.test/target/p2content.xml to /home/jenkins/.m2/repository/org/eclipse/ease/org.eclipse.ease.ui.test/0.8.0-SNAPSHOT/org.eclipse.ease.ui.test-0.8.0-SNAPSHOT-p2metadata.xml
09:34:28 [2020-12-29T14:34:28.817Z] [INFO] Installing /home/jenkins/agent/workspace/ease.verify.core.target.2019-06/tests/org.eclipse.ease.ui.test/target/p2artifacts.xml to /home/jenkins/.m2/repository/org/eclipse/ease/org.eclipse.ease.ui.test/0.8.0-SNAPSHOT/org.eclipse.ease.ui.test-0.8.0-SNAPSHOT-p2artifacts.xml
09:34:28 [2020-12-29T14:34:28.817Z] [INFO] 
09:34:28 [2020-12-29T14:34:28.817Z] [INFO] --- tycho-p2-plugin:1.5.0:update-local-index (default-update-local-index) @ org.eclipse.ease.ui.test ---
09:34:28 [2020-12-29T14:34:28.817Z] [INFO] 
09:34:28 [2020-12-29T14:34:28.817Z] [INFO] ---------------------< org.eclipse.ease:ease.core >---------------------
09:34:28 [2020-12-29T14:34:28.817Z] [INFO] Building EASE (Incubation) 0.4.0-SNAPSHOT                        [48/48]
09:34:28 [2020-12-29T14:34:28.817Z] [INFO] --------------------------------[ pom ]---------------------------------
09:34:28 [2020-12-29T14:34:28.817Z] [INFO] 
09:34:28 [2020-12-29T14:34:28.817Z] [INFO] --- maven-clean-plugin:2.5:clean (default-clean) @ ease.core ---
09:34:28 [2020-12-29T14:34:28.817Z] [INFO] 
09:34:28 [2020-12-29T14:34:28.817Z] [INFO] --- maven-install-plugin:2.4:install (default-install) @ ease.core ---
09:34:29 [2020-12-29T14:34:29.074Z] [INFO] Installing /home/jenkins/agent/workspace/ease.verify.core.target.2019-06/pom.xml to /home/jenkins/.m2/repository/org/eclipse/ease/ease.core/0.4.0-SNAPSHOT/ease.core-0.4.0-SNAPSHOT.pom
09:34:29 [2020-12-29T14:34:29.074Z] [INFO] ------------------------------------------------------------------------
09:34:29 [2020-12-29T14:34:29.074Z] [INFO] Reactor Summary:
09:34:29 [2020-12-29T14:34:29.075Z] [INFO] 
09:34:29 [2020-12-29T14:34:29.075Z] [INFO] org.eclipse.ease.releng 0.8.0-SNAPSHOT ............. SUCCESS [  5.343 s]
09:34:29 [2020-12-29T14:34:29.075Z] [INFO] org.eclipse.ease.classloader 0.8.0-SNAPSHOT ........ SUCCESS [  9.181 s]
09:34:29 [2020-12-29T14:34:29.075Z] [INFO] org.eclipse.ease 0.8.0-SNAPSHOT .................... SUCCESS [  3.017 s]
09:34:29 [2020-12-29T14:34:29.075Z] [INFO] org.eclipse.ease.ui 0.8.0-SNAPSHOT ................. SUCCESS [  4.427 s]
09:34:29 [2020-12-29T14:34:29.075Z] [INFO] org.eclipse.ease.ui.completions.java 0.8.0-SNAPSHOT  SUCCESS [  1.994 s]
09:34:29 [2020-12-29T14:34:29.075Z] [INFO] org.eclipse.ease.ui.scripts 0.8.0-SNAPSHOT ......... SUCCESS [  2.486 s]
09:34:29 [2020-12-29T14:34:29.075Z] [INFO] org.eclipse.ease.lang.javascript 0.8.0-SNAPSHOT .... SUCCESS [  1.411 s]
09:34:29 [2020-12-29T14:34:29.075Z] [INFO] org.eclipse.ease.lang.scriptarchive 0.8.0-SNAPSHOT . SUCCESS [  1.367 s]
09:34:29 [2020-12-29T14:34:29.075Z] [INFO] org.eclipse.ease.lang.python 0.8.0-SNAPSHOT ........ SUCCESS [  1.910 s]
09:34:29 [2020-12-29T14:34:29.075Z] [INFO] org.eclipse.ease.lang.python.py4j 0.8.0-SNAPSHOT ... SUCCESS [  1.625 s]
09:34:29 [2020-12-29T14:34:29.075Z] [INFO] org.eclipse.ease.lang.groovy 0.8.0-SNAPSHOT ........ SUCCESS [  1.304 s]
09:34:29 [2020-12-29T14:34:29.075Z] [INFO] org.eclipse.ease.lang.groovy.interpreter 0.8.0-SNAPSHOT SUCCESS [  1.412 s]
09:34:29 [2020-12-29T14:34:29.075Z] [INFO] org.eclipse.ease.lang.unittest 0.8.0-SNAPSHOT ...... SUCCESS [  2.147 s]
09:34:29 [2020-12-29T14:34:29.075Z] [INFO] org.eclipse.ease.lang.unittest.ui 0.8.0-SNAPSHOT ... SUCCESS [  1.996 s]
09:34:29 [2020-12-29T14:34:29.075Z] [INFO] org.eclipse.ease.lang.ruby 0.8.0-SNAPSHOT .......... SUCCESS [  1.456 s]
09:34:29 [2020-12-29T14:34:29.075Z] [INFO] org.eclipse.ease.lang.ruby.jruby 0.8.0-SNAPSHOT .... SUCCESS [  1.364 s]
09:34:29 [2020-12-29T14:34:29.075Z] [INFO] org.eclipse.ease.lang.javascript.nashorn 0.8.0-SNAPSHOT SUCCESS [  1.409 s]
09:34:29 [2020-12-29T14:34:29.075Z] [INFO] org.eclipse.ease.lang.javascript.rhino 0.8.0-SNAPSHOT SUCCESS [  1.813 s]
09:34:29 [2020-12-29T14:34:29.075Z] [INFO] org.eclipse.ease.lang.python.jython 0.8.0-SNAPSHOT . SUCCESS [  1.571 s]
09:34:29 [2020-12-29T14:34:29.075Z] [INFO] org.eclipse.ease.lang.javascript.ui 0.8.0-SNAPSHOT . SUCCESS [  1.588 s]
09:34:29 [2020-12-29T14:34:29.075Z] [INFO] org.eclipse.ease.lang.jvm.compiled 0.8.0-SNAPSHOT .. SUCCESS [  1.398 s]
09:34:29 [2020-12-29T14:34:29.075Z] [INFO] org.eclipse.ease.lang.scriptarchive.ui 0.8.0-SNAPSHOT SUCCESS [  1.396 s]
09:34:29 [2020-12-29T14:34:29.075Z] [INFO] org.eclipse.ease.help 0.8.0-SNAPSHOT ............... SUCCESS [  0.138 s]
09:34:29 [2020-12-29T14:34:29.075Z] [INFO] org.eclipse.ease.feature 0.8.0-SNAPSHOT ............ SUCCESS [  0.206 s]
09:34:29 [2020-12-29T14:34:29.075Z] [INFO] org.eclipse.ease.ui.feature 0.8.0-SNAPSHOT ......... SUCCESS [  0.273 s]
09:34:29 [2020-12-29T14:34:29.075Z] [INFO] org.eclipse.ease.lang.javascript.feature 0.8.0-SNAPSHOT SUCCESS [  0.094 s]
09:34:29 [2020-12-29T14:34:29.075Z] [INFO] org.eclipse.ease.lang.python.feature 0.8.0-SNAPSHOT  SUCCESS [  0.109 s]
09:34:29 [2020-12-29T14:34:29.075Z] [INFO] org.eclipse.ease.python.jython.feature 0.8.0-SNAPSHOT SUCCESS [  0.103 s]
09:34:29 [2020-12-29T14:34:29.075Z] [INFO] org.eclipse.ease.lang.python.py4j.feature 0.8.0-SNAPSHOT SUCCESS [  0.116 s]
09:34:29 [2020-12-29T14:34:29.075Z] [INFO] org.eclipse.ease.lang.jvm.feature 0.8.0-SNAPSHOT ... SUCCESS [  0.109 s]
09:34:29 [2020-12-29T14:34:29.075Z] [INFO] org.eclipse.ease.lang.groovy.feature 0.8.0-SNAPSHOT  SUCCESS [  0.110 s]
09:34:29 [2020-12-29T14:34:29.075Z] [INFO] org.eclipse.ease.lang.ruby.feature 0.8.0-SNAPSHOT .. SUCCESS [  0.091 s]
09:34:29 [2020-12-29T14:34:29.075Z] [INFO] org.eclipse.ease.lang.scriptarchive.feature 0.8.0-SNAPSHOT SUCCESS [  0.101 s]
09:34:29 [2020-12-29T14:34:29.075Z] [INFO] org.eclipse.ease.lang.unittest.feature 0.8.0-SNAPSHOT SUCCESS [  0.155 s]
09:34:29 [2020-12-29T14:34:29.075Z] [INFO] org.eclipse.ease.releng.target 0.8.0-SNAPSHOT ...... SUCCESS [  0.008 s]
09:34:29 [2020-12-29T14:34:29.075Z] [INFO] org.eclipse.ease.releng.p2 0.8.0-SNAPSHOT .......... SUCCESS [  3.135 s]
09:34:29 [2020-12-29T14:34:29.075Z] [INFO] org.eclipse.ease.testhelper 0.8.0-SNAPSHOT ......... SUCCESS [  1.462 s]
09:34:29 [2020-12-29T14:34:29.075Z] [INFO] org.eclipse.ease.test 0.8.0-SNAPSHOT ............... SUCCESS [ 16.312 s]
09:34:29 [2020-12-29T14:34:29.075Z] [INFO] org.eclipse.ease.lang.javascript.nashorn.test 0.8.0-SNAPSHOT SUCCESS [  4.636 s]
09:34:29 [2020-12-29T14:34:29.075Z] [INFO] org.eclipse.ease.lang.javascript.rhino.test 0.8.0-SNAPSHOT SUCCESS [ 15.778 s]
09:34:29 [2020-12-29T14:34:29.075Z] [INFO] org.eclipse.ease.lang.javascript.test 0.8.0-SNAPSHOT SUCCESS [  3.883 s]
09:34:29 [2020-12-29T14:34:29.075Z] [INFO] org.eclipse.ease.lang.python.test 0.8.0-SNAPSHOT ... SUCCESS [  3.518 s]
09:34:29 [2020-12-29T14:34:29.075Z] [INFO] org.eclipse.ease.lang.python.jython.test 0.8.0-SNAPSHOT SUCCESS [ 16.881 s]
09:34:29 [2020-12-29T14:34:29.075Z] [INFO] org.eclipse.ease.lang.scriptarchive.test 0.8.0-SNAPSHOT SUCCESS [  4.451 s]
09:34:29 [2020-12-29T14:34:29.075Z] [INFO] org.eclipse.ease.lang.unittest.test 0.8.0-SNAPSHOT . SUCCESS [  6.210 s]
09:34:29 [2020-12-29T14:34:29.075Z] [INFO] org.eclipse.ease.ui.scripts.test 0.8.0-SNAPSHOT .... SUCCESS [  3.801 s]
09:34:29 [2020-12-29T14:34:29.075Z] [INFO] org.eclipse.ease.ui.test 0.8.0-SNAPSHOT ............ SUCCESS [ 15.854 s]
09:34:29 [2020-12-29T14:34:29.075Z] [INFO] EASE (Incubation) 0.4.0-SNAPSHOT ................... SUCCESS [  0.206 s]
09:34:29 [2020-12-29T14:34:29.075Z] [INFO] ------------------------------------------------------------------------
09:34:29 [2020-12-29T14:34:29.075Z] [INFO] BUILD SUCCESS
09:34:29 [2020-12-29T14:34:29.075Z] [INFO] ------------------------------------------------------------------------
09:34:29 [2020-12-29T14:34:29.075Z] [INFO] Total time:  04:58 min
09:34:29 [2020-12-29T14:34:29.075Z] [INFO] Finished at: 2020-12-29T14:34:28Z
09:34:29 [2020-12-29T14:34:29.075Z] [INFO] ------------------------------------------------------------------------
09:34:29 [2020-12-29T14:34:29.075Z] [INFO] [jenkins-event-spy] Generated /home/jenkins/agent/workspace/ease.verify.core.target.2019-06@tmp/withMaven52a3c32c/maven-spy-20201229-142930-46314301953004183097243.log