Console Output

Skipping 726 KB.. Full Log
.javascript.test/target/surefire.properties]
09:34:09 [2020-12-08T14:34:09.689Z] Picked up JAVA_TOOL_OPTIONS: -Dmaven.ext.class.path="/home/jenkins/agent/workspace/ease.verify.core.target.2019-06@tmp/withMaven34c68374/pipeline-maven-spy.jar" -Dorg.jenkinsci.plugins.pipeline.maven.reportsFolder="/home/jenkins/agent/workspace/ease.verify.core.target.2019-06@tmp/withMaven34c68374" 
09:34:11 [2020-12-08T14:34:11.588Z] Running org.eclipse.ease.lang.javascript.JavaScriptCompletionContextTest
09:34:11 [2020-12-08T14:34:11.844Z] Tests run: 8, Failures: 0, Errors: 0, Skipped: 0, Time elapsed: 0.3 s - in org.eclipse.ease.lang.javascript.JavaScriptCompletionContextTest
09:34:11 [2020-12-08T14:34:11.844Z] verifyStaticClassTypes(org.eclipse.ease.lang.javascript.JavaScriptCompletionContextTest)  Time elapsed: 0.008 s
09:34:11 [2020-12-08T14:34:11.844Z] verifyClassInstanceTypes(org.eclipse.ease.lang.javascript.JavaScriptCompletionContextTest)  Time elapsed: 0.008 s
09:34:11 [2020-12-08T14:34:11.844Z] verifyTypesForScriptEngine(org.eclipse.ease.lang.javascript.JavaScriptCompletionContextTest)  Time elapsed: 0.137 s
09:34:11 [2020-12-08T14:34:11.844Z] verifyPackageTypes(org.eclipse.ease.lang.javascript.JavaScriptCompletionContextTest)  Time elapsed: 0.001 s
09:34:11 [2020-12-08T14:34:11.844Z] definedVariableTypes(org.eclipse.ease.lang.javascript.JavaScriptCompletionContextTest)  Time elapsed: 0 s
09:34:11 [2020-12-08T14:34:11.844Z] verifyStringLiteralTypes(org.eclipse.ease.lang.javascript.JavaScriptCompletionContextTest)  Time elapsed: 0.001 s
09:34:11 [2020-12-08T14:34:11.844Z] verifyUnknownTypes(org.eclipse.ease.lang.javascript.JavaScriptCompletionContextTest)  Time elapsed: 0 s
09:34:11 [2020-12-08T14:34:11.844Z] verifyNoneTypes(org.eclipse.ease.lang.javascript.JavaScriptCompletionContextTest)  Time elapsed: 0 s
09:34:11 [2020-12-08T14:34:11.844Z] Running org.eclipse.ease.lang.javascript.JavaScriptCodeFactoryTest
09:34:11 [2020-12-08T14:34:11.844Z] Tests run: 1, Failures: 0, Errors: 0, Skipped: 0, Time elapsed: 0.002 s - in org.eclipse.ease.lang.javascript.JavaScriptCodeFactoryTest
09:34:11 [2020-12-08T14:34:11.844Z] testCommentCreator(org.eclipse.ease.lang.javascript.JavaScriptCodeFactoryTest)  Time elapsed: 0.002 s
09:34:11 [2020-12-08T14:34:11.844Z] 
09:34:11 [2020-12-08T14:34:11.844Z] Results:
09:34:11 [2020-12-08T14:34:11.844Z] 
09:34:11 [2020-12-08T14:34:11.844Z] Tests run: 9, Failures: 0, Errors: 0, Skipped: 0
09:34:11 [2020-12-08T14:34:11.844Z] 
09:34:12 [2020-12-08T14:34:12.408Z] [INFO] All tests passed!
09:34:12 [2020-12-08T14:34:12.408Z] [INFO] 
09:34:12 [2020-12-08T14:34:12.408Z] [INFO] --- maven-install-plugin:2.3.1:install (default-install) @ org.eclipse.ease.lang.javascript.test ---
09:34:12 [2020-12-08T14:34:12.408Z] [INFO] Installing /home/jenkins/agent/workspace/ease.verify.core.target.2019-06/tests/org.eclipse.ease.lang.javascript.test/target/org.eclipse.ease.lang.javascript.test-0.8.0-SNAPSHOT.jar to /home/jenkins/.m2/repository/org/eclipse/ease/org.eclipse.ease.lang.javascript.test/0.8.0-SNAPSHOT/org.eclipse.ease.lang.javascript.test-0.8.0-SNAPSHOT.jar
09:34:12 [2020-12-08T14:34:12.408Z] [INFO] Installing /home/jenkins/agent/workspace/ease.verify.core.target.2019-06/tests/org.eclipse.ease.lang.javascript.test/pom.xml to /home/jenkins/.m2/repository/org/eclipse/ease/org.eclipse.ease.lang.javascript.test/0.8.0-SNAPSHOT/org.eclipse.ease.lang.javascript.test-0.8.0-SNAPSHOT.pom
09:34:12 [2020-12-08T14:34:12.408Z] [INFO] Installing /home/jenkins/agent/workspace/ease.verify.core.target.2019-06/tests/org.eclipse.ease.lang.javascript.test/target/org.eclipse.ease.lang.javascript.test-0.8.0-SNAPSHOT-sources.jar to /home/jenkins/.m2/repository/org/eclipse/ease/org.eclipse.ease.lang.javascript.test/0.8.0-SNAPSHOT/org.eclipse.ease.lang.javascript.test-0.8.0-SNAPSHOT-sources.jar
09:34:12 [2020-12-08T14:34:12.408Z] [INFO] Installing /home/jenkins/agent/workspace/ease.verify.core.target.2019-06/tests/org.eclipse.ease.lang.javascript.test/target/p2content.xml to /home/jenkins/.m2/repository/org/eclipse/ease/org.eclipse.ease.lang.javascript.test/0.8.0-SNAPSHOT/org.eclipse.ease.lang.javascript.test-0.8.0-SNAPSHOT-p2metadata.xml
09:34:12 [2020-12-08T14:34:12.408Z] [INFO] Installing /home/jenkins/agent/workspace/ease.verify.core.target.2019-06/tests/org.eclipse.ease.lang.javascript.test/target/p2artifacts.xml to /home/jenkins/.m2/repository/org/eclipse/ease/org.eclipse.ease.lang.javascript.test/0.8.0-SNAPSHOT/org.eclipse.ease.lang.javascript.test-0.8.0-SNAPSHOT-p2artifacts.xml
09:34:12 [2020-12-08T14:34:12.408Z] [INFO] Installing /home/jenkins/agent/workspace/ease.verify.core.target.2019-06/tests/org.eclipse.ease.lang.javascript.test/target/p2content.xml to /home/jenkins/.m2/repository/org/eclipse/ease/org.eclipse.ease.lang.javascript.test/0.8.0-SNAPSHOT/org.eclipse.ease.lang.javascript.test-0.8.0-SNAPSHOT-p2metadata.xml
09:34:12 [2020-12-08T14:34:12.408Z] [INFO] Installing /home/jenkins/agent/workspace/ease.verify.core.target.2019-06/tests/org.eclipse.ease.lang.javascript.test/target/p2artifacts.xml to /home/jenkins/.m2/repository/org/eclipse/ease/org.eclipse.ease.lang.javascript.test/0.8.0-SNAPSHOT/org.eclipse.ease.lang.javascript.test-0.8.0-SNAPSHOT-p2artifacts.xml
09:34:12 [2020-12-08T14:34:12.408Z] [INFO] 
09:34:12 [2020-12-08T14:34:12.408Z] [INFO] --- tycho-p2-plugin:1.5.0:update-local-index (default-update-local-index) @ org.eclipse.ease.lang.javascript.test ---
09:34:12 [2020-12-08T14:34:12.408Z] [INFO] 
09:34:12 [2020-12-08T14:34:12.408Z] [INFO] ---------< org.eclipse.ease:org.eclipse.ease.lang.python.test >---------
09:34:12 [2020-12-08T14:34:12.408Z] [INFO] Building org.eclipse.ease.lang.python.test 0.8.0-SNAPSHOT        [42/48]
09:34:12 [2020-12-08T14:34:12.408Z] [INFO] ------------------------[ eclipse-test-plugin ]-------------------------
09:34:12 [2020-12-08T14:34:12.408Z] [INFO] 
09:34:12 [2020-12-08T14:34:12.408Z] [INFO] --- maven-clean-plugin:2.5:clean (default-clean) @ org.eclipse.ease.lang.python.test ---
09:34:12 [2020-12-08T14:34:12.408Z] [INFO] 
09:34:12 [2020-12-08T14:34:12.408Z] [INFO] --- tycho-packaging-plugin:1.5.0:build-qualifier (default-build-qualifier) @ org.eclipse.ease.lang.python.test ---
09:34:12 [2020-12-08T14:34:12.408Z] [INFO] The project's OSGi version is 0.8.0.I201910171213
09:34:12 [2020-12-08T14:34:12.408Z] [INFO] 
09:34:12 [2020-12-08T14:34:12.408Z] [INFO] --- tycho-packaging-plugin:1.5.0:validate-id (default-validate-id) @ org.eclipse.ease.lang.python.test ---
09:34:12 [2020-12-08T14:34:12.408Z] [INFO] 
09:34:12 [2020-12-08T14:34:12.408Z] [INFO] --- tycho-packaging-plugin:1.5.0:validate-version (default-validate-version) @ org.eclipse.ease.lang.python.test ---
09:34:12 [2020-12-08T14:34:12.408Z] [INFO] 
09:34:12 [2020-12-08T14:34:12.408Z] [INFO] >>> maven-javadoc-plugin:2.9.1:javadoc (build-docs) > generate-sources @ org.eclipse.ease.lang.python.test >>>
09:34:12 [2020-12-08T14:34:12.408Z] [INFO] 
09:34:12 [2020-12-08T14:34:12.408Z] [INFO] --- tycho-packaging-plugin:1.5.0:build-qualifier (default-build-qualifier) @ org.eclipse.ease.lang.python.test ---
09:34:12 [2020-12-08T14:34:12.409Z] [INFO] The project's OSGi version is 0.8.0.I201910171213
09:34:12 [2020-12-08T14:34:12.409Z] [INFO] 
09:34:12 [2020-12-08T14:34:12.409Z] [INFO] --- tycho-packaging-plugin:1.5.0:validate-id (default-validate-id) @ org.eclipse.ease.lang.python.test ---
09:34:12 [2020-12-08T14:34:12.409Z] [INFO] 
09:34:12 [2020-12-08T14:34:12.409Z] [INFO] --- tycho-packaging-plugin:1.5.0:validate-version (default-validate-version) @ org.eclipse.ease.lang.python.test ---
09:34:12 [2020-12-08T14:34:12.409Z] [INFO] 
09:34:12 [2020-12-08T14:34:12.409Z] [INFO] <<< maven-javadoc-plugin:2.9.1:javadoc (build-docs) < generate-sources @ org.eclipse.ease.lang.python.test <<<
09:34:12 [2020-12-08T14:34:12.409Z] [INFO] 
09:34:12 [2020-12-08T14:34:12.409Z] [INFO] 
09:34:12 [2020-12-08T14:34:12.409Z] [INFO] --- maven-javadoc-plugin:2.9.1:javadoc (build-docs) @ org.eclipse.ease.lang.python.test ---
09:34:12 [2020-12-08T14:34:12.665Z] [ERROR] Error fetching link: http://help.eclipse.org/oxygen/topic/org.eclipse.platform.doc.isv/reference/api/package-list. Ignored it.
09:34:12 [2020-12-08T14:34:12.665Z] [ERROR] Error fetching link: https://ci.eclipse.org/ease/job/ease.build.core/JavaDoc/package-list. Ignored it.
09:34:14 [2020-12-08T14:34:14.045Z] [INFO] 
09:34:14 [2020-12-08T14:34:14.045Z] Loading source files for package org.eclipse.ease.lang.python...
09:34:14 [2020-12-08T14:34:14.045Z] Constructing Javadoc information...
09:34:14 [2020-12-08T14:34:14.045Z] WARNING: Cannot open location "/home/jenkins/agent/workspace/ease.verify.core.target.2019-06/tests/org.eclipse.ease.lang.python.test/target/javadoc-bundle-options/package-list"
09:34:14 [2020-12-08T14:34:14.045Z] No plugin definition found, skipping
09:34:14 [2020-12-08T14:34:14.045Z] No plugin definition found, skipping
09:34:14 [2020-12-08T14:34:14.045Z] [WARNING] Javadoc Warnings
09:34:14 [2020-12-08T14:34:14.045Z] [WARNING] Picked up JAVA_TOOL_OPTIONS: -Dmaven.ext.class.path="/home/jenkins/agent/workspace/ease.verify.core.target.2019-06@tmp/withMaven34c68374/pipeline-maven-spy.jar" -Dorg.jenkinsci.plugins.pipeline.maven.reportsFolder="/home/jenkins/agent/workspace/ease.verify.core.target.2019-06@tmp/withMaven34c68374"
09:34:14 [2020-12-08T14:34:14.045Z] [WARNING] javadoc: warning - The old Doclet and Taglet APIs in the packages
09:34:14 [2020-12-08T14:34:14.045Z] [WARNING] com.sun.javadoc, com.sun.tools.doclets and their implementations
09:34:14 [2020-12-08T14:34:14.045Z] [WARNING] are planned to be removed in a future JDK release. These
09:34:14 [2020-12-08T14:34:14.045Z] [WARNING] components have been superseded by the new APIs in jdk.javadoc.doclet.
09:34:14 [2020-12-08T14:34:14.045Z] [WARNING] Users are strongly recommended to migrate to the new APIs.
09:34:14 [2020-12-08T14:34:14.045Z] [INFO] 
09:34:14 [2020-12-08T14:34:14.045Z] [INFO] --- build-helper-maven-plugin:1.9.1:add-resource (add_help) @ org.eclipse.ease.lang.python.test ---
09:34:14 [2020-12-08T14:34:14.045Z] [INFO] 
09:34:14 [2020-12-08T14:34:14.045Z] [INFO] --- maven-resources-plugin:2.4.3:resources (default-resources) @ org.eclipse.ease.lang.python.test ---
09:34:14 [2020-12-08T14:34:14.045Z] [INFO] Using 'UTF-8' encoding to copy filtered resources.
09:34:14 [2020-12-08T14:34:14.045Z] [INFO] skip non existing resourceDirectory /home/jenkins/agent/workspace/ease.verify.core.target.2019-06/tests/org.eclipse.ease.lang.python.test/src/main/resources
09:34:14 [2020-12-08T14:34:14.045Z] [INFO] skip non existing resourceDirectory /home/jenkins/agent/workspace/ease.verify.core.target.2019-06/tests/org.eclipse.ease.lang.python.test/help
09:34:14 [2020-12-08T14:34:14.045Z] [INFO] 
09:34:14 [2020-12-08T14:34:14.045Z] [INFO] --- tycho-compiler-plugin:1.5.0:compile (default-compile) @ org.eclipse.ease.lang.python.test ---
09:34:14 [2020-12-08T14:34:14.045Z] [INFO] Compiling 1 source file to /home/jenkins/agent/workspace/ease.verify.core.target.2019-06/tests/org.eclipse.ease.lang.python.test/target/classes
09:34:14 [2020-12-08T14:34:14.045Z] [INFO] 
09:34:14 [2020-12-08T14:34:14.045Z] [INFO] --- maven-resources-plugin:2.4.3:testResources (default-testResources) @ org.eclipse.ease.lang.python.test ---
09:34:14 [2020-12-08T14:34:14.045Z] [INFO] Using 'UTF-8' encoding to copy filtered resources.
09:34:14 [2020-12-08T14:34:14.045Z] [INFO] skip non existing resourceDirectory /home/jenkins/agent/workspace/ease.verify.core.target.2019-06/tests/org.eclipse.ease.lang.python.test/src/test/resources
09:34:14 [2020-12-08T14:34:14.046Z] [INFO] 
09:34:14 [2020-12-08T14:34:14.046Z] [INFO] --- tycho-source-plugin:1.5.0:plugin-source (plugin-source) @ org.eclipse.ease.lang.python.test ---
09:34:14 [2020-12-08T14:34:14.046Z] [WARNING] Bundle-Vendor header not found in /home/jenkins/agent/workspace/ease.verify.core.target.2019-06/tests/org.eclipse.ease.lang.python.test/META-INF/MANIFEST.MF, fallback to 'unknown' for source bundle
09:34:14 [2020-12-08T14:34:14.046Z] [INFO] Building jar: /home/jenkins/agent/workspace/ease.verify.core.target.2019-06/tests/org.eclipse.ease.lang.python.test/target/org.eclipse.ease.lang.python.test-0.8.0-SNAPSHOT-sources.jar
09:34:14 [2020-12-08T14:34:14.046Z] [INFO] 
09:34:14 [2020-12-08T14:34:14.046Z] [INFO] --- target-platform-configuration:1.5.0:target-platform (default-target-platform) @ org.eclipse.ease.lang.python.test ---
09:34:14 [2020-12-08T14:34:14.046Z] [INFO] 
09:34:14 [2020-12-08T14:34:14.046Z] [INFO] --- tycho-packaging-plugin:1.5.0:package-plugin (default-package-plugin) @ org.eclipse.ease.lang.python.test ---
09:34:14 [2020-12-08T14:34:14.046Z] [INFO] Building jar: /home/jenkins/agent/workspace/ease.verify.core.target.2019-06/tests/org.eclipse.ease.lang.python.test/target/org.eclipse.ease.lang.python.test-0.8.0-SNAPSHOT.jar
09:34:14 [2020-12-08T14:34:14.312Z] [INFO] 
09:34:14 [2020-12-08T14:34:14.312Z] [INFO] --- tycho-p2-plugin:1.5.0:p2-metadata-default (default-p2-metadata-default) @ org.eclipse.ease.lang.python.test ---
09:34:14 [2020-12-08T14:34:14.312Z] [INFO] 
09:34:14 [2020-12-08T14:34:14.312Z] [INFO] --- tycho-source-feature-plugin:1.5.0:source-feature (source-feature) @ org.eclipse.ease.lang.python.test ---
09:34:14 [2020-12-08T14:34:14.312Z] [INFO] 
09:34:14 [2020-12-08T14:34:14.312Z] [INFO] --- tycho-p2-plugin:1.5.0:p2-metadata (attached-p2-metadata) @ org.eclipse.ease.lang.python.test ---
09:34:14 [2020-12-08T14:34:14.312Z] [INFO] 
09:34:14 [2020-12-08T14:34:14.312Z] [INFO] --- tycho-surefire-plugin:1.5.0:test (default-test) @ org.eclipse.ease.lang.python.test ---
09:34:14 [2020-12-08T14:34:14.588Z] [INFO] Expected eclipse log file: /home/jenkins/agent/workspace/ease.verify.core.target.2019-06/tests/org.eclipse.ease.lang.python.test/target/work/data/.metadata/.log
09:34:14 [2020-12-08T14:34:14.588Z] [INFO] Command line:
09:34:14 [2020-12-08T14:34:14.588Z] 	[/opt/tools/java/openjdk/jdk-11/11.0.2+9/bin/java, -Dosgi.noShutdown=false, -Dosgi.os=linux, -Dosgi.ws=gtk, -Dosgi.arch=x86_64, -Dosgi.clean=true, -jar, /home/jenkins/.m2/repository/p2/osgi/bundle/org.eclipse.equinox.launcher/1.5.800.v20200727-1323/org.eclipse.equinox.launcher-1.5.800.v20200727-1323.jar, -data, /home/jenkins/agent/workspace/ease.verify.core.target.2019-06/tests/org.eclipse.ease.lang.python.test/target/work/data, -install, /home/jenkins/agent/workspace/ease.verify.core.target.2019-06/tests/org.eclipse.ease.lang.python.test/target/work, -configuration, /home/jenkins/agent/workspace/ease.verify.core.target.2019-06/tests/org.eclipse.ease.lang.python.test/target/work/configuration, -application, org.eclipse.tycho.surefire.osgibooter.headlesstest, -testproperties, /home/jenkins/agent/workspace/ease.verify.core.target.2019-06/tests/org.eclipse.ease.lang.python.test/target/surefire.properties]
09:34:14 [2020-12-08T14:34:14.588Z] Picked up JAVA_TOOL_OPTIONS: -Dmaven.ext.class.path="/home/jenkins/agent/workspace/ease.verify.core.target.2019-06@tmp/withMaven34c68374/pipeline-maven-spy.jar" -Dorg.jenkinsci.plugins.pipeline.maven.reportsFolder="/home/jenkins/agent/workspace/ease.verify.core.target.2019-06@tmp/withMaven34c68374" 
09:34:16 [2020-12-08T14:34:16.550Z] Running org.eclipse.ease.lang.python.PythonCodeFactoryTest
09:34:16 [2020-12-08T14:34:16.550Z] Tests run: 1, Failures: 0, Errors: 0, Skipped: 0, Time elapsed: 0.085 s - in org.eclipse.ease.lang.python.PythonCodeFactoryTest
09:34:16 [2020-12-08T14:34:16.550Z] testCommentCreator(org.eclipse.ease.lang.python.PythonCodeFactoryTest)  Time elapsed: 0.003 s
09:34:16 [2020-12-08T14:34:16.550Z] 
09:34:16 [2020-12-08T14:34:16.550Z] Results:
09:34:16 [2020-12-08T14:34:16.550Z] 
09:34:16 [2020-12-08T14:34:16.550Z] Tests run: 1, Failures: 0, Errors: 0, Skipped: 0
09:34:16 [2020-12-08T14:34:16.550Z] 
09:34:17 [2020-12-08T14:34:17.112Z] [INFO] All tests passed!
09:34:17 [2020-12-08T14:34:17.112Z] [INFO] 
09:34:17 [2020-12-08T14:34:17.112Z] [INFO] --- maven-install-plugin:2.3.1:install (default-install) @ org.eclipse.ease.lang.python.test ---
09:34:17 [2020-12-08T14:34:17.112Z] [INFO] Installing /home/jenkins/agent/workspace/ease.verify.core.target.2019-06/tests/org.eclipse.ease.lang.python.test/target/org.eclipse.ease.lang.python.test-0.8.0-SNAPSHOT.jar to /home/jenkins/.m2/repository/org/eclipse/ease/org.eclipse.ease.lang.python.test/0.8.0-SNAPSHOT/org.eclipse.ease.lang.python.test-0.8.0-SNAPSHOT.jar
09:34:17 [2020-12-08T14:34:17.113Z] [INFO] Installing /home/jenkins/agent/workspace/ease.verify.core.target.2019-06/tests/org.eclipse.ease.lang.python.test/pom.xml to /home/jenkins/.m2/repository/org/eclipse/ease/org.eclipse.ease.lang.python.test/0.8.0-SNAPSHOT/org.eclipse.ease.lang.python.test-0.8.0-SNAPSHOT.pom
09:34:17 [2020-12-08T14:34:17.113Z] [INFO] Installing /home/jenkins/agent/workspace/ease.verify.core.target.2019-06/tests/org.eclipse.ease.lang.python.test/target/org.eclipse.ease.lang.python.test-0.8.0-SNAPSHOT-sources.jar to /home/jenkins/.m2/repository/org/eclipse/ease/org.eclipse.ease.lang.python.test/0.8.0-SNAPSHOT/org.eclipse.ease.lang.python.test-0.8.0-SNAPSHOT-sources.jar
09:34:17 [2020-12-08T14:34:17.113Z] [INFO] Installing /home/jenkins/agent/workspace/ease.verify.core.target.2019-06/tests/org.eclipse.ease.lang.python.test/target/p2content.xml to /home/jenkins/.m2/repository/org/eclipse/ease/org.eclipse.ease.lang.python.test/0.8.0-SNAPSHOT/org.eclipse.ease.lang.python.test-0.8.0-SNAPSHOT-p2metadata.xml
09:34:17 [2020-12-08T14:34:17.113Z] [INFO] Installing /home/jenkins/agent/workspace/ease.verify.core.target.2019-06/tests/org.eclipse.ease.lang.python.test/target/p2artifacts.xml to /home/jenkins/.m2/repository/org/eclipse/ease/org.eclipse.ease.lang.python.test/0.8.0-SNAPSHOT/org.eclipse.ease.lang.python.test-0.8.0-SNAPSHOT-p2artifacts.xml
09:34:17 [2020-12-08T14:34:17.113Z] [INFO] Installing /home/jenkins/agent/workspace/ease.verify.core.target.2019-06/tests/org.eclipse.ease.lang.python.test/target/p2content.xml to /home/jenkins/.m2/repository/org/eclipse/ease/org.eclipse.ease.lang.python.test/0.8.0-SNAPSHOT/org.eclipse.ease.lang.python.test-0.8.0-SNAPSHOT-p2metadata.xml
09:34:17 [2020-12-08T14:34:17.113Z] [INFO] Installing /home/jenkins/agent/workspace/ease.verify.core.target.2019-06/tests/org.eclipse.ease.lang.python.test/target/p2artifacts.xml to /home/jenkins/.m2/repository/org/eclipse/ease/org.eclipse.ease.lang.python.test/0.8.0-SNAPSHOT/org.eclipse.ease.lang.python.test-0.8.0-SNAPSHOT-p2artifacts.xml
09:34:17 [2020-12-08T14:34:17.113Z] [INFO] 
09:34:17 [2020-12-08T14:34:17.113Z] [INFO] --- tycho-p2-plugin:1.5.0:update-local-index (default-update-local-index) @ org.eclipse.ease.lang.python.test ---
09:34:17 [2020-12-08T14:34:17.113Z] [INFO] 
09:34:17 [2020-12-08T14:34:17.113Z] [INFO] -----< org.eclipse.ease:org.eclipse.ease.lang.python.jython.test >------
09:34:17 [2020-12-08T14:34:17.113Z] [INFO] Building org.eclipse.ease.lang.python.jython.test 0.8.0-SNAPSHOT [43/48]
09:34:17 [2020-12-08T14:34:17.113Z] [INFO] ------------------------[ eclipse-test-plugin ]-------------------------
09:34:17 [2020-12-08T14:34:17.113Z] [INFO] 
09:34:17 [2020-12-08T14:34:17.113Z] [INFO] --- maven-clean-plugin:2.5:clean (default-clean) @ org.eclipse.ease.lang.python.jython.test ---
09:34:17 [2020-12-08T14:34:17.113Z] [INFO] 
09:34:17 [2020-12-08T14:34:17.113Z] [INFO] --- tycho-packaging-plugin:1.5.0:build-qualifier (default-build-qualifier) @ org.eclipse.ease.lang.python.jython.test ---
09:34:17 [2020-12-08T14:34:17.113Z] [INFO] The project's OSGi version is 0.8.0.I201911291239
09:34:17 [2020-12-08T14:34:17.113Z] [INFO] 
09:34:17 [2020-12-08T14:34:17.113Z] [INFO] --- tycho-packaging-plugin:1.5.0:validate-id (default-validate-id) @ org.eclipse.ease.lang.python.jython.test ---
09:34:17 [2020-12-08T14:34:17.113Z] [INFO] 
09:34:17 [2020-12-08T14:34:17.113Z] [INFO] --- tycho-packaging-plugin:1.5.0:validate-version (default-validate-version) @ org.eclipse.ease.lang.python.jython.test ---
09:34:17 [2020-12-08T14:34:17.113Z] [INFO] 
09:34:17 [2020-12-08T14:34:17.113Z] [INFO] >>> maven-javadoc-plugin:2.9.1:javadoc (build-docs) > generate-sources @ org.eclipse.ease.lang.python.jython.test >>>
09:34:17 [2020-12-08T14:34:17.113Z] [INFO] 
09:34:17 [2020-12-08T14:34:17.113Z] [INFO] --- tycho-packaging-plugin:1.5.0:build-qualifier (default-build-qualifier) @ org.eclipse.ease.lang.python.jython.test ---
09:34:17 [2020-12-08T14:34:17.113Z] [INFO] The project's OSGi version is 0.8.0.I201911291239
09:34:17 [2020-12-08T14:34:17.113Z] [INFO] 
09:34:17 [2020-12-08T14:34:17.113Z] [INFO] --- tycho-packaging-plugin:1.5.0:validate-id (default-validate-id) @ org.eclipse.ease.lang.python.jython.test ---
09:34:17 [2020-12-08T14:34:17.113Z] [INFO] 
09:34:17 [2020-12-08T14:34:17.113Z] [INFO] --- tycho-packaging-plugin:1.5.0:validate-version (default-validate-version) @ org.eclipse.ease.lang.python.jython.test ---
09:34:17 [2020-12-08T14:34:17.113Z] [INFO] 
09:34:17 [2020-12-08T14:34:17.113Z] [INFO] <<< maven-javadoc-plugin:2.9.1:javadoc (build-docs) < generate-sources @ org.eclipse.ease.lang.python.jython.test <<<
09:34:17 [2020-12-08T14:34:17.113Z] [INFO] 
09:34:17 [2020-12-08T14:34:17.113Z] [INFO] 
09:34:17 [2020-12-08T14:34:17.113Z] [INFO] --- maven-javadoc-plugin:2.9.1:javadoc (build-docs) @ org.eclipse.ease.lang.python.jython.test ---
09:34:17 [2020-12-08T14:34:17.369Z] [ERROR] Error fetching link: http://help.eclipse.org/oxygen/topic/org.eclipse.platform.doc.isv/reference/api/package-list. Ignored it.
09:34:17 [2020-12-08T14:34:17.369Z] [ERROR] Error fetching link: https://ci.eclipse.org/ease/job/ease.build.core/JavaDoc/package-list. Ignored it.
09:34:18 [2020-12-08T14:34:18.735Z] [INFO] 
09:34:18 [2020-12-08T14:34:18.735Z] Loading source files for package org.eclipse.ease.lang.python.jython.debugger...
09:34:18 [2020-12-08T14:34:18.735Z] Constructing Javadoc information...
09:34:18 [2020-12-08T14:34:18.735Z] WARNING: Cannot open location "/home/jenkins/agent/workspace/ease.verify.core.target.2019-06/tests/org.eclipse.ease.lang.python.jython.test/target/javadoc-bundle-options/package-list"
09:34:18 [2020-12-08T14:34:18.735Z] No plugin definition found, skipping
09:34:18 [2020-12-08T14:34:18.735Z] No plugin definition found, skipping
09:34:18 [2020-12-08T14:34:18.735Z] [WARNING] Javadoc Warnings
09:34:18 [2020-12-08T14:34:18.735Z] [WARNING] Picked up JAVA_TOOL_OPTIONS: -Dmaven.ext.class.path="/home/jenkins/agent/workspace/ease.verify.core.target.2019-06@tmp/withMaven34c68374/pipeline-maven-spy.jar" -Dorg.jenkinsci.plugins.pipeline.maven.reportsFolder="/home/jenkins/agent/workspace/ease.verify.core.target.2019-06@tmp/withMaven34c68374"
09:34:18 [2020-12-08T14:34:18.735Z] [WARNING] javadoc: warning - The old Doclet and Taglet APIs in the packages
09:34:18 [2020-12-08T14:34:18.735Z] [WARNING] com.sun.javadoc, com.sun.tools.doclets and their implementations
09:34:18 [2020-12-08T14:34:18.735Z] [WARNING] are planned to be removed in a future JDK release. These
09:34:18 [2020-12-08T14:34:18.735Z] [WARNING] components have been superseded by the new APIs in jdk.javadoc.doclet.
09:34:18 [2020-12-08T14:34:18.735Z] [WARNING] Users are strongly recommended to migrate to the new APIs.
09:34:18 [2020-12-08T14:34:18.735Z] [INFO] 
09:34:18 [2020-12-08T14:34:18.735Z] [INFO] --- build-helper-maven-plugin:1.9.1:add-resource (add_help) @ org.eclipse.ease.lang.python.jython.test ---
09:34:18 [2020-12-08T14:34:18.735Z] [INFO] 
09:34:18 [2020-12-08T14:34:18.735Z] [INFO] --- maven-resources-plugin:2.4.3:resources (default-resources) @ org.eclipse.ease.lang.python.jython.test ---
09:34:18 [2020-12-08T14:34:18.735Z] [INFO] Using 'UTF-8' encoding to copy filtered resources.
09:34:18 [2020-12-08T14:34:18.735Z] [INFO] skip non existing resourceDirectory /home/jenkins/agent/workspace/ease.verify.core.target.2019-06/tests/org.eclipse.ease.lang.python.jython.test/src/main/resources
09:34:18 [2020-12-08T14:34:18.735Z] [INFO] skip non existing resourceDirectory /home/jenkins/agent/workspace/ease.verify.core.target.2019-06/tests/org.eclipse.ease.lang.python.jython.test/help
09:34:18 [2020-12-08T14:34:18.735Z] [INFO] 
09:34:18 [2020-12-08T14:34:18.735Z] [INFO] --- tycho-compiler-plugin:1.5.0:compile (default-compile) @ org.eclipse.ease.lang.python.jython.test ---
09:34:18 [2020-12-08T14:34:18.735Z] [INFO] Compiling 1 source file to /home/jenkins/agent/workspace/ease.verify.core.target.2019-06/tests/org.eclipse.ease.lang.python.jython.test/target/classes
09:34:18 [2020-12-08T14:34:18.735Z] [INFO] 
09:34:18 [2020-12-08T14:34:18.735Z] [INFO] --- maven-resources-plugin:2.4.3:testResources (default-testResources) @ org.eclipse.ease.lang.python.jython.test ---
09:34:18 [2020-12-08T14:34:18.736Z] [INFO] Using 'UTF-8' encoding to copy filtered resources.
09:34:18 [2020-12-08T14:34:18.736Z] [INFO] skip non existing resourceDirectory /home/jenkins/agent/workspace/ease.verify.core.target.2019-06/tests/org.eclipse.ease.lang.python.jython.test/src/test/resources
09:34:18 [2020-12-08T14:34:18.736Z] [INFO] 
09:34:18 [2020-12-08T14:34:18.736Z] [INFO] --- tycho-source-plugin:1.5.0:plugin-source (plugin-source) @ org.eclipse.ease.lang.python.jython.test ---
09:34:18 [2020-12-08T14:34:18.736Z] [WARNING] Bundle-Vendor header not found in /home/jenkins/agent/workspace/ease.verify.core.target.2019-06/tests/org.eclipse.ease.lang.python.jython.test/META-INF/MANIFEST.MF, fallback to 'unknown' for source bundle
09:34:18 [2020-12-08T14:34:18.736Z] [INFO] Building jar: /home/jenkins/agent/workspace/ease.verify.core.target.2019-06/tests/org.eclipse.ease.lang.python.jython.test/target/org.eclipse.ease.lang.python.jython.test-0.8.0-SNAPSHOT-sources.jar
09:34:18 [2020-12-08T14:34:18.736Z] [INFO] 
09:34:18 [2020-12-08T14:34:18.736Z] [INFO] --- target-platform-configuration:1.5.0:target-platform (default-target-platform) @ org.eclipse.ease.lang.python.jython.test ---
09:34:18 [2020-12-08T14:34:18.736Z] [INFO] 
09:34:18 [2020-12-08T14:34:18.736Z] [INFO] --- tycho-packaging-plugin:1.5.0:package-plugin (default-package-plugin) @ org.eclipse.ease.lang.python.jython.test ---
09:34:18 [2020-12-08T14:34:18.736Z] [INFO] Building jar: /home/jenkins/agent/workspace/ease.verify.core.target.2019-06/tests/org.eclipse.ease.lang.python.jython.test/target/org.eclipse.ease.lang.python.jython.test-0.8.0-SNAPSHOT.jar
09:34:18 [2020-12-08T14:34:18.736Z] [INFO] 
09:34:18 [2020-12-08T14:34:18.736Z] [INFO] --- tycho-p2-plugin:1.5.0:p2-metadata-default (default-p2-metadata-default) @ org.eclipse.ease.lang.python.jython.test ---
09:34:18 [2020-12-08T14:34:18.736Z] [INFO] 
09:34:18 [2020-12-08T14:34:18.736Z] [INFO] --- tycho-source-feature-plugin:1.5.0:source-feature (source-feature) @ org.eclipse.ease.lang.python.jython.test ---
09:34:18 [2020-12-08T14:34:18.736Z] [INFO] 
09:34:18 [2020-12-08T14:34:18.736Z] [INFO] --- tycho-p2-plugin:1.5.0:p2-metadata (attached-p2-metadata) @ org.eclipse.ease.lang.python.jython.test ---
09:34:18 [2020-12-08T14:34:18.736Z] [INFO] 
09:34:18 [2020-12-08T14:34:18.736Z] [INFO] --- tycho-surefire-plugin:1.5.0:test (default-test) @ org.eclipse.ease.lang.python.jython.test ---
09:34:19 [2020-12-08T14:34:19.299Z] [INFO] Expected eclipse log file: /home/jenkins/agent/workspace/ease.verify.core.target.2019-06/tests/org.eclipse.ease.lang.python.jython.test/target/work/data/.metadata/.log
09:34:19 [2020-12-08T14:34:19.299Z] [INFO] Command line:
09:34:19 [2020-12-08T14:34:19.299Z] 	[/opt/tools/java/openjdk/jdk-11/11.0.2+9/bin/java, -Dosgi.noShutdown=false, -Dosgi.os=linux, -Dosgi.ws=gtk, -Dosgi.arch=x86_64, -Dosgi.clean=true, -jar, /home/jenkins/.m2/repository/p2/osgi/bundle/org.eclipse.equinox.launcher/1.5.800.v20200727-1323/org.eclipse.equinox.launcher-1.5.800.v20200727-1323.jar, -data, /home/jenkins/agent/workspace/ease.verify.core.target.2019-06/tests/org.eclipse.ease.lang.python.jython.test/target/work/data, -install, /home/jenkins/agent/workspace/ease.verify.core.target.2019-06/tests/org.eclipse.ease.lang.python.jython.test/target/work, -configuration, /home/jenkins/agent/workspace/ease.verify.core.target.2019-06/tests/org.eclipse.ease.lang.python.jython.test/target/work/configuration, -application, org.eclipse.tycho.surefire.osgibooter.headlesstest, -testproperties, /home/jenkins/agent/workspace/ease.verify.core.target.2019-06/tests/org.eclipse.ease.lang.python.jython.test/target/surefire.properties]
09:34:19 [2020-12-08T14:34:19.299Z] Picked up JAVA_TOOL_OPTIONS: -Dmaven.ext.class.path="/home/jenkins/agent/workspace/ease.verify.core.target.2019-06@tmp/withMaven34c68374/pipeline-maven-spy.jar" -Dorg.jenkinsci.plugins.pipeline.maven.reportsFolder="/home/jenkins/agent/workspace/ease.verify.core.target.2019-06@tmp/withMaven34c68374" 
09:34:21 [2020-12-08T14:34:21.247Z] WARNING: An illegal reflective access operation has occurred
09:34:21 [2020-12-08T14:34:21.247Z] WARNING: Illegal reflective access by org.python.core.PySystemState (file:/home/jenkins/agent/workspace/ease.verify.core.target.2019-06/tests/org.eclipse.ease.lang.python.jython.test/target/work/plugins/org.jython_2.7.0.I201609090924/jython.jar) to method java.io.Console.encoding()
09:34:21 [2020-12-08T14:34:21.247Z] WARNING: Please consider reporting this to the maintainers of org.python.core.PySystemState
09:34:21 [2020-12-08T14:34:21.247Z] WARNING: Use --illegal-access=warn to enable warnings of further illegal reflective access operations
09:34:21 [2020-12-08T14:34:21.247Z] WARNING: All illegal access operations will be denied in a future release
09:34:21 [2020-12-08T14:34:21.247Z] Running org.eclipse.ease.lang.python.jython.debugger.JythonDebugTest
09:34:23 [2020-12-08T14:34:23.146Z] Start of script
09:34:23 [2020-12-08T14:34:23.146Z] include file start
09:34:23 [2020-12-08T14:34:23.146Z] include file processed
09:34:23 [2020-12-08T14:34:23.146Z] Result of testMethod = 5
09:34:23 [2020-12-08T14:34:23.146Z] End of script
09:34:23 [2020-12-08T14:34:23.146Z] Start of script
09:34:23 [2020-12-08T14:34:23.146Z] include file start
09:34:23 [2020-12-08T14:34:23.146Z] include file processed
09:34:23 [2020-12-08T14:34:23.146Z] Result of testMethod = 5
09:34:23 [2020-12-08T14:34:23.146Z] End of script
09:34:23 [2020-12-08T14:34:23.402Z] Start of script
09:34:23 [2020-12-08T14:34:23.402Z] include file start
09:34:23 [2020-12-08T14:34:23.402Z] include file processed
09:34:23 [2020-12-08T14:34:23.402Z] Result of testMethod = 5
09:34:23 [2020-12-08T14:34:23.658Z] Traceback (most recent call last):
09:34:23 [2020-12-08T14:34:23.659Z]   File "(none)", line 184, in run
09:34:23 [2020-12-08T14:34:23.659Z]   File "__ref_L/Debug Test/Main.py_samffqyrwf", line 23, in <module>
09:34:23 [2020-12-08T14:34:23.659Z]   File "(none)", line 161, in trace_dispatch
09:34:23 [2020-12-08T14:34:23.659Z] org.eclipse.ease.ExitException: 
09:34:23 [2020-12-08T14:34:23.659Z] 
09:34:23 [2020-12-08T14:34:23.659Z] org.eclipse.ease.ExitException: org.eclipse.ease.ExitException: 
09:34:23 [2020-12-08T14:34:23.659Z] Start of script
09:34:23 [2020-12-08T14:34:23.659Z] include file start
09:34:23 [2020-12-08T14:34:23.659Z] include file processed
09:34:23 [2020-12-08T14:34:23.915Z] Result of testMethod = 5
09:34:23 [2020-12-08T14:34:23.915Z] End of script
09:34:24 [2020-12-08T14:34:24.171Z] Start of script
09:34:24 [2020-12-08T14:34:24.171Z] include file start
09:34:24 [2020-12-08T14:34:24.171Z] include file processed
09:34:24 [2020-12-08T14:34:24.171Z] Result of testMethod = 5
09:34:24 [2020-12-08T14:34:24.171Z] End of script
09:34:24 [2020-12-08T14:34:24.427Z] Start of script
09:34:24 [2020-12-08T14:34:24.427Z] include file start
09:34:24 [2020-12-08T14:34:24.427Z] include file processed
09:34:24 [2020-12-08T14:34:24.427Z] Result of testMethod = 5
09:34:24 [2020-12-08T14:34:24.427Z] End of script
09:34:24 [2020-12-08T14:34:24.684Z] Start of script
09:34:24 [2020-12-08T14:34:24.684Z] include file start
09:34:24 [2020-12-08T14:34:24.684Z] include file processed
09:34:24 [2020-12-08T14:34:24.684Z] Result of testMethod = 5
09:34:24 [2020-12-08T14:34:24.684Z] Traceback (most recent call last):
09:34:24 [2020-12-08T14:34:24.684Z]   File "(none)", line 184, in run
09:34:24 [2020-12-08T14:34:24.684Z]   File "__ref_L/Debug Test/Main.py_ststmiivcj", line 23, in <module>
09:34:24 [2020-12-08T14:34:24.684Z]   File "(none)", line 161, in trace_dispatch
09:34:24 [2020-12-08T14:34:24.684Z] org.eclipse.ease.ExitException: 
09:34:24 [2020-12-08T14:34:24.684Z] 
09:34:24 [2020-12-08T14:34:24.684Z] org.eclipse.ease.ExitException: org.eclipse.ease.ExitException: 
09:34:24 [2020-12-08T14:34:24.940Z] Start of script
09:34:24 [2020-12-08T14:34:24.940Z] include file start
09:34:24 [2020-12-08T14:34:24.940Z] include file processed
09:34:25 [2020-12-08T14:34:25.196Z] Result of testMethod = 5
09:34:25 [2020-12-08T14:34:25.196Z] End of script
09:34:25 [2020-12-08T14:34:25.196Z] Start of script
09:34:25 [2020-12-08T14:34:25.196Z] include file start
09:34:25 [2020-12-08T14:34:25.196Z] include file processed
09:34:25 [2020-12-08T14:34:25.196Z] Result of testMethod = 5
09:34:25 [2020-12-08T14:34:25.196Z] End of script
09:34:25 [2020-12-08T14:34:25.451Z] Start of script
09:34:25 [2020-12-08T14:34:25.452Z] include file start
09:34:25 [2020-12-08T14:34:25.452Z] include file processed
09:34:25 [2020-12-08T14:34:25.712Z] Traceback (most recent call last):
09:34:25 [2020-12-08T14:34:25.712Z]   File "(none)", line 184, in run
09:34:25 [2020-12-08T14:34:25.713Z]   File "__ref_L/Debug Test/Main.py_lcxowrtkwa", line 22, in <module>
09:34:25 [2020-12-08T14:34:25.713Z]   File "(none)", line 161, in trace_dispatch
09:34:25 [2020-12-08T14:34:25.713Z] org.eclipse.ease.ExitException: 
09:34:25 [2020-12-08T14:34:25.713Z] 
09:34:25 [2020-12-08T14:34:25.713Z] org.eclipse.ease.ExitException: org.eclipse.ease.ExitException: 
09:34:25 [2020-12-08T14:34:25.978Z] Start of script
09:34:25 [2020-12-08T14:34:25.978Z] include file start
09:34:25 [2020-12-08T14:34:25.978Z] include file processed
09:34:25 [2020-12-08T14:34:25.978Z] Result of testMethod = 5
09:34:25 [2020-12-08T14:34:25.978Z] End of script
09:34:26 [2020-12-08T14:34:26.239Z] Start of script
09:34:26 [2020-12-08T14:34:26.239Z] include file start
09:34:26 [2020-12-08T14:34:26.239Z] include file processed
09:34:26 [2020-12-08T14:34:26.239Z] Result of testMethod = 5
09:34:26 [2020-12-08T14:34:26.239Z] End of script
09:34:26 [2020-12-08T14:34:26.495Z] Traceback (most recent call last):
09:34:26 [2020-12-08T14:34:26.495Z]   File "(none)", line 184, in run
09:34:26 [2020-12-08T14:34:26.495Z]   File "__ref_L/Debug Test/Main.py_pycwnurutm", line 1, in <module>
09:34:26 [2020-12-08T14:34:26.495Z]   File "(none)", line 161, in trace_dispatch
09:34:26 [2020-12-08T14:34:26.495Z] org.eclipse.ease.ExitException: 
09:34:26 [2020-12-08T14:34:26.495Z] 
09:34:26 [2020-12-08T14:34:26.495Z] org.eclipse.ease.ExitException: org.eclipse.ease.ExitException: 
09:34:26 [2020-12-08T14:34:26.773Z] Start of script
09:34:26 [2020-12-08T14:34:26.773Z] include file start
09:34:26 [2020-12-08T14:34:26.773Z] include file processed
09:34:26 [2020-12-08T14:34:26.773Z] Result of testMethod = 5
09:34:26 [2020-12-08T14:34:26.773Z] End of script
09:34:27 [2020-12-08T14:34:27.029Z] Start of script
09:34:27 [2020-12-08T14:34:27.029Z] include file start
09:34:27 [2020-12-08T14:34:27.029Z] include file processed
09:34:27 [2020-12-08T14:34:27.029Z] Result of testMethod = 5
09:34:27 [2020-12-08T14:34:27.029Z] End of script
09:34:27 [2020-12-08T14:34:27.286Z] Start of script
09:34:27 [2020-12-08T14:34:27.286Z] include file start
09:34:27 [2020-12-08T14:34:27.286Z] include file processed
09:34:27 [2020-12-08T14:34:27.286Z] Result of testMethod = 5
09:34:27 [2020-12-08T14:34:27.286Z] Traceback (most recent call last):
09:34:27 [2020-12-08T14:34:27.286Z]   File "(none)", line 184, in run
09:34:27 [2020-12-08T14:34:27.286Z]   File "__ref_L/Debug Test/Main.py_ddxwxawksz", line 23, in <module>
09:34:27 [2020-12-08T14:34:27.286Z]   File "(none)", line 161, in trace_dispatch
09:34:27 [2020-12-08T14:34:27.286Z] org.eclipse.ease.ExitException: 
09:34:27 [2020-12-08T14:34:27.286Z] 
09:34:27 [2020-12-08T14:34:27.286Z] org.eclipse.ease.ExitException: org.eclipse.ease.ExitException: 
09:34:27 [2020-12-08T14:34:27.542Z] Start of script
09:34:27 [2020-12-08T14:34:27.542Z] include file start
09:34:27 [2020-12-08T14:34:27.542Z] include file processed
09:34:27 [2020-12-08T14:34:27.798Z] Result of testMethod = 5
09:34:27 [2020-12-08T14:34:27.798Z] End of script
09:34:27 [2020-12-08T14:34:27.798Z] Traceback (most recent call last):
09:34:27 [2020-12-08T14:34:27.798Z]   File "(none)", line 184, in run
09:34:27 [2020-12-08T14:34:27.798Z]   File "__ref_L/Debug Test/Main.py_umeslrfqqt", line 1, in <module>
09:34:27 [2020-12-08T14:34:27.798Z]   File "(none)", line 161, in trace_dispatch
09:34:27 [2020-12-08T14:34:27.798Z] org.eclipse.ease.ExitException: 
09:34:27 [2020-12-08T14:34:27.798Z] 
09:34:27 [2020-12-08T14:34:27.798Z] org.eclipse.ease.ExitException: org.eclipse.ease.ExitException: 
09:34:28 [2020-12-08T14:34:28.054Z] Start of script
09:34:28 [2020-12-08T14:34:28.054Z] include file start
09:34:28 [2020-12-08T14:34:28.054Z] include file processed
09:34:28 [2020-12-08T14:34:28.054Z] Result of testMethod = 5
09:34:28 [2020-12-08T14:34:28.054Z] End of script
09:34:28 [2020-12-08T14:34:28.310Z] Start of script
09:34:28 [2020-12-08T14:34:28.310Z] include file start
09:34:28 [2020-12-08T14:34:28.310Z] include file processed
09:34:28 [2020-12-08T14:34:28.310Z] Result of testMethod = 5
09:34:28 [2020-12-08T14:34:28.310Z] End of script
09:34:28 [2020-12-08T14:34:28.566Z] Traceback (most recent call last):
09:34:28 [2020-12-08T14:34:28.566Z]   File "(none)", line 184, in run
09:34:28 [2020-12-08T14:34:28.566Z]   File "__ref_L/Debug Test/Main.py_omrfqkjncj", line 1, in <module>
09:34:28 [2020-12-08T14:34:28.566Z]   File "(none)", line 161, in trace_dispatch
09:34:28 [2020-12-08T14:34:28.566Z] org.eclipse.ease.ExitException: 
09:34:28 [2020-12-08T14:34:28.566Z] 
09:34:28 [2020-12-08T14:34:28.566Z] org.eclipse.ease.ExitException: org.eclipse.ease.ExitException: 
09:34:28 [2020-12-08T14:34:28.822Z] Start of script
09:34:28 [2020-12-08T14:34:28.822Z] include file start
09:34:28 [2020-12-08T14:34:28.822Z] include file processed
09:34:28 [2020-12-08T14:34:28.822Z] Result of testMethod = 5
09:34:28 [2020-12-08T14:34:28.822Z] End of script
09:34:29 [2020-12-08T14:34:29.078Z] Start of script
09:34:29 [2020-12-08T14:34:29.079Z] include file start
09:34:29 [2020-12-08T14:34:29.079Z] include file processed
09:34:29 [2020-12-08T14:34:29.079Z] Result of testMethod = 5
09:34:29 [2020-12-08T14:34:29.338Z] Traceback (most recent call last):
09:34:29 [2020-12-08T14:34:29.338Z]   File "(none)", line 184, in run
09:34:29 [2020-12-08T14:34:29.338Z]   File "__ref_L/Debug Test/Main.py_uafrcaqrip", line 23, in <module>
09:34:29 [2020-12-08T14:34:29.338Z]   File "(none)", line 161, in trace_dispatch
09:34:29 [2020-12-08T14:34:29.338Z] org.eclipse.ease.ExitException: 
09:34:29 [2020-12-08T14:34:29.338Z] 
09:34:29 [2020-12-08T14:34:29.338Z] org.eclipse.ease.ExitException: org.eclipse.ease.ExitException: 
09:34:29 [2020-12-08T14:34:29.338Z] Start of script
09:34:29 [2020-12-08T14:34:29.338Z] include file start
09:34:29 [2020-12-08T14:34:29.338Z] include file processed
09:34:29 [2020-12-08T14:34:29.338Z] Result of testMethod = 5
09:34:29 [2020-12-08T14:34:29.338Z] End of script
09:34:29 [2020-12-08T14:34:29.594Z] Start of script
09:34:29 [2020-12-08T14:34:29.594Z] include file start
09:34:29 [2020-12-08T14:34:29.594Z] include file processed
09:34:29 [2020-12-08T14:34:29.851Z] Result of testMethod = 5
09:34:29 [2020-12-08T14:34:29.851Z] End of script
09:34:29 [2020-12-08T14:34:29.851Z] Start of script
09:34:29 [2020-12-08T14:34:29.851Z] include file start
09:34:29 [2020-12-08T14:34:29.851Z] include file processed
09:34:29 [2020-12-08T14:34:29.851Z] Result of testMethod = 5
09:34:29 [2020-12-08T14:34:29.851Z] End of script
09:34:30 [2020-12-08T14:34:30.109Z] Start of script
09:34:30 [2020-12-08T14:34:30.109Z] include file start
09:34:30 [2020-12-08T14:34:30.109Z] include file processed
09:34:30 [2020-12-08T14:34:30.109Z] Result of testMethod = 5
09:34:30 [2020-12-08T14:34:30.109Z] End of script
09:34:30 [2020-12-08T14:34:30.365Z] Start of script
09:34:30 [2020-12-08T14:34:30.365Z] include file start
09:34:30 [2020-12-08T14:34:30.365Z] include file processed
09:34:30 [2020-12-08T14:34:30.365Z] Traceback (most recent call last):
09:34:30 [2020-12-08T14:34:30.365Z]   File "(none)", line 184, in run
09:34:30 [2020-12-08T14:34:30.365Z]   File "__ref_L/Debug Test/Main.py_qoskecmijd", line 21, in <module>
09:34:30 [2020-12-08T14:34:30.365Z]   File "__ref_L/Debug Test/Main.py_qoskecmijd", line 18, in testMethod
09:34:30 [2020-12-08T14:34:30.365Z]   File "(none)", line 161, in trace_dispatch
09:34:30 [2020-12-08T14:34:30.365Z] org.eclipse.ease.ExitException: 
09:34:30 [2020-12-08T14:34:30.365Z] 
09:34:30 [2020-12-08T14:34:30.365Z] org.eclipse.ease.ExitException: org.eclipse.ease.ExitException: 
09:34:30 [2020-12-08T14:34:30.621Z] Start of script
09:34:30 [2020-12-08T14:34:30.877Z] include file start
09:34:30 [2020-12-08T14:34:30.878Z] include file processed
09:34:30 [2020-12-08T14:34:30.878Z] Result of testMethod = 5
09:34:30 [2020-12-08T14:34:30.878Z] End of script
09:34:30 [2020-12-08T14:34:30.878Z] Start of script
09:34:30 [2020-12-08T14:34:30.878Z] include file start
09:34:30 [2020-12-08T14:34:30.878Z] include file processed
09:34:30 [2020-12-08T14:34:30.878Z] Result of testMethod = 5
09:34:31 [2020-12-08T14:34:31.134Z] Traceback (most recent call last):
09:34:31 [2020-12-08T14:34:31.134Z]   File "(none)", line 184, in run
09:34:31 [2020-12-08T14:34:31.134Z]   File "__ref_L/Debug Test/Main.py_adlwqwwizc", line 23, in <module>
09:34:31 [2020-12-08T14:34:31.134Z]   File "(none)", line 161, in trace_dispatch
09:34:31 [2020-12-08T14:34:31.134Z] org.eclipse.ease.ExitException: 
09:34:31 [2020-12-08T14:34:31.134Z] 
09:34:31 [2020-12-08T14:34:31.134Z] org.eclipse.ease.ExitException: org.eclipse.ease.ExitException: 
09:34:31 [2020-12-08T14:34:31.134Z] Start of script
09:34:31 [2020-12-08T14:34:31.134Z] include file start
09:34:31 [2020-12-08T14:34:31.134Z] include file processed
09:34:31 [2020-12-08T14:34:31.134Z] Result of testMethod = 5
09:34:31 [2020-12-08T14:34:31.390Z] End of script
09:34:31 [2020-12-08T14:34:31.390Z] Start of script
09:34:31 [2020-12-08T14:34:31.390Z] include file start
09:34:31 [2020-12-08T14:34:31.390Z] include file processed
09:34:31 [2020-12-08T14:34:31.647Z] Result of testMethod = 5
09:34:31 [2020-12-08T14:34:31.647Z] End of script
09:34:31 [2020-12-08T14:34:31.647Z] Start of script
09:34:31 [2020-12-08T14:34:31.647Z] include file start
09:34:31 [2020-12-08T14:34:31.647Z] include file processed
09:34:31 [2020-12-08T14:34:31.904Z] Result of testMethod = 5
09:34:31 [2020-12-08T14:34:31.904Z] End of script
09:34:32 [2020-12-08T14:34:32.163Z] Start of script
09:34:32 [2020-12-08T14:34:32.163Z] include file start
09:34:32 [2020-12-08T14:34:32.163Z] include file processed
09:34:32 [2020-12-08T14:34:32.163Z] Result of testMethod = 5
09:34:32 [2020-12-08T14:34:32.163Z] End of script
09:34:32 [2020-12-08T14:34:32.163Z] Start of script
09:34:32 [2020-12-08T14:34:32.163Z] include file start
09:34:32 [2020-12-08T14:34:32.163Z] include file processed
09:34:32 [2020-12-08T14:34:32.163Z] Result of testMethod = 5
09:34:32 [2020-12-08T14:34:32.419Z] Traceback (most recent call last):
09:34:32 [2020-12-08T14:34:32.419Z]   File "(none)", line 184, in run
09:34:32 [2020-12-08T14:34:32.419Z]   File "__ref_L/Debug Test/Main.py_xvomzvdjpa", line 23, in <module>
09:34:32 [2020-12-08T14:34:32.419Z]   File "(none)", line 161, in trace_dispatch
09:34:32 [2020-12-08T14:34:32.419Z] org.eclipse.ease.ExitException: 
09:34:32 [2020-12-08T14:34:32.419Z] 
09:34:32 [2020-12-08T14:34:32.419Z] org.eclipse.ease.ExitException: org.eclipse.ease.ExitException: 
09:34:32 [2020-12-08T14:34:32.675Z] Start of script
09:34:32 [2020-12-08T14:34:32.675Z] include file start
09:34:32 [2020-12-08T14:34:32.675Z] include file processed
09:34:32 [2020-12-08T14:34:32.675Z] Result of testMethod = 5
09:34:32 [2020-12-08T14:34:32.675Z] End of script
09:34:32 [2020-12-08T14:34:32.675Z] Start of script
09:34:32 [2020-12-08T14:34:32.675Z] include file start
09:34:32 [2020-12-08T14:34:32.675Z] include file processed
09:34:32 [2020-12-08T14:34:32.675Z] Result of testMethod = 5
09:34:32 [2020-12-08T14:34:32.931Z] Traceback (most recent call last):
09:34:32 [2020-12-08T14:34:32.932Z]   File "(none)", line 184, in run
09:34:32 [2020-12-08T14:34:32.932Z]   File "__ref_L/Debug Test/Main.py_atrqihvtbv", line 23, in <module>
09:34:32 [2020-12-08T14:34:32.932Z]   File "(none)", line 161, in trace_dispatch
09:34:32 [2020-12-08T14:34:32.932Z] org.eclipse.ease.ExitException: 
09:34:32 [2020-12-08T14:34:32.932Z] 
09:34:32 [2020-12-08T14:34:32.932Z] org.eclipse.ease.ExitException: org.eclipse.ease.ExitException: 
09:34:33 [2020-12-08T14:34:33.188Z] Traceback (most recent call last):
09:34:33 [2020-12-08T14:34:33.188Z]   File "(none)", line 184, in run
09:34:33 [2020-12-08T14:34:33.188Z]   File "__ref_L/Debug Test/Main.py_dqgcarrsua", line 1, in <module>
09:34:33 [2020-12-08T14:34:33.188Z]   File "(none)", line 161, in trace_dispatch
09:34:33 [2020-12-08T14:34:33.188Z] org.eclipse.ease.ExitException: 
09:34:33 [2020-12-08T14:34:33.188Z] 
09:34:33 [2020-12-08T14:34:33.188Z] org.eclipse.ease.ExitException: org.eclipse.ease.ExitException: 
09:34:33 [2020-12-08T14:34:33.444Z] Start of script
09:34:33 [2020-12-08T14:34:33.444Z] include file start
09:34:33 [2020-12-08T14:34:33.444Z] include file processed
09:34:33 [2020-12-08T14:34:33.444Z] Result of testMethod = 5
09:34:33 [2020-12-08T14:34:33.444Z] End of script
09:34:33 [2020-12-08T14:34:33.444Z] Start of script
09:34:33 [2020-12-08T14:34:33.444Z] include file start
09:34:33 [2020-12-08T14:34:33.444Z] include file processed
09:34:33 [2020-12-08T14:34:33.701Z] Result of testMethod = 5
09:34:33 [2020-12-08T14:34:33.701Z] End of script
09:34:33 [2020-12-08T14:34:33.701Z] Start of script
09:34:33 [2020-12-08T14:34:33.701Z] include file start
09:34:33 [2020-12-08T14:34:33.701Z] include file processed
09:34:33 [2020-12-08T14:34:33.701Z] Result of testMethod = 5
09:34:33 [2020-12-08T14:34:33.958Z] End of script
09:34:33 [2020-12-08T14:34:33.958Z] Tests run: 42, Failures: 0, Errors: 0, Skipped: 0, Time elapsed: 12.727 s - in org.eclipse.ease.lang.python.jython.debugger.JythonDebugTest
09:34:33 [2020-12-08T14:34:33.958Z] disconnectProcessInSuspendedState(org.eclipse.ease.lang.python.jython.debugger.JythonDebugTest)  Time elapsed: 1.857 s
09:34:33 [2020-12-08T14:34:33.958Z] stepReturnIncludeCommand(org.eclipse.ease.lang.python.jython.debugger.JythonDebugTest)  Time elapsed: 0.215 s
09:34:33 [2020-12-08T14:34:33.958Z] arrayVariableSorting(org.eclipse.ease.lang.python.jython.debugger.JythonDebugTest)  Time elapsed: 0.31 s
09:34:33 [2020-12-08T14:34:33.958Z] stepOverOnDebugTarget(org.eclipse.ease.lang.python.jython.debugger.JythonDebugTest)  Time elapsed: 0.311 s
09:34:33 [2020-12-08T14:34:33.958Z] hasDebugTarget(org.eclipse.ease.lang.python.jython.debugger.JythonDebugTest)  Time elapsed: 0.108 s
09:34:33 [2020-12-08T14:34:33.958Z] disconnectThreadInSuspendedState(org.eclipse.ease.lang.python.jython.debugger.JythonDebugTest)  Time elapsed: 0.213 s
09:34:33 [2020-12-08T14:34:33.958Z] stepReturnOnDebugTarget(org.eclipse.ease.lang.python.jython.debugger.JythonDebugTest)  Time elapsed: 0.314 s
09:34:33 [2020-12-08T14:34:33.958Z] nullVariable(org.eclipse.ease.lang.python.jython.debugger.JythonDebugTest)  Time elapsed: 0.315 s
09:34:33 [2020-12-08T14:34:33.958Z] stepOverOnStackFrame(org.eclipse.ease.lang.python.jython.debugger.JythonDebugTest)  Time elapsed: 0.308 s
09:34:33 [2020-12-08T14:34:33.958Z] resumeOnDebugTarget(org.eclipse.ease.lang.python.jython.debugger.JythonDebugTest)  Time elapsed: 0.207 s
09:34:33 [2020-12-08T14:34:33.958Z] modifyVariableKeepingType(org.eclipse.ease.lang.python.jython.debugger.JythonDebugTest)  Time elapsed: 0.507 s
09:34:33 [2020-12-08T14:34:33.958Z] resumeOnLastIncludeLine(org.eclipse.ease.lang.python.jython.debugger.JythonDebugTest)  Time elapsed: 0.207 s
09:34:33 [2020-12-08T14:34:33.958Z] stepReturnOnStackFrame(org.eclipse.ease.lang.python.jython.debugger.JythonDebugTest)  Time elapsed: 0.306 s
09:34:33 [2020-12-08T14:34:33.958Z] terminateStackFrameInSuspendedState(org.eclipse.ease.lang.python.jython.debugger.JythonDebugTest)  Time elapsed: 0.209 s
09:34:33 [2020-12-08T14:34:33.958Z] breakpointLocation(org.eclipse.ease.lang.python.jython.debugger.JythonDebugTest)  Time elapsed: 0.217 s
09:34:33 [2020-12-08T14:34:33.959Z] stepReturnOnThread(org.eclipse.ease.lang.python.jython.debugger.JythonDebugTest)  Time elapsed: 0.322 s
09:34:33 [2020-12-08T14:34:33.959Z] javaClassVariable(org.eclipse.ease.lang.python.jython.debugger.JythonDebugTest)  Time elapsed: 0.315 s
09:34:33 [2020-12-08T14:34:33.959Z] stepIntoOnThread(org.eclipse.ease.lang.python.jython.debugger.JythonDebugTest)  Time elapsed: 0.309 s
09:34:33 [2020-12-08T14:34:33.959Z] terminateThreadInSuspendedState(org.eclipse.ease.lang.python.jython.debugger.JythonDebugTest)  Time elapsed: 0.206 s
09:34:33 [2020-12-08T14:34:33.959Z] resumeOnThread(org.eclipse.ease.lang.python.jython.debugger.JythonDebugTest)  Time elapsed: 0.207 s
09:34:33 [2020-12-08T14:34:33.959Z] stepIntoOnStackFrame(org.eclipse.ease.lang.python.jython.debugger.JythonDebugTest)  Time elapsed: 0.307 s
09:34:33 [2020-12-08T14:34:33.959Z] terminateProcessInSuspendedState(org.eclipse.ease.lang.python.jython.debugger.JythonDebugTest)  Time elapsed: 0.206 s
09:34:33 [2020-12-08T14:34:33.959Z] stepOverOnProcess(org.eclipse.ease.lang.python.jython.debugger.JythonDebugTest)  Time elapsed: 0.307 s
09:34:33 [2020-12-08T14:34:33.959Z] nativeArrayVariable(org.eclipse.ease.lang.python.jython.debugger.JythonDebugTest)  Time elapsed: 0.306 s
09:34:33 [2020-12-08T14:34:33.959Z] disconnectDebugTargetInSuspendedState(org.eclipse.ease.lang.python.jython.debugger.JythonDebugTest)  Time elapsed: 0.207 s
09:34:33 [2020-12-08T14:34:33.959Z] stepIntoOnProcess(org.eclipse.ease.lang.python.jython.debugger.JythonDebugTest)  Time elapsed: 0.306 s
09:34:33 [2020-12-08T14:34:33.959Z] terminatedState(org.eclipse.ease.lang.python.jython.debugger.JythonDebugTest)  Time elapsed: 0.104 s
09:34:33 [2020-12-08T14:34:33.959Z] stepOverIncludeCommand(org.eclipse.ease.lang.python.jython.debugger.JythonDebugTest)  Time elapsed: 0.305 s
09:34:33 [2020-12-08T14:34:33.959Z] innerScopeVariableBeforeOuterScopeVariable(org.eclipse.ease.lang.python.jython.debugger.JythonDebugTest)  Time elapsed: 0.307 s
09:34:33 [2020-12-08T14:34:33.959Z] stepIntoIncludeCommand(org.eclipse.ease.lang.python.jython.debugger.JythonDebugTest)  Time elapsed: 0.305 s
09:34:33 [2020-12-08T14:34:33.959Z] primitiveStringVariable(org.eclipse.ease.lang.python.jython.debugger.JythonDebugTest)  Time elapsed: 0.305 s
09:34:33 [2020-12-08T14:34:33.959Z] resumeOnProcess(org.eclipse.ease.lang.python.jython.debugger.JythonDebugTest)  Time elapsed: 0.206 s
09:34:33 [2020-12-08T14:34:33.959Z] stepIntoOnDebugTarget(org.eclipse.ease.lang.python.jython.debugger.JythonDebugTest)  Time elapsed: 0.313 s
09:34:33 [2020-12-08T14:34:33.959Z] stepOverOnThread(org.eclipse.ease.lang.python.jython.debugger.JythonDebugTest)  Time elapsed: 0.306 s
09:34:33 [2020-12-08T14:34:33.959Z] suspendedState(org.eclipse.ease.lang.python.jython.debugger.JythonDebugTest)  Time elapsed: 0.206 s
09:34:33 [2020-12-08T14:34:33.959Z] primitiveDoubleVariable(org.eclipse.ease.lang.python.jython.debugger.JythonDebugTest)  Time elapsed: 0.306 s
09:34:33 [2020-12-08T14:34:33.959Z] resumeOnStackFrame(org.eclipse.ease.lang.python.jython.debugger.JythonDebugTest)  Time elapsed: 0.205 s
09:34:33 [2020-12-08T14:34:33.959Z] nativeObjectVariable(org.eclipse.ease.lang.python.jython.debugger.JythonDebugTest)  Time elapsed: 0.307 s
09:34:33 [2020-12-08T14:34:33.959Z] terminateDebugTargetInSuspendedState(org.eclipse.ease.lang.python.jython.debugger.JythonDebugTest)  Time elapsed: 0.206 s
09:34:33 [2020-12-08T14:34:33.959Z] disconnectStackFrameInSuspendedState(org.eclipse.ease.lang.python.jython.debugger.JythonDebugTest)  Time elapsed: 0.205 s
09:34:33 [2020-12-08T14:34:33.959Z] stepReturnOnProcess(org.eclipse.ease.lang.python.jython.debugger.JythonDebugTest)  Time elapsed: 0.306 s
09:34:33 [2020-12-08T14:34:33.959Z] evaluateWatchExpression(org.eclipse.ease.lang.python.jython.debugger.JythonDebugTest)  Time elapsed: 0.207 s
09:34:33 [2020-12-08T14:34:33.959Z] 
09:34:33 [2020-12-08T14:34:33.959Z] Results:
09:34:33 [2020-12-08T14:34:33.959Z] 
09:34:33 [2020-12-08T14:34:33.959Z] Tests run: 42, Failures: 0, Errors: 0, Skipped: 0
09:34:33 [2020-12-08T14:34:33.959Z] 
09:34:34 [2020-12-08T14:34:34.522Z] [INFO] All tests passed!
09:34:34 [2020-12-08T14:34:34.522Z] [INFO] 
09:34:34 [2020-12-08T14:34:34.522Z] [INFO] --- maven-install-plugin:2.3.1:install (default-install) @ org.eclipse.ease.lang.python.jython.test ---
09:34:34 [2020-12-08T14:34:34.523Z] [INFO] Installing /home/jenkins/agent/workspace/ease.verify.core.target.2019-06/tests/org.eclipse.ease.lang.python.jython.test/target/org.eclipse.ease.lang.python.jython.test-0.8.0-SNAPSHOT.jar to /home/jenkins/.m2/repository/org/eclipse/ease/org.eclipse.ease.lang.python.jython.test/0.8.0-SNAPSHOT/org.eclipse.ease.lang.python.jython.test-0.8.0-SNAPSHOT.jar
09:34:34 [2020-12-08T14:34:34.523Z] [INFO] Installing /home/jenkins/agent/workspace/ease.verify.core.target.2019-06/tests/org.eclipse.ease.lang.python.jython.test/pom.xml to /home/jenkins/.m2/repository/org/eclipse/ease/org.eclipse.ease.lang.python.jython.test/0.8.0-SNAPSHOT/org.eclipse.ease.lang.python.jython.test-0.8.0-SNAPSHOT.pom
09:34:34 [2020-12-08T14:34:34.523Z] [INFO] Installing /home/jenkins/agent/workspace/ease.verify.core.target.2019-06/tests/org.eclipse.ease.lang.python.jython.test/target/org.eclipse.ease.lang.python.jython.test-0.8.0-SNAPSHOT-sources.jar to /home/jenkins/.m2/repository/org/eclipse/ease/org.eclipse.ease.lang.python.jython.test/0.8.0-SNAPSHOT/org.eclipse.ease.lang.python.jython.test-0.8.0-SNAPSHOT-sources.jar
09:34:34 [2020-12-08T14:34:34.523Z] [INFO] Installing /home/jenkins/agent/workspace/ease.verify.core.target.2019-06/tests/org.eclipse.ease.lang.python.jython.test/target/p2content.xml to /home/jenkins/.m2/repository/org/eclipse/ease/org.eclipse.ease.lang.python.jython.test/0.8.0-SNAPSHOT/org.eclipse.ease.lang.python.jython.test-0.8.0-SNAPSHOT-p2metadata.xml
09:34:34 [2020-12-08T14:34:34.523Z] [INFO] Installing /home/jenkins/agent/workspace/ease.verify.core.target.2019-06/tests/org.eclipse.ease.lang.python.jython.test/target/p2artifacts.xml to /home/jenkins/.m2/repository/org/eclipse/ease/org.eclipse.ease.lang.python.jython.test/0.8.0-SNAPSHOT/org.eclipse.ease.lang.python.jython.test-0.8.0-SNAPSHOT-p2artifacts.xml
09:34:34 [2020-12-08T14:34:34.523Z] [INFO] Installing /home/jenkins/agent/workspace/ease.verify.core.target.2019-06/tests/org.eclipse.ease.lang.python.jython.test/target/p2content.xml to /home/jenkins/.m2/repository/org/eclipse/ease/org.eclipse.ease.lang.python.jython.test/0.8.0-SNAPSHOT/org.eclipse.ease.lang.python.jython.test-0.8.0-SNAPSHOT-p2metadata.xml
09:34:34 [2020-12-08T14:34:34.523Z] [INFO] Installing /home/jenkins/agent/workspace/ease.verify.core.target.2019-06/tests/org.eclipse.ease.lang.python.jython.test/target/p2artifacts.xml to /home/jenkins/.m2/repository/org/eclipse/ease/org.eclipse.ease.lang.python.jython.test/0.8.0-SNAPSHOT/org.eclipse.ease.lang.python.jython.test-0.8.0-SNAPSHOT-p2artifacts.xml
09:34:34 [2020-12-08T14:34:34.523Z] [INFO] 
09:34:34 [2020-12-08T14:34:34.523Z] [INFO] --- tycho-p2-plugin:1.5.0:update-local-index (default-update-local-index) @ org.eclipse.ease.lang.python.jython.test ---
09:34:34 [2020-12-08T14:34:34.523Z] [INFO] 
09:34:34 [2020-12-08T14:34:34.523Z] [INFO] -----< org.eclipse.ease:org.eclipse.ease.lang.scriptarchive.test >------
09:34:34 [2020-12-08T14:34:34.523Z] [INFO] Building org.eclipse.ease.lang.scriptarchive.test 0.8.0-SNAPSHOT [44/48]
09:34:34 [2020-12-08T14:34:34.523Z] [INFO] ------------------------[ eclipse-test-plugin ]-------------------------
09:34:34 [2020-12-08T14:34:34.523Z] [INFO] 
09:34:34 [2020-12-08T14:34:34.523Z] [INFO] --- maven-clean-plugin:2.5:clean (default-clean) @ org.eclipse.ease.lang.scriptarchive.test ---
09:34:34 [2020-12-08T14:34:34.523Z] [INFO] 
09:34:34 [2020-12-08T14:34:34.523Z] [INFO] --- tycho-packaging-plugin:1.5.0:build-qualifier (default-build-qualifier) @ org.eclipse.ease.lang.scriptarchive.test ---
09:34:34 [2020-12-08T14:34:34.523Z] [INFO] The project's OSGi version is 0.8.0.I201910171213
09:34:34 [2020-12-08T14:34:34.523Z] [INFO] 
09:34:34 [2020-12-08T14:34:34.523Z] [INFO] --- tycho-packaging-plugin:1.5.0:validate-id (default-validate-id) @ org.eclipse.ease.lang.scriptarchive.test ---
09:34:34 [2020-12-08T14:34:34.523Z] [INFO] 
09:34:34 [2020-12-08T14:34:34.523Z] [INFO] --- tycho-packaging-plugin:1.5.0:validate-version (default-validate-version) @ org.eclipse.ease.lang.scriptarchive.test ---
09:34:34 [2020-12-08T14:34:34.523Z] [INFO] 
09:34:34 [2020-12-08T14:34:34.523Z] [INFO] >>> maven-javadoc-plugin:2.9.1:javadoc (build-docs) > generate-sources @ org.eclipse.ease.lang.scriptarchive.test >>>
09:34:34 [2020-12-08T14:34:34.523Z] [INFO] 
09:34:34 [2020-12-08T14:34:34.523Z] [INFO] --- tycho-packaging-plugin:1.5.0:build-qualifier (default-build-qualifier) @ org.eclipse.ease.lang.scriptarchive.test ---
09:34:34 [2020-12-08T14:34:34.523Z] [INFO] The project's OSGi version is 0.8.0.I201910171213
09:34:34 [2020-12-08T14:34:34.523Z] [INFO] 
09:34:34 [2020-12-08T14:34:34.523Z] [INFO] --- tycho-packaging-plugin:1.5.0:validate-id (default-validate-id) @ org.eclipse.ease.lang.scriptarchive.test ---
09:34:34 [2020-12-08T14:34:34.523Z] [INFO] 
09:34:34 [2020-12-08T14:34:34.523Z] [INFO] --- tycho-packaging-plugin:1.5.0:validate-version (default-validate-version) @ org.eclipse.ease.lang.scriptarchive.test ---
09:34:34 [2020-12-08T14:34:34.523Z] [INFO] 
09:34:34 [2020-12-08T14:34:34.523Z] [INFO] <<< maven-javadoc-plugin:2.9.1:javadoc (build-docs) < generate-sources @ org.eclipse.ease.lang.scriptarchive.test <<<
09:34:34 [2020-12-08T14:34:34.523Z] [INFO] 
09:34:34 [2020-12-08T14:34:34.523Z] [INFO] 
09:34:34 [2020-12-08T14:34:34.524Z] [INFO] --- maven-javadoc-plugin:2.9.1:javadoc (build-docs) @ org.eclipse.ease.lang.scriptarchive.test ---
09:34:34 [2020-12-08T14:34:34.780Z] [ERROR] Error fetching link: http://help.eclipse.org/oxygen/topic/org.eclipse.platform.doc.isv/reference/api/package-list. Ignored it.
09:34:34 [2020-12-08T14:34:34.780Z] [ERROR] Error fetching link: https://ci.eclipse.org/ease/job/ease.build.core/JavaDoc/package-list. Ignored it.
09:34:36 [2020-12-08T14:34:36.146Z] [INFO] 
09:34:36 [2020-12-08T14:34:36.146Z] Loading source files for package org.eclipse.ease.lang.scriptarchive...
09:34:36 [2020-12-08T14:34:36.146Z] Constructing Javadoc information...
09:34:36 [2020-12-08T14:34:36.146Z] WARNING: Cannot open location "/home/jenkins/agent/workspace/ease.verify.core.target.2019-06/tests/org.eclipse.ease.lang.scriptarchive.test/target/javadoc-bundle-options/package-list"
09:34:36 [2020-12-08T14:34:36.146Z] No plugin definition found, skipping
09:34:36 [2020-12-08T14:34:36.146Z] No plugin definition found, skipping
09:34:36 [2020-12-08T14:34:36.146Z] [WARNING] Javadoc Warnings
09:34:36 [2020-12-08T14:34:36.146Z] [WARNING] Picked up JAVA_TOOL_OPTIONS: -Dmaven.ext.class.path="/home/jenkins/agent/workspace/ease.verify.core.target.2019-06@tmp/withMaven34c68374/pipeline-maven-spy.jar" -Dorg.jenkinsci.plugins.pipeline.maven.reportsFolder="/home/jenkins/agent/workspace/ease.verify.core.target.2019-06@tmp/withMaven34c68374"
09:34:36 [2020-12-08T14:34:36.146Z] [WARNING] javadoc: warning - The old Doclet and Taglet APIs in the packages
09:34:36 [2020-12-08T14:34:36.146Z] [WARNING] com.sun.javadoc, com.sun.tools.doclets and their implementations
09:34:36 [2020-12-08T14:34:36.146Z] [WARNING] are planned to be removed in a future JDK release. These
09:34:36 [2020-12-08T14:34:36.146Z] [WARNING] components have been superseded by the new APIs in jdk.javadoc.doclet.
09:34:36 [2020-12-08T14:34:36.146Z] [WARNING] Users are strongly recommended to migrate to the new APIs.
09:34:36 [2020-12-08T14:34:36.146Z] [INFO] 
09:34:36 [2020-12-08T14:34:36.146Z] [INFO] --- build-helper-maven-plugin:1.9.1:add-resource (add_help) @ org.eclipse.ease.lang.scriptarchive.test ---
09:34:36 [2020-12-08T14:34:36.146Z] [INFO] 
09:34:36 [2020-12-08T14:34:36.146Z] [INFO] --- maven-resources-plugin:2.4.3:resources (default-resources) @ org.eclipse.ease.lang.scriptarchive.test ---
09:34:36 [2020-12-08T14:34:36.146Z] [INFO] Using 'UTF-8' encoding to copy filtered resources.
09:34:36 [2020-12-08T14:34:36.146Z] [INFO] skip non existing resourceDirectory /home/jenkins/agent/workspace/ease.verify.core.target.2019-06/tests/org.eclipse.ease.lang.scriptarchive.test/src/main/resources
09:34:36 [2020-12-08T14:34:36.146Z] [INFO] skip non existing resourceDirectory /home/jenkins/agent/workspace/ease.verify.core.target.2019-06/tests/org.eclipse.ease.lang.scriptarchive.test/help
09:34:36 [2020-12-08T14:34:36.146Z] [INFO] 
09:34:36 [2020-12-08T14:34:36.146Z] [INFO] --- tycho-compiler-plugin:1.5.0:compile (default-compile) @ org.eclipse.ease.lang.scriptarchive.test ---
09:34:36 [2020-12-08T14:34:36.146Z] [INFO] Compiling 1 source file to /home/jenkins/agent/workspace/ease.verify.core.target.2019-06/tests/org.eclipse.ease.lang.scriptarchive.test/target/classes
09:34:36 [2020-12-08T14:34:36.146Z] [INFO] 
09:34:36 [2020-12-08T14:34:36.146Z] [INFO] --- maven-resources-plugin:2.4.3:testResources (default-testResources) @ org.eclipse.ease.lang.scriptarchive.test ---
09:34:36 [2020-12-08T14:34:36.146Z] [INFO] Using 'UTF-8' encoding to copy filtered resources.
09:34:36 [2020-12-08T14:34:36.146Z] [INFO] skip non existing resourceDirectory /home/jenkins/agent/workspace/ease.verify.core.target.2019-06/tests/org.eclipse.ease.lang.scriptarchive.test/src/test/resources
09:34:36 [2020-12-08T14:34:36.146Z] [INFO] 
09:34:36 [2020-12-08T14:34:36.146Z] [INFO] --- tycho-source-plugin:1.5.0:plugin-source (plugin-source) @ org.eclipse.ease.lang.scriptarchive.test ---
09:34:36 [2020-12-08T14:34:36.146Z] [INFO] Building jar: /home/jenkins/agent/workspace/ease.verify.core.target.2019-06/tests/org.eclipse.ease.lang.scriptarchive.test/target/org.eclipse.ease.lang.scriptarchive.test-0.8.0-SNAPSHOT-sources.jar
09:34:36 [2020-12-08T14:34:36.146Z] [INFO] 
09:34:36 [2020-12-08T14:34:36.146Z] [INFO] --- target-platform-configuration:1.5.0:target-platform (default-target-platform) @ org.eclipse.ease.lang.scriptarchive.test ---
09:34:36 [2020-12-08T14:34:36.146Z] [INFO] 
09:34:36 [2020-12-08T14:34:36.146Z] [INFO] --- tycho-packaging-plugin:1.5.0:package-plugin (default-package-plugin) @ org.eclipse.ease.lang.scriptarchive.test ---
09:34:36 [2020-12-08T14:34:36.147Z] [INFO] Building jar: /home/jenkins/agent/workspace/ease.verify.core.target.2019-06/tests/org.eclipse.ease.lang.scriptarchive.test/target/org.eclipse.ease.lang.scriptarchive.test-0.8.0-SNAPSHOT.jar
09:34:36 [2020-12-08T14:34:36.147Z] [INFO] 
09:34:36 [2020-12-08T14:34:36.147Z] [INFO] --- tycho-p2-plugin:1.5.0:p2-metadata-default (default-p2-metadata-default) @ org.eclipse.ease.lang.scriptarchive.test ---
09:34:36 [2020-12-08T14:34:36.147Z] [INFO] 
09:34:36 [2020-12-08T14:34:36.147Z] [INFO] --- tycho-source-feature-plugin:1.5.0:source-feature (source-feature) @ org.eclipse.ease.lang.scriptarchive.test ---
09:34:36 [2020-12-08T14:34:36.147Z] [INFO] 
09:34:36 [2020-12-08T14:34:36.147Z] [INFO] --- tycho-p2-plugin:1.5.0:p2-metadata (attached-p2-metadata) @ org.eclipse.ease.lang.scriptarchive.test ---
09:34:36 [2020-12-08T14:34:36.147Z] [INFO] 
09:34:36 [2020-12-08T14:34:36.147Z] [INFO] --- tycho-surefire-plugin:1.5.0:test (default-test) @ org.eclipse.ease.lang.scriptarchive.test ---
09:34:36 [2020-12-08T14:34:36.147Z] [INFO] Expected eclipse log file: /home/jenkins/agent/workspace/ease.verify.core.target.2019-06/tests/org.eclipse.ease.lang.scriptarchive.test/target/work/data/.metadata/.log
09:34:36 [2020-12-08T14:34:36.147Z] [INFO] Command line:
09:34:36 [2020-12-08T14:34:36.147Z] 	[/opt/tools/java/openjdk/jdk-11/11.0.2+9/bin/java, -Dosgi.noShutdown=false, -Dosgi.os=linux, -Dosgi.ws=gtk, -Dosgi.arch=x86_64, -Dosgi.clean=true, -jar, /home/jenkins/.m2/repository/p2/osgi/bundle/org.eclipse.equinox.launcher/1.5.800.v20200727-1323/org.eclipse.equinox.launcher-1.5.800.v20200727-1323.jar, -data, /home/jenkins/agent/workspace/ease.verify.core.target.2019-06/tests/org.eclipse.ease.lang.scriptarchive.test/target/work/data, -install, /home/jenkins/agent/workspace/ease.verify.core.target.2019-06/tests/org.eclipse.ease.lang.scriptarchive.test/target/work, -configuration, /home/jenkins/agent/workspace/ease.verify.core.target.2019-06/tests/org.eclipse.ease.lang.scriptarchive.test/target/work/configuration, -application, org.eclipse.tycho.surefire.osgibooter.headlesstest, -testproperties, /home/jenkins/agent/workspace/ease.verify.core.target.2019-06/tests/org.eclipse.ease.lang.scriptarchive.test/target/surefire.properties]
09:34:36 [2020-12-08T14:34:36.147Z] Picked up JAVA_TOOL_OPTIONS: -Dmaven.ext.class.path="/home/jenkins/agent/workspace/ease.verify.core.target.2019-06@tmp/withMaven34c68374/pipeline-maven-spy.jar" -Dorg.jenkinsci.plugins.pipeline.maven.reportsFolder="/home/jenkins/agent/workspace/ease.verify.core.target.2019-06@tmp/withMaven34c68374" 
09:34:38 [2020-12-08T14:34:38.050Z] Running org.eclipse.ease.lang.scriptarchive.ArchiveEngineTest
09:34:38 [2020-12-08T14:34:38.306Z] We are running from a zip file!
09:34:38 [2020-12-08T14:34:38.563Z] org.eclipse.ease.ScriptExecutionException: SyntaxError: missing ; before statement (workspace://__EASE_ScriptArchive_1/scripts/Master.js#3)
09:34:38 [2020-12-08T14:34:38.563Z] this is an error
09:34:38 [2020-12-08T14:34:38.563Z]        ^
09:34:38 [2020-12-08T14:34:38.563Z] 	at Master.js,workspace://__EASE_ScriptArchive_1/scripts/Master.js
09:34:38 [2020-12-08T14:34:38.563Z] org.eclipse.ease.ScriptExecutionException: SyntaxError: missing ; before statement (workspace://__EASE_ScriptArchive_1/scripts/Master.js#3)
09:34:38 [2020-12-08T14:34:38.563Z] this is an error
09:34:38 [2020-12-08T14:34:38.563Z]        ^
09:34:38 [2020-12-08T14:34:38.563Z] 	at Master.js,workspace://__EASE_ScriptArchive_1/scripts/Master.js
09:34:38 [2020-12-08T14:34:38.563Z] Tests run: 7, Failures: 0, Errors: 0, Skipped: 0, Time elapsed: 0.48 s - in org.eclipse.ease.lang.scriptarchive.ArchiveEngineTest
09:34:38 [2020-12-08T14:34:38.563Z] executeWithManifest(org.eclipse.ease.lang.scriptarchive.ArchiveEngineTest)  Time elapsed: 0.303 s
09:34:38 [2020-12-08T14:34:38.563Z] zipFileRegistration(org.eclipse.ease.lang.scriptarchive.ArchiveEngineTest)  Time elapsed: 0.006 s
09:34:38 [2020-12-08T14:34:38.563Z] engineIdRegistration(org.eclipse.ease.lang.scriptarchive.ArchiveEngineTest)  Time elapsed: 0 s
09:34:38 [2020-12-08T14:34:38.563Z] jarFileRegistration(org.eclipse.ease.lang.scriptarchive.ArchiveEngineTest)  Time elapsed: 0 s
09:34:38 [2020-12-08T14:34:38.563Z] sarFileRegistration(org.eclipse.ease.lang.scriptarchive.ArchiveEngineTest)  Time elapsed: 0 s
09:34:38 [2020-12-08T14:34:38.563Z] executeWithErrors(org.eclipse.ease.lang.scriptarchive.ArchiveEngineTest)  Time elapsed: 0.086 s
09:34:38 [2020-12-08T14:34:38.564Z] executeWithIncludes(org.eclipse.ease.lang.scriptarchive.ArchiveEngineTest)  Time elapsed: 0.03 s
09:34:38 [2020-12-08T14:34:38.564Z] 
09:34:38 [2020-12-08T14:34:38.564Z] Results:
09:34:38 [2020-12-08T14:34:38.564Z] 
09:34:38 [2020-12-08T14:34:38.564Z] Tests run: 7, Failures: 0, Errors: 0, Skipped: 0
09:34:38 [2020-12-08T14:34:38.564Z] 
09:34:39 [2020-12-08T14:34:39.127Z] [INFO] All tests passed!
09:34:39 [2020-12-08T14:34:39.127Z] [INFO] 
09:34:39 [2020-12-08T14:34:39.127Z] [INFO] --- maven-install-plugin:2.3.1:install (default-install) @ org.eclipse.ease.lang.scriptarchive.test ---
09:34:39 [2020-12-08T14:34:39.127Z] [INFO] Installing /home/jenkins/agent/workspace/ease.verify.core.target.2019-06/tests/org.eclipse.ease.lang.scriptarchive.test/target/org.eclipse.ease.lang.scriptarchive.test-0.8.0-SNAPSHOT.jar to /home/jenkins/.m2/repository/org/eclipse/ease/org.eclipse.ease.lang.scriptarchive.test/0.8.0-SNAPSHOT/org.eclipse.ease.lang.scriptarchive.test-0.8.0-SNAPSHOT.jar
09:34:39 [2020-12-08T14:34:39.127Z] [INFO] Installing /home/jenkins/agent/workspace/ease.verify.core.target.2019-06/tests/org.eclipse.ease.lang.scriptarchive.test/pom.xml to /home/jenkins/.m2/repository/org/eclipse/ease/org.eclipse.ease.lang.scriptarchive.test/0.8.0-SNAPSHOT/org.eclipse.ease.lang.scriptarchive.test-0.8.0-SNAPSHOT.pom
09:34:39 [2020-12-08T14:34:39.127Z] [INFO] Installing /home/jenkins/agent/workspace/ease.verify.core.target.2019-06/tests/org.eclipse.ease.lang.scriptarchive.test/target/org.eclipse.ease.lang.scriptarchive.test-0.8.0-SNAPSHOT-sources.jar to /home/jenkins/.m2/repository/org/eclipse/ease/org.eclipse.ease.lang.scriptarchive.test/0.8.0-SNAPSHOT/org.eclipse.ease.lang.scriptarchive.test-0.8.0-SNAPSHOT-sources.jar
09:34:39 [2020-12-08T14:34:39.128Z] [INFO] Installing /home/jenkins/agent/workspace/ease.verify.core.target.2019-06/tests/org.eclipse.ease.lang.scriptarchive.test/target/p2content.xml to /home/jenkins/.m2/repository/org/eclipse/ease/org.eclipse.ease.lang.scriptarchive.test/0.8.0-SNAPSHOT/org.eclipse.ease.lang.scriptarchive.test-0.8.0-SNAPSHOT-p2metadata.xml
09:34:39 [2020-12-08T14:34:39.128Z] [INFO] Installing /home/jenkins/agent/workspace/ease.verify.core.target.2019-06/tests/org.eclipse.ease.lang.scriptarchive.test/target/p2artifacts.xml to /home/jenkins/.m2/repository/org/eclipse/ease/org.eclipse.ease.lang.scriptarchive.test/0.8.0-SNAPSHOT/org.eclipse.ease.lang.scriptarchive.test-0.8.0-SNAPSHOT-p2artifacts.xml
09:34:39 [2020-12-08T14:34:39.128Z] [INFO] Installing /home/jenkins/agent/workspace/ease.verify.core.target.2019-06/tests/org.eclipse.ease.lang.scriptarchive.test/target/p2content.xml to /home/jenkins/.m2/repository/org/eclipse/ease/org.eclipse.ease.lang.scriptarchive.test/0.8.0-SNAPSHOT/org.eclipse.ease.lang.scriptarchive.test-0.8.0-SNAPSHOT-p2metadata.xml
09:34:39 [2020-12-08T14:34:39.128Z] [INFO] Installing /home/jenkins/agent/workspace/ease.verify.core.target.2019-06/tests/org.eclipse.ease.lang.scriptarchive.test/target/p2artifacts.xml to /home/jenkins/.m2/repository/org/eclipse/ease/org.eclipse.ease.lang.scriptarchive.test/0.8.0-SNAPSHOT/org.eclipse.ease.lang.scriptarchive.test-0.8.0-SNAPSHOT-p2artifacts.xml
09:34:39 [2020-12-08T14:34:39.128Z] [INFO] 
09:34:39 [2020-12-08T14:34:39.128Z] [INFO] --- tycho-p2-plugin:1.5.0:update-local-index (default-update-local-index) @ org.eclipse.ease.lang.scriptarchive.test ---
09:34:39 [2020-12-08T14:34:39.128Z] [INFO] 
09:34:39 [2020-12-08T14:34:39.128Z] [INFO] --------< org.eclipse.ease:org.eclipse.ease.lang.unittest.test >--------
09:34:39 [2020-12-08T14:34:39.128Z] [INFO] Building org.eclipse.ease.lang.unittest.test 0.8.0-SNAPSHOT      [45/48]
09:34:39 [2020-12-08T14:34:39.128Z] [INFO] ------------------------[ eclipse-test-plugin ]-------------------------
09:34:39 [2020-12-08T14:34:39.128Z] [INFO] 
09:34:39 [2020-12-08T14:34:39.128Z] [INFO] --- maven-clean-plugin:2.5:clean (default-clean) @ org.eclipse.ease.lang.unittest.test ---
09:34:39 [2020-12-08T14:34:39.128Z] [INFO] 
09:34:39 [2020-12-08T14:34:39.128Z] [INFO] --- tycho-packaging-plugin:1.5.0:build-qualifier (default-build-qualifier) @ org.eclipse.ease.lang.unittest.test ---
09:34:39 [2020-12-08T14:34:39.128Z] [INFO] The project's OSGi version is 0.8.0.I202009240747
09:34:39 [2020-12-08T14:34:39.128Z] [INFO] 
09:34:39 [2020-12-08T14:34:39.128Z] [INFO] --- tycho-packaging-plugin:1.5.0:validate-id (default-validate-id) @ org.eclipse.ease.lang.unittest.test ---
09:34:39 [2020-12-08T14:34:39.128Z] [INFO] 
09:34:39 [2020-12-08T14:34:39.128Z] [INFO] --- tycho-packaging-plugin:1.5.0:validate-version (default-validate-version) @ org.eclipse.ease.lang.unittest.test ---
09:34:39 [2020-12-08T14:34:39.128Z] [INFO] 
09:34:39 [2020-12-08T14:34:39.128Z] [INFO] >>> maven-javadoc-plugin:2.9.1:javadoc (build-docs) > generate-sources @ org.eclipse.ease.lang.unittest.test >>>
09:34:39 [2020-12-08T14:34:39.128Z] [INFO] 
09:34:39 [2020-12-08T14:34:39.128Z] [INFO] --- tycho-packaging-plugin:1.5.0:build-qualifier (default-build-qualifier) @ org.eclipse.ease.lang.unittest.test ---
09:34:39 [2020-12-08T14:34:39.128Z] [INFO] The project's OSGi version is 0.8.0.I202009240747
09:34:39 [2020-12-08T14:34:39.128Z] [INFO] 
09:34:39 [2020-12-08T14:34:39.128Z] [INFO] --- tycho-packaging-plugin:1.5.0:validate-id (default-validate-id) @ org.eclipse.ease.lang.unittest.test ---
09:34:39 [2020-12-08T14:34:39.128Z] [INFO] 
09:34:39 [2020-12-08T14:34:39.128Z] [INFO] --- tycho-packaging-plugin:1.5.0:validate-version (default-validate-version) @ org.eclipse.ease.lang.unittest.test ---
09:34:39 [2020-12-08T14:34:39.128Z] [INFO] 
09:34:39 [2020-12-08T14:34:39.128Z] [INFO] <<< maven-javadoc-plugin:2.9.1:javadoc (build-docs) < generate-sources @ org.eclipse.ease.lang.unittest.test <<<
09:34:39 [2020-12-08T14:34:39.128Z] [INFO] 
09:34:39 [2020-12-08T14:34:39.128Z] [INFO] 
09:34:39 [2020-12-08T14:34:39.128Z] [INFO] --- maven-javadoc-plugin:2.9.1:javadoc (build-docs) @ org.eclipse.ease.lang.unittest.test ---
09:34:39 [2020-12-08T14:34:39.385Z] [ERROR] Error fetching link: http://help.eclipse.org/oxygen/topic/org.eclipse.platform.doc.isv/reference/api/package-list. Ignored it.
09:34:39 [2020-12-08T14:34:39.385Z] [ERROR] Error fetching link: https://ci.eclipse.org/ease/job/ease.build.core/JavaDoc/package-list. Ignored it.
09:34:40 [2020-12-08T14:34:40.752Z] [INFO] 
09:34:40 [2020-12-08T14:34:40.752Z] Loading source files for package org.eclipse.ease.lang.unittest...
09:34:40 [2020-12-08T14:34:40.752Z] Constructing Javadoc information...
09:34:40 [2020-12-08T14:34:40.752Z] WARNING: Cannot open location "/home/jenkins/agent/workspace/ease.verify.core.target.2019-06/tests/org.eclipse.ease.lang.unittest.test/target/javadoc-bundle-options/package-list"
09:34:40 [2020-12-08T14:34:40.752Z] No plugin definition found, skipping
09:34:40 [2020-12-08T14:34:40.752Z] No plugin definition found, skipping
09:34:40 [2020-12-08T14:34:40.752Z] [WARNING] Javadoc Warnings
09:34:40 [2020-12-08T14:34:40.752Z] [WARNING] Picked up JAVA_TOOL_OPTIONS: -Dmaven.ext.class.path="/home/jenkins/agent/workspace/ease.verify.core.target.2019-06@tmp/withMaven34c68374/pipeline-maven-spy.jar" -Dorg.jenkinsci.plugins.pipeline.maven.reportsFolder="/home/jenkins/agent/workspace/ease.verify.core.target.2019-06@tmp/withMaven34c68374"
09:34:40 [2020-12-08T14:34:40.753Z] [WARNING] javadoc: warning - The old Doclet and Taglet APIs in the packages
09:34:40 [2020-12-08T14:34:40.753Z] [WARNING] com.sun.javadoc, com.sun.tools.doclets and their implementations
09:34:40 [2020-12-08T14:34:40.753Z] [WARNING] are planned to be removed in a future JDK release. These
09:34:40 [2020-12-08T14:34:40.753Z] [WARNING] components have been superseded by the new APIs in jdk.javadoc.doclet.
09:34:40 [2020-12-08T14:34:40.753Z] [WARNING] Users are strongly recommended to migrate to the new APIs.
09:34:40 [2020-12-08T14:34:40.753Z] [INFO] 
09:34:40 [2020-12-08T14:34:40.753Z] [INFO] --- build-helper-maven-plugin:1.9.1:add-resource (add_help) @ org.eclipse.ease.lang.unittest.test ---
09:34:40 [2020-12-08T14:34:40.753Z] [INFO] 
09:34:40 [2020-12-08T14:34:40.753Z] [INFO] --- maven-resources-plugin:2.4.3:resources (default-resources) @ org.eclipse.ease.lang.unittest.test ---
09:34:40 [2020-12-08T14:34:40.753Z] [INFO] Using 'UTF-8' encoding to copy filtered resources.
09:34:40 [2020-12-08T14:34:40.753Z] [INFO] skip non existing resourceDirectory /home/jenkins/agent/workspace/ease.verify.core.target.2019-06/tests/org.eclipse.ease.lang.unittest.test/src/main/resources
09:34:40 [2020-12-08T14:34:40.753Z] [INFO] skip non existing resourceDirectory /home/jenkins/agent/workspace/ease.verify.core.target.2019-06/tests/org.eclipse.ease.lang.unittest.test/help
09:34:40 [2020-12-08T14:34:40.753Z] [INFO] 
09:34:40 [2020-12-08T14:34:40.753Z] [INFO] --- tycho-compiler-plugin:1.5.0:compile (default-compile) @ org.eclipse.ease.lang.unittest.test ---
09:34:40 [2020-12-08T14:34:40.753Z] [INFO] Compiling 3 source files to /home/jenkins/agent/workspace/ease.verify.core.target.2019-06/tests/org.eclipse.ease.lang.unittest.test/target/classes
09:34:40 [2020-12-08T14:34:40.753Z] [INFO] 
09:34:40 [2020-12-08T14:34:40.753Z] [INFO] --- maven-resources-plugin:2.4.3:testResources (default-testResources) @ org.eclipse.ease.lang.unittest.test ---
09:34:40 [2020-12-08T14:34:40.753Z] [INFO] Using 'UTF-8' encoding to copy filtered resources.
09:34:40 [2020-12-08T14:34:40.753Z] [INFO] skip non existing resourceDirectory /home/jenkins/agent/workspace/ease.verify.core.target.2019-06/tests/org.eclipse.ease.lang.unittest.test/src/test/resources
09:34:40 [2020-12-08T14:34:40.753Z] [INFO] 
09:34:40 [2020-12-08T14:34:40.753Z] [INFO] --- tycho-source-plugin:1.5.0:plugin-source (plugin-source) @ org.eclipse.ease.lang.unittest.test ---
09:34:40 [2020-12-08T14:34:40.753Z] [WARNING] Bundle-Name header not found in /home/jenkins/agent/workspace/ease.verify.core.target.2019-06/tests/org.eclipse.ease.lang.unittest.test/META-INF/MANIFEST.MF, fallback to Bundle-SymbolicName for source bundle
09:34:40 [2020-12-08T14:34:40.753Z] [WARNING] Bundle-Vendor header not found in /home/jenkins/agent/workspace/ease.verify.core.target.2019-06/tests/org.eclipse.ease.lang.unittest.test/META-INF/MANIFEST.MF, fallback to 'unknown' for source bundle
09:34:40 [2020-12-08T14:34:40.753Z] [INFO] Building jar: /home/jenkins/agent/workspace/ease.verify.core.target.2019-06/tests/org.eclipse.ease.lang.unittest.test/target/org.eclipse.ease.lang.unittest.test-0.8.0-SNAPSHOT-sources.jar
09:34:40 [2020-12-08T14:34:40.753Z] [INFO] 
09:34:40 [2020-12-08T14:34:40.753Z] [INFO] --- target-platform-configuration:1.5.0:target-platform (default-target-platform) @ org.eclipse.ease.lang.unittest.test ---
09:34:40 [2020-12-08T14:34:40.753Z] [INFO] 
09:34:40 [2020-12-08T14:34:40.753Z] [INFO] --- tycho-packaging-plugin:1.5.0:package-plugin (default-package-plugin) @ org.eclipse.ease.lang.unittest.test ---
09:34:40 [2020-12-08T14:34:40.753Z] [INFO] Building jar: /home/jenkins/agent/workspace/ease.verify.core.target.2019-06/tests/org.eclipse.ease.lang.unittest.test/target/org.eclipse.ease.lang.unittest.test-0.8.0-SNAPSHOT.jar
09:34:40 [2020-12-08T14:34:40.753Z] [INFO] 
09:34:40 [2020-12-08T14:34:40.753Z] [INFO] --- tycho-p2-plugin:1.5.0:p2-metadata-default (default-p2-metadata-default) @ org.eclipse.ease.lang.unittest.test ---
09:34:40 [2020-12-08T14:34:40.753Z] [INFO] 
09:34:40 [2020-12-08T14:34:40.753Z] [INFO] --- tycho-source-feature-plugin:1.5.0:source-feature (source-feature) @ org.eclipse.ease.lang.unittest.test ---
09:34:40 [2020-12-08T14:34:40.753Z] [INFO] 
09:34:40 [2020-12-08T14:34:40.753Z] [INFO] --- tycho-p2-plugin:1.5.0:p2-metadata (attached-p2-metadata) @ org.eclipse.ease.lang.unittest.test ---
09:34:40 [2020-12-08T14:34:40.753Z] [INFO] 
09:34:40 [2020-12-08T14:34:40.753Z] [INFO] --- tycho-surefire-plugin:1.5.0:test (default-test) @ org.eclipse.ease.lang.unittest.test ---
09:34:41 [2020-12-08T14:34:41.088Z] [INFO] Expected eclipse log file: /home/jenkins/agent/workspace/ease.verify.core.target.2019-06/tests/org.eclipse.ease.lang.unittest.test/target/work/data/.metadata/.log
09:34:41 [2020-12-08T14:34:41.088Z] [INFO] Command line:
09:34:41 [2020-12-08T14:34:41.088Z] 	[/opt/tools/java/openjdk/jdk-11/11.0.2+9/bin/java, -Dosgi.noShutdown=false, -Dosgi.os=linux, -Dosgi.ws=gtk, -Dosgi.arch=x86_64, -Dosgi.clean=true, -jar, /home/jenkins/.m2/repository/p2/osgi/bundle/org.eclipse.equinox.launcher/1.5.800.v20200727-1323/org.eclipse.equinox.launcher-1.5.800.v20200727-1323.jar, -data, /home/jenkins/agent/workspace/ease.verify.core.target.2019-06/tests/org.eclipse.ease.lang.unittest.test/target/work/data, -install, /home/jenkins/agent/workspace/ease.verify.core.target.2019-06/tests/org.eclipse.ease.lang.unittest.test/target/work, -configuration, /home/jenkins/agent/workspace/ease.verify.core.target.2019-06/tests/org.eclipse.ease.lang.unittest.test/target/work/configuration, -application, org.eclipse.tycho.surefire.osgibooter.headlesstest, -testproperties, /home/jenkins/agent/workspace/ease.verify.core.target.2019-06/tests/org.eclipse.ease.lang.unittest.test/target/surefire.properties]
09:34:41 [2020-12-08T14:34:41.088Z] Picked up JAVA_TOOL_OPTIONS: -Dmaven.ext.class.path="/home/jenkins/agent/workspace/ease.verify.core.target.2019-06@tmp/withMaven34c68374/pipeline-maven-spy.jar" -Dorg.jenkinsci.plugins.pipeline.maven.reportsFolder="/home/jenkins/agent/workspace/ease.verify.core.target.2019-06@tmp/withMaven34c68374" 
09:34:43 [2020-12-08T14:34:43.049Z] Running org.eclipse.ease.lang.unittest.ClassicJavaScriptTest
09:34:44 [2020-12-08T14:34:44.950Z] Tests run: 7, Failures: 0, Errors: 0, Skipped: 0, Time elapsed: 1.653 s - in org.eclipse.ease.lang.unittest.ClassicJavaScriptTest
09:34:44 [2020-12-08T14:34:44.950Z] folderStatus(org.eclipse.ease.lang.unittest.ClassicJavaScriptTest)  Time elapsed: 0.572 s
09:34:44 [2020-12-08T14:34:44.950Z] errorTestStatus(org.eclipse.ease.lang.unittest.ClassicJavaScriptTest)  Time elapsed: 0.184 s
09:34:44 [2020-12-08T14:34:44.950Z] failureTestStatus(org.eclipse.ease.lang.unittest.ClassicJavaScriptTest)  Time elapsed: 0.109 s
09:34:44 [2020-12-08T14:34:44.950Z] verifyOutput(org.eclipse.ease.lang.unittest.ClassicJavaScriptTest)  Time elapsed: 0.112 s
09:34:44 [2020-12-08T14:34:44.950Z] suiteStatus(org.eclipse.ease.lang.unittest.ClassicJavaScriptTest)  Time elapsed: 0.464 s
09:34:44 [2020-12-08T14:34:44.950Z] ignoreTestStatus(org.eclipse.ease.lang.unittest.ClassicJavaScriptTest)  Time elapsed: 0.093 s
09:34:44 [2020-12-08T14:34:44.950Z] passTestStatus(org.eclipse.ease.lang.unittest.ClassicJavaScriptTest)  Time elapsed: 0.057 s
09:34:44 [2020-12-08T14:34:44.950Z] Running org.eclipse.ease.lang.unittest.ModernJavaScriptTest
09:34:45 [2020-12-08T14:34:45.514Z] Tests run: 8, Failures: 0, Errors: 0, Skipped: 0, Time elapsed: 0.743 s - in org.eclipse.ease.lang.unittest.ModernJavaScriptTest
09:34:45 [2020-12-08T14:34:45.514Z] folderStatus(org.eclipse.ease.lang.unittest.ModernJavaScriptTest)  Time elapsed: 0.138 s
09:34:45 [2020-12-08T14:34:45.514Z] verifyOutput(org.eclipse.ease.lang.unittest.ModernJavaScriptTest)  Time elapsed: 0.114 s
09:34:45 [2020-12-08T14:34:45.514Z] suiteStatus(org.eclipse.ease.lang.unittest.ModernJavaScriptTest)  Time elapsed: 0.09 s
09:34:45 [2020-12-08T14:34:45.514Z] ignoreTestStatus(org.eclipse.ease.lang.unittest.ModernJavaScriptTest)  Time elapsed: 0.088 s
09:34:45 [2020-12-08T14:34:45.514Z] ignoreTestClassStatus(org.eclipse.ease.lang.unittest.ModernJavaScriptTest)  Time elapsed: 0.084 s
09:34:45 [2020-12-08T14:34:45.514Z] failureTestClassStatus(org.eclipse.ease.lang.unittest.ModernJavaScriptTest)  Time elapsed: 0.089 s
09:34:45 [2020-12-08T14:34:45.514Z] errorTestClassStatus(org.eclipse.ease.lang.unittest.ModernJavaScriptTest)  Time elapsed: 0.083 s
09:34:45 [2020-12-08T14:34:45.514Z] passTestClassStatus(org.eclipse.ease.lang.unittest.ModernJavaScriptTest)  Time elapsed: 0.055 s
09:34:45 [2020-12-08T14:34:45.514Z] 
09:34:45 [2020-12-08T14:34:45.514Z] Results:
09:34:45 [2020-12-08T14:34:45.514Z] 
09:34:45 [2020-12-08T14:34:45.514Z] Tests run: 15, Failures: 0, Errors: 0, Skipped: 0
09:34:45 [2020-12-08T14:34:45.514Z] 
09:34:46 [2020-12-08T14:34:46.441Z] [INFO] All tests passed!
09:34:46 [2020-12-08T14:34:46.441Z] [INFO] 
09:34:46 [2020-12-08T14:34:46.442Z] [INFO] --- maven-install-plugin:2.3.1:install (default-install) @ org.eclipse.ease.lang.unittest.test ---
09:34:46 [2020-12-08T14:34:46.442Z] [INFO] Installing /home/jenkins/agent/workspace/ease.verify.core.target.2019-06/tests/org.eclipse.ease.lang.unittest.test/target/org.eclipse.ease.lang.unittest.test-0.8.0-SNAPSHOT.jar to /home/jenkins/.m2/repository/org/eclipse/ease/org.eclipse.ease.lang.unittest.test/0.8.0-SNAPSHOT/org.eclipse.ease.lang.unittest.test-0.8.0-SNAPSHOT.jar
09:34:46 [2020-12-08T14:34:46.442Z] [INFO] Installing /home/jenkins/agent/workspace/ease.verify.core.target.2019-06/tests/org.eclipse.ease.lang.unittest.test/pom.xml to /home/jenkins/.m2/repository/org/eclipse/ease/org.eclipse.ease.lang.unittest.test/0.8.0-SNAPSHOT/org.eclipse.ease.lang.unittest.test-0.8.0-SNAPSHOT.pom
09:34:46 [2020-12-08T14:34:46.698Z] [INFO] Installing /home/jenkins/agent/workspace/ease.verify.core.target.2019-06/tests/org.eclipse.ease.lang.unittest.test/target/org.eclipse.ease.lang.unittest.test-0.8.0-SNAPSHOT-sources.jar to /home/jenkins/.m2/repository/org/eclipse/ease/org.eclipse.ease.lang.unittest.test/0.8.0-SNAPSHOT/org.eclipse.ease.lang.unittest.test-0.8.0-SNAPSHOT-sources.jar
09:34:46 [2020-12-08T14:34:46.698Z] [INFO] Installing /home/jenkins/agent/workspace/ease.verify.core.target.2019-06/tests/org.eclipse.ease.lang.unittest.test/target/p2content.xml to /home/jenkins/.m2/repository/org/eclipse/ease/org.eclipse.ease.lang.unittest.test/0.8.0-SNAPSHOT/org.eclipse.ease.lang.unittest.test-0.8.0-SNAPSHOT-p2metadata.xml
09:34:46 [2020-12-08T14:34:46.698Z] [INFO] Installing /home/jenkins/agent/workspace/ease.verify.core.target.2019-06/tests/org.eclipse.ease.lang.unittest.test/target/p2artifacts.xml to /home/jenkins/.m2/repository/org/eclipse/ease/org.eclipse.ease.lang.unittest.test/0.8.0-SNAPSHOT/org.eclipse.ease.lang.unittest.test-0.8.0-SNAPSHOT-p2artifacts.xml
09:34:46 [2020-12-08T14:34:46.698Z] [INFO] Installing /home/jenkins/agent/workspace/ease.verify.core.target.2019-06/tests/org.eclipse.ease.lang.unittest.test/target/p2content.xml to /home/jenkins/.m2/repository/org/eclipse/ease/org.eclipse.ease.lang.unittest.test/0.8.0-SNAPSHOT/org.eclipse.ease.lang.unittest.test-0.8.0-SNAPSHOT-p2metadata.xml
09:34:46 [2020-12-08T14:34:46.698Z] [INFO] Installing /home/jenkins/agent/workspace/ease.verify.core.target.2019-06/tests/org.eclipse.ease.lang.unittest.test/target/p2artifacts.xml to /home/jenkins/.m2/repository/org/eclipse/ease/org.eclipse.ease.lang.unittest.test/0.8.0-SNAPSHOT/org.eclipse.ease.lang.unittest.test-0.8.0-SNAPSHOT-p2artifacts.xml
09:34:46 [2020-12-08T14:34:46.698Z] [INFO] 
09:34:46 [2020-12-08T14:34:46.698Z] [INFO] --- tycho-p2-plugin:1.5.0:update-local-index (default-update-local-index) @ org.eclipse.ease.lang.unittest.test ---
09:34:46 [2020-12-08T14:34:46.698Z] [INFO] 
09:34:46 [2020-12-08T14:34:46.698Z] [INFO] ---------< org.eclipse.ease:org.eclipse.ease.ui.scripts.test >----------
09:34:46 [2020-12-08T14:34:46.698Z] [INFO] Building org.eclipse.ease.ui.scripts.test 0.8.0-SNAPSHOT         [46/48]
09:34:46 [2020-12-08T14:34:46.698Z] [INFO] ------------------------[ eclipse-test-plugin ]-------------------------
09:34:46 [2020-12-08T14:34:46.698Z] [INFO] 
09:34:46 [2020-12-08T14:34:46.698Z] [INFO] --- maven-clean-plugin:2.5:clean (default-clean) @ org.eclipse.ease.ui.scripts.test ---
09:34:46 [2020-12-08T14:34:46.698Z] [INFO] 
09:34:46 [2020-12-08T14:34:46.698Z] [INFO] --- tycho-packaging-plugin:1.5.0:build-qualifier (default-build-qualifier) @ org.eclipse.ease.ui.scripts.test ---
09:34:46 [2020-12-08T14:34:46.698Z] [INFO] The project's OSGi version is 0.8.0.I202009240747
09:34:46 [2020-12-08T14:34:46.698Z] [INFO] 
09:34:46 [2020-12-08T14:34:46.698Z] [INFO] --- tycho-packaging-plugin:1.5.0:validate-id (default-validate-id) @ org.eclipse.ease.ui.scripts.test ---
09:34:46 [2020-12-08T14:34:46.698Z] [INFO] 
09:34:46 [2020-12-08T14:34:46.698Z] [INFO] --- tycho-packaging-plugin:1.5.0:validate-version (default-validate-version) @ org.eclipse.ease.ui.scripts.test ---
09:34:46 [2020-12-08T14:34:46.698Z] [INFO] 
09:34:46 [2020-12-08T14:34:46.698Z] [INFO] >>> maven-javadoc-plugin:2.9.1:javadoc (build-docs) > generate-sources @ org.eclipse.ease.ui.scripts.test >>>
09:34:46 [2020-12-08T14:34:46.698Z] [INFO] 
09:34:46 [2020-12-08T14:34:46.698Z] [INFO] --- tycho-packaging-plugin:1.5.0:build-qualifier (default-build-qualifier) @ org.eclipse.ease.ui.scripts.test ---
09:34:46 [2020-12-08T14:34:46.698Z] [INFO] The project's OSGi version is 0.8.0.I202009240747
09:34:46 [2020-12-08T14:34:46.698Z] [INFO] 
09:34:46 [2020-12-08T14:34:46.699Z] [INFO] --- tycho-packaging-plugin:1.5.0:validate-id (default-validate-id) @ org.eclipse.ease.ui.scripts.test ---
09:34:46 [2020-12-08T14:34:46.699Z] [INFO] 
09:34:46 [2020-12-08T14:34:46.699Z] [INFO] --- tycho-packaging-plugin:1.5.0:validate-version (default-validate-version) @ org.eclipse.ease.ui.scripts.test ---
09:34:46 [2020-12-08T14:34:46.699Z] [INFO] 
09:34:46 [2020-12-08T14:34:46.699Z] [INFO] <<< maven-javadoc-plugin:2.9.1:javadoc (build-docs) < generate-sources @ org.eclipse.ease.ui.scripts.test <<<
09:34:46 [2020-12-08T14:34:46.699Z] [INFO] 
09:34:46 [2020-12-08T14:34:46.699Z] [INFO] 
09:34:46 [2020-12-08T14:34:46.699Z] [INFO] --- maven-javadoc-plugin:2.9.1:javadoc (build-docs) @ org.eclipse.ease.ui.scripts.test ---
09:34:46 [2020-12-08T14:34:46.955Z] [ERROR] Error fetching link: http://help.eclipse.org/oxygen/topic/org.eclipse.platform.doc.isv/reference/api/package-list. Ignored it.
09:34:46 [2020-12-08T14:34:46.955Z] [ERROR] Error fetching link: https://ci.eclipse.org/ease/job/ease.build.core/JavaDoc/package-list. Ignored it.
09:34:47 [2020-12-08T14:34:47.883Z] [INFO] 
09:34:47 [2020-12-08T14:34:47.883Z] Loading source files for package org.eclipse.ease.ui.scripts.expressions.definitions...
09:34:47 [2020-12-08T14:34:47.883Z] Constructing Javadoc information...
09:34:47 [2020-12-08T14:34:47.883Z] WARNING: Cannot open location "/home/jenkins/agent/workspace/ease.verify.core.target.2019-06/tests/org.eclipse.ease.ui.scripts.test/target/javadoc-bundle-options/package-list"
09:34:47 [2020-12-08T14:34:47.883Z] No plugin definition found, skipping
09:34:47 [2020-12-08T14:34:47.883Z] No plugin definition found, skipping
09:34:47 [2020-12-08T14:34:47.883Z] [WARNING] Javadoc Warnings
09:34:47 [2020-12-08T14:34:47.883Z] [WARNING] Picked up JAVA_TOOL_OPTIONS: -Dmaven.ext.class.path="/home/jenkins/agent/workspace/ease.verify.core.target.2019-06@tmp/withMaven34c68374/pipeline-maven-spy.jar" -Dorg.jenkinsci.plugins.pipeline.maven.reportsFolder="/home/jenkins/agent/workspace/ease.verify.core.target.2019-06@tmp/withMaven34c68374"
09:34:47 [2020-12-08T14:34:47.883Z] [WARNING] javadoc: warning - The old Doclet and Taglet APIs in the packages
09:34:47 [2020-12-08T14:34:47.883Z] [WARNING] com.sun.javadoc, com.sun.tools.doclets and their implementations
09:34:47 [2020-12-08T14:34:47.884Z] [WARNING] are planned to be removed in a future JDK release. These
09:34:47 [2020-12-08T14:34:47.884Z] [WARNING] components have been superseded by the new APIs in jdk.javadoc.doclet.
09:34:47 [2020-12-08T14:34:47.884Z] [WARNING] Users are strongly recommended to migrate to the new APIs.
09:34:47 [2020-12-08T14:34:47.884Z] [INFO] 
09:34:47 [2020-12-08T14:34:47.884Z] [INFO] --- build-helper-maven-plugin:1.9.1:add-resource (add_help) @ org.eclipse.ease.ui.scripts.test ---
09:34:47 [2020-12-08T14:34:47.884Z] [INFO] 
09:34:47 [2020-12-08T14:34:47.884Z] [INFO] --- maven-resources-plugin:2.4.3:resources (default-resources) @ org.eclipse.ease.ui.scripts.test ---
09:34:47 [2020-12-08T14:34:47.884Z] [INFO] Using 'UTF-8' encoding to copy filtered resources.
09:34:47 [2020-12-08T14:34:47.884Z] [INFO] skip non existing resourceDirectory /home/jenkins/agent/workspace/ease.verify.core.target.2019-06/tests/org.eclipse.ease.ui.scripts.test/src/main/resources
09:34:47 [2020-12-08T14:34:47.884Z] [INFO] skip non existing resourceDirectory /home/jenkins/agent/workspace/ease.verify.core.target.2019-06/tests/org.eclipse.ease.ui.scripts.test/help
09:34:47 [2020-12-08T14:34:47.884Z] [INFO] 
09:34:47 [2020-12-08T14:34:47.884Z] [INFO] --- tycho-compiler-plugin:1.5.0:compile (default-compile) @ org.eclipse.ease.ui.scripts.test ---
09:34:47 [2020-12-08T14:34:47.884Z] [INFO] Compiling 1 source file to /home/jenkins/agent/workspace/ease.verify.core.target.2019-06/tests/org.eclipse.ease.ui.scripts.test/target/classes
09:34:47 [2020-12-08T14:34:47.884Z] [INFO] 
09:34:47 [2020-12-08T14:34:47.884Z] [INFO] --- maven-resources-plugin:2.4.3:testResources (default-testResources) @ org.eclipse.ease.ui.scripts.test ---
09:34:47 [2020-12-08T14:34:47.884Z] [INFO] Using 'UTF-8' encoding to copy filtered resources.
09:34:47 [2020-12-08T14:34:47.884Z] [INFO] skip non existing resourceDirectory /home/jenkins/agent/workspace/ease.verify.core.target.2019-06/tests/org.eclipse.ease.ui.scripts.test/src/test/resources
09:34:47 [2020-12-08T14:34:47.884Z] [INFO] 
09:34:47 [2020-12-08T14:34:47.884Z] [INFO] --- tycho-source-plugin:1.5.0:plugin-source (plugin-source) @ org.eclipse.ease.ui.scripts.test ---
09:34:47 [2020-12-08T14:34:47.884Z] [INFO] Building jar: /home/jenkins/agent/workspace/ease.verify.core.target.2019-06/tests/org.eclipse.ease.ui.scripts.test/target/org.eclipse.ease.ui.scripts.test-0.8.0-SNAPSHOT-sources.jar
09:34:47 [2020-12-08T14:34:47.884Z] [INFO] 
09:34:47 [2020-12-08T14:34:47.884Z] [INFO] --- target-platform-configuration:1.5.0:target-platform (default-target-platform) @ org.eclipse.ease.ui.scripts.test ---
09:34:47 [2020-12-08T14:34:47.884Z] [INFO] 
09:34:47 [2020-12-08T14:34:47.884Z] [INFO] --- tycho-packaging-plugin:1.5.0:package-plugin (default-package-plugin) @ org.eclipse.ease.ui.scripts.test ---
09:34:47 [2020-12-08T14:34:47.884Z] [INFO] Building jar: /home/jenkins/agent/workspace/ease.verify.core.target.2019-06/tests/org.eclipse.ease.ui.scripts.test/target/org.eclipse.ease.ui.scripts.test-0.8.0-SNAPSHOT.jar
09:34:47 [2020-12-08T14:34:47.884Z] [INFO] 
09:34:47 [2020-12-08T14:34:47.884Z] [INFO] --- tycho-p2-plugin:1.5.0:p2-metadata-default (default-p2-metadata-default) @ org.eclipse.ease.ui.scripts.test ---
09:34:47 [2020-12-08T14:34:47.884Z] [INFO] 
09:34:47 [2020-12-08T14:34:47.884Z] [INFO] --- tycho-source-feature-plugin:1.5.0:source-feature (source-feature) @ org.eclipse.ease.ui.scripts.test ---
09:34:47 [2020-12-08T14:34:47.884Z] [INFO] 
09:34:47 [2020-12-08T14:34:47.884Z] [INFO] --- tycho-p2-plugin:1.5.0:p2-metadata (attached-p2-metadata) @ org.eclipse.ease.ui.scripts.test ---
09:34:48 [2020-12-08T14:34:48.193Z] [INFO] 
09:34:48 [2020-12-08T14:34:48.193Z] [INFO] --- tycho-surefire-plugin:1.5.0:test (default-test) @ org.eclipse.ease.ui.scripts.test ---
09:34:48 [2020-12-08T14:34:48.193Z] [INFO] Expected eclipse log file: /home/jenkins/agent/workspace/ease.verify.core.target.2019-06/tests/org.eclipse.ease.ui.scripts.test/target/work/data/.metadata/.log
09:34:48 [2020-12-08T14:34:48.193Z] [INFO] Command line:
09:34:48 [2020-12-08T14:34:48.194Z] 	[/opt/tools/java/openjdk/jdk-11/11.0.2+9/bin/java, -Dosgi.noShutdown=false, -Dosgi.os=linux, -Dosgi.ws=gtk, -Dosgi.arch=x86_64, -Dosgi.clean=true, -jar, /home/jenkins/.m2/repository/p2/osgi/bundle/org.eclipse.equinox.launcher/1.5.800.v20200727-1323/org.eclipse.equinox.launcher-1.5.800.v20200727-1323.jar, -data, /home/jenkins/agent/workspace/ease.verify.core.target.2019-06/tests/org.eclipse.ease.ui.scripts.test/target/work/data, -install, /home/jenkins/agent/workspace/ease.verify.core.target.2019-06/tests/org.eclipse.ease.ui.scripts.test/target/work, -configuration, /home/jenkins/agent/workspace/ease.verify.core.target.2019-06/tests/org.eclipse.ease.ui.scripts.test/target/work/configuration, -application, org.eclipse.tycho.surefire.osgibooter.headlesstest, -testproperties, /home/jenkins/agent/workspace/ease.verify.core.target.2019-06/tests/org.eclipse.ease.ui.scripts.test/target/surefire.properties]
09:34:48 [2020-12-08T14:34:48.194Z] Picked up JAVA_TOOL_OPTIONS: -Dmaven.ext.class.path="/home/jenkins/agent/workspace/ease.verify.core.target.2019-06@tmp/withMaven34c68374/pipeline-maven-spy.jar" -Dorg.jenkinsci.plugins.pipeline.maven.reportsFolder="/home/jenkins/agent/workspace/ease.verify.core.target.2019-06@tmp/withMaven34c68374" 
09:34:50 [2020-12-08T14:34:50.781Z] Running org.eclipse.ease.ui.scripts.expressions.definitions.ExpressionFactoryTest
09:34:50 [2020-12-08T14:34:50.781Z] Tests run: 14, Failures: 0, Errors: 0, Skipped: 0, Time elapsed: 0.021 s - in org.eclipse.ease.ui.scripts.expressions.definitions.ExpressionFactoryTest
09:34:50 [2020-12-08T14:34:50.781Z] loadClassWithExpression  Time elapsed: 0.008 s
09:34:50 [2020-12-08T14:34:50.781Z] createWithExpression  Time elapsed: 0.001 s
09:34:50 [2020-12-08T14:34:50.781Z] createReferenceExpression  Time elapsed: 0 s
09:34:50 [2020-12-08T14:34:50.781Z] loadClassReferenceExpression  Time elapsed: 0 s
09:34:50 [2020-12-08T14:34:50.781Z] loadClassTestExpression  Time elapsed: 0.001 s
09:34:50 [2020-12-08T14:34:50.781Z] createEqualsExpression  Time elapsed: 0.001 s
09:34:50 [2020-12-08T14:34:50.781Z] loadClassCountExpression  Time elapsed: 0 s
09:34:50 [2020-12-08T14:34:50.781Z] loadClassOrExpression  Time elapsed: 0 s
09:34:50 [2020-12-08T14:34:50.781Z] createTestExpression  Time elapsed: 0.002 s
09:34:50 [2020-12-08T14:34:50.781Z] createOrExpression  Time elapsed: 0.001 s
09:34:50 [2020-12-08T14:34:50.782Z] loadClassAndExpression  Time elapsed: 0.001 s
09:34:50 [2020-12-08T14:34:50.782Z] createAndExpression  Time elapsed: 0 s
09:34:50 [2020-12-08T14:34:50.782Z] loadClassEqualsExpression  Time elapsed: 0.001 s
09:34:50 [2020-12-08T14:34:50.782Z] createCountExpression  Time elapsed: 0 s
09:34:50 [2020-12-08T14:34:50.782Z] 
09:34:50 [2020-12-08T14:34:50.782Z] Results:
09:34:50 [2020-12-08T14:34:50.782Z] 
09:34:50 [2020-12-08T14:34:50.782Z] Tests run: 14, Failures: 0, Errors: 0, Skipped: 0
09:34:50 [2020-12-08T14:34:50.782Z] 
09:34:51 [2020-12-08T14:34:51.038Z] [INFO] All tests passed!
09:34:51 [2020-12-08T14:34:51.038Z] [INFO] 
09:34:51 [2020-12-08T14:34:51.038Z] [INFO] --- maven-install-plugin:2.3.1:install (default-install) @ org.eclipse.ease.ui.scripts.test ---
09:34:51 [2020-12-08T14:34:51.038Z] [INFO] Installing /home/jenkins/agent/workspace/ease.verify.core.target.2019-06/tests/org.eclipse.ease.ui.scripts.test/target/org.eclipse.ease.ui.scripts.test-0.8.0-SNAPSHOT.jar to /home/jenkins/.m2/repository/org/eclipse/ease/org.eclipse.ease.ui.scripts.test/0.8.0-SNAPSHOT/org.eclipse.ease.ui.scripts.test-0.8.0-SNAPSHOT.jar
09:34:51 [2020-12-08T14:34:51.038Z] [INFO] Installing /home/jenkins/agent/workspace/ease.verify.core.target.2019-06/tests/org.eclipse.ease.ui.scripts.test/pom.xml to /home/jenkins/.m2/repository/org/eclipse/ease/org.eclipse.ease.ui.scripts.test/0.8.0-SNAPSHOT/org.eclipse.ease.ui.scripts.test-0.8.0-SNAPSHOT.pom
09:34:51 [2020-12-08T14:34:51.038Z] [INFO] Installing /home/jenkins/agent/workspace/ease.verify.core.target.2019-06/tests/org.eclipse.ease.ui.scripts.test/target/org.eclipse.ease.ui.scripts.test-0.8.0-SNAPSHOT-sources.jar to /home/jenkins/.m2/repository/org/eclipse/ease/org.eclipse.ease.ui.scripts.test/0.8.0-SNAPSHOT/org.eclipse.ease.ui.scripts.test-0.8.0-SNAPSHOT-sources.jar
09:34:51 [2020-12-08T14:34:51.038Z] [INFO] Installing /home/jenkins/agent/workspace/ease.verify.core.target.2019-06/tests/org.eclipse.ease.ui.scripts.test/target/p2content.xml to /home/jenkins/.m2/repository/org/eclipse/ease/org.eclipse.ease.ui.scripts.test/0.8.0-SNAPSHOT/org.eclipse.ease.ui.scripts.test-0.8.0-SNAPSHOT-p2metadata.xml
09:34:51 [2020-12-08T14:34:51.038Z] [INFO] Installing /home/jenkins/agent/workspace/ease.verify.core.target.2019-06/tests/org.eclipse.ease.ui.scripts.test/target/p2artifacts.xml to /home/jenkins/.m2/repository/org/eclipse/ease/org.eclipse.ease.ui.scripts.test/0.8.0-SNAPSHOT/org.eclipse.ease.ui.scripts.test-0.8.0-SNAPSHOT-p2artifacts.xml
09:34:51 [2020-12-08T14:34:51.038Z] [INFO] Installing /home/jenkins/agent/workspace/ease.verify.core.target.2019-06/tests/org.eclipse.ease.ui.scripts.test/target/p2content.xml to /home/jenkins/.m2/repository/org/eclipse/ease/org.eclipse.ease.ui.scripts.test/0.8.0-SNAPSHOT/org.eclipse.ease.ui.scripts.test-0.8.0-SNAPSHOT-p2metadata.xml
09:34:51 [2020-12-08T14:34:51.038Z] [INFO] Installing /home/jenkins/agent/workspace/ease.verify.core.target.2019-06/tests/org.eclipse.ease.ui.scripts.test/target/p2artifacts.xml to /home/jenkins/.m2/repository/org/eclipse/ease/org.eclipse.ease.ui.scripts.test/0.8.0-SNAPSHOT/org.eclipse.ease.ui.scripts.test-0.8.0-SNAPSHOT-p2artifacts.xml
09:34:51 [2020-12-08T14:34:51.038Z] [INFO] 
09:34:51 [2020-12-08T14:34:51.038Z] [INFO] --- tycho-p2-plugin:1.5.0:update-local-index (default-update-local-index) @ org.eclipse.ease.ui.scripts.test ---
09:34:51 [2020-12-08T14:34:51.038Z] [INFO] 
09:34:51 [2020-12-08T14:34:51.038Z] [INFO] -------------< org.eclipse.ease:org.eclipse.ease.ui.test >--------------
09:34:51 [2020-12-08T14:34:51.038Z] [INFO] Building org.eclipse.ease.ui.test 0.8.0-SNAPSHOT                 [47/48]
09:34:51 [2020-12-08T14:34:51.038Z] [INFO] ------------------------[ eclipse-test-plugin ]-------------------------
09:34:51 [2020-12-08T14:34:51.038Z] [INFO] 
09:34:51 [2020-12-08T14:34:51.038Z] [INFO] --- maven-clean-plugin:2.5:clean (default-clean) @ org.eclipse.ease.ui.test ---
09:34:51 [2020-12-08T14:34:51.038Z] [INFO] 
09:34:51 [2020-12-08T14:34:51.038Z] [INFO] --- tycho-packaging-plugin:1.5.0:build-qualifier (default-build-qualifier) @ org.eclipse.ease.ui.test ---
09:34:51 [2020-12-08T14:34:51.038Z] [INFO] The project's OSGi version is 0.8.0.I201910171213
09:34:51 [2020-12-08T14:34:51.038Z] [INFO] 
09:34:51 [2020-12-08T14:34:51.038Z] [INFO] --- tycho-packaging-plugin:1.5.0:validate-id (default-validate-id) @ org.eclipse.ease.ui.test ---
09:34:51 [2020-12-08T14:34:51.038Z] [INFO] 
09:34:51 [2020-12-08T14:34:51.039Z] [INFO] --- tycho-packaging-plugin:1.5.0:validate-version (default-validate-version) @ org.eclipse.ease.ui.test ---
09:34:51 [2020-12-08T14:34:51.039Z] [INFO] 
09:34:51 [2020-12-08T14:34:51.039Z] [INFO] >>> maven-javadoc-plugin:2.9.1:javadoc (build-docs) > generate-sources @ org.eclipse.ease.ui.test >>>
09:34:51 [2020-12-08T14:34:51.039Z] [INFO] 
09:34:51 [2020-12-08T14:34:51.039Z] [INFO] --- tycho-packaging-plugin:1.5.0:build-qualifier (default-build-qualifier) @ org.eclipse.ease.ui.test ---
09:34:51 [2020-12-08T14:34:51.039Z] [INFO] The project's OSGi version is 0.8.0.I201910171213
09:34:51 [2020-12-08T14:34:51.039Z] [INFO] 
09:34:51 [2020-12-08T14:34:51.039Z] [INFO] --- tycho-packaging-plugin:1.5.0:validate-id (default-validate-id) @ org.eclipse.ease.ui.test ---
09:34:51 [2020-12-08T14:34:51.039Z] [INFO] 
09:34:51 [2020-12-08T14:34:51.039Z] [INFO] --- tycho-packaging-plugin:1.5.0:validate-version (default-validate-version) @ org.eclipse.ease.ui.test ---
09:34:51 [2020-12-08T14:34:51.039Z] [INFO] 
09:34:51 [2020-12-08T14:34:51.039Z] [INFO] <<< maven-javadoc-plugin:2.9.1:javadoc (build-docs) < generate-sources @ org.eclipse.ease.ui.test <<<
09:34:51 [2020-12-08T14:34:51.039Z] [INFO] 
09:34:51 [2020-12-08T14:34:51.039Z] [INFO] 
09:34:51 [2020-12-08T14:34:51.039Z] [INFO] --- maven-javadoc-plugin:2.9.1:javadoc (build-docs) @ org.eclipse.ease.ui.test ---
09:34:51 [2020-12-08T14:34:51.294Z] [ERROR] Error fetching link: http://help.eclipse.org/oxygen/topic/org.eclipse.platform.doc.isv/reference/api/package-list. Ignored it.
09:34:51 [2020-12-08T14:34:51.295Z] [ERROR] Error fetching link: https://ci.eclipse.org/ease/job/ease.build.core/JavaDoc/package-list. Ignored it.
09:34:52 [2020-12-08T14:34:52.688Z] [INFO] 
09:34:52 [2020-12-08T14:34:52.688Z] Loading source files for package org.eclipse.ease.ui.completion...
09:34:52 [2020-12-08T14:34:52.688Z] Loading source files for package org.eclipse.ease.ui.completion.provider...
09:34:52 [2020-12-08T14:34:52.688Z] Loading source files for package org.eclipse.ease.ui.completions.java.provider...
09:34:52 [2020-12-08T14:34:52.688Z] Loading source files for package org.eclipse.ease.ui.help.hovers...
09:34:52 [2020-12-08T14:34:52.688Z] Constructing Javadoc information...
09:34:52 [2020-12-08T14:34:52.688Z] WARNING: Cannot open location "/home/jenkins/agent/workspace/ease.verify.core.target.2019-06/tests/org.eclipse.ease.ui.test/target/javadoc-bundle-options/package-list"
09:34:52 [2020-12-08T14:34:52.688Z] [WARNING] Javadoc Warnings
09:34:52 [2020-12-08T14:34:52.688Z] [WARNING] Picked up JAVA_TOOL_OPTIONS: -Dmaven.ext.class.path="/home/jenkins/agent/workspace/ease.verify.core.target.2019-06@tmp/withMaven34c68374/pipeline-maven-spy.jar" -Dorg.jenkinsci.plugins.pipeline.maven.reportsFolder="/home/jenkins/agent/workspace/ease.verify.core.target.2019-06@tmp/withMaven34c68374"
09:34:52 [2020-12-08T14:34:52.688Z] [WARNING] javadoc: warning - The old Doclet and Taglet APIs in the packages
09:34:52 [2020-12-08T14:34:52.688Z] [WARNING] com.sun.javadoc, com.sun.tools.doclets and their implementations
09:34:52 [2020-12-08T14:34:52.688Z] [WARNING] are planned to be removed in a future JDK release. These
09:34:52 [2020-12-08T14:34:52.688Z] [WARNING] components have been superseded by the new APIs in jdk.javadoc.doclet.
09:34:52 [2020-12-08T14:34:52.688Z] [WARNING] Users are strongly recommended to migrate to the new APIs.
09:34:52 [2020-12-08T14:34:52.688Z] [INFO] 
09:34:52 [2020-12-08T14:34:52.688Z] [INFO] --- build-helper-maven-plugin:1.9.1:add-resource (add_help) @ org.eclipse.ease.ui.test ---
09:34:52 [2020-12-08T14:34:52.688Z] [INFO] 
09:34:52 [2020-12-08T14:34:52.688Z] [INFO] --- maven-resources-plugin:2.4.3:resources (default-resources) @ org.eclipse.ease.ui.test ---
09:34:52 [2020-12-08T14:34:52.688Z] [INFO] Using 'UTF-8' encoding to copy filtered resources.
09:34:52 [2020-12-08T14:34:52.688Z] [INFO] skip non existing resourceDirectory /home/jenkins/agent/workspace/ease.verify.core.target.2019-06/tests/org.eclipse.ease.ui.test/src/main/resources
09:34:52 [2020-12-08T14:34:52.688Z] [INFO] Copying 2 resources to help
09:34:52 [2020-12-08T14:34:52.688Z] [INFO] 
09:34:52 [2020-12-08T14:34:52.688Z] [INFO] --- tycho-compiler-plugin:1.5.0:compile (default-compile) @ org.eclipse.ease.ui.test ---
09:34:52 [2020-12-08T14:34:52.688Z] [INFO] Compiling 6 source files to /home/jenkins/agent/workspace/ease.verify.core.target.2019-06/tests/org.eclipse.ease.ui.test/target/classes
09:34:52 [2020-12-08T14:34:52.688Z] [INFO] 
09:34:52 [2020-12-08T14:34:52.688Z] [INFO] --- maven-resources-plugin:2.4.3:testResources (default-testResources) @ org.eclipse.ease.ui.test ---
09:34:52 [2020-12-08T14:34:52.688Z] [INFO] Using 'UTF-8' encoding to copy filtered resources.
09:34:52 [2020-12-08T14:34:52.688Z] [INFO] skip non existing resourceDirectory /home/jenkins/agent/workspace/ease.verify.core.target.2019-06/tests/org.eclipse.ease.ui.test/src/test/resources
09:34:52 [2020-12-08T14:34:52.688Z] [INFO] 
09:34:52 [2020-12-08T14:34:52.688Z] [INFO] --- tycho-source-plugin:1.5.0:plugin-source (plugin-source) @ org.eclipse.ease.ui.test ---
09:34:52 [2020-12-08T14:34:52.689Z] [WARNING] Bundle-Vendor header not found in /home/jenkins/agent/workspace/ease.verify.core.target.2019-06/tests/org.eclipse.ease.ui.test/META-INF/MANIFEST.MF, fallback to 'unknown' for source bundle
09:34:52 [2020-12-08T14:34:52.689Z] [INFO] Building jar: /home/jenkins/agent/workspace/ease.verify.core.target.2019-06/tests/org.eclipse.ease.ui.test/target/org.eclipse.ease.ui.test-0.8.0-SNAPSHOT-sources.jar
09:34:52 [2020-12-08T14:34:52.689Z] [INFO] 
09:34:52 [2020-12-08T14:34:52.689Z] [INFO] --- target-platform-configuration:1.5.0:target-platform (default-target-platform) @ org.eclipse.ease.ui.test ---
09:34:52 [2020-12-08T14:34:52.689Z] [INFO] 
09:34:52 [2020-12-08T14:34:52.689Z] [INFO] --- tycho-packaging-plugin:1.5.0:package-plugin (default-package-plugin) @ org.eclipse.ease.ui.test ---
09:34:52 [2020-12-08T14:34:52.689Z] [INFO] Building jar: /home/jenkins/agent/workspace/ease.verify.core.target.2019-06/tests/org.eclipse.ease.ui.test/target/org.eclipse.ease.ui.test-0.8.0-SNAPSHOT.jar
09:34:52 [2020-12-08T14:34:52.689Z] [INFO] 
09:34:52 [2020-12-08T14:34:52.689Z] [INFO] --- tycho-p2-plugin:1.5.0:p2-metadata-default (default-p2-metadata-default) @ org.eclipse.ease.ui.test ---
09:34:52 [2020-12-08T14:34:52.689Z] [INFO] 
09:34:52 [2020-12-08T14:34:52.689Z] [INFO] --- tycho-source-feature-plugin:1.5.0:source-feature (source-feature) @ org.eclipse.ease.ui.test ---
09:34:52 [2020-12-08T14:34:52.689Z] [INFO] 
09:34:52 [2020-12-08T14:34:52.689Z] [INFO] --- tycho-p2-plugin:1.5.0:p2-metadata (attached-p2-metadata) @ org.eclipse.ease.ui.test ---
09:34:52 [2020-12-08T14:34:52.689Z] [INFO] 
09:34:52 [2020-12-08T14:34:52.689Z] [INFO] --- tycho-surefire-plugin:1.5.0:test (default-test) @ org.eclipse.ease.ui.test ---
09:34:52 [2020-12-08T14:34:52.987Z] [INFO] Expected eclipse log file: /home/jenkins/agent/workspace/ease.verify.core.target.2019-06/tests/org.eclipse.ease.ui.test/target/work/data/.metadata/.log
09:34:52 [2020-12-08T14:34:52.987Z] [INFO] Command line:
09:34:52 [2020-12-08T14:34:52.987Z] 	[/opt/tools/java/openjdk/jdk-11/11.0.2+9/bin/java, -Dosgi.noShutdown=false, -Dosgi.os=linux, -Dosgi.ws=gtk, -Dosgi.arch=x86_64, -Dosgi.clean=true, -jar, /home/jenkins/.m2/repository/p2/osgi/bundle/org.eclipse.equinox.launcher/1.5.800.v20200727-1323/org.eclipse.equinox.launcher-1.5.800.v20200727-1323.jar, -data, /home/jenkins/agent/workspace/ease.verify.core.target.2019-06/tests/org.eclipse.ease.ui.test/target/work/data, -install, /home/jenkins/agent/workspace/ease.verify.core.target.2019-06/tests/org.eclipse.ease.ui.test/target/work, -configuration, /home/jenkins/agent/workspace/ease.verify.core.target.2019-06/tests/org.eclipse.ease.ui.test/target/work/configuration, -application, org.eclipse.tycho.surefire.osgibooter.headlesstest, -testproperties, /home/jenkins/agent/workspace/ease.verify.core.target.2019-06/tests/org.eclipse.ease.ui.test/target/surefire.properties]
09:34:52 [2020-12-08T14:34:52.987Z] Picked up JAVA_TOOL_OPTIONS: -Dmaven.ext.class.path="/home/jenkins/agent/workspace/ease.verify.core.target.2019-06@tmp/withMaven34c68374/pipeline-maven-spy.jar" -Dorg.jenkinsci.plugins.pipeline.maven.reportsFolder="/home/jenkins/agent/workspace/ease.verify.core.target.2019-06@tmp/withMaven34c68374" 
09:34:54 [2020-12-08T14:34:54.986Z] Running org.eclipse.ease.ui.completion.CompletionContextTest
09:34:54 [2020-12-08T14:34:54.986Z] Tests run: 9, Failures: 0, Errors: 0, Skipped: 0, Time elapsed: 0.074 s - in org.eclipse.ease.ui.completion.CompletionContextTest
09:34:54 [2020-12-08T14:34:54.986Z] resolveStaticClass(org.eclipse.ease.ui.completion.CompletionContextTest)  Time elapsed: 0.004 s
09:34:54 [2020-12-08T14:34:54.986Z] resolveClassWithFilter(org.eclipse.ease.ui.completion.CompletionContextTest)  Time elapsed: 0 s
09:34:54 [2020-12-08T14:34:54.986Z] simplifyCalls(org.eclipse.ease.ui.completion.CompletionContextTest)  Time elapsed: 0 s
09:34:54 [2020-12-08T14:34:54.986Z] resolveClass(org.eclipse.ease.ui.completion.CompletionContextTest)  Time elapsed: 0 s
09:34:54 [2020-12-08T14:34:54.986Z] replaceEscapedStringLiterals(org.eclipse.ease.ui.completion.CompletionContextTest)  Time elapsed: 0 s
09:34:54 [2020-12-08T14:34:54.986Z] replaceSimpleStringLiterals(org.eclipse.ease.ui.completion.CompletionContextTest)  Time elapsed: 0 s
09:34:54 [2020-12-08T14:34:54.986Z] resolveStaticClassWithFilter(org.eclipse.ease.ui.completion.CompletionContextTest)  Time elapsed: 0 s
09:34:54 [2020-12-08T14:34:54.986Z] resolveClassWithParameters(org.eclipse.ease.ui.completion.CompletionContextTest)  Time elapsed: 0 s
09:34:54 [2020-12-08T14:34:54.986Z] replaceMultipleStringLiterals(org.eclipse.ease.ui.completion.CompletionContextTest)  Time elapsed: 0.001 s
09:34:54 [2020-12-08T14:34:54.986Z] Running org.eclipse.ease.ui.completion.provider.AbstractFileLocationCompletionProviderTest
09:34:55 [2020-12-08T14:34:55.244Z] Tests run: 8, Failures: 0, Errors: 0, Skipped: 8, Time elapsed: 0.101 s - in org.eclipse.ease.ui.completion.provider.AbstractFileLocationCompletionProviderTest
09:34:55 [2020-12-08T14:34:55.244Z] workspaceProjectProposals(org.eclipse.ease.ui.completion.provider.AbstractFileLocationCompletionProviderTest) skipped
09:34:55 [2020-12-08T14:34:55.244Z] checkOperatingSystem(org.eclipse.ease.ui.completion.provider.AbstractFileLocationCompletionProviderTest) skipped
09:34:55 [2020-12-08T14:34:55.244Z] absoluteRootWorkspaceProposals(org.eclipse.ease.ui.completion.provider.AbstractFileLocationCompletionProviderTest) skipped
09:34:55 [2020-12-08T14:34:55.244Z] workspaceFolderProposals(org.eclipse.ease.ui.completion.provider.AbstractFileLocationCompletionProviderTest) skipped
09:34:55 [2020-12-08T14:34:55.244Z] fileSystemFolderProposals(org.eclipse.ease.ui.completion.provider.AbstractFileLocationCompletionProviderTest) skipped
09:34:55 [2020-12-08T14:34:55.244Z] workspaceProposals(org.eclipse.ease.ui.completion.provider.AbstractFileLocationCompletionProviderTest) skipped
09:34:55 [2020-12-08T14:34:55.244Z] relativeRootWorkspaceProposals(org.eclipse.ease.ui.completion.provider.AbstractFileLocationCompletionProviderTest) skipped
09:34:55 [2020-12-08T14:34:55.244Z] fileSystemRootProposals(org.eclipse.ease.ui.completion.provider.AbstractFileLocationCompletionProviderTest) skipped
09:34:55 [2020-12-08T14:34:55.244Z] Running org.eclipse.ease.ui.help.hovers.ModuleHelpTest
09:34:55 [2020-12-08T14:34:55.244Z] Tests run: 4, Failures: 0, Errors: 0, Skipped: 4, Time elapsed: 0.003 s - in org.eclipse.ease.ui.help.hovers.ModuleHelpTest
09:34:55 [2020-12-08T14:34:55.244Z] getModuleHelpLocation(org.eclipse.ease.ui.help.hovers.ModuleHelpTest) skipped
09:34:55 [2020-12-08T14:34:55.244Z] getModuleHelp(org.eclipse.ease.ui.help.hovers.ModuleHelpTest) skipped
09:34:55 [2020-12-08T14:34:55.244Z] getMethodHelp(org.eclipse.ease.ui.help.hovers.ModuleHelpTest) skipped
09:34:55 [2020-12-08T14:34:55.244Z] getConstantHelp(org.eclipse.ease.ui.help.hovers.ModuleHelpTest) skipped
09:34:55 [2020-12-08T14:34:55.244Z] Running org.eclipse.ease.ui.completions.java.provider.JavaPackagesCompletionsProviderTest
09:34:55 [2020-12-08T14:34:55.244Z] WARNING: An illegal reflective access operation has occurred
09:34:55 [2020-12-08T14:34:55.244Z] WARNING: Illegal reflective access by org.mockito.cglib.core.ReflectUtils$2 (file:/home/jenkins/.m2/repository/p2/osgi/bundle/org.mockito/1.9.5.v201605172210/org.mockito-1.9.5.v201605172210.jar) to method java.lang.ClassLoader.defineClass(java.lang.String,byte[],int,int,java.security.ProtectionDomain)
09:34:55 [2020-12-08T14:34:55.244Z] WARNING: Please consider reporting this to the maintainers of org.mockito.cglib.core.ReflectUtils$2
09:34:55 [2020-12-08T14:34:55.244Z] WARNING: Use --illegal-access=warn to enable warnings of further illegal reflective access operations
09:34:55 [2020-12-08T14:34:55.244Z] WARNING: All illegal access operations will be denied in a future release
09:35:01 [2020-12-08T14:35:01.782Z] Tests run: 4, Failures: 0, Errors: 0, Skipped: 0, Time elapsed: 6.06 s - in org.eclipse.ease.ui.completions.java.provider.JavaPackagesCompletionsProviderTest
09:35:01 [2020-12-08T14:35:01.783Z] containsJavaLangPackageProposal(org.eclipse.ease.ui.completions.java.provider.JavaPackagesCompletionsProviderTest)  Time elapsed: 0.586 s
09:35:01 [2020-12-08T14:35:01.783Z] containsOrgRootPackageProposal(org.eclipse.ease.ui.completions.java.provider.JavaPackagesCompletionsProviderTest)  Time elapsed: 0.008 s
09:35:01 [2020-12-08T14:35:01.783Z] containsJavaRootPackageProposal(org.eclipse.ease.ui.completions.java.provider.JavaPackagesCompletionsProviderTest)  Time elapsed: 0.007 s
09:35:01 [2020-12-08T14:35:01.783Z] containsOrgEclipsePackageProposal(org.eclipse.ease.ui.completions.java.provider.JavaPackagesCompletionsProviderTest)  Time elapsed: 0.085 s
09:35:01 [2020-12-08T14:35:01.783Z] Running org.eclipse.ease.ui.completions.java.provider.JavaClassCompletionsProviderTest
09:35:07 [2020-12-08T14:35:07.031Z] Tests run: 6, Failures: 0, Errors: 0, Skipped: 0, Time elapsed: 5.16 s - in org.eclipse.ease.ui.completions.java.provider.JavaClassCompletionsProviderTest
09:35:07 [2020-12-08T14:35:07.031Z] containsPackageFileCompletion(org.eclipse.ease.ui.completions.java.provider.JavaClassCompletionsProviderTest)  Time elapsed: 0.01 s
09:35:07 [2020-12-08T14:35:07.031Z] containsGlobalFileCompletion(org.eclipse.ease.ui.completions.java.provider.JavaClassCompletionsProviderTest)  Time elapsed: 0.036 s
09:35:07 [2020-12-08T14:35:07.031Z] containsJavaLangPackageProposal(org.eclipse.ease.ui.completions.java.provider.JavaClassCompletionsProviderTest)  Time elapsed: 0.044 s
09:35:07 [2020-12-08T14:35:07.031Z] containsOrgRootPackageProposal(org.eclipse.ease.ui.completions.java.provider.JavaClassCompletionsProviderTest)  Time elapsed: 0.005 s
09:35:07 [2020-12-08T14:35:07.031Z] containsJavaRootPackageProposal(org.eclipse.ease.ui.completions.java.provider.JavaClassCompletionsProviderTest)  Time elapsed: 0.005 s
09:35:07 [2020-12-08T14:35:07.031Z] containsOrgEclipsePackageProposal(org.eclipse.ease.ui.completions.java.provider.JavaClassCompletionsProviderTest)  Time elapsed: 0.053 s
09:35:07 [2020-12-08T14:35:07.032Z] 
09:35:07 [2020-12-08T14:35:07.032Z] Results:
09:35:07 [2020-12-08T14:35:07.032Z] 
09:35:07 [2020-12-08T14:35:07.032Z] Tests run: 31, Failures: 0, Errors: 0, Skipped: 12
09:35:07 [2020-12-08T14:35:07.032Z] 
09:35:07 [2020-12-08T14:35:07.594Z] [INFO] All tests passed!
09:35:07 [2020-12-08T14:35:07.594Z] [INFO] 
09:35:07 [2020-12-08T14:35:07.594Z] [INFO] --- maven-install-plugin:2.3.1:install (default-install) @ org.eclipse.ease.ui.test ---
09:35:07 [2020-12-08T14:35:07.594Z] [INFO] Installing /home/jenkins/agent/workspace/ease.verify.core.target.2019-06/tests/org.eclipse.ease.ui.test/target/org.eclipse.ease.ui.test-0.8.0-SNAPSHOT.jar to /home/jenkins/.m2/repository/org/eclipse/ease/org.eclipse.ease.ui.test/0.8.0-SNAPSHOT/org.eclipse.ease.ui.test-0.8.0-SNAPSHOT.jar
09:35:07 [2020-12-08T14:35:07.594Z] [INFO] Installing /home/jenkins/agent/workspace/ease.verify.core.target.2019-06/tests/org.eclipse.ease.ui.test/pom.xml to /home/jenkins/.m2/repository/org/eclipse/ease/org.eclipse.ease.ui.test/0.8.0-SNAPSHOT/org.eclipse.ease.ui.test-0.8.0-SNAPSHOT.pom
09:35:07 [2020-12-08T14:35:07.594Z] [INFO] Installing /home/jenkins/agent/workspace/ease.verify.core.target.2019-06/tests/org.eclipse.ease.ui.test/target/org.eclipse.ease.ui.test-0.8.0-SNAPSHOT-sources.jar to /home/jenkins/.m2/repository/org/eclipse/ease/org.eclipse.ease.ui.test/0.8.0-SNAPSHOT/org.eclipse.ease.ui.test-0.8.0-SNAPSHOT-sources.jar
09:35:07 [2020-12-08T14:35:07.594Z] [INFO] Installing /home/jenkins/agent/workspace/ease.verify.core.target.2019-06/tests/org.eclipse.ease.ui.test/target/p2content.xml to /home/jenkins/.m2/repository/org/eclipse/ease/org.eclipse.ease.ui.test/0.8.0-SNAPSHOT/org.eclipse.ease.ui.test-0.8.0-SNAPSHOT-p2metadata.xml
09:35:07 [2020-12-08T14:35:07.594Z] [INFO] Installing /home/jenkins/agent/workspace/ease.verify.core.target.2019-06/tests/org.eclipse.ease.ui.test/target/p2artifacts.xml to /home/jenkins/.m2/repository/org/eclipse/ease/org.eclipse.ease.ui.test/0.8.0-SNAPSHOT/org.eclipse.ease.ui.test-0.8.0-SNAPSHOT-p2artifacts.xml
09:35:07 [2020-12-08T14:35:07.594Z] [INFO] Installing /home/jenkins/agent/workspace/ease.verify.core.target.2019-06/tests/org.eclipse.ease.ui.test/target/p2content.xml to /home/jenkins/.m2/repository/org/eclipse/ease/org.eclipse.ease.ui.test/0.8.0-SNAPSHOT/org.eclipse.ease.ui.test-0.8.0-SNAPSHOT-p2metadata.xml
09:35:07 [2020-12-08T14:35:07.594Z] [INFO] Installing /home/jenkins/agent/workspace/ease.verify.core.target.2019-06/tests/org.eclipse.ease.ui.test/target/p2artifacts.xml to /home/jenkins/.m2/repository/org/eclipse/ease/org.eclipse.ease.ui.test/0.8.0-SNAPSHOT/org.eclipse.ease.ui.test-0.8.0-SNAPSHOT-p2artifacts.xml
09:35:07 [2020-12-08T14:35:07.594Z] [INFO] 
09:35:07 [2020-12-08T14:35:07.594Z] [INFO] --- tycho-p2-plugin:1.5.0:update-local-index (default-update-local-index) @ org.eclipse.ease.ui.test ---
09:35:07 [2020-12-08T14:35:07.594Z] [INFO] 
09:35:07 [2020-12-08T14:35:07.594Z] [INFO] ---------------------< org.eclipse.ease:ease.core >---------------------
09:35:07 [2020-12-08T14:35:07.595Z] [INFO] Building EASE (Incubation) 0.4.0-SNAPSHOT                        [48/48]
09:35:07 [2020-12-08T14:35:07.595Z] [INFO] --------------------------------[ pom ]---------------------------------
09:35:07 [2020-12-08T14:35:07.595Z] [INFO] 
09:35:07 [2020-12-08T14:35:07.595Z] [INFO] --- maven-clean-plugin:2.5:clean (default-clean) @ ease.core ---
09:35:07 [2020-12-08T14:35:07.850Z] [INFO] 
09:35:07 [2020-12-08T14:35:07.850Z] [INFO] --- maven-install-plugin:2.4:install (default-install) @ ease.core ---
09:35:08 [2020-12-08T14:35:08.106Z] [INFO] Installing /home/jenkins/agent/workspace/ease.verify.core.target.2019-06/pom.xml to /home/jenkins/.m2/repository/org/eclipse/ease/ease.core/0.4.0-SNAPSHOT/ease.core-0.4.0-SNAPSHOT.pom
09:35:08 [2020-12-08T14:35:08.106Z] [INFO] ------------------------------------------------------------------------
09:35:08 [2020-12-08T14:35:08.106Z] [INFO] Reactor Summary:
09:35:08 [2020-12-08T14:35:08.106Z] [INFO] 
09:35:08 [2020-12-08T14:35:08.106Z] [INFO] org.eclipse.ease.releng 0.8.0-SNAPSHOT ............. SUCCESS [ 12.507 s]
09:35:08 [2020-12-08T14:35:08.106Z] [INFO] org.eclipse.ease.classloader 0.8.0-SNAPSHOT ........ SUCCESS [  8.815 s]
09:35:08 [2020-12-08T14:35:08.106Z] [INFO] org.eclipse.ease 0.8.0-SNAPSHOT .................... SUCCESS [  3.643 s]
09:35:08 [2020-12-08T14:35:08.106Z] [INFO] org.eclipse.ease.ui 0.8.0-SNAPSHOT ................. SUCCESS [  3.762 s]
09:35:08 [2020-12-08T14:35:08.106Z] [INFO] org.eclipse.ease.ui.completions.java 0.8.0-SNAPSHOT  SUCCESS [  2.151 s]
09:35:08 [2020-12-08T14:35:08.106Z] [INFO] org.eclipse.ease.ui.scripts 0.8.0-SNAPSHOT ......... SUCCESS [  3.879 s]
09:35:08 [2020-12-08T14:35:08.106Z] [INFO] org.eclipse.ease.lang.javascript 0.8.0-SNAPSHOT .... SUCCESS [  2.895 s]
09:35:08 [2020-12-08T14:35:08.106Z] [INFO] org.eclipse.ease.lang.scriptarchive 0.8.0-SNAPSHOT . SUCCESS [  1.666 s]
09:35:08 [2020-12-08T14:35:08.106Z] [INFO] org.eclipse.ease.lang.python 0.8.0-SNAPSHOT ........ SUCCESS [  2.410 s]
09:35:08 [2020-12-08T14:35:08.106Z] [INFO] org.eclipse.ease.lang.python.py4j 0.8.0-SNAPSHOT ... SUCCESS [  2.977 s]
09:35:08 [2020-12-08T14:35:08.106Z] [INFO] org.eclipse.ease.lang.groovy 0.8.0-SNAPSHOT ........ SUCCESS [  1.990 s]
09:35:08 [2020-12-08T14:35:08.106Z] [INFO] org.eclipse.ease.lang.groovy.interpreter 0.8.0-SNAPSHOT SUCCESS [  1.866 s]
09:35:08 [2020-12-08T14:35:08.106Z] [INFO] org.eclipse.ease.lang.unittest 0.8.0-SNAPSHOT ...... SUCCESS [  2.636 s]
09:35:08 [2020-12-08T14:35:08.106Z] [INFO] org.eclipse.ease.lang.unittest.ui 0.8.0-SNAPSHOT ... SUCCESS [  2.587 s]
09:35:08 [2020-12-08T14:35:08.106Z] [INFO] org.eclipse.ease.lang.ruby 0.8.0-SNAPSHOT .......... SUCCESS [  1.493 s]
09:35:08 [2020-12-08T14:35:08.106Z] [INFO] org.eclipse.ease.lang.ruby.jruby 0.8.0-SNAPSHOT .... SUCCESS [  1.583 s]
09:35:08 [2020-12-08T14:35:08.106Z] [INFO] org.eclipse.ease.lang.javascript.nashorn 0.8.0-SNAPSHOT SUCCESS [  1.604 s]
09:35:08 [2020-12-08T14:35:08.106Z] [INFO] org.eclipse.ease.lang.javascript.rhino 0.8.0-SNAPSHOT SUCCESS [  2.223 s]
09:35:08 [2020-12-08T14:35:08.106Z] [INFO] org.eclipse.ease.lang.python.jython 0.8.0-SNAPSHOT . SUCCESS [  2.002 s]
09:35:08 [2020-12-08T14:35:08.106Z] [INFO] org.eclipse.ease.lang.javascript.ui 0.8.0-SNAPSHOT . SUCCESS [  1.885 s]
09:35:08 [2020-12-08T14:35:08.106Z] [INFO] org.eclipse.ease.lang.jvm.compiled 0.8.0-SNAPSHOT .. SUCCESS [  1.702 s]
09:35:08 [2020-12-08T14:35:08.106Z] [INFO] org.eclipse.ease.lang.scriptarchive.ui 0.8.0-SNAPSHOT SUCCESS [  1.918 s]
09:35:08 [2020-12-08T14:35:08.106Z] [INFO] org.eclipse.ease.help 0.8.0-SNAPSHOT ............... SUCCESS [  0.254 s]
09:35:08 [2020-12-08T14:35:08.106Z] [INFO] org.eclipse.ease.feature 0.8.0-SNAPSHOT ............ SUCCESS [  0.208 s]
09:35:08 [2020-12-08T14:35:08.106Z] [INFO] org.eclipse.ease.ui.feature 0.8.0-SNAPSHOT ......... SUCCESS [  0.259 s]
09:35:08 [2020-12-08T14:35:08.106Z] [INFO] org.eclipse.ease.lang.javascript.feature 0.8.0-SNAPSHOT SUCCESS [  0.189 s]
09:35:08 [2020-12-08T14:35:08.106Z] [INFO] org.eclipse.ease.lang.python.feature 0.8.0-SNAPSHOT  SUCCESS [  0.172 s]
09:35:08 [2020-12-08T14:35:08.106Z] [INFO] org.eclipse.ease.python.jython.feature 0.8.0-SNAPSHOT SUCCESS [  0.122 s]
09:35:08 [2020-12-08T14:35:08.106Z] [INFO] org.eclipse.ease.lang.python.py4j.feature 0.8.0-SNAPSHOT SUCCESS [  0.180 s]
09:35:08 [2020-12-08T14:35:08.106Z] [INFO] org.eclipse.ease.lang.jvm.feature 0.8.0-SNAPSHOT ... SUCCESS [  0.106 s]
09:35:08 [2020-12-08T14:35:08.107Z] [INFO] org.eclipse.ease.lang.groovy.feature 0.8.0-SNAPSHOT  SUCCESS [  0.098 s]
09:35:08 [2020-12-08T14:35:08.107Z] [INFO] org.eclipse.ease.lang.ruby.feature 0.8.0-SNAPSHOT .. SUCCESS [  0.101 s]
09:35:08 [2020-12-08T14:35:08.107Z] [INFO] org.eclipse.ease.lang.scriptarchive.feature 0.8.0-SNAPSHOT SUCCESS [  0.182 s]
09:35:08 [2020-12-08T14:35:08.107Z] [INFO] org.eclipse.ease.lang.unittest.feature 0.8.0-SNAPSHOT SUCCESS [  0.128 s]
09:35:08 [2020-12-08T14:35:08.107Z] [INFO] org.eclipse.ease.releng.target 0.8.0-SNAPSHOT ...... SUCCESS [  0.010 s]
09:35:08 [2020-12-08T14:35:08.107Z] [INFO] org.eclipse.ease.releng.p2 0.8.0-SNAPSHOT .......... SUCCESS [  3.540 s]
09:35:08 [2020-12-08T14:35:08.107Z] [INFO] org.eclipse.ease.testhelper 0.8.0-SNAPSHOT ......... SUCCESS [  2.049 s]
09:35:08 [2020-12-08T14:35:08.107Z] [INFO] org.eclipse.ease.test 0.8.0-SNAPSHOT ............... SUCCESS [ 20.782 s]
09:35:08 [2020-12-08T14:35:08.107Z] [INFO] org.eclipse.ease.lang.javascript.nashorn.test 0.8.0-SNAPSHOT SUCCESS [  5.513 s]
09:35:08 [2020-12-08T14:35:08.107Z] [INFO] org.eclipse.ease.lang.javascript.rhino.test 0.8.0-SNAPSHOT SUCCESS [ 16.989 s]
09:35:08 [2020-12-08T14:35:08.107Z] [INFO] org.eclipse.ease.lang.javascript.test 0.8.0-SNAPSHOT SUCCESS [  4.410 s]
09:35:08 [2020-12-08T14:35:08.107Z] [INFO] org.eclipse.ease.lang.python.test 0.8.0-SNAPSHOT ... SUCCESS [  4.682 s]
09:35:08 [2020-12-08T14:35:08.107Z] [INFO] org.eclipse.ease.lang.python.jython.test 0.8.0-SNAPSHOT SUCCESS [ 17.458 s]
09:35:08 [2020-12-08T14:35:08.107Z] [INFO] org.eclipse.ease.lang.scriptarchive.test 0.8.0-SNAPSHOT SUCCESS [  4.603 s]
09:35:08 [2020-12-08T14:35:08.107Z] [INFO] org.eclipse.ease.lang.unittest.test 0.8.0-SNAPSHOT . SUCCESS [  7.478 s]
09:35:08 [2020-12-08T14:35:08.107Z] [INFO] org.eclipse.ease.ui.scripts.test 0.8.0-SNAPSHOT .... SUCCESS [  4.302 s]
09:35:08 [2020-12-08T14:35:08.107Z] [INFO] org.eclipse.ease.ui.test 0.8.0-SNAPSHOT ............ SUCCESS [ 16.612 s]
09:35:08 [2020-12-08T14:35:08.107Z] [INFO] EASE (Incubation) 0.4.0-SNAPSHOT ................... SUCCESS [  0.521 s]
09:35:08 [2020-12-08T14:35:08.107Z] [INFO] ------------------------------------------------------------------------
09:35:08 [2020-12-08T14:35:08.107Z] [INFO] BUILD SUCCESS
09:35:08 [2020-12-08T14:35:08.107Z] [INFO] ------------------------------------------------------------------------
09:35:08 [2020-12-08T14:35:08.107Z] [INFO] Total time:  05:38 min
09:35:08 [2020-12-08T14:35:08.107Z] [INFO] Finished at: 2020-12-08T14:35:07Z
09:35:08 [2020-12-08T14:35:08.107Z] [INFO] ------------------------------------------------------------------------
09:35:08 [2020-12-08T14:35:08.107Z] [INFO] [jenkins-event-spy] Generated /home/jenkins/agent/workspace/ease.verify.core.target.2019-06@tmp/withMaven34c68374/maven-spy-20201208-142929-4828287925795755417994.log