SuccessConsole Output

Skipping 202 KB.. Full Log
7 s
09:44:02 [2020-12-01T14:44:02.208Z] hasDebugTarget(org.eclipse.ease.lang.python.jython.debugger.JythonDebugTest)  Time elapsed: 0.107 s
09:44:02 [2020-12-01T14:44:02.208Z] disconnectThreadInSuspendedState(org.eclipse.ease.lang.python.jython.debugger.JythonDebugTest)  Time elapsed: 0.21 s
09:44:02 [2020-12-01T14:44:02.208Z] stepReturnOnDebugTarget(org.eclipse.ease.lang.python.jython.debugger.JythonDebugTest)  Time elapsed: 0.313 s
09:44:02 [2020-12-01T14:44:02.208Z] nullVariable(org.eclipse.ease.lang.python.jython.debugger.JythonDebugTest)  Time elapsed: 0.306 s
09:44:02 [2020-12-01T14:44:02.208Z] stepOverOnStackFrame(org.eclipse.ease.lang.python.jython.debugger.JythonDebugTest)  Time elapsed: 0.31 s
09:44:02 [2020-12-01T14:44:02.209Z] resumeOnDebugTarget(org.eclipse.ease.lang.python.jython.debugger.JythonDebugTest)  Time elapsed: 0.208 s
09:44:02 [2020-12-01T14:44:02.209Z] modifyVariableKeepingType(org.eclipse.ease.lang.python.jython.debugger.JythonDebugTest)  Time elapsed: 0.508 s
09:44:02 [2020-12-01T14:44:02.209Z] resumeOnLastIncludeLine(org.eclipse.ease.lang.python.jython.debugger.JythonDebugTest)  Time elapsed: 0.211 s
09:44:02 [2020-12-01T14:44:02.209Z] stepReturnOnStackFrame(org.eclipse.ease.lang.python.jython.debugger.JythonDebugTest)  Time elapsed: 0.309 s
09:44:02 [2020-12-01T14:44:02.209Z] terminateStackFrameInSuspendedState(org.eclipse.ease.lang.python.jython.debugger.JythonDebugTest)  Time elapsed: 0.208 s
09:44:02 [2020-12-01T14:44:02.209Z] breakpointLocation(org.eclipse.ease.lang.python.jython.debugger.JythonDebugTest)  Time elapsed: 0.206 s
09:44:02 [2020-12-01T14:44:02.209Z] stepReturnOnThread(org.eclipse.ease.lang.python.jython.debugger.JythonDebugTest)  Time elapsed: 0.308 s
09:44:02 [2020-12-01T14:44:02.209Z] javaClassVariable(org.eclipse.ease.lang.python.jython.debugger.JythonDebugTest)  Time elapsed: 0.309 s
09:44:02 [2020-12-01T14:44:02.209Z] stepIntoOnThread(org.eclipse.ease.lang.python.jython.debugger.JythonDebugTest)  Time elapsed: 0.308 s
09:44:02 [2020-12-01T14:44:02.209Z] terminateThreadInSuspendedState(org.eclipse.ease.lang.python.jython.debugger.JythonDebugTest)  Time elapsed: 0.206 s
09:44:02 [2020-12-01T14:44:02.209Z] resumeOnThread(org.eclipse.ease.lang.python.jython.debugger.JythonDebugTest)  Time elapsed: 0.21 s
09:44:02 [2020-12-01T14:44:02.209Z] stepIntoOnStackFrame(org.eclipse.ease.lang.python.jython.debugger.JythonDebugTest)  Time elapsed: 0.307 s
09:44:02 [2020-12-01T14:44:02.209Z] terminateProcessInSuspendedState(org.eclipse.ease.lang.python.jython.debugger.JythonDebugTest)  Time elapsed: 0.205 s
09:44:02 [2020-12-01T14:44:02.209Z] stepOverOnProcess(org.eclipse.ease.lang.python.jython.debugger.JythonDebugTest)  Time elapsed: 0.308 s
09:44:02 [2020-12-01T14:44:02.209Z] nativeArrayVariable(org.eclipse.ease.lang.python.jython.debugger.JythonDebugTest)  Time elapsed: 0.308 s
09:44:02 [2020-12-01T14:44:02.209Z] disconnectDebugTargetInSuspendedState(org.eclipse.ease.lang.python.jython.debugger.JythonDebugTest)  Time elapsed: 0.208 s
09:44:02 [2020-12-01T14:44:02.209Z] stepIntoOnProcess(org.eclipse.ease.lang.python.jython.debugger.JythonDebugTest)  Time elapsed: 0.307 s
09:44:02 [2020-12-01T14:44:02.209Z] terminatedState(org.eclipse.ease.lang.python.jython.debugger.JythonDebugTest)  Time elapsed: 0.105 s
09:44:02 [2020-12-01T14:44:02.209Z] stepOverIncludeCommand(org.eclipse.ease.lang.python.jython.debugger.JythonDebugTest)  Time elapsed: 0.305 s
09:44:02 [2020-12-01T14:44:02.209Z] innerScopeVariableBeforeOuterScopeVariable(org.eclipse.ease.lang.python.jython.debugger.JythonDebugTest)  Time elapsed: 0.306 s
09:44:02 [2020-12-01T14:44:02.209Z] stepIntoIncludeCommand(org.eclipse.ease.lang.python.jython.debugger.JythonDebugTest)  Time elapsed: 0.304 s
09:44:02 [2020-12-01T14:44:02.209Z] primitiveStringVariable(org.eclipse.ease.lang.python.jython.debugger.JythonDebugTest)  Time elapsed: 0.308 s
09:44:02 [2020-12-01T14:44:02.209Z] resumeOnProcess(org.eclipse.ease.lang.python.jython.debugger.JythonDebugTest)  Time elapsed: 0.206 s
09:44:02 [2020-12-01T14:44:02.209Z] stepIntoOnDebugTarget(org.eclipse.ease.lang.python.jython.debugger.JythonDebugTest)  Time elapsed: 0.306 s
09:44:02 [2020-12-01T14:44:02.209Z] stepOverOnThread(org.eclipse.ease.lang.python.jython.debugger.JythonDebugTest)  Time elapsed: 0.305 s
09:44:02 [2020-12-01T14:44:02.209Z] suspendedState(org.eclipse.ease.lang.python.jython.debugger.JythonDebugTest)  Time elapsed: 0.205 s
09:44:02 [2020-12-01T14:44:02.209Z] primitiveDoubleVariable(org.eclipse.ease.lang.python.jython.debugger.JythonDebugTest)  Time elapsed: 0.306 s
09:44:02 [2020-12-01T14:44:02.209Z] resumeOnStackFrame(org.eclipse.ease.lang.python.jython.debugger.JythonDebugTest)  Time elapsed: 0.205 s
09:44:02 [2020-12-01T14:44:02.209Z] nativeObjectVariable(org.eclipse.ease.lang.python.jython.debugger.JythonDebugTest)  Time elapsed: 0.307 s
09:44:02 [2020-12-01T14:44:02.209Z] terminateDebugTargetInSuspendedState(org.eclipse.ease.lang.python.jython.debugger.JythonDebugTest)  Time elapsed: 0.208 s
09:44:02 [2020-12-01T14:44:02.209Z] disconnectStackFrameInSuspendedState(org.eclipse.ease.lang.python.jython.debugger.JythonDebugTest)  Time elapsed: 0.206 s
09:44:02 [2020-12-01T14:44:02.209Z] stepReturnOnProcess(org.eclipse.ease.lang.python.jython.debugger.JythonDebugTest)  Time elapsed: 0.306 s
09:44:02 [2020-12-01T14:44:02.209Z] evaluateWatchExpression(org.eclipse.ease.lang.python.jython.debugger.JythonDebugTest)  Time elapsed: 0.211 s
09:44:02 [2020-12-01T14:44:02.209Z] 
09:44:02 [2020-12-01T14:44:02.209Z] Results:
09:44:02 [2020-12-01T14:44:02.209Z] 
09:44:02 [2020-12-01T14:44:02.209Z] Tests run: 42, Failures: 0, Errors: 0, Skipped: 0
09:44:02 [2020-12-01T14:44:02.209Z] 
09:44:02 [2020-12-01T14:44:02.770Z] [INFO] All tests passed!
09:44:02 [2020-12-01T14:44:02.770Z] [INFO] 
09:44:02 [2020-12-01T14:44:02.770Z] [INFO] ------< org.eclipse.ease:org.eclipse.ease.lang.python.py4j.test >-------
09:44:02 [2020-12-01T14:44:02.770Z] [INFO] Building org.eclipse.ease.lang.python.py4j.test 0.8.0-SNAPSHOT    [9/11]
09:44:02 [2020-12-01T14:44:02.770Z] [INFO] ------------------------[ eclipse-test-plugin ]-------------------------
09:44:02 [2020-12-01T14:44:02.770Z] [INFO] 
09:44:02 [2020-12-01T14:44:02.770Z] [INFO] --- tycho-packaging-plugin:1.5.0:build-qualifier (default-build-qualifier) @ org.eclipse.ease.lang.python.py4j.test ---
09:44:02 [2020-12-01T14:44:02.770Z] [INFO] The project's OSGi version is 0.8.0.I201912021001
09:44:02 [2020-12-01T14:44:02.770Z] [INFO] 
09:44:02 [2020-12-01T14:44:02.770Z] [INFO] --- tycho-packaging-plugin:1.5.0:validate-id (default-validate-id) @ org.eclipse.ease.lang.python.py4j.test ---
09:44:02 [2020-12-01T14:44:02.771Z] [INFO] 
09:44:02 [2020-12-01T14:44:02.771Z] [INFO] --- tycho-packaging-plugin:1.5.0:validate-version (default-validate-version) @ org.eclipse.ease.lang.python.py4j.test ---
09:44:02 [2020-12-01T14:44:02.771Z] [INFO] 
09:44:02 [2020-12-01T14:44:02.771Z] [INFO] --- maven-resources-plugin:2.4.3:resources (default-resources) @ org.eclipse.ease.lang.python.py4j.test ---
09:44:02 [2020-12-01T14:44:02.771Z] [INFO] Using 'UTF-8' encoding to copy filtered resources.
09:44:02 [2020-12-01T14:44:02.771Z] [INFO] skip non existing resourceDirectory /home/jenkins/agent/workspace/ease.verify.core.target.2019-06/tests/org.eclipse.ease.lang.python.py4j.test/src/main/resources
09:44:02 [2020-12-01T14:44:02.771Z] [INFO] 
09:44:02 [2020-12-01T14:44:02.771Z] [INFO] --- tycho-compiler-plugin:1.5.0:compile (default-compile) @ org.eclipse.ease.lang.python.py4j.test ---
09:44:02 [2020-12-01T14:44:02.771Z] [INFO] Compiling 10 source files to /home/jenkins/agent/workspace/ease.verify.core.target.2019-06/tests/org.eclipse.ease.lang.python.py4j.test/target/classes
09:44:04 [2020-12-01T14:44:04.184Z] [INFO] 
09:44:04 [2020-12-01T14:44:04.184Z] [INFO] --- maven-resources-plugin:2.4.3:testResources (default-testResources) @ org.eclipse.ease.lang.python.py4j.test ---
09:44:04 [2020-12-01T14:44:04.184Z] [INFO] Using 'UTF-8' encoding to copy filtered resources.
09:44:04 [2020-12-01T14:44:04.184Z] [INFO] skip non existing resourceDirectory /home/jenkins/agent/workspace/ease.verify.core.target.2019-06/tests/org.eclipse.ease.lang.python.py4j.test/src/test/resources
09:44:04 [2020-12-01T14:44:04.184Z] [INFO] 
09:44:04 [2020-12-01T14:44:04.185Z] [INFO] --- tycho-source-plugin:1.5.0:plugin-source (plugin-source) @ org.eclipse.ease.lang.python.py4j.test ---
09:44:04 [2020-12-01T14:44:04.185Z] [INFO] Building jar: /home/jenkins/agent/workspace/ease.verify.core.target.2019-06/tests/org.eclipse.ease.lang.python.py4j.test/target/org.eclipse.ease.lang.python.py4j.test-0.8.0-SNAPSHOT-sources.jar
09:44:04 [2020-12-01T14:44:04.185Z] [INFO] 
09:44:04 [2020-12-01T14:44:04.185Z] [INFO] --- target-platform-configuration:1.5.0:target-platform (default-target-platform) @ org.eclipse.ease.lang.python.py4j.test ---
09:44:04 [2020-12-01T14:44:04.185Z] [INFO] 
09:44:04 [2020-12-01T14:44:04.185Z] [INFO] --- tycho-packaging-plugin:1.5.0:package-plugin (default-package-plugin) @ org.eclipse.ease.lang.python.py4j.test ---
09:44:04 [2020-12-01T14:44:04.185Z] [INFO] Building jar: /home/jenkins/agent/workspace/ease.verify.core.target.2019-06/tests/org.eclipse.ease.lang.python.py4j.test/target/org.eclipse.ease.lang.python.py4j.test-0.8.0-SNAPSHOT.jar
09:44:04 [2020-12-01T14:44:04.185Z] [INFO] 
09:44:04 [2020-12-01T14:44:04.185Z] [INFO] --- tycho-p2-plugin:1.5.0:p2-metadata-default (default-p2-metadata-default) @ org.eclipse.ease.lang.python.py4j.test ---
09:44:04 [2020-12-01T14:44:04.185Z] [INFO] 
09:44:04 [2020-12-01T14:44:04.185Z] [INFO] --- tycho-source-feature-plugin:1.5.0:source-feature (source-feature) @ org.eclipse.ease.lang.python.py4j.test ---
09:44:04 [2020-12-01T14:44:04.185Z] [INFO] 
09:44:04 [2020-12-01T14:44:04.185Z] [INFO] --- tycho-p2-plugin:1.5.0:p2-metadata (attached-p2-metadata) @ org.eclipse.ease.lang.python.py4j.test ---
09:44:04 [2020-12-01T14:44:04.185Z] [INFO] 
09:44:04 [2020-12-01T14:44:04.185Z] [INFO] --- tycho-surefire-plugin:1.5.0:test (default-test) @ org.eclipse.ease.lang.python.py4j.test ---
09:44:04 [2020-12-01T14:44:04.185Z] [INFO] Expected eclipse log file: /home/jenkins/agent/workspace/ease.verify.core.target.2019-06/tests/org.eclipse.ease.lang.python.py4j.test/target/work/data/.metadata/.log
09:44:04 [2020-12-01T14:44:04.185Z] [INFO] Command line:
09:44:04 [2020-12-01T14:44:04.185Z] 	[/opt/tools/java/openjdk/jdk-11/11.0.2+9/bin/java, -Dosgi.noShutdown=false, -Dosgi.os=linux, -Dosgi.ws=gtk, -Dosgi.arch=x86_64, -Dosgi.clean=true, -jar, /home/jenkins/.m2/repository/p2/osgi/bundle/org.eclipse.equinox.launcher/1.5.400.v20190515-0925/org.eclipse.equinox.launcher-1.5.400.v20190515-0925.jar, -data, /home/jenkins/agent/workspace/ease.verify.core.target.2019-06/tests/org.eclipse.ease.lang.python.py4j.test/target/work/data, -install, /home/jenkins/agent/workspace/ease.verify.core.target.2019-06/tests/org.eclipse.ease.lang.python.py4j.test/target/work, -configuration, /home/jenkins/agent/workspace/ease.verify.core.target.2019-06/tests/org.eclipse.ease.lang.python.py4j.test/target/work/configuration, -application, org.eclipse.tycho.surefire.osgibooter.headlesstest, -testproperties, /home/jenkins/agent/workspace/ease.verify.core.target.2019-06/tests/org.eclipse.ease.lang.python.py4j.test/target/surefire.properties]
09:44:04 [2020-12-01T14:44:04.185Z] Picked up JAVA_TOOL_OPTIONS: -Dmaven.ext.class.path="/home/jenkins/agent/workspace/ease.verify.core.target.2019-06@tmp/withMaven6b223a92/pipeline-maven-spy.jar" -Dorg.jenkinsci.plugins.pipeline.maven.reportsFolder="/home/jenkins/agent/workspace/ease.verify.core.target.2019-06@tmp/withMaven6b223a92" 
09:44:06 [2020-12-01T14:44:06.737Z] Running org.eclipse.ease.lang.python.py4j.StartStopTest
09:44:06 [2020-12-01T14:44:06.737Z] ----------------------------------------------
09:44:06 [2020-12-01T14:44:06.737Z] Starting test: startStop(org.eclipse.ease.lang.python.py4j.StartStopTest)
09:44:06 [2020-12-01T14:44:06.737Z] 
09:44:06 [2020-12-01T14:44:06.737Z] Finished test: startStop(org.eclipse.ease.lang.python.py4j.StartStopTest)
09:44:06 [2020-12-01T14:44:06.737Z] ----------------------------------------------
09:44:06 [2020-12-01T14:44:06.737Z] ----------------------------------------------
09:44:06 [2020-12-01T14:44:06.737Z] Starting test: startStopShellNoBootstrap(org.eclipse.ease.lang.python.py4j.StartStopTest)
09:44:06 [2020-12-01T14:44:06.737Z] 
09:44:06 [2020-12-01T14:44:06.737Z] Finished test: startStopShellNoBootstrap(org.eclipse.ease.lang.python.py4j.StartStopTest)
09:44:06 [2020-12-01T14:44:06.737Z] ----------------------------------------------
09:44:06 [2020-12-01T14:44:06.737Z] ----------------------------------------------
09:44:06 [2020-12-01T14:44:06.737Z] Starting test: multiStartStop(org.eclipse.ease.lang.python.py4j.StartStopTest)
09:44:09 [2020-12-01T14:44:09.166Z] 
09:44:09 [2020-12-01T14:44:09.166Z] Finished test: multiStartStop(org.eclipse.ease.lang.python.py4j.StartStopTest)
09:44:09 [2020-12-01T14:44:09.166Z] ----------------------------------------------
09:44:09 [2020-12-01T14:44:09.166Z] Tests run: 3, Failures: 0, Errors: 0, Skipped: 0, Time elapsed: 0.763 s - in org.eclipse.ease.lang.python.py4j.StartStopTest
09:44:09 [2020-12-01T14:44:09.166Z] startStop(org.eclipse.ease.lang.python.py4j.StartStopTest)  Time elapsed: 0.331 s
09:44:09 [2020-12-01T14:44:09.166Z] startStopShellNoBootstrap(org.eclipse.ease.lang.python.py4j.StartStopTest)  Time elapsed: 0.201 s
09:44:09 [2020-12-01T14:44:09.166Z] multiStartStop(org.eclipse.ease.lang.python.py4j.StartStopTest)  Time elapsed: 0.204 s
09:44:09 [2020-12-01T14:44:09.166Z] Running org.eclipse.ease.lang.python.py4j.ScriptModeEngineTest
09:44:09 [2020-12-01T14:44:09.166Z] ----------------------------------------------
09:44:09 [2020-12-01T14:44:09.166Z] Starting test: invalidSyntax(org.eclipse.ease.lang.python.py4j.ScriptModeEngineTest)
09:44:09 [2020-12-01T14:44:09.166Z] org.eclipse.ease.ScriptExecutionException: Traceback (most recent call last):
09:44:09 [2020-12-01T14:44:09.166Z]   File "/usr/lib64/python2.7/ast.py", line 37, in parse
09:44:09 [2020-12-01T14:44:09.166Z]     return compile(source, filename, mode, PyCF_ONLY_AST)
09:44:09 [2020-12-01T14:44:09.166Z]   File "<unknown>", line 1
09:44:09 [2020-12-01T14:44:09.166Z]     1++
09:44:09 [2020-12-01T14:44:09.166Z]       ^
09:44:09 [2020-12-01T14:44:09.166Z] SyntaxError: invalid syntax
09:44:09 [2020-12-01T14:44:09.166Z] 
09:44:09 [2020-12-01T14:44:09.166Z] 
09:44:09 [2020-12-01T14:44:09.166Z] Finished test: invalidSyntax(org.eclipse.ease.lang.python.py4j.ScriptModeEngineTest)
09:44:09 [2020-12-01T14:44:09.166Z] ----------------------------------------------
09:44:09 [2020-12-01T14:44:09.166Z] ----------------------------------------------
09:44:09 [2020-12-01T14:44:09.166Z] Starting test: getScriptEngine(org.eclipse.ease.lang.python.py4j.ScriptModeEngineTest)
09:44:09 [2020-12-01T14:44:09.166Z] 1926024106
09:44:09 [2020-12-01T14:44:09.166Z] Finished test: getScriptEngine(org.eclipse.ease.lang.python.py4j.ScriptModeEngineTest)
09:44:09 [2020-12-01T14:44:09.166Z] ----------------------------------------------
09:44:09 [2020-12-01T14:44:09.166Z] ----------------------------------------------
09:44:09 [2020-12-01T14:44:09.166Z] Starting test: incompleteStatement(org.eclipse.ease.lang.python.py4j.ScriptModeEngineTest)
09:44:09 [2020-12-01T14:44:09.166Z] org.eclipse.ease.ScriptExecutionException: Traceback (most recent call last):
09:44:09 [2020-12-01T14:44:09.166Z]   File "/usr/lib64/python2.7/ast.py", line 37, in parse
09:44:09 [2020-12-01T14:44:09.166Z]     return compile(source, filename, mode, PyCF_ONLY_AST)
09:44:09 [2020-12-01T14:44:09.166Z]   File "<unknown>", line 1
09:44:09 [2020-12-01T14:44:09.166Z]     def a():
09:44:09 [2020-12-01T14:44:09.166Z]            ^
09:44:09 [2020-12-01T14:44:09.166Z] SyntaxError: unexpected EOF while parsing
09:44:09 [2020-12-01T14:44:09.166Z] 
09:44:09 [2020-12-01T14:44:09.166Z] 
09:44:09 [2020-12-01T14:44:09.166Z] Finished test: incompleteStatement(org.eclipse.ease.lang.python.py4j.ScriptModeEngineTest)
09:44:09 [2020-12-01T14:44:09.166Z] ----------------------------------------------
09:44:09 [2020-12-01T14:44:09.166Z] ----------------------------------------------
09:44:09 [2020-12-01T14:44:09.166Z] Starting test: multiLineStatement(org.eclipse.ease.lang.python.py4j.ScriptModeEngineTest)
09:44:09 [2020-12-01T14:44:09.166Z] 
09:44:09 [2020-12-01T14:44:09.166Z] Finished test: multiLineStatement(org.eclipse.ease.lang.python.py4j.ScriptModeEngineTest)
09:44:09 [2020-12-01T14:44:09.166Z] ----------------------------------------------
09:44:09 [2020-12-01T14:44:09.166Z] ----------------------------------------------
09:44:09 [2020-12-01T14:44:09.166Z] Starting test: runtimeError(org.eclipse.ease.lang.python.py4j.ScriptModeEngineTest)
09:44:09 [2020-12-01T14:44:09.166Z] org.eclipse.ease.ScriptExecutionException: Traceback (most recent call last):
09:44:09 [2020-12-01T14:44:09.166Z]   File "<...>", line 1, in <module>
09:44:09 [2020-12-01T14:44:09.166Z] NameError: name 'a' is not defined
09:44:09 [2020-12-01T14:44:09.166Z] 
09:44:09 [2020-12-01T14:44:09.166Z] 
09:44:09 [2020-12-01T14:44:09.166Z] Finished test: runtimeError(org.eclipse.ease.lang.python.py4j.ScriptModeEngineTest)
09:44:09 [2020-12-01T14:44:09.166Z] ----------------------------------------------
09:44:09 [2020-12-01T14:44:09.166Z] ----------------------------------------------
09:44:09 [2020-12-01T14:44:09.166Z] Starting test: javaIntArray(org.eclipse.ease.lang.python.py4j.ScriptModeEngineTest)
09:44:09 [2020-12-01T14:44:09.422Z] 
09:44:09 [2020-12-01T14:44:09.422Z] Finished test: javaIntArray(org.eclipse.ease.lang.python.py4j.ScriptModeEngineTest)
09:44:09 [2020-12-01T14:44:09.422Z] ----------------------------------------------
09:44:09 [2020-12-01T14:44:09.422Z] ----------------------------------------------
09:44:09 [2020-12-01T14:44:09.422Z] Starting test: javaDoubleArray(org.eclipse.ease.lang.python.py4j.ScriptModeEngineTest)
09:44:09 [2020-12-01T14:44:09.677Z] 
09:44:09 [2020-12-01T14:44:09.677Z] Finished test: javaDoubleArray(org.eclipse.ease.lang.python.py4j.ScriptModeEngineTest)
09:44:09 [2020-12-01T14:44:09.677Z] ----------------------------------------------
09:44:09 [2020-12-01T14:44:09.677Z] ----------------------------------------------
09:44:09 [2020-12-01T14:44:09.677Z] Starting test: pythonSet(org.eclipse.ease.lang.python.py4j.ScriptModeEngineTest)
09:44:09 [2020-12-01T14:44:09.677Z] 
09:44:09 [2020-12-01T14:44:09.677Z] Finished test: pythonSet(org.eclipse.ease.lang.python.py4j.ScriptModeEngineTest)
09:44:09 [2020-12-01T14:44:09.677Z] ----------------------------------------------
09:44:09 [2020-12-01T14:44:09.677Z] ----------------------------------------------
09:44:09 [2020-12-01T14:44:09.677Z] Starting test: javaStringArray(org.eclipse.ease.lang.python.py4j.ScriptModeEngineTest)
09:44:09 [2020-12-01T14:44:09.933Z] 
09:44:09 [2020-12-01T14:44:09.933Z] Finished test: javaStringArray(org.eclipse.ease.lang.python.py4j.ScriptModeEngineTest)
09:44:09 [2020-12-01T14:44:09.933Z] ----------------------------------------------
09:44:09 [2020-12-01T14:44:09.933Z] ----------------------------------------------
09:44:09 [2020-12-01T14:44:09.933Z] Starting test: javaShortArray(org.eclipse.ease.lang.python.py4j.ScriptModeEngineTest)
09:44:10 [2020-12-01T14:44:10.189Z] 
09:44:10 [2020-12-01T14:44:10.189Z] Finished test: javaShortArray(org.eclipse.ease.lang.python.py4j.ScriptModeEngineTest)
09:44:10 [2020-12-01T14:44:10.189Z] ----------------------------------------------
09:44:10 [2020-12-01T14:44:10.189Z] ----------------------------------------------
09:44:10 [2020-12-01T14:44:10.189Z] Starting test: javaBooleanArray(org.eclipse.ease.lang.python.py4j.ScriptModeEngineTest)
09:44:10 [2020-12-01T14:44:10.445Z] 
09:44:10 [2020-12-01T14:44:10.446Z] Finished test: javaBooleanArray(org.eclipse.ease.lang.python.py4j.ScriptModeEngineTest)
09:44:10 [2020-12-01T14:44:10.446Z] ----------------------------------------------
09:44:10 [2020-12-01T14:44:10.446Z] ----------------------------------------------
09:44:10 [2020-12-01T14:44:10.446Z] Starting test: javaObjectArray(org.eclipse.ease.lang.python.py4j.ScriptModeEngineTest)
09:44:10 [2020-12-01T14:44:10.702Z] 
09:44:10 [2020-12-01T14:44:10.702Z] Finished test: javaObjectArray(org.eclipse.ease.lang.python.py4j.ScriptModeEngineTest)
09:44:10 [2020-12-01T14:44:10.702Z] ----------------------------------------------
09:44:10 [2020-12-01T14:44:10.702Z] ----------------------------------------------
09:44:10 [2020-12-01T14:44:10.702Z] Starting test: javaIntegerArray(org.eclipse.ease.lang.python.py4j.ScriptModeEngineTest)
09:44:10 [2020-12-01T14:44:10.958Z] 
09:44:10 [2020-12-01T14:44:10.958Z] Finished test: javaIntegerArray(org.eclipse.ease.lang.python.py4j.ScriptModeEngineTest)
09:44:10 [2020-12-01T14:44:10.958Z] ----------------------------------------------
09:44:10 [2020-12-01T14:44:10.958Z] ----------------------------------------------
09:44:10 [2020-12-01T14:44:10.958Z] Starting test: javaInteger(org.eclipse.ease.lang.python.py4j.ScriptModeEngineTest)
09:44:10 [2020-12-01T14:44:10.958Z] 
09:44:10 [2020-12-01T14:44:10.958Z] Finished test: javaInteger(org.eclipse.ease.lang.python.py4j.ScriptModeEngineTest)
09:44:10 [2020-12-01T14:44:10.958Z] ----------------------------------------------
09:44:10 [2020-12-01T14:44:10.958Z] ----------------------------------------------
09:44:10 [2020-12-01T14:44:10.958Z] Starting test: javaString(org.eclipse.ease.lang.python.py4j.ScriptModeEngineTest)
09:44:11 [2020-12-01T14:44:11.215Z] 
09:44:11 [2020-12-01T14:44:11.215Z] Finished test: javaString(org.eclipse.ease.lang.python.py4j.ScriptModeEngineTest)
09:44:11 [2020-12-01T14:44:11.215Z] ----------------------------------------------
09:44:11 [2020-12-01T14:44:11.215Z] ----------------------------------------------
09:44:11 [2020-12-01T14:44:11.215Z] Starting test: javaByteArray(org.eclipse.ease.lang.python.py4j.ScriptModeEngineTest)
09:44:11 [2020-12-01T14:44:11.470Z] 
09:44:11 [2020-12-01T14:44:11.470Z] Finished test: javaByteArray(org.eclipse.ease.lang.python.py4j.ScriptModeEngineTest)
09:44:11 [2020-12-01T14:44:11.470Z] ----------------------------------------------
09:44:11 [2020-12-01T14:44:11.471Z] ----------------------------------------------
09:44:11 [2020-12-01T14:44:11.471Z] Starting test: createEclipseClass(org.eclipse.ease.lang.python.py4j.ScriptModeEngineTest)
09:44:11 [2020-12-01T14:44:11.726Z] 
09:44:11 [2020-12-01T14:44:11.726Z] Finished test: createEclipseClass(org.eclipse.ease.lang.python.py4j.ScriptModeEngineTest)
09:44:11 [2020-12-01T14:44:11.726Z] ----------------------------------------------
09:44:11 [2020-12-01T14:44:11.726Z] ----------------------------------------------
09:44:11 [2020-12-01T14:44:11.726Z] Starting test: pythonString(org.eclipse.ease.lang.python.py4j.ScriptModeEngineTest)
09:44:11 [2020-12-01T14:44:11.982Z] 
09:44:11 [2020-12-01T14:44:11.982Z] Finished test: pythonString(org.eclipse.ease.lang.python.py4j.ScriptModeEngineTest)
09:44:11 [2020-12-01T14:44:11.982Z] ----------------------------------------------
09:44:11 [2020-12-01T14:44:11.982Z] ----------------------------------------------
09:44:11 [2020-12-01T14:44:11.982Z] Starting test: varargs(org.eclipse.ease.lang.python.py4j.ScriptModeEngineTest)
09:44:12 [2020-12-01T14:44:12.239Z] 
09:44:12 [2020-12-01T14:44:12.239Z] Finished test: varargs(org.eclipse.ease.lang.python.py4j.ScriptModeEngineTest)
09:44:12 [2020-12-01T14:44:12.239Z] ----------------------------------------------
09:44:12 [2020-12-01T14:44:12.239Z] ----------------------------------------------
09:44:12 [2020-12-01T14:44:12.239Z] Starting test: createJavaType(org.eclipse.ease.lang.python.py4j.ScriptModeEngineTest)
09:44:12 [2020-12-01T14:44:12.239Z] 
09:44:12 [2020-12-01T14:44:12.239Z] Finished test: createJavaType(org.eclipse.ease.lang.python.py4j.ScriptModeEngineTest)
09:44:12 [2020-12-01T14:44:12.239Z] ----------------------------------------------
09:44:12 [2020-12-01T14:44:12.239Z] ----------------------------------------------
09:44:12 [2020-12-01T14:44:12.239Z] Starting test: javaFloatArray(org.eclipse.ease.lang.python.py4j.ScriptModeEngineTest)
09:44:12 [2020-12-01T14:44:12.495Z] 
09:44:12 [2020-12-01T14:44:12.495Z] Finished test: javaFloatArray(org.eclipse.ease.lang.python.py4j.ScriptModeEngineTest)
09:44:12 [2020-12-01T14:44:12.495Z] ----------------------------------------------
09:44:12 [2020-12-01T14:44:12.495Z] ----------------------------------------------
09:44:12 [2020-12-01T14:44:12.495Z] Starting test: implementJavaInterface(org.eclipse.ease.lang.python.py4j.ScriptModeEngineTest)
09:44:12 [2020-12-01T14:44:12.750Z] 
09:44:12 [2020-12-01T14:44:12.750Z] Finished test: implementJavaInterface(org.eclipse.ease.lang.python.py4j.ScriptModeEngineTest)
09:44:12 [2020-12-01T14:44:12.750Z] ----------------------------------------------
09:44:12 [2020-12-01T14:44:12.750Z] ----------------------------------------------
09:44:12 [2020-12-01T14:44:12.750Z] Starting test: pythonDict(org.eclipse.ease.lang.python.py4j.ScriptModeEngineTest)
09:44:13 [2020-12-01T14:44:13.006Z] 
09:44:13 [2020-12-01T14:44:13.006Z] Finished test: pythonDict(org.eclipse.ease.lang.python.py4j.ScriptModeEngineTest)
09:44:13 [2020-12-01T14:44:13.006Z] ----------------------------------------------
09:44:13 [2020-12-01T14:44:13.006Z] ----------------------------------------------
09:44:13 [2020-12-01T14:44:13.006Z] Starting test: pythonList(org.eclipse.ease.lang.python.py4j.ScriptModeEngineTest)
09:44:13 [2020-12-01T14:44:13.261Z] 
09:44:13 [2020-12-01T14:44:13.261Z] Finished test: pythonList(org.eclipse.ease.lang.python.py4j.ScriptModeEngineTest)
09:44:13 [2020-12-01T14:44:13.261Z] ----------------------------------------------
09:44:13 [2020-12-01T14:44:13.261Z] ----------------------------------------------
09:44:13 [2020-12-01T14:44:13.262Z] Starting test: testMultiple(org.eclipse.ease.lang.python.py4j.ScriptModeEngineTest)
09:44:13 [2020-12-01T14:44:13.517Z] 
09:44:13 [2020-12-01T14:44:13.517Z] Finished test: testMultiple(org.eclipse.ease.lang.python.py4j.ScriptModeEngineTest)
09:44:13 [2020-12-01T14:44:13.517Z] ----------------------------------------------
09:44:13 [2020-12-01T14:44:13.517Z] ----------------------------------------------
09:44:13 [2020-12-01T14:44:13.517Z] Starting test: javaLongArray(org.eclipse.ease.lang.python.py4j.ScriptModeEngineTest)
09:44:13 [2020-12-01T14:44:13.517Z] 
09:44:13 [2020-12-01T14:44:13.517Z] Finished test: javaLongArray(org.eclipse.ease.lang.python.py4j.ScriptModeEngineTest)
09:44:13 [2020-12-01T14:44:13.517Z] ----------------------------------------------
09:44:13 [2020-12-01T14:44:13.517Z] ----------------------------------------------
09:44:13 [2020-12-01T14:44:13.517Z] Starting test: createPythonObject(org.eclipse.ease.lang.python.py4j.ScriptModeEngineTest)
09:44:13 [2020-12-01T14:44:13.772Z] 
09:44:13 [2020-12-01T14:44:13.772Z] Finished test: createPythonObject(org.eclipse.ease.lang.python.py4j.ScriptModeEngineTest)
09:44:13 [2020-12-01T14:44:13.772Z] ----------------------------------------------
09:44:13 [2020-12-01T14:44:13.772Z] ----------------------------------------------
09:44:13 [2020-12-01T14:44:13.772Z] Starting test: pythonInteger(org.eclipse.ease.lang.python.py4j.ScriptModeEngineTest)
09:44:14 [2020-12-01T14:44:14.028Z] 
09:44:14 [2020-12-01T14:44:14.028Z] Finished test: pythonInteger(org.eclipse.ease.lang.python.py4j.ScriptModeEngineTest)
09:44:14 [2020-12-01T14:44:14.028Z] ----------------------------------------------
09:44:14 [2020-12-01T14:44:14.028Z] Tests run: 30, Failures: 0, Errors: 0, Skipped: 2, Time elapsed: 6.991 s - in org.eclipse.ease.lang.python.py4j.ScriptModeEngineTest
09:44:14 [2020-12-01T14:44:14.028Z] invalidSyntax(org.eclipse.ease.lang.python.py4j.ScriptModeEngineTest)  Time elapsed: 0.23 s
09:44:14 [2020-12-01T14:44:14.028Z] getScriptEngine(org.eclipse.ease.lang.python.py4j.ScriptModeEngineTest)  Time elapsed: 1.217 s
09:44:14 [2020-12-01T14:44:14.028Z] callExit(org.eclipse.ease.lang.python.py4j.ScriptModeEngineTest) skipped
09:44:14 [2020-12-01T14:44:14.028Z] multiLinesOfCode(org.eclipse.ease.lang.python.py4j.ScriptModeEngineTest) skipped
09:44:14 [2020-12-01T14:44:14.028Z] incompleteStatement(org.eclipse.ease.lang.python.py4j.ScriptModeEngineTest)  Time elapsed: 0.215 s
09:44:14 [2020-12-01T14:44:14.028Z] multiLineStatement(org.eclipse.ease.lang.python.py4j.ScriptModeEngineTest)  Time elapsed: 0.218 s
09:44:14 [2020-12-01T14:44:14.028Z] runtimeError(org.eclipse.ease.lang.python.py4j.ScriptModeEngineTest)  Time elapsed: 0.223 s
09:44:14 [2020-12-01T14:44:14.028Z] javaIntArray(org.eclipse.ease.lang.python.py4j.ScriptModeEngineTest)  Time elapsed: 0.221 s
09:44:14 [2020-12-01T14:44:14.028Z] javaDoubleArray(org.eclipse.ease.lang.python.py4j.ScriptModeEngineTest)  Time elapsed: 0.21 s
09:44:14 [2020-12-01T14:44:14.028Z] pythonSet(org.eclipse.ease.lang.python.py4j.ScriptModeEngineTest)  Time elapsed: 0.207 s
09:44:14 [2020-12-01T14:44:14.028Z] javaStringArray(org.eclipse.ease.lang.python.py4j.ScriptModeEngineTest)  Time elapsed: 0.209 s
09:44:14 [2020-12-01T14:44:14.028Z] javaShortArray(org.eclipse.ease.lang.python.py4j.ScriptModeEngineTest)  Time elapsed: 0.22 s
09:44:14 [2020-12-01T14:44:14.028Z] javaBooleanArray(org.eclipse.ease.lang.python.py4j.ScriptModeEngineTest)  Time elapsed: 0.215 s
09:44:14 [2020-12-01T14:44:14.028Z] javaObjectArray(org.eclipse.ease.lang.python.py4j.ScriptModeEngineTest)  Time elapsed: 0.233 s
09:44:14 [2020-12-01T14:44:14.028Z] javaIntegerArray(org.eclipse.ease.lang.python.py4j.ScriptModeEngineTest)  Time elapsed: 0.21 s
09:44:14 [2020-12-01T14:44:14.028Z] javaInteger(org.eclipse.ease.lang.python.py4j.ScriptModeEngineTest)  Time elapsed: 0.211 s
09:44:14 [2020-12-01T14:44:14.028Z] javaString(org.eclipse.ease.lang.python.py4j.ScriptModeEngineTest)  Time elapsed: 0.216 s
09:44:14 [2020-12-01T14:44:14.028Z] javaByteArray(org.eclipse.ease.lang.python.py4j.ScriptModeEngineTest)  Time elapsed: 0.217 s
09:44:14 [2020-12-01T14:44:14.028Z] createEclipseClass(org.eclipse.ease.lang.python.py4j.ScriptModeEngineTest)  Time elapsed: 0.222 s
09:44:14 [2020-12-01T14:44:14.028Z] pythonString(org.eclipse.ease.lang.python.py4j.ScriptModeEngineTest)  Time elapsed: 0.207 s
09:44:14 [2020-12-01T14:44:14.028Z] varargs(org.eclipse.ease.lang.python.py4j.ScriptModeEngineTest)  Time elapsed: 0.205 s
09:44:14 [2020-12-01T14:44:14.028Z] createJavaType(org.eclipse.ease.lang.python.py4j.ScriptModeEngineTest)  Time elapsed: 0.211 s
09:44:14 [2020-12-01T14:44:14.028Z] javaFloatArray(org.eclipse.ease.lang.python.py4j.ScriptModeEngineTest)  Time elapsed: 0.216 s
09:44:14 [2020-12-01T14:44:14.028Z] implementJavaInterface(org.eclipse.ease.lang.python.py4j.ScriptModeEngineTest)  Time elapsed: 0.204 s
09:44:14 [2020-12-01T14:44:14.028Z] pythonDict(org.eclipse.ease.lang.python.py4j.ScriptModeEngineTest)  Time elapsed: 0.204 s
09:44:14 [2020-12-01T14:44:14.028Z] pythonList(org.eclipse.ease.lang.python.py4j.ScriptModeEngineTest)  Time elapsed: 0.208 s
09:44:14 [2020-12-01T14:44:14.028Z] testMultiple(org.eclipse.ease.lang.python.py4j.ScriptModeEngineTest)  Time elapsed: 0.216 s
09:44:14 [2020-12-01T14:44:14.028Z] javaLongArray(org.eclipse.ease.lang.python.py4j.ScriptModeEngineTest)  Time elapsed: 0.208 s
09:44:14 [2020-12-01T14:44:14.028Z] createPythonObject(org.eclipse.ease.lang.python.py4j.ScriptModeEngineTest)  Time elapsed: 0.204 s
09:44:14 [2020-12-01T14:44:14.028Z] pythonInteger(org.eclipse.ease.lang.python.py4j.ScriptModeEngineTest)  Time elapsed: 0.204 s
09:44:14 [2020-12-01T14:44:14.028Z] Running org.eclipse.ease.lang.python.py4j.ShellModeEngineTest
09:44:14 [2020-12-01T14:44:14.028Z] ----------------------------------------------
09:44:14 [2020-12-01T14:44:14.028Z] Starting test: invalidSyntax(org.eclipse.ease.lang.python.py4j.ShellModeEngineTest)
09:44:14 [2020-12-01T14:44:14.028Z] org.eclipse.ease.ScriptExecutionException:   File "<console>", line 1
09:44:14 [2020-12-01T14:44:14.028Z]     1++
09:44:14 [2020-12-01T14:44:14.028Z]       ^
09:44:14 [2020-12-01T14:44:14.028Z] SyntaxError: invalid syntax
09:44:14 [2020-12-01T14:44:14.028Z] 
09:44:14 [2020-12-01T14:44:14.284Z] 
09:44:14 [2020-12-01T14:44:14.284Z] Finished test: invalidSyntax(org.eclipse.ease.lang.python.py4j.ShellModeEngineTest)
09:44:14 [2020-12-01T14:44:14.284Z] ----------------------------------------------
09:44:14 [2020-12-01T14:44:14.284Z] ----------------------------------------------
09:44:14 [2020-12-01T14:44:14.284Z] Starting test: optionalModuleParameters(org.eclipse.ease.lang.python.py4j.ShellModeEngineTest)
09:44:14 [2020-12-01T14:44:14.540Z] 
09:44:14 [2020-12-01T14:44:14.540Z] Finished test: optionalModuleParameters(org.eclipse.ease.lang.python.py4j.ShellModeEngineTest)
09:44:14 [2020-12-01T14:44:14.540Z] ----------------------------------------------
09:44:14 [2020-12-01T14:44:14.540Z] ----------------------------------------------
09:44:14 [2020-12-01T14:44:14.540Z] Starting test: getScriptEngine(org.eclipse.ease.lang.python.py4j.ShellModeEngineTest)
09:44:14 [2020-12-01T14:44:14.540Z] 
09:44:14 [2020-12-01T14:44:14.540Z] Finished test: getScriptEngine(org.eclipse.ease.lang.python.py4j.ShellModeEngineTest)
09:44:14 [2020-12-01T14:44:14.540Z] ----------------------------------------------
09:44:14 [2020-12-01T14:44:14.540Z] ----------------------------------------------
09:44:14 [2020-12-01T14:44:14.540Z] Starting test: callModuleCode(org.eclipse.ease.lang.python.py4j.ShellModeEngineTest)
09:44:14 [2020-12-01T14:44:14.795Z] 
09:44:14 [2020-12-01T14:44:14.795Z] Finished test: callModuleCode(org.eclipse.ease.lang.python.py4j.ShellModeEngineTest)
09:44:14 [2020-12-01T14:44:14.795Z] ----------------------------------------------
09:44:14 [2020-12-01T14:44:14.795Z] ----------------------------------------------
09:44:14 [2020-12-01T14:44:14.795Z] Starting test: incompleteStatement(org.eclipse.ease.lang.python.py4j.ShellModeEngineTest)
09:44:15 [2020-12-01T14:44:15.050Z] 
09:44:15 [2020-12-01T14:44:15.050Z] Finished test: incompleteStatement(org.eclipse.ease.lang.python.py4j.ShellModeEngineTest)
09:44:15 [2020-12-01T14:44:15.050Z] ----------------------------------------------
09:44:15 [2020-12-01T14:44:15.050Z] ----------------------------------------------
09:44:15 [2020-12-01T14:44:15.050Z] Starting test: multiLineStatement(org.eclipse.ease.lang.python.py4j.ShellModeEngineTest)
09:44:15 [2020-12-01T14:44:15.306Z] 
09:44:15 [2020-12-01T14:44:15.306Z] Finished test: multiLineStatement(org.eclipse.ease.lang.python.py4j.ShellModeEngineTest)
09:44:15 [2020-12-01T14:44:15.306Z] ----------------------------------------------
09:44:15 [2020-12-01T14:44:15.306Z] ----------------------------------------------
09:44:15 [2020-12-01T14:44:15.306Z] Starting test: runtimeError(org.eclipse.ease.lang.python.py4j.ShellModeEngineTest)
09:44:15 [2020-12-01T14:44:15.306Z] org.eclipse.ease.ScriptExecutionException: Traceback (most recent call last):
09:44:15 [2020-12-01T14:44:15.306Z]   File "<console>", line 1, in <module>
09:44:15 [2020-12-01T14:44:15.306Z] NameError: name 'x' is not defined
09:44:15 [2020-12-01T14:44:15.306Z] 
09:44:15 [2020-12-01T14:44:15.562Z] 
09:44:15 [2020-12-01T14:44:15.562Z] Finished test: runtimeError(org.eclipse.ease.lang.python.py4j.ShellModeEngineTest)
09:44:15 [2020-12-01T14:44:15.562Z] ----------------------------------------------
09:44:15 [2020-12-01T14:44:15.562Z] ----------------------------------------------
09:44:15 [2020-12-01T14:44:15.562Z] Starting test: javaIntArray(org.eclipse.ease.lang.python.py4j.ShellModeEngineTest)
09:44:15 [2020-12-01T14:44:15.562Z] 
09:44:15 [2020-12-01T14:44:15.562Z] Finished test: javaIntArray(org.eclipse.ease.lang.python.py4j.ShellModeEngineTest)
09:44:15 [2020-12-01T14:44:15.562Z] ----------------------------------------------
09:44:15 [2020-12-01T14:44:15.562Z] ----------------------------------------------
09:44:15 [2020-12-01T14:44:15.562Z] Starting test: javaDoubleArray(org.eclipse.ease.lang.python.py4j.ShellModeEngineTest)
09:44:15 [2020-12-01T14:44:15.817Z] 
09:44:15 [2020-12-01T14:44:15.817Z] Finished test: javaDoubleArray(org.eclipse.ease.lang.python.py4j.ShellModeEngineTest)
09:44:15 [2020-12-01T14:44:15.817Z] ----------------------------------------------
09:44:15 [2020-12-01T14:44:15.817Z] ----------------------------------------------
09:44:15 [2020-12-01T14:44:15.817Z] Starting test: pythonSet(org.eclipse.ease.lang.python.py4j.ShellModeEngineTest)
09:44:16 [2020-12-01T14:44:16.073Z] 
09:44:16 [2020-12-01T14:44:16.073Z] Finished test: pythonSet(org.eclipse.ease.lang.python.py4j.ShellModeEngineTest)
09:44:16 [2020-12-01T14:44:16.073Z] ----------------------------------------------
09:44:16 [2020-12-01T14:44:16.073Z] ----------------------------------------------
09:44:16 [2020-12-01T14:44:16.073Z] Starting test: javaStringArray(org.eclipse.ease.lang.python.py4j.ShellModeEngineTest)
09:44:16 [2020-12-01T14:44:16.329Z] 
09:44:16 [2020-12-01T14:44:16.329Z] Finished test: javaStringArray(org.eclipse.ease.lang.python.py4j.ShellModeEngineTest)
09:44:16 [2020-12-01T14:44:16.329Z] ----------------------------------------------
09:44:16 [2020-12-01T14:44:16.329Z] ----------------------------------------------
09:44:16 [2020-12-01T14:44:16.329Z] Starting test: javaShortArray(org.eclipse.ease.lang.python.py4j.ShellModeEngineTest)
09:44:16 [2020-12-01T14:44:16.585Z] 
09:44:16 [2020-12-01T14:44:16.585Z] Finished test: javaShortArray(org.eclipse.ease.lang.python.py4j.ShellModeEngineTest)
09:44:16 [2020-12-01T14:44:16.585Z] ----------------------------------------------
09:44:16 [2020-12-01T14:44:16.585Z] ----------------------------------------------
09:44:16 [2020-12-01T14:44:16.585Z] Starting test: javaBooleanArray(org.eclipse.ease.lang.python.py4j.ShellModeEngineTest)
09:44:16 [2020-12-01T14:44:16.585Z] 
09:44:16 [2020-12-01T14:44:16.585Z] Finished test: javaBooleanArray(org.eclipse.ease.lang.python.py4j.ShellModeEngineTest)
09:44:16 [2020-12-01T14:44:16.585Z] ----------------------------------------------
09:44:16 [2020-12-01T14:44:16.585Z] ----------------------------------------------
09:44:16 [2020-12-01T14:44:16.585Z] Starting test: javaObjectArray(org.eclipse.ease.lang.python.py4j.ShellModeEngineTest)
09:44:16 [2020-12-01T14:44:16.846Z] 
09:44:16 [2020-12-01T14:44:16.846Z] Finished test: javaObjectArray(org.eclipse.ease.lang.python.py4j.ShellModeEngineTest)
09:44:16 [2020-12-01T14:44:16.846Z] ----------------------------------------------
09:44:16 [2020-12-01T14:44:16.846Z] ----------------------------------------------
09:44:16 [2020-12-01T14:44:16.846Z] Starting test: javaIntegerArray(org.eclipse.ease.lang.python.py4j.ShellModeEngineTest)
09:44:17 [2020-12-01T14:44:17.111Z] 
09:44:17 [2020-12-01T14:44:17.111Z] Finished test: javaIntegerArray(org.eclipse.ease.lang.python.py4j.ShellModeEngineTest)
09:44:17 [2020-12-01T14:44:17.111Z] ----------------------------------------------
09:44:17 [2020-12-01T14:44:17.111Z] ----------------------------------------------
09:44:17 [2020-12-01T14:44:17.111Z] Starting test: javaInteger(org.eclipse.ease.lang.python.py4j.ShellModeEngineTest)
09:44:17 [2020-12-01T14:44:17.366Z] 
09:44:17 [2020-12-01T14:44:17.366Z] Finished test: javaInteger(org.eclipse.ease.lang.python.py4j.ShellModeEngineTest)
09:44:17 [2020-12-01T14:44:17.366Z] ----------------------------------------------
09:44:17 [2020-12-01T14:44:17.366Z] ----------------------------------------------
09:44:17 [2020-12-01T14:44:17.366Z] Starting test: javaString(org.eclipse.ease.lang.python.py4j.ShellModeEngineTest)
09:44:17 [2020-12-01T14:44:17.622Z] 
09:44:17 [2020-12-01T14:44:17.622Z] Finished test: javaString(org.eclipse.ease.lang.python.py4j.ShellModeEngineTest)
09:44:17 [2020-12-01T14:44:17.622Z] ----------------------------------------------
09:44:17 [2020-12-01T14:44:17.622Z] ----------------------------------------------
09:44:17 [2020-12-01T14:44:17.622Z] Starting test: javaByteArray(org.eclipse.ease.lang.python.py4j.ShellModeEngineTest)
09:44:17 [2020-12-01T14:44:17.622Z] 
09:44:17 [2020-12-01T14:44:17.622Z] Finished test: javaByteArray(org.eclipse.ease.lang.python.py4j.ShellModeEngineTest)
09:44:17 [2020-12-01T14:44:17.622Z] ----------------------------------------------
09:44:17 [2020-12-01T14:44:17.622Z] ----------------------------------------------
09:44:17 [2020-12-01T14:44:17.622Z] Starting test: createEclipseClass(org.eclipse.ease.lang.python.py4j.ShellModeEngineTest)
09:44:17 [2020-12-01T14:44:17.877Z] 
09:44:17 [2020-12-01T14:44:17.877Z] Finished test: createEclipseClass(org.eclipse.ease.lang.python.py4j.ShellModeEngineTest)
09:44:17 [2020-12-01T14:44:17.877Z] ----------------------------------------------
09:44:17 [2020-12-01T14:44:17.877Z] ----------------------------------------------
09:44:17 [2020-12-01T14:44:17.877Z] Starting test: pythonString(org.eclipse.ease.lang.python.py4j.ShellModeEngineTest)
09:44:18 [2020-12-01T14:44:18.133Z] 
09:44:18 [2020-12-01T14:44:18.133Z] Finished test: pythonString(org.eclipse.ease.lang.python.py4j.ShellModeEngineTest)
09:44:18 [2020-12-01T14:44:18.133Z] ----------------------------------------------
09:44:18 [2020-12-01T14:44:18.133Z] ----------------------------------------------
09:44:18 [2020-12-01T14:44:18.133Z] Starting test: varargs(org.eclipse.ease.lang.python.py4j.ShellModeEngineTest)
09:44:18 [2020-12-01T14:44:18.389Z] 
09:44:18 [2020-12-01T14:44:18.389Z] Finished test: varargs(org.eclipse.ease.lang.python.py4j.ShellModeEngineTest)
09:44:18 [2020-12-01T14:44:18.389Z] ----------------------------------------------
09:44:18 [2020-12-01T14:44:18.389Z] ----------------------------------------------
09:44:18 [2020-12-01T14:44:18.389Z] Starting test: createJavaType(org.eclipse.ease.lang.python.py4j.ShellModeEngineTest)
09:44:18 [2020-12-01T14:44:18.645Z] 
09:44:18 [2020-12-01T14:44:18.645Z] Finished test: createJavaType(org.eclipse.ease.lang.python.py4j.ShellModeEngineTest)
09:44:18 [2020-12-01T14:44:18.645Z] ----------------------------------------------
09:44:18 [2020-12-01T14:44:18.645Z] ----------------------------------------------
09:44:18 [2020-12-01T14:44:18.645Z] Starting test: javaFloatArray(org.eclipse.ease.lang.python.py4j.ShellModeEngineTest)
09:44:18 [2020-12-01T14:44:18.645Z] 
09:44:18 [2020-12-01T14:44:18.645Z] Finished test: javaFloatArray(org.eclipse.ease.lang.python.py4j.ShellModeEngineTest)
09:44:18 [2020-12-01T14:44:18.645Z] ----------------------------------------------
09:44:18 [2020-12-01T14:44:18.645Z] ----------------------------------------------
09:44:18 [2020-12-01T14:44:18.645Z] Starting test: implementJavaInterface(org.eclipse.ease.lang.python.py4j.ShellModeEngineTest)
09:44:18 [2020-12-01T14:44:18.906Z] 
09:44:18 [2020-12-01T14:44:18.906Z] Finished test: implementJavaInterface(org.eclipse.ease.lang.python.py4j.ShellModeEngineTest)
09:44:18 [2020-12-01T14:44:18.906Z] ----------------------------------------------
09:44:18 [2020-12-01T14:44:18.906Z] ----------------------------------------------
09:44:18 [2020-12-01T14:44:18.906Z] Starting test: pythonDict(org.eclipse.ease.lang.python.py4j.ShellModeEngineTest)
09:44:19 [2020-12-01T14:44:19.161Z] 
09:44:19 [2020-12-01T14:44:19.161Z] Finished test: pythonDict(org.eclipse.ease.lang.python.py4j.ShellModeEngineTest)
09:44:19 [2020-12-01T14:44:19.161Z] ----------------------------------------------
09:44:19 [2020-12-01T14:44:19.161Z] ----------------------------------------------
09:44:19 [2020-12-01T14:44:19.161Z] Starting test: pythonList(org.eclipse.ease.lang.python.py4j.ShellModeEngineTest)
09:44:19 [2020-12-01T14:44:19.417Z] 
09:44:19 [2020-12-01T14:44:19.417Z] Finished test: pythonList(org.eclipse.ease.lang.python.py4j.ShellModeEngineTest)
09:44:19 [2020-12-01T14:44:19.417Z] ----------------------------------------------
09:44:19 [2020-12-01T14:44:19.417Z] ----------------------------------------------
09:44:19 [2020-12-01T14:44:19.417Z] Starting test: testMultiple(org.eclipse.ease.lang.python.py4j.ShellModeEngineTest)
09:44:19 [2020-12-01T14:44:19.672Z] 
09:44:19 [2020-12-01T14:44:19.673Z] Finished test: testMultiple(org.eclipse.ease.lang.python.py4j.ShellModeEngineTest)
09:44:19 [2020-12-01T14:44:19.673Z] ----------------------------------------------
09:44:19 [2020-12-01T14:44:19.673Z] ----------------------------------------------
09:44:19 [2020-12-01T14:44:19.673Z] Starting test: javaLongArray(org.eclipse.ease.lang.python.py4j.ShellModeEngineTest)
09:44:19 [2020-12-01T14:44:19.673Z] 
09:44:19 [2020-12-01T14:44:19.673Z] Finished test: javaLongArray(org.eclipse.ease.lang.python.py4j.ShellModeEngineTest)
09:44:19 [2020-12-01T14:44:19.673Z] ----------------------------------------------
09:44:19 [2020-12-01T14:44:19.673Z] ----------------------------------------------
09:44:19 [2020-12-01T14:44:19.673Z] Starting test: createPythonObject(org.eclipse.ease.lang.python.py4j.ShellModeEngineTest)
09:44:19 [2020-12-01T14:44:19.928Z] 
09:44:19 [2020-12-01T14:44:19.928Z] Finished test: createPythonObject(org.eclipse.ease.lang.python.py4j.ShellModeEngineTest)
09:44:19 [2020-12-01T14:44:19.928Z] ----------------------------------------------
09:44:19 [2020-12-01T14:44:19.928Z] ----------------------------------------------
09:44:19 [2020-12-01T14:44:19.928Z] Starting test: pythonInteger(org.eclipse.ease.lang.python.py4j.ShellModeEngineTest)
09:44:20 [2020-12-01T14:44:20.185Z] 
09:44:20 [2020-12-01T14:44:20.185Z] Finished test: pythonInteger(org.eclipse.ease.lang.python.py4j.ShellModeEngineTest)
09:44:20 [2020-12-01T14:44:20.185Z] ----------------------------------------------
09:44:20 [2020-12-01T14:44:20.185Z] Tests run: 34, Failures: 0, Errors: 0, Skipped: 4, Time elapsed: 6.132 s - in org.eclipse.ease.lang.python.py4j.ShellModeEngineTest
09:44:20 [2020-12-01T14:44:20.185Z] invalidSyntax(org.eclipse.ease.lang.python.py4j.ShellModeEngineTest)  Time elapsed: 0.201 s
09:44:20 [2020-12-01T14:44:20.185Z] print_(org.eclipse.ease.lang.python.py4j.ShellModeEngineTest) skipped
09:44:20 [2020-12-01T14:44:20.185Z] optionalModuleParameters(org.eclipse.ease.lang.python.py4j.ShellModeEngineTest)  Time elapsed: 0.201 s
09:44:20 [2020-12-01T14:44:20.185Z] print_TextNoNewline(org.eclipse.ease.lang.python.py4j.ShellModeEngineTest) skipped
09:44:20 [2020-12-01T14:44:20.185Z] getScriptEngine(org.eclipse.ease.lang.python.py4j.ShellModeEngineTest)  Time elapsed: 0.202 s
09:44:20 [2020-12-01T14:44:20.185Z] print_Text(org.eclipse.ease.lang.python.py4j.ShellModeEngineTest) skipped
09:44:20 [2020-12-01T14:44:20.185Z] callModuleCode(org.eclipse.ease.lang.python.py4j.ShellModeEngineTest)  Time elapsed: 0.2 s
09:44:20 [2020-12-01T14:44:20.185Z] print_NoNewline(org.eclipse.ease.lang.python.py4j.ShellModeEngineTest) skipped
09:44:20 [2020-12-01T14:44:20.185Z] incompleteStatement(org.eclipse.ease.lang.python.py4j.ShellModeEngineTest)  Time elapsed: 0.201 s
09:44:20 [2020-12-01T14:44:20.185Z] multiLineStatement(org.eclipse.ease.lang.python.py4j.ShellModeEngineTest)  Time elapsed: 0.203 s
09:44:20 [2020-12-01T14:44:20.185Z] runtimeError(org.eclipse.ease.lang.python.py4j.ShellModeEngineTest)  Time elapsed: 0.2 s
09:44:20 [2020-12-01T14:44:20.185Z] javaIntArray(org.eclipse.ease.lang.python.py4j.ShellModeEngineTest)  Time elapsed: 0.203 s
09:44:20 [2020-12-01T14:44:20.185Z] javaDoubleArray(org.eclipse.ease.lang.python.py4j.ShellModeEngineTest)  Time elapsed: 0.201 s
09:44:20 [2020-12-01T14:44:20.185Z] pythonSet(org.eclipse.ease.lang.python.py4j.ShellModeEngineTest)  Time elapsed: 0.205 s
09:44:20 [2020-12-01T14:44:20.185Z] javaStringArray(org.eclipse.ease.lang.python.py4j.ShellModeEngineTest)  Time elapsed: 0.201 s
09:44:20 [2020-12-01T14:44:20.185Z] javaShortArray(org.eclipse.ease.lang.python.py4j.ShellModeEngineTest)  Time elapsed: 0.225 s
09:44:20 [2020-12-01T14:44:20.185Z] javaBooleanArray(org.eclipse.ease.lang.python.py4j.ShellModeEngineTest)  Time elapsed: 0.199 s
09:44:20 [2020-12-01T14:44:20.185Z] javaObjectArray(org.eclipse.ease.lang.python.py4j.ShellModeEngineTest)  Time elapsed: 0.204 s
09:44:20 [2020-12-01T14:44:20.185Z] javaIntegerArray(org.eclipse.ease.lang.python.py4j.ShellModeEngineTest)  Time elapsed: 0.204 s
09:44:20 [2020-12-01T14:44:20.185Z] javaInteger(org.eclipse.ease.lang.python.py4j.ShellModeEngineTest)  Time elapsed: 0.2 s
09:44:20 [2020-12-01T14:44:20.185Z] javaString(org.eclipse.ease.lang.python.py4j.ShellModeEngineTest)  Time elapsed: 0.214 s
09:44:20 [2020-12-01T14:44:20.185Z] javaByteArray(org.eclipse.ease.lang.python.py4j.ShellModeEngineTest)  Time elapsed: 0.2 s
09:44:20 [2020-12-01T14:44:20.185Z] createEclipseClass(org.eclipse.ease.lang.python.py4j.ShellModeEngineTest)  Time elapsed: 0.203 s
09:44:20 [2020-12-01T14:44:20.185Z] pythonString(org.eclipse.ease.lang.python.py4j.ShellModeEngineTest)  Time elapsed: 0.217 s
09:44:20 [2020-12-01T14:44:20.185Z] varargs(org.eclipse.ease.lang.python.py4j.ShellModeEngineTest)  Time elapsed: 0.225 s
09:44:20 [2020-12-01T14:44:20.185Z] createJavaType(org.eclipse.ease.lang.python.py4j.ShellModeEngineTest)  Time elapsed: 0.201 s
09:44:20 [2020-12-01T14:44:20.185Z] javaFloatArray(org.eclipse.ease.lang.python.py4j.ShellModeEngineTest)  Time elapsed: 0.203 s
09:44:20 [2020-12-01T14:44:20.185Z] implementJavaInterface(org.eclipse.ease.lang.python.py4j.ShellModeEngineTest)  Time elapsed: 0.202 s
09:44:20 [2020-12-01T14:44:20.185Z] pythonDict(org.eclipse.ease.lang.python.py4j.ShellModeEngineTest)  Time elapsed: 0.207 s
09:44:20 [2020-12-01T14:44:20.185Z] pythonList(org.eclipse.ease.lang.python.py4j.ShellModeEngineTest)  Time elapsed: 0.202 s
09:44:20 [2020-12-01T14:44:20.185Z] testMultiple(org.eclipse.ease.lang.python.py4j.ShellModeEngineTest)  Time elapsed: 0.205 s
09:44:20 [2020-12-01T14:44:20.185Z] javaLongArray(org.eclipse.ease.lang.python.py4j.ShellModeEngineTest)  Time elapsed: 0.198 s
09:44:20 [2020-12-01T14:44:20.185Z] createPythonObject(org.eclipse.ease.lang.python.py4j.ShellModeEngineTest)  Time elapsed: 0.199 s
09:44:20 [2020-12-01T14:44:20.185Z] pythonInteger(org.eclipse.ease.lang.python.py4j.ShellModeEngineTest)  Time elapsed: 0.198 s
09:44:20 [2020-12-01T14:44:20.185Z] Running org.eclipse.ease.lang.python.py4j.Py4JPep302ModuleLoadingTest
09:44:20 [2020-12-01T14:44:20.441Z] org.eclipse.ease.ScriptExecutionException: Traceback (most recent call last):
09:44:20 [2020-12-01T14:44:20.441Z]   File "<...>", line 1, in <module>
09:44:20 [2020-12-01T14:44:20.441Z]   File "<...>", line 81, in load_module
09:44:20 [2020-12-01T14:44:20.441Z] ImportError: No EASE module named 'eclipse.test.notthere'
09:44:20 [2020-12-01T14:44:20.441Z] 
09:44:20 [2020-12-01T14:44:20.697Z] Tests run: 8, Failures: 0, Errors: 0, Skipped: 0, Time elapsed: 0.46 s - in org.eclipse.ease.lang.python.py4j.Py4JPep302ModuleLoadingTest
09:44:20 [2020-12-01T14:44:20.697Z] loadSimpleModule(org.eclipse.ease.lang.python.py4j.Py4JPep302ModuleLoadingTest)  Time elapsed: 0.063 s
09:44:20 [2020-12-01T14:44:20.697Z] loadModuleWithDependencies(org.eclipse.ease.lang.python.py4j.Py4JPep302ModuleLoadingTest)  Time elapsed: 0.056 s
09:44:20 [2020-12-01T14:44:20.697Z] accessAdvancedModule(org.eclipse.ease.lang.python.py4j.Py4JPep302ModuleLoadingTest)  Time elapsed: 0.06 s
09:44:20 [2020-12-01T14:44:20.697Z] importAs(org.eclipse.ease.lang.python.py4j.Py4JPep302ModuleLoadingTest)  Time elapsed: 0.055 s
09:44:20 [2020-12-01T14:44:20.697Z] fromBasicImportMethod(org.eclipse.ease.lang.python.py4j.Py4JPep302ModuleLoadingTest)  Time elapsed: 0.057 s
09:44:20 [2020-12-01T14:44:20.697Z] loadNotExistingModule(org.eclipse.ease.lang.python.py4j.Py4JPep302ModuleLoadingTest)  Time elapsed: 0.053 s
09:44:20 [2020-12-01T14:44:20.697Z] fromBasicImportAll(org.eclipse.ease.lang.python.py4j.Py4JPep302ModuleLoadingTest)  Time elapsed: 0.058 s
09:44:20 [2020-12-01T14:44:20.697Z] accessModule(org.eclipse.ease.lang.python.py4j.Py4JPep302ModuleLoadingTest)  Time elapsed: 0.057 s
09:44:20 [2020-12-01T14:44:20.697Z] Running org.eclipse.ease.lang.python.py4j.Py4jDebugTest
09:44:20 [2020-12-01T14:44:20.697Z] WARNING: An illegal reflective access operation has occurred
09:44:20 [2020-12-01T14:44:20.697Z] WARNING: Illegal reflective access by org.mockito.cglib.core.ReflectUtils$2 (file:/home/jenkins/.m2/repository/p2/osgi/bundle/org.mockito/1.9.5.v201605172210/org.mockito-1.9.5.v201605172210.jar) to method java.lang.ClassLoader.defineClass(java.lang.String,byte[],int,int,java.security.ProtectionDomain)
09:44:20 [2020-12-01T14:44:20.697Z] WARNING: Please consider reporting this to the maintainers of org.mockito.cglib.core.ReflectUtils$2
09:44:20 [2020-12-01T14:44:20.697Z] WARNING: Use --illegal-access=warn to enable warnings of further illegal reflective access operations
09:44:20 [2020-12-01T14:44:20.697Z] WARNING: All illegal access operations will be denied in a future release
09:44:20 [2020-12-01T14:44:20.955Z] Start of script
09:44:20 [2020-12-01T14:44:20.955Z] include file start
09:44:20 [2020-12-01T14:44:20.955Z] include file processed
09:44:20 [2020-12-01T14:44:20.955Z] Result of testMethod = 5
09:44:20 [2020-12-01T14:44:20.955Z] End of script
09:44:21 [2020-12-01T14:44:21.212Z] Start of script
09:44:21 [2020-12-01T14:44:21.212Z] include file start
09:44:21 [2020-12-01T14:44:21.212Z] include file processed
09:44:21 [2020-12-01T14:44:21.212Z] Result of testMethod = 5
09:44:21 [2020-12-01T14:44:21.212Z] End of script
09:44:21 [2020-12-01T14:44:21.468Z] Start of script
09:44:21 [2020-12-01T14:44:21.468Z] include file start
09:44:21 [2020-12-01T14:44:21.468Z] include file processed
09:44:21 [2020-12-01T14:44:21.468Z] Result of testMethod = 5
09:44:21 [2020-12-01T14:44:21.723Z] py4j.Py4JException: An exception was raised by the Python Proxy. Return Message: Traceback (most recent call last):
09:44:21 [2020-12-01T14:44:21.723Z]   File "/home/jenkins/agent/workspace/ease.verify.core.target.2019-06/tests/org.eclipse.ease.lang.python.py4j.test/target/work/plugins/py4j-python_0.10.8.1-bnd-2odeag/src/py4j/clientserver.py", line 581, in _call_proxy
09:44:21 [2020-12-01T14:44:21.723Z]     return_value = getattr(self.pool[obj_id], method)(*params)
09:44:21 [2020-12-01T14:44:21.723Z]   File "<...>", line 424, in run
09:44:21 [2020-12-01T14:44:21.723Z]   File "/usr/lib64/python2.7/bdb.py", line 400, in run
09:44:21 [2020-12-01T14:44:21.723Z]     exec cmd in globals, locals
09:44:21 [2020-12-01T14:44:21.723Z]   File "__ref_L/Debug Test/Main.py_hohpcznbib", line 23, in <module>
09:44:21 [2020-12-01T14:44:21.723Z]   File "__ref_L/Debug Test/Main.py_hohpcznbib", line 23, in <module>
09:44:21 [2020-12-01T14:44:21.724Z]   File "<...>", line 231, in trace_dispatch
09:44:21 [2020-12-01T14:44:21.724Z]   File "/usr/lib64/python2.7/bdb.py", line 49, in trace_dispatch
09:44:21 [2020-12-01T14:44:21.724Z]     return self.dispatch_line(frame)
09:44:21 [2020-12-01T14:44:21.724Z]   File "/usr/lib64/python2.7/bdb.py", line 67, in dispatch_line
09:44:21 [2020-12-01T14:44:21.724Z]     self.user_line(frame)
09:44:21 [2020-12-01T14:44:21.724Z]   File "<...>", line 241, in user_line
09:44:21 [2020-12-01T14:44:21.724Z]   File "<...>", line 296, in dispatch
09:44:21 [2020-12-01T14:44:21.724Z]   File "/home/jenkins/agent/workspace/ease.verify.core.target.2019-06/tests/org.eclipse.ease.lang.python.py4j.test/target/work/plugins/py4j-python_0.10.8.1-bnd-2odeag/src/py4j/java_gateway.py", line 1286, in __call__
09:44:21 [2020-12-01T14:44:21.724Z]     answer, self.gateway_client, self.target_id, self.name)
09:44:21 [2020-12-01T14:44:21.724Z]   File "/home/jenkins/agent/workspace/ease.verify.core.target.2019-06/tests/org.eclipse.ease.lang.python.py4j.test/target/work/plugins/py4j-python_0.10.8.1-bnd-2odeag/src/py4j/protocol.py", line 328, in get_return_value
09:44:21 [2020-12-01T14:44:21.724Z]     format(target_id, ".", name), value)
09:44:21 [2020-12-01T14:44:21.724Z] Py4JJavaError: An error occurred while calling o0.traceDispatch.
09:44:21 [2020-12-01T14:44:21.724Z] : org.eclipse.ease.ExitException: 
09:44:21 [2020-12-01T14:44:21.724Z] 	at org.eclipse.ease.debugging.AbstractEaseDebugger.handleEventsInSuspendedState(AbstractEaseDebugger.java:329)
09:44:21 [2020-12-01T14:44:21.724Z] 	at org.eclipse.ease.debugging.AbstractEaseDebugger.suspend(AbstractEaseDebugger.java:255)
09:44:21 [2020-12-01T14:44:21.724Z] 	at org.eclipse.ease.lang.python.py4j.internal.Py4jDebugger.suspend(Py4jDebugger.java:87)
09:44:21 [2020-12-01T14:44:21.724Z] 	at org.eclipse.ease.debugging.AbstractEaseDebugger.processLine(AbstractEaseDebugger.java:490)
09:44:21 [2020-12-01T14:44:21.724Z] 	at org.eclipse.ease.lang.python.debugger.PythonDebugger.traceDispatch(PythonDebugger.java:177)
09:44:21 [2020-12-01T14:44:21.724Z] 	at jdk.internal.reflect.GeneratedMethodAccessor19.invoke(Unknown Source)
09:44:21 [2020-12-01T14:44:21.724Z] 	at java.base/jdk.internal.reflect.DelegatingMethodAccessorImpl.invoke(DelegatingMethodAccessorImpl.java:43)
09:44:21 [2020-12-01T14:44:21.724Z] 	at java.base/java.lang.reflect.Method.invoke(Method.java:566)
09:44:21 [2020-12-01T14:44:21.724Z] 	at py4j.reflection.MethodInvoker.invoke(MethodInvoker.java:244)
09:44:21 [2020-12-01T14:44:21.724Z] 	at py4j.reflection.ReflectionEngine.invoke(ReflectionEngine.java:357)
09:44:21 [2020-12-01T14:44:21.724Z] 	at py4j.Gateway.invoke(Gateway.java:282)
09:44:21 [2020-12-01T14:44:21.724Z] 	at py4j.commands.AbstractCommand.invokeMethod(AbstractCommand.java:132)
09:44:21 [2020-12-01T14:44:21.724Z] 	at py4j.commands.CallCommand.execute(CallCommand.java:79)
09:44:21 [2020-12-01T14:44:21.724Z] 	at py4j.ClientServerConnection.sendCommand(ClientServerConnection.java:244)
09:44:21 [2020-12-01T14:44:21.724Z] 	at py4j.CallbackClient.sendCommand(CallbackClient.java:384)
09:44:21 [2020-12-01T14:44:21.724Z] 	at py4j.CallbackClient.sendCommand(CallbackClient.java:356)
09:44:21 [2020-12-01T14:44:21.724Z] 	at py4j.reflection.PythonProxyHandler.invoke(PythonProxyHandler.java:106)
09:44:21 [2020-12-01T14:44:21.724Z] 	at com.sun.proxy.$Proxy18.run(Unknown Source)
09:44:21 [2020-12-01T14:44:21.724Z] 	at org.eclipse.ease.lang.python.py4j.internal.Py4jDebugger.execute(Py4jDebugger.java:106)
09:44:21 [2020-12-01T14:44:21.724Z] 	at org.eclipse.ease.lang.python.py4j.internal.Py4jDebuggerEngine.internalExecute(Py4jDebuggerEngine.java:85)
09:44:21 [2020-12-01T14:44:21.724Z] 	at org.eclipse.ease.lang.python.py4j.internal.Py4jScriptEngine.execute(Py4jScriptEngine.java:226)
09:44:21 [2020-12-01T14:44:21.724Z] 	at org.eclipse.ease.AbstractScriptEngine.inject(AbstractScriptEngine.java:224)
09:44:21 [2020-12-01T14:44:21.724Z] 	at org.eclipse.ease.AbstractScriptEngine.run(AbstractScriptEngine.java:274)
09:44:21 [2020-12-01T14:44:21.724Z] 	at org.eclipse.core.internal.jobs.Worker.run(Worker.java:63)
09:44:21 [2020-12-01T14:44:21.724Z] 
09:44:21 [2020-12-01T14:44:21.724Z] 
09:44:21 [2020-12-01T14:44:21.724Z] 	at py4j.Protocol.getReturnValue(Protocol.java:476)
09:44:21 [2020-12-01T14:44:21.724Z] 	at py4j.reflection.PythonProxyHandler.invoke(PythonProxyHandler.java:108)
09:44:21 [2020-12-01T14:44:21.724Z] 	at com.sun.proxy.$Proxy18.run(Unknown Source)
09:44:21 [2020-12-01T14:44:21.724Z] 	at org.eclipse.ease.lang.python.py4j.internal.Py4jDebugger.execute(Py4jDebugger.java:106)
09:44:21 [2020-12-01T14:44:21.724Z] 	at org.eclipse.ease.lang.python.py4j.internal.Py4jDebuggerEngine.internalExecute(Py4jDebuggerEngine.java:85)
09:44:21 [2020-12-01T14:44:21.724Z] 	at org.eclipse.ease.lang.python.py4j.internal.Py4jScriptEngine.execute(Py4jScriptEngine.java:226)
09:44:21 [2020-12-01T14:44:21.724Z] 	at org.eclipse.ease.AbstractScriptEngine.inject(AbstractScriptEngine.java:224)
09:44:21 [2020-12-01T14:44:21.724Z] 	at org.eclipse.ease.AbstractScriptEngine.run(AbstractScriptEngine.java:274)
09:44:21 [2020-12-01T14:44:21.724Z] 	at org.eclipse.core.internal.jobs.Worker.run(Worker.java:63)
09:44:21 [2020-12-01T14:44:21.724Z] Start of script
09:44:21 [2020-12-01T14:44:21.724Z] include file start
09:44:21 [2020-12-01T14:44:21.724Z] include file processed
09:44:21 [2020-12-01T14:44:21.979Z] Result of testMethod = 5
09:44:21 [2020-12-01T14:44:21.979Z] End of script
09:44:22 [2020-12-01T14:44:22.235Z] Start of script
09:44:22 [2020-12-01T14:44:22.235Z] include file start
09:44:22 [2020-12-01T14:44:22.235Z] include file processed
09:44:22 [2020-12-01T14:44:22.235Z] Result of testMethod = 5
09:44:22 [2020-12-01T14:44:22.235Z] End of script
09:44:22 [2020-12-01T14:44:22.490Z] Start of script
09:44:22 [2020-12-01T14:44:22.490Z] include file start
09:44:22 [2020-12-01T14:44:22.490Z] include file processed
09:44:22 [2020-12-01T14:44:22.745Z] Result of testMethod = 5
09:44:22 [2020-12-01T14:44:22.745Z] End of script
09:44:23 [2020-12-01T14:44:23.001Z] Start of script
09:44:23 [2020-12-01T14:44:23.001Z] include file start
09:44:23 [2020-12-01T14:44:23.001Z] include file processed
09:44:23 [2020-12-01T14:44:23.001Z] Result of testMethod = 5
09:44:23 [2020-12-01T14:44:23.001Z] py4j.Py4JException: An exception was raised by the Python Proxy. Return Message: Traceback (most recent call last):
09:44:23 [2020-12-01T14:44:23.001Z]   File "/home/jenkins/agent/workspace/ease.verify.core.target.2019-06/tests/org.eclipse.ease.lang.python.py4j.test/target/work/plugins/py4j-python_0.10.8.1-bnd-2odeag/src/py4j/clientserver.py", line 581, in _call_proxy
09:44:23 [2020-12-01T14:44:23.001Z]     return_value = getattr(self.pool[obj_id], method)(*params)
09:44:23 [2020-12-01T14:44:23.001Z]   File "<...>", line 424, in run
09:44:23 [2020-12-01T14:44:23.001Z]   File "/usr/lib64/python2.7/bdb.py", line 400, in run
09:44:23 [2020-12-01T14:44:23.001Z]     exec cmd in globals, locals
09:44:23 [2020-12-01T14:44:23.001Z]   File "__ref_L/Debug Test/Main.py_xdkrrvdhjr", line 23, in <module>
09:44:23 [2020-12-01T14:44:23.001Z]   File "__ref_L/Debug Test/Main.py_xdkrrvdhjr", line 23, in <module>
09:44:23 [2020-12-01T14:44:23.001Z]   File "<...>", line 231, in trace_dispatch
09:44:23 [2020-12-01T14:44:23.001Z]   File "/usr/lib64/python2.7/bdb.py", line 49, in trace_dispatch
09:44:23 [2020-12-01T14:44:23.001Z]     return self.dispatch_line(frame)
09:44:23 [2020-12-01T14:44:23.001Z]   File "/usr/lib64/python2.7/bdb.py", line 67, in dispatch_line
09:44:23 [2020-12-01T14:44:23.001Z]     self.user_line(frame)
09:44:23 [2020-12-01T14:44:23.001Z]   File "<...>", line 241, in user_line
09:44:23 [2020-12-01T14:44:23.001Z]   File "<...>", line 296, in dispatch
09:44:23 [2020-12-01T14:44:23.001Z]   File "/home/jenkins/agent/workspace/ease.verify.core.target.2019-06/tests/org.eclipse.ease.lang.python.py4j.test/target/work/plugins/py4j-python_0.10.8.1-bnd-2odeag/src/py4j/java_gateway.py", line 1286, in __call__
09:44:23 [2020-12-01T14:44:23.001Z]     answer, self.gateway_client, self.target_id, self.name)
09:44:23 [2020-12-01T14:44:23.001Z]   File "/home/jenkins/agent/workspace/ease.verify.core.target.2019-06/tests/org.eclipse.ease.lang.python.py4j.test/target/work/plugins/py4j-python_0.10.8.1-bnd-2odeag/src/py4j/protocol.py", line 328, in get_return_value
09:44:23 [2020-12-01T14:44:23.001Z]     format(target_id, ".", name), value)
09:44:23 [2020-12-01T14:44:23.001Z] Py4JJavaError: An error occurred while calling o0.traceDispatch.
09:44:23 [2020-12-01T14:44:23.001Z] : org.eclipse.ease.ExitException: 
09:44:23 [2020-12-01T14:44:23.001Z] 	at org.eclipse.ease.debugging.AbstractEaseDebugger.handleEventsInSuspendedState(AbstractEaseDebugger.java:329)
09:44:23 [2020-12-01T14:44:23.001Z] 	at org.eclipse.ease.debugging.AbstractEaseDebugger.suspend(AbstractEaseDebugger.java:255)
09:44:23 [2020-12-01T14:44:23.001Z] 	at org.eclipse.ease.lang.python.py4j.internal.Py4jDebugger.suspend(Py4jDebugger.java:87)
09:44:23 [2020-12-01T14:44:23.001Z] 	at org.eclipse.ease.debugging.AbstractEaseDebugger.processLine(AbstractEaseDebugger.java:490)
09:44:23 [2020-12-01T14:44:23.001Z] 	at org.eclipse.ease.lang.python.debugger.PythonDebugger.traceDispatch(PythonDebugger.java:177)
09:44:23 [2020-12-01T14:44:23.001Z] 	at jdk.internal.reflect.GeneratedMethodAccessor19.invoke(Unknown Source)
09:44:23 [2020-12-01T14:44:23.001Z] 	at java.base/jdk.internal.reflect.DelegatingMethodAccessorImpl.invoke(DelegatingMethodAccessorImpl.java:43)
09:44:23 [2020-12-01T14:44:23.001Z] 	at java.base/java.lang.reflect.Method.invoke(Method.java:566)
09:44:23 [2020-12-01T14:44:23.001Z] 	at py4j.reflection.MethodInvoker.invoke(MethodInvoker.java:244)
09:44:23 [2020-12-01T14:44:23.002Z] 	at py4j.reflection.ReflectionEngine.invoke(ReflectionEngine.java:357)
09:44:23 [2020-12-01T14:44:23.002Z] 	at py4j.Gateway.invoke(Gateway.java:282)
09:44:23 [2020-12-01T14:44:23.002Z] 	at py4j.commands.AbstractCommand.invokeMethod(AbstractCommand.java:132)
09:44:23 [2020-12-01T14:44:23.002Z] 	at py4j.commands.CallCommand.execute(CallCommand.java:79)
09:44:23 [2020-12-01T14:44:23.002Z] 	at py4j.ClientServerConnection.sendCommand(ClientServerConnection.java:244)
09:44:23 [2020-12-01T14:44:23.002Z] 	at py4j.CallbackClient.sendCommand(CallbackClient.java:384)
09:44:23 [2020-12-01T14:44:23.002Z] 	at py4j.CallbackClient.sendCommand(CallbackClient.java:356)
09:44:23 [2020-12-01T14:44:23.002Z] 	at py4j.reflection.PythonProxyHandler.invoke(PythonProxyHandler.java:106)
09:44:23 [2020-12-01T14:44:23.002Z] 	at com.sun.proxy.$Proxy18.run(Unknown Source)
09:44:23 [2020-12-01T14:44:23.002Z] 	at org.eclipse.ease.lang.python.py4j.internal.Py4jDebugger.execute(Py4jDebugger.java:106)
09:44:23 [2020-12-01T14:44:23.002Z] 	at org.eclipse.ease.lang.python.py4j.internal.Py4jDebuggerEngine.internalExecute(Py4jDebuggerEngine.java:85)
09:44:23 [2020-12-01T14:44:23.002Z] 	at org.eclipse.ease.lang.python.py4j.internal.Py4jScriptEngine.execute(Py4jScriptEngine.java:226)
09:44:23 [2020-12-01T14:44:23.002Z] 	at org.eclipse.ease.AbstractScriptEngine.inject(AbstractScriptEngine.java:224)
09:44:23 [2020-12-01T14:44:23.002Z] 	at org.eclipse.ease.AbstractScriptEngine.run(AbstractScriptEngine.java:274)
09:44:23 [2020-12-01T14:44:23.002Z] 	at org.eclipse.core.internal.jobs.Worker.run(Worker.java:63)
09:44:23 [2020-12-01T14:44:23.002Z] 
09:44:23 [2020-12-01T14:44:23.002Z] 
09:44:23 [2020-12-01T14:44:23.002Z] 	at py4j.Protocol.getReturnValue(Protocol.java:476)
09:44:23 [2020-12-01T14:44:23.002Z] 	at py4j.reflection.PythonProxyHandler.invoke(PythonProxyHandler.java:108)
09:44:23 [2020-12-01T14:44:23.002Z] 	at com.sun.proxy.$Proxy18.run(Unknown Source)
09:44:23 [2020-12-01T14:44:23.002Z] 	at org.eclipse.ease.lang.python.py4j.internal.Py4jDebugger.execute(Py4jDebugger.java:106)
09:44:23 [2020-12-01T14:44:23.002Z] 	at org.eclipse.ease.lang.python.py4j.internal.Py4jDebuggerEngine.internalExecute(Py4jDebuggerEngine.java:85)
09:44:23 [2020-12-01T14:44:23.002Z] 	at org.eclipse.ease.lang.python.py4j.internal.Py4jScriptEngine.execute(Py4jScriptEngine.java:226)
09:44:23 [2020-12-01T14:44:23.002Z] 	at org.eclipse.ease.AbstractScriptEngine.inject(AbstractScriptEngine.java:224)
09:44:23 [2020-12-01T14:44:23.002Z] 	at org.eclipse.ease.AbstractScriptEngine.run(AbstractScriptEngine.java:274)
09:44:23 [2020-12-01T14:44:23.002Z] 	at org.eclipse.core.internal.jobs.Worker.run(Worker.java:63)
09:44:23 [2020-12-01T14:44:23.257Z] Start of script
09:44:23 [2020-12-01T14:44:23.257Z] include file start
09:44:23 [2020-12-01T14:44:23.257Z] include file processed
09:44:23 [2020-12-01T14:44:23.512Z] Result of testMethod = 5
09:44:23 [2020-12-01T14:44:23.512Z] End of script
09:44:23 [2020-12-01T14:44:23.512Z] Start of script
09:44:23 [2020-12-01T14:44:23.768Z] include file start
09:44:23 [2020-12-01T14:44:23.768Z] include file processed
09:44:23 [2020-12-01T14:44:23.768Z] Result of testMethod = 5
09:44:23 [2020-12-01T14:44:23.768Z] End of script
09:44:24 [2020-12-01T14:44:24.024Z] Start of script
09:44:24 [2020-12-01T14:44:24.024Z] include file start
09:44:24 [2020-12-01T14:44:24.024Z] include file processed
09:44:24 [2020-12-01T14:44:24.279Z] py4j.Py4JException: An exception was raised by the Python Proxy. Return Message: Traceback (most recent call last):
09:44:24 [2020-12-01T14:44:24.279Z]   File "/home/jenkins/agent/workspace/ease.verify.core.target.2019-06/tests/org.eclipse.ease.lang.python.py4j.test/target/work/plugins/py4j-python_0.10.8.1-bnd-2odeag/src/py4j/clientserver.py", line 581, in _call_proxy
09:44:24 [2020-12-01T14:44:24.279Z]     return_value = getattr(self.pool[obj_id], method)(*params)
09:44:24 [2020-12-01T14:44:24.279Z]   File "<...>", line 424, in run
09:44:24 [2020-12-01T14:44:24.279Z]   File "/usr/lib64/python2.7/bdb.py", line 400, in run
09:44:24 [2020-12-01T14:44:24.279Z]     exec cmd in globals, locals
09:44:24 [2020-12-01T14:44:24.279Z]   File "__ref_L/Debug Test/Main.py_deacchtfwj", line 22, in <module>
09:44:24 [2020-12-01T14:44:24.279Z]   File "__ref_L/Debug Test/Main.py_deacchtfwj", line 22, in <module>
09:44:24 [2020-12-01T14:44:24.279Z]   File "<...>", line 231, in trace_dispatch
09:44:24 [2020-12-01T14:44:24.279Z]   File "/usr/lib64/python2.7/bdb.py", line 49, in trace_dispatch
09:44:24 [2020-12-01T14:44:24.279Z]     return self.dispatch_line(frame)
09:44:24 [2020-12-01T14:44:24.279Z]   File "/usr/lib64/python2.7/bdb.py", line 67, in dispatch_line
09:44:24 [2020-12-01T14:44:24.279Z]     self.user_line(frame)
09:44:24 [2020-12-01T14:44:24.279Z]   File "<...>", line 241, in user_line
09:44:24 [2020-12-01T14:44:24.279Z]   File "<...>", line 296, in dispatch
09:44:24 [2020-12-01T14:44:24.280Z]   File "/home/jenkins/agent/workspace/ease.verify.core.target.2019-06/tests/org.eclipse.ease.lang.python.py4j.test/target/work/plugins/py4j-python_0.10.8.1-bnd-2odeag/src/py4j/java_gateway.py", line 1286, in __call__
09:44:24 [2020-12-01T14:44:24.280Z]     answer, self.gateway_client, self.target_id, self.name)
09:44:24 [2020-12-01T14:44:24.280Z]   File "/home/jenkins/agent/workspace/ease.verify.core.target.2019-06/tests/org.eclipse.ease.lang.python.py4j.test/target/work/plugins/py4j-python_0.10.8.1-bnd-2odeag/src/py4j/protocol.py", line 328, in get_return_value
09:44:24 [2020-12-01T14:44:24.280Z]     format(target_id, ".", name), value)
09:44:24 [2020-12-01T14:44:24.280Z] Py4JJavaError: An error occurred while calling o0.traceDispatch.
09:44:24 [2020-12-01T14:44:24.280Z] : org.eclipse.ease.ExitException: 
09:44:24 [2020-12-01T14:44:24.280Z] 	at org.eclipse.ease.debugging.AbstractEaseDebugger.handleEventsInSuspendedState(AbstractEaseDebugger.java:329)
09:44:24 [2020-12-01T14:44:24.280Z] 	at org.eclipse.ease.debugging.AbstractEaseDebugger.suspend(AbstractEaseDebugger.java:255)
09:44:24 [2020-12-01T14:44:24.280Z] 	at org.eclipse.ease.lang.python.py4j.internal.Py4jDebugger.suspend(Py4jDebugger.java:87)
09:44:24 [2020-12-01T14:44:24.280Z] 	at org.eclipse.ease.debugging.AbstractEaseDebugger.processLine(AbstractEaseDebugger.java:510)
09:44:24 [2020-12-01T14:44:24.280Z] 	at org.eclipse.ease.lang.python.debugger.PythonDebugger.traceDispatch(PythonDebugger.java:177)
09:44:24 [2020-12-01T14:44:24.280Z] 	at jdk.internal.reflect.GeneratedMethodAccessor19.invoke(Unknown Source)
09:44:24 [2020-12-01T14:44:24.280Z] 	at java.base/jdk.internal.reflect.DelegatingMethodAccessorImpl.invoke(DelegatingMethodAccessorImpl.java:43)
09:44:24 [2020-12-01T14:44:24.280Z] 	at java.base/java.lang.reflect.Method.invoke(Method.java:566)
09:44:24 [2020-12-01T14:44:24.280Z] 	at py4j.reflection.MethodInvoker.invoke(MethodInvoker.java:244)
09:44:24 [2020-12-01T14:44:24.280Z] 	at py4j.reflection.ReflectionEngine.invoke(ReflectionEngine.java:357)
09:44:24 [2020-12-01T14:44:24.280Z] 	at py4j.Gateway.invoke(Gateway.java:282)
09:44:24 [2020-12-01T14:44:24.280Z] 	at py4j.commands.AbstractCommand.invokeMethod(AbstractCommand.java:132)
09:44:24 [2020-12-01T14:44:24.280Z] 	at py4j.commands.CallCommand.execute(CallCommand.java:79)
09:44:24 [2020-12-01T14:44:24.280Z] 	at py4j.ClientServerConnection.sendCommand(ClientServerConnection.java:244)
09:44:24 [2020-12-01T14:44:24.280Z] 	at py4j.CallbackClient.sendCommand(CallbackClient.java:384)
09:44:24 [2020-12-01T14:44:24.280Z] 	at py4j.CallbackClient.sendCommand(CallbackClient.java:356)
09:44:24 [2020-12-01T14:44:24.280Z] 	at py4j.reflection.PythonProxyHandler.invoke(PythonProxyHandler.java:106)
09:44:24 [2020-12-01T14:44:24.280Z] 	at com.sun.proxy.$Proxy18.run(Unknown Source)
09:44:24 [2020-12-01T14:44:24.280Z] 	at org.eclipse.ease.lang.python.py4j.internal.Py4jDebugger.execute(Py4jDebugger.java:106)
09:44:24 [2020-12-01T14:44:24.280Z] 	at org.eclipse.ease.lang.python.py4j.internal.Py4jDebuggerEngine.internalExecute(Py4jDebuggerEngine.java:85)
09:44:24 [2020-12-01T14:44:24.280Z] 	at org.eclipse.ease.lang.python.py4j.internal.Py4jScriptEngine.execute(Py4jScriptEngine.java:226)
09:44:24 [2020-12-01T14:44:24.280Z] 	at org.eclipse.ease.AbstractScriptEngine.inject(AbstractScriptEngine.java:224)
09:44:24 [2020-12-01T14:44:24.280Z] 	at org.eclipse.ease.AbstractScriptEngine.run(AbstractScriptEngine.java:274)
09:44:24 [2020-12-01T14:44:24.280Z] 	at org.eclipse.core.internal.jobs.Worker.run(Worker.java:63)
09:44:24 [2020-12-01T14:44:24.280Z] 
09:44:24 [2020-12-01T14:44:24.280Z] 
09:44:24 [2020-12-01T14:44:24.280Z] 	at py4j.Protocol.getReturnValue(Protocol.java:476)
09:44:24 [2020-12-01T14:44:24.280Z] 	at py4j.reflection.PythonProxyHandler.invoke(PythonProxyHandler.java:108)
09:44:24 [2020-12-01T14:44:24.280Z] 	at com.sun.proxy.$Proxy18.run(Unknown Source)
09:44:24 [2020-12-01T14:44:24.280Z] 	at org.eclipse.ease.lang.python.py4j.internal.Py4jDebugger.execute(Py4jDebugger.java:106)
09:44:24 [2020-12-01T14:44:24.280Z] 	at org.eclipse.ease.lang.python.py4j.internal.Py4jDebuggerEngine.internalExecute(Py4jDebuggerEngine.java:85)
09:44:24 [2020-12-01T14:44:24.280Z] 	at org.eclipse.ease.lang.python.py4j.internal.Py4jScriptEngine.execute(Py4jScriptEngine.java:226)
09:44:24 [2020-12-01T14:44:24.280Z] 	at org.eclipse.ease.AbstractScriptEngine.inject(AbstractScriptEngine.java:224)
09:44:24 [2020-12-01T14:44:24.280Z] 	at org.eclipse.ease.AbstractScriptEngine.run(AbstractScriptEngine.java:274)
09:44:24 [2020-12-01T14:44:24.280Z] 	at org.eclipse.core.internal.jobs.Worker.run(Worker.java:63)
09:44:24 [2020-12-01T14:44:24.536Z] Start of script
09:44:24 [2020-12-01T14:44:24.536Z] include file start
09:44:24 [2020-12-01T14:44:24.536Z] include file processed
09:44:24 [2020-12-01T14:44:24.536Z] Result of testMethod = 5
09:44:24 [2020-12-01T14:44:24.536Z] End of script
09:44:25 [2020-12-01T14:44:25.097Z] py4j.Py4JException: An exception was raised by the Python Proxy. Return Message: Traceback (most recent call last):
09:44:25 [2020-12-01T14:44:25.097Z]   File "/home/jenkins/agent/workspace/ease.verify.core.target.2019-06/tests/org.eclipse.ease.lang.python.py4j.test/target/work/plugins/py4j-python_0.10.8.1-bnd-2odeag/src/py4j/clientserver.py", line 581, in _call_proxy
09:44:25 [2020-12-01T14:44:25.098Z]     return_value = getattr(self.pool[obj_id], method)(*params)
09:44:25 [2020-12-01T14:44:25.098Z]   File "<...>", line 424, in run
09:44:25 [2020-12-01T14:44:25.098Z]   File "/usr/lib64/python2.7/bdb.py", line 400, in run
09:44:25 [2020-12-01T14:44:25.098Z]     exec cmd in globals, locals
09:44:25 [2020-12-01T14:44:25.098Z]   File "__ref_L/Debug Test/Main.py_knqfndupsx", line 1, in <module>
09:44:25 [2020-12-01T14:44:25.098Z]   File "__ref_L/Debug Test/Main.py_knqfndupsx", line 1, in <module>
09:44:25 [2020-12-01T14:44:25.098Z]   File "<...>", line 231, in trace_dispatch
09:44:25 [2020-12-01T14:44:25.098Z]   File "/usr/lib64/python2.7/bdb.py", line 49, in trace_dispatch
09:44:25 [2020-12-01T14:44:25.098Z]     return self.dispatch_line(frame)
09:44:25 [2020-12-01T14:44:25.098Z]   File "/usr/lib64/python2.7/bdb.py", line 67, in dispatch_line
09:44:25 [2020-12-01T14:44:25.098Z]     self.user_line(frame)
09:44:25 [2020-12-01T14:44:25.098Z]   File "<...>", line 241, in user_line
09:44:25 [2020-12-01T14:44:25.098Z]   File "<...>", line 296, in dispatch
09:44:25 [2020-12-01T14:44:25.098Z]   File "/home/jenkins/agent/workspace/ease.verify.core.target.2019-06/tests/org.eclipse.ease.lang.python.py4j.test/target/work/plugins/py4j-python_0.10.8.1-bnd-2odeag/src/py4j/java_gateway.py", line 1286, in __call__
09:44:25 [2020-12-01T14:44:25.098Z]     answer, self.gateway_client, self.target_id, self.name)
09:44:25 [2020-12-01T14:44:25.098Z]   File "/home/jenkins/agent/workspace/ease.verify.core.target.2019-06/tests/org.eclipse.ease.lang.python.py4j.test/target/work/plugins/py4j-python_0.10.8.1-bnd-2odeag/src/py4j/protocol.py", line 328, in get_return_value
09:44:25 [2020-12-01T14:44:25.098Z]     format(target_id, ".", name), value)
09:44:25 [2020-12-01T14:44:25.098Z] Py4JJavaError: An error occurred while calling o0.traceDispatch.
09:44:25 [2020-12-01T14:44:25.098Z] : org.eclipse.ease.ExitException: 
09:44:25 [2020-12-01T14:44:25.098Z] 	at org.eclipse.ease.debugging.AbstractEaseDebugger.handleEventsInSuspendedState(AbstractEaseDebugger.java:329)
09:44:25 [2020-12-01T14:44:25.098Z] 	at org.eclipse.ease.debugging.AbstractEaseDebugger.suspend(AbstractEaseDebugger.java:255)
09:44:25 [2020-12-01T14:44:25.098Z] 	at org.eclipse.ease.lang.python.py4j.internal.Py4jDebugger.suspend(Py4jDebugger.java:87)
09:44:25 [2020-12-01T14:44:25.098Z] 	at org.eclipse.ease.debugging.AbstractEaseDebugger.processLine(AbstractEaseDebugger.java:490)
09:44:25 [2020-12-01T14:44:25.098Z] 	at org.eclipse.ease.lang.python.debugger.PythonDebugger.traceDispatch(PythonDebugger.java:177)
09:44:25 [2020-12-01T14:44:25.098Z] 	at jdk.internal.reflect.GeneratedMethodAccessor19.invoke(Unknown Source)
09:44:25 [2020-12-01T14:44:25.098Z] 	at java.base/jdk.internal.reflect.DelegatingMethodAccessorImpl.invoke(DelegatingMethodAccessorImpl.java:43)
09:44:25 [2020-12-01T14:44:25.098Z] 	at java.base/java.lang.reflect.Method.invoke(Method.java:566)
09:44:25 [2020-12-01T14:44:25.098Z] 	at py4j.reflection.MethodInvoker.invoke(MethodInvoker.java:244)
09:44:25 [2020-12-01T14:44:25.098Z] 	at py4j.reflection.ReflectionEngine.invoke(ReflectionEngine.java:357)
09:44:25 [2020-12-01T14:44:25.098Z] 	at py4j.Gateway.invoke(Gateway.java:282)
09:44:25 [2020-12-01T14:44:25.098Z] 	at py4j.commands.AbstractCommand.invokeMethod(AbstractCommand.java:132)
09:44:25 [2020-12-01T14:44:25.098Z] 	at py4j.commands.CallCommand.execute(CallCommand.java:79)
09:44:25 [2020-12-01T14:44:25.098Z] 	at py4j.ClientServerConnection.sendCommand(ClientServerConnection.java:244)
09:44:25 [2020-12-01T14:44:25.098Z] 	at py4j.CallbackClient.sendCommand(CallbackClient.java:384)
09:44:25 [2020-12-01T14:44:25.098Z] 	at py4j.CallbackClient.sendCommand(CallbackClient.java:356)
09:44:25 [2020-12-01T14:44:25.098Z] 	at py4j.reflection.PythonProxyHandler.invoke(PythonProxyHandler.java:106)
09:44:25 [2020-12-01T14:44:25.098Z] 	at com.sun.proxy.$Proxy18.run(Unknown Source)
09:44:25 [2020-12-01T14:44:25.098Z] 	at org.eclipse.ease.lang.python.py4j.internal.Py4jDebugger.execute(Py4jDebugger.java:106)
09:44:25 [2020-12-01T14:44:25.098Z] 	at org.eclipse.ease.lang.python.py4j.internal.Py4jDebuggerEngine.internalExecute(Py4jDebuggerEngine.java:85)
09:44:25 [2020-12-01T14:44:25.098Z] 	at org.eclipse.ease.lang.python.py4j.internal.Py4jScriptEngine.execute(Py4jScriptEngine.java:226)
09:44:25 [2020-12-01T14:44:25.098Z] 	at org.eclipse.ease.AbstractScriptEngine.inject(AbstractScriptEngine.java:224)
09:44:25 [2020-12-01T14:44:25.098Z] 	at org.eclipse.ease.AbstractScriptEngine.run(AbstractScriptEngine.java:274)
09:44:25 [2020-12-01T14:44:25.098Z] 	at org.eclipse.core.internal.jobs.Worker.run(Worker.java:63)
09:44:25 [2020-12-01T14:44:25.098Z] 
09:44:25 [2020-12-01T14:44:25.098Z] 
09:44:25 [2020-12-01T14:44:25.098Z] 	at py4j.Protocol.getReturnValue(Protocol.java:476)
09:44:25 [2020-12-01T14:44:25.098Z] 	at py4j.reflection.PythonProxyHandler.invoke(PythonProxyHandler.java:108)
09:44:25 [2020-12-01T14:44:25.098Z] 	at com.sun.proxy.$Proxy18.run(Unknown Source)
09:44:25 [2020-12-01T14:44:25.098Z] 	at org.eclipse.ease.lang.python.py4j.internal.Py4jDebugger.execute(Py4jDebugger.java:106)
09:44:25 [2020-12-01T14:44:25.098Z] 	at org.eclipse.ease.lang.python.py4j.internal.Py4jDebuggerEngine.internalExecute(Py4jDebuggerEngine.java:85)
09:44:25 [2020-12-01T14:44:25.098Z] 	at org.eclipse.ease.lang.python.py4j.internal.Py4jScriptEngine.execute(Py4jScriptEngine.java:226)
09:44:25 [2020-12-01T14:44:25.098Z] 	at org.eclipse.ease.AbstractScriptEngine.inject(AbstractScriptEngine.java:224)
09:44:25 [2020-12-01T14:44:25.098Z] 	at org.eclipse.ease.AbstractScriptEngine.run(AbstractScriptEngine.java:274)
09:44:25 [2020-12-01T14:44:25.098Z] 	at org.eclipse.core.internal.jobs.Worker.run(Worker.java:63)
09:44:25 [2020-12-01T14:44:25.098Z] Start of script
09:44:25 [2020-12-01T14:44:25.098Z] include file start
09:44:25 [2020-12-01T14:44:25.098Z] include file processed
09:44:25 [2020-12-01T14:44:25.098Z] Result of testMethod = 5
09:44:25 [2020-12-01T14:44:25.098Z] End of script
09:44:25 [2020-12-01T14:44:25.354Z] Start of script
09:44:25 [2020-12-01T14:44:25.354Z] include file start
09:44:25 [2020-12-01T14:44:25.354Z] include file processed
09:44:25 [2020-12-01T14:44:25.609Z] Result of testMethod = 5
09:44:25 [2020-12-01T14:44:25.609Z] End of script
09:44:25 [2020-12-01T14:44:25.609Z] Start of script
09:44:25 [2020-12-01T14:44:25.609Z] include file start
09:44:25 [2020-12-01T14:44:25.609Z] include file processed
09:44:25 [2020-12-01T14:44:25.609Z] Result of testMethod = 5
09:44:25 [2020-12-01T14:44:25.865Z] py4j.Py4JException: An exception was raised by the Python Proxy. Return Message: Traceback (most recent call last):
09:44:25 [2020-12-01T14:44:25.865Z]   File "/home/jenkins/agent/workspace/ease.verify.core.target.2019-06/tests/org.eclipse.ease.lang.python.py4j.test/target/work/plugins/py4j-python_0.10.8.1-bnd-2odeag/src/py4j/clientserver.py", line 581, in _call_proxy
09:44:25 [2020-12-01T14:44:25.865Z]     return_value = getattr(self.pool[obj_id], method)(*params)
09:44:25 [2020-12-01T14:44:25.865Z]   File "<...>", line 424, in run
09:44:25 [2020-12-01T14:44:25.865Z]   File "/usr/lib64/python2.7/bdb.py", line 400, in run
09:44:25 [2020-12-01T14:44:25.865Z]     exec cmd in globals, locals
09:44:25 [2020-12-01T14:44:25.865Z]   File "__ref_L/Debug Test/Main.py_uvutqghjjg", line 23, in <module>
09:44:25 [2020-12-01T14:44:25.865Z]   File "__ref_L/Debug Test/Main.py_uvutqghjjg", line 23, in <module>
09:44:25 [2020-12-01T14:44:25.865Z]   File "<...>", line 231, in trace_dispatch
09:44:25 [2020-12-01T14:44:25.865Z]   File "/usr/lib64/python2.7/bdb.py", line 49, in trace_dispatch
09:44:25 [2020-12-01T14:44:25.865Z]     return self.dispatch_line(frame)
09:44:25 [2020-12-01T14:44:25.865Z]   File "/usr/lib64/python2.7/bdb.py", line 67, in dispatch_line
09:44:25 [2020-12-01T14:44:25.865Z]     self.user_line(frame)
09:44:25 [2020-12-01T14:44:25.865Z]   File "<...>", line 241, in user_line
09:44:25 [2020-12-01T14:44:25.865Z]   File "<...>", line 296, in dispatch
09:44:25 [2020-12-01T14:44:25.865Z]   File "/home/jenkins/agent/workspace/ease.verify.core.target.2019-06/tests/org.eclipse.ease.lang.python.py4j.test/target/work/plugins/py4j-python_0.10.8.1-bnd-2odeag/src/py4j/java_gateway.py", line 1286, in __call__
09:44:25 [2020-12-01T14:44:25.865Z]     answer, self.gateway_client, self.target_id, self.name)
09:44:25 [2020-12-01T14:44:25.865Z]   File "/home/jenkins/agent/workspace/ease.verify.core.target.2019-06/tests/org.eclipse.ease.lang.python.py4j.test/target/work/plugins/py4j-python_0.10.8.1-bnd-2odeag/src/py4j/protocol.py", line 328, in get_return_value
09:44:25 [2020-12-01T14:44:25.865Z]     format(target_id, ".", name), value)
09:44:25 [2020-12-01T14:44:25.865Z] Py4JJavaError: An error occurred while calling o0.traceDispatch.
09:44:25 [2020-12-01T14:44:25.865Z] : org.eclipse.ease.ExitException: 
09:44:25 [2020-12-01T14:44:25.866Z] 	at org.eclipse.ease.debugging.AbstractEaseDebugger.handleEventsInSuspendedState(AbstractEaseDebugger.java:329)
09:44:25 [2020-12-01T14:44:25.866Z] 	at org.eclipse.ease.debugging.AbstractEaseDebugger.suspend(AbstractEaseDebugger.java:255)
09:44:25 [2020-12-01T14:44:25.866Z] 	at org.eclipse.ease.lang.python.py4j.internal.Py4jDebugger.suspend(Py4jDebugger.java:87)
09:44:25 [2020-12-01T14:44:25.866Z] 	at org.eclipse.ease.debugging.AbstractEaseDebugger.processLine(AbstractEaseDebugger.java:490)
09:44:25 [2020-12-01T14:44:25.866Z] 	at org.eclipse.ease.lang.python.debugger.PythonDebugger.traceDispatch(PythonDebugger.java:177)
09:44:25 [2020-12-01T14:44:25.866Z] 	at jdk.internal.reflect.GeneratedMethodAccessor19.invoke(Unknown Source)
09:44:25 [2020-12-01T14:44:25.866Z] 	at java.base/jdk.internal.reflect.DelegatingMethodAccessorImpl.invoke(DelegatingMethodAccessorImpl.java:43)
09:44:25 [2020-12-01T14:44:25.866Z] 	at java.base/java.lang.reflect.Method.invoke(Method.java:566)
09:44:25 [2020-12-01T14:44:25.866Z] 	at py4j.reflection.MethodInvoker.invoke(MethodInvoker.java:244)
09:44:25 [2020-12-01T14:44:25.866Z] 	at py4j.reflection.ReflectionEngine.invoke(ReflectionEngine.java:357)
09:44:25 [2020-12-01T14:44:25.866Z] 	at py4j.Gateway.invoke(Gateway.java:282)
09:44:25 [2020-12-01T14:44:25.866Z] 	at py4j.commands.AbstractCommand.invokeMethod(AbstractCommand.java:132)
09:44:25 [2020-12-01T14:44:25.866Z] 	at py4j.commands.CallCommand.execute(CallCommand.java:79)
09:44:25 [2020-12-01T14:44:25.866Z] 	at py4j.ClientServerConnection.sendCommand(ClientServerConnection.java:244)
09:44:25 [2020-12-01T14:44:25.866Z] 	at py4j.CallbackClient.sendCommand(CallbackClient.java:384)
09:44:25 [2020-12-01T14:44:25.866Z] 	at py4j.CallbackClient.sendCommand(CallbackClient.java:356)
09:44:25 [2020-12-01T14:44:25.866Z] 	at py4j.reflection.PythonProxyHandler.invoke(PythonProxyHandler.java:106)
09:44:25 [2020-12-01T14:44:25.866Z] 	at com.sun.proxy.$Proxy18.run(Unknown Source)
09:44:25 [2020-12-01T14:44:25.866Z] 	at org.eclipse.ease.lang.python.py4j.internal.Py4jDebugger.execute(Py4jDebugger.java:106)
09:44:25 [2020-12-01T14:44:25.866Z] 	at org.eclipse.ease.lang.python.py4j.internal.Py4jDebuggerEngine.internalExecute(Py4jDebuggerEngine.java:85)
09:44:25 [2020-12-01T14:44:25.866Z] 	at org.eclipse.ease.lang.python.py4j.internal.Py4jScriptEngine.execute(Py4jScriptEngine.java:226)
09:44:25 [2020-12-01T14:44:25.866Z] 	at org.eclipse.ease.AbstractScriptEngine.inject(AbstractScriptEngine.java:224)
09:44:25 [2020-12-01T14:44:25.866Z] 	at org.eclipse.ease.AbstractScriptEngine.run(AbstractScriptEngine.java:274)
09:44:25 [2020-12-01T14:44:25.866Z] 	at org.eclipse.core.internal.jobs.Worker.run(Worker.java:63)
09:44:25 [2020-12-01T14:44:25.866Z] 
09:44:25 [2020-12-01T14:44:25.866Z] 
09:44:25 [2020-12-01T14:44:25.866Z] 	at py4j.Protocol.getReturnValue(Protocol.java:476)
09:44:25 [2020-12-01T14:44:25.866Z] 	at py4j.reflection.PythonProxyHandler.invoke(PythonProxyHandler.java:108)
09:44:25 [2020-12-01T14:44:25.866Z] 	at com.sun.proxy.$Proxy18.run(Unknown Source)
09:44:25 [2020-12-01T14:44:25.866Z] 	at org.eclipse.ease.lang.python.py4j.internal.Py4jDebugger.execute(Py4jDebugger.java:106)
09:44:25 [2020-12-01T14:44:25.866Z] 	at org.eclipse.ease.lang.python.py4j.internal.Py4jDebuggerEngine.internalExecute(Py4jDebuggerEngine.java:85)
09:44:25 [2020-12-01T14:44:25.866Z] 	at org.eclipse.ease.lang.python.py4j.internal.Py4jScriptEngine.execute(Py4jScriptEngine.java:226)
09:44:25 [2020-12-01T14:44:25.866Z] 	at org.eclipse.ease.AbstractScriptEngine.inject(AbstractScriptEngine.java:224)
09:44:25 [2020-12-01T14:44:25.866Z] 	at org.eclipse.ease.AbstractScriptEngine.run(AbstractScriptEngine.java:274)
09:44:25 [2020-12-01T14:44:25.866Z] 	at org.eclipse.core.internal.jobs.Worker.run(Worker.java:63)
09:44:25 [2020-12-01T14:44:25.866Z] Start of script
09:44:26 [2020-12-01T14:44:26.122Z] include file start
09:44:26 [2020-12-01T14:44:26.122Z] include file processed
09:44:26 [2020-12-01T14:44:26.122Z] Result of testMethod = 5
09:44:26 [2020-12-01T14:44:26.122Z] End of script
09:44:26 [2020-12-01T14:44:26.378Z] py4j.Py4JException: An exception was raised by the Python Proxy. Return Message: Traceback (most recent call last):
09:44:26 [2020-12-01T14:44:26.378Z]   File "/home/jenkins/agent/workspace/ease.verify.core.target.2019-06/tests/org.eclipse.ease.lang.python.py4j.test/target/work/plugins/py4j-python_0.10.8.1-bnd-2odeag/src/py4j/clientserver.py", line 581, in _call_proxy
09:44:26 [2020-12-01T14:44:26.378Z]     return_value = getattr(self.pool[obj_id], method)(*params)
09:44:26 [2020-12-01T14:44:26.378Z]   File "<...>", line 424, in run
09:44:26 [2020-12-01T14:44:26.378Z]   File "/usr/lib64/python2.7/bdb.py", line 400, in run
09:44:26 [2020-12-01T14:44:26.378Z]     exec cmd in globals, locals
09:44:26 [2020-12-01T14:44:26.378Z]   File "__ref_L/Debug Test/Main.py_kmsfhytxne", line 1, in <module>
09:44:26 [2020-12-01T14:44:26.378Z]   File "__ref_L/Debug Test/Main.py_kmsfhytxne", line 1, in <module>
09:44:26 [2020-12-01T14:44:26.378Z]   File "<...>", line 231, in trace_dispatch
09:44:26 [2020-12-01T14:44:26.378Z]   File "/usr/lib64/python2.7/bdb.py", line 49, in trace_dispatch
09:44:26 [2020-12-01T14:44:26.378Z]     return self.dispatch_line(frame)
09:44:26 [2020-12-01T14:44:26.378Z]   File "/usr/lib64/python2.7/bdb.py", line 67, in dispatch_line
09:44:26 [2020-12-01T14:44:26.378Z]     self.user_line(frame)
09:44:26 [2020-12-01T14:44:26.378Z]   File "<...>", line 241, in user_line
09:44:26 [2020-12-01T14:44:26.378Z]   File "<...>", line 296, in dispatch
09:44:26 [2020-12-01T14:44:26.378Z]   File "/home/jenkins/agent/workspace/ease.verify.core.target.2019-06/tests/org.eclipse.ease.lang.python.py4j.test/target/work/plugins/py4j-python_0.10.8.1-bnd-2odeag/src/py4j/java_gateway.py", line 1286, in __call__
09:44:26 [2020-12-01T14:44:26.378Z]     answer, self.gateway_client, self.target_id, self.name)
09:44:26 [2020-12-01T14:44:26.378Z]   File "/home/jenkins/agent/workspace/ease.verify.core.target.2019-06/tests/org.eclipse.ease.lang.python.py4j.test/target/work/plugins/py4j-python_0.10.8.1-bnd-2odeag/src/py4j/protocol.py", line 328, in get_return_value
09:44:26 [2020-12-01T14:44:26.378Z]     format(target_id, ".", name), value)
09:44:26 [2020-12-01T14:44:26.378Z] Py4JJavaError: An error occurred while calling o0.traceDispatch.
09:44:26 [2020-12-01T14:44:26.378Z] : org.eclipse.ease.ExitException: 
09:44:26 [2020-12-01T14:44:26.378Z] 	at org.eclipse.ease.debugging.AbstractEaseDebugger.handleEventsInSuspendedState(AbstractEaseDebugger.java:329)
09:44:26 [2020-12-01T14:44:26.378Z] 	at org.eclipse.ease.debugging.AbstractEaseDebugger.suspend(AbstractEaseDebugger.java:255)
09:44:26 [2020-12-01T14:44:26.378Z] 	at org.eclipse.ease.lang.python.py4j.internal.Py4jDebugger.suspend(Py4jDebugger.java:87)
09:44:26 [2020-12-01T14:44:26.378Z] 	at org.eclipse.ease.debugging.AbstractEaseDebugger.processLine(AbstractEaseDebugger.java:490)
09:44:26 [2020-12-01T14:44:26.378Z] 	at org.eclipse.ease.lang.python.debugger.PythonDebugger.traceDispatch(PythonDebugger.java:177)
09:44:26 [2020-12-01T14:44:26.378Z] 	at jdk.internal.reflect.GeneratedMethodAccessor19.invoke(Unknown Source)
09:44:26 [2020-12-01T14:44:26.378Z] 	at java.base/jdk.internal.reflect.DelegatingMethodAccessorImpl.invoke(DelegatingMethodAccessorImpl.java:43)
09:44:26 [2020-12-01T14:44:26.378Z] 	at java.base/java.lang.reflect.Method.invoke(Method.java:566)
09:44:26 [2020-12-01T14:44:26.378Z] 	at py4j.reflection.MethodInvoker.invoke(MethodInvoker.java:244)
09:44:26 [2020-12-01T14:44:26.378Z] 	at py4j.reflection.ReflectionEngine.invoke(ReflectionEngine.java:357)
09:44:26 [2020-12-01T14:44:26.378Z] 	at py4j.Gateway.invoke(Gateway.java:282)
09:44:26 [2020-12-01T14:44:26.378Z] 	at py4j.commands.AbstractCommand.invokeMethod(AbstractCommand.java:132)
09:44:26 [2020-12-01T14:44:26.378Z] 	at py4j.commands.CallCommand.execute(CallCommand.java:79)
09:44:26 [2020-12-01T14:44:26.378Z] 	at py4j.ClientServerConnection.sendCommand(ClientServerConnection.java:244)
09:44:26 [2020-12-01T14:44:26.378Z] 	at py4j.CallbackClient.sendCommand(CallbackClient.java:384)
09:44:26 [2020-12-01T14:44:26.378Z] 	at py4j.CallbackClient.sendCommand(CallbackClient.java:356)
09:44:26 [2020-12-01T14:44:26.378Z] 	at py4j.reflection.PythonProxyHandler.invoke(PythonProxyHandler.java:106)
09:44:26 [2020-12-01T14:44:26.378Z] 	at com.sun.proxy.$Proxy18.run(Unknown Source)
09:44:26 [2020-12-01T14:44:26.378Z] 	at org.eclipse.ease.lang.python.py4j.internal.Py4jDebugger.execute(Py4jDebugger.java:106)
09:44:26 [2020-12-01T14:44:26.378Z] 	at org.eclipse.ease.lang.python.py4j.internal.Py4jDebuggerEngine.internalExecute(Py4jDebuggerEngine.java:85)
09:44:26 [2020-12-01T14:44:26.378Z] 	at org.eclipse.ease.lang.python.py4j.internal.Py4jScriptEngine.execute(Py4jScriptEngine.java:226)
09:44:26 [2020-12-01T14:44:26.378Z] 	at org.eclipse.ease.AbstractScriptEngine.inject(AbstractScriptEngine.java:224)
09:44:26 [2020-12-01T14:44:26.378Z] 	at org.eclipse.ease.AbstractScriptEngine.run(AbstractScriptEngine.java:274)
09:44:26 [2020-12-01T14:44:26.378Z] 	at org.eclipse.core.internal.jobs.Worker.run(Worker.java:63)
09:44:26 [2020-12-01T14:44:26.378Z] 
09:44:26 [2020-12-01T14:44:26.378Z] 
09:44:26 [2020-12-01T14:44:26.378Z] 	at py4j.Protocol.getReturnValue(Protocol.java:476)
09:44:26 [2020-12-01T14:44:26.378Z] 	at py4j.reflection.PythonProxyHandler.invoke(PythonProxyHandler.java:108)
09:44:26 [2020-12-01T14:44:26.378Z] 	at com.sun.proxy.$Proxy18.run(Unknown Source)
09:44:26 [2020-12-01T14:44:26.378Z] 	at org.eclipse.ease.lang.python.py4j.internal.Py4jDebugger.execute(Py4jDebugger.java:106)
09:44:26 [2020-12-01T14:44:26.378Z] 	at org.eclipse.ease.lang.python.py4j.internal.Py4jDebuggerEngine.internalExecute(Py4jDebuggerEngine.java:85)
09:44:26 [2020-12-01T14:44:26.378Z] 	at org.eclipse.ease.lang.python.py4j.internal.Py4jScriptEngine.execute(Py4jScriptEngine.java:226)
09:44:26 [2020-12-01T14:44:26.378Z] 	at org.eclipse.ease.AbstractScriptEngine.inject(AbstractScriptEngine.java:224)
09:44:26 [2020-12-01T14:44:26.378Z] 	at org.eclipse.ease.AbstractScriptEngine.run(AbstractScriptEngine.java:274)
09:44:26 [2020-12-01T14:44:26.378Z] 	at org.eclipse.core.internal.jobs.Worker.run(Worker.java:63)
09:44:26 [2020-12-01T14:44:26.634Z] Start of script
09:44:26 [2020-12-01T14:44:26.634Z] include file start
09:44:26 [2020-12-01T14:44:26.634Z] include file processed
09:44:26 [2020-12-01T14:44:26.634Z] Result of testMethod = 5
09:44:26 [2020-12-01T14:44:26.634Z] End of script
09:44:26 [2020-12-01T14:44:26.890Z] Start of script
09:44:26 [2020-12-01T14:44:26.890Z] include file start
09:44:26 [2020-12-01T14:44:26.890Z] include file processed
09:44:26 [2020-12-01T14:44:26.890Z] Result of testMethod = 5
09:44:26 [2020-12-01T14:44:26.890Z] End of script
09:44:27 [2020-12-01T14:44:27.146Z] py4j.Py4JException: An exception was raised by the Python Proxy. Return Message: Traceback (most recent call last):
09:44:27 [2020-12-01T14:44:27.146Z]   File "/home/jenkins/agent/workspace/ease.verify.core.target.2019-06/tests/org.eclipse.ease.lang.python.py4j.test/target/work/plugins/py4j-python_0.10.8.1-bnd-2odeag/src/py4j/clientserver.py", line 581, in _call_proxy
09:44:27 [2020-12-01T14:44:27.146Z]     return_value = getattr(self.pool[obj_id], method)(*params)
09:44:27 [2020-12-01T14:44:27.146Z]   File "<...>", line 424, in run
09:44:27 [2020-12-01T14:44:27.146Z]   File "/usr/lib64/python2.7/bdb.py", line 400, in run
09:44:27 [2020-12-01T14:44:27.146Z]     exec cmd in globals, locals
09:44:27 [2020-12-01T14:44:27.146Z]   File "__ref_L/Debug Test/Main.py_uozehlfsnk", line 1, in <module>
09:44:27 [2020-12-01T14:44:27.146Z]   File "__ref_L/Debug Test/Main.py_uozehlfsnk", line 1, in <module>
09:44:27 [2020-12-01T14:44:27.146Z]   File "<...>", line 231, in trace_dispatch
09:44:27 [2020-12-01T14:44:27.146Z]   File "/usr/lib64/python2.7/bdb.py", line 49, in trace_dispatch
09:44:27 [2020-12-01T14:44:27.146Z]     return self.dispatch_line(frame)
09:44:27 [2020-12-01T14:44:27.146Z]   File "/usr/lib64/python2.7/bdb.py", line 67, in dispatch_line
09:44:27 [2020-12-01T14:44:27.146Z]     self.user_line(frame)
09:44:27 [2020-12-01T14:44:27.146Z]   File "<...>", line 241, in user_line
09:44:27 [2020-12-01T14:44:27.146Z]   File "<...>", line 296, in dispatch
09:44:27 [2020-12-01T14:44:27.146Z]   File "/home/jenkins/agent/workspace/ease.verify.core.target.2019-06/tests/org.eclipse.ease.lang.python.py4j.test/target/work/plugins/py4j-python_0.10.8.1-bnd-2odeag/src/py4j/java_gateway.py", line 1286, in __call__
09:44:27 [2020-12-01T14:44:27.146Z]     answer, self.gateway_client, self.target_id, self.name)
09:44:27 [2020-12-01T14:44:27.146Z]   File "/home/jenkins/agent/workspace/ease.verify.core.target.2019-06/tests/org.eclipse.ease.lang.python.py4j.test/target/work/plugins/py4j-python_0.10.8.1-bnd-2odeag/src/py4j/protocol.py", line 328, in get_return_value
09:44:27 [2020-12-01T14:44:27.146Z]     format(target_id, ".", name), value)
09:44:27 [2020-12-01T14:44:27.146Z] Py4JJavaError: An error occurred while calling o0.traceDispatch.
09:44:27 [2020-12-01T14:44:27.146Z] : org.eclipse.ease.ExitException: 
09:44:27 [2020-12-01T14:44:27.146Z] 	at org.eclipse.ease.debugging.AbstractEaseDebugger.handleEventsInSuspendedState(AbstractEaseDebugger.java:329)
09:44:27 [2020-12-01T14:44:27.146Z] 	at org.eclipse.ease.debugging.AbstractEaseDebugger.suspend(AbstractEaseDebugger.java:255)
09:44:27 [2020-12-01T14:44:27.146Z] 	at org.eclipse.ease.lang.python.py4j.internal.Py4jDebugger.suspend(Py4jDebugger.java:87)
09:44:27 [2020-12-01T14:44:27.146Z] 	at org.eclipse.ease.debugging.AbstractEaseDebugger.processLine(AbstractEaseDebugger.java:490)
09:44:27 [2020-12-01T14:44:27.146Z] 	at org.eclipse.ease.lang.python.debugger.PythonDebugger.traceDispatch(PythonDebugger.java:177)
09:44:27 [2020-12-01T14:44:27.146Z] 	at jdk.internal.reflect.GeneratedMethodAccessor19.invoke(Unknown Source)
09:44:27 [2020-12-01T14:44:27.147Z] 	at java.base/jdk.internal.reflect.DelegatingMethodAccessorImpl.invoke(DelegatingMethodAccessorImpl.java:43)
09:44:27 [2020-12-01T14:44:27.147Z] 	at java.base/java.lang.reflect.Method.invoke(Method.java:566)
09:44:27 [2020-12-01T14:44:27.147Z] 	at py4j.reflection.MethodInvoker.invoke(MethodInvoker.java:244)
09:44:27 [2020-12-01T14:44:27.147Z] 	at py4j.reflection.ReflectionEngine.invoke(ReflectionEngine.java:357)
09:44:27 [2020-12-01T14:44:27.147Z] 	at py4j.Gateway.invoke(Gateway.java:282)
09:44:27 [2020-12-01T14:44:27.147Z] 	at py4j.commands.AbstractCommand.invokeMethod(AbstractCommand.java:132)
09:44:27 [2020-12-01T14:44:27.147Z] 	at py4j.commands.CallCommand.execute(CallCommand.java:79)
09:44:27 [2020-12-01T14:44:27.147Z] 	at py4j.ClientServerConnection.sendCommand(ClientServerConnection.java:244)
09:44:27 [2020-12-01T14:44:27.147Z] 	at py4j.CallbackClient.sendCommand(CallbackClient.java:384)
09:44:27 [2020-12-01T14:44:27.147Z] 	at py4j.CallbackClient.sendCommand(CallbackClient.java:356)
09:44:27 [2020-12-01T14:44:27.147Z] 	at py4j.reflection.PythonProxyHandler.invoke(PythonProxyHandler.java:106)
09:44:27 [2020-12-01T14:44:27.147Z] 	at com.sun.proxy.$Proxy18.run(Unknown Source)
09:44:27 [2020-12-01T14:44:27.147Z] 	at org.eclipse.ease.lang.python.py4j.internal.Py4jDebugger.execute(Py4jDebugger.java:106)
09:44:27 [2020-12-01T14:44:27.147Z] 	at org.eclipse.ease.lang.python.py4j.internal.Py4jDebuggerEngine.internalExecute(Py4jDebuggerEngine.java:85)
09:44:27 [2020-12-01T14:44:27.147Z] 	at org.eclipse.ease.lang.python.py4j.internal.Py4jScriptEngine.execute(Py4jScriptEngine.java:226)
09:44:27 [2020-12-01T14:44:27.147Z] 	at org.eclipse.ease.AbstractScriptEngine.inject(AbstractScriptEngine.java:224)
09:44:27 [2020-12-01T14:44:27.147Z] 	at org.eclipse.ease.AbstractScriptEngine.run(AbstractScriptEngine.java:274)
09:44:27 [2020-12-01T14:44:27.147Z] 	at org.eclipse.core.internal.jobs.Worker.run(Worker.java:63)
09:44:27 [2020-12-01T14:44:27.147Z] 
09:44:27 [2020-12-01T14:44:27.147Z] 
09:44:27 [2020-12-01T14:44:27.147Z] 	at py4j.Protocol.getReturnValue(Protocol.java:476)
09:44:27 [2020-12-01T14:44:27.147Z] 	at py4j.reflection.PythonProxyHandler.invoke(PythonProxyHandler.java:108)
09:44:27 [2020-12-01T14:44:27.147Z] 	at com.sun.proxy.$Proxy18.run(Unknown Source)
09:44:27 [2020-12-01T14:44:27.147Z] 	at org.eclipse.ease.lang.python.py4j.internal.Py4jDebugger.execute(Py4jDebugger.java:106)
09:44:27 [2020-12-01T14:44:27.147Z] 	at org.eclipse.ease.lang.python.py4j.internal.Py4jDebuggerEngine.internalExecute(Py4jDebuggerEngine.java:85)
09:44:27 [2020-12-01T14:44:27.147Z] 	at org.eclipse.ease.lang.python.py4j.internal.Py4jScriptEngine.execute(Py4jScriptEngine.java:226)
09:44:27 [2020-12-01T14:44:27.147Z] 	at org.eclipse.ease.AbstractScriptEngine.inject(AbstractScriptEngine.java:224)
09:44:27 [2020-12-01T14:44:27.147Z] 	at org.eclipse.ease.AbstractScriptEngine.run(AbstractScriptEngine.java:274)
09:44:27 [2020-12-01T14:44:27.147Z] 	at org.eclipse.core.internal.jobs.Worker.run(Worker.java:63)
09:44:27 [2020-12-01T14:44:27.403Z] Start of script
09:44:27 [2020-12-01T14:44:27.403Z] include file start
09:44:27 [2020-12-01T14:44:27.403Z] include file processed
09:44:27 [2020-12-01T14:44:27.403Z] Result of testMethod = 5
09:44:27 [2020-12-01T14:44:27.403Z] End of script
09:44:27 [2020-12-01T14:44:27.659Z] Start of script
09:44:27 [2020-12-01T14:44:27.659Z] include file start
09:44:27 [2020-12-01T14:44:27.659Z] include file processed
09:44:27 [2020-12-01T14:44:27.659Z] Result of testMethod = 5
09:44:27 [2020-12-01T14:44:27.659Z] End of script
09:44:27 [2020-12-01T14:44:27.914Z] Start of script
09:44:27 [2020-12-01T14:44:27.914Z] include file start
09:44:27 [2020-12-01T14:44:27.914Z] include file processed
09:44:27 [2020-12-01T14:44:27.914Z] Result of testMethod = 5
09:44:27 [2020-12-01T14:44:27.914Z] End of script
09:44:28 [2020-12-01T14:44:28.170Z] Start of script
09:44:28 [2020-12-01T14:44:28.170Z] include file start
09:44:28 [2020-12-01T14:44:28.170Z] include file processed
09:44:28 [2020-12-01T14:44:28.170Z] Result of testMethod = 5
09:44:28 [2020-12-01T14:44:28.170Z] End of script
09:44:28 [2020-12-01T14:44:28.426Z] Start of script
09:44:28 [2020-12-01T14:44:28.426Z] include file start
09:44:28 [2020-12-01T14:44:28.426Z] include file processed
09:44:28 [2020-12-01T14:44:28.426Z] Result of testMethod = 5
09:44:28 [2020-12-01T14:44:28.426Z] End of script
09:44:28 [2020-12-01T14:44:28.681Z] Start of script
09:44:28 [2020-12-01T14:44:28.681Z] include file start
09:44:28 [2020-12-01T14:44:28.681Z] include file processed
09:44:28 [2020-12-01T14:44:28.937Z] py4j.Py4JException: An exception was raised by the Python Proxy. Return Message: Traceback (most recent call last):
09:44:28 [2020-12-01T14:44:28.937Z]   File "/home/jenkins/agent/workspace/ease.verify.core.target.2019-06/tests/org.eclipse.ease.lang.python.py4j.test/target/work/plugins/py4j-python_0.10.8.1-bnd-2odeag/src/py4j/clientserver.py", line 581, in _call_proxy
09:44:28 [2020-12-01T14:44:28.937Z]     return_value = getattr(self.pool[obj_id], method)(*params)
09:44:28 [2020-12-01T14:44:28.937Z]   File "<...>", line 424, in run
09:44:28 [2020-12-01T14:44:28.937Z]   File "/usr/lib64/python2.7/bdb.py", line 400, in run
09:44:28 [2020-12-01T14:44:28.937Z]     exec cmd in globals, locals
09:44:28 [2020-12-01T14:44:28.937Z]   File "__ref_L/Debug Test/Main.py_dbcezgglde", line 21, in <module>
09:44:28 [2020-12-01T14:44:28.937Z]   File "__ref_L/Debug Test/Main.py_dbcezgglde", line 18, in testMethod
09:44:28 [2020-12-01T14:44:28.937Z]   File "__ref_L/Debug Test/Main.py_dbcezgglde", line 18, in testMethod
09:44:28 [2020-12-01T14:44:28.937Z]   File "<...>", line 231, in trace_dispatch
09:44:28 [2020-12-01T14:44:28.937Z]   File "/usr/lib64/python2.7/bdb.py", line 49, in trace_dispatch
09:44:28 [2020-12-01T14:44:28.937Z]     return self.dispatch_line(frame)
09:44:28 [2020-12-01T14:44:28.937Z]   File "/usr/lib64/python2.7/bdb.py", line 67, in dispatch_line
09:44:28 [2020-12-01T14:44:28.937Z]     self.user_line(frame)
09:44:28 [2020-12-01T14:44:28.937Z]   File "<...>", line 241, in user_line
09:44:28 [2020-12-01T14:44:28.937Z]   File "<...>", line 296, in dispatch
09:44:28 [2020-12-01T14:44:28.937Z]   File "/home/jenkins/agent/workspace/ease.verify.core.target.2019-06/tests/org.eclipse.ease.lang.python.py4j.test/target/work/plugins/py4j-python_0.10.8.1-bnd-2odeag/src/py4j/java_gateway.py", line 1286, in __call__
09:44:28 [2020-12-01T14:44:28.937Z]     answer, self.gateway_client, self.target_id, self.name)
09:44:28 [2020-12-01T14:44:28.937Z]   File "/home/jenkins/agent/workspace/ease.verify.core.target.2019-06/tests/org.eclipse.ease.lang.python.py4j.test/target/work/plugins/py4j-python_0.10.8.1-bnd-2odeag/src/py4j/protocol.py", line 328, in get_return_value
09:44:28 [2020-12-01T14:44:28.937Z]     format(target_id, ".", name), value)
09:44:28 [2020-12-01T14:44:28.937Z] Py4JJavaError: An error occurred while calling o0.traceDispatch.
09:44:28 [2020-12-01T14:44:28.937Z] : org.eclipse.ease.ExitException: 
09:44:28 [2020-12-01T14:44:28.937Z] 	at org.eclipse.ease.debugging.AbstractEaseDebugger.handleEventsInSuspendedState(AbstractEaseDebugger.java:329)
09:44:28 [2020-12-01T14:44:28.937Z] 	at org.eclipse.ease.debugging.AbstractEaseDebugger.suspend(AbstractEaseDebugger.java:255)
09:44:28 [2020-12-01T14:44:28.937Z] 	at org.eclipse.ease.lang.python.py4j.internal.Py4jDebugger.suspend(Py4jDebugger.java:87)
09:44:28 [2020-12-01T14:44:28.937Z] 	at org.eclipse.ease.debugging.AbstractEaseDebugger.processLine(AbstractEaseDebugger.java:490)
09:44:28 [2020-12-01T14:44:28.937Z] 	at org.eclipse.ease.lang.python.debugger.PythonDebugger.traceDispatch(PythonDebugger.java:177)
09:44:28 [2020-12-01T14:44:28.937Z] 	at jdk.internal.reflect.GeneratedMethodAccessor19.invoke(Unknown Source)
09:44:28 [2020-12-01T14:44:28.937Z] 	at java.base/jdk.internal.reflect.DelegatingMethodAccessorImpl.invoke(DelegatingMethodAccessorImpl.java:43)
09:44:28 [2020-12-01T14:44:28.937Z] 	at java.base/java.lang.reflect.Method.invoke(Method.java:566)
09:44:28 [2020-12-01T14:44:28.937Z] 	at py4j.reflection.MethodInvoker.invoke(MethodInvoker.java:244)
09:44:28 [2020-12-01T14:44:28.937Z] 	at py4j.reflection.ReflectionEngine.invoke(ReflectionEngine.java:357)
09:44:28 [2020-12-01T14:44:28.937Z] 	at py4j.Gateway.invoke(Gateway.java:282)
09:44:28 [2020-12-01T14:44:28.937Z] 	at py4j.commands.AbstractCommand.invokeMethod(AbstractCommand.java:132)
09:44:28 [2020-12-01T14:44:28.937Z] 	at py4j.commands.CallCommand.execute(CallCommand.java:79)
09:44:28 [2020-12-01T14:44:28.937Z] 	at py4j.ClientServerConnection.sendCommand(ClientServerConnection.java:244)
09:44:28 [2020-12-01T14:44:28.937Z] 	at py4j.CallbackClient.sendCommand(CallbackClient.java:384)
09:44:28 [2020-12-01T14:44:28.937Z] 	at py4j.CallbackClient.sendCommand(CallbackClient.java:356)
09:44:28 [2020-12-01T14:44:28.937Z] 	at py4j.reflection.PythonProxyHandler.invoke(PythonProxyHandler.java:106)
09:44:28 [2020-12-01T14:44:28.938Z] 	at com.sun.proxy.$Proxy18.run(Unknown Source)
09:44:28 [2020-12-01T14:44:28.938Z] 	at org.eclipse.ease.lang.python.py4j.internal.Py4jDebugger.execute(Py4jDebugger.java:106)
09:44:28 [2020-12-01T14:44:28.938Z] 	at org.eclipse.ease.lang.python.py4j.internal.Py4jDebuggerEngine.internalExecute(Py4jDebuggerEngine.java:85)
09:44:28 [2020-12-01T14:44:28.938Z] 	at org.eclipse.ease.lang.python.py4j.internal.Py4jScriptEngine.execute(Py4jScriptEngine.java:226)
09:44:28 [2020-12-01T14:44:28.938Z] 	at org.eclipse.ease.AbstractScriptEngine.inject(AbstractScriptEngine.java:224)
09:44:28 [2020-12-01T14:44:28.938Z] 	at org.eclipse.ease.AbstractScriptEngine.run(AbstractScriptEngine.java:274)
09:44:28 [2020-12-01T14:44:28.938Z] 	at org.eclipse.core.internal.jobs.Worker.run(Worker.java:63)
09:44:28 [2020-12-01T14:44:28.938Z] 
09:44:28 [2020-12-01T14:44:28.938Z] 
09:44:28 [2020-12-01T14:44:28.938Z] 	at py4j.Protocol.getReturnValue(Protocol.java:476)
09:44:28 [2020-12-01T14:44:28.938Z] 	at py4j.reflection.PythonProxyHandler.invoke(PythonProxyHandler.java:108)
09:44:28 [2020-12-01T14:44:28.938Z] 	at com.sun.proxy.$Proxy18.run(Unknown Source)
09:44:28 [2020-12-01T14:44:28.938Z] 	at org.eclipse.ease.lang.python.py4j.internal.Py4jDebugger.execute(Py4jDebugger.java:106)
09:44:28 [2020-12-01T14:44:28.938Z] 	at org.eclipse.ease.lang.python.py4j.internal.Py4jDebuggerEngine.internalExecute(Py4jDebuggerEngine.java:85)
09:44:28 [2020-12-01T14:44:28.938Z] 	at org.eclipse.ease.lang.python.py4j.internal.Py4jScriptEngine.execute(Py4jScriptEngine.java:226)
09:44:28 [2020-12-01T14:44:28.938Z] 	at org.eclipse.ease.AbstractScriptEngine.inject(AbstractScriptEngine.java:224)
09:44:28 [2020-12-01T14:44:28.938Z] 	at org.eclipse.ease.AbstractScriptEngine.run(AbstractScriptEngine.java:274)
09:44:28 [2020-12-01T14:44:28.938Z] 	at org.eclipse.core.internal.jobs.Worker.run(Worker.java:63)
09:44:28 [2020-12-01T14:44:28.938Z] Start of script
09:44:28 [2020-12-01T14:44:28.938Z] include file start
09:44:28 [2020-12-01T14:44:28.938Z] include file processed
09:44:28 [2020-12-01T14:44:28.938Z] Result of testMethod = 5
09:44:29 [2020-12-01T14:44:29.193Z] py4j.Py4JException: An exception was raised by the Python Proxy. Return Message: Traceback (most recent call last):
09:44:29 [2020-12-01T14:44:29.194Z]   File "/home/jenkins/agent/workspace/ease.verify.core.target.2019-06/tests/org.eclipse.ease.lang.python.py4j.test/target/work/plugins/py4j-python_0.10.8.1-bnd-2odeag/src/py4j/clientserver.py", line 581, in _call_proxy
09:44:29 [2020-12-01T14:44:29.194Z]     return_value = getattr(self.pool[obj_id], method)(*params)
09:44:29 [2020-12-01T14:44:29.194Z]   File "<...>", line 424, in run
09:44:29 [2020-12-01T14:44:29.194Z]   File "/usr/lib64/python2.7/bdb.py", line 400, in run
09:44:29 [2020-12-01T14:44:29.194Z]     exec cmd in globals, locals
09:44:29 [2020-12-01T14:44:29.194Z]   File "__ref_L/Debug Test/Main.py_vkbishchyw", line 23, in <module>
09:44:29 [2020-12-01T14:44:29.194Z]   File "__ref_L/Debug Test/Main.py_vkbishchyw", line 23, in <module>
09:44:29 [2020-12-01T14:44:29.194Z]   File "<...>", line 231, in trace_dispatch
09:44:29 [2020-12-01T14:44:29.194Z]   File "/usr/lib64/python2.7/bdb.py", line 49, in trace_dispatch
09:44:29 [2020-12-01T14:44:29.194Z]     return self.dispatch_line(frame)
09:44:29 [2020-12-01T14:44:29.194Z]   File "/usr/lib64/python2.7/bdb.py", line 67, in dispatch_line
09:44:29 [2020-12-01T14:44:29.194Z]     self.user_line(frame)
09:44:29 [2020-12-01T14:44:29.194Z]   File "<...>", line 241, in user_line
09:44:29 [2020-12-01T14:44:29.194Z]   File "<...>", line 296, in dispatch
09:44:29 [2020-12-01T14:44:29.194Z]   File "/home/jenkins/agent/workspace/ease.verify.core.target.2019-06/tests/org.eclipse.ease.lang.python.py4j.test/target/work/plugins/py4j-python_0.10.8.1-bnd-2odeag/src/py4j/java_gateway.py", line 1286, in __call__
09:44:29 [2020-12-01T14:44:29.194Z]     answer, self.gateway_client, self.target_id, self.name)
09:44:29 [2020-12-01T14:44:29.194Z]   File "/home/jenkins/agent/workspace/ease.verify.core.target.2019-06/tests/org.eclipse.ease.lang.python.py4j.test/target/work/plugins/py4j-python_0.10.8.1-bnd-2odeag/src/py4j/protocol.py", line 328, in get_return_value
09:44:29 [2020-12-01T14:44:29.194Z]     format(target_id, ".", name), value)
09:44:29 [2020-12-01T14:44:29.194Z] Py4JJavaError: An error occurred while calling o0.traceDispatch.
09:44:29 [2020-12-01T14:44:29.194Z] : org.eclipse.ease.ExitException: 
09:44:29 [2020-12-01T14:44:29.194Z] 	at org.eclipse.ease.debugging.AbstractEaseDebugger.handleEventsInSuspendedState(AbstractEaseDebugger.java:329)
09:44:29 [2020-12-01T14:44:29.194Z] 	at org.eclipse.ease.debugging.AbstractEaseDebugger.suspend(AbstractEaseDebugger.java:255)
09:44:29 [2020-12-01T14:44:29.194Z] 	at org.eclipse.ease.lang.python.py4j.internal.Py4jDebugger.suspend(Py4jDebugger.java:87)
09:44:29 [2020-12-01T14:44:29.194Z] 	at org.eclipse.ease.debugging.AbstractEaseDebugger.processLine(AbstractEaseDebugger.java:490)
09:44:29 [2020-12-01T14:44:29.194Z] 	at org.eclipse.ease.lang.python.debugger.PythonDebugger.traceDispatch(PythonDebugger.java:177)
09:44:29 [2020-12-01T14:44:29.194Z] 	at jdk.internal.reflect.GeneratedMethodAccessor19.invoke(Unknown Source)
09:44:29 [2020-12-01T14:44:29.194Z] 	at java.base/jdk.internal.reflect.DelegatingMethodAccessorImpl.invoke(DelegatingMethodAccessorImpl.java:43)
09:44:29 [2020-12-01T14:44:29.194Z] 	at java.base/java.lang.reflect.Method.invoke(Method.java:566)
09:44:29 [2020-12-01T14:44:29.194Z] 	at py4j.reflection.MethodInvoker.invoke(MethodInvoker.java:244)
09:44:29 [2020-12-01T14:44:29.194Z] 	at py4j.reflection.ReflectionEngine.invoke(ReflectionEngine.java:357)
09:44:29 [2020-12-01T14:44:29.194Z] 	at py4j.Gateway.invoke(Gateway.java:282)
09:44:29 [2020-12-01T14:44:29.194Z] 	at py4j.commands.AbstractCommand.invokeMethod(AbstractCommand.java:132)
09:44:29 [2020-12-01T14:44:29.194Z] 	at py4j.commands.CallCommand.execute(CallCommand.java:79)
09:44:29 [2020-12-01T14:44:29.194Z] 	at py4j.ClientServerConnection.sendCommand(ClientServerConnection.java:244)
09:44:29 [2020-12-01T14:44:29.194Z] 	at py4j.CallbackClient.sendCommand(CallbackClient.java:384)
09:44:29 [2020-12-01T14:44:29.194Z] 	at py4j.CallbackClient.sendCommand(CallbackClient.java:356)
09:44:29 [2020-12-01T14:44:29.194Z] 	at py4j.reflection.PythonProxyHandler.invoke(PythonProxyHandler.java:106)
09:44:29 [2020-12-01T14:44:29.194Z] 	at com.sun.proxy.$Proxy18.run(Unknown Source)
09:44:29 [2020-12-01T14:44:29.194Z] 	at org.eclipse.ease.lang.python.py4j.internal.Py4jDebugger.execute(Py4jDebugger.java:106)
09:44:29 [2020-12-01T14:44:29.194Z] 	at org.eclipse.ease.lang.python.py4j.internal.Py4jDebuggerEngine.internalExecute(Py4jDebuggerEngine.java:85)
09:44:29 [2020-12-01T14:44:29.194Z] 	at org.eclipse.ease.lang.python.py4j.internal.Py4jScriptEngine.execute(Py4jScriptEngine.java:226)
09:44:29 [2020-12-01T14:44:29.194Z] 	at org.eclipse.ease.AbstractScriptEngine.inject(AbstractScriptEngine.java:224)
09:44:29 [2020-12-01T14:44:29.194Z] 	at org.eclipse.ease.AbstractScriptEngine.run(AbstractScriptEngine.java:274)
09:44:29 [2020-12-01T14:44:29.194Z] 	at org.eclipse.core.internal.jobs.Worker.run(Worker.java:63)
09:44:29 [2020-12-01T14:44:29.194Z] 
09:44:29 [2020-12-01T14:44:29.194Z] 
09:44:29 [2020-12-01T14:44:29.194Z] 	at py4j.Protocol.getReturnValue(Protocol.java:476)
09:44:29 [2020-12-01T14:44:29.194Z] 	at py4j.reflection.PythonProxyHandler.invoke(PythonProxyHandler.java:108)
09:44:29 [2020-12-01T14:44:29.194Z] 	at com.sun.proxy.$Proxy18.run(Unknown Source)
09:44:29 [2020-12-01T14:44:29.194Z] 	at org.eclipse.ease.lang.python.py4j.internal.Py4jDebugger.execute(Py4jDebugger.java:106)
09:44:29 [2020-12-01T14:44:29.194Z] 	at org.eclipse.ease.lang.python.py4j.internal.Py4jDebuggerEngine.internalExecute(Py4jDebuggerEngine.java:85)
09:44:29 [2020-12-01T14:44:29.194Z] 	at org.eclipse.ease.lang.python.py4j.internal.Py4jScriptEngine.execute(Py4jScriptEngine.java:226)
09:44:29 [2020-12-01T14:44:29.194Z] 	at org.eclipse.ease.AbstractScriptEngine.inject(AbstractScriptEngine.java:224)
09:44:29 [2020-12-01T14:44:29.194Z] 	at org.eclipse.ease.AbstractScriptEngine.run(AbstractScriptEngine.java:274)
09:44:29 [2020-12-01T14:44:29.194Z] 	at org.eclipse.core.internal.jobs.Worker.run(Worker.java:63)
09:44:29 [2020-12-01T14:44:29.450Z] Start of script
09:44:29 [2020-12-01T14:44:29.450Z] include file start
09:44:29 [2020-12-01T14:44:29.450Z] include file processed
09:44:29 [2020-12-01T14:44:29.450Z] Result of testMethod = 5
09:44:29 [2020-12-01T14:44:29.450Z] End of script
09:44:29 [2020-12-01T14:44:29.705Z] Start of script
09:44:29 [2020-12-01T14:44:29.705Z] include file start
09:44:29 [2020-12-01T14:44:29.705Z] include file processed
09:44:29 [2020-12-01T14:44:29.961Z] Result of testMethod = 5
09:44:29 [2020-12-01T14:44:29.961Z] End of script
09:44:29 [2020-12-01T14:44:29.961Z] Start of script
09:44:29 [2020-12-01T14:44:29.961Z] include file start
09:44:29 [2020-12-01T14:44:29.961Z] include file processed
09:44:30 [2020-12-01T14:44:30.217Z] Result of testMethod = 5
09:44:30 [2020-12-01T14:44:30.217Z] End of script
09:44:30 [2020-12-01T14:44:30.472Z] Start of script
09:44:30 [2020-12-01T14:44:30.472Z] include file start
09:44:30 [2020-12-01T14:44:30.472Z] include file processed
09:44:30 [2020-12-01T14:44:30.472Z] Result of testMethod = 5
09:44:30 [2020-12-01T14:44:30.472Z] End of script
09:44:30 [2020-12-01T14:44:30.729Z] Start of script
09:44:30 [2020-12-01T14:44:30.729Z] include file start
09:44:30 [2020-12-01T14:44:30.729Z] include file processed
09:44:30 [2020-12-01T14:44:30.729Z] Result of testMethod = 5
09:44:30 [2020-12-01T14:44:30.986Z] py4j.Py4JException: An exception was raised by the Python Proxy. Return Message: Traceback (most recent call last):
09:44:30 [2020-12-01T14:44:30.986Z]   File "/home/jenkins/agent/workspace/ease.verify.core.target.2019-06/tests/org.eclipse.ease.lang.python.py4j.test/target/work/plugins/py4j-python_0.10.8.1-bnd-2odeag/src/py4j/clientserver.py", line 581, in _call_proxy
09:44:30 [2020-12-01T14:44:30.986Z]     return_value = getattr(self.pool[obj_id], method)(*params)
09:44:30 [2020-12-01T14:44:30.986Z]   File "<...>", line 424, in run
09:44:30 [2020-12-01T14:44:30.986Z]   File "/usr/lib64/python2.7/bdb.py", line 400, in run
09:44:30 [2020-12-01T14:44:30.986Z]     exec cmd in globals, locals
09:44:30 [2020-12-01T14:44:30.986Z]   File "__ref_L/Debug Test/Main.py_axwbldzezk", line 23, in <module>
09:44:30 [2020-12-01T14:44:30.986Z]   File "__ref_L/Debug Test/Main.py_axwbldzezk", line 23, in <module>
09:44:30 [2020-12-01T14:44:30.986Z]   File "<...>", line 231, in trace_dispatch
09:44:30 [2020-12-01T14:44:30.986Z]   File "/usr/lib64/python2.7/bdb.py", line 49, in trace_dispatch
09:44:30 [2020-12-01T14:44:30.986Z]     return self.dispatch_line(frame)
09:44:30 [2020-12-01T14:44:30.986Z]   File "/usr/lib64/python2.7/bdb.py", line 67, in dispatch_line
09:44:30 [2020-12-01T14:44:30.986Z]     self.user_line(frame)
09:44:30 [2020-12-01T14:44:30.986Z]   File "<...>", line 241, in user_line
09:44:30 [2020-12-01T14:44:30.986Z]   File "<...>", line 296, in dispatch
09:44:30 [2020-12-01T14:44:30.986Z]   File "/home/jenkins/agent/workspace/ease.verify.core.target.2019-06/tests/org.eclipse.ease.lang.python.py4j.test/target/work/plugins/py4j-python_0.10.8.1-bnd-2odeag/src/py4j/java_gateway.py", line 1286, in __call__
09:44:30 [2020-12-01T14:44:30.986Z]     answer, self.gateway_client, self.target_id, self.name)
09:44:30 [2020-12-01T14:44:30.986Z]   File "/home/jenkins/agent/workspace/ease.verify.core.target.2019-06/tests/org.eclipse.ease.lang.python.py4j.test/target/work/plugins/py4j-python_0.10.8.1-bnd-2odeag/src/py4j/protocol.py", line 328, in get_return_value
09:44:30 [2020-12-01T14:44:30.986Z]     format(target_id, ".", name), value)
09:44:30 [2020-12-01T14:44:30.986Z] Py4JJavaError: An error occurred while calling o0.traceDispatch.
09:44:30 [2020-12-01T14:44:30.986Z] : org.eclipse.ease.ExitException: 
09:44:30 [2020-12-01T14:44:30.986Z] 	at org.eclipse.ease.debugging.AbstractEaseDebugger.handleEventsInSuspendedState(AbstractEaseDebugger.java:329)
09:44:30 [2020-12-01T14:44:30.986Z] 	at org.eclipse.ease.debugging.AbstractEaseDebugger.suspend(AbstractEaseDebugger.java:255)
09:44:30 [2020-12-01T14:44:30.986Z] 	at org.eclipse.ease.lang.python.py4j.internal.Py4jDebugger.suspend(Py4jDebugger.java:87)
09:44:30 [2020-12-01T14:44:30.986Z] 	at org.eclipse.ease.debugging.AbstractEaseDebugger.processLine(AbstractEaseDebugger.java:490)
09:44:30 [2020-12-01T14:44:30.986Z] 	at org.eclipse.ease.lang.python.debugger.PythonDebugger.traceDispatch(PythonDebugger.java:177)
09:44:30 [2020-12-01T14:44:30.986Z] 	at jdk.internal.reflect.GeneratedMethodAccessor19.invoke(Unknown Source)
09:44:30 [2020-12-01T14:44:30.986Z] 	at java.base/jdk.internal.reflect.DelegatingMethodAccessorImpl.invoke(DelegatingMethodAccessorImpl.java:43)
09:44:30 [2020-12-01T14:44:30.986Z] 	at java.base/java.lang.reflect.Method.invoke(Method.java:566)
09:44:30 [2020-12-01T14:44:30.986Z] 	at py4j.reflection.MethodInvoker.invoke(MethodInvoker.java:244)
09:44:30 [2020-12-01T14:44:30.986Z] 	at py4j.reflection.ReflectionEngine.invoke(ReflectionEngine.java:357)
09:44:30 [2020-12-01T14:44:30.986Z] 	at py4j.Gateway.invoke(Gateway.java:282)
09:44:30 [2020-12-01T14:44:30.986Z] 	at py4j.commands.AbstractCommand.invokeMethod(AbstractCommand.java:132)
09:44:30 [2020-12-01T14:44:30.986Z] 	at py4j.commands.CallCommand.execute(CallCommand.java:79)
09:44:30 [2020-12-01T14:44:30.986Z] 	at py4j.ClientServerConnection.sendCommand(ClientServerConnection.java:244)
09:44:30 [2020-12-01T14:44:30.986Z] 	at py4j.CallbackClient.sendCommand(CallbackClient.java:384)
09:44:30 [2020-12-01T14:44:30.986Z] 	at py4j.CallbackClient.sendCommand(CallbackClient.java:356)
09:44:30 [2020-12-01T14:44:30.986Z] 	at py4j.reflection.PythonProxyHandler.invoke(PythonProxyHandler.java:106)
09:44:30 [2020-12-01T14:44:30.986Z] 	at com.sun.proxy.$Proxy18.run(Unknown Source)
09:44:30 [2020-12-01T14:44:30.986Z] 	at org.eclipse.ease.lang.python.py4j.internal.Py4jDebugger.execute(Py4jDebugger.java:106)
09:44:30 [2020-12-01T14:44:30.986Z] 	at org.eclipse.ease.lang.python.py4j.internal.Py4jDebuggerEngine.internalExecute(Py4jDebuggerEngine.java:85)
09:44:30 [2020-12-01T14:44:30.986Z] 	at org.eclipse.ease.lang.python.py4j.internal.Py4jScriptEngine.execute(Py4jScriptEngine.java:226)
09:44:30 [2020-12-01T14:44:30.986Z] 	at org.eclipse.ease.AbstractScriptEngine.inject(AbstractScriptEngine.java:224)
09:44:30 [2020-12-01T14:44:30.986Z] 	at org.eclipse.ease.AbstractScriptEngine.run(AbstractScriptEngine.java:274)
09:44:30 [2020-12-01T14:44:30.986Z] 	at org.eclipse.core.internal.jobs.Worker.run(Worker.java:63)
09:44:30 [2020-12-01T14:44:30.986Z] 
09:44:30 [2020-12-01T14:44:30.986Z] 
09:44:30 [2020-12-01T14:44:30.986Z] 	at py4j.Protocol.getReturnValue(Protocol.java:476)
09:44:30 [2020-12-01T14:44:30.986Z] 	at py4j.reflection.PythonProxyHandler.invoke(PythonProxyHandler.java:108)
09:44:30 [2020-12-01T14:44:30.986Z] 	at com.sun.proxy.$Proxy18.run(Unknown Source)
09:44:30 [2020-12-01T14:44:30.986Z] 	at org.eclipse.ease.lang.python.py4j.internal.Py4jDebugger.execute(Py4jDebugger.java:106)
09:44:30 [2020-12-01T14:44:30.986Z] 	at org.eclipse.ease.lang.python.py4j.internal.Py4jDebuggerEngine.internalExecute(Py4jDebuggerEngine.java:85)
09:44:30 [2020-12-01T14:44:30.986Z] 	at org.eclipse.ease.lang.python.py4j.internal.Py4jScriptEngine.execute(Py4jScriptEngine.java:226)
09:44:30 [2020-12-01T14:44:30.987Z] 	at org.eclipse.ease.AbstractScriptEngine.inject(AbstractScriptEngine.java:224)
09:44:30 [2020-12-01T14:44:30.987Z] 	at org.eclipse.ease.AbstractScriptEngine.run(AbstractScriptEngine.java:274)
09:44:30 [2020-12-01T14:44:30.987Z] 	at org.eclipse.core.internal.jobs.Worker.run(Worker.java:63)
09:44:30 [2020-12-01T14:44:30.987Z] Start of script
09:44:31 [2020-12-01T14:44:31.243Z] include file start
09:44:31 [2020-12-01T14:44:31.243Z] include file processed
09:44:31 [2020-12-01T14:44:31.243Z] Result of testMethod = 5
09:44:31 [2020-12-01T14:44:31.243Z] End of script
09:44:31 [2020-12-01T14:44:31.498Z] py4j.Py4JException: An exception was raised by the Python Proxy. Return Message: Traceback (most recent call last):
09:44:31 [2020-12-01T14:44:31.498Z]   File "/home/jenkins/agent/workspace/ease.verify.core.target.2019-06/tests/org.eclipse.ease.lang.python.py4j.test/target/work/plugins/py4j-python_0.10.8.1-bnd-2odeag/src/py4j/clientserver.py", line 581, in _call_proxy
09:44:31 [2020-12-01T14:44:31.499Z]     return_value = getattr(self.pool[obj_id], method)(*params)
09:44:31 [2020-12-01T14:44:31.499Z]   File "<...>", line 424, in run
09:44:31 [2020-12-01T14:44:31.499Z]   File "/usr/lib64/python2.7/bdb.py", line 400, in run
09:44:31 [2020-12-01T14:44:31.499Z]     exec cmd in globals, locals
09:44:31 [2020-12-01T14:44:31.499Z]   File "__ref_L/Debug Test/Main.py_vcgwxckqlq", line 1, in <module>
09:44:31 [2020-12-01T14:44:31.499Z]   File "__ref_L/Debug Test/Main.py_vcgwxckqlq", line 1, in <module>
09:44:31 [2020-12-01T14:44:31.499Z]   File "<...>", line 231, in trace_dispatch
09:44:31 [2020-12-01T14:44:31.499Z]   File "/usr/lib64/python2.7/bdb.py", line 49, in trace_dispatch
09:44:31 [2020-12-01T14:44:31.499Z]     return self.dispatch_line(frame)
09:44:31 [2020-12-01T14:44:31.499Z]   File "/usr/lib64/python2.7/bdb.py", line 67, in dispatch_line
09:44:31 [2020-12-01T14:44:31.499Z]     self.user_line(frame)
09:44:31 [2020-12-01T14:44:31.499Z]   File "<...>", line 241, in user_line
09:44:31 [2020-12-01T14:44:31.499Z]   File "<...>", line 296, in dispatch
09:44:31 [2020-12-01T14:44:31.499Z]   File "/home/jenkins/agent/workspace/ease.verify.core.target.2019-06/tests/org.eclipse.ease.lang.python.py4j.test/target/work/plugins/py4j-python_0.10.8.1-bnd-2odeag/src/py4j/java_gateway.py", line 1286, in __call__
09:44:31 [2020-12-01T14:44:31.499Z]     answer, self.gateway_client, self.target_id, self.name)
09:44:31 [2020-12-01T14:44:31.499Z]   File "/home/jenkins/agent/workspace/ease.verify.core.target.2019-06/tests/org.eclipse.ease.lang.python.py4j.test/target/work/plugins/py4j-python_0.10.8.1-bnd-2odeag/src/py4j/protocol.py", line 328, in get_return_value
09:44:31 [2020-12-01T14:44:31.499Z]     format(target_id, ".", name), value)
09:44:31 [2020-12-01T14:44:31.499Z] Py4JJavaError: An error occurred while calling o0.traceDispatch.
09:44:31 [2020-12-01T14:44:31.499Z] : org.eclipse.ease.ExitException: 
09:44:31 [2020-12-01T14:44:31.499Z] 	at org.eclipse.ease.debugging.AbstractEaseDebugger.handleEventsInSuspendedState(AbstractEaseDebugger.java:329)
09:44:31 [2020-12-01T14:44:31.499Z] 	at org.eclipse.ease.debugging.AbstractEaseDebugger.suspend(AbstractEaseDebugger.java:255)
09:44:31 [2020-12-01T14:44:31.499Z] 	at org.eclipse.ease.lang.python.py4j.internal.Py4jDebugger.suspend(Py4jDebugger.java:87)
09:44:31 [2020-12-01T14:44:31.499Z] 	at org.eclipse.ease.debugging.AbstractEaseDebugger.processLine(AbstractEaseDebugger.java:490)
09:44:31 [2020-12-01T14:44:31.499Z] 	at org.eclipse.ease.lang.python.debugger.PythonDebugger.traceDispatch(PythonDebugger.java:177)
09:44:31 [2020-12-01T14:44:31.499Z] 	at jdk.internal.reflect.GeneratedMethodAccessor19.invoke(Unknown Source)
09:44:31 [2020-12-01T14:44:31.499Z] 	at java.base/jdk.internal.reflect.DelegatingMethodAccessorImpl.invoke(DelegatingMethodAccessorImpl.java:43)
09:44:31 [2020-12-01T14:44:31.499Z] 	at java.base/java.lang.reflect.Method.invoke(Method.java:566)
09:44:31 [2020-12-01T14:44:31.499Z] 	at py4j.reflection.MethodInvoker.invoke(MethodInvoker.java:244)
09:44:31 [2020-12-01T14:44:31.499Z] 	at py4j.reflection.ReflectionEngine.invoke(ReflectionEngine.java:357)
09:44:31 [2020-12-01T14:44:31.499Z] 	at py4j.Gateway.invoke(Gateway.java:282)
09:44:31 [2020-12-01T14:44:31.499Z] 	at py4j.commands.AbstractCommand.invokeMethod(AbstractCommand.java:132)
09:44:31 [2020-12-01T14:44:31.499Z] 	at py4j.commands.CallCommand.execute(CallCommand.java:79)
09:44:31 [2020-12-01T14:44:31.499Z] 	at py4j.ClientServerConnection.sendCommand(ClientServerConnection.java:244)
09:44:31 [2020-12-01T14:44:31.499Z] 	at py4j.CallbackClient.sendCommand(CallbackClient.java:384)
09:44:31 [2020-12-01T14:44:31.499Z] 	at py4j.CallbackClient.sendCommand(CallbackClient.java:356)
09:44:31 [2020-12-01T14:44:31.499Z] 	at py4j.reflection.PythonProxyHandler.invoke(PythonProxyHandler.java:106)
09:44:31 [2020-12-01T14:44:31.499Z] 	at com.sun.proxy.$Proxy18.run(Unknown Source)
09:44:31 [2020-12-01T14:44:31.499Z] 	at org.eclipse.ease.lang.python.py4j.internal.Py4jDebugger.execute(Py4jDebugger.java:106)
09:44:31 [2020-12-01T14:44:31.499Z] 	at org.eclipse.ease.lang.python.py4j.internal.Py4jDebuggerEngine.internalExecute(Py4jDebuggerEngine.java:85)
09:44:31 [2020-12-01T14:44:31.499Z] 	at org.eclipse.ease.lang.python.py4j.internal.Py4jScriptEngine.execute(Py4jScriptEngine.java:226)
09:44:31 [2020-12-01T14:44:31.499Z] 	at org.eclipse.ease.AbstractScriptEngine.inject(AbstractScriptEngine.java:224)
09:44:31 [2020-12-01T14:44:31.499Z] 	at org.eclipse.ease.AbstractScriptEngine.run(AbstractScriptEngine.java:274)
09:44:31 [2020-12-01T14:44:31.499Z] 	at org.eclipse.core.internal.jobs.Worker.run(Worker.java:63)
09:44:31 [2020-12-01T14:44:31.499Z] 
09:44:31 [2020-12-01T14:44:31.499Z] 
09:44:31 [2020-12-01T14:44:31.499Z] 	at py4j.Protocol.getReturnValue(Protocol.java:476)
09:44:31 [2020-12-01T14:44:31.499Z] 	at py4j.reflection.PythonProxyHandler.invoke(PythonProxyHandler.java:108)
09:44:31 [2020-12-01T14:44:31.499Z] 	at com.sun.proxy.$Proxy18.run(Unknown Source)
09:44:31 [2020-12-01T14:44:31.499Z] 	at org.eclipse.ease.lang.python.py4j.internal.Py4jDebugger.execute(Py4jDebugger.java:106)
09:44:31 [2020-12-01T14:44:31.499Z] 	at org.eclipse.ease.lang.python.py4j.internal.Py4jDebuggerEngine.internalExecute(Py4jDebuggerEngine.java:85)
09:44:31 [2020-12-01T14:44:31.499Z] 	at org.eclipse.ease.lang.python.py4j.internal.Py4jScriptEngine.execute(Py4jScriptEngine.java:226)
09:44:31 [2020-12-01T14:44:31.499Z] 	at org.eclipse.ease.AbstractScriptEngine.inject(AbstractScriptEngine.java:224)
09:44:31 [2020-12-01T14:44:31.499Z] 	at org.eclipse.ease.AbstractScriptEngine.run(AbstractScriptEngine.java:274)
09:44:31 [2020-12-01T14:44:31.499Z] 	at org.eclipse.core.internal.jobs.Worker.run(Worker.java:63)
09:44:31 [2020-12-01T14:44:31.499Z] Start of script
09:44:31 [2020-12-01T14:44:31.754Z] include file start
09:44:31 [2020-12-01T14:44:31.754Z] include file processed
09:44:31 [2020-12-01T14:44:31.754Z] Result of testMethod = 5
09:44:31 [2020-12-01T14:44:31.754Z] End of script
09:44:31 [2020-12-01T14:44:31.754Z] Start of script
09:44:31 [2020-12-01T14:44:31.754Z] include file start
09:44:31 [2020-12-01T14:44:31.754Z] include file processed
09:44:32 [2020-12-01T14:44:32.010Z] Result of testMethod = 5
09:44:32 [2020-12-01T14:44:32.010Z] End of script
09:44:32 [2020-12-01T14:44:32.267Z] Start of script
09:44:32 [2020-12-01T14:44:32.267Z] include file start
09:44:32 [2020-12-01T14:44:32.267Z] include file processed
09:44:32 [2020-12-01T14:44:32.267Z] Result of testMethod = 5
09:44:32 [2020-12-01T14:44:32.267Z] End of script
09:44:32 [2020-12-01T14:44:32.522Z] Tests run: 42, Failures: 0, Errors: 0, Skipped: 4, Time elapsed: 11.797 s - in org.eclipse.ease.lang.python.py4j.Py4jDebugTest
09:44:32 [2020-12-01T14:44:32.522Z] resumeOnLastIncludeLine(org.eclipse.ease.lang.python.py4j.Py4jDebugTest) skipped
09:44:32 [2020-12-01T14:44:32.522Z] nativeArrayVariable(org.eclipse.ease.lang.python.py4j.Py4jDebugTest) skipped
09:44:32 [2020-12-01T14:44:32.522Z] stepIntoIncludeCommand(org.eclipse.ease.lang.python.py4j.Py4jDebugTest) skipped
09:44:32 [2020-12-01T14:44:32.522Z] nativeObjectVariable(org.eclipse.ease.lang.python.py4j.Py4jDebugTest) skipped
09:44:32 [2020-12-01T14:44:32.522Z] disconnectProcessInSuspendedState(org.eclipse.ease.lang.python.py4j.Py4jDebugTest)  Time elapsed: 0.433 s
09:44:32 [2020-12-01T14:44:32.522Z] stepReturnIncludeCommand(org.eclipse.ease.lang.python.py4j.Py4jDebugTest)  Time elapsed: 0.211 s
09:44:32 [2020-12-01T14:44:32.522Z] arrayVariableSorting(org.eclipse.ease.lang.python.py4j.Py4jDebugTest)  Time elapsed: 0.411 s
09:44:32 [2020-12-01T14:44:32.522Z] stepOverOnDebugTarget(org.eclipse.ease.lang.python.py4j.Py4jDebugTest)  Time elapsed: 0.309 s
09:44:32 [2020-12-01T14:44:32.522Z] hasDebugTarget(org.eclipse.ease.lang.python.py4j.Py4jDebugTest)  Time elapsed: 0.205 s
09:44:32 [2020-12-01T14:44:32.522Z] disconnectThreadInSuspendedState(org.eclipse.ease.lang.python.py4j.Py4jDebugTest)  Time elapsed: 0.207 s
09:44:32 [2020-12-01T14:44:32.523Z] stepReturnOnDebugTarget(org.eclipse.ease.lang.python.py4j.Py4jDebugTest)  Time elapsed: 0.408 s
09:44:32 [2020-12-01T14:44:32.523Z] nullVariable(org.eclipse.ease.lang.python.py4j.Py4jDebugTest)  Time elapsed: 0.307 s
09:44:32 [2020-12-01T14:44:32.523Z] stepOverOnStackFrame(org.eclipse.ease.lang.python.py4j.Py4jDebugTest)  Time elapsed: 0.408 s
09:44:32 [2020-12-01T14:44:32.523Z] resumeOnDebugTarget(org.eclipse.ease.lang.python.py4j.Py4jDebugTest)  Time elapsed: 0.306 s
09:44:32 [2020-12-01T14:44:32.523Z] modifyVariableKeepingType(org.eclipse.ease.lang.python.py4j.Py4jDebugTest)  Time elapsed: 0.506 s
09:44:32 [2020-12-01T14:44:32.523Z] stepReturnOnStackFrame(org.eclipse.ease.lang.python.py4j.Py4jDebugTest)  Time elapsed: 0.406 s
09:44:32 [2020-12-01T14:44:32.523Z] terminateStackFrameInSuspendedState(org.eclipse.ease.lang.python.py4j.Py4jDebugTest)  Time elapsed: 0.308 s
09:44:32 [2020-12-01T14:44:32.523Z] breakpointLocation(org.eclipse.ease.lang.python.py4j.Py4jDebugTest)  Time elapsed: 0.206 s
09:44:32 [2020-12-01T14:44:32.523Z] stepReturnOnThread(org.eclipse.ease.lang.python.py4j.Py4jDebugTest)  Time elapsed: 0.31 s
09:44:32 [2020-12-01T14:44:32.523Z] javaClassVariable(org.eclipse.ease.lang.python.py4j.Py4jDebugTest)  Time elapsed: 0.307 s
09:44:32 [2020-12-01T14:44:32.523Z] stepIntoOnThread(org.eclipse.ease.lang.python.py4j.Py4jDebugTest)  Time elapsed: 0.407 s
09:44:32 [2020-12-01T14:44:32.523Z] terminateThreadInSuspendedState(org.eclipse.ease.lang.python.py4j.Py4jDebugTest)  Time elapsed: 0.206 s
09:44:32 [2020-12-01T14:44:32.523Z] resumeOnThread(org.eclipse.ease.lang.python.py4j.Py4jDebugTest)  Time elapsed: 0.206 s
09:44:32 [2020-12-01T14:44:32.523Z] stepIntoOnStackFrame(org.eclipse.ease.lang.python.py4j.Py4jDebugTest)  Time elapsed: 0.306 s
09:44:32 [2020-12-01T14:44:32.523Z] terminateProcessInSuspendedState(org.eclipse.ease.lang.python.py4j.Py4jDebugTest)  Time elapsed: 0.207 s
09:44:32 [2020-12-01T14:44:32.523Z] stepOverOnProcess(org.eclipse.ease.lang.python.py4j.Py4jDebugTest)  Time elapsed: 0.306 s
09:44:32 [2020-12-01T14:44:32.523Z] disconnectDebugTargetInSuspendedState(org.eclipse.ease.lang.python.py4j.Py4jDebugTest)  Time elapsed: 0.206 s
09:44:32 [2020-12-01T14:44:32.523Z] stepIntoOnProcess(org.eclipse.ease.lang.python.py4j.Py4jDebugTest)  Time elapsed: 0.307 s
09:44:32 [2020-12-01T14:44:32.523Z] terminatedState(org.eclipse.ease.lang.python.py4j.Py4jDebugTest)  Time elapsed: 0.204 s
09:44:32 [2020-12-01T14:44:32.523Z] stepOverIncludeCommand(org.eclipse.ease.lang.python.py4j.Py4jDebugTest)  Time elapsed: 0.305 s
09:44:32 [2020-12-01T14:44:32.523Z] innerScopeVariableBeforeOuterScopeVariable(org.eclipse.ease.lang.python.py4j.Py4jDebugTest)  Time elapsed: 0.405 s
09:44:32 [2020-12-01T14:44:32.523Z] primitiveStringVariable(org.eclipse.ease.lang.python.py4j.Py4jDebugTest)  Time elapsed: 0.306 s
09:44:32 [2020-12-01T14:44:32.523Z] resumeOnProcess(org.eclipse.ease.lang.python.py4j.Py4jDebugTest)  Time elapsed: 0.305 s
09:44:32 [2020-12-01T14:44:32.523Z] stepIntoOnDebugTarget(org.eclipse.ease.lang.python.py4j.Py4jDebugTest)  Time elapsed: 0.406 s
09:44:32 [2020-12-01T14:44:32.523Z] stepOverOnThread(org.eclipse.ease.lang.python.py4j.Py4jDebugTest)  Time elapsed: 0.306 s
09:44:32 [2020-12-01T14:44:32.523Z] suspendedState(org.eclipse.ease.lang.python.py4j.Py4jDebugTest)  Time elapsed: 0.305 s
09:44:32 [2020-12-01T14:44:32.523Z] primitiveDoubleVariable(org.eclipse.ease.lang.python.py4j.Py4jDebugTest)  Time elapsed: 0.406 s
09:44:32 [2020-12-01T14:44:32.523Z] resumeOnStackFrame(org.eclipse.ease.lang.python.py4j.Py4jDebugTest)  Time elapsed: 0.318 s
09:44:32 [2020-12-01T14:44:32.523Z] terminateDebugTargetInSuspendedState(org.eclipse.ease.lang.python.py4j.Py4jDebugTest)  Time elapsed: 0.206 s
09:44:32 [2020-12-01T14:44:32.523Z] disconnectStackFrameInSuspendedState(org.eclipse.ease.lang.python.py4j.Py4jDebugTest)  Time elapsed: 0.205 s
09:44:32 [2020-12-01T14:44:32.523Z] stepReturnOnProcess(org.eclipse.ease.lang.python.py4j.Py4jDebugTest)  Time elapsed: 0.406 s
09:44:32 [2020-12-01T14:44:32.523Z] evaluateWatchExpression(org.eclipse.ease.lang.python.py4j.Py4jDebugTest)  Time elapsed: 0.307 s
09:44:32 [2020-12-01T14:44:32.523Z] Running org.eclipse.ease.lang.python.py4j.Py4JEngineTest
09:44:32 [2020-12-01T14:44:32.523Z] Tests run: 3, Failures: 0, Errors: 0, Skipped: 3, Time elapsed: 0 s - in org.eclipse.ease.lang.python.py4j.Py4JEngineTest
09:44:32 [2020-12-01T14:44:32.523Z] print(org.eclipse.ease.lang.python.py4j.Py4JEngineTest) skipped
09:44:32 [2020-12-01T14:44:32.523Z] mixedMode(org.eclipse.ease.lang.python.py4j.Py4JEngineTest) skipped
09:44:32 [2020-12-01T14:44:32.523Z] cleanShutdown(org.eclipse.ease.lang.python.py4j.Py4JEngineTest) skipped
09:44:32 [2020-12-01T14:44:32.523Z] 
09:44:32 [2020-12-01T14:44:32.523Z] Results:
09:44:32 [2020-12-01T14:44:32.523Z] 
09:44:32 [2020-12-01T14:44:32.523Z] Tests run: 120, Failures: 0, Errors: 0, Skipped: 13
09:44:32 [2020-12-01T14:44:32.523Z] 
09:44:33 [2020-12-01T14:44:33.085Z] [INFO] All tests passed!
09:44:33 [2020-12-01T14:44:33.085Z] [INFO] 
09:44:33 [2020-12-01T14:44:33.085Z] [INFO] -----< org.eclipse.ease:org.eclipse.ease.lang.scriptarchive.test >------
09:44:33 [2020-12-01T14:44:33.085Z] [INFO] Building org.eclipse.ease.lang.scriptarchive.test 0.8.0-SNAPSHOT [10/11]
09:44:33 [2020-12-01T14:44:33.085Z] [INFO] ------------------------[ eclipse-test-plugin ]-------------------------
09:44:33 [2020-12-01T14:44:33.085Z] [INFO] 
09:44:33 [2020-12-01T14:44:33.085Z] [INFO] --- tycho-packaging-plugin:1.5.0:build-qualifier (default-build-qualifier) @ org.eclipse.ease.lang.scriptarchive.test ---
09:44:33 [2020-12-01T14:44:33.085Z] [INFO] The project's OSGi version is 0.8.0.I201910171213
09:44:33 [2020-12-01T14:44:33.085Z] [INFO] 
09:44:33 [2020-12-01T14:44:33.085Z] [INFO] --- tycho-packaging-plugin:1.5.0:validate-id (default-validate-id) @ org.eclipse.ease.lang.scriptarchive.test ---
09:44:33 [2020-12-01T14:44:33.085Z] [INFO] 
09:44:33 [2020-12-01T14:44:33.085Z] [INFO] --- tycho-packaging-plugin:1.5.0:validate-version (default-validate-version) @ org.eclipse.ease.lang.scriptarchive.test ---
09:44:33 [2020-12-01T14:44:33.085Z] [INFO] 
09:44:33 [2020-12-01T14:44:33.085Z] [INFO] --- maven-resources-plugin:2.4.3:resources (default-resources) @ org.eclipse.ease.lang.scriptarchive.test ---
09:44:33 [2020-12-01T14:44:33.085Z] [INFO] Using 'UTF-8' encoding to copy filtered resources.
09:44:33 [2020-12-01T14:44:33.085Z] [INFO] skip non existing resourceDirectory /home/jenkins/agent/workspace/ease.verify.core.target.2019-06/tests/org.eclipse.ease.lang.scriptarchive.test/src/main/resources
09:44:33 [2020-12-01T14:44:33.085Z] [INFO] 
09:44:33 [2020-12-01T14:44:33.085Z] [INFO] --- tycho-compiler-plugin:1.5.0:compile (default-compile) @ org.eclipse.ease.lang.scriptarchive.test ---
09:44:33 [2020-12-01T14:44:33.085Z] [INFO] Nothing to compile - all classes are up to date
09:44:33 [2020-12-01T14:44:33.085Z] [INFO] 
09:44:33 [2020-12-01T14:44:33.085Z] [INFO] --- maven-resources-plugin:2.4.3:testResources (default-testResources) @ org.eclipse.ease.lang.scriptarchive.test ---
09:44:33 [2020-12-01T14:44:33.085Z] [INFO] Using 'UTF-8' encoding to copy filtered resources.
09:44:33 [2020-12-01T14:44:33.085Z] [INFO] skip non existing resourceDirectory /home/jenkins/agent/workspace/ease.verify.core.target.2019-06/tests/org.eclipse.ease.lang.scriptarchive.test/src/test/resources
09:44:33 [2020-12-01T14:44:33.085Z] [INFO] 
09:44:33 [2020-12-01T14:44:33.085Z] [INFO] --- tycho-source-plugin:1.5.0:plugin-source (plugin-source) @ org.eclipse.ease.lang.scriptarchive.test ---
09:44:33 [2020-12-01T14:44:33.085Z] [INFO] Building jar: /home/jenkins/agent/workspace/ease.verify.core.target.2019-06/tests/org.eclipse.ease.lang.scriptarchive.test/target/org.eclipse.ease.lang.scriptarchive.test-0.8.0-SNAPSHOT-sources.jar
09:44:33 [2020-12-01T14:44:33.085Z] [INFO] 
09:44:33 [2020-12-01T14:44:33.085Z] [INFO] --- target-platform-configuration:1.5.0:target-platform (default-target-platform) @ org.eclipse.ease.lang.scriptarchive.test ---
09:44:33 [2020-12-01T14:44:33.085Z] [INFO] 
09:44:33 [2020-12-01T14:44:33.085Z] [INFO] --- tycho-packaging-plugin:1.5.0:package-plugin (default-package-plugin) @ org.eclipse.ease.lang.scriptarchive.test ---
09:44:33 [2020-12-01T14:44:33.085Z] [INFO] Building jar: /home/jenkins/agent/workspace/ease.verify.core.target.2019-06/tests/org.eclipse.ease.lang.scriptarchive.test/target/org.eclipse.ease.lang.scriptarchive.test-0.8.0-SNAPSHOT.jar
09:44:33 [2020-12-01T14:44:33.085Z] [INFO] 
09:44:33 [2020-12-01T14:44:33.086Z] [INFO] --- tycho-p2-plugin:1.5.0:p2-metadata-default (default-p2-metadata-default) @ org.eclipse.ease.lang.scriptarchive.test ---
09:44:33 [2020-12-01T14:44:33.086Z] [INFO] 
09:44:33 [2020-12-01T14:44:33.086Z] [INFO] --- tycho-source-feature-plugin:1.5.0:source-feature (source-feature) @ org.eclipse.ease.lang.scriptarchive.test ---
09:44:33 [2020-12-01T14:44:33.086Z] [INFO] 
09:44:33 [2020-12-01T14:44:33.086Z] [INFO] --- tycho-p2-plugin:1.5.0:p2-metadata (attached-p2-metadata) @ org.eclipse.ease.lang.scriptarchive.test ---
09:44:33 [2020-12-01T14:44:33.086Z] [INFO] 
09:44:33 [2020-12-01T14:44:33.086Z] [INFO] --- tycho-surefire-plugin:1.5.0:test (default-test) @ org.eclipse.ease.lang.scriptarchive.test ---
09:44:33 [2020-12-01T14:44:33.086Z] [INFO] Expected eclipse log file: /home/jenkins/agent/workspace/ease.verify.core.target.2019-06/tests/org.eclipse.ease.lang.scriptarchive.test/target/work/data/.metadata/.log
09:44:33 [2020-12-01T14:44:33.086Z] [INFO] Command line:
09:44:33 [2020-12-01T14:44:33.086Z] 	[/opt/tools/java/openjdk/jdk-11/11.0.2+9/bin/java, -Dosgi.noShutdown=false, -Dosgi.os=linux, -Dosgi.ws=gtk, -Dosgi.arch=x86_64, -Dosgi.clean=true, -jar, /home/jenkins/.m2/repository/p2/osgi/bundle/org.eclipse.equinox.launcher/1.5.400.v20190515-0925/org.eclipse.equinox.launcher-1.5.400.v20190515-0925.jar, -data, /home/jenkins/agent/workspace/ease.verify.core.target.2019-06/tests/org.eclipse.ease.lang.scriptarchive.test/target/work/data, -install, /home/jenkins/agent/workspace/ease.verify.core.target.2019-06/tests/org.eclipse.ease.lang.scriptarchive.test/target/work, -configuration, /home/jenkins/agent/workspace/ease.verify.core.target.2019-06/tests/org.eclipse.ease.lang.scriptarchive.test/target/work/configuration, -application, org.eclipse.tycho.surefire.osgibooter.headlesstest, -testproperties, /home/jenkins/agent/workspace/ease.verify.core.target.2019-06/tests/org.eclipse.ease.lang.scriptarchive.test/target/surefire.properties]
09:44:33 [2020-12-01T14:44:33.086Z] Picked up JAVA_TOOL_OPTIONS: -Dmaven.ext.class.path="/home/jenkins/agent/workspace/ease.verify.core.target.2019-06@tmp/withMaven6b223a92/pipeline-maven-spy.jar" -Dorg.jenkinsci.plugins.pipeline.maven.reportsFolder="/home/jenkins/agent/workspace/ease.verify.core.target.2019-06@tmp/withMaven6b223a92" 
09:44:35 [2020-12-01T14:44:35.048Z] Running org.eclipse.ease.lang.scriptarchive.ArchiveEngineTest
09:44:35 [2020-12-01T14:44:35.305Z] We are running from a zip file!
09:44:35 [2020-12-01T14:44:35.305Z] org.eclipse.ease.ScriptExecutionException: SyntaxError: missing ; before statement (workspace://__EASE_ScriptArchive_1/scripts/Master.js#3)
09:44:35 [2020-12-01T14:44:35.305Z] this is an error
09:44:35 [2020-12-01T14:44:35.305Z]        ^
09:44:35 [2020-12-01T14:44:35.305Z] 	at Master.js,workspace://__EASE_ScriptArchive_1/scripts/Master.js
09:44:35 [2020-12-01T14:44:35.305Z] org.eclipse.ease.ScriptExecutionException: SyntaxError: missing ; before statement (workspace://__EASE_ScriptArchive_1/scripts/Master.js#3)
09:44:35 [2020-12-01T14:44:35.305Z] this is an error
09:44:35 [2020-12-01T14:44:35.305Z]        ^
09:44:35 [2020-12-01T14:44:35.305Z] 	at Master.js,workspace://__EASE_ScriptArchive_1/scripts/Master.js
09:44:35 [2020-12-01T14:44:35.305Z] Tests run: 7, Failures: 0, Errors: 0, Skipped: 0, Time elapsed: 0.486 s - in org.eclipse.ease.lang.scriptarchive.ArchiveEngineTest
09:44:35 [2020-12-01T14:44:35.305Z] executeWithManifest(org.eclipse.ease.lang.scriptarchive.ArchiveEngineTest)  Time elapsed: 0.307 s
09:44:35 [2020-12-01T14:44:35.305Z] zipFileRegistration(org.eclipse.ease.lang.scriptarchive.ArchiveEngineTest)  Time elapsed: 0.005 s
09:44:35 [2020-12-01T14:44:35.305Z] engineIdRegistration(org.eclipse.ease.lang.scriptarchive.ArchiveEngineTest)  Time elapsed: 0 s
09:44:35 [2020-12-01T14:44:35.305Z] jarFileRegistration(org.eclipse.ease.lang.scriptarchive.ArchiveEngineTest)  Time elapsed: 0 s
09:44:35 [2020-12-01T14:44:35.305Z] sarFileRegistration(org.eclipse.ease.lang.scriptarchive.ArchiveEngineTest)  Time elapsed: 0 s
09:44:35 [2020-12-01T14:44:35.305Z] executeWithErrors(org.eclipse.ease.lang.scriptarchive.ArchiveEngineTest)  Time elapsed: 0.071 s
09:44:35 [2020-12-01T14:44:35.305Z] executeWithIncludes(org.eclipse.ease.lang.scriptarchive.ArchiveEngineTest)  Time elapsed: 0.085 s
09:44:35 [2020-12-01T14:44:35.305Z] 
09:44:35 [2020-12-01T14:44:35.305Z] Results:
09:44:35 [2020-12-01T14:44:35.305Z] 
09:44:35 [2020-12-01T14:44:35.305Z] Tests run: 7, Failures: 0, Errors: 0, Skipped: 0
09:44:35 [2020-12-01T14:44:35.305Z] 
09:44:35 [2020-12-01T14:44:35.884Z] [INFO] All tests passed!
09:44:35 [2020-12-01T14:44:35.884Z] [INFO] 
09:44:35 [2020-12-01T14:44:35.884Z] [INFO] -------------< org.eclipse.ease:org.eclipse.ease.ui.test >--------------
09:44:35 [2020-12-01T14:44:35.884Z] [INFO] Building org.eclipse.ease.ui.test 0.8.0-SNAPSHOT                 [11/11]
09:44:35 [2020-12-01T14:44:35.884Z] [INFO] ------------------------[ eclipse-test-plugin ]-------------------------
09:44:35 [2020-12-01T14:44:35.884Z] [INFO] 
09:44:35 [2020-12-01T14:44:35.884Z] [INFO] --- tycho-packaging-plugin:1.5.0:build-qualifier (default-build-qualifier) @ org.eclipse.ease.ui.test ---
09:44:35 [2020-12-01T14:44:35.884Z] [INFO] The project's OSGi version is 0.8.0.I201910171213
09:44:35 [2020-12-01T14:44:35.884Z] [INFO] 
09:44:35 [2020-12-01T14:44:35.884Z] [INFO] --- tycho-packaging-plugin:1.5.0:validate-id (default-validate-id) @ org.eclipse.ease.ui.test ---
09:44:35 [2020-12-01T14:44:35.884Z] [INFO] 
09:44:35 [2020-12-01T14:44:35.884Z] [INFO] --- tycho-packaging-plugin:1.5.0:validate-version (default-validate-version) @ org.eclipse.ease.ui.test ---
09:44:35 [2020-12-01T14:44:35.884Z] [INFO] 
09:44:35 [2020-12-01T14:44:35.884Z] [INFO] --- maven-resources-plugin:2.4.3:resources (default-resources) @ org.eclipse.ease.ui.test ---
09:44:35 [2020-12-01T14:44:35.884Z] [INFO] Using 'UTF-8' encoding to copy filtered resources.
09:44:35 [2020-12-01T14:44:35.884Z] [INFO] skip non existing resourceDirectory /home/jenkins/agent/workspace/ease.verify.core.target.2019-06/tests/org.eclipse.ease.ui.test/src/main/resources
09:44:35 [2020-12-01T14:44:35.884Z] [INFO] 
09:44:35 [2020-12-01T14:44:35.884Z] [INFO] --- tycho-compiler-plugin:1.5.0:compile (default-compile) @ org.eclipse.ease.ui.test ---
09:44:35 [2020-12-01T14:44:35.884Z] [INFO] Nothing to compile - all classes are up to date
09:44:35 [2020-12-01T14:44:35.884Z] [INFO] 
09:44:35 [2020-12-01T14:44:35.884Z] [INFO] --- maven-resources-plugin:2.4.3:testResources (default-testResources) @ org.eclipse.ease.ui.test ---
09:44:35 [2020-12-01T14:44:35.884Z] [INFO] Using 'UTF-8' encoding to copy filtered resources.
09:44:35 [2020-12-01T14:44:35.884Z] [INFO] skip non existing resourceDirectory /home/jenkins/agent/workspace/ease.verify.core.target.2019-06/tests/org.eclipse.ease.ui.test/src/test/resources
09:44:35 [2020-12-01T14:44:35.884Z] [INFO] 
09:44:35 [2020-12-01T14:44:35.884Z] [INFO] --- tycho-source-plugin:1.5.0:plugin-source (plugin-source) @ org.eclipse.ease.ui.test ---
09:44:35 [2020-12-01T14:44:35.884Z] [WARNING] Bundle-Vendor header not found in /home/jenkins/agent/workspace/ease.verify.core.target.2019-06/tests/org.eclipse.ease.ui.test/META-INF/MANIFEST.MF, fallback to 'unknown' for source bundle
09:44:35 [2020-12-01T14:44:35.884Z] [INFO] Building jar: /home/jenkins/agent/workspace/ease.verify.core.target.2019-06/tests/org.eclipse.ease.ui.test/target/org.eclipse.ease.ui.test-0.8.0-SNAPSHOT-sources.jar
09:44:35 [2020-12-01T14:44:35.884Z] [INFO] 
09:44:35 [2020-12-01T14:44:35.884Z] [INFO] --- target-platform-configuration:1.5.0:target-platform (default-target-platform) @ org.eclipse.ease.ui.test ---
09:44:35 [2020-12-01T14:44:35.884Z] [INFO] 
09:44:35 [2020-12-01T14:44:35.885Z] [INFO] --- tycho-packaging-plugin:1.5.0:package-plugin (default-package-plugin) @ org.eclipse.ease.ui.test ---
09:44:35 [2020-12-01T14:44:35.885Z] [INFO] Building jar: /home/jenkins/agent/workspace/ease.verify.core.target.2019-06/tests/org.eclipse.ease.ui.test/target/org.eclipse.ease.ui.test-0.8.0-SNAPSHOT.jar
09:44:35 [2020-12-01T14:44:35.885Z] [INFO] 
09:44:35 [2020-12-01T14:44:35.885Z] [INFO] --- tycho-p2-plugin:1.5.0:p2-metadata-default (default-p2-metadata-default) @ org.eclipse.ease.ui.test ---
09:44:35 [2020-12-01T14:44:35.885Z] [INFO] 
09:44:35 [2020-12-01T14:44:35.885Z] [INFO] --- tycho-source-feature-plugin:1.5.0:source-feature (source-feature) @ org.eclipse.ease.ui.test ---
09:44:35 [2020-12-01T14:44:35.885Z] [INFO] 
09:44:35 [2020-12-01T14:44:35.885Z] [INFO] --- tycho-p2-plugin:1.5.0:p2-metadata (attached-p2-metadata) @ org.eclipse.ease.ui.test ---
09:44:35 [2020-12-01T14:44:35.885Z] [INFO] 
09:44:35 [2020-12-01T14:44:35.885Z] [INFO] --- tycho-surefire-plugin:1.5.0:test (default-test) @ org.eclipse.ease.ui.test ---
09:44:36 [2020-12-01T14:44:36.140Z] [INFO] Expected eclipse log file: /home/jenkins/agent/workspace/ease.verify.core.target.2019-06/tests/org.eclipse.ease.ui.test/target/work/data/.metadata/.log
09:44:36 [2020-12-01T14:44:36.140Z] [INFO] Command line:
09:44:36 [2020-12-01T14:44:36.140Z] 	[/opt/tools/java/openjdk/jdk-11/11.0.2+9/bin/java, -Dosgi.noShutdown=false, -Dosgi.os=linux, -Dosgi.ws=gtk, -Dosgi.arch=x86_64, -Dosgi.clean=true, -jar, /home/jenkins/.m2/repository/p2/osgi/bundle/org.eclipse.equinox.launcher/1.5.400.v20190515-0925/org.eclipse.equinox.launcher-1.5.400.v20190515-0925.jar, -data, /home/jenkins/agent/workspace/ease.verify.core.target.2019-06/tests/org.eclipse.ease.ui.test/target/work/data, -install, /home/jenkins/agent/workspace/ease.verify.core.target.2019-06/tests/org.eclipse.ease.ui.test/target/work, -configuration, /home/jenkins/agent/workspace/ease.verify.core.target.2019-06/tests/org.eclipse.ease.ui.test/target/work/configuration, -application, org.eclipse.tycho.surefire.osgibooter.headlesstest, -testproperties, /home/jenkins/agent/workspace/ease.verify.core.target.2019-06/tests/org.eclipse.ease.ui.test/target/surefire.properties]
09:44:36 [2020-12-01T14:44:36.140Z] Picked up JAVA_TOOL_OPTIONS: -Dmaven.ext.class.path="/home/jenkins/agent/workspace/ease.verify.core.target.2019-06@tmp/withMaven6b223a92/pipeline-maven-spy.jar" -Dorg.jenkinsci.plugins.pipeline.maven.reportsFolder="/home/jenkins/agent/workspace/ease.verify.core.target.2019-06@tmp/withMaven6b223a92" 
09:44:38 [2020-12-01T14:44:38.046Z] Running org.eclipse.ease.ui.completion.CompletionContextTest
09:44:38 [2020-12-01T14:44:38.046Z] Tests run: 9, Failures: 0, Errors: 0, Skipped: 0, Time elapsed: 0.022 s - in org.eclipse.ease.ui.completion.CompletionContextTest
09:44:38 [2020-12-01T14:44:38.046Z] resolveStaticClass(org.eclipse.ease.ui.completion.CompletionContextTest)  Time elapsed: 0.002 s
09:44:38 [2020-12-01T14:44:38.046Z] resolveClassWithFilter(org.eclipse.ease.ui.completion.CompletionContextTest)  Time elapsed: 0 s
09:44:38 [2020-12-01T14:44:38.046Z] simplifyCalls(org.eclipse.ease.ui.completion.CompletionContextTest)  Time elapsed: 0 s
09:44:38 [2020-12-01T14:44:38.046Z] resolveClass(org.eclipse.ease.ui.completion.CompletionContextTest)  Time elapsed: 0 s
09:44:38 [2020-12-01T14:44:38.046Z] replaceEscapedStringLiterals(org.eclipse.ease.ui.completion.CompletionContextTest)  Time elapsed: 0 s
09:44:38 [2020-12-01T14:44:38.046Z] replaceSimpleStringLiterals(org.eclipse.ease.ui.completion.CompletionContextTest)  Time elapsed: 0 s
09:44:38 [2020-12-01T14:44:38.046Z] resolveStaticClassWithFilter(org.eclipse.ease.ui.completion.CompletionContextTest)  Time elapsed: 0 s
09:44:38 [2020-12-01T14:44:38.046Z] resolveClassWithParameters(org.eclipse.ease.ui.completion.CompletionContextTest)  Time elapsed: 0 s
09:44:38 [2020-12-01T14:44:38.046Z] replaceMultipleStringLiterals(org.eclipse.ease.ui.completion.CompletionContextTest)  Time elapsed: 0 s
09:44:38 [2020-12-01T14:44:38.046Z] Running org.eclipse.ease.ui.completion.provider.AbstractFileLocationCompletionProviderTest
09:44:38 [2020-12-01T14:44:38.046Z] Tests run: 8, Failures: 0, Errors: 0, Skipped: 8, Time elapsed: 0.084 s - in org.eclipse.ease.ui.completion.provider.AbstractFileLocationCompletionProviderTest
09:44:38 [2020-12-01T14:44:38.046Z] workspaceProjectProposals(org.eclipse.ease.ui.completion.provider.AbstractFileLocationCompletionProviderTest) skipped
09:44:38 [2020-12-01T14:44:38.046Z] checkOperatingSystem(org.eclipse.ease.ui.completion.provider.AbstractFileLocationCompletionProviderTest) skipped
09:44:38 [2020-12-01T14:44:38.046Z] absoluteRootWorkspaceProposals(org.eclipse.ease.ui.completion.provider.AbstractFileLocationCompletionProviderTest) skipped
09:44:38 [2020-12-01T14:44:38.046Z] workspaceFolderProposals(org.eclipse.ease.ui.completion.provider.AbstractFileLocationCompletionProviderTest) skipped
09:44:38 [2020-12-01T14:44:38.046Z] fileSystemFolderProposals(org.eclipse.ease.ui.completion.provider.AbstractFileLocationCompletionProviderTest) skipped
09:44:38 [2020-12-01T14:44:38.046Z] workspaceProposals(org.eclipse.ease.ui.completion.provider.AbstractFileLocationCompletionProviderTest) skipped
09:44:38 [2020-12-01T14:44:38.046Z] relativeRootWorkspaceProposals(org.eclipse.ease.ui.completion.provider.AbstractFileLocationCompletionProviderTest) skipped
09:44:38 [2020-12-01T14:44:38.046Z] fileSystemRootProposals(org.eclipse.ease.ui.completion.provider.AbstractFileLocationCompletionProviderTest) skipped
09:44:38 [2020-12-01T14:44:38.046Z] Running org.eclipse.ease.ui.help.hovers.ModuleHelpTest
09:44:38 [2020-12-01T14:44:38.047Z] Tests run: 4, Failures: 0, Errors: 0, Skipped: 4, Time elapsed: 0.001 s - in org.eclipse.ease.ui.help.hovers.ModuleHelpTest
09:44:38 [2020-12-01T14:44:38.047Z] getModuleHelpLocation(org.eclipse.ease.ui.help.hovers.ModuleHelpTest) skipped
09:44:38 [2020-12-01T14:44:38.047Z] getModuleHelp(org.eclipse.ease.ui.help.hovers.ModuleHelpTest) skipped
09:44:38 [2020-12-01T14:44:38.047Z] getMethodHelp(org.eclipse.ease.ui.help.hovers.ModuleHelpTest) skipped
09:44:38 [2020-12-01T14:44:38.047Z] getConstantHelp(org.eclipse.ease.ui.help.hovers.ModuleHelpTest) skipped
09:44:38 [2020-12-01T14:44:38.047Z] Running org.eclipse.ease.ui.completions.java.provider.JavaPackagesCompletionsProviderTest
09:44:38 [2020-12-01T14:44:38.047Z] WARNING: An illegal reflective access operation has occurred
09:44:38 [2020-12-01T14:44:38.047Z] WARNING: Illegal reflective access by org.mockito.cglib.core.ReflectUtils$2 (file:/home/jenkins/.m2/repository/p2/osgi/bundle/org.mockito/1.9.5.v201605172210/org.mockito-1.9.5.v201605172210.jar) to method java.lang.ClassLoader.defineClass(java.lang.String,byte[],int,int,java.security.ProtectionDomain)
09:44:38 [2020-12-01T14:44:38.047Z] WARNING: Please consider reporting this to the maintainers of org.mockito.cglib.core.ReflectUtils$2
09:44:38 [2020-12-01T14:44:38.047Z] WARNING: Use --illegal-access=warn to enable warnings of further illegal reflective access operations
09:44:38 [2020-12-01T14:44:38.047Z] WARNING: All illegal access operations will be denied in a future release
09:44:44 [2020-12-01T14:44:44.586Z] Tests run: 4, Failures: 0, Errors: 0, Skipped: 0, Time elapsed: 5.89 s - in org.eclipse.ease.ui.completions.java.provider.JavaPackagesCompletionsProviderTest
09:44:44 [2020-12-01T14:44:44.586Z] containsJavaLangPackageProposal(org.eclipse.ease.ui.completions.java.provider.JavaPackagesCompletionsProviderTest)  Time elapsed: 0.483 s
09:44:44 [2020-12-01T14:44:44.586Z] containsOrgRootPackageProposal(org.eclipse.ease.ui.completions.java.provider.JavaPackagesCompletionsProviderTest)  Time elapsed: 0.009 s
09:44:44 [2020-12-01T14:44:44.586Z] containsJavaRootPackageProposal(org.eclipse.ease.ui.completions.java.provider.JavaPackagesCompletionsProviderTest)  Time elapsed: 0.011 s
09:44:44 [2020-12-01T14:44:44.586Z] containsOrgEclipsePackageProposal(org.eclipse.ease.ui.completions.java.provider.JavaPackagesCompletionsProviderTest)  Time elapsed: 0.051 s
09:44:44 [2020-12-01T14:44:44.586Z] Running org.eclipse.ease.ui.completions.java.provider.JavaClassCompletionsProviderTest
09:44:49 [2020-12-01T14:44:49.850Z] Tests run: 6, Failures: 0, Errors: 0, Skipped: 0, Time elapsed: 5.208 s - in org.eclipse.ease.ui.completions.java.provider.JavaClassCompletionsProviderTest
09:44:49 [2020-12-01T14:44:49.850Z] containsPackageFileCompletion(org.eclipse.ease.ui.completions.java.provider.JavaClassCompletionsProviderTest)  Time elapsed: 0.009 s
09:44:49 [2020-12-01T14:44:49.850Z] containsGlobalFileCompletion(org.eclipse.ease.ui.completions.java.provider.JavaClassCompletionsProviderTest)  Time elapsed: 0.034 s
09:44:49 [2020-12-01T14:44:49.850Z] containsJavaLangPackageProposal(org.eclipse.ease.ui.completions.java.provider.JavaClassCompletionsProviderTest)  Time elapsed: 0.066 s
09:44:49 [2020-12-01T14:44:49.851Z] containsOrgRootPackageProposal(org.eclipse.ease.ui.completions.java.provider.JavaClassCompletionsProviderTest)  Time elapsed: 0.006 s
09:44:49 [2020-12-01T14:44:49.851Z] containsJavaRootPackageProposal(org.eclipse.ease.ui.completions.java.provider.JavaClassCompletionsProviderTest)  Time elapsed: 0.005 s
09:44:49 [2020-12-01T14:44:49.851Z] containsOrgEclipsePackageProposal(org.eclipse.ease.ui.completions.java.provider.JavaClassCompletionsProviderTest)  Time elapsed: 0.052 s
09:44:49 [2020-12-01T14:44:49.851Z] 
09:44:49 [2020-12-01T14:44:49.851Z] Results:
09:44:49 [2020-12-01T14:44:49.851Z] 
09:44:49 [2020-12-01T14:44:49.851Z] Tests run: 31, Failures: 0, Errors: 0, Skipped: 12
09:44:49 [2020-12-01T14:44:49.851Z] 
09:44:50 [2020-12-01T14:44:50.106Z] [INFO] All tests passed!
09:44:50 [2020-12-01T14:44:50.106Z] [INFO] ------------------------------------------------------------------------
09:44:50 [2020-12-01T14:44:50.106Z] [INFO] Reactor Summary for org.eclipse.ease.releng 0.8.0-SNAPSHOT:
09:44:50 [2020-12-01T14:44:50.106Z] [INFO] 
09:44:50 [2020-12-01T14:44:50.106Z] [INFO] org.eclipse.ease.releng ............................ SUCCESS [  0.002 s]
09:44:50 [2020-12-01T14:44:50.106Z] [INFO] org.eclipse.ease.releng.target ..................... SUCCESS [  0.194 s]
09:44:50 [2020-12-01T14:44:50.106Z] [INFO] org.eclipse.ease.test .............................. SUCCESS [ 18.509 s]
09:44:50 [2020-12-01T14:44:50.106Z] [INFO] org.eclipse.ease.lang.javascript.nashorn.test ...... SUCCESS [  3.060 s]
09:44:50 [2020-12-01T14:44:50.106Z] [INFO] org.eclipse.ease.lang.javascript.rhino.test ........ SUCCESS [ 14.896 s]
09:44:50 [2020-12-01T14:44:50.106Z] [INFO] org.eclipse.ease.lang.javascript.test .............. SUCCESS [  2.988 s]
09:44:50 [2020-12-01T14:44:50.106Z] [INFO] org.eclipse.ease.lang.python.test .................. SUCCESS [  2.772 s]
09:44:50 [2020-12-01T14:44:50.106Z] [INFO] org.eclipse.ease.lang.python.jython.test ........... SUCCESS [ 15.753 s]
09:44:50 [2020-12-01T14:44:50.106Z] [INFO] org.eclipse.ease.lang.python.py4j.test ............. SUCCESS [ 30.326 s]
09:44:50 [2020-12-01T14:44:50.106Z] [INFO] org.eclipse.ease.lang.scriptarchive.test ........... SUCCESS [  2.833 s]
09:44:50 [2020-12-01T14:44:50.106Z] [INFO] org.eclipse.ease.ui.test ........................... SUCCESS [ 14.143 s]
09:44:50 [2020-12-01T14:44:50.106Z] [INFO] ------------------------------------------------------------------------
09:44:50 [2020-12-01T14:44:50.106Z] [INFO] BUILD SUCCESS
09:44:50 [2020-12-01T14:44:50.106Z] [INFO] ------------------------------------------------------------------------
09:44:50 [2020-12-01T14:44:50.106Z] [INFO] Total time:  05:40 min
09:44:50 [2020-12-01T14:44:50.106Z] [INFO] Finished at: 2020-12-01T14:44:49Z
09:44:50 [2020-12-01T14:44:50.106Z] [INFO] ------------------------------------------------------------------------
09:44:50 [2020-12-01T14:44:50.106Z] [WARNING] [jenkins-event-spy] Unexpected Maven project file name 'target-tests-pom.xml', problems may occur
09:44:50 [2020-12-01T14:44:50.106Z] [INFO] [jenkins-event-spy] Generated /home/jenkins/agent/workspace/ease.verify.core.target.2019-06@tmp/withMaven6b223a92/maven-spy-20201201-143909-44715035131111323501612.log