SuccessConsole Output

Skipping 725 KB.. Full Log
e.properties]
09:38:05 [2020-12-01T14:38:05.646Z] Picked up JAVA_TOOL_OPTIONS: -Dmaven.ext.class.path="/home/jenkins/agent/workspace/ease.verify.core.target.2019-06@tmp/withMavenda45dd09/pipeline-maven-spy.jar" -Dorg.jenkinsci.plugins.pipeline.maven.reportsFolder="/home/jenkins/agent/workspace/ease.verify.core.target.2019-06@tmp/withMavenda45dd09" 
09:38:07 [2020-12-01T14:38:07.545Z] Running org.eclipse.ease.lang.javascript.JavaScriptCompletionContextTest
09:38:07 [2020-12-01T14:38:07.800Z] Tests run: 8, Failures: 0, Errors: 0, Skipped: 0, Time elapsed: 0.281 s - in org.eclipse.ease.lang.javascript.JavaScriptCompletionContextTest
09:38:07 [2020-12-01T14:38:07.800Z] verifyStaticClassTypes(org.eclipse.ease.lang.javascript.JavaScriptCompletionContextTest)  Time elapsed: 0.005 s
09:38:07 [2020-12-01T14:38:07.800Z] verifyClassInstanceTypes(org.eclipse.ease.lang.javascript.JavaScriptCompletionContextTest)  Time elapsed: 0.006 s
09:38:07 [2020-12-01T14:38:07.800Z] verifyTypesForScriptEngine(org.eclipse.ease.lang.javascript.JavaScriptCompletionContextTest)  Time elapsed: 0.109 s
09:38:07 [2020-12-01T14:38:07.800Z] verifyPackageTypes(org.eclipse.ease.lang.javascript.JavaScriptCompletionContextTest)  Time elapsed: 0.001 s
09:38:07 [2020-12-01T14:38:07.800Z] definedVariableTypes(org.eclipse.ease.lang.javascript.JavaScriptCompletionContextTest)  Time elapsed: 0 s
09:38:07 [2020-12-01T14:38:07.800Z] verifyStringLiteralTypes(org.eclipse.ease.lang.javascript.JavaScriptCompletionContextTest)  Time elapsed: 0.001 s
09:38:07 [2020-12-01T14:38:07.800Z] verifyUnknownTypes(org.eclipse.ease.lang.javascript.JavaScriptCompletionContextTest)  Time elapsed: 0 s
09:38:07 [2020-12-01T14:38:07.800Z] verifyNoneTypes(org.eclipse.ease.lang.javascript.JavaScriptCompletionContextTest)  Time elapsed: 0 s
09:38:07 [2020-12-01T14:38:07.800Z] Running org.eclipse.ease.lang.javascript.JavaScriptCodeFactoryTest
09:38:07 [2020-12-01T14:38:07.800Z] Tests run: 1, Failures: 0, Errors: 0, Skipped: 0, Time elapsed: 0.002 s - in org.eclipse.ease.lang.javascript.JavaScriptCodeFactoryTest
09:38:07 [2020-12-01T14:38:07.800Z] testCommentCreator(org.eclipse.ease.lang.javascript.JavaScriptCodeFactoryTest)  Time elapsed: 0.001 s
09:38:07 [2020-12-01T14:38:07.800Z] 
09:38:07 [2020-12-01T14:38:07.800Z] Results:
09:38:07 [2020-12-01T14:38:07.800Z] 
09:38:07 [2020-12-01T14:38:07.800Z] Tests run: 9, Failures: 0, Errors: 0, Skipped: 0
09:38:07 [2020-12-01T14:38:07.800Z] 
09:38:08 [2020-12-01T14:38:08.726Z] [INFO] All tests passed!
09:38:08 [2020-12-01T14:38:08.726Z] [INFO] 
09:38:08 [2020-12-01T14:38:08.726Z] [INFO] --- maven-install-plugin:2.3.1:install (default-install) @ org.eclipse.ease.lang.javascript.test ---
09:38:08 [2020-12-01T14:38:08.726Z] [INFO] Installing /home/jenkins/agent/workspace/ease.verify.core.target.2019-06/tests/org.eclipse.ease.lang.javascript.test/target/org.eclipse.ease.lang.javascript.test-0.8.0-SNAPSHOT.jar to /home/jenkins/.m2/repository/org/eclipse/ease/org.eclipse.ease.lang.javascript.test/0.8.0-SNAPSHOT/org.eclipse.ease.lang.javascript.test-0.8.0-SNAPSHOT.jar
09:38:08 [2020-12-01T14:38:08.726Z] [INFO] Installing /home/jenkins/agent/workspace/ease.verify.core.target.2019-06/tests/org.eclipse.ease.lang.javascript.test/pom.xml to /home/jenkins/.m2/repository/org/eclipse/ease/org.eclipse.ease.lang.javascript.test/0.8.0-SNAPSHOT/org.eclipse.ease.lang.javascript.test-0.8.0-SNAPSHOT.pom
09:38:08 [2020-12-01T14:38:08.726Z] [INFO] Installing /home/jenkins/agent/workspace/ease.verify.core.target.2019-06/tests/org.eclipse.ease.lang.javascript.test/target/org.eclipse.ease.lang.javascript.test-0.8.0-SNAPSHOT-sources.jar to /home/jenkins/.m2/repository/org/eclipse/ease/org.eclipse.ease.lang.javascript.test/0.8.0-SNAPSHOT/org.eclipse.ease.lang.javascript.test-0.8.0-SNAPSHOT-sources.jar
09:38:08 [2020-12-01T14:38:08.726Z] [INFO] Installing /home/jenkins/agent/workspace/ease.verify.core.target.2019-06/tests/org.eclipse.ease.lang.javascript.test/target/p2content.xml to /home/jenkins/.m2/repository/org/eclipse/ease/org.eclipse.ease.lang.javascript.test/0.8.0-SNAPSHOT/org.eclipse.ease.lang.javascript.test-0.8.0-SNAPSHOT-p2metadata.xml
09:38:08 [2020-12-01T14:38:08.726Z] [INFO] Installing /home/jenkins/agent/workspace/ease.verify.core.target.2019-06/tests/org.eclipse.ease.lang.javascript.test/target/p2artifacts.xml to /home/jenkins/.m2/repository/org/eclipse/ease/org.eclipse.ease.lang.javascript.test/0.8.0-SNAPSHOT/org.eclipse.ease.lang.javascript.test-0.8.0-SNAPSHOT-p2artifacts.xml
09:38:08 [2020-12-01T14:38:08.726Z] [INFO] Installing /home/jenkins/agent/workspace/ease.verify.core.target.2019-06/tests/org.eclipse.ease.lang.javascript.test/target/p2content.xml to /home/jenkins/.m2/repository/org/eclipse/ease/org.eclipse.ease.lang.javascript.test/0.8.0-SNAPSHOT/org.eclipse.ease.lang.javascript.test-0.8.0-SNAPSHOT-p2metadata.xml
09:38:08 [2020-12-01T14:38:08.726Z] [INFO] Installing /home/jenkins/agent/workspace/ease.verify.core.target.2019-06/tests/org.eclipse.ease.lang.javascript.test/target/p2artifacts.xml to /home/jenkins/.m2/repository/org/eclipse/ease/org.eclipse.ease.lang.javascript.test/0.8.0-SNAPSHOT/org.eclipse.ease.lang.javascript.test-0.8.0-SNAPSHOT-p2artifacts.xml
09:38:08 [2020-12-01T14:38:08.726Z] [INFO] 
09:38:08 [2020-12-01T14:38:08.726Z] [INFO] --- tycho-p2-plugin:1.5.0:update-local-index (default-update-local-index) @ org.eclipse.ease.lang.javascript.test ---
09:38:08 [2020-12-01T14:38:08.726Z] [INFO] 
09:38:08 [2020-12-01T14:38:08.726Z] [INFO] ---------< org.eclipse.ease:org.eclipse.ease.lang.python.test >---------
09:38:08 [2020-12-01T14:38:08.726Z] [INFO] Building org.eclipse.ease.lang.python.test 0.8.0-SNAPSHOT        [42/48]
09:38:08 [2020-12-01T14:38:08.726Z] [INFO] ------------------------[ eclipse-test-plugin ]-------------------------
09:38:08 [2020-12-01T14:38:08.726Z] [INFO] 
09:38:08 [2020-12-01T14:38:08.726Z] [INFO] --- maven-clean-plugin:2.5:clean (default-clean) @ org.eclipse.ease.lang.python.test ---
09:38:08 [2020-12-01T14:38:08.726Z] [INFO] 
09:38:08 [2020-12-01T14:38:08.727Z] [INFO] --- tycho-packaging-plugin:1.5.0:build-qualifier (default-build-qualifier) @ org.eclipse.ease.lang.python.test ---
09:38:08 [2020-12-01T14:38:08.727Z] [INFO] The project's OSGi version is 0.8.0.I201910171213
09:38:08 [2020-12-01T14:38:08.727Z] [INFO] 
09:38:08 [2020-12-01T14:38:08.727Z] [INFO] --- tycho-packaging-plugin:1.5.0:validate-id (default-validate-id) @ org.eclipse.ease.lang.python.test ---
09:38:08 [2020-12-01T14:38:08.727Z] [INFO] 
09:38:08 [2020-12-01T14:38:08.727Z] [INFO] --- tycho-packaging-plugin:1.5.0:validate-version (default-validate-version) @ org.eclipse.ease.lang.python.test ---
09:38:08 [2020-12-01T14:38:08.727Z] [INFO] 
09:38:08 [2020-12-01T14:38:08.727Z] [INFO] >>> maven-javadoc-plugin:2.9.1:javadoc (build-docs) > generate-sources @ org.eclipse.ease.lang.python.test >>>
09:38:08 [2020-12-01T14:38:08.727Z] [INFO] 
09:38:08 [2020-12-01T14:38:08.727Z] [INFO] --- tycho-packaging-plugin:1.5.0:build-qualifier (default-build-qualifier) @ org.eclipse.ease.lang.python.test ---
09:38:08 [2020-12-01T14:38:08.727Z] [INFO] The project's OSGi version is 0.8.0.I201910171213
09:38:08 [2020-12-01T14:38:08.727Z] [INFO] 
09:38:08 [2020-12-01T14:38:08.727Z] [INFO] --- tycho-packaging-plugin:1.5.0:validate-id (default-validate-id) @ org.eclipse.ease.lang.python.test ---
09:38:08 [2020-12-01T14:38:08.727Z] [INFO] 
09:38:08 [2020-12-01T14:38:08.727Z] [INFO] --- tycho-packaging-plugin:1.5.0:validate-version (default-validate-version) @ org.eclipse.ease.lang.python.test ---
09:38:08 [2020-12-01T14:38:08.727Z] [INFO] 
09:38:08 [2020-12-01T14:38:08.727Z] [INFO] <<< maven-javadoc-plugin:2.9.1:javadoc (build-docs) < generate-sources @ org.eclipse.ease.lang.python.test <<<
09:38:08 [2020-12-01T14:38:08.727Z] [INFO] 
09:38:08 [2020-12-01T14:38:08.727Z] [INFO] 
09:38:08 [2020-12-01T14:38:08.727Z] [INFO] --- maven-javadoc-plugin:2.9.1:javadoc (build-docs) @ org.eclipse.ease.lang.python.test ---
09:38:08 [2020-12-01T14:38:08.983Z] [ERROR] Error fetching link: http://help.eclipse.org/oxygen/topic/org.eclipse.platform.doc.isv/reference/api/package-list. Ignored it.
09:38:08 [2020-12-01T14:38:08.983Z] [ERROR] Error fetching link: https://ci.eclipse.org/ease/job/ease.build.core/JavaDoc/package-list. Ignored it.
09:38:10 [2020-12-01T14:38:10.381Z] [INFO] 
09:38:10 [2020-12-01T14:38:10.381Z] Loading source files for package org.eclipse.ease.lang.python...
09:38:10 [2020-12-01T14:38:10.381Z] Constructing Javadoc information...
09:38:10 [2020-12-01T14:38:10.381Z] WARNING: Cannot open location "/home/jenkins/agent/workspace/ease.verify.core.target.2019-06/tests/org.eclipse.ease.lang.python.test/target/javadoc-bundle-options/package-list"
09:38:10 [2020-12-01T14:38:10.381Z] No plugin definition found, skipping
09:38:10 [2020-12-01T14:38:10.381Z] No plugin definition found, skipping
09:38:10 [2020-12-01T14:38:10.381Z] [WARNING] Javadoc Warnings
09:38:10 [2020-12-01T14:38:10.381Z] [WARNING] Picked up JAVA_TOOL_OPTIONS: -Dmaven.ext.class.path="/home/jenkins/agent/workspace/ease.verify.core.target.2019-06@tmp/withMavenda45dd09/pipeline-maven-spy.jar" -Dorg.jenkinsci.plugins.pipeline.maven.reportsFolder="/home/jenkins/agent/workspace/ease.verify.core.target.2019-06@tmp/withMavenda45dd09"
09:38:10 [2020-12-01T14:38:10.381Z] [WARNING] javadoc: warning - The old Doclet and Taglet APIs in the packages
09:38:10 [2020-12-01T14:38:10.381Z] [WARNING] com.sun.javadoc, com.sun.tools.doclets and their implementations
09:38:10 [2020-12-01T14:38:10.381Z] [WARNING] are planned to be removed in a future JDK release. These
09:38:10 [2020-12-01T14:38:10.381Z] [WARNING] components have been superseded by the new APIs in jdk.javadoc.doclet.
09:38:10 [2020-12-01T14:38:10.381Z] [WARNING] Users are strongly recommended to migrate to the new APIs.
09:38:10 [2020-12-01T14:38:10.381Z] [INFO] 
09:38:10 [2020-12-01T14:38:10.381Z] [INFO] --- build-helper-maven-plugin:1.9.1:add-resource (add_help) @ org.eclipse.ease.lang.python.test ---
09:38:10 [2020-12-01T14:38:10.381Z] [INFO] 
09:38:10 [2020-12-01T14:38:10.381Z] [INFO] --- maven-resources-plugin:2.4.3:resources (default-resources) @ org.eclipse.ease.lang.python.test ---
09:38:10 [2020-12-01T14:38:10.381Z] [INFO] Using 'UTF-8' encoding to copy filtered resources.
09:38:10 [2020-12-01T14:38:10.381Z] [INFO] skip non existing resourceDirectory /home/jenkins/agent/workspace/ease.verify.core.target.2019-06/tests/org.eclipse.ease.lang.python.test/src/main/resources
09:38:10 [2020-12-01T14:38:10.381Z] [INFO] skip non existing resourceDirectory /home/jenkins/agent/workspace/ease.verify.core.target.2019-06/tests/org.eclipse.ease.lang.python.test/help
09:38:10 [2020-12-01T14:38:10.381Z] [INFO] 
09:38:10 [2020-12-01T14:38:10.381Z] [INFO] --- tycho-compiler-plugin:1.5.0:compile (default-compile) @ org.eclipse.ease.lang.python.test ---
09:38:10 [2020-12-01T14:38:10.381Z] [INFO] Compiling 1 source file to /home/jenkins/agent/workspace/ease.verify.core.target.2019-06/tests/org.eclipse.ease.lang.python.test/target/classes
09:38:10 [2020-12-01T14:38:10.381Z] [INFO] 
09:38:10 [2020-12-01T14:38:10.381Z] [INFO] --- maven-resources-plugin:2.4.3:testResources (default-testResources) @ org.eclipse.ease.lang.python.test ---
09:38:10 [2020-12-01T14:38:10.381Z] [INFO] Using 'UTF-8' encoding to copy filtered resources.
09:38:10 [2020-12-01T14:38:10.381Z] [INFO] skip non existing resourceDirectory /home/jenkins/agent/workspace/ease.verify.core.target.2019-06/tests/org.eclipse.ease.lang.python.test/src/test/resources
09:38:10 [2020-12-01T14:38:10.381Z] [INFO] 
09:38:10 [2020-12-01T14:38:10.381Z] [INFO] --- tycho-source-plugin:1.5.0:plugin-source (plugin-source) @ org.eclipse.ease.lang.python.test ---
09:38:10 [2020-12-01T14:38:10.381Z] [WARNING] Bundle-Vendor header not found in /home/jenkins/agent/workspace/ease.verify.core.target.2019-06/tests/org.eclipse.ease.lang.python.test/META-INF/MANIFEST.MF, fallback to 'unknown' for source bundle
09:38:10 [2020-12-01T14:38:10.381Z] [INFO] Building jar: /home/jenkins/agent/workspace/ease.verify.core.target.2019-06/tests/org.eclipse.ease.lang.python.test/target/org.eclipse.ease.lang.python.test-0.8.0-SNAPSHOT-sources.jar
09:38:10 [2020-12-01T14:38:10.381Z] [INFO] 
09:38:10 [2020-12-01T14:38:10.381Z] [INFO] --- target-platform-configuration:1.5.0:target-platform (default-target-platform) @ org.eclipse.ease.lang.python.test ---
09:38:10 [2020-12-01T14:38:10.381Z] [INFO] 
09:38:10 [2020-12-01T14:38:10.382Z] [INFO] --- tycho-packaging-plugin:1.5.0:package-plugin (default-package-plugin) @ org.eclipse.ease.lang.python.test ---
09:38:10 [2020-12-01T14:38:10.382Z] [INFO] Building jar: /home/jenkins/agent/workspace/ease.verify.core.target.2019-06/tests/org.eclipse.ease.lang.python.test/target/org.eclipse.ease.lang.python.test-0.8.0-SNAPSHOT.jar
09:38:10 [2020-12-01T14:38:10.382Z] [INFO] 
09:38:10 [2020-12-01T14:38:10.382Z] [INFO] --- tycho-p2-plugin:1.5.0:p2-metadata-default (default-p2-metadata-default) @ org.eclipse.ease.lang.python.test ---
09:38:10 [2020-12-01T14:38:10.382Z] [INFO] 
09:38:10 [2020-12-01T14:38:10.382Z] [INFO] --- tycho-source-feature-plugin:1.5.0:source-feature (source-feature) @ org.eclipse.ease.lang.python.test ---
09:38:10 [2020-12-01T14:38:10.382Z] [INFO] 
09:38:10 [2020-12-01T14:38:10.382Z] [INFO] --- tycho-p2-plugin:1.5.0:p2-metadata (attached-p2-metadata) @ org.eclipse.ease.lang.python.test ---
09:38:10 [2020-12-01T14:38:10.382Z] [INFO] 
09:38:10 [2020-12-01T14:38:10.382Z] [INFO] --- tycho-surefire-plugin:1.5.0:test (default-test) @ org.eclipse.ease.lang.python.test ---
09:38:10 [2020-12-01T14:38:10.382Z] [INFO] Expected eclipse log file: /home/jenkins/agent/workspace/ease.verify.core.target.2019-06/tests/org.eclipse.ease.lang.python.test/target/work/data/.metadata/.log
09:38:10 [2020-12-01T14:38:10.382Z] [INFO] Command line:
09:38:10 [2020-12-01T14:38:10.382Z] 	[/opt/tools/java/openjdk/jdk-11/11.0.2+9/bin/java, -Dosgi.noShutdown=false, -Dosgi.os=linux, -Dosgi.ws=gtk, -Dosgi.arch=x86_64, -Dosgi.clean=true, -jar, /home/jenkins/.m2/repository/p2/osgi/bundle/org.eclipse.equinox.launcher/1.5.800.v20200727-1323/org.eclipse.equinox.launcher-1.5.800.v20200727-1323.jar, -data, /home/jenkins/agent/workspace/ease.verify.core.target.2019-06/tests/org.eclipse.ease.lang.python.test/target/work/data, -install, /home/jenkins/agent/workspace/ease.verify.core.target.2019-06/tests/org.eclipse.ease.lang.python.test/target/work, -configuration, /home/jenkins/agent/workspace/ease.verify.core.target.2019-06/tests/org.eclipse.ease.lang.python.test/target/work/configuration, -application, org.eclipse.tycho.surefire.osgibooter.headlesstest, -testproperties, /home/jenkins/agent/workspace/ease.verify.core.target.2019-06/tests/org.eclipse.ease.lang.python.test/target/surefire.properties]
09:38:10 [2020-12-01T14:38:10.382Z] Picked up JAVA_TOOL_OPTIONS: -Dmaven.ext.class.path="/home/jenkins/agent/workspace/ease.verify.core.target.2019-06@tmp/withMavenda45dd09/pipeline-maven-spy.jar" -Dorg.jenkinsci.plugins.pipeline.maven.reportsFolder="/home/jenkins/agent/workspace/ease.verify.core.target.2019-06@tmp/withMavenda45dd09" 
09:38:12 [2020-12-01T14:38:12.913Z] Running org.eclipse.ease.lang.python.PythonCodeFactoryTest
09:38:12 [2020-12-01T14:38:12.913Z] Tests run: 1, Failures: 0, Errors: 0, Skipped: 0, Time elapsed: 0.034 s - in org.eclipse.ease.lang.python.PythonCodeFactoryTest
09:38:12 [2020-12-01T14:38:12.913Z] testCommentCreator(org.eclipse.ease.lang.python.PythonCodeFactoryTest)  Time elapsed: 0.003 s
09:38:12 [2020-12-01T14:38:12.913Z] 
09:38:12 [2020-12-01T14:38:12.913Z] Results:
09:38:12 [2020-12-01T14:38:12.913Z] 
09:38:12 [2020-12-01T14:38:12.913Z] Tests run: 1, Failures: 0, Errors: 0, Skipped: 0
09:38:12 [2020-12-01T14:38:12.913Z] 
09:38:13 [2020-12-01T14:38:13.169Z] [INFO] All tests passed!
09:38:13 [2020-12-01T14:38:13.169Z] [INFO] 
09:38:13 [2020-12-01T14:38:13.169Z] [INFO] --- maven-install-plugin:2.3.1:install (default-install) @ org.eclipse.ease.lang.python.test ---
09:38:13 [2020-12-01T14:38:13.169Z] [INFO] Installing /home/jenkins/agent/workspace/ease.verify.core.target.2019-06/tests/org.eclipse.ease.lang.python.test/target/org.eclipse.ease.lang.python.test-0.8.0-SNAPSHOT.jar to /home/jenkins/.m2/repository/org/eclipse/ease/org.eclipse.ease.lang.python.test/0.8.0-SNAPSHOT/org.eclipse.ease.lang.python.test-0.8.0-SNAPSHOT.jar
09:38:13 [2020-12-01T14:38:13.169Z] [INFO] Installing /home/jenkins/agent/workspace/ease.verify.core.target.2019-06/tests/org.eclipse.ease.lang.python.test/pom.xml to /home/jenkins/.m2/repository/org/eclipse/ease/org.eclipse.ease.lang.python.test/0.8.0-SNAPSHOT/org.eclipse.ease.lang.python.test-0.8.0-SNAPSHOT.pom
09:38:13 [2020-12-01T14:38:13.169Z] [INFO] Installing /home/jenkins/agent/workspace/ease.verify.core.target.2019-06/tests/org.eclipse.ease.lang.python.test/target/org.eclipse.ease.lang.python.test-0.8.0-SNAPSHOT-sources.jar to /home/jenkins/.m2/repository/org/eclipse/ease/org.eclipse.ease.lang.python.test/0.8.0-SNAPSHOT/org.eclipse.ease.lang.python.test-0.8.0-SNAPSHOT-sources.jar
09:38:13 [2020-12-01T14:38:13.169Z] [INFO] Installing /home/jenkins/agent/workspace/ease.verify.core.target.2019-06/tests/org.eclipse.ease.lang.python.test/target/p2content.xml to /home/jenkins/.m2/repository/org/eclipse/ease/org.eclipse.ease.lang.python.test/0.8.0-SNAPSHOT/org.eclipse.ease.lang.python.test-0.8.0-SNAPSHOT-p2metadata.xml
09:38:13 [2020-12-01T14:38:13.169Z] [INFO] Installing /home/jenkins/agent/workspace/ease.verify.core.target.2019-06/tests/org.eclipse.ease.lang.python.test/target/p2artifacts.xml to /home/jenkins/.m2/repository/org/eclipse/ease/org.eclipse.ease.lang.python.test/0.8.0-SNAPSHOT/org.eclipse.ease.lang.python.test-0.8.0-SNAPSHOT-p2artifacts.xml
09:38:13 [2020-12-01T14:38:13.169Z] [INFO] Installing /home/jenkins/agent/workspace/ease.verify.core.target.2019-06/tests/org.eclipse.ease.lang.python.test/target/p2content.xml to /home/jenkins/.m2/repository/org/eclipse/ease/org.eclipse.ease.lang.python.test/0.8.0-SNAPSHOT/org.eclipse.ease.lang.python.test-0.8.0-SNAPSHOT-p2metadata.xml
09:38:13 [2020-12-01T14:38:13.169Z] [INFO] Installing /home/jenkins/agent/workspace/ease.verify.core.target.2019-06/tests/org.eclipse.ease.lang.python.test/target/p2artifacts.xml to /home/jenkins/.m2/repository/org/eclipse/ease/org.eclipse.ease.lang.python.test/0.8.0-SNAPSHOT/org.eclipse.ease.lang.python.test-0.8.0-SNAPSHOT-p2artifacts.xml
09:38:13 [2020-12-01T14:38:13.169Z] [INFO] 
09:38:13 [2020-12-01T14:38:13.169Z] [INFO] --- tycho-p2-plugin:1.5.0:update-local-index (default-update-local-index) @ org.eclipse.ease.lang.python.test ---
09:38:13 [2020-12-01T14:38:13.170Z] [INFO] 
09:38:13 [2020-12-01T14:38:13.170Z] [INFO] -----< org.eclipse.ease:org.eclipse.ease.lang.python.jython.test >------
09:38:13 [2020-12-01T14:38:13.170Z] [INFO] Building org.eclipse.ease.lang.python.jython.test 0.8.0-SNAPSHOT [43/48]
09:38:13 [2020-12-01T14:38:13.170Z] [INFO] ------------------------[ eclipse-test-plugin ]-------------------------
09:38:13 [2020-12-01T14:38:13.170Z] [INFO] 
09:38:13 [2020-12-01T14:38:13.170Z] [INFO] --- maven-clean-plugin:2.5:clean (default-clean) @ org.eclipse.ease.lang.python.jython.test ---
09:38:13 [2020-12-01T14:38:13.170Z] [INFO] 
09:38:13 [2020-12-01T14:38:13.170Z] [INFO] --- tycho-packaging-plugin:1.5.0:build-qualifier (default-build-qualifier) @ org.eclipse.ease.lang.python.jython.test ---
09:38:13 [2020-12-01T14:38:13.170Z] [INFO] The project's OSGi version is 0.8.0.I201911291239
09:38:13 [2020-12-01T14:38:13.170Z] [INFO] 
09:38:13 [2020-12-01T14:38:13.170Z] [INFO] --- tycho-packaging-plugin:1.5.0:validate-id (default-validate-id) @ org.eclipse.ease.lang.python.jython.test ---
09:38:13 [2020-12-01T14:38:13.170Z] [INFO] 
09:38:13 [2020-12-01T14:38:13.170Z] [INFO] --- tycho-packaging-plugin:1.5.0:validate-version (default-validate-version) @ org.eclipse.ease.lang.python.jython.test ---
09:38:13 [2020-12-01T14:38:13.170Z] [INFO] 
09:38:13 [2020-12-01T14:38:13.170Z] [INFO] >>> maven-javadoc-plugin:2.9.1:javadoc (build-docs) > generate-sources @ org.eclipse.ease.lang.python.jython.test >>>
09:38:13 [2020-12-01T14:38:13.170Z] [INFO] 
09:38:13 [2020-12-01T14:38:13.170Z] [INFO] --- tycho-packaging-plugin:1.5.0:build-qualifier (default-build-qualifier) @ org.eclipse.ease.lang.python.jython.test ---
09:38:13 [2020-12-01T14:38:13.170Z] [INFO] The project's OSGi version is 0.8.0.I201911291239
09:38:13 [2020-12-01T14:38:13.170Z] [INFO] 
09:38:13 [2020-12-01T14:38:13.170Z] [INFO] --- tycho-packaging-plugin:1.5.0:validate-id (default-validate-id) @ org.eclipse.ease.lang.python.jython.test ---
09:38:13 [2020-12-01T14:38:13.170Z] [INFO] 
09:38:13 [2020-12-01T14:38:13.170Z] [INFO] --- tycho-packaging-plugin:1.5.0:validate-version (default-validate-version) @ org.eclipse.ease.lang.python.jython.test ---
09:38:13 [2020-12-01T14:38:13.170Z] [INFO] 
09:38:13 [2020-12-01T14:38:13.170Z] [INFO] <<< maven-javadoc-plugin:2.9.1:javadoc (build-docs) < generate-sources @ org.eclipse.ease.lang.python.jython.test <<<
09:38:13 [2020-12-01T14:38:13.170Z] [INFO] 
09:38:13 [2020-12-01T14:38:13.170Z] [INFO] 
09:38:13 [2020-12-01T14:38:13.170Z] [INFO] --- maven-javadoc-plugin:2.9.1:javadoc (build-docs) @ org.eclipse.ease.lang.python.jython.test ---
09:38:13 [2020-12-01T14:38:13.426Z] [ERROR] Error fetching link: http://help.eclipse.org/oxygen/topic/org.eclipse.platform.doc.isv/reference/api/package-list. Ignored it.
09:38:13 [2020-12-01T14:38:13.426Z] [ERROR] Error fetching link: https://ci.eclipse.org/ease/job/ease.build.core/JavaDoc/package-list. Ignored it.
09:38:14 [2020-12-01T14:38:14.355Z] [INFO] 
09:38:14 [2020-12-01T14:38:14.355Z] Loading source files for package org.eclipse.ease.lang.python.jython.debugger...
09:38:14 [2020-12-01T14:38:14.355Z] Constructing Javadoc information...
09:38:14 [2020-12-01T14:38:14.355Z] WARNING: Cannot open location "/home/jenkins/agent/workspace/ease.verify.core.target.2019-06/tests/org.eclipse.ease.lang.python.jython.test/target/javadoc-bundle-options/package-list"
09:38:14 [2020-12-01T14:38:14.355Z] No plugin definition found, skipping
09:38:14 [2020-12-01T14:38:14.355Z] No plugin definition found, skipping
09:38:14 [2020-12-01T14:38:14.355Z] [WARNING] Javadoc Warnings
09:38:14 [2020-12-01T14:38:14.355Z] [WARNING] Picked up JAVA_TOOL_OPTIONS: -Dmaven.ext.class.path="/home/jenkins/agent/workspace/ease.verify.core.target.2019-06@tmp/withMavenda45dd09/pipeline-maven-spy.jar" -Dorg.jenkinsci.plugins.pipeline.maven.reportsFolder="/home/jenkins/agent/workspace/ease.verify.core.target.2019-06@tmp/withMavenda45dd09"
09:38:14 [2020-12-01T14:38:14.355Z] [WARNING] javadoc: warning - The old Doclet and Taglet APIs in the packages
09:38:14 [2020-12-01T14:38:14.355Z] [WARNING] com.sun.javadoc, com.sun.tools.doclets and their implementations
09:38:14 [2020-12-01T14:38:14.355Z] [WARNING] are planned to be removed in a future JDK release. These
09:38:14 [2020-12-01T14:38:14.355Z] [WARNING] components have been superseded by the new APIs in jdk.javadoc.doclet.
09:38:14 [2020-12-01T14:38:14.355Z] [WARNING] Users are strongly recommended to migrate to the new APIs.
09:38:14 [2020-12-01T14:38:14.355Z] [INFO] 
09:38:14 [2020-12-01T14:38:14.355Z] [INFO] --- build-helper-maven-plugin:1.9.1:add-resource (add_help) @ org.eclipse.ease.lang.python.jython.test ---
09:38:14 [2020-12-01T14:38:14.355Z] [INFO] 
09:38:14 [2020-12-01T14:38:14.355Z] [INFO] --- maven-resources-plugin:2.4.3:resources (default-resources) @ org.eclipse.ease.lang.python.jython.test ---
09:38:14 [2020-12-01T14:38:14.355Z] [INFO] Using 'UTF-8' encoding to copy filtered resources.
09:38:14 [2020-12-01T14:38:14.355Z] [INFO] skip non existing resourceDirectory /home/jenkins/agent/workspace/ease.verify.core.target.2019-06/tests/org.eclipse.ease.lang.python.jython.test/src/main/resources
09:38:14 [2020-12-01T14:38:14.355Z] [INFO] skip non existing resourceDirectory /home/jenkins/agent/workspace/ease.verify.core.target.2019-06/tests/org.eclipse.ease.lang.python.jython.test/help
09:38:14 [2020-12-01T14:38:14.355Z] [INFO] 
09:38:14 [2020-12-01T14:38:14.355Z] [INFO] --- tycho-compiler-plugin:1.5.0:compile (default-compile) @ org.eclipse.ease.lang.python.jython.test ---
09:38:14 [2020-12-01T14:38:14.355Z] [INFO] Compiling 1 source file to /home/jenkins/agent/workspace/ease.verify.core.target.2019-06/tests/org.eclipse.ease.lang.python.jython.test/target/classes
09:38:14 [2020-12-01T14:38:14.611Z] [INFO] 
09:38:14 [2020-12-01T14:38:14.611Z] [INFO] --- maven-resources-plugin:2.4.3:testResources (default-testResources) @ org.eclipse.ease.lang.python.jython.test ---
09:38:14 [2020-12-01T14:38:14.611Z] [INFO] Using 'UTF-8' encoding to copy filtered resources.
09:38:14 [2020-12-01T14:38:14.611Z] [INFO] skip non existing resourceDirectory /home/jenkins/agent/workspace/ease.verify.core.target.2019-06/tests/org.eclipse.ease.lang.python.jython.test/src/test/resources
09:38:14 [2020-12-01T14:38:14.611Z] [INFO] 
09:38:14 [2020-12-01T14:38:14.611Z] [INFO] --- tycho-source-plugin:1.5.0:plugin-source (plugin-source) @ org.eclipse.ease.lang.python.jython.test ---
09:38:14 [2020-12-01T14:38:14.611Z] [WARNING] Bundle-Vendor header not found in /home/jenkins/agent/workspace/ease.verify.core.target.2019-06/tests/org.eclipse.ease.lang.python.jython.test/META-INF/MANIFEST.MF, fallback to 'unknown' for source bundle
09:38:14 [2020-12-01T14:38:14.611Z] [INFO] Building jar: /home/jenkins/agent/workspace/ease.verify.core.target.2019-06/tests/org.eclipse.ease.lang.python.jython.test/target/org.eclipse.ease.lang.python.jython.test-0.8.0-SNAPSHOT-sources.jar
09:38:14 [2020-12-01T14:38:14.611Z] [INFO] 
09:38:14 [2020-12-01T14:38:14.611Z] [INFO] --- target-platform-configuration:1.5.0:target-platform (default-target-platform) @ org.eclipse.ease.lang.python.jython.test ---
09:38:14 [2020-12-01T14:38:14.611Z] [INFO] 
09:38:14 [2020-12-01T14:38:14.611Z] [INFO] --- tycho-packaging-plugin:1.5.0:package-plugin (default-package-plugin) @ org.eclipse.ease.lang.python.jython.test ---
09:38:14 [2020-12-01T14:38:14.611Z] [INFO] Building jar: /home/jenkins/agent/workspace/ease.verify.core.target.2019-06/tests/org.eclipse.ease.lang.python.jython.test/target/org.eclipse.ease.lang.python.jython.test-0.8.0-SNAPSHOT.jar
09:38:14 [2020-12-01T14:38:14.611Z] [INFO] 
09:38:14 [2020-12-01T14:38:14.611Z] [INFO] --- tycho-p2-plugin:1.5.0:p2-metadata-default (default-p2-metadata-default) @ org.eclipse.ease.lang.python.jython.test ---
09:38:14 [2020-12-01T14:38:14.611Z] [INFO] 
09:38:14 [2020-12-01T14:38:14.611Z] [INFO] --- tycho-source-feature-plugin:1.5.0:source-feature (source-feature) @ org.eclipse.ease.lang.python.jython.test ---
09:38:14 [2020-12-01T14:38:14.611Z] [INFO] 
09:38:14 [2020-12-01T14:38:14.611Z] [INFO] --- tycho-p2-plugin:1.5.0:p2-metadata (attached-p2-metadata) @ org.eclipse.ease.lang.python.jython.test ---
09:38:14 [2020-12-01T14:38:14.611Z] [INFO] 
09:38:14 [2020-12-01T14:38:14.611Z] [INFO] --- tycho-surefire-plugin:1.5.0:test (default-test) @ org.eclipse.ease.lang.python.jython.test ---
09:38:15 [2020-12-01T14:38:15.172Z] [INFO] Expected eclipse log file: /home/jenkins/agent/workspace/ease.verify.core.target.2019-06/tests/org.eclipse.ease.lang.python.jython.test/target/work/data/.metadata/.log
09:38:15 [2020-12-01T14:38:15.172Z] [INFO] Command line:
09:38:15 [2020-12-01T14:38:15.172Z] 	[/opt/tools/java/openjdk/jdk-11/11.0.2+9/bin/java, -Dosgi.noShutdown=false, -Dosgi.os=linux, -Dosgi.ws=gtk, -Dosgi.arch=x86_64, -Dosgi.clean=true, -jar, /home/jenkins/.m2/repository/p2/osgi/bundle/org.eclipse.equinox.launcher/1.5.800.v20200727-1323/org.eclipse.equinox.launcher-1.5.800.v20200727-1323.jar, -data, /home/jenkins/agent/workspace/ease.verify.core.target.2019-06/tests/org.eclipse.ease.lang.python.jython.test/target/work/data, -install, /home/jenkins/agent/workspace/ease.verify.core.target.2019-06/tests/org.eclipse.ease.lang.python.jython.test/target/work, -configuration, /home/jenkins/agent/workspace/ease.verify.core.target.2019-06/tests/org.eclipse.ease.lang.python.jython.test/target/work/configuration, -application, org.eclipse.tycho.surefire.osgibooter.headlesstest, -testproperties, /home/jenkins/agent/workspace/ease.verify.core.target.2019-06/tests/org.eclipse.ease.lang.python.jython.test/target/surefire.properties]
09:38:15 [2020-12-01T14:38:15.172Z] Picked up JAVA_TOOL_OPTIONS: -Dmaven.ext.class.path="/home/jenkins/agent/workspace/ease.verify.core.target.2019-06@tmp/withMavenda45dd09/pipeline-maven-spy.jar" -Dorg.jenkinsci.plugins.pipeline.maven.reportsFolder="/home/jenkins/agent/workspace/ease.verify.core.target.2019-06@tmp/withMavenda45dd09" 
09:38:17 [2020-12-01T14:38:17.064Z] WARNING: An illegal reflective access operation has occurred
09:38:17 [2020-12-01T14:38:17.064Z] WARNING: Illegal reflective access by org.python.core.PySystemState (file:/home/jenkins/agent/workspace/ease.verify.core.target.2019-06/tests/org.eclipse.ease.lang.python.jython.test/target/work/plugins/org.jython_2.7.0.I201609090924/jython.jar) to method java.io.Console.encoding()
09:38:17 [2020-12-01T14:38:17.064Z] WARNING: Please consider reporting this to the maintainers of org.python.core.PySystemState
09:38:17 [2020-12-01T14:38:17.064Z] WARNING: Use --illegal-access=warn to enable warnings of further illegal reflective access operations
09:38:17 [2020-12-01T14:38:17.064Z] WARNING: All illegal access operations will be denied in a future release
09:38:17 [2020-12-01T14:38:17.321Z] Running org.eclipse.ease.lang.python.jython.debugger.JythonDebugTest
09:38:19 [2020-12-01T14:38:19.247Z] Start of script
09:38:19 [2020-12-01T14:38:19.247Z] include file start
09:38:19 [2020-12-01T14:38:19.247Z] include file processed
09:38:19 [2020-12-01T14:38:19.247Z] Result of testMethod = 5
09:38:19 [2020-12-01T14:38:19.247Z] End of script
09:38:19 [2020-12-01T14:38:19.247Z] Start of script
09:38:19 [2020-12-01T14:38:19.247Z] include file start
09:38:19 [2020-12-01T14:38:19.247Z] include file processed
09:38:19 [2020-12-01T14:38:19.247Z] Result of testMethod = 5
09:38:19 [2020-12-01T14:38:19.247Z] End of script
09:38:19 [2020-12-01T14:38:19.503Z] Start of script
09:38:19 [2020-12-01T14:38:19.503Z] include file start
09:38:19 [2020-12-01T14:38:19.503Z] include file processed
09:38:19 [2020-12-01T14:38:19.503Z] Result of testMethod = 5
09:38:19 [2020-12-01T14:38:19.759Z] Traceback (most recent call last):
09:38:19 [2020-12-01T14:38:19.759Z]   File "(none)", line 184, in run
09:38:19 [2020-12-01T14:38:19.759Z]   File "__ref_L/Debug Test/Main.py_llbnunnhpe", line 23, in <module>
09:38:19 [2020-12-01T14:38:19.759Z]   File "(none)", line 161, in trace_dispatch
09:38:19 [2020-12-01T14:38:19.759Z] org.eclipse.ease.ExitException: 
09:38:19 [2020-12-01T14:38:19.759Z] 
09:38:19 [2020-12-01T14:38:19.759Z] org.eclipse.ease.ExitException: org.eclipse.ease.ExitException: 
09:38:19 [2020-12-01T14:38:19.759Z] Start of script
09:38:19 [2020-12-01T14:38:19.759Z] include file start
09:38:19 [2020-12-01T14:38:19.759Z] include file processed
09:38:20 [2020-12-01T14:38:20.015Z] Result of testMethod = 5
09:38:20 [2020-12-01T14:38:20.015Z] End of script
09:38:20 [2020-12-01T14:38:20.270Z] Start of script
09:38:20 [2020-12-01T14:38:20.270Z] include file start
09:38:20 [2020-12-01T14:38:20.270Z] include file processed
09:38:20 [2020-12-01T14:38:20.270Z] Result of testMethod = 5
09:38:20 [2020-12-01T14:38:20.270Z] End of script
09:38:20 [2020-12-01T14:38:20.526Z] Start of script
09:38:20 [2020-12-01T14:38:20.526Z] include file start
09:38:20 [2020-12-01T14:38:20.526Z] include file processed
09:38:20 [2020-12-01T14:38:20.526Z] Result of testMethod = 5
09:38:20 [2020-12-01T14:38:20.526Z] End of script
09:38:20 [2020-12-01T14:38:20.782Z] Start of script
09:38:20 [2020-12-01T14:38:20.782Z] include file start
09:38:20 [2020-12-01T14:38:20.782Z] include file processed
09:38:20 [2020-12-01T14:38:20.782Z] Result of testMethod = 5
09:38:20 [2020-12-01T14:38:20.782Z] Traceback (most recent call last):
09:38:20 [2020-12-01T14:38:20.782Z]   File "(none)", line 184, in run
09:38:20 [2020-12-01T14:38:20.782Z]   File "__ref_L/Debug Test/Main.py_yyiluauxuw", line 23, in <module>
09:38:20 [2020-12-01T14:38:20.782Z]   File "(none)", line 161, in trace_dispatch
09:38:20 [2020-12-01T14:38:20.782Z] org.eclipse.ease.ExitException: 
09:38:20 [2020-12-01T14:38:20.782Z] 
09:38:20 [2020-12-01T14:38:20.782Z] org.eclipse.ease.ExitException: org.eclipse.ease.ExitException: 
09:38:21 [2020-12-01T14:38:21.037Z] Start of script
09:38:21 [2020-12-01T14:38:21.037Z] include file start
09:38:21 [2020-12-01T14:38:21.037Z] include file processed
09:38:21 [2020-12-01T14:38:21.293Z] Result of testMethod = 5
09:38:21 [2020-12-01T14:38:21.293Z] End of script
09:38:21 [2020-12-01T14:38:21.293Z] Start of script
09:38:21 [2020-12-01T14:38:21.293Z] include file start
09:38:21 [2020-12-01T14:38:21.293Z] include file processed
09:38:21 [2020-12-01T14:38:21.293Z] Result of testMethod = 5
09:38:21 [2020-12-01T14:38:21.293Z] End of script
09:38:21 [2020-12-01T14:38:21.549Z] Start of script
09:38:21 [2020-12-01T14:38:21.549Z] include file start
09:38:21 [2020-12-01T14:38:21.549Z] include file processed
09:38:21 [2020-12-01T14:38:21.805Z] Traceback (most recent call last):
09:38:21 [2020-12-01T14:38:21.805Z]   File "(none)", line 184, in run
09:38:21 [2020-12-01T14:38:21.805Z]   File "__ref_L/Debug Test/Main.py_awdhaqwias", line 22, in <module>
09:38:21 [2020-12-01T14:38:21.805Z]   File "(none)", line 161, in trace_dispatch
09:38:21 [2020-12-01T14:38:21.805Z] org.eclipse.ease.ExitException: 
09:38:21 [2020-12-01T14:38:21.805Z] 
09:38:21 [2020-12-01T14:38:21.805Z] org.eclipse.ease.ExitException: org.eclipse.ease.ExitException: 
09:38:22 [2020-12-01T14:38:22.061Z] Start of script
09:38:22 [2020-12-01T14:38:22.061Z] include file start
09:38:22 [2020-12-01T14:38:22.061Z] include file processed
09:38:22 [2020-12-01T14:38:22.061Z] Result of testMethod = 5
09:38:22 [2020-12-01T14:38:22.061Z] End of script
09:38:22 [2020-12-01T14:38:22.316Z] Start of script
09:38:22 [2020-12-01T14:38:22.316Z] include file start
09:38:22 [2020-12-01T14:38:22.316Z] include file processed
09:38:22 [2020-12-01T14:38:22.592Z] Result of testMethod = 5
09:38:22 [2020-12-01T14:38:22.592Z] End of script
09:38:22 [2020-12-01T14:38:22.592Z] Traceback (most recent call last):
09:38:22 [2020-12-01T14:38:22.592Z]   File "(none)", line 184, in run
09:38:22 [2020-12-01T14:38:22.592Z]   File "__ref_L/Debug Test/Main.py_tsdnktpqwo", line 1, in <module>
09:38:22 [2020-12-01T14:38:22.592Z]   File "(none)", line 161, in trace_dispatch
09:38:22 [2020-12-01T14:38:22.592Z] org.eclipse.ease.ExitException: 
09:38:22 [2020-12-01T14:38:22.592Z] 
09:38:22 [2020-12-01T14:38:22.592Z] org.eclipse.ease.ExitException: org.eclipse.ease.ExitException: 
09:38:22 [2020-12-01T14:38:22.855Z] Start of script
09:38:22 [2020-12-01T14:38:22.855Z] include file start
09:38:22 [2020-12-01T14:38:22.855Z] include file processed
09:38:22 [2020-12-01T14:38:22.855Z] Result of testMethod = 5
09:38:22 [2020-12-01T14:38:22.855Z] End of script
09:38:23 [2020-12-01T14:38:23.111Z] Start of script
09:38:23 [2020-12-01T14:38:23.111Z] include file start
09:38:23 [2020-12-01T14:38:23.111Z] include file processed
09:38:23 [2020-12-01T14:38:23.111Z] Result of testMethod = 5
09:38:23 [2020-12-01T14:38:23.111Z] End of script
09:38:23 [2020-12-01T14:38:23.368Z] Start of script
09:38:23 [2020-12-01T14:38:23.368Z] include file start
09:38:23 [2020-12-01T14:38:23.368Z] include file processed
09:38:23 [2020-12-01T14:38:23.368Z] Result of testMethod = 5
09:38:23 [2020-12-01T14:38:23.368Z] Traceback (most recent call last):
09:38:23 [2020-12-01T14:38:23.368Z]   File "(none)", line 184, in run
09:38:23 [2020-12-01T14:38:23.368Z]   File "__ref_L/Debug Test/Main.py_wlwnvajhao", line 23, in <module>
09:38:23 [2020-12-01T14:38:23.368Z]   File "(none)", line 161, in trace_dispatch
09:38:23 [2020-12-01T14:38:23.368Z] org.eclipse.ease.ExitException: 
09:38:23 [2020-12-01T14:38:23.368Z] 
09:38:23 [2020-12-01T14:38:23.368Z] org.eclipse.ease.ExitException: org.eclipse.ease.ExitException: 
09:38:23 [2020-12-01T14:38:23.624Z] Start of script
09:38:23 [2020-12-01T14:38:23.624Z] include file start
09:38:23 [2020-12-01T14:38:23.624Z] include file processed
09:38:23 [2020-12-01T14:38:23.880Z] Result of testMethod = 5
09:38:23 [2020-12-01T14:38:23.880Z] End of script
09:38:24 [2020-12-01T14:38:24.135Z] Traceback (most recent call last):
09:38:24 [2020-12-01T14:38:24.135Z]   File "(none)", line 184, in run
09:38:24 [2020-12-01T14:38:24.135Z]   File "__ref_L/Debug Test/Main.py_tadqwzzpcp", line 1, in <module>
09:38:24 [2020-12-01T14:38:24.135Z]   File "(none)", line 161, in trace_dispatch
09:38:24 [2020-12-01T14:38:24.135Z] org.eclipse.ease.ExitException: 
09:38:24 [2020-12-01T14:38:24.135Z] 
09:38:24 [2020-12-01T14:38:24.135Z] org.eclipse.ease.ExitException: org.eclipse.ease.ExitException: 
09:38:24 [2020-12-01T14:38:24.135Z] Start of script
09:38:24 [2020-12-01T14:38:24.135Z] include file start
09:38:24 [2020-12-01T14:38:24.135Z] include file processed
09:38:24 [2020-12-01T14:38:24.135Z] Result of testMethod = 5
09:38:24 [2020-12-01T14:38:24.135Z] End of script
09:38:24 [2020-12-01T14:38:24.391Z] Start of script
09:38:24 [2020-12-01T14:38:24.391Z] include file start
09:38:24 [2020-12-01T14:38:24.391Z] include file processed
09:38:24 [2020-12-01T14:38:24.646Z] Result of testMethod = 5
09:38:24 [2020-12-01T14:38:24.646Z] End of script
09:38:24 [2020-12-01T14:38:24.646Z] Traceback (most recent call last):
09:38:24 [2020-12-01T14:38:24.646Z]   File "(none)", line 184, in run
09:38:24 [2020-12-01T14:38:24.646Z]   File "__ref_L/Debug Test/Main.py_flftkcbtfq", line 1, in <module>
09:38:24 [2020-12-01T14:38:24.646Z]   File "(none)", line 161, in trace_dispatch
09:38:24 [2020-12-01T14:38:24.646Z] org.eclipse.ease.ExitException: 
09:38:24 [2020-12-01T14:38:24.646Z] 
09:38:24 [2020-12-01T14:38:24.646Z] org.eclipse.ease.ExitException: org.eclipse.ease.ExitException: 
09:38:24 [2020-12-01T14:38:24.902Z] Start of script
09:38:24 [2020-12-01T14:38:24.902Z] include file start
09:38:24 [2020-12-01T14:38:24.902Z] include file processed
09:38:25 [2020-12-01T14:38:25.158Z] Result of testMethod = 5
09:38:25 [2020-12-01T14:38:25.158Z] End of script
09:38:25 [2020-12-01T14:38:25.158Z] Start of script
09:38:25 [2020-12-01T14:38:25.158Z] include file start
09:38:25 [2020-12-01T14:38:25.158Z] include file processed
09:38:25 [2020-12-01T14:38:25.158Z] Result of testMethod = 5
09:38:25 [2020-12-01T14:38:25.414Z] Traceback (most recent call last):
09:38:25 [2020-12-01T14:38:25.414Z]   File "(none)", line 184, in run
09:38:25 [2020-12-01T14:38:25.414Z]   File "__ref_L/Debug Test/Main.py_gfdabtzkuz", line 23, in <module>
09:38:25 [2020-12-01T14:38:25.414Z]   File "(none)", line 161, in trace_dispatch
09:38:25 [2020-12-01T14:38:25.414Z] org.eclipse.ease.ExitException: 
09:38:25 [2020-12-01T14:38:25.414Z] 
09:38:25 [2020-12-01T14:38:25.414Z] org.eclipse.ease.ExitException: org.eclipse.ease.ExitException: 
09:38:25 [2020-12-01T14:38:25.669Z] Start of script
09:38:25 [2020-12-01T14:38:25.669Z] include file start
09:38:25 [2020-12-01T14:38:25.669Z] include file processed
09:38:25 [2020-12-01T14:38:25.669Z] Result of testMethod = 5
09:38:25 [2020-12-01T14:38:25.669Z] End of script
09:38:25 [2020-12-01T14:38:25.669Z] Start of script
09:38:25 [2020-12-01T14:38:25.669Z] include file start
09:38:25 [2020-12-01T14:38:25.669Z] include file processed
09:38:25 [2020-12-01T14:38:25.925Z] Result of testMethod = 5
09:38:25 [2020-12-01T14:38:25.925Z] End of script
09:38:25 [2020-12-01T14:38:25.925Z] Start of script
09:38:25 [2020-12-01T14:38:25.925Z] include file start
09:38:25 [2020-12-01T14:38:25.925Z] include file processed
09:38:25 [2020-12-01T14:38:25.925Z] Result of testMethod = 5
09:38:25 [2020-12-01T14:38:25.925Z] End of script
09:38:26 [2020-12-01T14:38:26.181Z] Start of script
09:38:26 [2020-12-01T14:38:26.181Z] include file start
09:38:26 [2020-12-01T14:38:26.181Z] include file processed
09:38:26 [2020-12-01T14:38:26.181Z] Result of testMethod = 5
09:38:26 [2020-12-01T14:38:26.181Z] End of script
09:38:26 [2020-12-01T14:38:26.436Z] Start of script
09:38:26 [2020-12-01T14:38:26.436Z] include file start
09:38:26 [2020-12-01T14:38:26.436Z] include file processed
09:38:26 [2020-12-01T14:38:26.692Z] Traceback (most recent call last):
09:38:26 [2020-12-01T14:38:26.692Z]   File "(none)", line 184, in run
09:38:26 [2020-12-01T14:38:26.692Z]   File "__ref_L/Debug Test/Main.py_ldgixmjxqn", line 21, in <module>
09:38:26 [2020-12-01T14:38:26.692Z]   File "__ref_L/Debug Test/Main.py_ldgixmjxqn", line 18, in testMethod
09:38:26 [2020-12-01T14:38:26.692Z]   File "(none)", line 161, in trace_dispatch
09:38:26 [2020-12-01T14:38:26.692Z] org.eclipse.ease.ExitException: 
09:38:26 [2020-12-01T14:38:26.692Z] 
09:38:26 [2020-12-01T14:38:26.692Z] org.eclipse.ease.ExitException: org.eclipse.ease.ExitException: 
09:38:26 [2020-12-01T14:38:26.692Z] Start of script
09:38:26 [2020-12-01T14:38:26.948Z] include file start
09:38:26 [2020-12-01T14:38:26.948Z] include file processed
09:38:26 [2020-12-01T14:38:26.948Z] Result of testMethod = 5
09:38:26 [2020-12-01T14:38:26.948Z] End of script
09:38:26 [2020-12-01T14:38:26.948Z] Start of script
09:38:26 [2020-12-01T14:38:26.948Z] include file start
09:38:26 [2020-12-01T14:38:26.948Z] include file processed
09:38:26 [2020-12-01T14:38:26.948Z] Result of testMethod = 5
09:38:27 [2020-12-01T14:38:27.204Z] Traceback (most recent call last):
09:38:27 [2020-12-01T14:38:27.204Z]   File "(none)", line 184, in run
09:38:27 [2020-12-01T14:38:27.204Z]   File "__ref_L/Debug Test/Main.py_etscvrqlga", line 23, in <module>
09:38:27 [2020-12-01T14:38:27.204Z]   File "(none)", line 161, in trace_dispatch
09:38:27 [2020-12-01T14:38:27.204Z] org.eclipse.ease.ExitException: 
09:38:27 [2020-12-01T14:38:27.204Z] 
09:38:27 [2020-12-01T14:38:27.204Z] org.eclipse.ease.ExitException: org.eclipse.ease.ExitException: 
09:38:27 [2020-12-01T14:38:27.204Z] Start of script
09:38:27 [2020-12-01T14:38:27.204Z] include file start
09:38:27 [2020-12-01T14:38:27.204Z] include file processed
09:38:27 [2020-12-01T14:38:27.204Z] Result of testMethod = 5
09:38:27 [2020-12-01T14:38:27.459Z] End of script
09:38:27 [2020-12-01T14:38:27.459Z] Start of script
09:38:27 [2020-12-01T14:38:27.459Z] include file start
09:38:27 [2020-12-01T14:38:27.459Z] include file processed
09:38:27 [2020-12-01T14:38:27.715Z] Result of testMethod = 5
09:38:27 [2020-12-01T14:38:27.715Z] End of script
09:38:27 [2020-12-01T14:38:27.715Z] Start of script
09:38:27 [2020-12-01T14:38:27.715Z] include file start
09:38:27 [2020-12-01T14:38:27.715Z] include file processed
09:38:27 [2020-12-01T14:38:27.970Z] Result of testMethod = 5
09:38:27 [2020-12-01T14:38:27.970Z] End of script
09:38:28 [2020-12-01T14:38:28.226Z] Start of script
09:38:28 [2020-12-01T14:38:28.226Z] include file start
09:38:28 [2020-12-01T14:38:28.226Z] include file processed
09:38:28 [2020-12-01T14:38:28.226Z] Result of testMethod = 5
09:38:28 [2020-12-01T14:38:28.226Z] End of script
09:38:28 [2020-12-01T14:38:28.226Z] Start of script
09:38:28 [2020-12-01T14:38:28.226Z] include file start
09:38:28 [2020-12-01T14:38:28.226Z] include file processed
09:38:28 [2020-12-01T14:38:28.226Z] Result of testMethod = 5
09:38:28 [2020-12-01T14:38:28.482Z] Traceback (most recent call last):
09:38:28 [2020-12-01T14:38:28.482Z]   File "(none)", line 184, in run
09:38:28 [2020-12-01T14:38:28.482Z]   File "__ref_L/Debug Test/Main.py_agawgtjyry", line 23, in <module>
09:38:28 [2020-12-01T14:38:28.482Z]   File "(none)", line 161, in trace_dispatch
09:38:28 [2020-12-01T14:38:28.482Z] org.eclipse.ease.ExitException: 
09:38:28 [2020-12-01T14:38:28.482Z] 
09:38:28 [2020-12-01T14:38:28.482Z] org.eclipse.ease.ExitException: org.eclipse.ease.ExitException: 
09:38:28 [2020-12-01T14:38:28.737Z] Start of script
09:38:28 [2020-12-01T14:38:28.737Z] include file start
09:38:28 [2020-12-01T14:38:28.737Z] include file processed
09:38:28 [2020-12-01T14:38:28.737Z] Result of testMethod = 5
09:38:28 [2020-12-01T14:38:28.737Z] End of script
09:38:28 [2020-12-01T14:38:28.737Z] Start of script
09:38:28 [2020-12-01T14:38:28.737Z] include file start
09:38:28 [2020-12-01T14:38:28.737Z] include file processed
09:38:28 [2020-12-01T14:38:28.737Z] Result of testMethod = 5
09:38:28 [2020-12-01T14:38:28.993Z] Traceback (most recent call last):
09:38:28 [2020-12-01T14:38:28.993Z]   File "(none)", line 184, in run
09:38:28 [2020-12-01T14:38:28.993Z]   File "__ref_L/Debug Test/Main.py_qmfnonadmy", line 23, in <module>
09:38:28 [2020-12-01T14:38:28.993Z]   File "(none)", line 161, in trace_dispatch
09:38:28 [2020-12-01T14:38:28.993Z] org.eclipse.ease.ExitException: 
09:38:28 [2020-12-01T14:38:28.993Z] 
09:38:28 [2020-12-01T14:38:28.993Z] org.eclipse.ease.ExitException: org.eclipse.ease.ExitException: 
09:38:29 [2020-12-01T14:38:29.249Z] Traceback (most recent call last):
09:38:29 [2020-12-01T14:38:29.249Z]   File "(none)", line 184, in run
09:38:29 [2020-12-01T14:38:29.249Z]   File "__ref_L/Debug Test/Main.py_uubbyeessu", line 1, in <module>
09:38:29 [2020-12-01T14:38:29.249Z]   File "(none)", line 161, in trace_dispatch
09:38:29 [2020-12-01T14:38:29.249Z] org.eclipse.ease.ExitException: 
09:38:29 [2020-12-01T14:38:29.249Z] 
09:38:29 [2020-12-01T14:38:29.249Z] org.eclipse.ease.ExitException: org.eclipse.ease.ExitException: 
09:38:29 [2020-12-01T14:38:29.504Z] Start of script
09:38:29 [2020-12-01T14:38:29.504Z] include file start
09:38:29 [2020-12-01T14:38:29.504Z] include file processed
09:38:29 [2020-12-01T14:38:29.504Z] Result of testMethod = 5
09:38:29 [2020-12-01T14:38:29.504Z] End of script
09:38:29 [2020-12-01T14:38:29.504Z] Start of script
09:38:29 [2020-12-01T14:38:29.504Z] include file start
09:38:29 [2020-12-01T14:38:29.504Z] include file processed
09:38:29 [2020-12-01T14:38:29.762Z] Result of testMethod = 5
09:38:29 [2020-12-01T14:38:29.762Z] End of script
09:38:29 [2020-12-01T14:38:29.762Z] Start of script
09:38:29 [2020-12-01T14:38:29.762Z] include file start
09:38:29 [2020-12-01T14:38:29.762Z] include file processed
09:38:29 [2020-12-01T14:38:29.762Z] Result of testMethod = 5
09:38:30 [2020-12-01T14:38:30.018Z] End of script
09:38:30 [2020-12-01T14:38:30.018Z] Tests run: 42, Failures: 0, Errors: 0, Skipped: 0, Time elapsed: 12.813 s - in org.eclipse.ease.lang.python.jython.debugger.JythonDebugTest
09:38:30 [2020-12-01T14:38:30.018Z] disconnectProcessInSuspendedState(org.eclipse.ease.lang.python.jython.debugger.JythonDebugTest)  Time elapsed: 1.947 s
09:38:30 [2020-12-01T14:38:30.018Z] stepReturnIncludeCommand(org.eclipse.ease.lang.python.jython.debugger.JythonDebugTest)  Time elapsed: 0.212 s
09:38:30 [2020-12-01T14:38:30.018Z] arrayVariableSorting(org.eclipse.ease.lang.python.jython.debugger.JythonDebugTest)  Time elapsed: 0.313 s
09:38:30 [2020-12-01T14:38:30.018Z] stepOverOnDebugTarget(org.eclipse.ease.lang.python.jython.debugger.JythonDebugTest)  Time elapsed: 0.313 s
09:38:30 [2020-12-01T14:38:30.018Z] hasDebugTarget(org.eclipse.ease.lang.python.jython.debugger.JythonDebugTest)  Time elapsed: 0.108 s
09:38:30 [2020-12-01T14:38:30.018Z] disconnectThreadInSuspendedState(org.eclipse.ease.lang.python.jython.debugger.JythonDebugTest)  Time elapsed: 0.214 s
09:38:30 [2020-12-01T14:38:30.018Z] stepReturnOnDebugTarget(org.eclipse.ease.lang.python.jython.debugger.JythonDebugTest)  Time elapsed: 0.308 s
09:38:30 [2020-12-01T14:38:30.018Z] nullVariable(org.eclipse.ease.lang.python.jython.debugger.JythonDebugTest)  Time elapsed: 0.307 s
09:38:30 [2020-12-01T14:38:30.018Z] stepOverOnStackFrame(org.eclipse.ease.lang.python.jython.debugger.JythonDebugTest)  Time elapsed: 0.308 s
09:38:30 [2020-12-01T14:38:30.018Z] resumeOnDebugTarget(org.eclipse.ease.lang.python.jython.debugger.JythonDebugTest)  Time elapsed: 0.206 s
09:38:30 [2020-12-01T14:38:30.018Z] modifyVariableKeepingType(org.eclipse.ease.lang.python.jython.debugger.JythonDebugTest)  Time elapsed: 0.509 s
09:38:30 [2020-12-01T14:38:30.018Z] resumeOnLastIncludeLine(org.eclipse.ease.lang.python.jython.debugger.JythonDebugTest)  Time elapsed: 0.216 s
09:38:30 [2020-12-01T14:38:30.018Z] stepReturnOnStackFrame(org.eclipse.ease.lang.python.jython.debugger.JythonDebugTest)  Time elapsed: 0.316 s
09:38:30 [2020-12-01T14:38:30.018Z] terminateStackFrameInSuspendedState(org.eclipse.ease.lang.python.jython.debugger.JythonDebugTest)  Time elapsed: 0.209 s
09:38:30 [2020-12-01T14:38:30.018Z] breakpointLocation(org.eclipse.ease.lang.python.jython.debugger.JythonDebugTest)  Time elapsed: 0.219 s
09:38:30 [2020-12-01T14:38:30.018Z] stepReturnOnThread(org.eclipse.ease.lang.python.jython.debugger.JythonDebugTest)  Time elapsed: 0.31 s
09:38:30 [2020-12-01T14:38:30.018Z] javaClassVariable(org.eclipse.ease.lang.python.jython.debugger.JythonDebugTest)  Time elapsed: 0.31 s
09:38:30 [2020-12-01T14:38:30.018Z] stepIntoOnThread(org.eclipse.ease.lang.python.jython.debugger.JythonDebugTest)  Time elapsed: 0.307 s
09:38:30 [2020-12-01T14:38:30.018Z] terminateThreadInSuspendedState(org.eclipse.ease.lang.python.jython.debugger.JythonDebugTest)  Time elapsed: 0.208 s
09:38:30 [2020-12-01T14:38:30.018Z] resumeOnThread(org.eclipse.ease.lang.python.jython.debugger.JythonDebugTest)  Time elapsed: 0.208 s
09:38:30 [2020-12-01T14:38:30.018Z] stepIntoOnStackFrame(org.eclipse.ease.lang.python.jython.debugger.JythonDebugTest)  Time elapsed: 0.307 s
09:38:30 [2020-12-01T14:38:30.018Z] terminateProcessInSuspendedState(org.eclipse.ease.lang.python.jython.debugger.JythonDebugTest)  Time elapsed: 0.208 s
09:38:30 [2020-12-01T14:38:30.018Z] stepOverOnProcess(org.eclipse.ease.lang.python.jython.debugger.JythonDebugTest)  Time elapsed: 0.307 s
09:38:30 [2020-12-01T14:38:30.018Z] nativeArrayVariable(org.eclipse.ease.lang.python.jython.debugger.JythonDebugTest)  Time elapsed: 0.306 s
09:38:30 [2020-12-01T14:38:30.018Z] disconnectDebugTargetInSuspendedState(org.eclipse.ease.lang.python.jython.debugger.JythonDebugTest)  Time elapsed: 0.208 s
09:38:30 [2020-12-01T14:38:30.018Z] stepIntoOnProcess(org.eclipse.ease.lang.python.jython.debugger.JythonDebugTest)  Time elapsed: 0.306 s
09:38:30 [2020-12-01T14:38:30.018Z] terminatedState(org.eclipse.ease.lang.python.jython.debugger.JythonDebugTest)  Time elapsed: 0.104 s
09:38:30 [2020-12-01T14:38:30.018Z] stepOverIncludeCommand(org.eclipse.ease.lang.python.jython.debugger.JythonDebugTest)  Time elapsed: 0.305 s
09:38:30 [2020-12-01T14:38:30.018Z] innerScopeVariableBeforeOuterScopeVariable(org.eclipse.ease.lang.python.jython.debugger.JythonDebugTest)  Time elapsed: 0.307 s
09:38:30 [2020-12-01T14:38:30.018Z] stepIntoIncludeCommand(org.eclipse.ease.lang.python.jython.debugger.JythonDebugTest)  Time elapsed: 0.304 s
09:38:30 [2020-12-01T14:38:30.018Z] primitiveStringVariable(org.eclipse.ease.lang.python.jython.debugger.JythonDebugTest)  Time elapsed: 0.306 s
09:38:30 [2020-12-01T14:38:30.019Z] resumeOnProcess(org.eclipse.ease.lang.python.jython.debugger.JythonDebugTest)  Time elapsed: 0.206 s
09:38:30 [2020-12-01T14:38:30.019Z] stepIntoOnDebugTarget(org.eclipse.ease.lang.python.jython.debugger.JythonDebugTest)  Time elapsed: 0.306 s
09:38:30 [2020-12-01T14:38:30.019Z] stepOverOnThread(org.eclipse.ease.lang.python.jython.debugger.JythonDebugTest)  Time elapsed: 0.305 s
09:38:30 [2020-12-01T14:38:30.019Z] suspendedState(org.eclipse.ease.lang.python.jython.debugger.JythonDebugTest)  Time elapsed: 0.205 s
09:38:30 [2020-12-01T14:38:30.019Z] primitiveDoubleVariable(org.eclipse.ease.lang.python.jython.debugger.JythonDebugTest)  Time elapsed: 0.307 s
09:38:30 [2020-12-01T14:38:30.019Z] resumeOnStackFrame(org.eclipse.ease.lang.python.jython.debugger.JythonDebugTest)  Time elapsed: 0.206 s
09:38:30 [2020-12-01T14:38:30.019Z] nativeObjectVariable(org.eclipse.ease.lang.python.jython.debugger.JythonDebugTest)  Time elapsed: 0.309 s
09:38:30 [2020-12-01T14:38:30.019Z] terminateDebugTargetInSuspendedState(org.eclipse.ease.lang.python.jython.debugger.JythonDebugTest)  Time elapsed: 0.207 s
09:38:30 [2020-12-01T14:38:30.019Z] disconnectStackFrameInSuspendedState(org.eclipse.ease.lang.python.jython.debugger.JythonDebugTest)  Time elapsed: 0.205 s
09:38:30 [2020-12-01T14:38:30.019Z] stepReturnOnProcess(org.eclipse.ease.lang.python.jython.debugger.JythonDebugTest)  Time elapsed: 0.306 s
09:38:30 [2020-12-01T14:38:30.019Z] evaluateWatchExpression(org.eclipse.ease.lang.python.jython.debugger.JythonDebugTest)  Time elapsed: 0.209 s
09:38:30 [2020-12-01T14:38:30.019Z] 
09:38:30 [2020-12-01T14:38:30.019Z] Results:
09:38:30 [2020-12-01T14:38:30.019Z] 
09:38:30 [2020-12-01T14:38:30.019Z] Tests run: 42, Failures: 0, Errors: 0, Skipped: 0
09:38:30 [2020-12-01T14:38:30.019Z] 
09:38:30 [2020-12-01T14:38:30.945Z] [INFO] All tests passed!
09:38:30 [2020-12-01T14:38:30.945Z] [INFO] 
09:38:30 [2020-12-01T14:38:30.945Z] [INFO] --- maven-install-plugin:2.3.1:install (default-install) @ org.eclipse.ease.lang.python.jython.test ---
09:38:30 [2020-12-01T14:38:30.945Z] [INFO] Installing /home/jenkins/agent/workspace/ease.verify.core.target.2019-06/tests/org.eclipse.ease.lang.python.jython.test/target/org.eclipse.ease.lang.python.jython.test-0.8.0-SNAPSHOT.jar to /home/jenkins/.m2/repository/org/eclipse/ease/org.eclipse.ease.lang.python.jython.test/0.8.0-SNAPSHOT/org.eclipse.ease.lang.python.jython.test-0.8.0-SNAPSHOT.jar
09:38:30 [2020-12-01T14:38:30.945Z] [INFO] Installing /home/jenkins/agent/workspace/ease.verify.core.target.2019-06/tests/org.eclipse.ease.lang.python.jython.test/pom.xml to /home/jenkins/.m2/repository/org/eclipse/ease/org.eclipse.ease.lang.python.jython.test/0.8.0-SNAPSHOT/org.eclipse.ease.lang.python.jython.test-0.8.0-SNAPSHOT.pom
09:38:30 [2020-12-01T14:38:30.945Z] [INFO] Installing /home/jenkins/agent/workspace/ease.verify.core.target.2019-06/tests/org.eclipse.ease.lang.python.jython.test/target/org.eclipse.ease.lang.python.jython.test-0.8.0-SNAPSHOT-sources.jar to /home/jenkins/.m2/repository/org/eclipse/ease/org.eclipse.ease.lang.python.jython.test/0.8.0-SNAPSHOT/org.eclipse.ease.lang.python.jython.test-0.8.0-SNAPSHOT-sources.jar
09:38:30 [2020-12-01T14:38:30.945Z] [INFO] Installing /home/jenkins/agent/workspace/ease.verify.core.target.2019-06/tests/org.eclipse.ease.lang.python.jython.test/target/p2content.xml to /home/jenkins/.m2/repository/org/eclipse/ease/org.eclipse.ease.lang.python.jython.test/0.8.0-SNAPSHOT/org.eclipse.ease.lang.python.jython.test-0.8.0-SNAPSHOT-p2metadata.xml
09:38:30 [2020-12-01T14:38:30.945Z] [INFO] Installing /home/jenkins/agent/workspace/ease.verify.core.target.2019-06/tests/org.eclipse.ease.lang.python.jython.test/target/p2artifacts.xml to /home/jenkins/.m2/repository/org/eclipse/ease/org.eclipse.ease.lang.python.jython.test/0.8.0-SNAPSHOT/org.eclipse.ease.lang.python.jython.test-0.8.0-SNAPSHOT-p2artifacts.xml
09:38:30 [2020-12-01T14:38:30.945Z] [INFO] Installing /home/jenkins/agent/workspace/ease.verify.core.target.2019-06/tests/org.eclipse.ease.lang.python.jython.test/target/p2content.xml to /home/jenkins/.m2/repository/org/eclipse/ease/org.eclipse.ease.lang.python.jython.test/0.8.0-SNAPSHOT/org.eclipse.ease.lang.python.jython.test-0.8.0-SNAPSHOT-p2metadata.xml
09:38:30 [2020-12-01T14:38:30.945Z] [INFO] Installing /home/jenkins/agent/workspace/ease.verify.core.target.2019-06/tests/org.eclipse.ease.lang.python.jython.test/target/p2artifacts.xml to /home/jenkins/.m2/repository/org/eclipse/ease/org.eclipse.ease.lang.python.jython.test/0.8.0-SNAPSHOT/org.eclipse.ease.lang.python.jython.test-0.8.0-SNAPSHOT-p2artifacts.xml
09:38:30 [2020-12-01T14:38:30.945Z] [INFO] 
09:38:30 [2020-12-01T14:38:30.945Z] [INFO] --- tycho-p2-plugin:1.5.0:update-local-index (default-update-local-index) @ org.eclipse.ease.lang.python.jython.test ---
09:38:30 [2020-12-01T14:38:30.945Z] [INFO] 
09:38:30 [2020-12-01T14:38:30.945Z] [INFO] -----< org.eclipse.ease:org.eclipse.ease.lang.scriptarchive.test >------
09:38:30 [2020-12-01T14:38:30.945Z] [INFO] Building org.eclipse.ease.lang.scriptarchive.test 0.8.0-SNAPSHOT [44/48]
09:38:30 [2020-12-01T14:38:30.945Z] [INFO] ------------------------[ eclipse-test-plugin ]-------------------------
09:38:30 [2020-12-01T14:38:30.945Z] [INFO] 
09:38:30 [2020-12-01T14:38:30.945Z] [INFO] --- maven-clean-plugin:2.5:clean (default-clean) @ org.eclipse.ease.lang.scriptarchive.test ---
09:38:30 [2020-12-01T14:38:30.945Z] [INFO] 
09:38:30 [2020-12-01T14:38:30.945Z] [INFO] --- tycho-packaging-plugin:1.5.0:build-qualifier (default-build-qualifier) @ org.eclipse.ease.lang.scriptarchive.test ---
09:38:30 [2020-12-01T14:38:30.945Z] [INFO] The project's OSGi version is 0.8.0.I201910171213
09:38:30 [2020-12-01T14:38:30.945Z] [INFO] 
09:38:30 [2020-12-01T14:38:30.945Z] [INFO] --- tycho-packaging-plugin:1.5.0:validate-id (default-validate-id) @ org.eclipse.ease.lang.scriptarchive.test ---
09:38:30 [2020-12-01T14:38:30.946Z] [INFO] 
09:38:30 [2020-12-01T14:38:30.946Z] [INFO] --- tycho-packaging-plugin:1.5.0:validate-version (default-validate-version) @ org.eclipse.ease.lang.scriptarchive.test ---
09:38:30 [2020-12-01T14:38:30.946Z] [INFO] 
09:38:30 [2020-12-01T14:38:30.946Z] [INFO] >>> maven-javadoc-plugin:2.9.1:javadoc (build-docs) > generate-sources @ org.eclipse.ease.lang.scriptarchive.test >>>
09:38:30 [2020-12-01T14:38:30.946Z] [INFO] 
09:38:30 [2020-12-01T14:38:30.946Z] [INFO] --- tycho-packaging-plugin:1.5.0:build-qualifier (default-build-qualifier) @ org.eclipse.ease.lang.scriptarchive.test ---
09:38:30 [2020-12-01T14:38:30.946Z] [INFO] The project's OSGi version is 0.8.0.I201910171213
09:38:30 [2020-12-01T14:38:30.946Z] [INFO] 
09:38:30 [2020-12-01T14:38:30.946Z] [INFO] --- tycho-packaging-plugin:1.5.0:validate-id (default-validate-id) @ org.eclipse.ease.lang.scriptarchive.test ---
09:38:30 [2020-12-01T14:38:30.946Z] [INFO] 
09:38:30 [2020-12-01T14:38:30.946Z] [INFO] --- tycho-packaging-plugin:1.5.0:validate-version (default-validate-version) @ org.eclipse.ease.lang.scriptarchive.test ---
09:38:30 [2020-12-01T14:38:30.946Z] [INFO] 
09:38:30 [2020-12-01T14:38:30.946Z] [INFO] <<< maven-javadoc-plugin:2.9.1:javadoc (build-docs) < generate-sources @ org.eclipse.ease.lang.scriptarchive.test <<<
09:38:30 [2020-12-01T14:38:30.946Z] [INFO] 
09:38:30 [2020-12-01T14:38:30.946Z] [INFO] 
09:38:30 [2020-12-01T14:38:30.946Z] [INFO] --- maven-javadoc-plugin:2.9.1:javadoc (build-docs) @ org.eclipse.ease.lang.scriptarchive.test ---
09:38:31 [2020-12-01T14:38:31.201Z] [ERROR] Error fetching link: http://help.eclipse.org/oxygen/topic/org.eclipse.platform.doc.isv/reference/api/package-list. Ignored it.
09:38:31 [2020-12-01T14:38:31.201Z] [ERROR] Error fetching link: https://ci.eclipse.org/ease/job/ease.build.core/JavaDoc/package-list. Ignored it.
09:38:32 [2020-12-01T14:38:32.128Z] [INFO] 
09:38:32 [2020-12-01T14:38:32.128Z] Loading source files for package org.eclipse.ease.lang.scriptarchive...
09:38:32 [2020-12-01T14:38:32.128Z] Constructing Javadoc information...
09:38:32 [2020-12-01T14:38:32.128Z] WARNING: Cannot open location "/home/jenkins/agent/workspace/ease.verify.core.target.2019-06/tests/org.eclipse.ease.lang.scriptarchive.test/target/javadoc-bundle-options/package-list"
09:38:32 [2020-12-01T14:38:32.128Z] No plugin definition found, skipping
09:38:32 [2020-12-01T14:38:32.128Z] No plugin definition found, skipping
09:38:32 [2020-12-01T14:38:32.128Z] [WARNING] Javadoc Warnings
09:38:32 [2020-12-01T14:38:32.128Z] [WARNING] Picked up JAVA_TOOL_OPTIONS: -Dmaven.ext.class.path="/home/jenkins/agent/workspace/ease.verify.core.target.2019-06@tmp/withMavenda45dd09/pipeline-maven-spy.jar" -Dorg.jenkinsci.plugins.pipeline.maven.reportsFolder="/home/jenkins/agent/workspace/ease.verify.core.target.2019-06@tmp/withMavenda45dd09"
09:38:32 [2020-12-01T14:38:32.128Z] [WARNING] javadoc: warning - The old Doclet and Taglet APIs in the packages
09:38:32 [2020-12-01T14:38:32.128Z] [WARNING] com.sun.javadoc, com.sun.tools.doclets and their implementations
09:38:32 [2020-12-01T14:38:32.128Z] [WARNING] are planned to be removed in a future JDK release. These
09:38:32 [2020-12-01T14:38:32.128Z] [WARNING] components have been superseded by the new APIs in jdk.javadoc.doclet.
09:38:32 [2020-12-01T14:38:32.128Z] [WARNING] Users are strongly recommended to migrate to the new APIs.
09:38:32 [2020-12-01T14:38:32.128Z] [INFO] 
09:38:32 [2020-12-01T14:38:32.128Z] [INFO] --- build-helper-maven-plugin:1.9.1:add-resource (add_help) @ org.eclipse.ease.lang.scriptarchive.test ---
09:38:32 [2020-12-01T14:38:32.128Z] [INFO] 
09:38:32 [2020-12-01T14:38:32.128Z] [INFO] --- maven-resources-plugin:2.4.3:resources (default-resources) @ org.eclipse.ease.lang.scriptarchive.test ---
09:38:32 [2020-12-01T14:38:32.128Z] [INFO] Using 'UTF-8' encoding to copy filtered resources.
09:38:32 [2020-12-01T14:38:32.128Z] [INFO] skip non existing resourceDirectory /home/jenkins/agent/workspace/ease.verify.core.target.2019-06/tests/org.eclipse.ease.lang.scriptarchive.test/src/main/resources
09:38:32 [2020-12-01T14:38:32.128Z] [INFO] skip non existing resourceDirectory /home/jenkins/agent/workspace/ease.verify.core.target.2019-06/tests/org.eclipse.ease.lang.scriptarchive.test/help
09:38:32 [2020-12-01T14:38:32.128Z] [INFO] 
09:38:32 [2020-12-01T14:38:32.128Z] [INFO] --- tycho-compiler-plugin:1.5.0:compile (default-compile) @ org.eclipse.ease.lang.scriptarchive.test ---
09:38:32 [2020-12-01T14:38:32.129Z] [INFO] Compiling 1 source file to /home/jenkins/agent/workspace/ease.verify.core.target.2019-06/tests/org.eclipse.ease.lang.scriptarchive.test/target/classes
09:38:32 [2020-12-01T14:38:32.384Z] [INFO] 
09:38:32 [2020-12-01T14:38:32.384Z] [INFO] --- maven-resources-plugin:2.4.3:testResources (default-testResources) @ org.eclipse.ease.lang.scriptarchive.test ---
09:38:32 [2020-12-01T14:38:32.384Z] [INFO] Using 'UTF-8' encoding to copy filtered resources.
09:38:32 [2020-12-01T14:38:32.384Z] [INFO] skip non existing resourceDirectory /home/jenkins/agent/workspace/ease.verify.core.target.2019-06/tests/org.eclipse.ease.lang.scriptarchive.test/src/test/resources
09:38:32 [2020-12-01T14:38:32.384Z] [INFO] 
09:38:32 [2020-12-01T14:38:32.384Z] [INFO] --- tycho-source-plugin:1.5.0:plugin-source (plugin-source) @ org.eclipse.ease.lang.scriptarchive.test ---
09:38:32 [2020-12-01T14:38:32.384Z] [INFO] Building jar: /home/jenkins/agent/workspace/ease.verify.core.target.2019-06/tests/org.eclipse.ease.lang.scriptarchive.test/target/org.eclipse.ease.lang.scriptarchive.test-0.8.0-SNAPSHOT-sources.jar
09:38:32 [2020-12-01T14:38:32.384Z] [INFO] 
09:38:32 [2020-12-01T14:38:32.384Z] [INFO] --- target-platform-configuration:1.5.0:target-platform (default-target-platform) @ org.eclipse.ease.lang.scriptarchive.test ---
09:38:32 [2020-12-01T14:38:32.384Z] [INFO] 
09:38:32 [2020-12-01T14:38:32.385Z] [INFO] --- tycho-packaging-plugin:1.5.0:package-plugin (default-package-plugin) @ org.eclipse.ease.lang.scriptarchive.test ---
09:38:32 [2020-12-01T14:38:32.385Z] [INFO] Building jar: /home/jenkins/agent/workspace/ease.verify.core.target.2019-06/tests/org.eclipse.ease.lang.scriptarchive.test/target/org.eclipse.ease.lang.scriptarchive.test-0.8.0-SNAPSHOT.jar
09:38:32 [2020-12-01T14:38:32.385Z] [INFO] 
09:38:32 [2020-12-01T14:38:32.385Z] [INFO] --- tycho-p2-plugin:1.5.0:p2-metadata-default (default-p2-metadata-default) @ org.eclipse.ease.lang.scriptarchive.test ---
09:38:32 [2020-12-01T14:38:32.385Z] [INFO] 
09:38:32 [2020-12-01T14:38:32.385Z] [INFO] --- tycho-source-feature-plugin:1.5.0:source-feature (source-feature) @ org.eclipse.ease.lang.scriptarchive.test ---
09:38:32 [2020-12-01T14:38:32.385Z] [INFO] 
09:38:32 [2020-12-01T14:38:32.385Z] [INFO] --- tycho-p2-plugin:1.5.0:p2-metadata (attached-p2-metadata) @ org.eclipse.ease.lang.scriptarchive.test ---
09:38:32 [2020-12-01T14:38:32.385Z] [INFO] 
09:38:32 [2020-12-01T14:38:32.385Z] [INFO] --- tycho-surefire-plugin:1.5.0:test (default-test) @ org.eclipse.ease.lang.scriptarchive.test ---
09:38:32 [2020-12-01T14:38:32.640Z] [INFO] Expected eclipse log file: /home/jenkins/agent/workspace/ease.verify.core.target.2019-06/tests/org.eclipse.ease.lang.scriptarchive.test/target/work/data/.metadata/.log
09:38:32 [2020-12-01T14:38:32.640Z] [INFO] Command line:
09:38:32 [2020-12-01T14:38:32.640Z] 	[/opt/tools/java/openjdk/jdk-11/11.0.2+9/bin/java, -Dosgi.noShutdown=false, -Dosgi.os=linux, -Dosgi.ws=gtk, -Dosgi.arch=x86_64, -Dosgi.clean=true, -jar, /home/jenkins/.m2/repository/p2/osgi/bundle/org.eclipse.equinox.launcher/1.5.800.v20200727-1323/org.eclipse.equinox.launcher-1.5.800.v20200727-1323.jar, -data, /home/jenkins/agent/workspace/ease.verify.core.target.2019-06/tests/org.eclipse.ease.lang.scriptarchive.test/target/work/data, -install, /home/jenkins/agent/workspace/ease.verify.core.target.2019-06/tests/org.eclipse.ease.lang.scriptarchive.test/target/work, -configuration, /home/jenkins/agent/workspace/ease.verify.core.target.2019-06/tests/org.eclipse.ease.lang.scriptarchive.test/target/work/configuration, -application, org.eclipse.tycho.surefire.osgibooter.headlesstest, -testproperties, /home/jenkins/agent/workspace/ease.verify.core.target.2019-06/tests/org.eclipse.ease.lang.scriptarchive.test/target/surefire.properties]
09:38:32 [2020-12-01T14:38:32.640Z] Picked up JAVA_TOOL_OPTIONS: -Dmaven.ext.class.path="/home/jenkins/agent/workspace/ease.verify.core.target.2019-06@tmp/withMavenda45dd09/pipeline-maven-spy.jar" -Dorg.jenkinsci.plugins.pipeline.maven.reportsFolder="/home/jenkins/agent/workspace/ease.verify.core.target.2019-06@tmp/withMavenda45dd09" 
09:38:34 [2020-12-01T14:38:34.546Z] Running org.eclipse.ease.lang.scriptarchive.ArchiveEngineTest
09:38:34 [2020-12-01T14:38:34.802Z] We are running from a zip file!
09:38:34 [2020-12-01T14:38:34.802Z] org.eclipse.ease.ScriptExecutionException: SyntaxError: missing ; before statement (workspace://__EASE_ScriptArchive_1/scripts/Master.js#3)
09:38:34 [2020-12-01T14:38:34.802Z] this is an error
09:38:34 [2020-12-01T14:38:34.802Z]        ^
09:38:34 [2020-12-01T14:38:34.802Z] 	at Master.js,workspace://__EASE_ScriptArchive_1/scripts/Master.js
09:38:34 [2020-12-01T14:38:34.802Z] org.eclipse.ease.ScriptExecutionException: SyntaxError: missing ; before statement (workspace://__EASE_ScriptArchive_1/scripts/Master.js#3)
09:38:34 [2020-12-01T14:38:34.802Z] this is an error
09:38:34 [2020-12-01T14:38:34.802Z]        ^
09:38:34 [2020-12-01T14:38:34.802Z] 	at Master.js,workspace://__EASE_ScriptArchive_1/scripts/Master.js
09:38:35 [2020-12-01T14:38:35.058Z] Tests run: 7, Failures: 0, Errors: 0, Skipped: 0, Time elapsed: 0.524 s - in org.eclipse.ease.lang.scriptarchive.ArchiveEngineTest
09:38:35 [2020-12-01T14:38:35.058Z] executeWithManifest(org.eclipse.ease.lang.scriptarchive.ArchiveEngineTest)  Time elapsed: 0.337 s
09:38:35 [2020-12-01T14:38:35.058Z] zipFileRegistration(org.eclipse.ease.lang.scriptarchive.ArchiveEngineTest)  Time elapsed: 0.007 s
09:38:35 [2020-12-01T14:38:35.058Z] engineIdRegistration(org.eclipse.ease.lang.scriptarchive.ArchiveEngineTest)  Time elapsed: 0 s
09:38:35 [2020-12-01T14:38:35.058Z] jarFileRegistration(org.eclipse.ease.lang.scriptarchive.ArchiveEngineTest)  Time elapsed: 0 s
09:38:35 [2020-12-01T14:38:35.058Z] sarFileRegistration(org.eclipse.ease.lang.scriptarchive.ArchiveEngineTest)  Time elapsed: 0 s
09:38:35 [2020-12-01T14:38:35.058Z] executeWithErrors(org.eclipse.ease.lang.scriptarchive.ArchiveEngineTest)  Time elapsed: 0.075 s
09:38:35 [2020-12-01T14:38:35.058Z] executeWithIncludes(org.eclipse.ease.lang.scriptarchive.ArchiveEngineTest)  Time elapsed: 0.076 s
09:38:35 [2020-12-01T14:38:35.058Z] 
09:38:35 [2020-12-01T14:38:35.058Z] Results:
09:38:35 [2020-12-01T14:38:35.058Z] 
09:38:35 [2020-12-01T14:38:35.058Z] Tests run: 7, Failures: 0, Errors: 0, Skipped: 0
09:38:35 [2020-12-01T14:38:35.058Z] 
09:38:35 [2020-12-01T14:38:35.619Z] [INFO] All tests passed!
09:38:35 [2020-12-01T14:38:35.619Z] [INFO] 
09:38:35 [2020-12-01T14:38:35.619Z] [INFO] --- maven-install-plugin:2.3.1:install (default-install) @ org.eclipse.ease.lang.scriptarchive.test ---
09:38:35 [2020-12-01T14:38:35.619Z] [INFO] Installing /home/jenkins/agent/workspace/ease.verify.core.target.2019-06/tests/org.eclipse.ease.lang.scriptarchive.test/target/org.eclipse.ease.lang.scriptarchive.test-0.8.0-SNAPSHOT.jar to /home/jenkins/.m2/repository/org/eclipse/ease/org.eclipse.ease.lang.scriptarchive.test/0.8.0-SNAPSHOT/org.eclipse.ease.lang.scriptarchive.test-0.8.0-SNAPSHOT.jar
09:38:35 [2020-12-01T14:38:35.619Z] [INFO] Installing /home/jenkins/agent/workspace/ease.verify.core.target.2019-06/tests/org.eclipse.ease.lang.scriptarchive.test/pom.xml to /home/jenkins/.m2/repository/org/eclipse/ease/org.eclipse.ease.lang.scriptarchive.test/0.8.0-SNAPSHOT/org.eclipse.ease.lang.scriptarchive.test-0.8.0-SNAPSHOT.pom
09:38:35 [2020-12-01T14:38:35.619Z] [INFO] Installing /home/jenkins/agent/workspace/ease.verify.core.target.2019-06/tests/org.eclipse.ease.lang.scriptarchive.test/target/org.eclipse.ease.lang.scriptarchive.test-0.8.0-SNAPSHOT-sources.jar to /home/jenkins/.m2/repository/org/eclipse/ease/org.eclipse.ease.lang.scriptarchive.test/0.8.0-SNAPSHOT/org.eclipse.ease.lang.scriptarchive.test-0.8.0-SNAPSHOT-sources.jar
09:38:35 [2020-12-01T14:38:35.619Z] [INFO] Installing /home/jenkins/agent/workspace/ease.verify.core.target.2019-06/tests/org.eclipse.ease.lang.scriptarchive.test/target/p2content.xml to /home/jenkins/.m2/repository/org/eclipse/ease/org.eclipse.ease.lang.scriptarchive.test/0.8.0-SNAPSHOT/org.eclipse.ease.lang.scriptarchive.test-0.8.0-SNAPSHOT-p2metadata.xml
09:38:35 [2020-12-01T14:38:35.619Z] [INFO] Installing /home/jenkins/agent/workspace/ease.verify.core.target.2019-06/tests/org.eclipse.ease.lang.scriptarchive.test/target/p2artifacts.xml to /home/jenkins/.m2/repository/org/eclipse/ease/org.eclipse.ease.lang.scriptarchive.test/0.8.0-SNAPSHOT/org.eclipse.ease.lang.scriptarchive.test-0.8.0-SNAPSHOT-p2artifacts.xml
09:38:35 [2020-12-01T14:38:35.619Z] [INFO] Installing /home/jenkins/agent/workspace/ease.verify.core.target.2019-06/tests/org.eclipse.ease.lang.scriptarchive.test/target/p2content.xml to /home/jenkins/.m2/repository/org/eclipse/ease/org.eclipse.ease.lang.scriptarchive.test/0.8.0-SNAPSHOT/org.eclipse.ease.lang.scriptarchive.test-0.8.0-SNAPSHOT-p2metadata.xml
09:38:35 [2020-12-01T14:38:35.619Z] [INFO] Installing /home/jenkins/agent/workspace/ease.verify.core.target.2019-06/tests/org.eclipse.ease.lang.scriptarchive.test/target/p2artifacts.xml to /home/jenkins/.m2/repository/org/eclipse/ease/org.eclipse.ease.lang.scriptarchive.test/0.8.0-SNAPSHOT/org.eclipse.ease.lang.scriptarchive.test-0.8.0-SNAPSHOT-p2artifacts.xml
09:38:35 [2020-12-01T14:38:35.619Z] [INFO] 
09:38:35 [2020-12-01T14:38:35.620Z] [INFO] --- tycho-p2-plugin:1.5.0:update-local-index (default-update-local-index) @ org.eclipse.ease.lang.scriptarchive.test ---
09:38:35 [2020-12-01T14:38:35.620Z] [INFO] 
09:38:35 [2020-12-01T14:38:35.620Z] [INFO] --------< org.eclipse.ease:org.eclipse.ease.lang.unittest.test >--------
09:38:35 [2020-12-01T14:38:35.620Z] [INFO] Building org.eclipse.ease.lang.unittest.test 0.8.0-SNAPSHOT      [45/48]
09:38:35 [2020-12-01T14:38:35.620Z] [INFO] ------------------------[ eclipse-test-plugin ]-------------------------
09:38:35 [2020-12-01T14:38:35.620Z] [INFO] 
09:38:35 [2020-12-01T14:38:35.620Z] [INFO] --- maven-clean-plugin:2.5:clean (default-clean) @ org.eclipse.ease.lang.unittest.test ---
09:38:35 [2020-12-01T14:38:35.620Z] [INFO] 
09:38:35 [2020-12-01T14:38:35.620Z] [INFO] --- tycho-packaging-plugin:1.5.0:build-qualifier (default-build-qualifier) @ org.eclipse.ease.lang.unittest.test ---
09:38:35 [2020-12-01T14:38:35.620Z] [INFO] The project's OSGi version is 0.8.0.I202009240747
09:38:35 [2020-12-01T14:38:35.620Z] [INFO] 
09:38:35 [2020-12-01T14:38:35.620Z] [INFO] --- tycho-packaging-plugin:1.5.0:validate-id (default-validate-id) @ org.eclipse.ease.lang.unittest.test ---
09:38:35 [2020-12-01T14:38:35.620Z] [INFO] 
09:38:35 [2020-12-01T14:38:35.620Z] [INFO] --- tycho-packaging-plugin:1.5.0:validate-version (default-validate-version) @ org.eclipse.ease.lang.unittest.test ---
09:38:35 [2020-12-01T14:38:35.620Z] [INFO] 
09:38:35 [2020-12-01T14:38:35.620Z] [INFO] >>> maven-javadoc-plugin:2.9.1:javadoc (build-docs) > generate-sources @ org.eclipse.ease.lang.unittest.test >>>
09:38:35 [2020-12-01T14:38:35.620Z] [INFO] 
09:38:35 [2020-12-01T14:38:35.620Z] [INFO] --- tycho-packaging-plugin:1.5.0:build-qualifier (default-build-qualifier) @ org.eclipse.ease.lang.unittest.test ---
09:38:35 [2020-12-01T14:38:35.620Z] [INFO] The project's OSGi version is 0.8.0.I202009240747
09:38:35 [2020-12-01T14:38:35.620Z] [INFO] 
09:38:35 [2020-12-01T14:38:35.620Z] [INFO] --- tycho-packaging-plugin:1.5.0:validate-id (default-validate-id) @ org.eclipse.ease.lang.unittest.test ---
09:38:35 [2020-12-01T14:38:35.620Z] [INFO] 
09:38:35 [2020-12-01T14:38:35.620Z] [INFO] --- tycho-packaging-plugin:1.5.0:validate-version (default-validate-version) @ org.eclipse.ease.lang.unittest.test ---
09:38:35 [2020-12-01T14:38:35.620Z] [INFO] 
09:38:35 [2020-12-01T14:38:35.620Z] [INFO] <<< maven-javadoc-plugin:2.9.1:javadoc (build-docs) < generate-sources @ org.eclipse.ease.lang.unittest.test <<<
09:38:35 [2020-12-01T14:38:35.620Z] [INFO] 
09:38:35 [2020-12-01T14:38:35.620Z] [INFO] 
09:38:35 [2020-12-01T14:38:35.620Z] [INFO] --- maven-javadoc-plugin:2.9.1:javadoc (build-docs) @ org.eclipse.ease.lang.unittest.test ---
09:38:35 [2020-12-01T14:38:35.876Z] [ERROR] Error fetching link: http://help.eclipse.org/oxygen/topic/org.eclipse.platform.doc.isv/reference/api/package-list. Ignored it.
09:38:35 [2020-12-01T14:38:35.876Z] [ERROR] Error fetching link: https://ci.eclipse.org/ease/job/ease.build.core/JavaDoc/package-list. Ignored it.
09:38:37 [2020-12-01T14:38:37.281Z] [INFO] 
09:38:37 [2020-12-01T14:38:37.281Z] Loading source files for package org.eclipse.ease.lang.unittest...
09:38:37 [2020-12-01T14:38:37.281Z] Constructing Javadoc information...
09:38:37 [2020-12-01T14:38:37.281Z] WARNING: Cannot open location "/home/jenkins/agent/workspace/ease.verify.core.target.2019-06/tests/org.eclipse.ease.lang.unittest.test/target/javadoc-bundle-options/package-list"
09:38:37 [2020-12-01T14:38:37.281Z] No plugin definition found, skipping
09:38:37 [2020-12-01T14:38:37.281Z] No plugin definition found, skipping
09:38:37 [2020-12-01T14:38:37.281Z] [WARNING] Javadoc Warnings
09:38:37 [2020-12-01T14:38:37.282Z] [WARNING] Picked up JAVA_TOOL_OPTIONS: -Dmaven.ext.class.path="/home/jenkins/agent/workspace/ease.verify.core.target.2019-06@tmp/withMavenda45dd09/pipeline-maven-spy.jar" -Dorg.jenkinsci.plugins.pipeline.maven.reportsFolder="/home/jenkins/agent/workspace/ease.verify.core.target.2019-06@tmp/withMavenda45dd09"
09:38:37 [2020-12-01T14:38:37.282Z] [WARNING] javadoc: warning - The old Doclet and Taglet APIs in the packages
09:38:37 [2020-12-01T14:38:37.282Z] [WARNING] com.sun.javadoc, com.sun.tools.doclets and their implementations
09:38:37 [2020-12-01T14:38:37.282Z] [WARNING] are planned to be removed in a future JDK release. These
09:38:37 [2020-12-01T14:38:37.282Z] [WARNING] components have been superseded by the new APIs in jdk.javadoc.doclet.
09:38:37 [2020-12-01T14:38:37.282Z] [WARNING] Users are strongly recommended to migrate to the new APIs.
09:38:37 [2020-12-01T14:38:37.282Z] [INFO] 
09:38:37 [2020-12-01T14:38:37.282Z] [INFO] --- build-helper-maven-plugin:1.9.1:add-resource (add_help) @ org.eclipse.ease.lang.unittest.test ---
09:38:37 [2020-12-01T14:38:37.282Z] [INFO] 
09:38:37 [2020-12-01T14:38:37.282Z] [INFO] --- maven-resources-plugin:2.4.3:resources (default-resources) @ org.eclipse.ease.lang.unittest.test ---
09:38:37 [2020-12-01T14:38:37.282Z] [INFO] Using 'UTF-8' encoding to copy filtered resources.
09:38:37 [2020-12-01T14:38:37.282Z] [INFO] skip non existing resourceDirectory /home/jenkins/agent/workspace/ease.verify.core.target.2019-06/tests/org.eclipse.ease.lang.unittest.test/src/main/resources
09:38:37 [2020-12-01T14:38:37.282Z] [INFO] skip non existing resourceDirectory /home/jenkins/agent/workspace/ease.verify.core.target.2019-06/tests/org.eclipse.ease.lang.unittest.test/help
09:38:37 [2020-12-01T14:38:37.282Z] [INFO] 
09:38:37 [2020-12-01T14:38:37.282Z] [INFO] --- tycho-compiler-plugin:1.5.0:compile (default-compile) @ org.eclipse.ease.lang.unittest.test ---
09:38:37 [2020-12-01T14:38:37.282Z] [INFO] Compiling 3 source files to /home/jenkins/agent/workspace/ease.verify.core.target.2019-06/tests/org.eclipse.ease.lang.unittest.test/target/classes
09:38:37 [2020-12-01T14:38:37.282Z] [INFO] 
09:38:37 [2020-12-01T14:38:37.282Z] [INFO] --- maven-resources-plugin:2.4.3:testResources (default-testResources) @ org.eclipse.ease.lang.unittest.test ---
09:38:37 [2020-12-01T14:38:37.282Z] [INFO] Using 'UTF-8' encoding to copy filtered resources.
09:38:37 [2020-12-01T14:38:37.282Z] [INFO] skip non existing resourceDirectory /home/jenkins/agent/workspace/ease.verify.core.target.2019-06/tests/org.eclipse.ease.lang.unittest.test/src/test/resources
09:38:37 [2020-12-01T14:38:37.282Z] [INFO] 
09:38:37 [2020-12-01T14:38:37.282Z] [INFO] --- tycho-source-plugin:1.5.0:plugin-source (plugin-source) @ org.eclipse.ease.lang.unittest.test ---
09:38:37 [2020-12-01T14:38:37.282Z] [WARNING] Bundle-Name header not found in /home/jenkins/agent/workspace/ease.verify.core.target.2019-06/tests/org.eclipse.ease.lang.unittest.test/META-INF/MANIFEST.MF, fallback to Bundle-SymbolicName for source bundle
09:38:37 [2020-12-01T14:38:37.282Z] [WARNING] Bundle-Vendor header not found in /home/jenkins/agent/workspace/ease.verify.core.target.2019-06/tests/org.eclipse.ease.lang.unittest.test/META-INF/MANIFEST.MF, fallback to 'unknown' for source bundle
09:38:37 [2020-12-01T14:38:37.282Z] [INFO] Building jar: /home/jenkins/agent/workspace/ease.verify.core.target.2019-06/tests/org.eclipse.ease.lang.unittest.test/target/org.eclipse.ease.lang.unittest.test-0.8.0-SNAPSHOT-sources.jar
09:38:37 [2020-12-01T14:38:37.282Z] [INFO] 
09:38:37 [2020-12-01T14:38:37.282Z] [INFO] --- target-platform-configuration:1.5.0:target-platform (default-target-platform) @ org.eclipse.ease.lang.unittest.test ---
09:38:37 [2020-12-01T14:38:37.282Z] [INFO] 
09:38:37 [2020-12-01T14:38:37.282Z] [INFO] --- tycho-packaging-plugin:1.5.0:package-plugin (default-package-plugin) @ org.eclipse.ease.lang.unittest.test ---
09:38:37 [2020-12-01T14:38:37.282Z] [INFO] Building jar: /home/jenkins/agent/workspace/ease.verify.core.target.2019-06/tests/org.eclipse.ease.lang.unittest.test/target/org.eclipse.ease.lang.unittest.test-0.8.0-SNAPSHOT.jar
09:38:37 [2020-12-01T14:38:37.282Z] [INFO] 
09:38:37 [2020-12-01T14:38:37.282Z] [INFO] --- tycho-p2-plugin:1.5.0:p2-metadata-default (default-p2-metadata-default) @ org.eclipse.ease.lang.unittest.test ---
09:38:37 [2020-12-01T14:38:37.282Z] [INFO] 
09:38:37 [2020-12-01T14:38:37.282Z] [INFO] --- tycho-source-feature-plugin:1.5.0:source-feature (source-feature) @ org.eclipse.ease.lang.unittest.test ---
09:38:37 [2020-12-01T14:38:37.282Z] [INFO] 
09:38:37 [2020-12-01T14:38:37.282Z] [INFO] --- tycho-p2-plugin:1.5.0:p2-metadata (attached-p2-metadata) @ org.eclipse.ease.lang.unittest.test ---
09:38:37 [2020-12-01T14:38:37.282Z] [INFO] 
09:38:37 [2020-12-01T14:38:37.283Z] [INFO] --- tycho-surefire-plugin:1.5.0:test (default-test) @ org.eclipse.ease.lang.unittest.test ---
09:38:37 [2020-12-01T14:38:37.541Z] [INFO] Expected eclipse log file: /home/jenkins/agent/workspace/ease.verify.core.target.2019-06/tests/org.eclipse.ease.lang.unittest.test/target/work/data/.metadata/.log
09:38:37 [2020-12-01T14:38:37.541Z] [INFO] Command line:
09:38:37 [2020-12-01T14:38:37.541Z] 	[/opt/tools/java/openjdk/jdk-11/11.0.2+9/bin/java, -Dosgi.noShutdown=false, -Dosgi.os=linux, -Dosgi.ws=gtk, -Dosgi.arch=x86_64, -Dosgi.clean=true, -jar, /home/jenkins/.m2/repository/p2/osgi/bundle/org.eclipse.equinox.launcher/1.5.800.v20200727-1323/org.eclipse.equinox.launcher-1.5.800.v20200727-1323.jar, -data, /home/jenkins/agent/workspace/ease.verify.core.target.2019-06/tests/org.eclipse.ease.lang.unittest.test/target/work/data, -install, /home/jenkins/agent/workspace/ease.verify.core.target.2019-06/tests/org.eclipse.ease.lang.unittest.test/target/work, -configuration, /home/jenkins/agent/workspace/ease.verify.core.target.2019-06/tests/org.eclipse.ease.lang.unittest.test/target/work/configuration, -application, org.eclipse.tycho.surefire.osgibooter.headlesstest, -testproperties, /home/jenkins/agent/workspace/ease.verify.core.target.2019-06/tests/org.eclipse.ease.lang.unittest.test/target/surefire.properties]
09:38:37 [2020-12-01T14:38:37.541Z] Picked up JAVA_TOOL_OPTIONS: -Dmaven.ext.class.path="/home/jenkins/agent/workspace/ease.verify.core.target.2019-06@tmp/withMavenda45dd09/pipeline-maven-spy.jar" -Dorg.jenkinsci.plugins.pipeline.maven.reportsFolder="/home/jenkins/agent/workspace/ease.verify.core.target.2019-06@tmp/withMavenda45dd09" 
09:38:40 [2020-12-01T14:38:40.106Z] Running org.eclipse.ease.lang.unittest.ClassicJavaScriptTest
09:38:41 [2020-12-01T14:38:41.522Z] Tests run: 7, Failures: 0, Errors: 0, Skipped: 0, Time elapsed: 1.817 s - in org.eclipse.ease.lang.unittest.ClassicJavaScriptTest
09:38:41 [2020-12-01T14:38:41.522Z] folderStatus(org.eclipse.ease.lang.unittest.ClassicJavaScriptTest)  Time elapsed: 0.751 s
09:38:41 [2020-12-01T14:38:41.522Z] errorTestStatus(org.eclipse.ease.lang.unittest.ClassicJavaScriptTest)  Time elapsed: 0.22 s
09:38:41 [2020-12-01T14:38:41.522Z] failureTestStatus(org.eclipse.ease.lang.unittest.ClassicJavaScriptTest)  Time elapsed: 0.195 s
09:38:41 [2020-12-01T14:38:41.522Z] verifyOutput(org.eclipse.ease.lang.unittest.ClassicJavaScriptTest)  Time elapsed: 0.168 s
09:38:41 [2020-12-01T14:38:41.522Z] suiteStatus(org.eclipse.ease.lang.unittest.ClassicJavaScriptTest)  Time elapsed: 0.121 s
09:38:41 [2020-12-01T14:38:41.522Z] ignoreTestStatus(org.eclipse.ease.lang.unittest.ClassicJavaScriptTest)  Time elapsed: 0.166 s
09:38:41 [2020-12-01T14:38:41.522Z] passTestStatus(org.eclipse.ease.lang.unittest.ClassicJavaScriptTest)  Time elapsed: 0.127 s
09:38:41 [2020-12-01T14:38:41.522Z] Running org.eclipse.ease.lang.unittest.ModernJavaScriptTest
09:38:42 [2020-12-01T14:38:42.456Z] Tests run: 8, Failures: 0, Errors: 0, Skipped: 0, Time elapsed: 0.821 s - in org.eclipse.ease.lang.unittest.ModernJavaScriptTest
09:38:42 [2020-12-01T14:38:42.456Z] folderStatus(org.eclipse.ease.lang.unittest.ModernJavaScriptTest)  Time elapsed: 0.156 s
09:38:42 [2020-12-01T14:38:42.456Z] verifyOutput(org.eclipse.ease.lang.unittest.ModernJavaScriptTest)  Time elapsed: 0.11 s
09:38:42 [2020-12-01T14:38:42.456Z] suiteStatus(org.eclipse.ease.lang.unittest.ModernJavaScriptTest)  Time elapsed: 0.11 s
09:38:42 [2020-12-01T14:38:42.456Z] ignoreTestStatus(org.eclipse.ease.lang.unittest.ModernJavaScriptTest)  Time elapsed: 0.096 s
09:38:42 [2020-12-01T14:38:42.456Z] ignoreTestClassStatus(org.eclipse.ease.lang.unittest.ModernJavaScriptTest)  Time elapsed: 0.115 s
09:38:42 [2020-12-01T14:38:42.456Z] failureTestClassStatus(org.eclipse.ease.lang.unittest.ModernJavaScriptTest)  Time elapsed: 0.096 s
09:38:42 [2020-12-01T14:38:42.456Z] errorTestClassStatus(org.eclipse.ease.lang.unittest.ModernJavaScriptTest)  Time elapsed: 0.08 s
09:38:42 [2020-12-01T14:38:42.456Z] passTestClassStatus(org.eclipse.ease.lang.unittest.ModernJavaScriptTest)  Time elapsed: 0.055 s
09:38:42 [2020-12-01T14:38:42.456Z] 
09:38:42 [2020-12-01T14:38:42.456Z] Results:
09:38:42 [2020-12-01T14:38:42.456Z] 
09:38:42 [2020-12-01T14:38:42.456Z] Tests run: 15, Failures: 0, Errors: 0, Skipped: 0
09:38:42 [2020-12-01T14:38:42.456Z] 
09:38:43 [2020-12-01T14:38:43.382Z] [INFO] All tests passed!
09:38:43 [2020-12-01T14:38:43.382Z] [INFO] 
09:38:43 [2020-12-01T14:38:43.382Z] [INFO] --- maven-install-plugin:2.3.1:install (default-install) @ org.eclipse.ease.lang.unittest.test ---
09:38:43 [2020-12-01T14:38:43.382Z] [INFO] Installing /home/jenkins/agent/workspace/ease.verify.core.target.2019-06/tests/org.eclipse.ease.lang.unittest.test/target/org.eclipse.ease.lang.unittest.test-0.8.0-SNAPSHOT.jar to /home/jenkins/.m2/repository/org/eclipse/ease/org.eclipse.ease.lang.unittest.test/0.8.0-SNAPSHOT/org.eclipse.ease.lang.unittest.test-0.8.0-SNAPSHOT.jar
09:38:43 [2020-12-01T14:38:43.383Z] [INFO] Installing /home/jenkins/agent/workspace/ease.verify.core.target.2019-06/tests/org.eclipse.ease.lang.unittest.test/pom.xml to /home/jenkins/.m2/repository/org/eclipse/ease/org.eclipse.ease.lang.unittest.test/0.8.0-SNAPSHOT/org.eclipse.ease.lang.unittest.test-0.8.0-SNAPSHOT.pom
09:38:43 [2020-12-01T14:38:43.383Z] [INFO] Installing /home/jenkins/agent/workspace/ease.verify.core.target.2019-06/tests/org.eclipse.ease.lang.unittest.test/target/org.eclipse.ease.lang.unittest.test-0.8.0-SNAPSHOT-sources.jar to /home/jenkins/.m2/repository/org/eclipse/ease/org.eclipse.ease.lang.unittest.test/0.8.0-SNAPSHOT/org.eclipse.ease.lang.unittest.test-0.8.0-SNAPSHOT-sources.jar
09:38:43 [2020-12-01T14:38:43.383Z] [INFO] Installing /home/jenkins/agent/workspace/ease.verify.core.target.2019-06/tests/org.eclipse.ease.lang.unittest.test/target/p2content.xml to /home/jenkins/.m2/repository/org/eclipse/ease/org.eclipse.ease.lang.unittest.test/0.8.0-SNAPSHOT/org.eclipse.ease.lang.unittest.test-0.8.0-SNAPSHOT-p2metadata.xml
09:38:43 [2020-12-01T14:38:43.383Z] [INFO] Installing /home/jenkins/agent/workspace/ease.verify.core.target.2019-06/tests/org.eclipse.ease.lang.unittest.test/target/p2artifacts.xml to /home/jenkins/.m2/repository/org/eclipse/ease/org.eclipse.ease.lang.unittest.test/0.8.0-SNAPSHOT/org.eclipse.ease.lang.unittest.test-0.8.0-SNAPSHOT-p2artifacts.xml
09:38:43 [2020-12-01T14:38:43.383Z] [INFO] Installing /home/jenkins/agent/workspace/ease.verify.core.target.2019-06/tests/org.eclipse.ease.lang.unittest.test/target/p2content.xml to /home/jenkins/.m2/repository/org/eclipse/ease/org.eclipse.ease.lang.unittest.test/0.8.0-SNAPSHOT/org.eclipse.ease.lang.unittest.test-0.8.0-SNAPSHOT-p2metadata.xml
09:38:43 [2020-12-01T14:38:43.383Z] [INFO] Installing /home/jenkins/agent/workspace/ease.verify.core.target.2019-06/tests/org.eclipse.ease.lang.unittest.test/target/p2artifacts.xml to /home/jenkins/.m2/repository/org/eclipse/ease/org.eclipse.ease.lang.unittest.test/0.8.0-SNAPSHOT/org.eclipse.ease.lang.unittest.test-0.8.0-SNAPSHOT-p2artifacts.xml
09:38:43 [2020-12-01T14:38:43.383Z] [INFO] 
09:38:43 [2020-12-01T14:38:43.383Z] [INFO] --- tycho-p2-plugin:1.5.0:update-local-index (default-update-local-index) @ org.eclipse.ease.lang.unittest.test ---
09:38:43 [2020-12-01T14:38:43.383Z] [INFO] 
09:38:43 [2020-12-01T14:38:43.383Z] [INFO] ---------< org.eclipse.ease:org.eclipse.ease.ui.scripts.test >----------
09:38:43 [2020-12-01T14:38:43.383Z] [INFO] Building org.eclipse.ease.ui.scripts.test 0.8.0-SNAPSHOT         [46/48]
09:38:43 [2020-12-01T14:38:43.383Z] [INFO] ------------------------[ eclipse-test-plugin ]-------------------------
09:38:43 [2020-12-01T14:38:43.383Z] [INFO] 
09:38:43 [2020-12-01T14:38:43.383Z] [INFO] --- maven-clean-plugin:2.5:clean (default-clean) @ org.eclipse.ease.ui.scripts.test ---
09:38:43 [2020-12-01T14:38:43.383Z] [INFO] 
09:38:43 [2020-12-01T14:38:43.383Z] [INFO] --- tycho-packaging-plugin:1.5.0:build-qualifier (default-build-qualifier) @ org.eclipse.ease.ui.scripts.test ---
09:38:43 [2020-12-01T14:38:43.383Z] [INFO] The project's OSGi version is 0.8.0.I202009240747
09:38:43 [2020-12-01T14:38:43.383Z] [INFO] 
09:38:43 [2020-12-01T14:38:43.383Z] [INFO] --- tycho-packaging-plugin:1.5.0:validate-id (default-validate-id) @ org.eclipse.ease.ui.scripts.test ---
09:38:43 [2020-12-01T14:38:43.383Z] [INFO] 
09:38:43 [2020-12-01T14:38:43.383Z] [INFO] --- tycho-packaging-plugin:1.5.0:validate-version (default-validate-version) @ org.eclipse.ease.ui.scripts.test ---
09:38:43 [2020-12-01T14:38:43.383Z] [INFO] 
09:38:43 [2020-12-01T14:38:43.383Z] [INFO] >>> maven-javadoc-plugin:2.9.1:javadoc (build-docs) > generate-sources @ org.eclipse.ease.ui.scripts.test >>>
09:38:43 [2020-12-01T14:38:43.383Z] [INFO] 
09:38:43 [2020-12-01T14:38:43.383Z] [INFO] --- tycho-packaging-plugin:1.5.0:build-qualifier (default-build-qualifier) @ org.eclipse.ease.ui.scripts.test ---
09:38:43 [2020-12-01T14:38:43.383Z] [INFO] The project's OSGi version is 0.8.0.I202009240747
09:38:43 [2020-12-01T14:38:43.383Z] [INFO] 
09:38:43 [2020-12-01T14:38:43.383Z] [INFO] --- tycho-packaging-plugin:1.5.0:validate-id (default-validate-id) @ org.eclipse.ease.ui.scripts.test ---
09:38:43 [2020-12-01T14:38:43.383Z] [INFO] 
09:38:43 [2020-12-01T14:38:43.383Z] [INFO] --- tycho-packaging-plugin:1.5.0:validate-version (default-validate-version) @ org.eclipse.ease.ui.scripts.test ---
09:38:43 [2020-12-01T14:38:43.383Z] [INFO] 
09:38:43 [2020-12-01T14:38:43.383Z] [INFO] <<< maven-javadoc-plugin:2.9.1:javadoc (build-docs) < generate-sources @ org.eclipse.ease.ui.scripts.test <<<
09:38:43 [2020-12-01T14:38:43.383Z] [INFO] 
09:38:43 [2020-12-01T14:38:43.383Z] [INFO] 
09:38:43 [2020-12-01T14:38:43.383Z] [INFO] --- maven-javadoc-plugin:2.9.1:javadoc (build-docs) @ org.eclipse.ease.ui.scripts.test ---
09:38:43 [2020-12-01T14:38:43.383Z] [ERROR] Error fetching link: http://help.eclipse.org/oxygen/topic/org.eclipse.platform.doc.isv/reference/api/package-list. Ignored it.
09:38:43 [2020-12-01T14:38:43.639Z] [ERROR] Error fetching link: https://ci.eclipse.org/ease/job/ease.build.core/JavaDoc/package-list. Ignored it.
09:38:44 [2020-12-01T14:38:44.569Z] [INFO] 
09:38:44 [2020-12-01T14:38:44.570Z] Loading source files for package org.eclipse.ease.ui.scripts.expressions.definitions...
09:38:44 [2020-12-01T14:38:44.570Z] Constructing Javadoc information...
09:38:44 [2020-12-01T14:38:44.570Z] WARNING: Cannot open location "/home/jenkins/agent/workspace/ease.verify.core.target.2019-06/tests/org.eclipse.ease.ui.scripts.test/target/javadoc-bundle-options/package-list"
09:38:44 [2020-12-01T14:38:44.570Z] No plugin definition found, skipping
09:38:44 [2020-12-01T14:38:44.570Z] No plugin definition found, skipping
09:38:44 [2020-12-01T14:38:44.570Z] [WARNING] Javadoc Warnings
09:38:44 [2020-12-01T14:38:44.570Z] [WARNING] Picked up JAVA_TOOL_OPTIONS: -Dmaven.ext.class.path="/home/jenkins/agent/workspace/ease.verify.core.target.2019-06@tmp/withMavenda45dd09/pipeline-maven-spy.jar" -Dorg.jenkinsci.plugins.pipeline.maven.reportsFolder="/home/jenkins/agent/workspace/ease.verify.core.target.2019-06@tmp/withMavenda45dd09"
09:38:44 [2020-12-01T14:38:44.570Z] [WARNING] javadoc: warning - The old Doclet and Taglet APIs in the packages
09:38:44 [2020-12-01T14:38:44.570Z] [WARNING] com.sun.javadoc, com.sun.tools.doclets and their implementations
09:38:44 [2020-12-01T14:38:44.570Z] [WARNING] are planned to be removed in a future JDK release. These
09:38:44 [2020-12-01T14:38:44.570Z] [WARNING] components have been superseded by the new APIs in jdk.javadoc.doclet.
09:38:44 [2020-12-01T14:38:44.570Z] [WARNING] Users are strongly recommended to migrate to the new APIs.
09:38:44 [2020-12-01T14:38:44.570Z] [INFO] 
09:38:44 [2020-12-01T14:38:44.570Z] [INFO] --- build-helper-maven-plugin:1.9.1:add-resource (add_help) @ org.eclipse.ease.ui.scripts.test ---
09:38:44 [2020-12-01T14:38:44.570Z] [INFO] 
09:38:44 [2020-12-01T14:38:44.570Z] [INFO] --- maven-resources-plugin:2.4.3:resources (default-resources) @ org.eclipse.ease.ui.scripts.test ---
09:38:44 [2020-12-01T14:38:44.570Z] [INFO] Using 'UTF-8' encoding to copy filtered resources.
09:38:44 [2020-12-01T14:38:44.570Z] [INFO] skip non existing resourceDirectory /home/jenkins/agent/workspace/ease.verify.core.target.2019-06/tests/org.eclipse.ease.ui.scripts.test/src/main/resources
09:38:44 [2020-12-01T14:38:44.570Z] [INFO] skip non existing resourceDirectory /home/jenkins/agent/workspace/ease.verify.core.target.2019-06/tests/org.eclipse.ease.ui.scripts.test/help
09:38:44 [2020-12-01T14:38:44.570Z] [INFO] 
09:38:44 [2020-12-01T14:38:44.570Z] [INFO] --- tycho-compiler-plugin:1.5.0:compile (default-compile) @ org.eclipse.ease.ui.scripts.test ---
09:38:44 [2020-12-01T14:38:44.570Z] [INFO] Compiling 1 source file to /home/jenkins/agent/workspace/ease.verify.core.target.2019-06/tests/org.eclipse.ease.ui.scripts.test/target/classes
09:38:44 [2020-12-01T14:38:44.828Z] [INFO] 
09:38:44 [2020-12-01T14:38:44.828Z] [INFO] --- maven-resources-plugin:2.4.3:testResources (default-testResources) @ org.eclipse.ease.ui.scripts.test ---
09:38:44 [2020-12-01T14:38:44.828Z] [INFO] Using 'UTF-8' encoding to copy filtered resources.
09:38:44 [2020-12-01T14:38:44.828Z] [INFO] skip non existing resourceDirectory /home/jenkins/agent/workspace/ease.verify.core.target.2019-06/tests/org.eclipse.ease.ui.scripts.test/src/test/resources
09:38:44 [2020-12-01T14:38:44.828Z] [INFO] 
09:38:44 [2020-12-01T14:38:44.828Z] [INFO] --- tycho-source-plugin:1.5.0:plugin-source (plugin-source) @ org.eclipse.ease.ui.scripts.test ---
09:38:44 [2020-12-01T14:38:44.828Z] [INFO] Building jar: /home/jenkins/agent/workspace/ease.verify.core.target.2019-06/tests/org.eclipse.ease.ui.scripts.test/target/org.eclipse.ease.ui.scripts.test-0.8.0-SNAPSHOT-sources.jar
09:38:44 [2020-12-01T14:38:44.828Z] [INFO] 
09:38:44 [2020-12-01T14:38:44.828Z] [INFO] --- target-platform-configuration:1.5.0:target-platform (default-target-platform) @ org.eclipse.ease.ui.scripts.test ---
09:38:44 [2020-12-01T14:38:44.828Z] [INFO] 
09:38:44 [2020-12-01T14:38:44.828Z] [INFO] --- tycho-packaging-plugin:1.5.0:package-plugin (default-package-plugin) @ org.eclipse.ease.ui.scripts.test ---
09:38:44 [2020-12-01T14:38:44.828Z] [INFO] Building jar: /home/jenkins/agent/workspace/ease.verify.core.target.2019-06/tests/org.eclipse.ease.ui.scripts.test/target/org.eclipse.ease.ui.scripts.test-0.8.0-SNAPSHOT.jar
09:38:44 [2020-12-01T14:38:44.828Z] [INFO] 
09:38:44 [2020-12-01T14:38:44.828Z] [INFO] --- tycho-p2-plugin:1.5.0:p2-metadata-default (default-p2-metadata-default) @ org.eclipse.ease.ui.scripts.test ---
09:38:44 [2020-12-01T14:38:44.828Z] [INFO] 
09:38:44 [2020-12-01T14:38:44.828Z] [INFO] --- tycho-source-feature-plugin:1.5.0:source-feature (source-feature) @ org.eclipse.ease.ui.scripts.test ---
09:38:44 [2020-12-01T14:38:44.828Z] [INFO] 
09:38:44 [2020-12-01T14:38:44.828Z] [INFO] --- tycho-p2-plugin:1.5.0:p2-metadata (attached-p2-metadata) @ org.eclipse.ease.ui.scripts.test ---
09:38:44 [2020-12-01T14:38:44.828Z] [INFO] 
09:38:44 [2020-12-01T14:38:44.828Z] [INFO] --- tycho-surefire-plugin:1.5.0:test (default-test) @ org.eclipse.ease.ui.scripts.test ---
09:38:44 [2020-12-01T14:38:44.829Z] [INFO] Expected eclipse log file: /home/jenkins/agent/workspace/ease.verify.core.target.2019-06/tests/org.eclipse.ease.ui.scripts.test/target/work/data/.metadata/.log
09:38:44 [2020-12-01T14:38:44.829Z] [INFO] Command line:
09:38:44 [2020-12-01T14:38:44.829Z] 	[/opt/tools/java/openjdk/jdk-11/11.0.2+9/bin/java, -Dosgi.noShutdown=false, -Dosgi.os=linux, -Dosgi.ws=gtk, -Dosgi.arch=x86_64, -Dosgi.clean=true, -jar, /home/jenkins/.m2/repository/p2/osgi/bundle/org.eclipse.equinox.launcher/1.5.800.v20200727-1323/org.eclipse.equinox.launcher-1.5.800.v20200727-1323.jar, -data, /home/jenkins/agent/workspace/ease.verify.core.target.2019-06/tests/org.eclipse.ease.ui.scripts.test/target/work/data, -install, /home/jenkins/agent/workspace/ease.verify.core.target.2019-06/tests/org.eclipse.ease.ui.scripts.test/target/work, -configuration, /home/jenkins/agent/workspace/ease.verify.core.target.2019-06/tests/org.eclipse.ease.ui.scripts.test/target/work/configuration, -application, org.eclipse.tycho.surefire.osgibooter.headlesstest, -testproperties, /home/jenkins/agent/workspace/ease.verify.core.target.2019-06/tests/org.eclipse.ease.ui.scripts.test/target/surefire.properties]
09:38:44 [2020-12-01T14:38:44.829Z] Picked up JAVA_TOOL_OPTIONS: -Dmaven.ext.class.path="/home/jenkins/agent/workspace/ease.verify.core.target.2019-06@tmp/withMavenda45dd09/pipeline-maven-spy.jar" -Dorg.jenkinsci.plugins.pipeline.maven.reportsFolder="/home/jenkins/agent/workspace/ease.verify.core.target.2019-06@tmp/withMavenda45dd09" 
09:38:47 [2020-12-01T14:38:47.407Z] Running org.eclipse.ease.ui.scripts.expressions.definitions.ExpressionFactoryTest
09:38:47 [2020-12-01T14:38:47.407Z] Tests run: 14, Failures: 0, Errors: 0, Skipped: 0, Time elapsed: 0.034 s - in org.eclipse.ease.ui.scripts.expressions.definitions.ExpressionFactoryTest
09:38:47 [2020-12-01T14:38:47.407Z] loadClassWithExpression  Time elapsed: 0.011 s
09:38:47 [2020-12-01T14:38:47.407Z] createWithExpression  Time elapsed: 0.001 s
09:38:47 [2020-12-01T14:38:47.407Z] createReferenceExpression  Time elapsed: 0.001 s
09:38:47 [2020-12-01T14:38:47.407Z] loadClassReferenceExpression  Time elapsed: 0 s
09:38:47 [2020-12-01T14:38:47.407Z] loadClassTestExpression  Time elapsed: 0.001 s
09:38:47 [2020-12-01T14:38:47.407Z] createEqualsExpression  Time elapsed: 0.001 s
09:38:47 [2020-12-01T14:38:47.407Z] loadClassCountExpression  Time elapsed: 0.001 s
09:38:47 [2020-12-01T14:38:47.407Z] loadClassOrExpression  Time elapsed: 0 s
09:38:47 [2020-12-01T14:38:47.407Z] createTestExpression  Time elapsed: 0.003 s
09:38:47 [2020-12-01T14:38:47.407Z] createOrExpression  Time elapsed: 0.001 s
09:38:47 [2020-12-01T14:38:47.407Z] loadClassAndExpression  Time elapsed: 0.001 s
09:38:47 [2020-12-01T14:38:47.407Z] createAndExpression  Time elapsed: 0.001 s
09:38:47 [2020-12-01T14:38:47.407Z] loadClassEqualsExpression  Time elapsed: 0.001 s
09:38:47 [2020-12-01T14:38:47.407Z] createCountExpression  Time elapsed: 0.001 s
09:38:47 [2020-12-01T14:38:47.407Z] 
09:38:47 [2020-12-01T14:38:47.407Z] Results:
09:38:47 [2020-12-01T14:38:47.407Z] 
09:38:47 [2020-12-01T14:38:47.407Z] Tests run: 14, Failures: 0, Errors: 0, Skipped: 0
09:38:47 [2020-12-01T14:38:47.407Z] 
09:38:47 [2020-12-01T14:38:47.968Z] [INFO] All tests passed!
09:38:47 [2020-12-01T14:38:47.968Z] [INFO] 
09:38:47 [2020-12-01T14:38:47.968Z] [INFO] --- maven-install-plugin:2.3.1:install (default-install) @ org.eclipse.ease.ui.scripts.test ---
09:38:47 [2020-12-01T14:38:47.968Z] [INFO] Installing /home/jenkins/agent/workspace/ease.verify.core.target.2019-06/tests/org.eclipse.ease.ui.scripts.test/target/org.eclipse.ease.ui.scripts.test-0.8.0-SNAPSHOT.jar to /home/jenkins/.m2/repository/org/eclipse/ease/org.eclipse.ease.ui.scripts.test/0.8.0-SNAPSHOT/org.eclipse.ease.ui.scripts.test-0.8.0-SNAPSHOT.jar
09:38:47 [2020-12-01T14:38:47.968Z] [INFO] Installing /home/jenkins/agent/workspace/ease.verify.core.target.2019-06/tests/org.eclipse.ease.ui.scripts.test/pom.xml to /home/jenkins/.m2/repository/org/eclipse/ease/org.eclipse.ease.ui.scripts.test/0.8.0-SNAPSHOT/org.eclipse.ease.ui.scripts.test-0.8.0-SNAPSHOT.pom
09:38:47 [2020-12-01T14:38:47.968Z] [INFO] Installing /home/jenkins/agent/workspace/ease.verify.core.target.2019-06/tests/org.eclipse.ease.ui.scripts.test/target/org.eclipse.ease.ui.scripts.test-0.8.0-SNAPSHOT-sources.jar to /home/jenkins/.m2/repository/org/eclipse/ease/org.eclipse.ease.ui.scripts.test/0.8.0-SNAPSHOT/org.eclipse.ease.ui.scripts.test-0.8.0-SNAPSHOT-sources.jar
09:38:47 [2020-12-01T14:38:47.968Z] [INFO] Installing /home/jenkins/agent/workspace/ease.verify.core.target.2019-06/tests/org.eclipse.ease.ui.scripts.test/target/p2content.xml to /home/jenkins/.m2/repository/org/eclipse/ease/org.eclipse.ease.ui.scripts.test/0.8.0-SNAPSHOT/org.eclipse.ease.ui.scripts.test-0.8.0-SNAPSHOT-p2metadata.xml
09:38:47 [2020-12-01T14:38:47.968Z] [INFO] Installing /home/jenkins/agent/workspace/ease.verify.core.target.2019-06/tests/org.eclipse.ease.ui.scripts.test/target/p2artifacts.xml to /home/jenkins/.m2/repository/org/eclipse/ease/org.eclipse.ease.ui.scripts.test/0.8.0-SNAPSHOT/org.eclipse.ease.ui.scripts.test-0.8.0-SNAPSHOT-p2artifacts.xml
09:38:47 [2020-12-01T14:38:47.968Z] [INFO] Installing /home/jenkins/agent/workspace/ease.verify.core.target.2019-06/tests/org.eclipse.ease.ui.scripts.test/target/p2content.xml to /home/jenkins/.m2/repository/org/eclipse/ease/org.eclipse.ease.ui.scripts.test/0.8.0-SNAPSHOT/org.eclipse.ease.ui.scripts.test-0.8.0-SNAPSHOT-p2metadata.xml
09:38:47 [2020-12-01T14:38:47.968Z] [INFO] Installing /home/jenkins/agent/workspace/ease.verify.core.target.2019-06/tests/org.eclipse.ease.ui.scripts.test/target/p2artifacts.xml to /home/jenkins/.m2/repository/org/eclipse/ease/org.eclipse.ease.ui.scripts.test/0.8.0-SNAPSHOT/org.eclipse.ease.ui.scripts.test-0.8.0-SNAPSHOT-p2artifacts.xml
09:38:47 [2020-12-01T14:38:47.968Z] [INFO] 
09:38:47 [2020-12-01T14:38:47.968Z] [INFO] --- tycho-p2-plugin:1.5.0:update-local-index (default-update-local-index) @ org.eclipse.ease.ui.scripts.test ---
09:38:47 [2020-12-01T14:38:47.968Z] [INFO] 
09:38:47 [2020-12-01T14:38:47.968Z] [INFO] -------------< org.eclipse.ease:org.eclipse.ease.ui.test >--------------
09:38:47 [2020-12-01T14:38:47.968Z] [INFO] Building org.eclipse.ease.ui.test 0.8.0-SNAPSHOT                 [47/48]
09:38:47 [2020-12-01T14:38:47.968Z] [INFO] ------------------------[ eclipse-test-plugin ]-------------------------
09:38:47 [2020-12-01T14:38:47.968Z] [INFO] 
09:38:47 [2020-12-01T14:38:47.968Z] [INFO] --- maven-clean-plugin:2.5:clean (default-clean) @ org.eclipse.ease.ui.test ---
09:38:47 [2020-12-01T14:38:47.968Z] [INFO] 
09:38:47 [2020-12-01T14:38:47.968Z] [INFO] --- tycho-packaging-plugin:1.5.0:build-qualifier (default-build-qualifier) @ org.eclipse.ease.ui.test ---
09:38:47 [2020-12-01T14:38:47.968Z] [INFO] The project's OSGi version is 0.8.0.I201910171213
09:38:47 [2020-12-01T14:38:47.968Z] [INFO] 
09:38:47 [2020-12-01T14:38:47.969Z] [INFO] --- tycho-packaging-plugin:1.5.0:validate-id (default-validate-id) @ org.eclipse.ease.ui.test ---
09:38:47 [2020-12-01T14:38:47.969Z] [INFO] 
09:38:47 [2020-12-01T14:38:47.969Z] [INFO] --- tycho-packaging-plugin:1.5.0:validate-version (default-validate-version) @ org.eclipse.ease.ui.test ---
09:38:47 [2020-12-01T14:38:47.969Z] [INFO] 
09:38:47 [2020-12-01T14:38:47.969Z] [INFO] >>> maven-javadoc-plugin:2.9.1:javadoc (build-docs) > generate-sources @ org.eclipse.ease.ui.test >>>
09:38:47 [2020-12-01T14:38:47.969Z] [INFO] 
09:38:47 [2020-12-01T14:38:47.969Z] [INFO] --- tycho-packaging-plugin:1.5.0:build-qualifier (default-build-qualifier) @ org.eclipse.ease.ui.test ---
09:38:47 [2020-12-01T14:38:47.969Z] [INFO] The project's OSGi version is 0.8.0.I201910171213
09:38:47 [2020-12-01T14:38:47.969Z] [INFO] 
09:38:47 [2020-12-01T14:38:47.969Z] [INFO] --- tycho-packaging-plugin:1.5.0:validate-id (default-validate-id) @ org.eclipse.ease.ui.test ---
09:38:47 [2020-12-01T14:38:47.969Z] [INFO] 
09:38:47 [2020-12-01T14:38:47.969Z] [INFO] --- tycho-packaging-plugin:1.5.0:validate-version (default-validate-version) @ org.eclipse.ease.ui.test ---
09:38:47 [2020-12-01T14:38:47.969Z] [INFO] 
09:38:47 [2020-12-01T14:38:47.969Z] [INFO] <<< maven-javadoc-plugin:2.9.1:javadoc (build-docs) < generate-sources @ org.eclipse.ease.ui.test <<<
09:38:47 [2020-12-01T14:38:47.969Z] [INFO] 
09:38:47 [2020-12-01T14:38:47.969Z] [INFO] 
09:38:47 [2020-12-01T14:38:47.969Z] [INFO] --- maven-javadoc-plugin:2.9.1:javadoc (build-docs) @ org.eclipse.ease.ui.test ---
09:38:47 [2020-12-01T14:38:47.969Z] [ERROR] Error fetching link: http://help.eclipse.org/oxygen/topic/org.eclipse.platform.doc.isv/reference/api/package-list. Ignored it.
09:38:48 [2020-12-01T14:38:48.226Z] [ERROR] Error fetching link: https://ci.eclipse.org/ease/job/ease.build.core/JavaDoc/package-list. Ignored it.
09:38:49 [2020-12-01T14:38:49.623Z] [INFO] 
09:38:49 [2020-12-01T14:38:49.623Z] Loading source files for package org.eclipse.ease.ui.completion...
09:38:49 [2020-12-01T14:38:49.623Z] Loading source files for package org.eclipse.ease.ui.completion.provider...
09:38:49 [2020-12-01T14:38:49.623Z] Loading source files for package org.eclipse.ease.ui.completions.java.provider...
09:38:49 [2020-12-01T14:38:49.623Z] Loading source files for package org.eclipse.ease.ui.help.hovers...
09:38:49 [2020-12-01T14:38:49.623Z] Constructing Javadoc information...
09:38:49 [2020-12-01T14:38:49.623Z] WARNING: Cannot open location "/home/jenkins/agent/workspace/ease.verify.core.target.2019-06/tests/org.eclipse.ease.ui.test/target/javadoc-bundle-options/package-list"
09:38:49 [2020-12-01T14:38:49.624Z] [WARNING] Javadoc Warnings
09:38:49 [2020-12-01T14:38:49.624Z] [WARNING] Picked up JAVA_TOOL_OPTIONS: -Dmaven.ext.class.path="/home/jenkins/agent/workspace/ease.verify.core.target.2019-06@tmp/withMavenda45dd09/pipeline-maven-spy.jar" -Dorg.jenkinsci.plugins.pipeline.maven.reportsFolder="/home/jenkins/agent/workspace/ease.verify.core.target.2019-06@tmp/withMavenda45dd09"
09:38:49 [2020-12-01T14:38:49.624Z] [WARNING] javadoc: warning - The old Doclet and Taglet APIs in the packages
09:38:49 [2020-12-01T14:38:49.624Z] [WARNING] com.sun.javadoc, com.sun.tools.doclets and their implementations
09:38:49 [2020-12-01T14:38:49.624Z] [WARNING] are planned to be removed in a future JDK release. These
09:38:49 [2020-12-01T14:38:49.624Z] [WARNING] components have been superseded by the new APIs in jdk.javadoc.doclet.
09:38:49 [2020-12-01T14:38:49.624Z] [WARNING] Users are strongly recommended to migrate to the new APIs.
09:38:49 [2020-12-01T14:38:49.624Z] [INFO] 
09:38:49 [2020-12-01T14:38:49.624Z] [INFO] --- build-helper-maven-plugin:1.9.1:add-resource (add_help) @ org.eclipse.ease.ui.test ---
09:38:49 [2020-12-01T14:38:49.624Z] [INFO] 
09:38:49 [2020-12-01T14:38:49.624Z] [INFO] --- maven-resources-plugin:2.4.3:resources (default-resources) @ org.eclipse.ease.ui.test ---
09:38:49 [2020-12-01T14:38:49.624Z] [INFO] Using 'UTF-8' encoding to copy filtered resources.
09:38:49 [2020-12-01T14:38:49.624Z] [INFO] skip non existing resourceDirectory /home/jenkins/agent/workspace/ease.verify.core.target.2019-06/tests/org.eclipse.ease.ui.test/src/main/resources
09:38:49 [2020-12-01T14:38:49.624Z] [INFO] Copying 2 resources to help
09:38:49 [2020-12-01T14:38:49.624Z] [INFO] 
09:38:49 [2020-12-01T14:38:49.624Z] [INFO] --- tycho-compiler-plugin:1.5.0:compile (default-compile) @ org.eclipse.ease.ui.test ---
09:38:49 [2020-12-01T14:38:49.624Z] [INFO] Compiling 6 source files to /home/jenkins/agent/workspace/ease.verify.core.target.2019-06/tests/org.eclipse.ease.ui.test/target/classes
09:38:49 [2020-12-01T14:38:49.624Z] [INFO] 
09:38:49 [2020-12-01T14:38:49.624Z] [INFO] --- maven-resources-plugin:2.4.3:testResources (default-testResources) @ org.eclipse.ease.ui.test ---
09:38:49 [2020-12-01T14:38:49.624Z] [INFO] Using 'UTF-8' encoding to copy filtered resources.
09:38:49 [2020-12-01T14:38:49.624Z] [INFO] skip non existing resourceDirectory /home/jenkins/agent/workspace/ease.verify.core.target.2019-06/tests/org.eclipse.ease.ui.test/src/test/resources
09:38:49 [2020-12-01T14:38:49.624Z] [INFO] 
09:38:49 [2020-12-01T14:38:49.624Z] [INFO] --- tycho-source-plugin:1.5.0:plugin-source (plugin-source) @ org.eclipse.ease.ui.test ---
09:38:49 [2020-12-01T14:38:49.624Z] [WARNING] Bundle-Vendor header not found in /home/jenkins/agent/workspace/ease.verify.core.target.2019-06/tests/org.eclipse.ease.ui.test/META-INF/MANIFEST.MF, fallback to 'unknown' for source bundle
09:38:49 [2020-12-01T14:38:49.624Z] [INFO] Building jar: /home/jenkins/agent/workspace/ease.verify.core.target.2019-06/tests/org.eclipse.ease.ui.test/target/org.eclipse.ease.ui.test-0.8.0-SNAPSHOT-sources.jar
09:38:49 [2020-12-01T14:38:49.624Z] [INFO] 
09:38:49 [2020-12-01T14:38:49.624Z] [INFO] --- target-platform-configuration:1.5.0:target-platform (default-target-platform) @ org.eclipse.ease.ui.test ---
09:38:49 [2020-12-01T14:38:49.624Z] [INFO] 
09:38:49 [2020-12-01T14:38:49.624Z] [INFO] --- tycho-packaging-plugin:1.5.0:package-plugin (default-package-plugin) @ org.eclipse.ease.ui.test ---
09:38:49 [2020-12-01T14:38:49.624Z] [INFO] Building jar: /home/jenkins/agent/workspace/ease.verify.core.target.2019-06/tests/org.eclipse.ease.ui.test/target/org.eclipse.ease.ui.test-0.8.0-SNAPSHOT.jar
09:38:49 [2020-12-01T14:38:49.624Z] [INFO] 
09:38:49 [2020-12-01T14:38:49.624Z] [INFO] --- tycho-p2-plugin:1.5.0:p2-metadata-default (default-p2-metadata-default) @ org.eclipse.ease.ui.test ---
09:38:49 [2020-12-01T14:38:49.624Z] [INFO] 
09:38:49 [2020-12-01T14:38:49.624Z] [INFO] --- tycho-source-feature-plugin:1.5.0:source-feature (source-feature) @ org.eclipse.ease.ui.test ---
09:38:49 [2020-12-01T14:38:49.624Z] [INFO] 
09:38:49 [2020-12-01T14:38:49.624Z] [INFO] --- tycho-p2-plugin:1.5.0:p2-metadata (attached-p2-metadata) @ org.eclipse.ease.ui.test ---
09:38:49 [2020-12-01T14:38:49.624Z] [INFO] 
09:38:49 [2020-12-01T14:38:49.624Z] [INFO] --- tycho-surefire-plugin:1.5.0:test (default-test) @ org.eclipse.ease.ui.test ---
09:38:49 [2020-12-01T14:38:49.884Z] [INFO] Expected eclipse log file: /home/jenkins/agent/workspace/ease.verify.core.target.2019-06/tests/org.eclipse.ease.ui.test/target/work/data/.metadata/.log
09:38:49 [2020-12-01T14:38:49.884Z] [INFO] Command line:
09:38:49 [2020-12-01T14:38:49.884Z] 	[/opt/tools/java/openjdk/jdk-11/11.0.2+9/bin/java, -Dosgi.noShutdown=false, -Dosgi.os=linux, -Dosgi.ws=gtk, -Dosgi.arch=x86_64, -Dosgi.clean=true, -jar, /home/jenkins/.m2/repository/p2/osgi/bundle/org.eclipse.equinox.launcher/1.5.800.v20200727-1323/org.eclipse.equinox.launcher-1.5.800.v20200727-1323.jar, -data, /home/jenkins/agent/workspace/ease.verify.core.target.2019-06/tests/org.eclipse.ease.ui.test/target/work/data, -install, /home/jenkins/agent/workspace/ease.verify.core.target.2019-06/tests/org.eclipse.ease.ui.test/target/work, -configuration, /home/jenkins/agent/workspace/ease.verify.core.target.2019-06/tests/org.eclipse.ease.ui.test/target/work/configuration, -application, org.eclipse.tycho.surefire.osgibooter.headlesstest, -testproperties, /home/jenkins/agent/workspace/ease.verify.core.target.2019-06/tests/org.eclipse.ease.ui.test/target/surefire.properties]
09:38:49 [2020-12-01T14:38:49.884Z] Picked up JAVA_TOOL_OPTIONS: -Dmaven.ext.class.path="/home/jenkins/agent/workspace/ease.verify.core.target.2019-06@tmp/withMavenda45dd09/pipeline-maven-spy.jar" -Dorg.jenkinsci.plugins.pipeline.maven.reportsFolder="/home/jenkins/agent/workspace/ease.verify.core.target.2019-06@tmp/withMavenda45dd09" 
09:38:51 [2020-12-01T14:38:51.816Z] Running org.eclipse.ease.ui.completion.CompletionContextTest
09:38:52 [2020-12-01T14:38:52.090Z] Tests run: 9, Failures: 0, Errors: 0, Skipped: 0, Time elapsed: 0.089 s - in org.eclipse.ease.ui.completion.CompletionContextTest
09:38:52 [2020-12-01T14:38:52.090Z] resolveStaticClass(org.eclipse.ease.ui.completion.CompletionContextTest)  Time elapsed: 0.046 s
09:38:52 [2020-12-01T14:38:52.090Z] resolveClassWithFilter(org.eclipse.ease.ui.completion.CompletionContextTest)  Time elapsed: 0.001 s
09:38:52 [2020-12-01T14:38:52.090Z] simplifyCalls(org.eclipse.ease.ui.completion.CompletionContextTest)  Time elapsed: 0.001 s
09:38:52 [2020-12-01T14:38:52.090Z] resolveClass(org.eclipse.ease.ui.completion.CompletionContextTest)  Time elapsed: 0 s
09:38:52 [2020-12-01T14:38:52.090Z] replaceEscapedStringLiterals(org.eclipse.ease.ui.completion.CompletionContextTest)  Time elapsed: 0.001 s
09:38:52 [2020-12-01T14:38:52.090Z] replaceSimpleStringLiterals(org.eclipse.ease.ui.completion.CompletionContextTest)  Time elapsed: 0 s
09:38:52 [2020-12-01T14:38:52.090Z] resolveStaticClassWithFilter(org.eclipse.ease.ui.completion.CompletionContextTest)  Time elapsed: 0.001 s
09:38:52 [2020-12-01T14:38:52.090Z] resolveClassWithParameters(org.eclipse.ease.ui.completion.CompletionContextTest)  Time elapsed: 0 s
09:38:52 [2020-12-01T14:38:52.090Z] replaceMultipleStringLiterals(org.eclipse.ease.ui.completion.CompletionContextTest)  Time elapsed: 0 s
09:38:52 [2020-12-01T14:38:52.090Z] Running org.eclipse.ease.ui.completion.provider.AbstractFileLocationCompletionProviderTest
09:38:52 [2020-12-01T14:38:52.090Z] Tests run: 8, Failures: 0, Errors: 0, Skipped: 8, Time elapsed: 0.082 s - in org.eclipse.ease.ui.completion.provider.AbstractFileLocationCompletionProviderTest
09:38:52 [2020-12-01T14:38:52.090Z] workspaceProjectProposals(org.eclipse.ease.ui.completion.provider.AbstractFileLocationCompletionProviderTest) skipped
09:38:52 [2020-12-01T14:38:52.090Z] checkOperatingSystem(org.eclipse.ease.ui.completion.provider.AbstractFileLocationCompletionProviderTest) skipped
09:38:52 [2020-12-01T14:38:52.090Z] absoluteRootWorkspaceProposals(org.eclipse.ease.ui.completion.provider.AbstractFileLocationCompletionProviderTest) skipped
09:38:52 [2020-12-01T14:38:52.090Z] workspaceFolderProposals(org.eclipse.ease.ui.completion.provider.AbstractFileLocationCompletionProviderTest) skipped
09:38:52 [2020-12-01T14:38:52.090Z] fileSystemFolderProposals(org.eclipse.ease.ui.completion.provider.AbstractFileLocationCompletionProviderTest) skipped
09:38:52 [2020-12-01T14:38:52.090Z] workspaceProposals(org.eclipse.ease.ui.completion.provider.AbstractFileLocationCompletionProviderTest) skipped
09:38:52 [2020-12-01T14:38:52.091Z] relativeRootWorkspaceProposals(org.eclipse.ease.ui.completion.provider.AbstractFileLocationCompletionProviderTest) skipped
09:38:52 [2020-12-01T14:38:52.091Z] fileSystemRootProposals(org.eclipse.ease.ui.completion.provider.AbstractFileLocationCompletionProviderTest) skipped
09:38:52 [2020-12-01T14:38:52.091Z] Running org.eclipse.ease.ui.help.hovers.ModuleHelpTest
09:38:52 [2020-12-01T14:38:52.091Z] Tests run: 4, Failures: 0, Errors: 0, Skipped: 4, Time elapsed: 0.001 s - in org.eclipse.ease.ui.help.hovers.ModuleHelpTest
09:38:52 [2020-12-01T14:38:52.091Z] getModuleHelpLocation(org.eclipse.ease.ui.help.hovers.ModuleHelpTest) skipped
09:38:52 [2020-12-01T14:38:52.091Z] getModuleHelp(org.eclipse.ease.ui.help.hovers.ModuleHelpTest) skipped
09:38:52 [2020-12-01T14:38:52.091Z] getMethodHelp(org.eclipse.ease.ui.help.hovers.ModuleHelpTest) skipped
09:38:52 [2020-12-01T14:38:52.091Z] getConstantHelp(org.eclipse.ease.ui.help.hovers.ModuleHelpTest) skipped
09:38:52 [2020-12-01T14:38:52.091Z] Running org.eclipse.ease.ui.completions.java.provider.JavaPackagesCompletionsProviderTest
09:38:52 [2020-12-01T14:38:52.091Z] WARNING: An illegal reflective access operation has occurred
09:38:52 [2020-12-01T14:38:52.091Z] WARNING: Illegal reflective access by org.mockito.cglib.core.ReflectUtils$2 (file:/home/jenkins/.m2/repository/p2/osgi/bundle/org.mockito/1.9.5.v201605172210/org.mockito-1.9.5.v201605172210.jar) to method java.lang.ClassLoader.defineClass(java.lang.String,byte[],int,int,java.security.ProtectionDomain)
09:38:52 [2020-12-01T14:38:52.091Z] WARNING: Please consider reporting this to the maintainers of org.mockito.cglib.core.ReflectUtils$2
09:38:52 [2020-12-01T14:38:52.091Z] WARNING: Use --illegal-access=warn to enable warnings of further illegal reflective access operations
09:38:52 [2020-12-01T14:38:52.091Z] WARNING: All illegal access operations will be denied in a future release
09:38:58 [2020-12-01T14:38:58.636Z] Tests run: 4, Failures: 0, Errors: 0, Skipped: 0, Time elapsed: 5.937 s - in org.eclipse.ease.ui.completions.java.provider.JavaPackagesCompletionsProviderTest
09:38:58 [2020-12-01T14:38:58.636Z] containsJavaLangPackageProposal(org.eclipse.ease.ui.completions.java.provider.JavaPackagesCompletionsProviderTest)  Time elapsed: 0.449 s
09:38:58 [2020-12-01T14:38:58.636Z] containsOrgRootPackageProposal(org.eclipse.ease.ui.completions.java.provider.JavaPackagesCompletionsProviderTest)  Time elapsed: 0.02 s
09:38:58 [2020-12-01T14:38:58.637Z] containsJavaRootPackageProposal(org.eclipse.ease.ui.completions.java.provider.JavaPackagesCompletionsProviderTest)  Time elapsed: 0.008 s
09:38:58 [2020-12-01T14:38:58.637Z] containsOrgEclipsePackageProposal(org.eclipse.ease.ui.completions.java.provider.JavaPackagesCompletionsProviderTest)  Time elapsed: 0.055 s
09:38:58 [2020-12-01T14:38:58.637Z] Running org.eclipse.ease.ui.completions.java.provider.JavaClassCompletionsProviderTest
09:39:03 [2020-12-01T14:39:03.882Z] Tests run: 6, Failures: 0, Errors: 0, Skipped: 0, Time elapsed: 5.166 s - in org.eclipse.ease.ui.completions.java.provider.JavaClassCompletionsProviderTest
09:39:03 [2020-12-01T14:39:03.882Z] containsPackageFileCompletion(org.eclipse.ease.ui.completions.java.provider.JavaClassCompletionsProviderTest)  Time elapsed: 0.008 s
09:39:03 [2020-12-01T14:39:03.882Z] containsGlobalFileCompletion(org.eclipse.ease.ui.completions.java.provider.JavaClassCompletionsProviderTest)  Time elapsed: 0.031 s
09:39:03 [2020-12-01T14:39:03.882Z] containsJavaLangPackageProposal(org.eclipse.ease.ui.completions.java.provider.JavaClassCompletionsProviderTest)  Time elapsed: 0.052 s
09:39:03 [2020-12-01T14:39:03.882Z] containsOrgRootPackageProposal(org.eclipse.ease.ui.completions.java.provider.JavaClassCompletionsProviderTest)  Time elapsed: 0.005 s
09:39:03 [2020-12-01T14:39:03.882Z] containsJavaRootPackageProposal(org.eclipse.ease.ui.completions.java.provider.JavaClassCompletionsProviderTest)  Time elapsed: 0.005 s
09:39:03 [2020-12-01T14:39:03.882Z] containsOrgEclipsePackageProposal(org.eclipse.ease.ui.completions.java.provider.JavaClassCompletionsProviderTest)  Time elapsed: 0.058 s
09:39:03 [2020-12-01T14:39:03.882Z] 
09:39:03 [2020-12-01T14:39:03.882Z] Results:
09:39:03 [2020-12-01T14:39:03.882Z] 
09:39:03 [2020-12-01T14:39:03.882Z] Tests run: 31, Failures: 0, Errors: 0, Skipped: 12
09:39:03 [2020-12-01T14:39:03.882Z] 
09:39:04 [2020-12-01T14:39:04.443Z] [INFO] All tests passed!
09:39:04 [2020-12-01T14:39:04.443Z] [INFO] 
09:39:04 [2020-12-01T14:39:04.443Z] [INFO] --- maven-install-plugin:2.3.1:install (default-install) @ org.eclipse.ease.ui.test ---
09:39:04 [2020-12-01T14:39:04.443Z] [INFO] Installing /home/jenkins/agent/workspace/ease.verify.core.target.2019-06/tests/org.eclipse.ease.ui.test/target/org.eclipse.ease.ui.test-0.8.0-SNAPSHOT.jar to /home/jenkins/.m2/repository/org/eclipse/ease/org.eclipse.ease.ui.test/0.8.0-SNAPSHOT/org.eclipse.ease.ui.test-0.8.0-SNAPSHOT.jar
09:39:04 [2020-12-01T14:39:04.444Z] [INFO] Installing /home/jenkins/agent/workspace/ease.verify.core.target.2019-06/tests/org.eclipse.ease.ui.test/pom.xml to /home/jenkins/.m2/repository/org/eclipse/ease/org.eclipse.ease.ui.test/0.8.0-SNAPSHOT/org.eclipse.ease.ui.test-0.8.0-SNAPSHOT.pom
09:39:04 [2020-12-01T14:39:04.444Z] [INFO] Installing /home/jenkins/agent/workspace/ease.verify.core.target.2019-06/tests/org.eclipse.ease.ui.test/target/org.eclipse.ease.ui.test-0.8.0-SNAPSHOT-sources.jar to /home/jenkins/.m2/repository/org/eclipse/ease/org.eclipse.ease.ui.test/0.8.0-SNAPSHOT/org.eclipse.ease.ui.test-0.8.0-SNAPSHOT-sources.jar
09:39:04 [2020-12-01T14:39:04.444Z] [INFO] Installing /home/jenkins/agent/workspace/ease.verify.core.target.2019-06/tests/org.eclipse.ease.ui.test/target/p2content.xml to /home/jenkins/.m2/repository/org/eclipse/ease/org.eclipse.ease.ui.test/0.8.0-SNAPSHOT/org.eclipse.ease.ui.test-0.8.0-SNAPSHOT-p2metadata.xml
09:39:04 [2020-12-01T14:39:04.444Z] [INFO] Installing /home/jenkins/agent/workspace/ease.verify.core.target.2019-06/tests/org.eclipse.ease.ui.test/target/p2artifacts.xml to /home/jenkins/.m2/repository/org/eclipse/ease/org.eclipse.ease.ui.test/0.8.0-SNAPSHOT/org.eclipse.ease.ui.test-0.8.0-SNAPSHOT-p2artifacts.xml
09:39:04 [2020-12-01T14:39:04.444Z] [INFO] Installing /home/jenkins/agent/workspace/ease.verify.core.target.2019-06/tests/org.eclipse.ease.ui.test/target/p2content.xml to /home/jenkins/.m2/repository/org/eclipse/ease/org.eclipse.ease.ui.test/0.8.0-SNAPSHOT/org.eclipse.ease.ui.test-0.8.0-SNAPSHOT-p2metadata.xml
09:39:04 [2020-12-01T14:39:04.444Z] [INFO] Installing /home/jenkins/agent/workspace/ease.verify.core.target.2019-06/tests/org.eclipse.ease.ui.test/target/p2artifacts.xml to /home/jenkins/.m2/repository/org/eclipse/ease/org.eclipse.ease.ui.test/0.8.0-SNAPSHOT/org.eclipse.ease.ui.test-0.8.0-SNAPSHOT-p2artifacts.xml
09:39:04 [2020-12-01T14:39:04.444Z] [INFO] 
09:39:04 [2020-12-01T14:39:04.444Z] [INFO] --- tycho-p2-plugin:1.5.0:update-local-index (default-update-local-index) @ org.eclipse.ease.ui.test ---
09:39:04 [2020-12-01T14:39:04.444Z] [INFO] 
09:39:04 [2020-12-01T14:39:04.444Z] [INFO] ---------------------< org.eclipse.ease:ease.core >---------------------
09:39:04 [2020-12-01T14:39:04.444Z] [INFO] Building EASE (Incubation) 0.4.0-SNAPSHOT                        [48/48]
09:39:04 [2020-12-01T14:39:04.444Z] [INFO] --------------------------------[ pom ]---------------------------------
09:39:04 [2020-12-01T14:39:04.444Z] [INFO] 
09:39:04 [2020-12-01T14:39:04.444Z] [INFO] --- maven-clean-plugin:2.5:clean (default-clean) @ ease.core ---
09:39:04 [2020-12-01T14:39:04.700Z] [INFO] 
09:39:04 [2020-12-01T14:39:04.700Z] [INFO] --- maven-install-plugin:2.4:install (default-install) @ ease.core ---
09:39:04 [2020-12-01T14:39:04.700Z] [INFO] Installing /home/jenkins/agent/workspace/ease.verify.core.target.2019-06/pom.xml to /home/jenkins/.m2/repository/org/eclipse/ease/ease.core/0.4.0-SNAPSHOT/ease.core-0.4.0-SNAPSHOT.pom
09:39:04 [2020-12-01T14:39:04.700Z] [INFO] ------------------------------------------------------------------------
09:39:04 [2020-12-01T14:39:04.700Z] [INFO] Reactor Summary:
09:39:04 [2020-12-01T14:39:04.700Z] [INFO] 
09:39:04 [2020-12-01T14:39:04.700Z] [INFO] org.eclipse.ease.releng 0.8.0-SNAPSHOT ............. SUCCESS [  6.921 s]
09:39:04 [2020-12-01T14:39:04.700Z] [INFO] org.eclipse.ease.classloader 0.8.0-SNAPSHOT ........ SUCCESS [  8.463 s]
09:39:04 [2020-12-01T14:39:04.700Z] [INFO] org.eclipse.ease 0.8.0-SNAPSHOT .................... SUCCESS [  3.755 s]
09:39:04 [2020-12-01T14:39:04.700Z] [INFO] org.eclipse.ease.ui 0.8.0-SNAPSHOT ................. SUCCESS [  4.050 s]
09:39:04 [2020-12-01T14:39:04.700Z] [INFO] org.eclipse.ease.ui.completions.java 0.8.0-SNAPSHOT  SUCCESS [  3.069 s]
09:39:04 [2020-12-01T14:39:04.700Z] [INFO] org.eclipse.ease.ui.scripts 0.8.0-SNAPSHOT ......... SUCCESS [  3.071 s]
09:39:04 [2020-12-01T14:39:04.700Z] [INFO] org.eclipse.ease.lang.javascript 0.8.0-SNAPSHOT .... SUCCESS [  1.626 s]
09:39:04 [2020-12-01T14:39:04.700Z] [INFO] org.eclipse.ease.lang.scriptarchive 0.8.0-SNAPSHOT . SUCCESS [  1.475 s]
09:39:04 [2020-12-01T14:39:04.700Z] [INFO] org.eclipse.ease.lang.python 0.8.0-SNAPSHOT ........ SUCCESS [  1.839 s]
09:39:04 [2020-12-01T14:39:04.700Z] [INFO] org.eclipse.ease.lang.python.py4j 0.8.0-SNAPSHOT ... SUCCESS [  1.604 s]
09:39:04 [2020-12-01T14:39:04.700Z] [INFO] org.eclipse.ease.lang.groovy 0.8.0-SNAPSHOT ........ SUCCESS [  1.673 s]
09:39:04 [2020-12-01T14:39:04.700Z] [INFO] org.eclipse.ease.lang.groovy.interpreter 0.8.0-SNAPSHOT SUCCESS [  1.609 s]
09:39:04 [2020-12-01T14:39:04.700Z] [INFO] org.eclipse.ease.lang.unittest 0.8.0-SNAPSHOT ...... SUCCESS [  2.591 s]
09:39:04 [2020-12-01T14:39:04.700Z] [INFO] org.eclipse.ease.lang.unittest.ui 0.8.0-SNAPSHOT ... SUCCESS [  2.512 s]
09:39:04 [2020-12-01T14:39:04.700Z] [INFO] org.eclipse.ease.lang.ruby 0.8.0-SNAPSHOT .......... SUCCESS [  1.540 s]
09:39:04 [2020-12-01T14:39:04.700Z] [INFO] org.eclipse.ease.lang.ruby.jruby 0.8.0-SNAPSHOT .... SUCCESS [  2.785 s]
09:39:04 [2020-12-01T14:39:04.700Z] [INFO] org.eclipse.ease.lang.javascript.nashorn 0.8.0-SNAPSHOT SUCCESS [  1.756 s]
09:39:04 [2020-12-01T14:39:04.701Z] [INFO] org.eclipse.ease.lang.javascript.rhino 0.8.0-SNAPSHOT SUCCESS [  2.150 s]
09:39:04 [2020-12-01T14:39:04.701Z] [INFO] org.eclipse.ease.lang.python.jython 0.8.0-SNAPSHOT . SUCCESS [  1.976 s]
09:39:04 [2020-12-01T14:39:04.701Z] [INFO] org.eclipse.ease.lang.javascript.ui 0.8.0-SNAPSHOT . SUCCESS [  1.912 s]
09:39:04 [2020-12-01T14:39:04.701Z] [INFO] org.eclipse.ease.lang.jvm.compiled 0.8.0-SNAPSHOT .. SUCCESS [  1.906 s]
09:39:04 [2020-12-01T14:39:04.701Z] [INFO] org.eclipse.ease.lang.scriptarchive.ui 0.8.0-SNAPSHOT SUCCESS [  1.889 s]
09:39:04 [2020-12-01T14:39:04.701Z] [INFO] org.eclipse.ease.help 0.8.0-SNAPSHOT ............... SUCCESS [  0.283 s]
09:39:04 [2020-12-01T14:39:04.701Z] [INFO] org.eclipse.ease.feature 0.8.0-SNAPSHOT ............ SUCCESS [  0.299 s]
09:39:04 [2020-12-01T14:39:04.701Z] [INFO] org.eclipse.ease.ui.feature 0.8.0-SNAPSHOT ......... SUCCESS [  0.276 s]
09:39:04 [2020-12-01T14:39:04.701Z] [INFO] org.eclipse.ease.lang.javascript.feature 0.8.0-SNAPSHOT SUCCESS [  0.222 s]
09:39:04 [2020-12-01T14:39:04.701Z] [INFO] org.eclipse.ease.lang.python.feature 0.8.0-SNAPSHOT  SUCCESS [  0.178 s]
09:39:04 [2020-12-01T14:39:04.701Z] [INFO] org.eclipse.ease.python.jython.feature 0.8.0-SNAPSHOT SUCCESS [  0.115 s]
09:39:04 [2020-12-01T14:39:04.701Z] [INFO] org.eclipse.ease.lang.python.py4j.feature 0.8.0-SNAPSHOT SUCCESS [  0.175 s]
09:39:04 [2020-12-01T14:39:04.701Z] [INFO] org.eclipse.ease.lang.jvm.feature 0.8.0-SNAPSHOT ... SUCCESS [  0.146 s]
09:39:04 [2020-12-01T14:39:04.701Z] [INFO] org.eclipse.ease.lang.groovy.feature 0.8.0-SNAPSHOT  SUCCESS [  0.156 s]
09:39:04 [2020-12-01T14:39:04.701Z] [INFO] org.eclipse.ease.lang.ruby.feature 0.8.0-SNAPSHOT .. SUCCESS [  0.133 s]
09:39:04 [2020-12-01T14:39:04.701Z] [INFO] org.eclipse.ease.lang.scriptarchive.feature 0.8.0-SNAPSHOT SUCCESS [  0.125 s]
09:39:04 [2020-12-01T14:39:04.701Z] [INFO] org.eclipse.ease.lang.unittest.feature 0.8.0-SNAPSHOT SUCCESS [  0.167 s]
09:39:04 [2020-12-01T14:39:04.701Z] [INFO] org.eclipse.ease.releng.target 0.8.0-SNAPSHOT ...... SUCCESS [  0.013 s]
09:39:04 [2020-12-01T14:39:04.701Z] [INFO] org.eclipse.ease.releng.p2 0.8.0-SNAPSHOT .......... SUCCESS [  3.924 s]
09:39:04 [2020-12-01T14:39:04.701Z] [INFO] org.eclipse.ease.testhelper 0.8.0-SNAPSHOT ......... SUCCESS [  1.785 s]
09:39:04 [2020-12-01T14:39:04.701Z] [INFO] org.eclipse.ease.test 0.8.0-SNAPSHOT ............... SUCCESS [ 18.443 s]
09:39:04 [2020-12-01T14:39:04.701Z] [INFO] org.eclipse.ease.lang.javascript.nashorn.test 0.8.0-SNAPSHOT SUCCESS [  5.369 s]
09:39:04 [2020-12-01T14:39:04.701Z] [INFO] org.eclipse.ease.lang.javascript.rhino.test 0.8.0-SNAPSHOT SUCCESS [ 17.013 s]
09:39:04 [2020-12-01T14:39:04.701Z] [INFO] org.eclipse.ease.lang.javascript.test 0.8.0-SNAPSHOT SUCCESS [  4.956 s]
09:39:04 [2020-12-01T14:39:04.701Z] [INFO] org.eclipse.ease.lang.python.test 0.8.0-SNAPSHOT ... SUCCESS [  4.345 s]
09:39:04 [2020-12-01T14:39:04.701Z] [INFO] org.eclipse.ease.lang.python.jython.test 0.8.0-SNAPSHOT SUCCESS [ 17.791 s]
09:39:04 [2020-12-01T14:39:04.701Z] [INFO] org.eclipse.ease.lang.scriptarchive.test 0.8.0-SNAPSHOT SUCCESS [  4.706 s]
09:39:04 [2020-12-01T14:39:04.701Z] [INFO] org.eclipse.ease.lang.unittest.test 0.8.0-SNAPSHOT . SUCCESS [  7.676 s]
09:39:04 [2020-12-01T14:39:04.701Z] [INFO] org.eclipse.ease.ui.scripts.test 0.8.0-SNAPSHOT .... SUCCESS [  4.573 s]
09:39:04 [2020-12-01T14:39:04.701Z] [INFO] org.eclipse.ease.ui.test 0.8.0-SNAPSHOT ............ SUCCESS [ 16.613 s]
09:39:04 [2020-12-01T14:39:04.701Z] [INFO] EASE (Incubation) 0.4.0-SNAPSHOT ................... SUCCESS [  0.237 s]
09:39:04 [2020-12-01T14:39:04.701Z] [INFO] ------------------------------------------------------------------------
09:39:04 [2020-12-01T14:39:04.701Z] [INFO] BUILD SUCCESS
09:39:04 [2020-12-01T14:39:04.701Z] [INFO] ------------------------------------------------------------------------
09:39:04 [2020-12-01T14:39:04.701Z] [INFO] Total time:  09:34 min
09:39:04 [2020-12-01T14:39:04.701Z] [INFO] Finished at: 2020-12-01T14:39:04Z
09:39:04 [2020-12-01T14:39:04.701Z] [INFO] ------------------------------------------------------------------------
09:39:04 [2020-12-01T14:39:04.701Z] [INFO] [jenkins-event-spy] Generated /home/jenkins/agent/workspace/ease.verify.core.target.2019-06@tmp/withMavenda45dd09/maven-spy-20201201-142930-42917206350779953542913.log