FailedConsole Output

Skipping 963 KB.. Full Log
09:34:59 [2020-11-10T14:34:59.827Z] [INFO] Fetching org.eclipse.jdt.ui_3.18.0.v20190601-2139.jar.pack.gz from http://download.eclipse.org/releases/2019-06/201906191000/plugins/ (4.04MB)
09:34:59 [2020-11-10T14:34:59.827Z] [INFO] Fetching org.eclipse.jdt.ui_3.18.0.v20190601-2139.jar.pack.gz from http://download.eclipse.org/releases/2019-06/201906191000/plugins/ (4.04MB)
09:35:02 [2020-11-10T14:35:02.345Z] [INFO] Fetching org.eclipse.jdt.core_3.18.0.v20190522-0428.jar from http://download.eclipse.org/releases/2019-06/201906191000/plugins/ (6.65MB)
09:35:02 [2020-11-10T14:35:02.345Z] [INFO] Fetching org.eclipse.jdt.core_3.18.0.v20190522-0428.jar from http://download.eclipse.org/releases/2019-06/201906191000/plugins/ (6.65MB)
09:35:02 [2020-11-10T14:35:02.600Z] [INFO] Fetching org.objectweb.asm_7.1.0.v20190412-2143.jar.pack.gz from http://download.eclipse.org/releases/2019-06/201906191000/plugins/ (58.92kB)
09:35:02 [2020-11-10T14:35:02.600Z] [INFO] Fetching org.objectweb.asm_7.1.0.v20190412-2143.jar.pack.gz from http://download.eclipse.org/releases/2019-06/201906191000/plugins/ (58.92kB)
09:35:02 [2020-11-10T14:35:02.601Z] [INFO] Fetching org.eclipse.help.ui_4.1.500.v20190519-2119.jar.pack.gz from http://download.eclipse.org/releases/2019-06/201906191000/plugins/ (204.91kB)
09:35:02 [2020-11-10T14:35:02.601Z] [INFO] Fetching org.eclipse.help.ui_4.1.500.v20190519-2119.jar.pack.gz from http://download.eclipse.org/releases/2019-06/201906191000/plugins/ (204.91kB)
09:35:02 [2020-11-10T14:35:02.856Z] [INFO] Fetching org.eclipse.help.webapp_3.9.500.v20190517-1202.jar.pack.gz from http://download.eclipse.org/releases/2019-06/201906191000/plugins/ (284.28kB)
09:35:02 [2020-11-10T14:35:02.856Z] [INFO] Fetching org.eclipse.help.webapp_3.9.500.v20190517-1202.jar.pack.gz from http://download.eclipse.org/releases/2019-06/201906191000/plugins/ (284.28kB)
09:35:03 [2020-11-10T14:35:03.112Z] [INFO] Fetching org.eclipse.equinox.http.jetty_3.7.100.v20190516-1504.jar.pack.gz from http://download.eclipse.org/releases/2019-06/201906191000/plugins/ (16.62kB)
09:35:03 [2020-11-10T14:35:03.112Z] [INFO] Fetching org.eclipse.equinox.http.jetty_3.7.100.v20190516-1504.jar.pack.gz from http://download.eclipse.org/releases/2019-06/201906191000/plugins/ (16.62kB)
09:35:03 [2020-11-10T14:35:03.368Z] [INFO] Fetching org.eclipse.ui.browser_3.6.400.v20190513-2118.jar.pack.gz from http://download.eclipse.org/releases/2019-06/201906191000/plugins/ (97.33kB)
09:35:03 [2020-11-10T14:35:03.368Z] [INFO] Fetching org.eclipse.ui.browser_3.6.400.v20190513-2118.jar.pack.gz from http://download.eclipse.org/releases/2019-06/201906191000/plugins/ (97.33kB)
09:35:03 [2020-11-10T14:35:03.368Z] [INFO] Fetching org.eclipse.equinox.http.servlet_1.6.100.v20190516-1504.jar.pack.gz from http://download.eclipse.org/releases/2019-06/201906191000/plugins/ (76.37kB)
09:35:03 [2020-11-10T14:35:03.368Z] [INFO] Fetching org.eclipse.equinox.http.servlet_1.6.100.v20190516-1504.jar.pack.gz from http://download.eclipse.org/releases/2019-06/201906191000/plugins/ (76.37kB)
09:35:03 [2020-11-10T14:35:03.623Z] [INFO] Fetching org.eclipse.jetty.http_9.4.18.v20190429.jar from http://download.eclipse.org/releases/2019-06/201906191000/plugins/ (211.63kB)
09:35:03 [2020-11-10T14:35:03.623Z] [INFO] Fetching org.eclipse.jetty.http_9.4.18.v20190429.jar from http://download.eclipse.org/releases/2019-06/201906191000/plugins/ (211.63kB)
09:35:03 [2020-11-10T14:35:03.623Z] [INFO] Fetching org.eclipse.jetty.server_9.4.18.v20190429.jar from http://download.eclipse.org/releases/2019-06/201906191000/plugins/ (666.13kB)
09:35:03 [2020-11-10T14:35:03.623Z] [INFO] Fetching org.eclipse.jetty.server_9.4.18.v20190429.jar from http://download.eclipse.org/releases/2019-06/201906191000/plugins/ (666.13kB)
09:35:03 [2020-11-10T14:35:03.879Z] [INFO] Fetching org.eclipse.jetty.servlet_9.4.18.v20190429.jar from http://download.eclipse.org/releases/2019-06/201906191000/plugins/ (127.95kB)
09:35:03 [2020-11-10T14:35:03.879Z] [INFO] Fetching org.eclipse.jetty.servlet_9.4.18.v20190429.jar from http://download.eclipse.org/releases/2019-06/201906191000/plugins/ (127.95kB)
09:35:03 [2020-11-10T14:35:03.879Z] [INFO] Fetching org.eclipse.jetty.util_9.4.18.v20190429.jar from http://download.eclipse.org/releases/2019-06/201906191000/plugins/ (548.93kB)
09:35:03 [2020-11-10T14:35:03.879Z] [INFO] Fetching org.eclipse.jetty.util_9.4.18.v20190429.jar from http://download.eclipse.org/releases/2019-06/201906191000/plugins/ (548.93kB)
09:35:04 [2020-11-10T14:35:04.136Z] [INFO] Fetching org.eclipse.equinox.http.registry_1.1.700.v20190214-1948.jar.pack.gz from http://download.eclipse.org/releases/2019-06/201906191000/plugins/ (18.49kB)
09:35:04 [2020-11-10T14:35:04.136Z] [INFO] Fetching org.eclipse.equinox.http.registry_1.1.700.v20190214-1948.jar.pack.gz from http://download.eclipse.org/releases/2019-06/201906191000/plugins/ (18.49kB)
09:35:04 [2020-11-10T14:35:04.136Z] [INFO] Fetching org.eclipse.equinox.jsp.jasper_1.1.200.v20190214-1948.jar.pack.gz from http://download.eclipse.org/releases/2019-06/201906191000/plugins/ (14.66kB)
09:35:04 [2020-11-10T14:35:04.136Z] [INFO] Fetching org.eclipse.equinox.jsp.jasper_1.1.200.v20190214-1948.jar.pack.gz from http://download.eclipse.org/releases/2019-06/201906191000/plugins/ (14.66kB)
09:35:04 [2020-11-10T14:35:04.392Z] [INFO] Fetching org.eclipse.equinox.jsp.jasper.registry_1.1.200.v20190214-1948.jar.pack.gz from http://download.eclipse.org/releases/2019-06/201906191000/plugins/ (8.7kB)
09:35:04 [2020-11-10T14:35:04.392Z] [INFO] Fetching org.eclipse.equinox.jsp.jasper.registry_1.1.200.v20190214-1948.jar.pack.gz from http://download.eclipse.org/releases/2019-06/201906191000/plugins/ (8.7kB)
09:35:04 [2020-11-10T14:35:04.392Z] [INFO] Fetching org.eclipse.help.base_4.2.600.v20190605-1800.jar.pack.gz from http://download.eclipse.org/releases/2019-06/201906191000/plugins/ (175.2kB)
09:35:04 [2020-11-10T14:35:04.392Z] [INFO] Fetching org.eclipse.help.base_4.2.600.v20190605-1800.jar.pack.gz from http://download.eclipse.org/releases/2019-06/201906191000/plugins/ (175.2kB)
09:35:04 [2020-11-10T14:35:04.648Z] [INFO] Fetching org.eclipse.jdt.core.manipulation_1.11.200.v20190520-0718.jar.pack.gz from http://download.eclipse.org/releases/2019-06/201906191000/plugins/ (285.64kB)
09:35:04 [2020-11-10T14:35:04.648Z] [INFO] Fetching org.eclipse.jdt.core.manipulation_1.11.200.v20190520-0718.jar.pack.gz from http://download.eclipse.org/releases/2019-06/201906191000/plugins/ (285.64kB)
09:35:04 [2020-11-10T14:35:04.903Z] [INFO] Fetching org.eclipse.jdt.launching_3.14.0.v20190508-0531.jar.pack.gz from http://download.eclipse.org/releases/2019-06/201906191000/plugins/ (272.59kB)
09:35:04 [2020-11-10T14:35:04.903Z] [INFO] Fetching org.eclipse.jdt.launching_3.14.0.v20190508-0531.jar.pack.gz from http://download.eclipse.org/releases/2019-06/201906191000/plugins/ (272.59kB)
09:35:05 [2020-11-10T14:35:05.159Z] [INFO] Fetching org.eclipse.jdt.debug_3.13.0.v20190521-1707.jar.pack.gz from http://download.eclipse.org/releases/2019-06/201906191000/plugins/ (931.98kB)
09:35:05 [2020-11-10T14:35:05.159Z] [INFO] Fetching org.eclipse.jdt.debug_3.13.0.v20190521-1707.jar.pack.gz from http://download.eclipse.org/releases/2019-06/201906191000/plugins/ (931.98kB)
09:35:05 [2020-11-10T14:35:05.159Z] [INFO] Fetching org.eclipse.jetty.io_9.4.18.v20190429.jar from http://download.eclipse.org/releases/2019-06/201906191000/plugins/ (167.49kB)
09:35:05 [2020-11-10T14:35:05.414Z] [INFO] Fetching org.eclipse.jetty.io_9.4.18.v20190429.jar from http://download.eclipse.org/releases/2019-06/201906191000/plugins/ (167.49kB)
09:35:05 [2020-11-10T14:35:05.414Z] [INFO] Fetching org.eclipse.jetty.security_9.4.18.v20190429.jar from http://download.eclipse.org/releases/2019-06/201906191000/plugins/ (124.9kB)
09:35:05 [2020-11-10T14:35:05.414Z] [INFO] Fetching org.eclipse.jetty.security_9.4.18.v20190429.jar from http://download.eclipse.org/releases/2019-06/201906191000/plugins/ (124.9kB)
09:35:05 [2020-11-10T14:35:05.414Z] [WARNING] The following locally built units have been used to resolve project dependencies:
09:35:05 [2020-11-10T14:35:05.414Z] [WARNING]   org.eclipse.ease/0.8.0.I202010051129
09:35:05 [2020-11-10T14:35:05.414Z] [WARNING]   org.eclipse.ease.ui.completions.java/0.8.0.I202010061535
09:35:05 [2020-11-10T14:35:05.414Z] [WARNING]   org.eclipse.ease.classloader/0.8.0.I202010061535
09:35:05 [2020-11-10T14:35:05.414Z] [WARNING]   org.eclipse.ease.ui/0.8.0.I202011101048
09:35:05 [2020-11-10T14:35:05.414Z] [INFO] Resolving class path of MavenProject: org.eclipse.ease:org.eclipse.ease.ui.test:0.8.0-SNAPSHOT @ /home/jenkins/agent/workspace/ease.verify.core.target.2019-06/tests/org.eclipse.ease.ui.test/pom.xml
09:35:05 [2020-11-10T14:35:05.670Z] [WARNING] The project org.eclipse.ease:org.eclipse.ease.releng:pom:0.8.0-SNAPSHOT uses prerequisites which is only intended for maven-plugin projects but not for non maven-plugin projects. For such purposes you should use the maven-enforcer-plugin. See https://maven.apache.org/enforcer/enforcer-rules/requireMavenVersion.html
09:35:05 [2020-11-10T14:35:05.670Z] [WARNING] [jenkins-event-spy] Unexpected Maven project file name 'target-tests-pom.xml', problems may occur
09:35:05 [2020-11-10T14:35:05.670Z] [INFO] ------------------------------------------------------------------------
09:35:05 [2020-11-10T14:35:05.670Z] [INFO] Reactor Build Order:
09:35:05 [2020-11-10T14:35:05.670Z] [INFO] 
09:35:05 [2020-11-10T14:35:05.670Z] [INFO] org.eclipse.ease.releng                                            [pom]
09:35:05 [2020-11-10T14:35:05.670Z] [INFO] org.eclipse.ease.releng.target               [eclipse-target-definition]
09:35:05 [2020-11-10T14:35:05.670Z] [INFO] org.eclipse.ease.test                              [eclipse-test-plugin]
09:35:05 [2020-11-10T14:35:05.670Z] [INFO] org.eclipse.ease.lang.javascript.nashorn.test      [eclipse-test-plugin]
09:35:05 [2020-11-10T14:35:05.670Z] [INFO] org.eclipse.ease.lang.javascript.rhino.test        [eclipse-test-plugin]
09:35:05 [2020-11-10T14:35:05.670Z] [INFO] org.eclipse.ease.lang.javascript.test              [eclipse-test-plugin]
09:35:05 [2020-11-10T14:35:05.670Z] [INFO] org.eclipse.ease.lang.python.test                  [eclipse-test-plugin]
09:35:05 [2020-11-10T14:35:05.670Z] [INFO] org.eclipse.ease.lang.python.jython.test           [eclipse-test-plugin]
09:35:05 [2020-11-10T14:35:05.670Z] [INFO] org.eclipse.ease.lang.python.py4j.test             [eclipse-test-plugin]
09:35:05 [2020-11-10T14:35:05.670Z] [INFO] org.eclipse.ease.lang.scriptarchive.test           [eclipse-test-plugin]
09:35:05 [2020-11-10T14:35:05.670Z] [INFO] org.eclipse.ease.ui.test                           [eclipse-test-plugin]
09:35:05 [2020-11-10T14:35:05.670Z] [WARNING] [jenkins-event-spy] Unexpected Maven project file name 'target-tests-pom.xml', problems may occur
09:35:05 [2020-11-10T14:35:05.670Z] [INFO] 
09:35:05 [2020-11-10T14:35:05.670Z] [INFO] --------------< org.eclipse.ease:org.eclipse.ease.releng >--------------
09:35:05 [2020-11-10T14:35:05.670Z] [INFO] Building org.eclipse.ease.releng 0.8.0-SNAPSHOT                   [1/11]
09:35:05 [2020-11-10T14:35:05.670Z] [INFO] --------------------------------[ pom ]---------------------------------
09:35:05 [2020-11-10T14:35:05.670Z] [WARNING] [jenkins-event-spy] Unexpected Maven project file name 'target-tests-pom.xml', problems may occur
09:35:05 [2020-11-10T14:35:05.670Z] [INFO] 
09:35:05 [2020-11-10T14:35:05.670Z] [INFO] ----------< org.eclipse.ease:org.eclipse.ease.releng.target >-----------
09:35:05 [2020-11-10T14:35:05.670Z] [INFO] Building org.eclipse.ease.releng.target 0.8.0-SNAPSHOT            [2/11]
09:35:05 [2020-11-10T14:35:05.670Z] [INFO] ---------------------[ eclipse-target-definition ]----------------------
09:35:05 [2020-11-10T14:35:05.670Z] [INFO] 
09:35:05 [2020-11-10T14:35:05.670Z] [INFO] --- tycho-source-plugin:1.5.0:plugin-source (plugin-source) @ org.eclipse.ease.releng.target ---
09:35:05 [2020-11-10T14:35:05.670Z] [INFO] 
09:35:05 [2020-11-10T14:35:05.671Z] [INFO] --- tycho-packaging-plugin:1.5.0:package-target-definition (default-package-target-definition) @ org.eclipse.ease.releng.target ---
09:35:05 [2020-11-10T14:35:05.671Z] [INFO] 
09:35:05 [2020-11-10T14:35:05.671Z] [INFO] --- tycho-source-feature-plugin:1.5.0:source-feature (source-feature) @ org.eclipse.ease.releng.target ---
09:35:05 [2020-11-10T14:35:05.671Z] [INFO] 
09:35:05 [2020-11-10T14:35:05.671Z] [INFO] --- tycho-p2-plugin:1.5.0:p2-metadata (attached-p2-metadata) @ org.eclipse.ease.releng.target ---
09:35:05 [2020-11-10T14:35:05.671Z] [INFO] 
09:35:05 [2020-11-10T14:35:05.671Z] [INFO] ---------------< org.eclipse.ease:org.eclipse.ease.test >---------------
09:35:05 [2020-11-10T14:35:05.671Z] [INFO] Building org.eclipse.ease.test 0.8.0-SNAPSHOT                     [3/11]
09:35:05 [2020-11-10T14:35:05.671Z] [INFO] ------------------------[ eclipse-test-plugin ]-------------------------
09:35:05 [2020-11-10T14:35:05.671Z] [INFO] 
09:35:05 [2020-11-10T14:35:05.671Z] [INFO] --- tycho-packaging-plugin:1.5.0:build-qualifier (default-build-qualifier) @ org.eclipse.ease.test ---
09:35:05 [2020-11-10T14:35:05.926Z] [INFO] The project's OSGi version is 0.8.0.I201910171213
09:35:05 [2020-11-10T14:35:05.926Z] [INFO] 
09:35:05 [2020-11-10T14:35:05.926Z] [INFO] --- tycho-packaging-plugin:1.5.0:validate-id (default-validate-id) @ org.eclipse.ease.test ---
09:35:05 [2020-11-10T14:35:05.926Z] [INFO] 
09:35:05 [2020-11-10T14:35:05.926Z] [INFO] --- tycho-packaging-plugin:1.5.0:validate-version (default-validate-version) @ org.eclipse.ease.test ---
09:35:05 [2020-11-10T14:35:05.926Z] [INFO] 
09:35:05 [2020-11-10T14:35:05.926Z] [INFO] --- maven-resources-plugin:2.4.3:resources (default-resources) @ org.eclipse.ease.test ---
09:35:05 [2020-11-10T14:35:05.926Z] [INFO] Using 'UTF-8' encoding to copy filtered resources.
09:35:05 [2020-11-10T14:35:05.926Z] [INFO] skip non existing resourceDirectory /home/jenkins/agent/workspace/ease.verify.core.target.2019-06/tests/org.eclipse.ease.test/src/main/resources
09:35:05 [2020-11-10T14:35:05.926Z] [INFO] 
09:35:05 [2020-11-10T14:35:05.926Z] [INFO] --- tycho-compiler-plugin:1.5.0:compile (default-compile) @ org.eclipse.ease.test ---
09:35:05 [2020-11-10T14:35:05.926Z] [INFO] Nothing to compile - all classes are up to date
09:35:05 [2020-11-10T14:35:05.926Z] [INFO] 
09:35:05 [2020-11-10T14:35:05.926Z] [INFO] --- maven-resources-plugin:2.4.3:testResources (default-testResources) @ org.eclipse.ease.test ---
09:35:05 [2020-11-10T14:35:05.926Z] [INFO] Using 'UTF-8' encoding to copy filtered resources.
09:35:05 [2020-11-10T14:35:05.926Z] [INFO] skip non existing resourceDirectory /home/jenkins/agent/workspace/ease.verify.core.target.2019-06/tests/org.eclipse.ease.test/src/test/resources
09:35:05 [2020-11-10T14:35:05.926Z] [INFO] 
09:35:05 [2020-11-10T14:35:05.926Z] [INFO] --- tycho-source-plugin:1.5.0:plugin-source (plugin-source) @ org.eclipse.ease.test ---
09:35:06 [2020-11-10T14:35:06.202Z] [INFO] Building jar: /home/jenkins/agent/workspace/ease.verify.core.target.2019-06/tests/org.eclipse.ease.test/target/org.eclipse.ease.test-0.8.0-SNAPSHOT-sources.jar
09:35:06 [2020-11-10T14:35:06.202Z] [INFO] 
09:35:06 [2020-11-10T14:35:06.202Z] [INFO] --- target-platform-configuration:1.5.0:target-platform (default-target-platform) @ org.eclipse.ease.test ---
09:35:06 [2020-11-10T14:35:06.202Z] [INFO] 
09:35:06 [2020-11-10T14:35:06.202Z] [INFO] --- tycho-packaging-plugin:1.5.0:package-plugin (default-package-plugin) @ org.eclipse.ease.test ---
09:35:06 [2020-11-10T14:35:06.202Z] [INFO] Building jar: /home/jenkins/agent/workspace/ease.verify.core.target.2019-06/tests/org.eclipse.ease.test/target/org.eclipse.ease.test-0.8.0-SNAPSHOT.jar
09:35:06 [2020-11-10T14:35:06.202Z] [INFO] 
09:35:06 [2020-11-10T14:35:06.459Z] [INFO] --- tycho-p2-plugin:1.5.0:p2-metadata-default (default-p2-metadata-default) @ org.eclipse.ease.test ---
09:35:06 [2020-11-10T14:35:06.459Z] [INFO] 
09:35:06 [2020-11-10T14:35:06.459Z] [INFO] --- tycho-source-feature-plugin:1.5.0:source-feature (source-feature) @ org.eclipse.ease.test ---
09:35:06 [2020-11-10T14:35:06.459Z] [INFO] 
09:35:06 [2020-11-10T14:35:06.459Z] [INFO] --- tycho-p2-plugin:1.5.0:p2-metadata (attached-p2-metadata) @ org.eclipse.ease.test ---
09:35:06 [2020-11-10T14:35:06.459Z] [INFO] 
09:35:06 [2020-11-10T14:35:06.459Z] [INFO] --- tycho-surefire-plugin:1.5.0:test (default-test) @ org.eclipse.ease.test ---
09:35:06 [2020-11-10T14:35:06.459Z] [INFO] Expected eclipse log file: /home/jenkins/agent/workspace/ease.verify.core.target.2019-06/tests/org.eclipse.ease.test/target/work/data/.metadata/.log
09:35:06 [2020-11-10T14:35:06.459Z] [INFO] Command line:
09:35:06 [2020-11-10T14:35:06.460Z] 	[/opt/tools/java/openjdk/jdk-11/11.0.2+9/bin/java, -Dosgi.noShutdown=false, -Dosgi.os=linux, -Dosgi.ws=gtk, -Dosgi.arch=x86_64, -Dosgi.clean=true, -jar, /home/jenkins/.m2/repository/p2/osgi/bundle/org.eclipse.equinox.launcher/1.5.400.v20190515-0925/org.eclipse.equinox.launcher-1.5.400.v20190515-0925.jar, -data, /home/jenkins/agent/workspace/ease.verify.core.target.2019-06/tests/org.eclipse.ease.test/target/work/data, -install, /home/jenkins/agent/workspace/ease.verify.core.target.2019-06/tests/org.eclipse.ease.test/target/work, -configuration, /home/jenkins/agent/workspace/ease.verify.core.target.2019-06/tests/org.eclipse.ease.test/target/work/configuration, -application, org.eclipse.tycho.surefire.osgibooter.headlesstest, -testproperties, /home/jenkins/agent/workspace/ease.verify.core.target.2019-06/tests/org.eclipse.ease.test/target/surefire.properties]
09:35:06 [2020-11-10T14:35:06.460Z] Picked up JAVA_TOOL_OPTIONS: -Dmaven.ext.class.path="/home/jenkins/agent/workspace/ease.verify.core.target.2019-06@tmp/withMaven7f2c0cca/pipeline-maven-spy.jar" -Dorg.jenkinsci.plugins.pipeline.maven.reportsFolder="/home/jenkins/agent/workspace/ease.verify.core.target.2019-06@tmp/withMaven7f2c0cca" 
09:35:08 [2020-11-10T14:35:08.360Z] Running org.eclipse.ease.ScriptTest
09:35:08 [2020-11-10T14:35:08.360Z] Tests run: 13, Failures: 0, Errors: 0, Skipped: 0, Time elapsed: 0.083 s - in org.eclipse.ease.ScriptTest
09:35:08 [2020-11-10T14:35:08.360Z] codeFromScriptable(org.eclipse.ease.ScriptTest)  Time elapsed: 0.043 s
09:35:08 [2020-11-10T14:35:08.360Z] codeFromFilesystemFile(org.eclipse.ease.ScriptTest)  Time elapsed: 0.002 s
09:35:08 [2020-11-10T14:35:08.360Z] getCodeStream(org.eclipse.ease.ScriptTest)  Time elapsed: 0 s
09:35:08 [2020-11-10T14:35:08.360Z] getFile(org.eclipse.ease.ScriptTest)  Time elapsed: 0 s
09:35:08 [2020-11-10T14:35:08.360Z] codeFromStringBuilder(org.eclipse.ease.ScriptTest)  Time elapsed: 0 s
09:35:08 [2020-11-10T14:35:08.360Z] getResult(org.eclipse.ease.ScriptTest)  Time elapsed: 0 s
09:35:08 [2020-11-10T14:35:08.360Z] getException(org.eclipse.ease.ScriptTest)  Time elapsed: 0 s
09:35:08 [2020-11-10T14:35:08.360Z] codeFromWorkspaceFile(org.eclipse.ease.ScriptTest)  Time elapsed: 0.017 s
09:35:08 [2020-11-10T14:35:08.360Z] codeFromInputStream(org.eclipse.ease.ScriptTest)  Time elapsed: 0.001 s
09:35:08 [2020-11-10T14:35:08.360Z] getTitle(org.eclipse.ease.ScriptTest)  Time elapsed: 0 s
09:35:08 [2020-11-10T14:35:08.360Z] getCommand(org.eclipse.ease.ScriptTest)  Time elapsed: 0 s
09:35:08 [2020-11-10T14:35:08.360Z] codeFromReader(org.eclipse.ease.ScriptTest)  Time elapsed: 0 s
09:35:08 [2020-11-10T14:35:08.360Z] codeFromString(org.eclipse.ease.ScriptTest)  Time elapsed: 0 s
09:35:08 [2020-11-10T14:35:08.360Z] Running org.eclipse.ease.AbstractReplScriptEngineTest
09:35:14 [2020-11-10T14:35:14.893Z] testorg.eclipse.ease.ScriptExecutionException: Engine got terminated
09:35:14 [2020-11-10T14:35:14.893Z] java.lang.RuntimeException: ERROR
09:35:14 [2020-11-10T14:35:14.893Z] 	at org.eclipse.ease.AbstractReplScriptEngineTest$MockedScriptEngine.execute(AbstractReplScriptEngineTest.java:61)
09:35:14 [2020-11-10T14:35:14.893Z] 	at org.eclipse.ease.AbstractScriptEngine.inject(AbstractScriptEngine.java:224)
09:35:14 [2020-11-10T14:35:14.893Z] 	at org.eclipse.ease.AbstractScriptEngine.run(AbstractScriptEngine.java:274)
09:35:14 [2020-11-10T14:35:14.893Z] 	at org.eclipse.core.internal.jobs.Worker.run(Worker.java:63)
09:35:15 [2020-11-10T14:35:15.453Z] Hello worldHello world1Tests run: 20, Failures: 0, Errors: 0, Skipped: 0, Time elapsed: 7.062 s - in org.eclipse.ease.AbstractReplScriptEngineTest
09:35:15 [2020-11-10T14:35:15.453Z] terminateOnIdleAfterSchedule(org.eclipse.ease.AbstractReplScriptEngineTest)  Time elapsed: 0.023 s
09:35:15 [2020-11-10T14:35:15.453Z] terminateEngine(org.eclipse.ease.AbstractReplScriptEngineTest)  Time elapsed: 1.001 s
09:35:15 [2020-11-10T14:35:15.453Z] keepRunningOnIdle(org.eclipse.ease.AbstractReplScriptEngineTest)  Time elapsed: 0.002 s
09:35:15 [2020-11-10T14:35:15.453Z] extractEmptyArguments(org.eclipse.ease.AbstractReplScriptEngineTest)  Time elapsed: 0 s
09:35:15 [2020-11-10T14:35:15.453Z] setNotNullOutputStream(org.eclipse.ease.AbstractReplScriptEngineTest)  Time elapsed: 0 s
09:35:15 [2020-11-10T14:35:15.453Z] terminateViaMonitorCancellation(org.eclipse.ease.AbstractReplScriptEngineTest)  Time elapsed: 1.202 s
09:35:15 [2020-11-10T14:35:15.453Z] inject(org.eclipse.ease.AbstractReplScriptEngineTest)  Time elapsed: 0.001 s
09:35:15 [2020-11-10T14:35:15.453Z] extractArguments(org.eclipse.ease.AbstractReplScriptEngineTest)  Time elapsed: 0 s
09:35:15 [2020-11-10T14:35:15.453Z] executeSync(org.eclipse.ease.AbstractReplScriptEngineTest)  Time elapsed: 1.002 s
09:35:15 [2020-11-10T14:35:15.453Z] setNotNullErrorStream(org.eclipse.ease.AbstractReplScriptEngineTest)  Time elapsed: 0 s
09:35:15 [2020-11-10T14:35:15.453Z] setNullErrorStream(org.eclipse.ease.AbstractReplScriptEngineTest)  Time elapsed: 0 s
09:35:15 [2020-11-10T14:35:15.453Z] isJob(org.eclipse.ease.AbstractReplScriptEngineTest)  Time elapsed: 0 s
09:35:15 [2020-11-10T14:35:15.453Z] streamsAvailable(org.eclipse.ease.AbstractReplScriptEngineTest)  Time elapsed: 0 s
09:35:15 [2020-11-10T14:35:15.453Z] executeValidCodeAndTerminate(org.eclipse.ease.AbstractReplScriptEngineTest)  Time elapsed: 1.002 s
09:35:15 [2020-11-10T14:35:15.453Z] setNullOutputStream(org.eclipse.ease.AbstractReplScriptEngineTest)  Time elapsed: 0 s
09:35:15 [2020-11-10T14:35:15.453Z] terminateMultipleTimes(org.eclipse.ease.AbstractReplScriptEngineTest)  Time elapsed: 0.602 s
09:35:15 [2020-11-10T14:35:15.453Z] engineTerminatesWhenIdle(org.eclipse.ease.AbstractReplScriptEngineTest)  Time elapsed: 0 s
09:35:15 [2020-11-10T14:35:15.453Z] terminateViaTerminateMethod(org.eclipse.ease.AbstractReplScriptEngineTest)  Time elapsed: 1.202 s
09:35:15 [2020-11-10T14:35:15.453Z] terminateViaMethodCallback(org.eclipse.ease.AbstractReplScriptEngineTest)  Time elapsed: 0.001 s
09:35:15 [2020-11-10T14:35:15.454Z] executeErrorCodeAndTerminate(org.eclipse.ease.AbstractReplScriptEngineTest)  Time elapsed: 1.002 s
09:35:15 [2020-11-10T14:35:15.454Z] Running org.eclipse.ease.tools.ResourceToolsTest
09:35:15 [2020-11-10T14:35:15.454Z] Tests run: 47, Failures: 0, Errors: 0, Skipped: 0, Time elapsed: 0.047 s - in org.eclipse.ease.tools.ResourceToolsTest
09:35:15 [2020-11-10T14:35:15.454Z] resolveScriptLocation(org.eclipse.ease.tools.ResourceToolsTest)  Time elapsed: 0.011 s
09:35:15 [2020-11-10T14:35:15.454Z] getWorkspaceInputStream(org.eclipse.ease.tools.ResourceToolsTest)  Time elapsed: 0.001 s
09:35:15 [2020-11-10T14:35:15.454Z] resolvePlatformURI(org.eclipse.ease.tools.ResourceToolsTest)  Time elapsed: 0 s
09:35:15 [2020-11-10T14:35:15.454Z] resolveScriptLocationWithSpacesInPath(org.eclipse.ease.tools.ResourceToolsTest)  Time elapsed: 0.002 s
09:35:15 [2020-11-10T14:35:15.454Z] resolveURL(org.eclipse.ease.tools.ResourceToolsTest)  Time elapsed: 0.001 s
09:35:15 [2020-11-10T14:35:15.454Z] invalidIsAbsolute(org.eclipse.ease.tools.ResourceToolsTest)  Time elapsed: 0.001 s
09:35:15 [2020-11-10T14:35:15.454Z] getFilesystemInputStream(org.eclipse.ease.tools.ResourceToolsTest)  Time elapsed: 0 s
09:35:15 [2020-11-10T14:35:15.454Z] toRelativeLocationInWorkspace(org.eclipse.ease.tools.ResourceToolsTest)  Time elapsed: 0 s
09:35:15 [2020-11-10T14:35:15.454Z] checkOperatingSystem(org.eclipse.ease.tools.ResourceToolsTest)  Time elapsed: 0 s
09:35:15 [2020-11-10T14:35:15.454Z] inputStreamToString(org.eclipse.ease.tools.ResourceToolsTest)  Time elapsed: 0.001 s
09:35:15 [2020-11-10T14:35:15.454Z] fileSystemToAbsoluteLocationOnLinux(org.eclipse.ease.tools.ResourceToolsTest)  Time elapsed: 0 s
09:35:15 [2020-11-10T14:35:15.454Z] exists(org.eclipse.ease.tools.ResourceToolsTest)  Time elapsed: 0 s
09:35:15 [2020-11-10T14:35:15.454Z] resolveRelativeInWorkspace(org.eclipse.ease.tools.ResourceToolsTest)  Time elapsed: 0.001 s
09:35:15 [2020-11-10T14:35:15.454Z] isFile(org.eclipse.ease.tools.ResourceToolsTest)  Time elapsed: 0 s
09:35:15 [2020-11-10T14:35:15.454Z] invalidToFile(org.eclipse.ease.tools.ResourceToolsTest)  Time elapsed: 0 s
09:35:15 [2020-11-10T14:35:15.454Z] resolveAbsoluteInFileSystem(org.eclipse.ease.tools.ResourceToolsTest)  Time elapsed: 0 s
09:35:15 [2020-11-10T14:35:15.454Z] resolveWindowsRoot(org.eclipse.ease.tools.ResourceToolsTest)  Time elapsed: 0 s
09:35:15 [2020-11-10T14:35:15.454Z] resolveRelativeInFileSystemOnWindows(org.eclipse.ease.tools.ResourceToolsTest)  Time elapsed: 0 s
09:35:15 [2020-11-10T14:35:15.454Z] isAbsoluteFileSystemPathOnWindows(org.eclipse.ease.tools.ResourceToolsTest)  Time elapsed: 0 s
09:35:15 [2020-11-10T14:35:15.454Z] readerToString(org.eclipse.ease.tools.ResourceToolsTest)  Time elapsed: 0 s
09:35:15 [2020-11-10T14:35:15.454Z] workspaceFileToString(org.eclipse.ease.tools.ResourceToolsTest)  Time elapsed: 0 s
09:35:15 [2020-11-10T14:35:15.454Z] toFile(org.eclipse.ease.tools.ResourceToolsTest)  Time elapsed: 0.001 s
09:35:15 [2020-11-10T14:35:15.454Z] toProjectRelativeLocation(org.eclipse.ease.tools.ResourceToolsTest)  Time elapsed: 0 s
09:35:15 [2020-11-10T14:35:15.454Z] getInvalidInputStream(org.eclipse.ease.tools.ResourceToolsTest)  Time elapsed: 0.004 s
09:35:15 [2020-11-10T14:35:15.454Z] resolveRelativeInFileSystemOnLinux(org.eclipse.ease.tools.ResourceToolsTest)  Time elapsed: 0 s
09:35:15 [2020-11-10T14:35:15.454Z] isFolder(org.eclipse.ease.tools.ResourceToolsTest)  Time elapsed: 0 s
09:35:15 [2020-11-10T14:35:15.454Z] fileSystemToAbsoluteLocationOnWindows(org.eclipse.ease.tools.ResourceToolsTest)  Time elapsed: 0 s
09:35:15 [2020-11-10T14:35:15.454Z] isAbsoluteWorkspacePath(org.eclipse.ease.tools.ResourceToolsTest)  Time elapsed: 0 s
09:35:15 [2020-11-10T14:35:15.454Z] isAbsoluteFileSystemPathOnLinux(org.eclipse.ease.tools.ResourceToolsTest)  Time elapsed: 0 s
09:35:15 [2020-11-10T14:35:15.454Z] resolveInvalid(org.eclipse.ease.tools.ResourceToolsTest)  Time elapsed: 0 s
09:35:15 [2020-11-10T14:35:15.454Z] resolveAbsoluteInFileSystemOnWindows(org.eclipse.ease.tools.ResourceToolsTest)  Time elapsed: 0 s
09:35:15 [2020-11-10T14:35:15.454Z] resolveScriptLocationWithSpacesInDomain(org.eclipse.ease.tools.ResourceToolsTest)  Time elapsed: 0 s
09:35:15 [2020-11-10T14:35:15.454Z] resolveRelativefromWorkspaceToFilesystem(org.eclipse.ease.tools.ResourceToolsTest)  Time elapsed: 0 s
09:35:15 [2020-11-10T14:35:15.454Z] resolveRelativeWithoutBaseFile(org.eclipse.ease.tools.ResourceToolsTest)  Time elapsed: 0.001 s
09:35:15 [2020-11-10T14:35:15.454Z] resolveInWorkspace(org.eclipse.ease.tools.ResourceToolsTest)  Time elapsed: 0 s
09:35:15 [2020-11-10T14:35:15.454Z] resolveScriptLocationWithSpecialCharactersInPath(org.eclipse.ease.tools.ResourceToolsTest)  Time elapsed: 0 s
09:35:15 [2020-11-10T14:35:15.454Z] filesystemFileToString(org.eclipse.ease.tools.ResourceToolsTest)  Time elapsed: 0 s
09:35:15 [2020-11-10T14:35:15.454Z] createURI(org.eclipse.ease.tools.ResourceToolsTest)  Time elapsed: 0 s
09:35:15 [2020-11-10T14:35:15.454Z] uriToAbsoluteLocation(org.eclipse.ease.tools.ResourceToolsTest)  Time elapsed: 0 s
09:35:15 [2020-11-10T14:35:15.454Z] createFolder(org.eclipse.ease.tools.ResourceToolsTest)  Time elapsed: 0.003 s
09:35:15 [2020-11-10T14:35:15.454Z] workspaceToAbsoluteLocation(org.eclipse.ease.tools.ResourceToolsTest)  Time elapsed: 0 s
09:35:15 [2020-11-10T14:35:15.454Z] resolveAbsoluteInFileSystemOnLinux(org.eclipse.ease.tools.ResourceToolsTest)  Time elapsed: 0 s
09:35:15 [2020-11-10T14:35:15.454Z] invalidToString(org.eclipse.ease.tools.ResourceToolsTest)  Time elapsed: 0 s
09:35:15 [2020-11-10T14:35:15.454Z] resolveRelativeURIs(org.eclipse.ease.tools.ResourceToolsTest)  Time elapsed: 0 s
09:35:15 [2020-11-10T14:35:15.454Z] resolveRelativeInFileSystem(org.eclipse.ease.tools.ResourceToolsTest)  Time elapsed: 0.001 s
09:35:15 [2020-11-10T14:35:15.454Z] resolveScriptLocationWithSpecialCharactersInDomain(org.eclipse.ease.tools.ResourceToolsTest)  Time elapsed: 0.003 s
09:35:15 [2020-11-10T14:35:15.454Z] isAbsoluteURL(org.eclipse.ease.tools.ResourceToolsTest)  Time elapsed: 0 s
09:35:15 [2020-11-10T14:35:15.454Z] Running org.eclipse.ease.tools.RunnableWithResultTest
09:35:15 [2020-11-10T14:35:15.454Z] Tests run: 2, Failures: 0, Errors: 0, Skipped: 0, Time elapsed: 0.001 s - in org.eclipse.ease.tools.RunnableWithResultTest
09:35:15 [2020-11-10T14:35:15.454Z] testException(org.eclipse.ease.tools.RunnableWithResultTest)  Time elapsed: 0 s
09:35:15 [2020-11-10T14:35:15.454Z] testResult(org.eclipse.ease.tools.RunnableWithResultTest)  Time elapsed: 0.001 s
09:35:15 [2020-11-10T14:35:15.454Z] Running org.eclipse.ease.tools.StringToolsTest
09:35:15 [2020-11-10T14:35:15.454Z] Tests run: 8, Failures: 0, Errors: 0, Skipped: 0, Time elapsed: 0.002 s - in org.eclipse.ease.tools.StringToolsTest
09:35:15 [2020-11-10T14:35:15.454Z] parseArgumentsNull(org.eclipse.ease.tools.StringToolsTest)  Time elapsed: 0 s
09:35:15 [2020-11-10T14:35:15.454Z] parseArgumentsQuotedSingle(org.eclipse.ease.tools.StringToolsTest)  Time elapsed: 0 s
09:35:15 [2020-11-10T14:35:15.454Z] parseArgumentsEmpty(org.eclipse.ease.tools.StringToolsTest)  Time elapsed: 0 s
09:35:15 [2020-11-10T14:35:15.454Z] parseArgumentsMixedMultiple(org.eclipse.ease.tools.StringToolsTest)  Time elapsed: 0 s
09:35:15 [2020-11-10T14:35:15.454Z] parseArgumentsMixedMultipleLines(org.eclipse.ease.tools.StringToolsTest)  Time elapsed: 0.001 s
09:35:15 [2020-11-10T14:35:15.454Z] parseArgumentsNonQuotedMultiple(org.eclipse.ease.tools.StringToolsTest)  Time elapsed: 0 s
09:35:15 [2020-11-10T14:35:15.454Z] parseArgumentsNonQuotedSingle(org.eclipse.ease.tools.StringToolsTest)  Time elapsed: 0 s
09:35:15 [2020-11-10T14:35:15.454Z] parseArgumentsQuotedMultiple(org.eclipse.ease.tools.StringToolsTest)  Time elapsed: 0 s
09:35:15 [2020-11-10T14:35:15.454Z] Running org.eclipse.ease.AbstractCodeParserTest
09:35:15 [2020-11-10T14:35:15.454Z] Tests run: 5, Failures: 0, Errors: 0, Skipped: 0, Time elapsed: 0.004 s - in org.eclipse.ease.AbstractCodeParserTest
09:35:15 [2020-11-10T14:35:15.454Z] parseCode(org.eclipse.ease.AbstractCodeParserTest)  Time elapsed: 0.001 s
09:35:15 [2020-11-10T14:35:15.454Z] parseLineHeader(org.eclipse.ease.AbstractCodeParserTest)  Time elapsed: 0.001 s
09:35:15 [2020-11-10T14:35:15.454Z] parseBlockAfterWhitespace(org.eclipse.ease.AbstractCodeParserTest)  Time elapsed: 0 s
09:35:15 [2020-11-10T14:35:15.454Z] parseEmpty(org.eclipse.ease.AbstractCodeParserTest)  Time elapsed: 0 s
09:35:15 [2020-11-10T14:35:15.454Z] parseBlockHeader(org.eclipse.ease.AbstractCodeParserTest)  Time elapsed: 0 s
09:35:15 [2020-11-10T14:35:15.454Z] Running org.eclipse.ease.adapters.ScriptableAdapterTest
09:35:15 [2020-11-10T14:35:15.454Z] Tests run: 5, Failures: 0, Errors: 0, Skipped: 0, Time elapsed: 0.006 s - in org.eclipse.ease.adapters.ScriptableAdapterTest
09:35:15 [2020-11-10T14:35:15.454Z] adaptURI(org.eclipse.ease.adapters.ScriptableAdapterTest)  Time elapsed: 0.005 s
09:35:15 [2020-11-10T14:35:15.454Z] adaptURL(org.eclipse.ease.adapters.ScriptableAdapterTest)  Time elapsed: 0 s
09:35:15 [2020-11-10T14:35:15.454Z] adaptWorkspaceFile(org.eclipse.ease.adapters.ScriptableAdapterTest)  Time elapsed: 0 s
09:35:15 [2020-11-10T14:35:15.454Z] getAdapterList(org.eclipse.ease.adapters.ScriptableAdapterTest)  Time elapsed: 0 s
09:35:15 [2020-11-10T14:35:15.454Z] adaptFilesystemFile(org.eclipse.ease.adapters.ScriptableAdapterTest)  Time elapsed: 0 s
09:35:15 [2020-11-10T14:35:15.454Z] Running org.eclipse.ease.sign.SignatureHelperTest
09:35:15 [2020-11-10T14:35:15.455Z] Tests run: 1, Failures: 0, Errors: 0, Skipped: 0, Time elapsed: 0.008 s - in org.eclipse.ease.sign.SignatureHelperTest
09:35:15 [2020-11-10T14:35:15.455Z] certificateTest(org.eclipse.ease.sign.SignatureHelperTest)  Time elapsed: 0.007 s
09:35:15 [2020-11-10T14:35:15.455Z] Running org.eclipse.ease.sign.VerifySignatureTest
09:35:15 [2020-11-10T14:35:15.455Z] WARNING: An illegal reflective access operation has occurred
09:35:15 [2020-11-10T14:35:15.455Z] WARNING: Illegal reflective access by org.mockito.cglib.core.ReflectUtils$2 (file:/home/jenkins/.m2/repository/p2/osgi/bundle/org.mockito/1.9.5.v201605172210/org.mockito-1.9.5.v201605172210.jar) to method java.lang.ClassLoader.defineClass(java.lang.String,byte[],int,int,java.security.ProtectionDomain)
09:35:15 [2020-11-10T14:35:15.455Z] WARNING: Please consider reporting this to the maintainers of org.mockito.cglib.core.ReflectUtils$2
09:35:15 [2020-11-10T14:35:15.455Z] WARNING: Use --illegal-access=warn to enable warnings of further illegal reflective access operations
09:35:15 [2020-11-10T14:35:15.455Z] WARNING: All illegal access operations will be denied in a future release
09:35:15 [2020-11-10T14:35:15.455Z] Tests run: 1, Failures: 0, Errors: 0, Skipped: 0, Time elapsed: 0.062 s - in org.eclipse.ease.sign.VerifySignatureTest
09:35:15 [2020-11-10T14:35:15.455Z] testWithNonCodeParserScriptType(org.eclipse.ease.sign.VerifySignatureTest)  Time elapsed: 0.06 s
09:35:15 [2020-11-10T14:35:15.455Z] Running org.eclipse.ease.AbstractCodeFactoryTest
09:35:15 [2020-11-10T14:35:15.710Z] Tests run: 1, Failures: 0, Errors: 0, Skipped: 0, Time elapsed: 0.015 s - in org.eclipse.ease.AbstractCodeFactoryTest
09:35:15 [2020-11-10T14:35:15.710Z] createNewKeywordHeader(org.eclipse.ease.AbstractCodeFactoryTest)  Time elapsed: 0.014 s
09:35:15 [2020-11-10T14:35:15.710Z] Running org.eclipse.ease.AbstractScriptEngineTest
09:35:22 [2020-11-10T14:35:22.248Z] testorg.eclipse.ease.ScriptExecutionException: Engine got terminated
09:35:22 [2020-11-10T14:35:22.248Z] java.lang.RuntimeException: ERROR
09:35:22 [2020-11-10T14:35:22.248Z] 	at org.eclipse.ease.AbstractScriptEngineTest$MockedScriptEngine.execute(AbstractScriptEngineTest.java:73)
09:35:22 [2020-11-10T14:35:22.248Z] 	at org.eclipse.ease.AbstractScriptEngine.inject(AbstractScriptEngine.java:224)
09:35:22 [2020-11-10T14:35:22.248Z] 	at org.eclipse.ease.AbstractScriptEngine.run(AbstractScriptEngine.java:274)
09:35:22 [2020-11-10T14:35:22.248Z] 	at org.eclipse.core.internal.jobs.Worker.run(Worker.java:63)
09:35:22 [2020-11-10T14:35:22.248Z] 1Tests run: 17, Failures: 0, Errors: 0, Skipped: 0, Time elapsed: 6.516 s - in org.eclipse.ease.AbstractScriptEngineTest
09:35:22 [2020-11-10T14:35:22.248Z] extractEmptyArguments(org.eclipse.ease.AbstractScriptEngineTest)  Time elapsed: 0 s
09:35:22 [2020-11-10T14:35:22.248Z] setNotNullOutputStream(org.eclipse.ease.AbstractScriptEngineTest)  Time elapsed: 0 s
09:35:22 [2020-11-10T14:35:22.248Z] terminateViaMonitorCancellation(org.eclipse.ease.AbstractScriptEngineTest)  Time elapsed: 1.101 s
09:35:22 [2020-11-10T14:35:22.248Z] inject(org.eclipse.ease.AbstractScriptEngineTest)  Time elapsed: 0.001 s
09:35:22 [2020-11-10T14:35:22.248Z] extractArguments(org.eclipse.ease.AbstractScriptEngineTest)  Time elapsed: 0 s
09:35:22 [2020-11-10T14:35:22.248Z] executeSync(org.eclipse.ease.AbstractScriptEngineTest)  Time elapsed: 1.002 s
09:35:22 [2020-11-10T14:35:22.248Z] setNotNullErrorStream(org.eclipse.ease.AbstractScriptEngineTest)  Time elapsed: 0 s
09:35:22 [2020-11-10T14:35:22.248Z] setNullErrorStream(org.eclipse.ease.AbstractScriptEngineTest)  Time elapsed: 0 s
09:35:22 [2020-11-10T14:35:22.248Z] isJob(org.eclipse.ease.AbstractScriptEngineTest)  Time elapsed: 0 s
09:35:22 [2020-11-10T14:35:22.249Z] streamsAvailable(org.eclipse.ease.AbstractScriptEngineTest)  Time elapsed: 0 s
09:35:22 [2020-11-10T14:35:22.249Z] executeValidCodeAndTerminate(org.eclipse.ease.AbstractScriptEngineTest)  Time elapsed: 1.002 s
09:35:22 [2020-11-10T14:35:22.249Z] setNullOutputStream(org.eclipse.ease.AbstractScriptEngineTest)  Time elapsed: 0 s
09:35:22 [2020-11-10T14:35:22.249Z] terminateMultipleTimes(org.eclipse.ease.AbstractScriptEngineTest)  Time elapsed: 0.302 s
09:35:22 [2020-11-10T14:35:22.249Z] engineTerminatesWhenIdle(org.eclipse.ease.AbstractScriptEngineTest)  Time elapsed: 1.001 s
09:35:22 [2020-11-10T14:35:22.249Z] terminateViaTerminateMethod(org.eclipse.ease.AbstractScriptEngineTest)  Time elapsed: 1.102 s
09:35:22 [2020-11-10T14:35:22.249Z] terminateViaMethodCallback(org.eclipse.ease.AbstractScriptEngineTest)  Time elapsed: 1.002 s
09:35:22 [2020-11-10T14:35:22.249Z] executeErrorCodeAndTerminate(org.eclipse.ease.AbstractScriptEngineTest)  Time elapsed: 0.002 s
09:35:22 [2020-11-10T14:35:22.249Z] Running org.eclipse.ease.ScriptResultTest
09:35:22 [2020-11-10T14:35:22.249Z] Tests run: 4, Failures: 0, Errors: 0, Skipped: 0, Time elapsed: 0.001 s - in org.eclipse.ease.ScriptResultTest
09:35:22 [2020-11-10T14:35:22.249Z] hasException(org.eclipse.ease.ScriptResultTest)  Time elapsed: 0 s
09:35:22 [2020-11-10T14:35:22.249Z] getResult(org.eclipse.ease.ScriptResultTest)  Time elapsed: 0 s
09:35:22 [2020-11-10T14:35:22.249Z] getException(org.eclipse.ease.ScriptResultTest)  Time elapsed: 0 s
09:35:22 [2020-11-10T14:35:22.249Z] isReady(org.eclipse.ease.ScriptResultTest)  Time elapsed: 0 s
09:35:22 [2020-11-10T14:35:22.249Z] 
09:35:22 [2020-11-10T14:35:22.249Z] Results:
09:35:22 [2020-11-10T14:35:22.249Z] 
09:35:22 [2020-11-10T14:35:22.249Z] Tests run: 124, Failures: 0, Errors: 0, Skipped: 0
09:35:22 [2020-11-10T14:35:22.249Z] 
09:35:22 [2020-11-10T14:35:22.505Z] [INFO] All tests passed!
09:35:22 [2020-11-10T14:35:22.505Z] [INFO] 
09:35:22 [2020-11-10T14:35:22.505Z] [INFO] ---< org.eclipse.ease:org.eclipse.ease.lang.javascript.nashorn.test >---
09:35:22 [2020-11-10T14:35:22.505Z] [INFO] Building org.eclipse.ease.lang.javascript.nashorn.test 0.8.0-SNAPSHOT [4/11]
09:35:22 [2020-11-10T14:35:22.505Z] [INFO] ------------------------[ eclipse-test-plugin ]-------------------------
09:35:22 [2020-11-10T14:35:22.505Z] [INFO] 
09:35:22 [2020-11-10T14:35:22.505Z] [INFO] --- tycho-packaging-plugin:1.5.0:build-qualifier (default-build-qualifier) @ org.eclipse.ease.lang.javascript.nashorn.test ---
09:35:22 [2020-11-10T14:35:22.505Z] [INFO] The project's OSGi version is 0.8.0.I201910171213
09:35:22 [2020-11-10T14:35:22.505Z] [INFO] 
09:35:22 [2020-11-10T14:35:22.505Z] [INFO] --- tycho-packaging-plugin:1.5.0:validate-id (default-validate-id) @ org.eclipse.ease.lang.javascript.nashorn.test ---
09:35:22 [2020-11-10T14:35:22.505Z] [INFO] 
09:35:22 [2020-11-10T14:35:22.505Z] [INFO] --- tycho-packaging-plugin:1.5.0:validate-version (default-validate-version) @ org.eclipse.ease.lang.javascript.nashorn.test ---
09:35:22 [2020-11-10T14:35:22.505Z] [INFO] 
09:35:22 [2020-11-10T14:35:22.505Z] [INFO] --- maven-resources-plugin:2.4.3:resources (default-resources) @ org.eclipse.ease.lang.javascript.nashorn.test ---
09:35:22 [2020-11-10T14:35:22.505Z] [INFO] Using 'UTF-8' encoding to copy filtered resources.
09:35:22 [2020-11-10T14:35:22.505Z] [INFO] skip non existing resourceDirectory /home/jenkins/agent/workspace/ease.verify.core.target.2019-06/tests/org.eclipse.ease.lang.javascript.nashorn.test/src/main/resources
09:35:22 [2020-11-10T14:35:22.505Z] [INFO] 
09:35:22 [2020-11-10T14:35:22.505Z] [INFO] --- tycho-compiler-plugin:1.5.0:compile (default-compile) @ org.eclipse.ease.lang.javascript.nashorn.test ---
09:35:22 [2020-11-10T14:35:22.505Z] [INFO] Nothing to compile - all classes are up to date
09:35:22 [2020-11-10T14:35:22.505Z] [INFO] 
09:35:22 [2020-11-10T14:35:22.505Z] [INFO] --- maven-resources-plugin:2.4.3:testResources (default-testResources) @ org.eclipse.ease.lang.javascript.nashorn.test ---
09:35:22 [2020-11-10T14:35:22.505Z] [INFO] Using 'UTF-8' encoding to copy filtered resources.
09:35:22 [2020-11-10T14:35:22.505Z] [INFO] skip non existing resourceDirectory /home/jenkins/agent/workspace/ease.verify.core.target.2019-06/tests/org.eclipse.ease.lang.javascript.nashorn.test/src/test/resources
09:35:22 [2020-11-10T14:35:22.505Z] [INFO] 
09:35:22 [2020-11-10T14:35:22.505Z] [INFO] --- tycho-source-plugin:1.5.0:plugin-source (plugin-source) @ org.eclipse.ease.lang.javascript.nashorn.test ---
09:35:22 [2020-11-10T14:35:22.505Z] [WARNING] Bundle-Vendor header not found in /home/jenkins/agent/workspace/ease.verify.core.target.2019-06/tests/org.eclipse.ease.lang.javascript.nashorn.test/META-INF/MANIFEST.MF, fallback to 'unknown' for source bundle
09:35:22 [2020-11-10T14:35:22.505Z] [INFO] Building jar: /home/jenkins/agent/workspace/ease.verify.core.target.2019-06/tests/org.eclipse.ease.lang.javascript.nashorn.test/target/org.eclipse.ease.lang.javascript.nashorn.test-0.8.0-SNAPSHOT-sources.jar
09:35:22 [2020-11-10T14:35:22.505Z] [INFO] 
09:35:22 [2020-11-10T14:35:22.505Z] [INFO] --- target-platform-configuration:1.5.0:target-platform (default-target-platform) @ org.eclipse.ease.lang.javascript.nashorn.test ---
09:35:22 [2020-11-10T14:35:22.505Z] [INFO] 
09:35:22 [2020-11-10T14:35:22.505Z] [INFO] --- tycho-packaging-plugin:1.5.0:package-plugin (default-package-plugin) @ org.eclipse.ease.lang.javascript.nashorn.test ---
09:35:22 [2020-11-10T14:35:22.505Z] [INFO] Building jar: /home/jenkins/agent/workspace/ease.verify.core.target.2019-06/tests/org.eclipse.ease.lang.javascript.nashorn.test/target/org.eclipse.ease.lang.javascript.nashorn.test-0.8.0-SNAPSHOT.jar
09:35:22 [2020-11-10T14:35:22.505Z] [INFO] 
09:35:22 [2020-11-10T14:35:22.505Z] [INFO] --- tycho-p2-plugin:1.5.0:p2-metadata-default (default-p2-metadata-default) @ org.eclipse.ease.lang.javascript.nashorn.test ---
09:35:22 [2020-11-10T14:35:22.505Z] [INFO] 
09:35:22 [2020-11-10T14:35:22.505Z] [INFO] --- tycho-source-feature-plugin:1.5.0:source-feature (source-feature) @ org.eclipse.ease.lang.javascript.nashorn.test ---
09:35:22 [2020-11-10T14:35:22.505Z] [INFO] 
09:35:22 [2020-11-10T14:35:22.505Z] [INFO] --- tycho-p2-plugin:1.5.0:p2-metadata (attached-p2-metadata) @ org.eclipse.ease.lang.javascript.nashorn.test ---
09:35:22 [2020-11-10T14:35:22.761Z] [INFO] 
09:35:22 [2020-11-10T14:35:22.761Z] [INFO] --- tycho-surefire-plugin:1.5.0:test (default-test) @ org.eclipse.ease.lang.javascript.nashorn.test ---
09:35:22 [2020-11-10T14:35:22.761Z] [INFO] Expected eclipse log file: /home/jenkins/agent/workspace/ease.verify.core.target.2019-06/tests/org.eclipse.ease.lang.javascript.nashorn.test/target/work/data/.metadata/.log
09:35:22 [2020-11-10T14:35:22.761Z] [INFO] Command line:
09:35:22 [2020-11-10T14:35:22.761Z] 	[/opt/tools/java/openjdk/jdk-11/11.0.2+9/bin/java, -Dosgi.noShutdown=false, -Dosgi.os=linux, -Dosgi.ws=gtk, -Dosgi.arch=x86_64, -Dosgi.clean=true, -jar, /home/jenkins/.m2/repository/p2/osgi/bundle/org.eclipse.equinox.launcher/1.5.400.v20190515-0925/org.eclipse.equinox.launcher-1.5.400.v20190515-0925.jar, -data, /home/jenkins/agent/workspace/ease.verify.core.target.2019-06/tests/org.eclipse.ease.lang.javascript.nashorn.test/target/work/data, -install, /home/jenkins/agent/workspace/ease.verify.core.target.2019-06/tests/org.eclipse.ease.lang.javascript.nashorn.test/target/work, -configuration, /home/jenkins/agent/workspace/ease.verify.core.target.2019-06/tests/org.eclipse.ease.lang.javascript.nashorn.test/target/work/configuration, -application, org.eclipse.tycho.surefire.osgibooter.headlesstest, -testproperties, /home/jenkins/agent/workspace/ease.verify.core.target.2019-06/tests/org.eclipse.ease.lang.javascript.nashorn.test/target/surefire.properties]
09:35:22 [2020-11-10T14:35:22.761Z] Picked up JAVA_TOOL_OPTIONS: -Dmaven.ext.class.path="/home/jenkins/agent/workspace/ease.verify.core.target.2019-06@tmp/withMaven7f2c0cca/pipeline-maven-spy.jar" -Dorg.jenkinsci.plugins.pipeline.maven.reportsFolder="/home/jenkins/agent/workspace/ease.verify.core.target.2019-06@tmp/withMaven7f2c0cca" 
09:35:24 [2020-11-10T14:35:24.659Z] Running org.eclipse.ease.lang.javascript.nashorn.NashornEnvironmentTest
09:35:24 [2020-11-10T14:35:24.659Z] Warning: Nashorn engine is planned to be removed from a future JDK release
09:35:24 [2020-11-10T14:35:24.914Z] Warning: Nashorn engine is planned to be removed from a future JDK release
09:35:24 [2020-11-10T14:35:24.914Z] Warning: Nashorn engine is planned to be removed from a future JDK release
09:35:24 [2020-11-10T14:35:24.914Z] WARNING: An illegal reflective access operation has occurred
09:35:24 [2020-11-10T14:35:24.914Z] WARNING: Illegal reflective access by org.mockito.cglib.core.ReflectUtils$2 (file:/home/jenkins/.m2/repository/p2/osgi/bundle/org.mockito/1.9.5.v201605172210/org.mockito-1.9.5.v201605172210.jar) to method java.lang.ClassLoader.defineClass(java.lang.String,byte[],int,int,java.security.ProtectionDomain)
09:35:24 [2020-11-10T14:35:24.914Z] WARNING: Please consider reporting this to the maintainers of org.mockito.cglib.core.ReflectUtils$2
09:35:24 [2020-11-10T14:35:24.914Z] WARNING: Use --illegal-access=warn to enable warnings of further illegal reflective access operations
09:35:24 [2020-11-10T14:35:24.914Z] WARNING: All illegal access operations will be denied in a future release
09:35:25 [2020-11-10T14:35:25.199Z] Warning: Nashorn engine is planned to be removed from a future JDK release
09:35:25 [2020-11-10T14:35:25.199Z] Warning: Nashorn engine is planned to be removed from a future JDK release
09:35:25 [2020-11-10T14:35:25.199Z] Tests run: 5, Failures: 0, Errors: 0, Skipped: 0, Time elapsed: 0.918 s - in org.eclipse.ease.lang.javascript.nashorn.NashornEnvironmentTest
09:35:25 [2020-11-10T14:35:25.199Z] reloadEnvironment(org.eclipse.ease.lang.javascript.nashorn.NashornEnvironmentTest)  Time elapsed: 0.51 s
09:35:25 [2020-11-10T14:35:25.199Z] bootstrappedEnvironment(org.eclipse.ease.lang.javascript.nashorn.NashornEnvironmentTest)  Time elapsed: 0.075 s
09:35:25 [2020-11-10T14:35:25.199Z] postMethodCallback(org.eclipse.ease.lang.javascript.nashorn.NashornEnvironmentTest)  Time elapsed: 0.177 s
09:35:25 [2020-11-10T14:35:25.199Z] preMethodCallback(org.eclipse.ease.lang.javascript.nashorn.NashornEnvironmentTest)  Time elapsed: 0.051 s
09:35:25 [2020-11-10T14:35:25.199Z] reloadFunctionDefinitions(org.eclipse.ease.lang.javascript.nashorn.NashornEnvironmentTest)  Time elapsed: 0.086 s
09:35:25 [2020-11-10T14:35:25.199Z] 
09:35:25 [2020-11-10T14:35:25.199Z] Results:
09:35:25 [2020-11-10T14:35:25.199Z] 
09:35:25 [2020-11-10T14:35:25.199Z] Tests run: 5, Failures: 0, Errors: 0, Skipped: 0
09:35:25 [2020-11-10T14:35:25.199Z] 
09:35:25 [2020-11-10T14:35:25.800Z] [INFO] All tests passed!
09:35:25 [2020-11-10T14:35:25.800Z] [INFO] 
09:35:25 [2020-11-10T14:35:25.800Z] [INFO] ----< org.eclipse.ease:org.eclipse.ease.lang.javascript.rhino.test >----
09:35:25 [2020-11-10T14:35:25.800Z] [INFO] Building org.eclipse.ease.lang.javascript.rhino.test 0.8.0-SNAPSHOT [5/11]
09:35:25 [2020-11-10T14:35:25.800Z] [INFO] ------------------------[ eclipse-test-plugin ]-------------------------
09:35:25 [2020-11-10T14:35:25.800Z] [INFO] 
09:35:25 [2020-11-10T14:35:25.800Z] [INFO] --- tycho-packaging-plugin:1.5.0:build-qualifier (default-build-qualifier) @ org.eclipse.ease.lang.javascript.rhino.test ---
09:35:25 [2020-11-10T14:35:25.800Z] [INFO] The project's OSGi version is 0.8.0.I201911291239
09:35:25 [2020-11-10T14:35:25.800Z] [INFO] 
09:35:25 [2020-11-10T14:35:25.800Z] [INFO] --- tycho-packaging-plugin:1.5.0:validate-id (default-validate-id) @ org.eclipse.ease.lang.javascript.rhino.test ---
09:35:25 [2020-11-10T14:35:25.800Z] [INFO] 
09:35:25 [2020-11-10T14:35:25.800Z] [INFO] --- tycho-packaging-plugin:1.5.0:validate-version (default-validate-version) @ org.eclipse.ease.lang.javascript.rhino.test ---
09:35:25 [2020-11-10T14:35:25.800Z] [INFO] 
09:35:25 [2020-11-10T14:35:25.800Z] [INFO] --- maven-resources-plugin:2.4.3:resources (default-resources) @ org.eclipse.ease.lang.javascript.rhino.test ---
09:35:25 [2020-11-10T14:35:25.800Z] [INFO] Using 'UTF-8' encoding to copy filtered resources.
09:35:25 [2020-11-10T14:35:25.800Z] [INFO] skip non existing resourceDirectory /home/jenkins/agent/workspace/ease.verify.core.target.2019-06/tests/org.eclipse.ease.lang.javascript.rhino.test/src/main/resources
09:35:25 [2020-11-10T14:35:25.800Z] [INFO] 
09:35:25 [2020-11-10T14:35:25.800Z] [INFO] --- tycho-compiler-plugin:1.5.0:compile (default-compile) @ org.eclipse.ease.lang.javascript.rhino.test ---
09:35:25 [2020-11-10T14:35:25.800Z] [INFO] Nothing to compile - all classes are up to date
09:35:25 [2020-11-10T14:35:25.800Z] [INFO] 
09:35:25 [2020-11-10T14:35:25.800Z] [INFO] --- maven-resources-plugin:2.4.3:testResources (default-testResources) @ org.eclipse.ease.lang.javascript.rhino.test ---
09:35:25 [2020-11-10T14:35:25.800Z] [INFO] Using 'UTF-8' encoding to copy filtered resources.
09:35:25 [2020-11-10T14:35:25.800Z] [INFO] skip non existing resourceDirectory /home/jenkins/agent/workspace/ease.verify.core.target.2019-06/tests/org.eclipse.ease.lang.javascript.rhino.test/src/test/resources
09:35:25 [2020-11-10T14:35:25.800Z] [INFO] 
09:35:25 [2020-11-10T14:35:25.800Z] [INFO] --- tycho-source-plugin:1.5.0:plugin-source (plugin-source) @ org.eclipse.ease.lang.javascript.rhino.test ---
09:35:25 [2020-11-10T14:35:25.800Z] [WARNING] Bundle-Vendor header not found in /home/jenkins/agent/workspace/ease.verify.core.target.2019-06/tests/org.eclipse.ease.lang.javascript.rhino.test/META-INF/MANIFEST.MF, fallback to 'unknown' for source bundle
09:35:25 [2020-11-10T14:35:25.800Z] [INFO] Building jar: /home/jenkins/agent/workspace/ease.verify.core.target.2019-06/tests/org.eclipse.ease.lang.javascript.rhino.test/target/org.eclipse.ease.lang.javascript.rhino.test-0.8.0-SNAPSHOT-sources.jar
09:35:25 [2020-11-10T14:35:25.800Z] [INFO] 
09:35:25 [2020-11-10T14:35:25.800Z] [INFO] --- target-platform-configuration:1.5.0:target-platform (default-target-platform) @ org.eclipse.ease.lang.javascript.rhino.test ---
09:35:25 [2020-11-10T14:35:25.800Z] [INFO] 
09:35:25 [2020-11-10T14:35:25.801Z] [INFO] --- tycho-packaging-plugin:1.5.0:package-plugin (default-package-plugin) @ org.eclipse.ease.lang.javascript.rhino.test ---
09:35:25 [2020-11-10T14:35:25.801Z] [INFO] Building jar: /home/jenkins/agent/workspace/ease.verify.core.target.2019-06/tests/org.eclipse.ease.lang.javascript.rhino.test/target/org.eclipse.ease.lang.javascript.rhino.test-0.8.0-SNAPSHOT.jar
09:35:25 [2020-11-10T14:35:25.801Z] [INFO] 
09:35:25 [2020-11-10T14:35:25.801Z] [INFO] --- tycho-p2-plugin:1.5.0:p2-metadata-default (default-p2-metadata-default) @ org.eclipse.ease.lang.javascript.rhino.test ---
09:35:25 [2020-11-10T14:35:25.801Z] [INFO] 
09:35:25 [2020-11-10T14:35:25.801Z] [INFO] --- tycho-source-feature-plugin:1.5.0:source-feature (source-feature) @ org.eclipse.ease.lang.javascript.rhino.test ---
09:35:25 [2020-11-10T14:35:25.801Z] [INFO] 
09:35:25 [2020-11-10T14:35:25.801Z] [INFO] --- tycho-p2-plugin:1.5.0:p2-metadata (attached-p2-metadata) @ org.eclipse.ease.lang.javascript.rhino.test ---
09:35:25 [2020-11-10T14:35:25.801Z] [INFO] 
09:35:25 [2020-11-10T14:35:25.801Z] [INFO] --- tycho-surefire-plugin:1.5.0:test (default-test) @ org.eclipse.ease.lang.javascript.rhino.test ---
09:35:26 [2020-11-10T14:35:26.056Z] [INFO] Expected eclipse log file: /home/jenkins/agent/workspace/ease.verify.core.target.2019-06/tests/org.eclipse.ease.lang.javascript.rhino.test/target/work/data/.metadata/.log
09:35:26 [2020-11-10T14:35:26.056Z] [INFO] Command line:
09:35:26 [2020-11-10T14:35:26.056Z] 	[/opt/tools/java/openjdk/jdk-11/11.0.2+9/bin/java, -Dosgi.noShutdown=false, -Dosgi.os=linux, -Dosgi.ws=gtk, -Dosgi.arch=x86_64, -Dosgi.clean=true, -jar, /home/jenkins/.m2/repository/p2/osgi/bundle/org.eclipse.equinox.launcher/1.5.400.v20190515-0925/org.eclipse.equinox.launcher-1.5.400.v20190515-0925.jar, -data, /home/jenkins/agent/workspace/ease.verify.core.target.2019-06/tests/org.eclipse.ease.lang.javascript.rhino.test/target/work/data, -install, /home/jenkins/agent/workspace/ease.verify.core.target.2019-06/tests/org.eclipse.ease.lang.javascript.rhino.test/target/work, -configuration, /home/jenkins/agent/workspace/ease.verify.core.target.2019-06/tests/org.eclipse.ease.lang.javascript.rhino.test/target/work/configuration, -application, org.eclipse.tycho.surefire.osgibooter.headlesstest, -testproperties, /home/jenkins/agent/workspace/ease.verify.core.target.2019-06/tests/org.eclipse.ease.lang.javascript.rhino.test/target/surefire.properties]
09:35:26 [2020-11-10T14:35:26.056Z] Picked up JAVA_TOOL_OPTIONS: -Dmaven.ext.class.path="/home/jenkins/agent/workspace/ease.verify.core.target.2019-06@tmp/withMaven7f2c0cca/pipeline-maven-spy.jar" -Dorg.jenkinsci.plugins.pipeline.maven.reportsFolder="/home/jenkins/agent/workspace/ease.verify.core.target.2019-06@tmp/withMaven7f2c0cca" 
09:35:27 [2020-11-10T14:35:27.998Z] Running org.eclipse.ease.lang.javascript.rhino.RhinoScriptEngineTest
09:35:27 [2020-11-10T14:35:27.998Z] org.eclipse.ease.ScriptExecutionException: JavaError: NotThere cannot be found by org.mozilla.javascript_1.7.10.v20190430-1943
09:35:27 [2020-11-10T14:35:27.998Z] 	at <unknown source>
09:35:27 [2020-11-10T14:35:27.998Z] 
09:35:27 [2020-11-10T14:35:27.998Z] Java Stacktrace:
09:35:27 [2020-11-10T14:35:27.998Z] java.lang.ClassNotFoundException: NotThere cannot be found by org.mozilla.javascript_1.7.10.v20190430-1943
09:35:27 [2020-11-10T14:35:27.998Z] 	at org.eclipse.osgi.internal.loader.BundleLoader.findClassInternal(BundleLoader.java:512)
09:35:27 [2020-11-10T14:35:27.998Z] 	at org.eclipse.osgi.internal.loader.BundleLoader.findClass(BundleLoader.java:423)
09:35:27 [2020-11-10T14:35:27.998Z] 	at org.eclipse.osgi.internal.loader.BundleLoader.findClass(BundleLoader.java:415)
09:35:27 [2020-11-10T14:35:27.998Z] 	at org.eclipse.osgi.internal.loader.ModuleClassLoader.loadClass(ModuleClassLoader.java:155)
09:35:27 [2020-11-10T14:35:27.998Z] 	at java.base/java.lang.ClassLoader.loadClass(ClassLoader.java:521)
09:35:27 [2020-11-10T14:35:27.998Z] 	at java.base/java.lang.Class.forName0(Native Method)
09:35:27 [2020-11-10T14:35:27.998Z] 	at java.base/java.lang.Class.forName(Class.java:315)
09:35:27 [2020-11-10T14:35:27.998Z] 	at java.base/jdk.internal.reflect.NativeMethodAccessorImpl.invoke0(Native Method)
09:35:27 [2020-11-10T14:35:27.998Z] 	at java.base/jdk.internal.reflect.NativeMethodAccessorImpl.invoke(NativeMethodAccessorImpl.java:62)
09:35:27 [2020-11-10T14:35:27.998Z] 	at java.base/jdk.internal.reflect.DelegatingMethodAccessorImpl.invoke(DelegatingMethodAccessorImpl.java:43)
09:35:27 [2020-11-10T14:35:27.998Z] 	at java.base/java.lang.reflect.Method.invoke(Method.java:566)
09:35:27 [2020-11-10T14:35:27.998Z] 	at org.mozilla.javascript.MemberBox.invoke(MemberBox.java:126)
09:35:27 [2020-11-10T14:35:27.998Z] 	at org.mozilla.javascript.NativeJavaMethod.call(NativeJavaMethod.java:225)
09:35:27 [2020-11-10T14:35:27.998Z] 	at org.mozilla.javascript.optimizer.OptRuntime.call1(OptRuntime.java:32)
09:35:27 [2020-11-10T14:35:27.998Z] 	at org.mozilla.javascript.gen.c_3._c_script_0(Unknown Source)
09:35:27 [2020-11-10T14:35:27.998Z] 	at org.mozilla.javascript.gen.c_3.call(Unknown Source)
09:35:27 [2020-11-10T14:35:27.998Z] 	at org.mozilla.javascript.ContextFactory.doTopCall(ContextFactory.java:405)
09:35:27 [2020-11-10T14:35:27.998Z] 	at org.mozilla.javascript.ScriptRuntime.doTopCall(ScriptRuntime.java:3508)
09:35:27 [2020-11-10T14:35:27.998Z] 	at org.mozilla.javascript.gen.c_3.call(Unknown Source)
09:35:27 [2020-11-10T14:35:27.998Z] 	at org.mozilla.javascript.gen.c_3.exec(Unknown Source)
09:35:27 [2020-11-10T14:35:27.998Z] 	at org.mozilla.javascript.Context.evaluateReader(Context.java:1293)
09:35:27 [2020-11-10T14:35:27.998Z] 	at org.eclipse.ease.lang.javascript.rhino.RhinoScriptEngine.internalExecute(RhinoScriptEngine.java:222)
09:35:27 [2020-11-10T14:35:27.998Z] 	at org.eclipse.ease.lang.javascript.rhino.RhinoScriptEngine.execute(RhinoScriptEngine.java:201)
09:35:27 [2020-11-10T14:35:27.998Z] 	at org.eclipse.ease.AbstractScriptEngine.inject(AbstractScriptEngine.java:224)
09:35:27 [2020-11-10T14:35:27.998Z] 	at org.eclipse.ease.AbstractScriptEngine.run(AbstractScriptEngine.java:274)
09:35:27 [2020-11-10T14:35:27.998Z] 	at org.eclipse.core.internal.jobs.Worker.run(Worker.java:63)
09:35:27 [2020-11-10T14:35:27.998Z] org.eclipse.ease.ScriptExecutionException: TypeError: Cannot call method "foobar" of undefined
09:35:27 [2020-11-10T14:35:27.998Z] 	at <unknown source>
09:35:28 [2020-11-10T14:35:28.254Z] org.eclipse.ease.ScriptExecutionException: ScriptException: test
09:35:28 [2020-11-10T14:35:28.254Z] 	at <unknown source>
09:35:28 [2020-11-10T14:35:28.254Z] org.eclipse.ease.ScriptExecutionException: JavaError: java.lang.Exception
09:35:28 [2020-11-10T14:35:28.254Z] 	at <unknown source>
09:35:28 [2020-11-10T14:35:28.254Z] 
09:35:28 [2020-11-10T14:35:28.254Z] Java Stacktrace:
09:35:28 [2020-11-10T14:35:28.254Z] java.lang.Exception
09:35:28 [2020-11-10T14:35:28.254Z] 	at java.base/jdk.internal.reflect.NativeConstructorAccessorImpl.newInstance0(Native Method)
09:35:28 [2020-11-10T14:35:28.254Z] 	at java.base/jdk.internal.reflect.NativeConstructorAccessorImpl.newInstance(NativeConstructorAccessorImpl.java:62)
09:35:28 [2020-11-10T14:35:28.254Z] 	at java.base/jdk.internal.reflect.DelegatingConstructorAccessorImpl.newInstance(DelegatingConstructorAccessorImpl.java:45)
09:35:28 [2020-11-10T14:35:28.254Z] 	at java.base/java.lang.reflect.Constructor.newInstance(Constructor.java:490)
09:35:28 [2020-11-10T14:35:28.254Z] 	at org.mozilla.javascript.MemberBox.newInstance(MemberBox.java:159)
09:35:28 [2020-11-10T14:35:28.254Z] 	at org.mozilla.javascript.NativeJavaClass.constructInternal(NativeJavaClass.java:266)
09:35:28 [2020-11-10T14:35:28.254Z] 	at org.mozilla.javascript.NativeJavaClass.constructSpecific(NativeJavaClass.java:205)
09:35:28 [2020-11-10T14:35:28.254Z] 	at org.mozilla.javascript.NativeJavaClass.construct(NativeJavaClass.java:166)
09:35:28 [2020-11-10T14:35:28.254Z] 	at org.mozilla.javascript.ScriptRuntime.newObject(ScriptRuntime.java:2655)
09:35:28 [2020-11-10T14:35:28.254Z] 	at org.mozilla.javascript.gen.c_21._c_script_0(Unknown Source)
09:35:28 [2020-11-10T14:35:28.254Z] 	at org.mozilla.javascript.gen.c_21.call(Unknown Source)
09:35:28 [2020-11-10T14:35:28.254Z] 	at org.mozilla.javascript.ContextFactory.doTopCall(ContextFactory.java:405)
09:35:28 [2020-11-10T14:35:28.254Z] 	at org.mozilla.javascript.ScriptRuntime.doTopCall(ScriptRuntime.java:3508)
09:35:28 [2020-11-10T14:35:28.254Z] 	at org.mozilla.javascript.gen.c_21.call(Unknown Source)
09:35:28 [2020-11-10T14:35:28.254Z] 	at org.mozilla.javascript.gen.c_21.exec(Unknown Source)
09:35:28 [2020-11-10T14:35:28.254Z] 	at org.mozilla.javascript.Context.evaluateReader(Context.java:1293)
09:35:28 [2020-11-10T14:35:28.254Z] 	at org.eclipse.ease.lang.javascript.rhino.RhinoScriptEngine.internalExecute(RhinoScriptEngine.java:222)
09:35:28 [2020-11-10T14:35:28.254Z] 	at org.eclipse.ease.lang.javascript.rhino.RhinoScriptEngine.execute(RhinoScriptEngine.java:201)
09:35:28 [2020-11-10T14:35:28.254Z] 	at org.eclipse.ease.AbstractScriptEngine.inject(AbstractScriptEngine.java:224)
09:35:28 [2020-11-10T14:35:28.254Z] 	at org.eclipse.ease.AbstractScriptEngine.run(AbstractScriptEngine.java:274)
09:35:28 [2020-11-10T14:35:28.254Z] 	at org.eclipse.core.internal.jobs.Worker.run(Worker.java:63)
09:35:28 [2020-11-10T14:35:28.254Z] org.eclipse.ease.ScriptExecutionException: ScriptException: JavaScript
09:35:28 [2020-11-10T14:35:28.254Z] 	at <unknown source>
09:35:28 [2020-11-10T14:35:28.254Z] org.eclipse.ease.ScriptExecutionException: SyntaxError: unterminated string literal (#1)
09:35:28 [2020-11-10T14:35:28.254Z] 'asdf
09:35:28 [2020-11-10T14:35:28.254Z]     ^
09:35:28 [2020-11-10T14:35:28.254Z] 	at <unknown source>
09:35:28 [2020-11-10T14:35:28.254Z] Tests run: 11, Failures: 0, Errors: 0, Skipped: 0, Time elapsed: 0.448 s - in org.eclipse.ease.lang.javascript.rhino.RhinoScriptEngineTest
09:35:28 [2020-11-10T14:35:28.254Z] causeWrappedException(org.eclipse.ease.lang.javascript.rhino.RhinoScriptEngineTest)  Time elapsed: 0.131 s
09:35:28 [2020-11-10T14:35:28.254Z] optionalModuleParameters(org.eclipse.ease.lang.javascript.rhino.RhinoScriptEngineTest)  Time elapsed: 0.024 s
09:35:28 [2020-11-10T14:35:28.254Z] simpleScriptCode(org.eclipse.ease.lang.javascript.rhino.RhinoScriptEngineTest)  Time elapsed: 0.067 s
09:35:28 [2020-11-10T14:35:28.254Z] causeRuntimeErrorException(org.eclipse.ease.lang.javascript.rhino.RhinoScriptEngineTest)  Time elapsed: 0.021 s
09:35:28 [2020-11-10T14:35:28.254Z] callModuleCode(org.eclipse.ease.lang.javascript.rhino.RhinoScriptEngineTest)  Time elapsed: 0.034 s
09:35:28 [2020-11-10T14:35:28.255Z] throwJavaClass(org.eclipse.ease.lang.javascript.rhino.RhinoScriptEngineTest)  Time elapsed: 0.053 s
09:35:28 [2020-11-10T14:35:28.255Z] throwJavaException(org.eclipse.ease.lang.javascript.rhino.RhinoScriptEngineTest)  Time elapsed: 0.015 s
09:35:28 [2020-11-10T14:35:28.255Z] accessJavaClasses(org.eclipse.ease.lang.javascript.rhino.RhinoScriptEngineTest)  Time elapsed: 0.012 s
09:35:28 [2020-11-10T14:35:28.255Z] accessEclipseClasses(org.eclipse.ease.lang.javascript.rhino.RhinoScriptEngineTest)  Time elapsed: 0.013 s
09:35:28 [2020-11-10T14:35:28.255Z] throwJavaScriptException(org.eclipse.ease.lang.javascript.rhino.RhinoScriptEngineTest)  Time elapsed: 0.011 s
09:35:28 [2020-11-10T14:35:28.255Z] causeSyntaxErrorException(org.eclipse.ease.lang.javascript.rhino.RhinoScriptEngineTest)  Time elapsed: 0.047 s
09:35:28 [2020-11-10T14:35:28.255Z] Running org.eclipse.ease.lang.javascript.rhino.RhinoEnvironmentTest
09:35:28 [2020-11-10T14:35:28.255Z] WARNING: An illegal reflective access operation has occurred
09:35:28 [2020-11-10T14:35:28.255Z] WARNING: Illegal reflective access by org.mockito.cglib.core.ReflectUtils$2 (file:/home/jenkins/.m2/repository/p2/osgi/bundle/org.mockito/1.9.5.v201605172210/org.mockito-1.9.5.v201605172210.jar) to method java.lang.ClassLoader.defineClass(java.lang.String,byte[],int,int,java.security.ProtectionDomain)
09:35:28 [2020-11-10T14:35:28.255Z] WARNING: Please consider reporting this to the maintainers of org.mockito.cglib.core.ReflectUtils$2
09:35:28 [2020-11-10T14:35:28.255Z] WARNING: Use --illegal-access=warn to enable warnings of further illegal reflective access operations
09:35:28 [2020-11-10T14:35:28.255Z] WARNING: All illegal access operations will be denied in a future release
09:35:28 [2020-11-10T14:35:28.511Z] Tests run: 5, Failures: 0, Errors: 0, Skipped: 0, Time elapsed: 0.194 s - in org.eclipse.ease.lang.javascript.rhino.RhinoEnvironmentTest
09:35:28 [2020-11-10T14:35:28.511Z] reloadEnvironment(org.eclipse.ease.lang.javascript.rhino.RhinoEnvironmentTest)  Time elapsed: 0.027 s
09:35:28 [2020-11-10T14:35:28.511Z] bootstrappedEnvironment(org.eclipse.ease.lang.javascript.rhino.RhinoEnvironmentTest)  Time elapsed: 0.011 s
09:35:28 [2020-11-10T14:35:28.511Z] postMethodCallback(org.eclipse.ease.lang.javascript.rhino.RhinoEnvironmentTest)  Time elapsed: 0.095 s
09:35:28 [2020-11-10T14:35:28.511Z] preMethodCallback(org.eclipse.ease.lang.javascript.rhino.RhinoEnvironmentTest)  Time elapsed: 0.013 s
09:35:28 [2020-11-10T14:35:28.511Z] reloadFunctionDefinitions(org.eclipse.ease.lang.javascript.rhino.RhinoEnvironmentTest)  Time elapsed: 0.046 s
09:35:28 [2020-11-10T14:35:28.511Z] Running org.eclipse.ease.lang.javascript.rhino.RhinoDebuggerEngineTest
09:35:28 [2020-11-10T14:35:28.511Z] org.eclipse.ease.ScriptExecutionException: JavaError: NotThere cannot be found by org.mozilla.javascript_1.7.10.v20190430-1943
09:35:28 [2020-11-10T14:35:28.511Z] 
09:35:28 [2020-11-10T14:35:28.511Z] Java Stacktrace:
09:35:28 [2020-11-10T14:35:28.511Z] java.lang.ClassNotFoundException: NotThere cannot be found by org.mozilla.javascript_1.7.10.v20190430-1943
09:35:28 [2020-11-10T14:35:28.511Z] 	at org.eclipse.osgi.internal.loader.BundleLoader.findClassInternal(BundleLoader.java:512)
09:35:28 [2020-11-10T14:35:28.511Z] 	at org.eclipse.osgi.internal.loader.BundleLoader.findClass(BundleLoader.java:423)
09:35:28 [2020-11-10T14:35:28.511Z] 	at org.eclipse.osgi.internal.loader.BundleLoader.findClass(BundleLoader.java:415)
09:35:28 [2020-11-10T14:35:28.511Z] 	at org.eclipse.osgi.internal.loader.ModuleClassLoader.loadClass(ModuleClassLoader.java:155)
09:35:28 [2020-11-10T14:35:28.511Z] 	at java.base/java.lang.ClassLoader.loadClass(ClassLoader.java:521)
09:35:28 [2020-11-10T14:35:28.511Z] 	at java.base/java.lang.Class.forName0(Native Method)
09:35:28 [2020-11-10T14:35:28.511Z] 	at java.base/java.lang.Class.forName(Class.java:315)
09:35:28 [2020-11-10T14:35:28.511Z] 	at java.base/jdk.internal.reflect.NativeMethodAccessorImpl.invoke0(Native Method)
09:35:28 [2020-11-10T14:35:28.511Z] 	at java.base/jdk.internal.reflect.NativeMethodAccessorImpl.invoke(NativeMethodAccessorImpl.java:62)
09:35:28 [2020-11-10T14:35:28.511Z] 	at java.base/jdk.internal.reflect.DelegatingMethodAccessorImpl.invoke(DelegatingMethodAccessorImpl.java:43)
09:35:28 [2020-11-10T14:35:28.511Z] 	at java.base/java.lang.reflect.Method.invoke(Method.java:566)
09:35:28 [2020-11-10T14:35:28.511Z] 	at org.mozilla.javascript.MemberBox.invoke(MemberBox.java:126)
09:35:28 [2020-11-10T14:35:28.511Z] 	at org.mozilla.javascript.NativeJavaMethod.call(NativeJavaMethod.java:225)
09:35:28 [2020-11-10T14:35:28.511Z] 	at org.mozilla.javascript.Interpreter.interpretLoop(Interpreter.java:1573)
09:35:28 [2020-11-10T14:35:28.511Z] 	at org.mozilla.javascript.Interpreter.interpret(Interpreter.java:911)
09:35:28 [2020-11-10T14:35:28.511Z] 	at org.mozilla.javascript.InterpretedFunction.call(InterpretedFunction.java:109)
09:35:28 [2020-11-10T14:35:28.511Z] 	at org.mozilla.javascript.ContextFactory.doTopCall(ContextFactory.java:405)
09:35:28 [2020-11-10T14:35:28.511Z] 	at org.mozilla.javascript.ScriptRuntime.doTopCall(ScriptRuntime.java:3508)
09:35:28 [2020-11-10T14:35:28.511Z] 	at org.mozilla.javascript.InterpretedFunction.exec(InterpretedFunction.java:120)
09:35:28 [2020-11-10T14:35:28.511Z] 	at org.mozilla.javascript.Context.evaluateReader(Context.java:1293)
09:35:28 [2020-11-10T14:35:28.511Z] 	at org.eclipse.ease.lang.javascript.rhino.RhinoScriptEngine.internalExecute(RhinoScriptEngine.java:222)
09:35:28 [2020-11-10T14:35:28.511Z] 	at org.eclipse.ease.lang.javascript.rhino.RhinoScriptEngine.execute(RhinoScriptEngine.java:201)
09:35:28 [2020-11-10T14:35:28.511Z] 	at org.eclipse.ease.AbstractScriptEngine.inject(AbstractScriptEngine.java:224)
09:35:28 [2020-11-10T14:35:28.511Z] 	at org.eclipse.ease.AbstractScriptEngine.run(AbstractScriptEngine.java:274)
09:35:28 [2020-11-10T14:35:28.511Z] 	at org.eclipse.core.internal.jobs.Worker.run(Worker.java:63)
09:35:28 [2020-11-10T14:35:28.511Z] org.eclipse.ease.ScriptExecutionException: TypeError: Cannot call method "foobar" of undefined
09:35:28 [2020-11-10T14:35:28.767Z] org.eclipse.ease.ScriptExecutionException: ScriptException: test
09:35:28 [2020-11-10T14:35:28.767Z] org.eclipse.ease.ScriptExecutionException: JavaError: java.lang.Exception
09:35:28 [2020-11-10T14:35:28.767Z] 
09:35:28 [2020-11-10T14:35:28.767Z] Java Stacktrace:
09:35:28 [2020-11-10T14:35:28.767Z] java.lang.Exception
09:35:28 [2020-11-10T14:35:28.767Z] 	at java.base/jdk.internal.reflect.NativeConstructorAccessorImpl.newInstance0(Native Method)
09:35:28 [2020-11-10T14:35:28.767Z] 	at java.base/jdk.internal.reflect.NativeConstructorAccessorImpl.newInstance(NativeConstructorAccessorImpl.java:62)
09:35:28 [2020-11-10T14:35:28.767Z] 	at java.base/jdk.internal.reflect.DelegatingConstructorAccessorImpl.newInstance(DelegatingConstructorAccessorImpl.java:45)
09:35:28 [2020-11-10T14:35:28.767Z] 	at java.base/java.lang.reflect.Constructor.newInstance(Constructor.java:490)
09:35:28 [2020-11-10T14:35:28.767Z] 	at org.mozilla.javascript.MemberBox.newInstance(MemberBox.java:159)
09:35:28 [2020-11-10T14:35:28.767Z] 	at org.mozilla.javascript.NativeJavaClass.constructInternal(NativeJavaClass.java:266)
09:35:28 [2020-11-10T14:35:28.767Z] 	at org.mozilla.javascript.NativeJavaClass.constructSpecific(NativeJavaClass.java:205)
09:35:28 [2020-11-10T14:35:28.767Z] 	at org.mozilla.javascript.NativeJavaClass.construct(NativeJavaClass.java:166)
09:35:28 [2020-11-10T14:35:28.767Z] 	at org.mozilla.javascript.Interpreter.interpretLoop(Interpreter.java:1617)
09:35:28 [2020-11-10T14:35:28.767Z] 	at org.mozilla.javascript.Interpreter.interpret(Interpreter.java:911)
09:35:28 [2020-11-10T14:35:28.767Z] 	at org.mozilla.javascript.InterpretedFunction.call(InterpretedFunction.java:109)
09:35:28 [2020-11-10T14:35:28.767Z] 	at org.mozilla.javascript.ContextFactory.doTopCall(ContextFactory.java:405)
09:35:28 [2020-11-10T14:35:28.767Z] 	at org.mozilla.javascript.ScriptRuntime.doTopCall(ScriptRuntime.java:3508)
09:35:28 [2020-11-10T14:35:28.767Z] 	at org.mozilla.javascript.InterpretedFunction.exec(InterpretedFunction.java:120)
09:35:28 [2020-11-10T14:35:28.767Z] 	at org.mozilla.javascript.Context.evaluateReader(Context.java:1293)
09:35:28 [2020-11-10T14:35:28.767Z] 	at org.eclipse.ease.lang.javascript.rhino.RhinoScriptEngine.internalExecute(RhinoScriptEngine.java:222)
09:35:28 [2020-11-10T14:35:28.767Z] 	at org.eclipse.ease.lang.javascript.rhino.RhinoScriptEngine.execute(RhinoScriptEngine.java:201)
09:35:28 [2020-11-10T14:35:28.767Z] 	at org.eclipse.ease.AbstractScriptEngine.inject(AbstractScriptEngine.java:224)
09:35:28 [2020-11-10T14:35:28.767Z] 	at org.eclipse.ease.AbstractScriptEngine.run(AbstractScriptEngine.java:274)
09:35:28 [2020-11-10T14:35:28.767Z] 	at org.eclipse.core.internal.jobs.Worker.run(Worker.java:63)
09:35:28 [2020-11-10T14:35:28.767Z] org.eclipse.ease.ScriptExecutionException: ScriptException: JavaScript
09:35:28 [2020-11-10T14:35:28.767Z] org.eclipse.ease.ScriptExecutionException: SyntaxError: unterminated string literal (#1)
09:35:28 [2020-11-10T14:35:28.767Z] 'asdf
09:35:28 [2020-11-10T14:35:28.767Z]     ^
09:35:28 [2020-11-10T14:35:28.767Z] 	at <unknown source>:1
09:35:28 [2020-11-10T14:35:28.767Z] Tests run: 12, Failures: 0, Errors: 0, Skipped: 0, Time elapsed: 0.303 s - in org.eclipse.ease.lang.javascript.rhino.RhinoDebuggerEngineTest
09:35:28 [2020-11-10T14:35:28.767Z] getExceptionStackTrace(org.eclipse.ease.lang.javascript.rhino.RhinoDebuggerEngineTest)  Time elapsed: 0.09 s
09:35:28 [2020-11-10T14:35:28.767Z] causeWrappedException(org.eclipse.ease.lang.javascript.rhino.RhinoDebuggerEngineTest)  Time elapsed: 0.015 s
09:35:28 [2020-11-10T14:35:28.767Z] optionalModuleParameters(org.eclipse.ease.lang.javascript.rhino.RhinoDebuggerEngineTest)  Time elapsed: 0.014 s
09:35:28 [2020-11-10T14:35:28.767Z] simpleScriptCode(org.eclipse.ease.lang.javascript.rhino.RhinoDebuggerEngineTest)  Time elapsed: 0.013 s
09:35:28 [2020-11-10T14:35:28.767Z] causeRuntimeErrorException(org.eclipse.ease.lang.javascript.rhino.RhinoDebuggerEngineTest)  Time elapsed: 0.043 s
09:35:28 [2020-11-10T14:35:28.767Z] callModuleCode(org.eclipse.ease.lang.javascript.rhino.RhinoDebuggerEngineTest)  Time elapsed: 0.012 s
09:35:28 [2020-11-10T14:35:28.767Z] throwJavaClass(org.eclipse.ease.lang.javascript.rhino.RhinoDebuggerEngineTest)  Time elapsed: 0.014 s
09:35:28 [2020-11-10T14:35:28.767Z] throwJavaException(org.eclipse.ease.lang.javascript.rhino.RhinoDebuggerEngineTest)  Time elapsed: 0.015 s
09:35:28 [2020-11-10T14:35:28.767Z] accessJavaClasses(org.eclipse.ease.lang.javascript.rhino.RhinoDebuggerEngineTest)  Time elapsed: 0.012 s
09:35:28 [2020-11-10T14:35:28.767Z] accessEclipseClasses(org.eclipse.ease.lang.javascript.rhino.RhinoDebuggerEngineTest)  Time elapsed: 0.045 s
09:35:28 [2020-11-10T14:35:28.767Z] throwJavaScriptException(org.eclipse.ease.lang.javascript.rhino.RhinoDebuggerEngineTest)  Time elapsed: 0.012 s
09:35:28 [2020-11-10T14:35:28.767Z] causeSyntaxErrorException(org.eclipse.ease.lang.javascript.rhino.RhinoDebuggerEngineTest)  Time elapsed: 0.015 s
09:35:28 [2020-11-10T14:35:28.767Z] Running org.eclipse.ease.lang.javascript.rhino.RhinoDebugTest
09:35:29 [2020-11-10T14:35:29.023Z] Start of script
09:35:29 [2020-11-10T14:35:29.023Z] include file start
09:35:29 [2020-11-10T14:35:29.023Z] Include file processed
09:35:29 [2020-11-10T14:35:29.023Z] line after include file
09:35:29 [2020-11-10T14:35:29.023Z] Result of testMethod = 5
09:35:29 [2020-11-10T14:35:29.023Z] End of script
09:35:29 [2020-11-10T14:35:29.023Z] Start of script
09:35:29 [2020-11-10T14:35:29.023Z] include file start
09:35:29 [2020-11-10T14:35:29.023Z] Include file processed
09:35:29 [2020-11-10T14:35:29.023Z] line after include file
09:35:29 [2020-11-10T14:35:29.023Z] Result of testMethod = 5
09:35:29 [2020-11-10T14:35:29.023Z] End of script
09:35:29 [2020-11-10T14:35:29.279Z] Start of script
09:35:29 [2020-11-10T14:35:29.279Z] include file start
09:35:29 [2020-11-10T14:35:29.279Z] Include file processed
09:35:29 [2020-11-10T14:35:29.279Z] line after include file
09:35:29 [2020-11-10T14:35:29.279Z] Result of testMethod = 5
09:35:29 [2020-11-10T14:35:29.535Z] Start of script
09:35:29 [2020-11-10T14:35:29.535Z] include file start
09:35:29 [2020-11-10T14:35:29.535Z] Include file processed
09:35:29 [2020-11-10T14:35:29.535Z] line after include file
09:35:29 [2020-11-10T14:35:29.791Z] Result of testMethod = 5
09:35:29 [2020-11-10T14:35:29.791Z] End of script
09:35:30 [2020-11-10T14:35:30.047Z] Start of script
09:35:30 [2020-11-10T14:35:30.047Z] include file start
09:35:30 [2020-11-10T14:35:30.047Z] Include file processed
09:35:30 [2020-11-10T14:35:30.047Z] line after include file
09:35:30 [2020-11-10T14:35:30.047Z] Result of testMethod = 5
09:35:30 [2020-11-10T14:35:30.047Z] End of script
09:35:30 [2020-11-10T14:35:30.303Z] Start of script
09:35:30 [2020-11-10T14:35:30.303Z] include file start
09:35:30 [2020-11-10T14:35:30.303Z] Include file processed
09:35:30 [2020-11-10T14:35:30.303Z] line after include file
09:35:30 [2020-11-10T14:35:30.303Z] Result of testMethod = 5
09:35:30 [2020-11-10T14:35:30.303Z] End of script
09:35:30 [2020-11-10T14:35:30.559Z] Start of script
09:35:30 [2020-11-10T14:35:30.559Z] include file start
09:35:30 [2020-11-10T14:35:30.559Z] Include file processed
09:35:30 [2020-11-10T14:35:30.559Z] line after include file
09:35:30 [2020-11-10T14:35:30.559Z] Result of testMethod = 5
09:35:30 [2020-11-10T14:35:30.814Z] Start of script
09:35:30 [2020-11-10T14:35:30.814Z] include file start
09:35:30 [2020-11-10T14:35:30.814Z] Include file processed
09:35:30 [2020-11-10T14:35:30.814Z] line after include file
09:35:31 [2020-11-10T14:35:31.070Z] Result of testMethod = 5
09:35:31 [2020-11-10T14:35:31.070Z] End of script
09:35:31 [2020-11-10T14:35:31.070Z] Start of script
09:35:31 [2020-11-10T14:35:31.070Z] include file start
09:35:31 [2020-11-10T14:35:31.070Z] Include file processed
09:35:31 [2020-11-10T14:35:31.070Z] line after include file
09:35:31 [2020-11-10T14:35:31.070Z] Result of testMethod = 5
09:35:31 [2020-11-10T14:35:31.326Z] End of script
09:35:31 [2020-11-10T14:35:31.326Z] Start of script
09:35:31 [2020-11-10T14:35:31.326Z] include file start
09:35:31 [2020-11-10T14:35:31.326Z] Include file processed
09:35:31 [2020-11-10T14:35:31.326Z] line after include file
09:35:31 [2020-11-10T14:35:31.889Z] Start of script
09:35:31 [2020-11-10T14:35:31.889Z] include file start
09:35:31 [2020-11-10T14:35:31.889Z] Include file processed
09:35:31 [2020-11-10T14:35:31.889Z] line after include file
09:35:31 [2020-11-10T14:35:31.889Z] Result of testMethod = 5
09:35:31 [2020-11-10T14:35:31.890Z] End of script
09:35:31 [2020-11-10T14:35:31.890Z] Start of script
09:35:31 [2020-11-10T14:35:31.890Z] include file start
09:35:31 [2020-11-10T14:35:31.890Z] Include file processed
09:35:31 [2020-11-10T14:35:31.890Z] line after include file
09:35:32 [2020-11-10T14:35:32.145Z] Result of testMethod = 5
09:35:32 [2020-11-10T14:35:32.145Z] End of script
09:35:32 [2020-11-10T14:35:32.401Z] Start of script
09:35:32 [2020-11-10T14:35:32.657Z] include file start
09:35:32 [2020-11-10T14:35:32.657Z] Include file processed
09:35:32 [2020-11-10T14:35:32.657Z] line after include file
09:35:32 [2020-11-10T14:35:32.657Z] Result of testMethod = 5
09:35:32 [2020-11-10T14:35:32.657Z] End of script
09:35:32 [2020-11-10T14:35:32.657Z] Start of script
09:35:32 [2020-11-10T14:35:32.657Z] include file start
09:35:32 [2020-11-10T14:35:32.657Z] Include file processed
09:35:32 [2020-11-10T14:35:32.657Z] line after include file
09:35:32 [2020-11-10T14:35:32.914Z] Result of testMethod = 5
09:35:32 [2020-11-10T14:35:32.914Z] End of script
09:35:32 [2020-11-10T14:35:32.914Z] Start of script
09:35:32 [2020-11-10T14:35:32.914Z] include file start
09:35:32 [2020-11-10T14:35:32.914Z] Include file processed
09:35:32 [2020-11-10T14:35:32.914Z] line after include file
09:35:32 [2020-11-10T14:35:32.914Z] Result of testMethod = 5
09:35:33 [2020-11-10T14:35:33.169Z] Start of script
09:35:33 [2020-11-10T14:35:33.169Z] include file start
09:35:33 [2020-11-10T14:35:33.169Z] Include file processed
09:35:33 [2020-11-10T14:35:33.169Z] line after include file
09:35:33 [2020-11-10T14:35:33.425Z] Result of testMethod = 5
09:35:33 [2020-11-10T14:35:33.425Z] End of script
09:35:33 [2020-11-10T14:35:33.681Z] Start of script
09:35:33 [2020-11-10T14:35:33.681Z] include file start
09:35:33 [2020-11-10T14:35:33.681Z] Include file processed
09:35:33 [2020-11-10T14:35:33.681Z] line after include file
09:35:33 [2020-11-10T14:35:33.681Z] Result of testMethod = 5
09:35:33 [2020-11-10T14:35:33.937Z] End of script
09:35:33 [2020-11-10T14:35:33.937Z] Start of script
09:35:33 [2020-11-10T14:35:33.937Z] include file start
09:35:33 [2020-11-10T14:35:33.937Z] Include file processed
09:35:33 [2020-11-10T14:35:33.937Z] line after include file
09:35:34 [2020-11-10T14:35:34.193Z] Result of testMethod = 5
09:35:34 [2020-11-10T14:35:34.193Z] End of script
09:35:34 [2020-11-10T14:35:34.448Z] Start of script
09:35:34 [2020-11-10T14:35:34.448Z] include file start
09:35:34 [2020-11-10T14:35:34.448Z] Include file processed
09:35:34 [2020-11-10T14:35:34.448Z] line after include file
09:35:34 [2020-11-10T14:35:34.704Z] Result of testMethod = 5
09:35:34 [2020-11-10T14:35:34.704Z] End of script
09:35:34 [2020-11-10T14:35:34.704Z] Start of script
09:35:34 [2020-11-10T14:35:34.704Z] include file start
09:35:34 [2020-11-10T14:35:34.704Z] Include file processed
09:35:34 [2020-11-10T14:35:34.704Z] line after include file
09:35:34 [2020-11-10T14:35:34.704Z] Result of testMethod = 5
09:35:35 [2020-11-10T14:35:35.265Z] Start of script
09:35:35 [2020-11-10T14:35:35.265Z] include file start
09:35:35 [2020-11-10T14:35:35.265Z] Include file processed
09:35:35 [2020-11-10T14:35:35.265Z] line after include file
09:35:35 [2020-11-10T14:35:35.265Z] Result of testMethod = 5
09:35:35 [2020-11-10T14:35:35.265Z] End of script
09:35:35 [2020-11-10T14:35:35.265Z] Start of script
09:35:35 [2020-11-10T14:35:35.265Z] include file start
09:35:35 [2020-11-10T14:35:35.265Z] Include file processed
09:35:35 [2020-11-10T14:35:35.265Z] line after include file
09:35:35 [2020-11-10T14:35:35.521Z] Result of testMethod = 5
09:35:35 [2020-11-10T14:35:35.521Z] End of script
09:35:35 [2020-11-10T14:35:35.521Z] Start of script
09:35:35 [2020-11-10T14:35:35.521Z] include file start
09:35:35 [2020-11-10T14:35:35.521Z] Include file processed
09:35:35 [2020-11-10T14:35:35.521Z] line after include file
09:35:35 [2020-11-10T14:35:35.521Z] Result of testMethod = 5
09:35:35 [2020-11-10T14:35:35.521Z] End of script
09:35:35 [2020-11-10T14:35:35.776Z] Start of script
09:35:35 [2020-11-10T14:35:35.777Z] include file start
09:35:35 [2020-11-10T14:35:35.777Z] Include file processed
09:35:36 [2020-11-10T14:35:36.032Z] line after include file
09:35:36 [2020-11-10T14:35:36.032Z] Result of testMethod = 5
09:35:36 [2020-11-10T14:35:36.032Z] End of script
09:35:36 [2020-11-10T14:35:36.032Z] Start of script
09:35:36 [2020-11-10T14:35:36.032Z] include file start
09:35:36 [2020-11-10T14:35:36.032Z] Include file processed
09:35:36 [2020-11-10T14:35:36.032Z] line after include file
09:35:36 [2020-11-10T14:35:36.288Z] Start of script
09:35:36 [2020-11-10T14:35:36.543Z] include file start
09:35:36 [2020-11-10T14:35:36.543Z] Include file processed
09:35:36 [2020-11-10T14:35:36.543Z] line after include file
09:35:36 [2020-11-10T14:35:36.543Z] Result of testMethod = 5
09:35:36 [2020-11-10T14:35:36.543Z] End of script
09:35:36 [2020-11-10T14:35:36.543Z] Start of script
09:35:36 [2020-11-10T14:35:36.543Z] include file start
09:35:36 [2020-11-10T14:35:36.544Z] Include file processed
09:35:36 [2020-11-10T14:35:36.544Z] line after include file
09:35:36 [2020-11-10T14:35:36.544Z] Result of testMethod = 5
09:35:37 [2020-11-10T14:35:37.104Z] Start of script
09:35:37 [2020-11-10T14:35:37.104Z] include file start
09:35:37 [2020-11-10T14:35:37.104Z] Include file processed
09:35:37 [2020-11-10T14:35:37.104Z] line after include file
09:35:37 [2020-11-10T14:35:37.104Z] Result of testMethod = 5
09:35:37 [2020-11-10T14:35:37.104Z] End of script
09:35:37 [2020-11-10T14:35:37.104Z] Start of script
09:35:37 [2020-11-10T14:35:37.104Z] include file start
09:35:37 [2020-11-10T14:35:37.104Z] Include file processed
09:35:37 [2020-11-10T14:35:37.105Z] line after include file
09:35:37 [2020-11-10T14:35:37.360Z] Result of testMethod = 5
09:35:37 [2020-11-10T14:35:37.360Z] End of script
09:35:37 [2020-11-10T14:35:37.360Z] Start of script
09:35:37 [2020-11-10T14:35:37.360Z] include file start
09:35:37 [2020-11-10T14:35:37.360Z] Include file processed
09:35:37 [2020-11-10T14:35:37.360Z] line after include file
09:35:37 [2020-11-10T14:35:37.616Z] Result of testMethod = 5
09:35:37 [2020-11-10T14:35:37.616Z] End of script
09:35:37 [2020-11-10T14:35:37.872Z] Start of script
09:35:37 [2020-11-10T14:35:37.872Z] include file start
09:35:37 [2020-11-10T14:35:37.872Z] Include file processed
09:35:37 [2020-11-10T14:35:37.872Z] line after include file
09:35:37 [2020-11-10T14:35:37.872Z] Result of testMethod = 5
09:35:37 [2020-11-10T14:35:37.872Z] End of script
09:35:37 [2020-11-10T14:35:37.872Z] Start of script
09:35:37 [2020-11-10T14:35:37.872Z] include file start
09:35:37 [2020-11-10T14:35:37.872Z] Include file processed
09:35:37 [2020-11-10T14:35:37.872Z] line after include file
09:35:37 [2020-11-10T14:35:37.872Z] Result of testMethod = 5
09:35:38 [2020-11-10T14:35:38.433Z] Start of script
09:35:38 [2020-11-10T14:35:38.433Z] include file start
09:35:38 [2020-11-10T14:35:38.433Z] Include file processed
09:35:38 [2020-11-10T14:35:38.433Z] line after include file
09:35:38 [2020-11-10T14:35:38.433Z] Result of testMethod = 5
09:35:38 [2020-11-10T14:35:38.433Z] End of script
09:35:38 [2020-11-10T14:35:38.433Z] Start of script
09:35:38 [2020-11-10T14:35:38.433Z] include file start
09:35:38 [2020-11-10T14:35:38.433Z] Include file processed
09:35:38 [2020-11-10T14:35:38.433Z] line after include file
09:35:38 [2020-11-10T14:35:38.433Z] Result of testMethod = 5
09:35:38 [2020-11-10T14:35:38.995Z] Start of script
09:35:38 [2020-11-10T14:35:38.995Z] include file start
09:35:38 [2020-11-10T14:35:38.995Z] Include file processed
09:35:38 [2020-11-10T14:35:38.995Z] line after include file
09:35:38 [2020-11-10T14:35:38.995Z] Result of testMethod = 5
09:35:38 [2020-11-10T14:35:38.995Z] End of script
09:35:39 [2020-11-10T14:35:39.251Z] Start of script
09:35:39 [2020-11-10T14:35:39.251Z] include file start
09:35:39 [2020-11-10T14:35:39.251Z] Include file processed
09:35:39 [2020-11-10T14:35:39.251Z] line after include file
09:35:39 [2020-11-10T14:35:39.506Z] Result of testMethod = 5
09:35:39 [2020-11-10T14:35:39.506Z] End of script
09:35:39 [2020-11-10T14:35:39.506Z] Start of script
09:35:39 [2020-11-10T14:35:39.506Z] include file start
09:35:39 [2020-11-10T14:35:39.506Z] Include file processed
09:35:39 [2020-11-10T14:35:39.506Z] line after include file
09:35:39 [2020-11-10T14:35:39.506Z] Result of testMethod = 5
09:35:39 [2020-11-10T14:35:39.506Z] End of script
09:35:39 [2020-11-10T14:35:39.762Z] Tests run: 42, Failures: 0, Errors: 0, Skipped: 0, Time elapsed: 10.932 s - in org.eclipse.ease.lang.javascript.rhino.RhinoDebugTest
09:35:39 [2020-11-10T14:35:39.762Z] disconnectProcessInSuspendedState(org.eclipse.ease.lang.javascript.rhino.RhinoDebugTest)  Time elapsed: 0.259 s
09:35:39 [2020-11-10T14:35:39.762Z] stepReturnIncludeCommand(org.eclipse.ease.lang.javascript.rhino.RhinoDebugTest)  Time elapsed: 0.212 s
09:35:39 [2020-11-10T14:35:39.762Z] arrayVariableSorting(org.eclipse.ease.lang.javascript.rhino.RhinoDebugTest)  Time elapsed: 0.309 s
09:35:39 [2020-11-10T14:35:39.762Z] stepOverOnDebugTarget(org.eclipse.ease.lang.javascript.rhino.RhinoDebugTest)  Time elapsed: 0.313 s
09:35:39 [2020-11-10T14:35:39.762Z] hasDebugTarget(org.eclipse.ease.lang.javascript.rhino.RhinoDebugTest)  Time elapsed: 0.105 s
09:35:39 [2020-11-10T14:35:39.762Z] disconnectThreadInSuspendedState(org.eclipse.ease.lang.javascript.rhino.RhinoDebugTest)  Time elapsed: 0.207 s
09:35:39 [2020-11-10T14:35:39.762Z] stepReturnOnDebugTarget(org.eclipse.ease.lang.javascript.rhino.RhinoDebugTest)  Time elapsed: 0.308 s
09:35:39 [2020-11-10T14:35:39.762Z] nullVariable(org.eclipse.ease.lang.javascript.rhino.RhinoDebugTest)  Time elapsed: 0.306 s
09:35:39 [2020-11-10T14:35:39.762Z] stepOverOnStackFrame(org.eclipse.ease.lang.javascript.rhino.RhinoDebugTest)  Time elapsed: 0.307 s
09:35:39 [2020-11-10T14:35:39.762Z] resumeOnDebugTarget(org.eclipse.ease.lang.javascript.rhino.RhinoDebugTest)  Time elapsed: 0.207 s
09:35:39 [2020-11-10T14:35:39.762Z] modifyVariableKeepingType(org.eclipse.ease.lang.javascript.rhino.RhinoDebugTest)  Time elapsed: 0.405 s
09:35:39 [2020-11-10T14:35:39.762Z] resumeOnLastIncludeLine(org.eclipse.ease.lang.javascript.rhino.RhinoDebugTest)  Time elapsed: 0.207 s
09:35:39 [2020-11-10T14:35:39.762Z] stepReturnOnStackFrame(org.eclipse.ease.lang.javascript.rhino.RhinoDebugTest)  Time elapsed: 0.307 s
09:35:39 [2020-11-10T14:35:39.762Z] terminateStackFrameInSuspendedState(org.eclipse.ease.lang.javascript.rhino.RhinoDebugTest)  Time elapsed: 0.206 s
09:35:39 [2020-11-10T14:35:39.762Z] breakpointLocation(org.eclipse.ease.lang.javascript.rhino.RhinoDebugTest)  Time elapsed: 0.206 s
09:35:39 [2020-11-10T14:35:39.762Z] stepReturnOnThread(org.eclipse.ease.lang.javascript.rhino.RhinoDebugTest)  Time elapsed: 0.307 s
09:35:39 [2020-11-10T14:35:39.762Z] javaClassVariable(org.eclipse.ease.lang.javascript.rhino.RhinoDebugTest)  Time elapsed: 0.307 s
09:35:39 [2020-11-10T14:35:39.762Z] stepIntoOnThread(org.eclipse.ease.lang.javascript.rhino.RhinoDebugTest)  Time elapsed: 0.306 s
09:35:39 [2020-11-10T14:35:39.762Z] terminateThreadInSuspendedState(org.eclipse.ease.lang.javascript.rhino.RhinoDebugTest)  Time elapsed: 0.205 s
09:35:39 [2020-11-10T14:35:39.762Z] resumeOnThread(org.eclipse.ease.lang.javascript.rhino.RhinoDebugTest)  Time elapsed: 0.206 s
09:35:39 [2020-11-10T14:35:39.762Z] stepIntoOnStackFrame(org.eclipse.ease.lang.javascript.rhino.RhinoDebugTest)  Time elapsed: 0.307 s
09:35:39 [2020-11-10T14:35:39.762Z] terminateProcessInSuspendedState(org.eclipse.ease.lang.javascript.rhino.RhinoDebugTest)  Time elapsed: 0.206 s
09:35:39 [2020-11-10T14:35:39.762Z] stepOverOnProcess(org.eclipse.ease.lang.javascript.rhino.RhinoDebugTest)  Time elapsed: 0.307 s
09:35:39 [2020-11-10T14:35:39.762Z] nativeArrayVariable(org.eclipse.ease.lang.javascript.rhino.RhinoDebugTest)  Time elapsed: 0.306 s
09:35:39 [2020-11-10T14:35:39.762Z] disconnectDebugTargetInSuspendedState(org.eclipse.ease.lang.javascript.rhino.RhinoDebugTest)  Time elapsed: 0.206 s
09:35:39 [2020-11-10T14:35:39.762Z] stepIntoOnProcess(org.eclipse.ease.lang.javascript.rhino.RhinoDebugTest)  Time elapsed: 0.306 s
09:35:39 [2020-11-10T14:35:39.762Z] terminatedState(org.eclipse.ease.lang.javascript.rhino.RhinoDebugTest)  Time elapsed: 0.104 s
09:35:39 [2020-11-10T14:35:39.762Z] stepOverIncludeCommand(org.eclipse.ease.lang.javascript.rhino.RhinoDebugTest)  Time elapsed: 0.305 s
09:35:39 [2020-11-10T14:35:39.762Z] innerScopeVariableBeforeOuterScopeVariable(org.eclipse.ease.lang.javascript.rhino.RhinoDebugTest)  Time elapsed: 0.306 s
09:35:39 [2020-11-10T14:35:39.762Z] stepIntoIncludeCommand(org.eclipse.ease.lang.javascript.rhino.RhinoDebugTest)  Time elapsed: 0.305 s
09:35:39 [2020-11-10T14:35:39.762Z] primitiveStringVariable(org.eclipse.ease.lang.javascript.rhino.RhinoDebugTest)  Time elapsed: 0.306 s
09:35:39 [2020-11-10T14:35:39.762Z] resumeOnProcess(org.eclipse.ease.lang.javascript.rhino.RhinoDebugTest)  Time elapsed: 0.205 s
09:35:39 [2020-11-10T14:35:39.762Z] stepIntoOnDebugTarget(org.eclipse.ease.lang.javascript.rhino.RhinoDebugTest)  Time elapsed: 0.307 s
09:35:39 [2020-11-10T14:35:39.762Z] stepOverOnThread(org.eclipse.ease.lang.javascript.rhino.RhinoDebugTest)  Time elapsed: 0.306 s
09:35:39 [2020-11-10T14:35:39.762Z] suspendedState(org.eclipse.ease.lang.javascript.rhino.RhinoDebugTest)  Time elapsed: 0.206 s
09:35:39 [2020-11-10T14:35:39.762Z] primitiveDoubleVariable(org.eclipse.ease.lang.javascript.rhino.RhinoDebugTest)  Time elapsed: 0.305 s
09:35:39 [2020-11-10T14:35:39.762Z] resumeOnStackFrame(org.eclipse.ease.lang.javascript.rhino.RhinoDebugTest)  Time elapsed: 0.206 s
09:35:39 [2020-11-10T14:35:39.762Z] nativeObjectVariable(org.eclipse.ease.lang.javascript.rhino.RhinoDebugTest)  Time elapsed: 0.305 s
09:35:39 [2020-11-10T14:35:39.762Z] terminateDebugTargetInSuspendedState(org.eclipse.ease.lang.javascript.rhino.RhinoDebugTest)  Time elapsed: 0.205 s
09:35:39 [2020-11-10T14:35:39.762Z] disconnectStackFrameInSuspendedState(org.eclipse.ease.lang.javascript.rhino.RhinoDebugTest)  Time elapsed: 0.205 s
09:35:39 [2020-11-10T14:35:39.762Z] stepReturnOnProcess(org.eclipse.ease.lang.javascript.rhino.RhinoDebugTest)  Time elapsed: 0.306 s
09:35:39 [2020-11-10T14:35:39.762Z] evaluateWatchExpression(org.eclipse.ease.lang.javascript.rhino.RhinoDebugTest)  Time elapsed: 0.207 s
09:35:39 [2020-11-10T14:35:39.762Z] 
09:35:39 [2020-11-10T14:35:39.762Z] Results:
09:35:39 [2020-11-10T14:35:39.762Z] 
09:35:39 [2020-11-10T14:35:39.762Z] Tests run: 70, Failures: 0, Errors: 0, Skipped: 0
09:35:39 [2020-11-10T14:35:39.762Z] 
09:35:40 [2020-11-10T14:35:40.018Z] [INFO] All tests passed!
09:35:40 [2020-11-10T14:35:40.018Z] [INFO] 
09:35:40 [2020-11-10T14:35:40.018Z] [INFO] -------< org.eclipse.ease:org.eclipse.ease.lang.javascript.test >-------
09:35:40 [2020-11-10T14:35:40.018Z] [INFO] Building org.eclipse.ease.lang.javascript.test 0.8.0-SNAPSHOT     [6/11]
09:35:40 [2020-11-10T14:35:40.018Z] [INFO] ------------------------[ eclipse-test-plugin ]-------------------------
09:35:40 [2020-11-10T14:35:40.018Z] [INFO] 
09:35:40 [2020-11-10T14:35:40.018Z] [INFO] --- tycho-packaging-plugin:1.5.0:build-qualifier (default-build-qualifier) @ org.eclipse.ease.lang.javascript.test ---
09:35:40 [2020-11-10T14:35:40.296Z] [INFO] The project's OSGi version is 0.8.0.I201910171213
09:35:40 [2020-11-10T14:35:40.296Z] [INFO] 
09:35:40 [2020-11-10T14:35:40.296Z] [INFO] --- tycho-packaging-plugin:1.5.0:validate-id (default-validate-id) @ org.eclipse.ease.lang.javascript.test ---
09:35:40 [2020-11-10T14:35:40.296Z] [INFO] 
09:35:40 [2020-11-10T14:35:40.296Z] [INFO] --- tycho-packaging-plugin:1.5.0:validate-version (default-validate-version) @ org.eclipse.ease.lang.javascript.test ---
09:35:40 [2020-11-10T14:35:40.296Z] [INFO] 
09:35:40 [2020-11-10T14:35:40.296Z] [INFO] --- maven-resources-plugin:2.4.3:resources (default-resources) @ org.eclipse.ease.lang.javascript.test ---
09:35:40 [2020-11-10T14:35:40.296Z] [INFO] Using 'UTF-8' encoding to copy filtered resources.
09:35:40 [2020-11-10T14:35:40.296Z] [INFO] skip non existing resourceDirectory /home/jenkins/agent/workspace/ease.verify.core.target.2019-06/tests/org.eclipse.ease.lang.javascript.test/src/main/resources
09:35:40 [2020-11-10T14:35:40.296Z] [INFO] 
09:35:40 [2020-11-10T14:35:40.296Z] [INFO] --- tycho-compiler-plugin:1.5.0:compile (default-compile) @ org.eclipse.ease.lang.javascript.test ---
09:35:40 [2020-11-10T14:35:40.296Z] [INFO] Nothing to compile - all classes are up to date
09:35:40 [2020-11-10T14:35:40.296Z] [INFO] 
09:35:40 [2020-11-10T14:35:40.296Z] [INFO] --- maven-resources-plugin:2.4.3:testResources (default-testResources) @ org.eclipse.ease.lang.javascript.test ---
09:35:40 [2020-11-10T14:35:40.296Z] [INFO] Using 'UTF-8' encoding to copy filtered resources.
09:35:40 [2020-11-10T14:35:40.296Z] [INFO] skip non existing resourceDirectory /home/jenkins/agent/workspace/ease.verify.core.target.2019-06/tests/org.eclipse.ease.lang.javascript.test/src/test/resources
09:35:40 [2020-11-10T14:35:40.296Z] [INFO] 
09:35:40 [2020-11-10T14:35:40.296Z] [INFO] --- tycho-source-plugin:1.5.0:plugin-source (plugin-source) @ org.eclipse.ease.lang.javascript.test ---
09:35:40 [2020-11-10T14:35:40.296Z] [WARNING] Bundle-Vendor header not found in /home/jenkins/agent/workspace/ease.verify.core.target.2019-06/tests/org.eclipse.ease.lang.javascript.test/META-INF/MANIFEST.MF, fallback to 'unknown' for source bundle
09:35:40 [2020-11-10T14:35:40.296Z] [INFO] Building jar: /home/jenkins/agent/workspace/ease.verify.core.target.2019-06/tests/org.eclipse.ease.lang.javascript.test/target/org.eclipse.ease.lang.javascript.test-0.8.0-SNAPSHOT-sources.jar
09:35:40 [2020-11-10T14:35:40.296Z] [INFO] 
09:35:40 [2020-11-10T14:35:40.297Z] [INFO] --- target-platform-configuration:1.5.0:target-platform (default-target-platform) @ org.eclipse.ease.lang.javascript.test ---
09:35:40 [2020-11-10T14:35:40.297Z] [INFO] 
09:35:40 [2020-11-10T14:35:40.297Z] [INFO] --- tycho-packaging-plugin:1.5.0:package-plugin (default-package-plugin) @ org.eclipse.ease.lang.javascript.test ---
09:35:40 [2020-11-10T14:35:40.297Z] [INFO] Building jar: /home/jenkins/agent/workspace/ease.verify.core.target.2019-06/tests/org.eclipse.ease.lang.javascript.test/target/org.eclipse.ease.lang.javascript.test-0.8.0-SNAPSHOT.jar
09:35:40 [2020-11-10T14:35:40.297Z] [INFO] 
09:35:40 [2020-11-10T14:35:40.297Z] [INFO] --- tycho-p2-plugin:1.5.0:p2-metadata-default (default-p2-metadata-default) @ org.eclipse.ease.lang.javascript.test ---
09:35:40 [2020-11-10T14:35:40.297Z] [INFO] 
09:35:40 [2020-11-10T14:35:40.297Z] [INFO] --- tycho-source-feature-plugin:1.5.0:source-feature (source-feature) @ org.eclipse.ease.lang.javascript.test ---
09:35:40 [2020-11-10T14:35:40.297Z] [INFO] 
09:35:40 [2020-11-10T14:35:40.297Z] [INFO] --- tycho-p2-plugin:1.5.0:p2-metadata (attached-p2-metadata) @ org.eclipse.ease.lang.javascript.test ---
09:35:40 [2020-11-10T14:35:40.297Z] [INFO] 
09:35:40 [2020-11-10T14:35:40.297Z] [INFO] --- tycho-surefire-plugin:1.5.0:test (default-test) @ org.eclipse.ease.lang.javascript.test ---
09:35:40 [2020-11-10T14:35:40.297Z] [INFO] Expected eclipse log file: /home/jenkins/agent/workspace/ease.verify.core.target.2019-06/tests/org.eclipse.ease.lang.javascript.test/target/work/data/.metadata/.log
09:35:40 [2020-11-10T14:35:40.297Z] [INFO] Command line:
09:35:40 [2020-11-10T14:35:40.297Z] 	[/opt/tools/java/openjdk/jdk-11/11.0.2+9/bin/java, -Dosgi.noShutdown=false, -Dosgi.os=linux, -Dosgi.ws=gtk, -Dosgi.arch=x86_64, -Dosgi.clean=true, -jar, /home/jenkins/.m2/repository/p2/osgi/bundle/org.eclipse.equinox.launcher/1.5.400.v20190515-0925/org.eclipse.equinox.launcher-1.5.400.v20190515-0925.jar, -data, /home/jenkins/agent/workspace/ease.verify.core.target.2019-06/tests/org.eclipse.ease.lang.javascript.test/target/work/data, -install, /home/jenkins/agent/workspace/ease.verify.core.target.2019-06/tests/org.eclipse.ease.lang.javascript.test/target/work, -configuration, /home/jenkins/agent/workspace/ease.verify.core.target.2019-06/tests/org.eclipse.ease.lang.javascript.test/target/work/configuration, -application, org.eclipse.tycho.surefire.osgibooter.headlesstest, -testproperties, /home/jenkins/agent/workspace/ease.verify.core.target.2019-06/tests/org.eclipse.ease.lang.javascript.test/target/surefire.properties]
09:35:40 [2020-11-10T14:35:40.297Z] Picked up JAVA_TOOL_OPTIONS: -Dmaven.ext.class.path="/home/jenkins/agent/workspace/ease.verify.core.target.2019-06@tmp/withMaven7f2c0cca/pipeline-maven-spy.jar" -Dorg.jenkinsci.plugins.pipeline.maven.reportsFolder="/home/jenkins/agent/workspace/ease.verify.core.target.2019-06@tmp/withMaven7f2c0cca" 
09:35:42 [2020-11-10T14:35:42.185Z] Running org.eclipse.ease.lang.javascript.JavaScriptCompletionContextTest
09:35:42 [2020-11-10T14:35:42.185Z] Tests run: 8, Failures: 0, Errors: 0, Skipped: 0, Time elapsed: 0.223 s - in org.eclipse.ease.lang.javascript.JavaScriptCompletionContextTest
09:35:42 [2020-11-10T14:35:42.185Z] verifyStaticClassTypes(org.eclipse.ease.lang.javascript.JavaScriptCompletionContextTest)  Time elapsed: 0.005 s
09:35:42 [2020-11-10T14:35:42.185Z] verifyClassInstanceTypes(org.eclipse.ease.lang.javascript.JavaScriptCompletionContextTest)  Time elapsed: 0.007 s
09:35:42 [2020-11-10T14:35:42.185Z] verifyTypesForScriptEngine(org.eclipse.ease.lang.javascript.JavaScriptCompletionContextTest)  Time elapsed: 0.117 s
09:35:42 [2020-11-10T14:35:42.185Z] verifyPackageTypes(org.eclipse.ease.lang.javascript.JavaScriptCompletionContextTest)  Time elapsed: 0.001 s
09:35:42 [2020-11-10T14:35:42.185Z] definedVariableTypes(org.eclipse.ease.lang.javascript.JavaScriptCompletionContextTest)  Time elapsed: 0 s
09:35:42 [2020-11-10T14:35:42.185Z] verifyStringLiteralTypes(org.eclipse.ease.lang.javascript.JavaScriptCompletionContextTest)  Time elapsed: 0.001 s
09:35:42 [2020-11-10T14:35:42.186Z] verifyUnknownTypes(org.eclipse.ease.lang.javascript.JavaScriptCompletionContextTest)  Time elapsed: 0 s
09:35:42 [2020-11-10T14:35:42.186Z] verifyNoneTypes(org.eclipse.ease.lang.javascript.JavaScriptCompletionContextTest)  Time elapsed: 0 s
09:35:42 [2020-11-10T14:35:42.186Z] Running org.eclipse.ease.lang.javascript.JavaScriptCodeFactoryTest
09:35:42 [2020-11-10T14:35:42.186Z] Tests run: 1, Failures: 0, Errors: 0, Skipped: 0, Time elapsed: 0.002 s - in org.eclipse.ease.lang.javascript.JavaScriptCodeFactoryTest
09:35:42 [2020-11-10T14:35:42.186Z] testCommentCreator(org.eclipse.ease.lang.javascript.JavaScriptCodeFactoryTest)  Time elapsed: 0.001 s
09:35:42 [2020-11-10T14:35:42.186Z] 
09:35:42 [2020-11-10T14:35:42.186Z] Results:
09:35:42 [2020-11-10T14:35:42.186Z] 
09:35:42 [2020-11-10T14:35:42.186Z] Tests run: 9, Failures: 0, Errors: 0, Skipped: 0
09:35:42 [2020-11-10T14:35:42.186Z] 
09:35:42 [2020-11-10T14:35:42.748Z] [INFO] All tests passed!
09:35:42 [2020-11-10T14:35:42.748Z] [INFO] 
09:35:42 [2020-11-10T14:35:42.748Z] [INFO] ---------< org.eclipse.ease:org.eclipse.ease.lang.python.test >---------
09:35:42 [2020-11-10T14:35:42.748Z] [INFO] Building org.eclipse.ease.lang.python.test 0.8.0-SNAPSHOT         [7/11]
09:35:42 [2020-11-10T14:35:42.748Z] [INFO] ------------------------[ eclipse-test-plugin ]-------------------------
09:35:42 [2020-11-10T14:35:42.748Z] [INFO] 
09:35:42 [2020-11-10T14:35:42.748Z] [INFO] --- tycho-packaging-plugin:1.5.0:build-qualifier (default-build-qualifier) @ org.eclipse.ease.lang.python.test ---
09:35:42 [2020-11-10T14:35:42.748Z] [INFO] The project's OSGi version is 0.8.0.I201910171213
09:35:42 [2020-11-10T14:35:42.748Z] [INFO] 
09:35:42 [2020-11-10T14:35:42.748Z] [INFO] --- tycho-packaging-plugin:1.5.0:validate-id (default-validate-id) @ org.eclipse.ease.lang.python.test ---
09:35:42 [2020-11-10T14:35:42.748Z] [INFO] 
09:35:42 [2020-11-10T14:35:42.748Z] [INFO] --- tycho-packaging-plugin:1.5.0:validate-version (default-validate-version) @ org.eclipse.ease.lang.python.test ---
09:35:42 [2020-11-10T14:35:42.748Z] [INFO] 
09:35:42 [2020-11-10T14:35:42.748Z] [INFO] --- maven-resources-plugin:2.4.3:resources (default-resources) @ org.eclipse.ease.lang.python.test ---
09:35:42 [2020-11-10T14:35:42.748Z] [INFO] Using 'UTF-8' encoding to copy filtered resources.
09:35:42 [2020-11-10T14:35:42.748Z] [INFO] skip non existing resourceDirectory /home/jenkins/agent/workspace/ease.verify.core.target.2019-06/tests/org.eclipse.ease.lang.python.test/src/main/resources
09:35:42 [2020-11-10T14:35:42.748Z] [INFO] 
09:35:42 [2020-11-10T14:35:42.748Z] [INFO] --- tycho-compiler-plugin:1.5.0:compile (default-compile) @ org.eclipse.ease.lang.python.test ---
09:35:42 [2020-11-10T14:35:42.748Z] [INFO] Nothing to compile - all classes are up to date
09:35:42 [2020-11-10T14:35:42.748Z] [INFO] 
09:35:42 [2020-11-10T14:35:42.748Z] [INFO] --- maven-resources-plugin:2.4.3:testResources (default-testResources) @ org.eclipse.ease.lang.python.test ---
09:35:42 [2020-11-10T14:35:42.748Z] [INFO] Using 'UTF-8' encoding to copy filtered resources.
09:35:42 [2020-11-10T14:35:42.748Z] [INFO] skip non existing resourceDirectory /home/jenkins/agent/workspace/ease.verify.core.target.2019-06/tests/org.eclipse.ease.lang.python.test/src/test/resources
09:35:42 [2020-11-10T14:35:42.748Z] [INFO] 
09:35:42 [2020-11-10T14:35:42.749Z] [INFO] --- tycho-source-plugin:1.5.0:plugin-source (plugin-source) @ org.eclipse.ease.lang.python.test ---
09:35:42 [2020-11-10T14:35:42.749Z] [WARNING] Bundle-Vendor header not found in /home/jenkins/agent/workspace/ease.verify.core.target.2019-06/tests/org.eclipse.ease.lang.python.test/META-INF/MANIFEST.MF, fallback to 'unknown' for source bundle
09:35:42 [2020-11-10T14:35:42.749Z] [INFO] Building jar: /home/jenkins/agent/workspace/ease.verify.core.target.2019-06/tests/org.eclipse.ease.lang.python.test/target/org.eclipse.ease.lang.python.test-0.8.0-SNAPSHOT-sources.jar
09:35:42 [2020-11-10T14:35:42.749Z] [INFO] 
09:35:42 [2020-11-10T14:35:42.749Z] [INFO] --- target-platform-configuration:1.5.0:target-platform (default-target-platform) @ org.eclipse.ease.lang.python.test ---
09:35:42 [2020-11-10T14:35:42.749Z] [INFO] 
09:35:42 [2020-11-10T14:35:42.749Z] [INFO] --- tycho-packaging-plugin:1.5.0:package-plugin (default-package-plugin) @ org.eclipse.ease.lang.python.test ---
09:35:42 [2020-11-10T14:35:42.749Z] [INFO] Building jar: /home/jenkins/agent/workspace/ease.verify.core.target.2019-06/tests/org.eclipse.ease.lang.python.test/target/org.eclipse.ease.lang.python.test-0.8.0-SNAPSHOT.jar
09:35:42 [2020-11-10T14:35:42.749Z] [INFO] 
09:35:42 [2020-11-10T14:35:42.749Z] [INFO] --- tycho-p2-plugin:1.5.0:p2-metadata-default (default-p2-metadata-default) @ org.eclipse.ease.lang.python.test ---
09:35:42 [2020-11-10T14:35:42.749Z] [INFO] 
09:35:42 [2020-11-10T14:35:42.749Z] [INFO] --- tycho-source-feature-plugin:1.5.0:source-feature (source-feature) @ org.eclipse.ease.lang.python.test ---
09:35:42 [2020-11-10T14:35:42.749Z] [INFO] 
09:35:42 [2020-11-10T14:35:42.749Z] [INFO] --- tycho-p2-plugin:1.5.0:p2-metadata (attached-p2-metadata) @ org.eclipse.ease.lang.python.test ---
09:35:42 [2020-11-10T14:35:42.749Z] [INFO] 
09:35:42 [2020-11-10T14:35:42.749Z] [INFO] --- tycho-surefire-plugin:1.5.0:test (default-test) @ org.eclipse.ease.lang.python.test ---
09:35:42 [2020-11-10T14:35:42.749Z] [INFO] Expected eclipse log file: /home/jenkins/agent/workspace/ease.verify.core.target.2019-06/tests/org.eclipse.ease.lang.python.test/target/work/data/.metadata/.log
09:35:42 [2020-11-10T14:35:42.749Z] [INFO] Command line:
09:35:42 [2020-11-10T14:35:42.749Z] 	[/opt/tools/java/openjdk/jdk-11/11.0.2+9/bin/java, -Dosgi.noShutdown=false, -Dosgi.os=linux, -Dosgi.ws=gtk, -Dosgi.arch=x86_64, -Dosgi.clean=true, -jar, /home/jenkins/.m2/repository/p2/osgi/bundle/org.eclipse.equinox.launcher/1.5.400.v20190515-0925/org.eclipse.equinox.launcher-1.5.400.v20190515-0925.jar, -data, /home/jenkins/agent/workspace/ease.verify.core.target.2019-06/tests/org.eclipse.ease.lang.python.test/target/work/data, -install, /home/jenkins/agent/workspace/ease.verify.core.target.2019-06/tests/org.eclipse.ease.lang.python.test/target/work, -configuration, /home/jenkins/agent/workspace/ease.verify.core.target.2019-06/tests/org.eclipse.ease.lang.python.test/target/work/configuration, -application, org.eclipse.tycho.surefire.osgibooter.headlesstest, -testproperties, /home/jenkins/agent/workspace/ease.verify.core.target.2019-06/tests/org.eclipse.ease.lang.python.test/target/surefire.properties]
09:35:42 [2020-11-10T14:35:42.749Z] Picked up JAVA_TOOL_OPTIONS: -Dmaven.ext.class.path="/home/jenkins/agent/workspace/ease.verify.core.target.2019-06@tmp/withMaven7f2c0cca/pipeline-maven-spy.jar" -Dorg.jenkinsci.plugins.pipeline.maven.reportsFolder="/home/jenkins/agent/workspace/ease.verify.core.target.2019-06@tmp/withMaven7f2c0cca" 
09:35:44 [2020-11-10T14:35:44.648Z] Running org.eclipse.ease.lang.python.PythonCodeFactoryTest
09:35:44 [2020-11-10T14:35:44.648Z] Tests run: 1, Failures: 0, Errors: 0, Skipped: 0, Time elapsed: 0.064 s - in org.eclipse.ease.lang.python.PythonCodeFactoryTest
09:35:44 [2020-11-10T14:35:44.648Z] testCommentCreator(org.eclipse.ease.lang.python.PythonCodeFactoryTest)  Time elapsed: 0.003 s
09:35:44 [2020-11-10T14:35:44.648Z] 
09:35:44 [2020-11-10T14:35:44.648Z] Results:
09:35:44 [2020-11-10T14:35:44.648Z] 
09:35:44 [2020-11-10T14:35:44.648Z] Tests run: 1, Failures: 0, Errors: 0, Skipped: 0
09:35:44 [2020-11-10T14:35:44.648Z] 
09:35:44 [2020-11-10T14:35:44.912Z] [INFO] All tests passed!
09:35:44 [2020-11-10T14:35:44.912Z] [INFO] 
09:35:44 [2020-11-10T14:35:44.912Z] [INFO] -----< org.eclipse.ease:org.eclipse.ease.lang.python.jython.test >------
09:35:44 [2020-11-10T14:35:44.912Z] [INFO] Building org.eclipse.ease.lang.python.jython.test 0.8.0-SNAPSHOT  [8/11]
09:35:44 [2020-11-10T14:35:44.912Z] [INFO] ------------------------[ eclipse-test-plugin ]-------------------------
09:35:44 [2020-11-10T14:35:44.912Z] [INFO] 
09:35:44 [2020-11-10T14:35:44.912Z] [INFO] --- tycho-packaging-plugin:1.5.0:build-qualifier (default-build-qualifier) @ org.eclipse.ease.lang.python.jython.test ---
09:35:44 [2020-11-10T14:35:44.912Z] [INFO] The project's OSGi version is 0.8.0.I201911291239
09:35:44 [2020-11-10T14:35:44.912Z] [INFO] 
09:35:44 [2020-11-10T14:35:44.912Z] [INFO] --- tycho-packaging-plugin:1.5.0:validate-id (default-validate-id) @ org.eclipse.ease.lang.python.jython.test ---
09:35:44 [2020-11-10T14:35:44.912Z] [INFO] 
09:35:44 [2020-11-10T14:35:44.912Z] [INFO] --- tycho-packaging-plugin:1.5.0:validate-version (default-validate-version) @ org.eclipse.ease.lang.python.jython.test ---
09:35:44 [2020-11-10T14:35:44.912Z] [INFO] 
09:35:44 [2020-11-10T14:35:44.912Z] [INFO] --- maven-resources-plugin:2.4.3:resources (default-resources) @ org.eclipse.ease.lang.python.jython.test ---
09:35:44 [2020-11-10T14:35:44.912Z] [INFO] Using 'UTF-8' encoding to copy filtered resources.
09:35:44 [2020-11-10T14:35:44.912Z] [INFO] skip non existing resourceDirectory /home/jenkins/agent/workspace/ease.verify.core.target.2019-06/tests/org.eclipse.ease.lang.python.jython.test/src/main/resources
09:35:44 [2020-11-10T14:35:44.912Z] [INFO] 
09:35:44 [2020-11-10T14:35:44.912Z] [INFO] --- tycho-compiler-plugin:1.5.0:compile (default-compile) @ org.eclipse.ease.lang.python.jython.test ---
09:35:44 [2020-11-10T14:35:44.912Z] [INFO] Nothing to compile - all classes are up to date
09:35:44 [2020-11-10T14:35:44.912Z] [INFO] 
09:35:44 [2020-11-10T14:35:44.912Z] [INFO] --- maven-resources-plugin:2.4.3:testResources (default-testResources) @ org.eclipse.ease.lang.python.jython.test ---
09:35:44 [2020-11-10T14:35:44.912Z] [INFO] Using 'UTF-8' encoding to copy filtered resources.
09:35:44 [2020-11-10T14:35:44.912Z] [INFO] skip non existing resourceDirectory /home/jenkins/agent/workspace/ease.verify.core.target.2019-06/tests/org.eclipse.ease.lang.python.jython.test/src/test/resources
09:35:44 [2020-11-10T14:35:44.912Z] [INFO] 
09:35:44 [2020-11-10T14:35:44.912Z] [INFO] --- tycho-source-plugin:1.5.0:plugin-source (plugin-source) @ org.eclipse.ease.lang.python.jython.test ---
09:35:44 [2020-11-10T14:35:44.912Z] [WARNING] Bundle-Vendor header not found in /home/jenkins/agent/workspace/ease.verify.core.target.2019-06/tests/org.eclipse.ease.lang.python.jython.test/META-INF/MANIFEST.MF, fallback to 'unknown' for source bundle
09:35:44 [2020-11-10T14:35:44.912Z] [INFO] Building jar: /home/jenkins/agent/workspace/ease.verify.core.target.2019-06/tests/org.eclipse.ease.lang.python.jython.test/target/org.eclipse.ease.lang.python.jython.test-0.8.0-SNAPSHOT-sources.jar
09:35:44 [2020-11-10T14:35:44.912Z] [INFO] 
09:35:44 [2020-11-10T14:35:44.912Z] [INFO] --- target-platform-configuration:1.5.0:target-platform (default-target-platform) @ org.eclipse.ease.lang.python.jython.test ---
09:35:44 [2020-11-10T14:35:44.912Z] [INFO] 
09:35:44 [2020-11-10T14:35:44.912Z] [INFO] --- tycho-packaging-plugin:1.5.0:package-plugin (default-package-plugin) @ org.eclipse.ease.lang.python.jython.test ---
09:35:44 [2020-11-10T14:35:44.912Z] [INFO] Building jar: /home/jenkins/agent/workspace/ease.verify.core.target.2019-06/tests/org.eclipse.ease.lang.python.jython.test/target/org.eclipse.ease.lang.python.jython.test-0.8.0-SNAPSHOT.jar
09:35:44 [2020-11-10T14:35:44.912Z] [INFO] 
09:35:44 [2020-11-10T14:35:44.912Z] [INFO] --- tycho-p2-plugin:1.5.0:p2-metadata-default (default-p2-metadata-default) @ org.eclipse.ease.lang.python.jython.test ---
09:35:44 [2020-11-10T14:35:44.912Z] [INFO] 
09:35:44 [2020-11-10T14:35:44.912Z] [INFO] --- tycho-source-feature-plugin:1.5.0:source-feature (source-feature) @ org.eclipse.ease.lang.python.jython.test ---
09:35:44 [2020-11-10T14:35:44.913Z] [INFO] 
09:35:44 [2020-11-10T14:35:44.913Z] [INFO] --- tycho-p2-plugin:1.5.0:p2-metadata (attached-p2-metadata) @ org.eclipse.ease.lang.python.jython.test ---
09:35:44 [2020-11-10T14:35:44.913Z] [INFO] 
09:35:44 [2020-11-10T14:35:44.913Z] [INFO] --- tycho-surefire-plugin:1.5.0:test (default-test) @ org.eclipse.ease.lang.python.jython.test ---
09:35:45 [2020-11-10T14:35:45.476Z] [INFO] Expected eclipse log file: /home/jenkins/agent/workspace/ease.verify.core.target.2019-06/tests/org.eclipse.ease.lang.python.jython.test/target/work/data/.metadata/.log
09:35:45 [2020-11-10T14:35:45.476Z] [INFO] Command line:
09:35:45 [2020-11-10T14:35:45.476Z] 	[/opt/tools/java/openjdk/jdk-11/11.0.2+9/bin/java, -Dosgi.noShutdown=false, -Dosgi.os=linux, -Dosgi.ws=gtk, -Dosgi.arch=x86_64, -Dosgi.clean=true, -jar, /home/jenkins/.m2/repository/p2/osgi/bundle/org.eclipse.equinox.launcher/1.5.400.v20190515-0925/org.eclipse.equinox.launcher-1.5.400.v20190515-0925.jar, -data, /home/jenkins/agent/workspace/ease.verify.core.target.2019-06/tests/org.eclipse.ease.lang.python.jython.test/target/work/data, -install, /home/jenkins/agent/workspace/ease.verify.core.target.2019-06/tests/org.eclipse.ease.lang.python.jython.test/target/work, -configuration, /home/jenkins/agent/workspace/ease.verify.core.target.2019-06/tests/org.eclipse.ease.lang.python.jython.test/target/work/configuration, -application, org.eclipse.tycho.surefire.osgibooter.headlesstest, -testproperties, /home/jenkins/agent/workspace/ease.verify.core.target.2019-06/tests/org.eclipse.ease.lang.python.jython.test/target/surefire.properties]
09:35:45 [2020-11-10T14:35:45.476Z] Picked up JAVA_TOOL_OPTIONS: -Dmaven.ext.class.path="/home/jenkins/agent/workspace/ease.verify.core.target.2019-06@tmp/withMaven7f2c0cca/pipeline-maven-spy.jar" -Dorg.jenkinsci.plugins.pipeline.maven.reportsFolder="/home/jenkins/agent/workspace/ease.verify.core.target.2019-06@tmp/withMaven7f2c0cca" 
09:35:47 [2020-11-10T14:35:47.364Z] WARNING: An illegal reflective access operation has occurred
09:35:47 [2020-11-10T14:35:47.364Z] WARNING: Illegal reflective access by org.python.core.PySystemState (file:/home/jenkins/agent/workspace/ease.verify.core.target.2019-06/tests/org.eclipse.ease.lang.python.jython.test/target/work/plugins/org.jython_2.7.0.I201609090924/jython.jar) to method java.io.Console.encoding()
09:35:47 [2020-11-10T14:35:47.364Z] WARNING: Please consider reporting this to the maintainers of org.python.core.PySystemState
09:35:47 [2020-11-10T14:35:47.364Z] WARNING: Use --illegal-access=warn to enable warnings of further illegal reflective access operations
09:35:47 [2020-11-10T14:35:47.364Z] WARNING: All illegal access operations will be denied in a future release
09:35:47 [2020-11-10T14:35:47.364Z] Running org.eclipse.ease.lang.python.jython.debugger.JythonDebugTest
09:35:48 [2020-11-10T14:35:48.738Z] Start of script
09:35:48 [2020-11-10T14:35:48.738Z] include file start
09:35:48 [2020-11-10T14:35:48.738Z] include file processed
09:35:48 [2020-11-10T14:35:48.738Z] Result of testMethod = 5
09:35:48 [2020-11-10T14:35:48.738Z] End of script
09:35:48 [2020-11-10T14:35:48.738Z] Start of script
09:35:48 [2020-11-10T14:35:48.738Z] include file start
09:35:48 [2020-11-10T14:35:48.738Z] include file processed
09:35:48 [2020-11-10T14:35:48.738Z] Result of testMethod = 5
09:35:48 [2020-11-10T14:35:48.738Z] End of script
09:35:48 [2020-11-10T14:35:48.993Z] Start of script
09:35:48 [2020-11-10T14:35:48.993Z] include file start
09:35:48 [2020-11-10T14:35:48.993Z] include file processed
09:35:48 [2020-11-10T14:35:48.993Z] Result of testMethod = 5
09:35:49 [2020-11-10T14:35:49.249Z] Traceback (most recent call last):
09:35:49 [2020-11-10T14:35:49.249Z]   File "(none)", line 184, in run
09:35:49 [2020-11-10T14:35:49.249Z]   File "__ref_L/Debug Test/Main.py_fwlihyyebw", line 23, in <module>
09:35:49 [2020-11-10T14:35:49.249Z]   File "(none)", line 161, in trace_dispatch
09:35:49 [2020-11-10T14:35:49.249Z] org.eclipse.ease.ExitException: 
09:35:49 [2020-11-10T14:35:49.249Z] 
09:35:49 [2020-11-10T14:35:49.249Z] org.eclipse.ease.ExitException: org.eclipse.ease.ExitException: 
09:35:49 [2020-11-10T14:35:49.249Z] Start of script
09:35:49 [2020-11-10T14:35:49.249Z] include file start
09:35:49 [2020-11-10T14:35:49.249Z] include file processed
09:35:49 [2020-11-10T14:35:49.504Z] Result of testMethod = 5
09:35:49 [2020-11-10T14:35:49.504Z] End of script
09:35:49 [2020-11-10T14:35:49.760Z] Start of script
09:35:49 [2020-11-10T14:35:49.760Z] include file start
09:35:49 [2020-11-10T14:35:49.760Z] include file processed
09:35:49 [2020-11-10T14:35:49.760Z] Result of testMethod = 5
09:35:49 [2020-11-10T14:35:49.760Z] End of script
09:35:50 [2020-11-10T14:35:50.016Z] Start of script
09:35:50 [2020-11-10T14:35:50.016Z] include file start
09:35:50 [2020-11-10T14:35:50.016Z] include file processed
09:35:50 [2020-11-10T14:35:50.016Z] Result of testMethod = 5
09:35:50 [2020-11-10T14:35:50.016Z] End of script
09:35:50 [2020-11-10T14:35:50.271Z] Start of script
09:35:50 [2020-11-10T14:35:50.271Z] include file start
09:35:50 [2020-11-10T14:35:50.271Z] include file processed
09:35:50 [2020-11-10T14:35:50.271Z] Result of testMethod = 5
09:35:50 [2020-11-10T14:35:50.271Z] Traceback (most recent call last):
09:35:50 [2020-11-10T14:35:50.271Z]   File "(none)", line 184, in run
09:35:50 [2020-11-10T14:35:50.271Z]   File "__ref_L/Debug Test/Main.py_fhsqpcjlsh", line 23, in <module>
09:35:50 [2020-11-10T14:35:50.271Z]   File "(none)", line 161, in trace_dispatch
09:35:50 [2020-11-10T14:35:50.271Z] org.eclipse.ease.ExitException: 
09:35:50 [2020-11-10T14:35:50.271Z] 
09:35:50 [2020-11-10T14:35:50.271Z] org.eclipse.ease.ExitException: org.eclipse.ease.ExitException: 
09:35:50 [2020-11-10T14:35:50.526Z] Start of script
09:35:50 [2020-11-10T14:35:50.526Z] include file start
09:35:50 [2020-11-10T14:35:50.526Z] include file processed
09:35:50 [2020-11-10T14:35:50.782Z] Result of testMethod = 5
09:35:50 [2020-11-10T14:35:50.782Z] End of script
09:35:50 [2020-11-10T14:35:50.782Z] Start of script
09:35:50 [2020-11-10T14:35:50.782Z] include file start
09:35:50 [2020-11-10T14:35:50.782Z] include file processed
09:35:50 [2020-11-10T14:35:50.782Z] Result of testMethod = 5
09:35:50 [2020-11-10T14:35:50.782Z] End of script
09:35:51 [2020-11-10T14:35:51.038Z] Start of script
09:35:51 [2020-11-10T14:35:51.038Z] include file start
09:35:51 [2020-11-10T14:35:51.038Z] include file processed
09:35:51 [2020-11-10T14:35:51.293Z] Traceback (most recent call last):
09:35:51 [2020-11-10T14:35:51.293Z]   File "(none)", line 184, in run
09:35:51 [2020-11-10T14:35:51.293Z]   File "__ref_L/Debug Test/Main.py_rvkamuxamw", line 22, in <module>
09:35:51 [2020-11-10T14:35:51.293Z]   File "(none)", line 161, in trace_dispatch
09:35:51 [2020-11-10T14:35:51.293Z] org.eclipse.ease.ExitException: 
09:35:51 [2020-11-10T14:35:51.293Z] 
09:35:51 [2020-11-10T14:35:51.293Z] org.eclipse.ease.ExitException: org.eclipse.ease.ExitException: 
09:35:51 [2020-11-10T14:35:51.548Z] Start of script
09:35:51 [2020-11-10T14:35:51.548Z] include file start
09:35:51 [2020-11-10T14:35:51.548Z] include file processed
09:35:51 [2020-11-10T14:35:51.548Z] Result of testMethod = 5
09:35:51 [2020-11-10T14:35:51.548Z] End of script
09:35:51 [2020-11-10T14:35:51.804Z] Start of script
09:35:51 [2020-11-10T14:35:51.804Z] include file start
09:35:51 [2020-11-10T14:35:51.804Z] include file processed
09:35:51 [2020-11-10T14:35:51.804Z] Result of testMethod = 5
09:35:51 [2020-11-10T14:35:51.804Z] End of script
09:35:52 [2020-11-10T14:35:52.060Z] Traceback (most recent call last):
09:35:52 [2020-11-10T14:35:52.060Z]   File "(none)", line 184, in run
09:35:52 [2020-11-10T14:35:52.060Z]   File "__ref_L/Debug Test/Main.py_vmtcfvulvt", line 1, in <module>
09:35:52 [2020-11-10T14:35:52.060Z]   File "(none)", line 161, in trace_dispatch
09:35:52 [2020-11-10T14:35:52.060Z] org.eclipse.ease.ExitException: 
09:35:52 [2020-11-10T14:35:52.060Z] 
09:35:52 [2020-11-10T14:35:52.060Z] org.eclipse.ease.ExitException: org.eclipse.ease.ExitException: 
09:35:52 [2020-11-10T14:35:52.316Z] Start of script
09:35:52 [2020-11-10T14:35:52.316Z] include file start
09:35:52 [2020-11-10T14:35:52.316Z] include file processed
09:35:52 [2020-11-10T14:35:52.316Z] Result of testMethod = 5
09:35:52 [2020-11-10T14:35:52.316Z] End of script
09:35:52 [2020-11-10T14:35:52.571Z] Start of script
09:35:52 [2020-11-10T14:35:52.571Z] include file start
09:35:52 [2020-11-10T14:35:52.571Z] include file processed
09:35:52 [2020-11-10T14:35:52.571Z] Result of testMethod = 5
09:35:52 [2020-11-10T14:35:52.571Z] End of script
09:35:52 [2020-11-10T14:35:52.827Z] Start of script
09:35:52 [2020-11-10T14:35:52.827Z] include file start
09:35:52 [2020-11-10T14:35:52.827Z] include file processed
09:35:52 [2020-11-10T14:35:52.827Z] Result of testMethod = 5
09:35:53 [2020-11-10T14:35:53.084Z] Traceback (most recent call last):
09:35:53 [2020-11-10T14:35:53.084Z]   File "(none)", line 184, in run
09:35:53 [2020-11-10T14:35:53.084Z]   File "__ref_L/Debug Test/Main.py_iaznzzflsq", line 23, in <module>
09:35:53 [2020-11-10T14:35:53.084Z]   File "(none)", line 161, in trace_dispatch
09:35:53 [2020-11-10T14:35:53.084Z] org.eclipse.ease.ExitException: 
09:35:53 [2020-11-10T14:35:53.084Z] 
09:35:53 [2020-11-10T14:35:53.084Z] org.eclipse.ease.ExitException: org.eclipse.ease.ExitException: 
09:35:53 [2020-11-10T14:35:53.084Z] Start of script
09:35:53 [2020-11-10T14:35:53.084Z] include file start
09:35:53 [2020-11-10T14:35:53.084Z] include file processed
09:35:53 [2020-11-10T14:35:53.339Z] Result of testMethod = 5
09:35:53 [2020-11-10T14:35:53.339Z] End of script
09:35:53 [2020-11-10T14:35:53.595Z] Traceback (most recent call last):
09:35:53 [2020-11-10T14:35:53.595Z]   File "(none)", line 184, in run
09:35:53 [2020-11-10T14:35:53.595Z]   File "__ref_L/Debug Test/Main.py_xdhnyumbxy", line 1, in <module>
09:35:53 [2020-11-10T14:35:53.595Z]   File "(none)", line 161, in trace_dispatch
09:35:53 [2020-11-10T14:35:53.595Z] org.eclipse.ease.ExitException: 
09:35:53 [2020-11-10T14:35:53.595Z] 
09:35:53 [2020-11-10T14:35:53.595Z] org.eclipse.ease.ExitException: org.eclipse.ease.ExitException: 
09:35:53 [2020-11-10T14:35:53.595Z] Start of script
09:35:53 [2020-11-10T14:35:53.595Z] include file start
09:35:53 [2020-11-10T14:35:53.595Z] include file processed
09:35:53 [2020-11-10T14:35:53.595Z] Result of testMethod = 5
09:35:53 [2020-11-10T14:35:53.595Z] End of script
09:35:53 [2020-11-10T14:35:53.851Z] Start of script
09:35:53 [2020-11-10T14:35:53.851Z] include file start
09:35:53 [2020-11-10T14:35:53.851Z] include file processed
09:35:54 [2020-11-10T14:35:54.107Z] Result of testMethod = 5
09:35:54 [2020-11-10T14:35:54.107Z] End of script
09:35:54 [2020-11-10T14:35:54.107Z] Traceback (most recent call last):
09:35:54 [2020-11-10T14:35:54.107Z]   File "(none)", line 184, in run
09:35:54 [2020-11-10T14:35:54.107Z]   File "__ref_L/Debug Test/Main.py_keoqtsvejo", line 1, in <module>
09:35:54 [2020-11-10T14:35:54.107Z]   File "(none)", line 161, in trace_dispatch
09:35:54 [2020-11-10T14:35:54.107Z] org.eclipse.ease.ExitException: 
09:35:54 [2020-11-10T14:35:54.107Z] 
09:35:54 [2020-11-10T14:35:54.107Z] org.eclipse.ease.ExitException: org.eclipse.ease.ExitException: 
09:35:54 [2020-11-10T14:35:54.362Z] Start of script
09:35:54 [2020-11-10T14:35:54.362Z] include file start
09:35:54 [2020-11-10T14:35:54.363Z] include file processed
09:35:54 [2020-11-10T14:35:54.618Z] Result of testMethod = 5
09:35:54 [2020-11-10T14:35:54.618Z] End of script
09:35:54 [2020-11-10T14:35:54.618Z] Start of script
09:35:54 [2020-11-10T14:35:54.618Z] include file start
09:35:54 [2020-11-10T14:35:54.618Z] include file processed
09:35:54 [2020-11-10T14:35:54.618Z] Result of testMethod = 5
09:35:54 [2020-11-10T14:35:54.875Z] Traceback (most recent call last):
09:35:54 [2020-11-10T14:35:54.875Z]   File "(none)", line 184, in run
09:35:54 [2020-11-10T14:35:54.875Z]   File "__ref_L/Debug Test/Main.py_jtcstanmyc", line 23, in <module>
09:35:54 [2020-11-10T14:35:54.875Z]   File "(none)", line 161, in trace_dispatch
09:35:54 [2020-11-10T14:35:54.875Z] org.eclipse.ease.ExitException: 
09:35:54 [2020-11-10T14:35:54.875Z] 
09:35:54 [2020-11-10T14:35:54.875Z] org.eclipse.ease.ExitException: org.eclipse.ease.ExitException: 
09:35:55 [2020-11-10T14:35:55.131Z] Start of script
09:35:55 [2020-11-10T14:35:55.131Z] include file start
09:35:55 [2020-11-10T14:35:55.131Z] include file processed
09:35:55 [2020-11-10T14:35:55.131Z] Result of testMethod = 5
09:35:55 [2020-11-10T14:35:55.131Z] End of script
09:35:55 [2020-11-10T14:35:55.131Z] Start of script
09:35:55 [2020-11-10T14:35:55.131Z] include file start
09:35:55 [2020-11-10T14:35:55.131Z] include file processed
09:35:55 [2020-11-10T14:35:55.387Z] Result of testMethod = 5
09:35:55 [2020-11-10T14:35:55.387Z] End of script
09:35:55 [2020-11-10T14:35:55.387Z] Start of script
09:35:55 [2020-11-10T14:35:55.387Z] include file start
09:35:55 [2020-11-10T14:35:55.387Z] include file processed
09:35:55 [2020-11-10T14:35:55.387Z] Result of testMethod = 5
09:35:55 [2020-11-10T14:35:55.387Z] End of script
09:35:55 [2020-11-10T14:35:55.643Z] Start of script
09:35:55 [2020-11-10T14:35:55.643Z] include file start
09:35:55 [2020-11-10T14:35:55.643Z] include file processed
09:35:55 [2020-11-10T14:35:55.643Z] Result of testMethod = 5
09:35:55 [2020-11-10T14:35:55.643Z] End of script
09:35:55 [2020-11-10T14:35:55.899Z] Start of script
09:35:55 [2020-11-10T14:35:55.899Z] include file start
09:35:55 [2020-11-10T14:35:55.899Z] include file processed
09:35:56 [2020-11-10T14:35:56.154Z] Traceback (most recent call last):
09:35:56 [2020-11-10T14:35:56.154Z]   File "(none)", line 184, in run
09:35:56 [2020-11-10T14:35:56.154Z]   File "__ref_L/Debug Test/Main.py_rijizxyajl", line 21, in <module>
09:35:56 [2020-11-10T14:35:56.154Z]   File "__ref_L/Debug Test/Main.py_rijizxyajl", line 18, in testMethod
09:35:56 [2020-11-10T14:35:56.154Z]   File "(none)", line 161, in trace_dispatch
09:35:56 [2020-11-10T14:35:56.154Z] org.eclipse.ease.ExitException: 
09:35:56 [2020-11-10T14:35:56.154Z] 
09:35:56 [2020-11-10T14:35:56.154Z] org.eclipse.ease.ExitException: org.eclipse.ease.ExitException: 
09:35:56 [2020-11-10T14:35:56.154Z] Start of script
09:35:56 [2020-11-10T14:35:56.410Z] include file start
09:35:56 [2020-11-10T14:35:56.410Z] include file processed
09:35:56 [2020-11-10T14:35:56.410Z] Result of testMethod = 5
09:35:56 [2020-11-10T14:35:56.410Z] End of script
09:35:56 [2020-11-10T14:35:56.410Z] Start of script
09:35:56 [2020-11-10T14:35:56.410Z] include file start
09:35:56 [2020-11-10T14:35:56.410Z] include file processed
09:35:56 [2020-11-10T14:35:56.410Z] Result of testMethod = 5
09:35:56 [2020-11-10T14:35:56.665Z] Traceback (most recent call last):
09:35:56 [2020-11-10T14:35:56.665Z]   File "(none)", line 184, in run
09:35:56 [2020-11-10T14:35:56.665Z]   File "__ref_L/Debug Test/Main.py_uozbljxzeb", line 23, in <module>
09:35:56 [2020-11-10T14:35:56.665Z]   File "(none)", line 161, in trace_dispatch
09:35:56 [2020-11-10T14:35:56.665Z] org.eclipse.ease.ExitException: 
09:35:56 [2020-11-10T14:35:56.665Z] 
09:35:56 [2020-11-10T14:35:56.665Z] org.eclipse.ease.ExitException: org.eclipse.ease.ExitException: 
09:35:56 [2020-11-10T14:35:56.665Z] Start of script
09:35:56 [2020-11-10T14:35:56.665Z] include file start
09:35:56 [2020-11-10T14:35:56.665Z] include file processed
09:35:56 [2020-11-10T14:35:56.666Z] Result of testMethod = 5
09:35:56 [2020-11-10T14:35:56.921Z] End of script
09:35:56 [2020-11-10T14:35:56.921Z] Start of script
09:35:56 [2020-11-10T14:35:56.921Z] include file start
09:35:56 [2020-11-10T14:35:56.921Z] include file processed
09:35:57 [2020-11-10T14:35:57.176Z] Result of testMethod = 5
09:35:57 [2020-11-10T14:35:57.176Z] End of script
09:35:57 [2020-11-10T14:35:57.176Z] Start of script
09:35:57 [2020-11-10T14:35:57.176Z] include file start
09:35:57 [2020-11-10T14:35:57.176Z] include file processed
09:35:57 [2020-11-10T14:35:57.432Z] Result of testMethod = 5
09:35:57 [2020-11-10T14:35:57.432Z] End of script
09:35:57 [2020-11-10T14:35:57.688Z] Start of script
09:35:57 [2020-11-10T14:35:57.688Z] include file start
09:35:57 [2020-11-10T14:35:57.688Z] include file processed
09:35:57 [2020-11-10T14:35:57.688Z] Result of testMethod = 5
09:35:57 [2020-11-10T14:35:57.688Z] End of script
09:35:57 [2020-11-10T14:35:57.688Z] Start of script
09:35:57 [2020-11-10T14:35:57.688Z] include file start
09:35:57 [2020-11-10T14:35:57.688Z] include file processed
09:35:57 [2020-11-10T14:35:57.688Z] Result of testMethod = 5
09:35:57 [2020-11-10T14:35:57.944Z] Traceback (most recent call last):
09:35:57 [2020-11-10T14:35:57.944Z]   File "(none)", line 184, in run
09:35:57 [2020-11-10T14:35:57.944Z]   File "__ref_L/Debug Test/Main.py_rkwvkhwliw", line 23, in <module>
09:35:57 [2020-11-10T14:35:57.944Z]   File "(none)", line 161, in trace_dispatch
09:35:57 [2020-11-10T14:35:57.944Z] org.eclipse.ease.ExitException: 
09:35:57 [2020-11-10T14:35:57.944Z] 
09:35:57 [2020-11-10T14:35:57.944Z] org.eclipse.ease.ExitException: org.eclipse.ease.ExitException: 
09:35:58 [2020-11-10T14:35:58.200Z] Start of script
09:35:58 [2020-11-10T14:35:58.200Z] include file start
09:35:58 [2020-11-10T14:35:58.200Z] include file processed
09:35:58 [2020-11-10T14:35:58.200Z] Result of testMethod = 5
09:35:58 [2020-11-10T14:35:58.200Z] End of script
09:35:58 [2020-11-10T14:35:58.200Z] Start of script
09:35:58 [2020-11-10T14:35:58.200Z] include file start
09:35:58 [2020-11-10T14:35:58.200Z] include file processed
09:35:58 [2020-11-10T14:35:58.200Z] Result of testMethod = 5
09:35:58 [2020-11-10T14:35:58.455Z] Traceback (most recent call last):
09:35:58 [2020-11-10T14:35:58.455Z]   File "(none)", line 184, in run
09:35:58 [2020-11-10T14:35:58.455Z]   File "__ref_L/Debug Test/Main.py_afstuohzrn", line 23, in <module>
09:35:58 [2020-11-10T14:35:58.455Z]   File "(none)", line 161, in trace_dispatch
09:35:58 [2020-11-10T14:35:58.455Z] org.eclipse.ease.ExitException: 
09:35:58 [2020-11-10T14:35:58.455Z] 
09:35:58 [2020-11-10T14:35:58.455Z] org.eclipse.ease.ExitException: org.eclipse.ease.ExitException: 
09:35:58 [2020-11-10T14:35:58.710Z] Traceback (most recent call last):
09:35:58 [2020-11-10T14:35:58.710Z]   File "(none)", line 184, in run
09:35:58 [2020-11-10T14:35:58.710Z]   File "__ref_L/Debug Test/Main.py_muetkzdrqq", line 1, in <module>
09:35:58 [2020-11-10T14:35:58.710Z]   File "(none)", line 161, in trace_dispatch
09:35:58 [2020-11-10T14:35:58.710Z] org.eclipse.ease.ExitException: 
09:35:58 [2020-11-10T14:35:58.710Z] 
09:35:58 [2020-11-10T14:35:58.710Z] org.eclipse.ease.ExitException: org.eclipse.ease.ExitException: 
09:35:58 [2020-11-10T14:35:58.965Z] Start of script
09:35:58 [2020-11-10T14:35:58.965Z] include file start
09:35:58 [2020-11-10T14:35:58.965Z] include file processed
09:35:58 [2020-11-10T14:35:58.965Z] Result of testMethod = 5
09:35:58 [2020-11-10T14:35:58.966Z] End of script
09:35:58 [2020-11-10T14:35:58.966Z] Start of script
09:35:58 [2020-11-10T14:35:58.966Z] include file start
09:35:58 [2020-11-10T14:35:58.966Z] include file processed
09:35:59 [2020-11-10T14:35:59.221Z] Result of testMethod = 5
09:35:59 [2020-11-10T14:35:59.221Z] End of script
09:35:59 [2020-11-10T14:35:59.221Z] Start of script
09:35:59 [2020-11-10T14:35:59.221Z] include file start
09:35:59 [2020-11-10T14:35:59.221Z] include file processed
09:35:59 [2020-11-10T14:35:59.221Z] Result of testMethod = 5
09:35:59 [2020-11-10T14:35:59.477Z] End of script
09:35:59 [2020-11-10T14:35:59.477Z] Tests run: 42, Failures: 1, Errors: 0, Skipped: 0, Time elapsed: 12.251 s <<< FAILURE! - in org.eclipse.ease.lang.python.jython.debugger.JythonDebugTest
09:35:59 [2020-11-10T14:35:59.477Z] disconnectProcessInSuspendedState(org.eclipse.ease.lang.python.jython.debugger.JythonDebugTest)  Time elapsed: 1.444 s  <<< FAILURE!
09:35:59 [2020-11-10T14:35:59.477Z] java.lang.AssertionError: expected:<1> but was:<0>
09:35:59 [2020-11-10T14:35:59.477Z] 
09:35:59 [2020-11-10T14:35:59.477Z] stepReturnIncludeCommand(org.eclipse.ease.lang.python.jython.debugger.JythonDebugTest)  Time elapsed: 0.21 s
09:35:59 [2020-11-10T14:35:59.477Z] arrayVariableSorting(org.eclipse.ease.lang.python.jython.debugger.JythonDebugTest)  Time elapsed: 0.309 s
09:35:59 [2020-11-10T14:35:59.477Z] stepOverOnDebugTarget(org.eclipse.ease.lang.python.jython.debugger.JythonDebugTest)  Time elapsed: 0.311 s
09:35:59 [2020-11-10T14:35:59.477Z] hasDebugTarget(org.eclipse.ease.lang.python.jython.debugger.JythonDebugTest)  Time elapsed: 0.107 s
09:35:59 [2020-11-10T14:35:59.477Z] disconnectThreadInSuspendedState(org.eclipse.ease.lang.python.jython.debugger.JythonDebugTest)  Time elapsed: 0.207 s
09:35:59 [2020-11-10T14:35:59.477Z] stepReturnOnDebugTarget(org.eclipse.ease.lang.python.jython.debugger.JythonDebugTest)  Time elapsed: 0.308 s
09:35:59 [2020-11-10T14:35:59.477Z] nullVariable(org.eclipse.ease.lang.python.jython.debugger.JythonDebugTest)  Time elapsed: 0.307 s
09:35:59 [2020-11-10T14:35:59.477Z] stepOverOnStackFrame(org.eclipse.ease.lang.python.jython.debugger.JythonDebugTest)  Time elapsed: 0.308 s
09:35:59 [2020-11-10T14:35:59.477Z] resumeOnDebugTarget(org.eclipse.ease.lang.python.jython.debugger.JythonDebugTest)  Time elapsed: 0.207 s
09:35:59 [2020-11-10T14:35:59.477Z] modifyVariableKeepingType(org.eclipse.ease.lang.python.jython.debugger.JythonDebugTest)  Time elapsed: 0.506 s
09:35:59 [2020-11-10T14:35:59.477Z] resumeOnLastIncludeLine(org.eclipse.ease.lang.python.jython.debugger.JythonDebugTest)  Time elapsed: 0.207 s
09:35:59 [2020-11-10T14:35:59.477Z] stepReturnOnStackFrame(org.eclipse.ease.lang.python.jython.debugger.JythonDebugTest)  Time elapsed: 0.307 s
09:35:59 [2020-11-10T14:35:59.477Z] terminateStackFrameInSuspendedState(org.eclipse.ease.lang.python.jython.debugger.JythonDebugTest)  Time elapsed: 0.207 s
09:35:59 [2020-11-10T14:35:59.477Z] breakpointLocation(org.eclipse.ease.lang.python.jython.debugger.JythonDebugTest)  Time elapsed: 0.207 s
09:35:59 [2020-11-10T14:35:59.477Z] stepReturnOnThread(org.eclipse.ease.lang.python.jython.debugger.JythonDebugTest)  Time elapsed: 0.307 s
09:35:59 [2020-11-10T14:35:59.477Z] javaClassVariable(org.eclipse.ease.lang.python.jython.debugger.JythonDebugTest)  Time elapsed: 0.308 s
09:35:59 [2020-11-10T14:35:59.477Z] stepIntoOnThread(org.eclipse.ease.lang.python.jython.debugger.JythonDebugTest)  Time elapsed: 0.307 s
09:35:59 [2020-11-10T14:35:59.477Z] terminateThreadInSuspendedState(org.eclipse.ease.lang.python.jython.debugger.JythonDebugTest)  Time elapsed: 0.206 s
09:35:59 [2020-11-10T14:35:59.477Z] resumeOnThread(org.eclipse.ease.lang.python.jython.debugger.JythonDebugTest)  Time elapsed: 0.206 s
09:35:59 [2020-11-10T14:35:59.477Z] stepIntoOnStackFrame(org.eclipse.ease.lang.python.jython.debugger.JythonDebugTest)  Time elapsed: 0.306 s
09:35:59 [2020-11-10T14:35:59.477Z] terminateProcessInSuspendedState(org.eclipse.ease.lang.python.jython.debugger.JythonDebugTest)  Time elapsed: 0.206 s
09:35:59 [2020-11-10T14:35:59.477Z] stepOverOnProcess(org.eclipse.ease.lang.python.jython.debugger.JythonDebugTest)  Time elapsed: 0.307 s
09:35:59 [2020-11-10T14:35:59.477Z] nativeArrayVariable(org.eclipse.ease.lang.python.jython.debugger.JythonDebugTest)  Time elapsed: 0.306 s
09:35:59 [2020-11-10T14:35:59.477Z] disconnectDebugTargetInSuspendedState(org.eclipse.ease.lang.python.jython.debugger.JythonDebugTest)  Time elapsed: 0.206 s
09:35:59 [2020-11-10T14:35:59.477Z] stepIntoOnProcess(org.eclipse.ease.lang.python.jython.debugger.JythonDebugTest)  Time elapsed: 0.308 s
09:35:59 [2020-11-10T14:35:59.477Z] terminatedState(org.eclipse.ease.lang.python.jython.debugger.JythonDebugTest)  Time elapsed: 0.106 s
09:35:59 [2020-11-10T14:35:59.477Z] stepOverIncludeCommand(org.eclipse.ease.lang.python.jython.debugger.JythonDebugTest)  Time elapsed: 0.306 s
09:35:59 [2020-11-10T14:35:59.477Z] innerScopeVariableBeforeOuterScopeVariable(org.eclipse.ease.lang.python.jython.debugger.JythonDebugTest)  Time elapsed: 0.306 s
09:35:59 [2020-11-10T14:35:59.477Z] stepIntoIncludeCommand(org.eclipse.ease.lang.python.jython.debugger.JythonDebugTest)  Time elapsed: 0.306 s
09:35:59 [2020-11-10T14:35:59.477Z] primitiveStringVariable(org.eclipse.ease.lang.python.jython.debugger.JythonDebugTest)  Time elapsed: 0.306 s
09:35:59 [2020-11-10T14:35:59.477Z] resumeOnProcess(org.eclipse.ease.lang.python.jython.debugger.JythonDebugTest)  Time elapsed: 0.206 s
09:35:59 [2020-11-10T14:35:59.477Z] stepIntoOnDebugTarget(org.eclipse.ease.lang.python.jython.debugger.JythonDebugTest)  Time elapsed: 0.306 s
09:35:59 [2020-11-10T14:35:59.477Z] stepOverOnThread(org.eclipse.ease.lang.python.jython.debugger.JythonDebugTest)  Time elapsed: 0.307 s
09:35:59 [2020-11-10T14:35:59.477Z] suspendedState(org.eclipse.ease.lang.python.jython.debugger.JythonDebugTest)  Time elapsed: 0.205 s
09:35:59 [2020-11-10T14:35:59.477Z] primitiveDoubleVariable(org.eclipse.ease.lang.python.jython.debugger.JythonDebugTest)  Time elapsed: 0.306 s
09:35:59 [2020-11-10T14:35:59.477Z] resumeOnStackFrame(org.eclipse.ease.lang.python.jython.debugger.JythonDebugTest)  Time elapsed: 0.206 s
09:35:59 [2020-11-10T14:35:59.477Z] nativeObjectVariable(org.eclipse.ease.lang.python.jython.debugger.JythonDebugTest)  Time elapsed: 0.306 s
09:35:59 [2020-11-10T14:35:59.478Z] terminateDebugTargetInSuspendedState(org.eclipse.ease.lang.python.jython.debugger.JythonDebugTest)  Time elapsed: 0.207 s
09:35:59 [2020-11-10T14:35:59.478Z] disconnectStackFrameInSuspendedState(org.eclipse.ease.lang.python.jython.debugger.JythonDebugTest)  Time elapsed: 0.206 s
09:35:59 [2020-11-10T14:35:59.478Z] stepReturnOnProcess(org.eclipse.ease.lang.python.jython.debugger.JythonDebugTest)  Time elapsed: 0.307 s
09:35:59 [2020-11-10T14:35:59.478Z] evaluateWatchExpression(org.eclipse.ease.lang.python.jython.debugger.JythonDebugTest)  Time elapsed: 0.208 s
09:35:59 [2020-11-10T14:35:59.478Z] 
09:35:59 [2020-11-10T14:35:59.478Z] Results:
09:35:59 [2020-11-10T14:35:59.478Z] 
09:35:59 [2020-11-10T14:35:59.478Z] Failures: 
09:35:59 [2020-11-10T14:35:59.478Z]   JythonDebugTest>AbstractDebugTest.disconnectProcessInSuspendedState:523->AbstractDebugTest.disconnectTestTemplate:513 expected:<1> but was:<0>
09:35:59 [2020-11-10T14:35:59.478Z] 
09:35:59 [2020-11-10T14:35:59.478Z] Tests run: 42, Failures: 1, Errors: 0, Skipped: 0
09:35:59 [2020-11-10T14:35:59.478Z] 
09:36:00 [2020-11-10T14:36:00.056Z] [INFO] ------------------------------------------------------------------------
09:36:00 [2020-11-10T14:36:00.056Z] [INFO] Reactor Summary for org.eclipse.ease.releng 0.8.0-SNAPSHOT:
09:36:00 [2020-11-10T14:36:00.056Z] [INFO] 
09:36:00 [2020-11-10T14:36:00.056Z] [INFO] org.eclipse.ease.releng ............................ SUCCESS [  0.001 s]
09:36:00 [2020-11-10T14:36:00.056Z] [INFO] org.eclipse.ease.releng.target ..................... SUCCESS [  0.153 s]
09:36:00 [2020-11-10T14:36:00.056Z] [INFO] org.eclipse.ease.test .............................. SUCCESS [ 16.755 s]
09:36:00 [2020-11-10T14:36:00.056Z] [INFO] org.eclipse.ease.lang.javascript.nashorn.test ...... SUCCESS [  3.203 s]
09:36:00 [2020-11-10T14:36:00.056Z] [INFO] org.eclipse.ease.lang.javascript.rhino.test ........ SUCCESS [ 14.392 s]
09:36:00 [2020-11-10T14:36:00.056Z] [INFO] org.eclipse.ease.lang.javascript.test .............. SUCCESS [  2.491 s]
09:36:00 [2020-11-10T14:36:00.056Z] [INFO] org.eclipse.ease.lang.python.test .................. SUCCESS [  2.205 s]
09:36:00 [2020-11-10T14:36:00.056Z] [INFO] org.eclipse.ease.lang.python.jython.test ........... FAILURE [ 15.183 s]
09:36:00 [2020-11-10T14:36:00.056Z] [INFO] org.eclipse.ease.lang.python.py4j.test ............. SKIPPED
09:36:00 [2020-11-10T14:36:00.056Z] [INFO] org.eclipse.ease.lang.scriptarchive.test ........... SKIPPED
09:36:00 [2020-11-10T14:36:00.056Z] [INFO] org.eclipse.ease.ui.test ........................... SKIPPED
09:36:00 [2020-11-10T14:36:00.056Z] [INFO] ------------------------------------------------------------------------
09:36:00 [2020-11-10T14:36:00.056Z] [INFO] BUILD FAILURE
09:36:00 [2020-11-10T14:36:00.056Z] [INFO] ------------------------------------------------------------------------
09:36:00 [2020-11-10T14:36:00.056Z] [INFO] Total time:  01:36 min
09:36:00 [2020-11-10T14:36:00.056Z] [INFO] Finished at: 2020-11-10T14:35:59Z
09:36:00 [2020-11-10T14:36:00.056Z] [INFO] ------------------------------------------------------------------------
09:36:00 [2020-11-10T14:36:00.056Z] [WARNING] [jenkins-event-spy] Unexpected Maven project file name 'target-tests-pom.xml', problems may occur
09:36:00 [2020-11-10T14:36:00.056Z] [INFO] [jenkins-event-spy] Generated /home/jenkins/agent/workspace/ease.verify.core.target.2019-06@tmp/withMaven7f2c0cca/maven-spy-20201110-143423-43418258899626563961673.log
09:36:00 [2020-11-10T14:36:00.056Z] [ERROR] Failed to execute goal org.eclipse.tycho:tycho-surefire-plugin:1.5.0:test (default-test) on project org.eclipse.ease.lang.python.jython.test: There are test failures.
09:36:00 [2020-11-10T14:36:00.056Z] [ERROR] 
09:36:00 [2020-11-10T14:36:00.056Z] [ERROR] Please refer to /home/jenkins/agent/workspace/ease.verify.core.target.2019-06/tests/org.eclipse.ease.lang.python.jython.test/target/surefire-reports for the individual test results.
09:36:00 [2020-11-10T14:36:00.056Z] [ERROR] -> [Help 1]
09:36:00 [2020-11-10T14:36:00.056Z] [ERROR] 
09:36:00 [2020-11-10T14:36:00.056Z] [ERROR] To see the full stack trace of the errors, re-run Maven with the -e switch.
09:36:00 [2020-11-10T14:36:00.056Z] [ERROR] Re-run Maven using the -X switch to enable full debug logging.
09:36:00 [2020-11-10T14:36:00.056Z] [ERROR] 
09:36:00 [2020-11-10T14:36:00.056Z] [ERROR] For more information about the errors and possible solutions, please read the following articles:
09:36:00 [2020-11-10T14:36:00.056Z] [ERROR] [Help 1] http://cwiki.apache.org/confluence/display/MAVEN/MojoFailureException
09:36:00 [2020-11-10T14:36:00.056Z] [ERROR] 
09:36:00 [2020-11-10T14:36:00.056Z] [ERROR] After correcting the problems, you can resume the build with the command
09:36:00 [2020-11-10T14:36:00.056Z] [ERROR]   mvn <args> -rf :org.eclipse.ease.lang.python.jython.test
[Pipeline] }
09:36:00 [2020-11-10T14:36:00.350Z] [withMaven] Publishers: Pipeline Graph Publisher: 3 ms
[Pipeline] // withMaven
[Pipeline] }
[Pipeline] // stage
[Pipeline] stage
[Pipeline] { (Declarative: Post Actions)
[Pipeline] archiveArtifacts
09:36:00 [2020-11-10T14:36:00.386Z] Archiving artifacts
[Pipeline] emailext
09:36:21 [2020-11-10T14:36:21.540Z] Sending email to: christian.pontesegger@web.de
[Pipeline] }
[Pipeline] // stage
[Pipeline] }
[Pipeline] // timeout
[Pipeline] }
[Pipeline] // timestamps
[Pipeline] }
[Pipeline] // node
[Pipeline] End of Pipeline
ERROR: script returned exit code 1
Finished: FAILURE