SuccessConsole Output

Skipping 725 KB.. Full Log
arget/surefire.properties]
09:33:44 [2020-10-20T13:33:44.082Z] Picked up JAVA_TOOL_OPTIONS: -Dmaven.ext.class.path="/home/jenkins/agent/workspace/ease.verify.core.target.2019-06@tmp/withMaven4b7189ce/pipeline-maven-spy.jar" -Dorg.jenkinsci.plugins.pipeline.maven.reportsFolder="/home/jenkins/agent/workspace/ease.verify.core.target.2019-06@tmp/withMaven4b7189ce" 
09:33:46 [2020-10-20T13:33:46.046Z] Running org.eclipse.ease.lang.javascript.JavaScriptCompletionContextTest
09:33:46 [2020-10-20T13:33:46.046Z] Tests run: 8, Failures: 0, Errors: 0, Skipped: 0, Time elapsed: 0.288 s - in org.eclipse.ease.lang.javascript.JavaScriptCompletionContextTest
09:33:46 [2020-10-20T13:33:46.046Z] verifyStaticClassTypes(org.eclipse.ease.lang.javascript.JavaScriptCompletionContextTest)  Time elapsed: 0.005 s
09:33:46 [2020-10-20T13:33:46.046Z] verifyClassInstanceTypes(org.eclipse.ease.lang.javascript.JavaScriptCompletionContextTest)  Time elapsed: 0.007 s
09:33:46 [2020-10-20T13:33:46.046Z] verifyTypesForScriptEngine(org.eclipse.ease.lang.javascript.JavaScriptCompletionContextTest)  Time elapsed: 0.11 s
09:33:46 [2020-10-20T13:33:46.046Z] verifyPackageTypes(org.eclipse.ease.lang.javascript.JavaScriptCompletionContextTest)  Time elapsed: 0.001 s
09:33:46 [2020-10-20T13:33:46.046Z] definedVariableTypes(org.eclipse.ease.lang.javascript.JavaScriptCompletionContextTest)  Time elapsed: 0.001 s
09:33:46 [2020-10-20T13:33:46.046Z] verifyStringLiteralTypes(org.eclipse.ease.lang.javascript.JavaScriptCompletionContextTest)  Time elapsed: 0 s
09:33:46 [2020-10-20T13:33:46.046Z] verifyUnknownTypes(org.eclipse.ease.lang.javascript.JavaScriptCompletionContextTest)  Time elapsed: 0.001 s
09:33:46 [2020-10-20T13:33:46.046Z] verifyNoneTypes(org.eclipse.ease.lang.javascript.JavaScriptCompletionContextTest)  Time elapsed: 0 s
09:33:46 [2020-10-20T13:33:46.046Z] Running org.eclipse.ease.lang.javascript.JavaScriptCodeFactoryTest
09:33:46 [2020-10-20T13:33:46.046Z] Tests run: 1, Failures: 0, Errors: 0, Skipped: 0, Time elapsed: 0.003 s - in org.eclipse.ease.lang.javascript.JavaScriptCodeFactoryTest
09:33:46 [2020-10-20T13:33:46.046Z] testCommentCreator(org.eclipse.ease.lang.javascript.JavaScriptCodeFactoryTest)  Time elapsed: 0.002 s
09:33:46 [2020-10-20T13:33:46.046Z] 
09:33:46 [2020-10-20T13:33:46.046Z] Results:
09:33:46 [2020-10-20T13:33:46.046Z] 
09:33:46 [2020-10-20T13:33:46.046Z] Tests run: 9, Failures: 0, Errors: 0, Skipped: 0
09:33:46 [2020-10-20T13:33:46.046Z] 
09:33:46 [2020-10-20T13:33:46.973Z] [INFO] All tests passed!
09:33:46 [2020-10-20T13:33:46.973Z] [INFO] 
09:33:46 [2020-10-20T13:33:46.973Z] [INFO] --- maven-install-plugin:2.3.1:install (default-install) @ org.eclipse.ease.lang.javascript.test ---
09:33:46 [2020-10-20T13:33:46.973Z] [INFO] Installing /home/jenkins/agent/workspace/ease.verify.core.target.2019-06/tests/org.eclipse.ease.lang.javascript.test/target/org.eclipse.ease.lang.javascript.test-0.8.0-SNAPSHOT.jar to /home/jenkins/.m2/repository/org/eclipse/ease/org.eclipse.ease.lang.javascript.test/0.8.0-SNAPSHOT/org.eclipse.ease.lang.javascript.test-0.8.0-SNAPSHOT.jar
09:33:46 [2020-10-20T13:33:46.973Z] [INFO] Installing /home/jenkins/agent/workspace/ease.verify.core.target.2019-06/tests/org.eclipse.ease.lang.javascript.test/pom.xml to /home/jenkins/.m2/repository/org/eclipse/ease/org.eclipse.ease.lang.javascript.test/0.8.0-SNAPSHOT/org.eclipse.ease.lang.javascript.test-0.8.0-SNAPSHOT.pom
09:33:46 [2020-10-20T13:33:46.973Z] [INFO] Installing /home/jenkins/agent/workspace/ease.verify.core.target.2019-06/tests/org.eclipse.ease.lang.javascript.test/target/org.eclipse.ease.lang.javascript.test-0.8.0-SNAPSHOT-sources.jar to /home/jenkins/.m2/repository/org/eclipse/ease/org.eclipse.ease.lang.javascript.test/0.8.0-SNAPSHOT/org.eclipse.ease.lang.javascript.test-0.8.0-SNAPSHOT-sources.jar
09:33:46 [2020-10-20T13:33:46.973Z] [INFO] Installing /home/jenkins/agent/workspace/ease.verify.core.target.2019-06/tests/org.eclipse.ease.lang.javascript.test/target/p2content.xml to /home/jenkins/.m2/repository/org/eclipse/ease/org.eclipse.ease.lang.javascript.test/0.8.0-SNAPSHOT/org.eclipse.ease.lang.javascript.test-0.8.0-SNAPSHOT-p2metadata.xml
09:33:46 [2020-10-20T13:33:46.973Z] [INFO] Installing /home/jenkins/agent/workspace/ease.verify.core.target.2019-06/tests/org.eclipse.ease.lang.javascript.test/target/p2artifacts.xml to /home/jenkins/.m2/repository/org/eclipse/ease/org.eclipse.ease.lang.javascript.test/0.8.0-SNAPSHOT/org.eclipse.ease.lang.javascript.test-0.8.0-SNAPSHOT-p2artifacts.xml
09:33:46 [2020-10-20T13:33:46.973Z] [INFO] Installing /home/jenkins/agent/workspace/ease.verify.core.target.2019-06/tests/org.eclipse.ease.lang.javascript.test/target/p2content.xml to /home/jenkins/.m2/repository/org/eclipse/ease/org.eclipse.ease.lang.javascript.test/0.8.0-SNAPSHOT/org.eclipse.ease.lang.javascript.test-0.8.0-SNAPSHOT-p2metadata.xml
09:33:46 [2020-10-20T13:33:46.974Z] [INFO] Installing /home/jenkins/agent/workspace/ease.verify.core.target.2019-06/tests/org.eclipse.ease.lang.javascript.test/target/p2artifacts.xml to /home/jenkins/.m2/repository/org/eclipse/ease/org.eclipse.ease.lang.javascript.test/0.8.0-SNAPSHOT/org.eclipse.ease.lang.javascript.test-0.8.0-SNAPSHOT-p2artifacts.xml
09:33:46 [2020-10-20T13:33:46.974Z] [INFO] 
09:33:46 [2020-10-20T13:33:46.974Z] [INFO] --- tycho-p2-plugin:1.5.0:update-local-index (default-update-local-index) @ org.eclipse.ease.lang.javascript.test ---
09:33:46 [2020-10-20T13:33:46.974Z] [INFO] 
09:33:46 [2020-10-20T13:33:46.974Z] [INFO] ---------< org.eclipse.ease:org.eclipse.ease.lang.python.test >---------
09:33:46 [2020-10-20T13:33:46.974Z] [INFO] Building org.eclipse.ease.lang.python.test 0.8.0-SNAPSHOT        [42/48]
09:33:46 [2020-10-20T13:33:46.974Z] [INFO] ------------------------[ eclipse-test-plugin ]-------------------------
09:33:46 [2020-10-20T13:33:46.974Z] [INFO] 
09:33:46 [2020-10-20T13:33:46.974Z] [INFO] --- maven-clean-plugin:2.5:clean (default-clean) @ org.eclipse.ease.lang.python.test ---
09:33:46 [2020-10-20T13:33:46.974Z] [INFO] 
09:33:46 [2020-10-20T13:33:46.974Z] [INFO] --- tycho-packaging-plugin:1.5.0:build-qualifier (default-build-qualifier) @ org.eclipse.ease.lang.python.test ---
09:33:46 [2020-10-20T13:33:46.974Z] [INFO] The project's OSGi version is 0.8.0.I201910171213
09:33:46 [2020-10-20T13:33:46.974Z] [INFO] 
09:33:46 [2020-10-20T13:33:46.974Z] [INFO] --- tycho-packaging-plugin:1.5.0:validate-id (default-validate-id) @ org.eclipse.ease.lang.python.test ---
09:33:46 [2020-10-20T13:33:46.974Z] [INFO] 
09:33:46 [2020-10-20T13:33:46.974Z] [INFO] --- tycho-packaging-plugin:1.5.0:validate-version (default-validate-version) @ org.eclipse.ease.lang.python.test ---
09:33:46 [2020-10-20T13:33:46.974Z] [INFO] 
09:33:46 [2020-10-20T13:33:46.974Z] [INFO] >>> maven-javadoc-plugin:2.9.1:javadoc (build-docs) > generate-sources @ org.eclipse.ease.lang.python.test >>>
09:33:46 [2020-10-20T13:33:46.974Z] [INFO] 
09:33:46 [2020-10-20T13:33:46.974Z] [INFO] --- tycho-packaging-plugin:1.5.0:build-qualifier (default-build-qualifier) @ org.eclipse.ease.lang.python.test ---
09:33:46 [2020-10-20T13:33:46.974Z] [INFO] The project's OSGi version is 0.8.0.I201910171213
09:33:46 [2020-10-20T13:33:46.974Z] [INFO] 
09:33:46 [2020-10-20T13:33:46.974Z] [INFO] --- tycho-packaging-plugin:1.5.0:validate-id (default-validate-id) @ org.eclipse.ease.lang.python.test ---
09:33:46 [2020-10-20T13:33:46.974Z] [INFO] 
09:33:46 [2020-10-20T13:33:46.974Z] [INFO] --- tycho-packaging-plugin:1.5.0:validate-version (default-validate-version) @ org.eclipse.ease.lang.python.test ---
09:33:46 [2020-10-20T13:33:46.974Z] [INFO] 
09:33:46 [2020-10-20T13:33:46.974Z] [INFO] <<< maven-javadoc-plugin:2.9.1:javadoc (build-docs) < generate-sources @ org.eclipse.ease.lang.python.test <<<
09:33:46 [2020-10-20T13:33:46.974Z] [INFO] 
09:33:46 [2020-10-20T13:33:46.974Z] [INFO] 
09:33:46 [2020-10-20T13:33:46.974Z] [INFO] --- maven-javadoc-plugin:2.9.1:javadoc (build-docs) @ org.eclipse.ease.lang.python.test ---
09:33:46 [2020-10-20T13:33:46.974Z] [ERROR] Error fetching link: http://help.eclipse.org/oxygen/topic/org.eclipse.platform.doc.isv/reference/api/package-list. Ignored it.
09:33:46 [2020-10-20T13:33:46.974Z] [ERROR] Error fetching link: https://ci.eclipse.org/ease/job/ease.build.core/JavaDoc/package-list. Ignored it.
09:33:47 [2020-10-20T13:33:47.901Z] [INFO] 
09:33:47 [2020-10-20T13:33:47.901Z] Loading source files for package org.eclipse.ease.lang.python...
09:33:47 [2020-10-20T13:33:47.901Z] Constructing Javadoc information...
09:33:47 [2020-10-20T13:33:47.901Z] WARNING: Cannot open location "/home/jenkins/agent/workspace/ease.verify.core.target.2019-06/tests/org.eclipse.ease.lang.python.test/target/javadoc-bundle-options/package-list"
09:33:47 [2020-10-20T13:33:47.901Z] No plugin definition found, skipping
09:33:47 [2020-10-20T13:33:47.901Z] No plugin definition found, skipping
09:33:47 [2020-10-20T13:33:47.901Z] [WARNING] Javadoc Warnings
09:33:47 [2020-10-20T13:33:47.901Z] [WARNING] Picked up JAVA_TOOL_OPTIONS: -Dmaven.ext.class.path="/home/jenkins/agent/workspace/ease.verify.core.target.2019-06@tmp/withMaven4b7189ce/pipeline-maven-spy.jar" -Dorg.jenkinsci.plugins.pipeline.maven.reportsFolder="/home/jenkins/agent/workspace/ease.verify.core.target.2019-06@tmp/withMaven4b7189ce"
09:33:47 [2020-10-20T13:33:47.901Z] [WARNING] javadoc: warning - The old Doclet and Taglet APIs in the packages
09:33:47 [2020-10-20T13:33:47.901Z] [WARNING] com.sun.javadoc, com.sun.tools.doclets and their implementations
09:33:47 [2020-10-20T13:33:47.901Z] [WARNING] are planned to be removed in a future JDK release. These
09:33:47 [2020-10-20T13:33:47.901Z] [WARNING] components have been superseded by the new APIs in jdk.javadoc.doclet.
09:33:47 [2020-10-20T13:33:47.901Z] [WARNING] Users are strongly recommended to migrate to the new APIs.
09:33:47 [2020-10-20T13:33:47.901Z] [INFO] 
09:33:47 [2020-10-20T13:33:47.901Z] [INFO] --- build-helper-maven-plugin:1.9.1:add-resource (add_help) @ org.eclipse.ease.lang.python.test ---
09:33:47 [2020-10-20T13:33:47.901Z] [INFO] 
09:33:47 [2020-10-20T13:33:47.901Z] [INFO] --- maven-resources-plugin:2.4.3:resources (default-resources) @ org.eclipse.ease.lang.python.test ---
09:33:47 [2020-10-20T13:33:47.901Z] [INFO] Using 'UTF-8' encoding to copy filtered resources.
09:33:47 [2020-10-20T13:33:47.901Z] [INFO] skip non existing resourceDirectory /home/jenkins/agent/workspace/ease.verify.core.target.2019-06/tests/org.eclipse.ease.lang.python.test/src/main/resources
09:33:47 [2020-10-20T13:33:47.902Z] [INFO] skip non existing resourceDirectory /home/jenkins/agent/workspace/ease.verify.core.target.2019-06/tests/org.eclipse.ease.lang.python.test/help
09:33:47 [2020-10-20T13:33:47.902Z] [INFO] 
09:33:47 [2020-10-20T13:33:47.902Z] [INFO] --- tycho-compiler-plugin:1.5.0:compile (default-compile) @ org.eclipse.ease.lang.python.test ---
09:33:47 [2020-10-20T13:33:47.902Z] [INFO] Compiling 1 source file to /home/jenkins/agent/workspace/ease.verify.core.target.2019-06/tests/org.eclipse.ease.lang.python.test/target/classes
09:33:47 [2020-10-20T13:33:47.902Z] [INFO] 
09:33:47 [2020-10-20T13:33:47.902Z] [INFO] --- maven-resources-plugin:2.4.3:testResources (default-testResources) @ org.eclipse.ease.lang.python.test ---
09:33:47 [2020-10-20T13:33:47.902Z] [INFO] Using 'UTF-8' encoding to copy filtered resources.
09:33:47 [2020-10-20T13:33:47.902Z] [INFO] skip non existing resourceDirectory /home/jenkins/agent/workspace/ease.verify.core.target.2019-06/tests/org.eclipse.ease.lang.python.test/src/test/resources
09:33:47 [2020-10-20T13:33:47.902Z] [INFO] 
09:33:47 [2020-10-20T13:33:47.902Z] [INFO] --- tycho-source-plugin:1.5.0:plugin-source (plugin-source) @ org.eclipse.ease.lang.python.test ---
09:33:47 [2020-10-20T13:33:47.902Z] [WARNING] Bundle-Vendor header not found in /home/jenkins/agent/workspace/ease.verify.core.target.2019-06/tests/org.eclipse.ease.lang.python.test/META-INF/MANIFEST.MF, fallback to 'unknown' for source bundle
09:33:47 [2020-10-20T13:33:47.902Z] [INFO] Building jar: /home/jenkins/agent/workspace/ease.verify.core.target.2019-06/tests/org.eclipse.ease.lang.python.test/target/org.eclipse.ease.lang.python.test-0.8.0-SNAPSHOT-sources.jar
09:33:47 [2020-10-20T13:33:47.902Z] [INFO] 
09:33:47 [2020-10-20T13:33:47.902Z] [INFO] --- target-platform-configuration:1.5.0:target-platform (default-target-platform) @ org.eclipse.ease.lang.python.test ---
09:33:47 [2020-10-20T13:33:47.902Z] [INFO] 
09:33:47 [2020-10-20T13:33:47.902Z] [INFO] --- tycho-packaging-plugin:1.5.0:package-plugin (default-package-plugin) @ org.eclipse.ease.lang.python.test ---
09:33:47 [2020-10-20T13:33:47.902Z] [INFO] Building jar: /home/jenkins/agent/workspace/ease.verify.core.target.2019-06/tests/org.eclipse.ease.lang.python.test/target/org.eclipse.ease.lang.python.test-0.8.0-SNAPSHOT.jar
09:33:47 [2020-10-20T13:33:47.902Z] [INFO] 
09:33:47 [2020-10-20T13:33:47.902Z] [INFO] --- tycho-p2-plugin:1.5.0:p2-metadata-default (default-p2-metadata-default) @ org.eclipse.ease.lang.python.test ---
09:33:47 [2020-10-20T13:33:47.902Z] [INFO] 
09:33:47 [2020-10-20T13:33:47.902Z] [INFO] --- tycho-source-feature-plugin:1.5.0:source-feature (source-feature) @ org.eclipse.ease.lang.python.test ---
09:33:47 [2020-10-20T13:33:47.902Z] [INFO] 
09:33:47 [2020-10-20T13:33:47.902Z] [INFO] --- tycho-p2-plugin:1.5.0:p2-metadata (attached-p2-metadata) @ org.eclipse.ease.lang.python.test ---
09:33:47 [2020-10-20T13:33:47.902Z] [INFO] 
09:33:47 [2020-10-20T13:33:47.902Z] [INFO] --- tycho-surefire-plugin:1.5.0:test (default-test) @ org.eclipse.ease.lang.python.test ---
09:33:48 [2020-10-20T13:33:48.183Z] [INFO] Expected eclipse log file: /home/jenkins/agent/workspace/ease.verify.core.target.2019-06/tests/org.eclipse.ease.lang.python.test/target/work/data/.metadata/.log
09:33:48 [2020-10-20T13:33:48.183Z] [INFO] Command line:
09:33:48 [2020-10-20T13:33:48.183Z] 	[/opt/tools/java/openjdk/jdk-11/11.0.2+9/bin/java, -Dosgi.noShutdown=false, -Dosgi.os=linux, -Dosgi.ws=gtk, -Dosgi.arch=x86_64, -Dosgi.clean=true, -jar, /home/jenkins/.m2/repository/p2/osgi/bundle/org.eclipse.equinox.launcher/1.5.800.v20200727-1323/org.eclipse.equinox.launcher-1.5.800.v20200727-1323.jar, -data, /home/jenkins/agent/workspace/ease.verify.core.target.2019-06/tests/org.eclipse.ease.lang.python.test/target/work/data, -install, /home/jenkins/agent/workspace/ease.verify.core.target.2019-06/tests/org.eclipse.ease.lang.python.test/target/work, -configuration, /home/jenkins/agent/workspace/ease.verify.core.target.2019-06/tests/org.eclipse.ease.lang.python.test/target/work/configuration, -application, org.eclipse.tycho.surefire.osgibooter.headlesstest, -testproperties, /home/jenkins/agent/workspace/ease.verify.core.target.2019-06/tests/org.eclipse.ease.lang.python.test/target/surefire.properties]
09:33:48 [2020-10-20T13:33:48.183Z] Picked up JAVA_TOOL_OPTIONS: -Dmaven.ext.class.path="/home/jenkins/agent/workspace/ease.verify.core.target.2019-06@tmp/withMaven4b7189ce/pipeline-maven-spy.jar" -Dorg.jenkinsci.plugins.pipeline.maven.reportsFolder="/home/jenkins/agent/workspace/ease.verify.core.target.2019-06@tmp/withMaven4b7189ce" 
09:33:49 [2020-10-20T13:33:49.546Z] Running org.eclipse.ease.lang.python.PythonCodeFactoryTest
09:33:49 [2020-10-20T13:33:49.834Z] Tests run: 1, Failures: 0, Errors: 0, Skipped: 0, Time elapsed: 0.086 s - in org.eclipse.ease.lang.python.PythonCodeFactoryTest
09:33:49 [2020-10-20T13:33:49.834Z] testCommentCreator(org.eclipse.ease.lang.python.PythonCodeFactoryTest)  Time elapsed: 0.003 s
09:33:49 [2020-10-20T13:33:49.834Z] 
09:33:49 [2020-10-20T13:33:49.834Z] Results:
09:33:49 [2020-10-20T13:33:49.834Z] 
09:33:49 [2020-10-20T13:33:49.834Z] Tests run: 1, Failures: 0, Errors: 0, Skipped: 0
09:33:49 [2020-10-20T13:33:49.834Z] 
09:33:50 [2020-10-20T13:33:50.397Z] [INFO] All tests passed!
09:33:50 [2020-10-20T13:33:50.397Z] [INFO] 
09:33:50 [2020-10-20T13:33:50.397Z] [INFO] --- maven-install-plugin:2.3.1:install (default-install) @ org.eclipse.ease.lang.python.test ---
09:33:50 [2020-10-20T13:33:50.397Z] [INFO] Installing /home/jenkins/agent/workspace/ease.verify.core.target.2019-06/tests/org.eclipse.ease.lang.python.test/target/org.eclipse.ease.lang.python.test-0.8.0-SNAPSHOT.jar to /home/jenkins/.m2/repository/org/eclipse/ease/org.eclipse.ease.lang.python.test/0.8.0-SNAPSHOT/org.eclipse.ease.lang.python.test-0.8.0-SNAPSHOT.jar
09:33:50 [2020-10-20T13:33:50.397Z] [INFO] Installing /home/jenkins/agent/workspace/ease.verify.core.target.2019-06/tests/org.eclipse.ease.lang.python.test/pom.xml to /home/jenkins/.m2/repository/org/eclipse/ease/org.eclipse.ease.lang.python.test/0.8.0-SNAPSHOT/org.eclipse.ease.lang.python.test-0.8.0-SNAPSHOT.pom
09:33:50 [2020-10-20T13:33:50.397Z] [INFO] Installing /home/jenkins/agent/workspace/ease.verify.core.target.2019-06/tests/org.eclipse.ease.lang.python.test/target/org.eclipse.ease.lang.python.test-0.8.0-SNAPSHOT-sources.jar to /home/jenkins/.m2/repository/org/eclipse/ease/org.eclipse.ease.lang.python.test/0.8.0-SNAPSHOT/org.eclipse.ease.lang.python.test-0.8.0-SNAPSHOT-sources.jar
09:33:50 [2020-10-20T13:33:50.397Z] [INFO] Installing /home/jenkins/agent/workspace/ease.verify.core.target.2019-06/tests/org.eclipse.ease.lang.python.test/target/p2content.xml to /home/jenkins/.m2/repository/org/eclipse/ease/org.eclipse.ease.lang.python.test/0.8.0-SNAPSHOT/org.eclipse.ease.lang.python.test-0.8.0-SNAPSHOT-p2metadata.xml
09:33:50 [2020-10-20T13:33:50.397Z] [INFO] Installing /home/jenkins/agent/workspace/ease.verify.core.target.2019-06/tests/org.eclipse.ease.lang.python.test/target/p2artifacts.xml to /home/jenkins/.m2/repository/org/eclipse/ease/org.eclipse.ease.lang.python.test/0.8.0-SNAPSHOT/org.eclipse.ease.lang.python.test-0.8.0-SNAPSHOT-p2artifacts.xml
09:33:50 [2020-10-20T13:33:50.397Z] [INFO] Installing /home/jenkins/agent/workspace/ease.verify.core.target.2019-06/tests/org.eclipse.ease.lang.python.test/target/p2content.xml to /home/jenkins/.m2/repository/org/eclipse/ease/org.eclipse.ease.lang.python.test/0.8.0-SNAPSHOT/org.eclipse.ease.lang.python.test-0.8.0-SNAPSHOT-p2metadata.xml
09:33:50 [2020-10-20T13:33:50.397Z] [INFO] Installing /home/jenkins/agent/workspace/ease.verify.core.target.2019-06/tests/org.eclipse.ease.lang.python.test/target/p2artifacts.xml to /home/jenkins/.m2/repository/org/eclipse/ease/org.eclipse.ease.lang.python.test/0.8.0-SNAPSHOT/org.eclipse.ease.lang.python.test-0.8.0-SNAPSHOT-p2artifacts.xml
09:33:50 [2020-10-20T13:33:50.397Z] [INFO] 
09:33:50 [2020-10-20T13:33:50.397Z] [INFO] --- tycho-p2-plugin:1.5.0:update-local-index (default-update-local-index) @ org.eclipse.ease.lang.python.test ---
09:33:50 [2020-10-20T13:33:50.397Z] [INFO] 
09:33:50 [2020-10-20T13:33:50.397Z] [INFO] -----< org.eclipse.ease:org.eclipse.ease.lang.python.jython.test >------
09:33:50 [2020-10-20T13:33:50.397Z] [INFO] Building org.eclipse.ease.lang.python.jython.test 0.8.0-SNAPSHOT [43/48]
09:33:50 [2020-10-20T13:33:50.397Z] [INFO] ------------------------[ eclipse-test-plugin ]-------------------------
09:33:50 [2020-10-20T13:33:50.397Z] [INFO] 
09:33:50 [2020-10-20T13:33:50.397Z] [INFO] --- maven-clean-plugin:2.5:clean (default-clean) @ org.eclipse.ease.lang.python.jython.test ---
09:33:50 [2020-10-20T13:33:50.397Z] [INFO] 
09:33:50 [2020-10-20T13:33:50.397Z] [INFO] --- tycho-packaging-plugin:1.5.0:build-qualifier (default-build-qualifier) @ org.eclipse.ease.lang.python.jython.test ---
09:33:50 [2020-10-20T13:33:50.397Z] [INFO] The project's OSGi version is 0.8.0.I201911291239
09:33:50 [2020-10-20T13:33:50.397Z] [INFO] 
09:33:50 [2020-10-20T13:33:50.397Z] [INFO] --- tycho-packaging-plugin:1.5.0:validate-id (default-validate-id) @ org.eclipse.ease.lang.python.jython.test ---
09:33:50 [2020-10-20T13:33:50.397Z] [INFO] 
09:33:50 [2020-10-20T13:33:50.397Z] [INFO] --- tycho-packaging-plugin:1.5.0:validate-version (default-validate-version) @ org.eclipse.ease.lang.python.jython.test ---
09:33:50 [2020-10-20T13:33:50.397Z] [INFO] 
09:33:50 [2020-10-20T13:33:50.397Z] [INFO] >>> maven-javadoc-plugin:2.9.1:javadoc (build-docs) > generate-sources @ org.eclipse.ease.lang.python.jython.test >>>
09:33:50 [2020-10-20T13:33:50.397Z] [INFO] 
09:33:50 [2020-10-20T13:33:50.397Z] [INFO] --- tycho-packaging-plugin:1.5.0:build-qualifier (default-build-qualifier) @ org.eclipse.ease.lang.python.jython.test ---
09:33:50 [2020-10-20T13:33:50.397Z] [INFO] The project's OSGi version is 0.8.0.I201911291239
09:33:50 [2020-10-20T13:33:50.397Z] [INFO] 
09:33:50 [2020-10-20T13:33:50.397Z] [INFO] --- tycho-packaging-plugin:1.5.0:validate-id (default-validate-id) @ org.eclipse.ease.lang.python.jython.test ---
09:33:50 [2020-10-20T13:33:50.397Z] [INFO] 
09:33:50 [2020-10-20T13:33:50.397Z] [INFO] --- tycho-packaging-plugin:1.5.0:validate-version (default-validate-version) @ org.eclipse.ease.lang.python.jython.test ---
09:33:50 [2020-10-20T13:33:50.397Z] [INFO] 
09:33:50 [2020-10-20T13:33:50.398Z] [INFO] <<< maven-javadoc-plugin:2.9.1:javadoc (build-docs) < generate-sources @ org.eclipse.ease.lang.python.jython.test <<<
09:33:50 [2020-10-20T13:33:50.398Z] [INFO] 
09:33:50 [2020-10-20T13:33:50.398Z] [INFO] 
09:33:50 [2020-10-20T13:33:50.398Z] [INFO] --- maven-javadoc-plugin:2.9.1:javadoc (build-docs) @ org.eclipse.ease.lang.python.jython.test ---
09:33:50 [2020-10-20T13:33:50.653Z] [ERROR] Error fetching link: http://help.eclipse.org/oxygen/topic/org.eclipse.platform.doc.isv/reference/api/package-list. Ignored it.
09:33:50 [2020-10-20T13:33:50.653Z] [ERROR] Error fetching link: https://ci.eclipse.org/ease/job/ease.build.core/JavaDoc/package-list. Ignored it.
09:33:51 [2020-10-20T13:33:51.581Z] [INFO] 
09:33:51 [2020-10-20T13:33:51.581Z] Loading source files for package org.eclipse.ease.lang.python.jython.debugger...
09:33:51 [2020-10-20T13:33:51.581Z] Constructing Javadoc information...
09:33:51 [2020-10-20T13:33:51.581Z] WARNING: Cannot open location "/home/jenkins/agent/workspace/ease.verify.core.target.2019-06/tests/org.eclipse.ease.lang.python.jython.test/target/javadoc-bundle-options/package-list"
09:33:51 [2020-10-20T13:33:51.581Z] No plugin definition found, skipping
09:33:51 [2020-10-20T13:33:51.581Z] No plugin definition found, skipping
09:33:51 [2020-10-20T13:33:51.581Z] [WARNING] Javadoc Warnings
09:33:51 [2020-10-20T13:33:51.581Z] [WARNING] Picked up JAVA_TOOL_OPTIONS: -Dmaven.ext.class.path="/home/jenkins/agent/workspace/ease.verify.core.target.2019-06@tmp/withMaven4b7189ce/pipeline-maven-spy.jar" -Dorg.jenkinsci.plugins.pipeline.maven.reportsFolder="/home/jenkins/agent/workspace/ease.verify.core.target.2019-06@tmp/withMaven4b7189ce"
09:33:51 [2020-10-20T13:33:51.581Z] [WARNING] javadoc: warning - The old Doclet and Taglet APIs in the packages
09:33:51 [2020-10-20T13:33:51.581Z] [WARNING] com.sun.javadoc, com.sun.tools.doclets and their implementations
09:33:51 [2020-10-20T13:33:51.581Z] [WARNING] are planned to be removed in a future JDK release. These
09:33:51 [2020-10-20T13:33:51.581Z] [WARNING] components have been superseded by the new APIs in jdk.javadoc.doclet.
09:33:51 [2020-10-20T13:33:51.581Z] [WARNING] Users are strongly recommended to migrate to the new APIs.
09:33:51 [2020-10-20T13:33:51.581Z] [INFO] 
09:33:51 [2020-10-20T13:33:51.581Z] [INFO] --- build-helper-maven-plugin:1.9.1:add-resource (add_help) @ org.eclipse.ease.lang.python.jython.test ---
09:33:51 [2020-10-20T13:33:51.581Z] [INFO] 
09:33:51 [2020-10-20T13:33:51.581Z] [INFO] --- maven-resources-plugin:2.4.3:resources (default-resources) @ org.eclipse.ease.lang.python.jython.test ---
09:33:51 [2020-10-20T13:33:51.581Z] [INFO] Using 'UTF-8' encoding to copy filtered resources.
09:33:51 [2020-10-20T13:33:51.581Z] [INFO] skip non existing resourceDirectory /home/jenkins/agent/workspace/ease.verify.core.target.2019-06/tests/org.eclipse.ease.lang.python.jython.test/src/main/resources
09:33:51 [2020-10-20T13:33:51.581Z] [INFO] skip non existing resourceDirectory /home/jenkins/agent/workspace/ease.verify.core.target.2019-06/tests/org.eclipse.ease.lang.python.jython.test/help
09:33:51 [2020-10-20T13:33:51.581Z] [INFO] 
09:33:51 [2020-10-20T13:33:51.581Z] [INFO] --- tycho-compiler-plugin:1.5.0:compile (default-compile) @ org.eclipse.ease.lang.python.jython.test ---
09:33:51 [2020-10-20T13:33:51.581Z] [INFO] Compiling 1 source file to /home/jenkins/agent/workspace/ease.verify.core.target.2019-06/tests/org.eclipse.ease.lang.python.jython.test/target/classes
09:33:51 [2020-10-20T13:33:51.581Z] [INFO] 
09:33:51 [2020-10-20T13:33:51.582Z] [INFO] --- maven-resources-plugin:2.4.3:testResources (default-testResources) @ org.eclipse.ease.lang.python.jython.test ---
09:33:51 [2020-10-20T13:33:51.582Z] [INFO] Using 'UTF-8' encoding to copy filtered resources.
09:33:51 [2020-10-20T13:33:51.582Z] [INFO] skip non existing resourceDirectory /home/jenkins/agent/workspace/ease.verify.core.target.2019-06/tests/org.eclipse.ease.lang.python.jython.test/src/test/resources
09:33:51 [2020-10-20T13:33:51.582Z] [INFO] 
09:33:51 [2020-10-20T13:33:51.582Z] [INFO] --- tycho-source-plugin:1.5.0:plugin-source (plugin-source) @ org.eclipse.ease.lang.python.jython.test ---
09:33:51 [2020-10-20T13:33:51.582Z] [WARNING] Bundle-Vendor header not found in /home/jenkins/agent/workspace/ease.verify.core.target.2019-06/tests/org.eclipse.ease.lang.python.jython.test/META-INF/MANIFEST.MF, fallback to 'unknown' for source bundle
09:33:51 [2020-10-20T13:33:51.582Z] [INFO] Building jar: /home/jenkins/agent/workspace/ease.verify.core.target.2019-06/tests/org.eclipse.ease.lang.python.jython.test/target/org.eclipse.ease.lang.python.jython.test-0.8.0-SNAPSHOT-sources.jar
09:33:51 [2020-10-20T13:33:51.582Z] [INFO] 
09:33:51 [2020-10-20T13:33:51.582Z] [INFO] --- target-platform-configuration:1.5.0:target-platform (default-target-platform) @ org.eclipse.ease.lang.python.jython.test ---
09:33:51 [2020-10-20T13:33:51.582Z] [INFO] 
09:33:51 [2020-10-20T13:33:51.582Z] [INFO] --- tycho-packaging-plugin:1.5.0:package-plugin (default-package-plugin) @ org.eclipse.ease.lang.python.jython.test ---
09:33:51 [2020-10-20T13:33:51.582Z] [INFO] Building jar: /home/jenkins/agent/workspace/ease.verify.core.target.2019-06/tests/org.eclipse.ease.lang.python.jython.test/target/org.eclipse.ease.lang.python.jython.test-0.8.0-SNAPSHOT.jar
09:33:51 [2020-10-20T13:33:51.582Z] [INFO] 
09:33:51 [2020-10-20T13:33:51.582Z] [INFO] --- tycho-p2-plugin:1.5.0:p2-metadata-default (default-p2-metadata-default) @ org.eclipse.ease.lang.python.jython.test ---
09:33:51 [2020-10-20T13:33:51.582Z] [INFO] 
09:33:51 [2020-10-20T13:33:51.582Z] [INFO] --- tycho-source-feature-plugin:1.5.0:source-feature (source-feature) @ org.eclipse.ease.lang.python.jython.test ---
09:33:51 [2020-10-20T13:33:51.582Z] [INFO] 
09:33:51 [2020-10-20T13:33:51.582Z] [INFO] --- tycho-p2-plugin:1.5.0:p2-metadata (attached-p2-metadata) @ org.eclipse.ease.lang.python.jython.test ---
09:33:51 [2020-10-20T13:33:51.582Z] [INFO] 
09:33:51 [2020-10-20T13:33:51.582Z] [INFO] --- tycho-surefire-plugin:1.5.0:test (default-test) @ org.eclipse.ease.lang.python.jython.test ---
09:33:52 [2020-10-20T13:33:52.143Z] [INFO] Expected eclipse log file: /home/jenkins/agent/workspace/ease.verify.core.target.2019-06/tests/org.eclipse.ease.lang.python.jython.test/target/work/data/.metadata/.log
09:33:52 [2020-10-20T13:33:52.143Z] [INFO] Command line:
09:33:52 [2020-10-20T13:33:52.143Z] 	[/opt/tools/java/openjdk/jdk-11/11.0.2+9/bin/java, -Dosgi.noShutdown=false, -Dosgi.os=linux, -Dosgi.ws=gtk, -Dosgi.arch=x86_64, -Dosgi.clean=true, -jar, /home/jenkins/.m2/repository/p2/osgi/bundle/org.eclipse.equinox.launcher/1.5.800.v20200727-1323/org.eclipse.equinox.launcher-1.5.800.v20200727-1323.jar, -data, /home/jenkins/agent/workspace/ease.verify.core.target.2019-06/tests/org.eclipse.ease.lang.python.jython.test/target/work/data, -install, /home/jenkins/agent/workspace/ease.verify.core.target.2019-06/tests/org.eclipse.ease.lang.python.jython.test/target/work, -configuration, /home/jenkins/agent/workspace/ease.verify.core.target.2019-06/tests/org.eclipse.ease.lang.python.jython.test/target/work/configuration, -application, org.eclipse.tycho.surefire.osgibooter.headlesstest, -testproperties, /home/jenkins/agent/workspace/ease.verify.core.target.2019-06/tests/org.eclipse.ease.lang.python.jython.test/target/surefire.properties]
09:33:52 [2020-10-20T13:33:52.143Z] Picked up JAVA_TOOL_OPTIONS: -Dmaven.ext.class.path="/home/jenkins/agent/workspace/ease.verify.core.target.2019-06@tmp/withMaven4b7189ce/pipeline-maven-spy.jar" -Dorg.jenkinsci.plugins.pipeline.maven.reportsFolder="/home/jenkins/agent/workspace/ease.verify.core.target.2019-06@tmp/withMaven4b7189ce" 
09:33:54 [2020-10-20T13:33:54.043Z] WARNING: An illegal reflective access operation has occurred
09:33:54 [2020-10-20T13:33:54.043Z] WARNING: Illegal reflective access by org.python.core.PySystemState (file:/home/jenkins/agent/workspace/ease.verify.core.target.2019-06/tests/org.eclipse.ease.lang.python.jython.test/target/work/plugins/org.jython_2.7.0.I201609090924/jython.jar) to method java.io.Console.encoding()
09:33:54 [2020-10-20T13:33:54.043Z] WARNING: Please consider reporting this to the maintainers of org.python.core.PySystemState
09:33:54 [2020-10-20T13:33:54.043Z] WARNING: Use --illegal-access=warn to enable warnings of further illegal reflective access operations
09:33:54 [2020-10-20T13:33:54.043Z] WARNING: All illegal access operations will be denied in a future release
09:33:54 [2020-10-20T13:33:54.043Z] Running org.eclipse.ease.lang.python.jython.debugger.JythonDebugTest
09:33:55 [2020-10-20T13:33:55.420Z] Start of script
09:33:55 [2020-10-20T13:33:55.420Z] include file start
09:33:55 [2020-10-20T13:33:55.420Z] include file processed
09:33:55 [2020-10-20T13:33:55.420Z] Result of testMethod = 5
09:33:55 [2020-10-20T13:33:55.420Z] End of script
09:33:55 [2020-10-20T13:33:55.676Z] Start of script
09:33:55 [2020-10-20T13:33:55.676Z] include file start
09:33:55 [2020-10-20T13:33:55.676Z] include file processed
09:33:55 [2020-10-20T13:33:55.676Z] Result of testMethod = 5
09:33:55 [2020-10-20T13:33:55.676Z] End of script
09:33:55 [2020-10-20T13:33:55.932Z] Start of script
09:33:55 [2020-10-20T13:33:55.932Z] include file start
09:33:55 [2020-10-20T13:33:55.932Z] include file processed
09:33:55 [2020-10-20T13:33:55.932Z] Result of testMethod = 5
09:33:55 [2020-10-20T13:33:55.932Z] Traceback (most recent call last):
09:33:55 [2020-10-20T13:33:55.932Z]   File "(none)", line 184, in run
09:33:55 [2020-10-20T13:33:55.932Z]   File "__ref_L/Debug Test/Main.py_dsjhibtjxd", line 23, in <module>
09:33:55 [2020-10-20T13:33:55.932Z]   File "(none)", line 161, in trace_dispatch
09:33:55 [2020-10-20T13:33:55.932Z] org.eclipse.ease.ExitException: 
09:33:55 [2020-10-20T13:33:55.932Z] 
09:33:55 [2020-10-20T13:33:55.932Z] org.eclipse.ease.ExitException: org.eclipse.ease.ExitException: 
09:33:56 [2020-10-20T13:33:56.188Z] Start of script
09:33:56 [2020-10-20T13:33:56.188Z] include file start
09:33:56 [2020-10-20T13:33:56.188Z] include file processed
09:33:56 [2020-10-20T13:33:56.188Z] Result of testMethod = 5
09:33:56 [2020-10-20T13:33:56.188Z] End of script
09:33:56 [2020-10-20T13:33:56.749Z] Start of script
09:33:56 [2020-10-20T13:33:56.749Z] include file start
09:33:56 [2020-10-20T13:33:56.749Z] include file processed
09:33:56 [2020-10-20T13:33:56.749Z] Result of testMethod = 5
09:33:56 [2020-10-20T13:33:56.749Z] End of script
09:33:56 [2020-10-20T13:33:56.749Z] Start of script
09:33:56 [2020-10-20T13:33:56.749Z] include file start
09:33:56 [2020-10-20T13:33:56.749Z] include file processed
09:33:57 [2020-10-20T13:33:57.005Z] Result of testMethod = 5
09:33:57 [2020-10-20T13:33:57.005Z] End of script
09:33:57 [2020-10-20T13:33:57.005Z] Start of script
09:33:57 [2020-10-20T13:33:57.005Z] include file start
09:33:57 [2020-10-20T13:33:57.005Z] include file processed
09:33:57 [2020-10-20T13:33:57.005Z] Result of testMethod = 5
09:33:57 [2020-10-20T13:33:57.261Z] Traceback (most recent call last):
09:33:57 [2020-10-20T13:33:57.261Z]   File "(none)", line 184, in run
09:33:57 [2020-10-20T13:33:57.261Z]   File "__ref_L/Debug Test/Main.py_aaaqolvlmo", line 23, in <module>
09:33:57 [2020-10-20T13:33:57.261Z]   File "(none)", line 161, in trace_dispatch
09:33:57 [2020-10-20T13:33:57.261Z] org.eclipse.ease.ExitException: 
09:33:57 [2020-10-20T13:33:57.261Z] 
09:33:57 [2020-10-20T13:33:57.261Z] org.eclipse.ease.ExitException: org.eclipse.ease.ExitException: 
09:33:57 [2020-10-20T13:33:57.261Z] Start of script
09:33:57 [2020-10-20T13:33:57.261Z] include file start
09:33:57 [2020-10-20T13:33:57.261Z] include file processed
09:33:57 [2020-10-20T13:33:57.517Z] Result of testMethod = 5
09:33:57 [2020-10-20T13:33:57.517Z] End of script
09:33:57 [2020-10-20T13:33:57.772Z] Start of script
09:33:57 [2020-10-20T13:33:57.772Z] include file start
09:33:57 [2020-10-20T13:33:57.772Z] include file processed
09:33:57 [2020-10-20T13:33:57.772Z] Result of testMethod = 5
09:33:57 [2020-10-20T13:33:57.772Z] End of script
09:33:57 [2020-10-20T13:33:57.772Z] Start of script
09:33:57 [2020-10-20T13:33:57.772Z] include file start
09:33:57 [2020-10-20T13:33:57.772Z] include file processed
09:33:58 [2020-10-20T13:33:58.334Z] Traceback (most recent call last):
09:33:58 [2020-10-20T13:33:58.334Z]   File "(none)", line 184, in run
09:33:58 [2020-10-20T13:33:58.334Z]   File "__ref_L/Debug Test/Main.py_vhxevyxeql", line 22, in <module>
09:33:58 [2020-10-20T13:33:58.334Z]   File "(none)", line 161, in trace_dispatch
09:33:58 [2020-10-20T13:33:58.334Z] org.eclipse.ease.ExitException: 
09:33:58 [2020-10-20T13:33:58.334Z] 
09:33:58 [2020-10-20T13:33:58.334Z] org.eclipse.ease.ExitException: org.eclipse.ease.ExitException: 
09:33:58 [2020-10-20T13:33:58.334Z] Start of script
09:33:58 [2020-10-20T13:33:58.334Z] include file start
09:33:58 [2020-10-20T13:33:58.334Z] include file processed
09:33:58 [2020-10-20T13:33:58.334Z] Result of testMethod = 5
09:33:58 [2020-10-20T13:33:58.334Z] End of script
09:33:58 [2020-10-20T13:33:58.590Z] Start of script
09:33:58 [2020-10-20T13:33:58.590Z] include file start
09:33:58 [2020-10-20T13:33:58.590Z] include file processed
09:33:58 [2020-10-20T13:33:58.845Z] Result of testMethod = 5
09:33:58 [2020-10-20T13:33:58.845Z] End of script
09:33:59 [2020-10-20T13:33:59.101Z] Traceback (most recent call last):
09:33:59 [2020-10-20T13:33:59.101Z]   File "(none)", line 184, in run
09:33:59 [2020-10-20T13:33:59.101Z]   File "__ref_L/Debug Test/Main.py_umayihtujg", line 1, in <module>
09:33:59 [2020-10-20T13:33:59.101Z]   File "(none)", line 161, in trace_dispatch
09:33:59 [2020-10-20T13:33:59.101Z] org.eclipse.ease.ExitException: 
09:33:59 [2020-10-20T13:33:59.101Z] 
09:33:59 [2020-10-20T13:33:59.101Z] org.eclipse.ease.ExitException: org.eclipse.ease.ExitException: 
09:33:59 [2020-10-20T13:33:59.101Z] Start of script
09:33:59 [2020-10-20T13:33:59.101Z] include file start
09:33:59 [2020-10-20T13:33:59.101Z] include file processed
09:33:59 [2020-10-20T13:33:59.101Z] Result of testMethod = 5
09:33:59 [2020-10-20T13:33:59.101Z] End of script
09:33:59 [2020-10-20T13:33:59.357Z] Start of script
09:33:59 [2020-10-20T13:33:59.357Z] include file start
09:33:59 [2020-10-20T13:33:59.357Z] include file processed
09:33:59 [2020-10-20T13:33:59.611Z] Result of testMethod = 5
09:33:59 [2020-10-20T13:33:59.611Z] End of script
09:33:59 [2020-10-20T13:33:59.611Z] Start of script
09:33:59 [2020-10-20T13:33:59.611Z] include file start
09:33:59 [2020-10-20T13:33:59.611Z] include file processed
09:33:59 [2020-10-20T13:33:59.611Z] Result of testMethod = 5
09:33:59 [2020-10-20T13:33:59.867Z] Traceback (most recent call last):
09:33:59 [2020-10-20T13:33:59.867Z]   File "(none)", line 184, in run
09:33:59 [2020-10-20T13:33:59.867Z]   File "__ref_L/Debug Test/Main.py_mkdkjmnqlc", line 23, in <module>
09:33:59 [2020-10-20T13:33:59.867Z]   File "(none)", line 161, in trace_dispatch
09:33:59 [2020-10-20T13:33:59.867Z] org.eclipse.ease.ExitException: 
09:33:59 [2020-10-20T13:33:59.867Z] 
09:33:59 [2020-10-20T13:33:59.867Z] org.eclipse.ease.ExitException: org.eclipse.ease.ExitException: 
09:33:59 [2020-10-20T13:33:59.867Z] Start of script
09:33:59 [2020-10-20T13:33:59.867Z] include file start
09:33:59 [2020-10-20T13:33:59.867Z] include file processed
09:34:00 [2020-10-20T13:34:00.122Z] Result of testMethod = 5
09:34:00 [2020-10-20T13:34:00.122Z] End of script
09:34:00 [2020-10-20T13:34:00.378Z] Traceback (most recent call last):
09:34:00 [2020-10-20T13:34:00.378Z]   File "(none)", line 184, in run
09:34:00 [2020-10-20T13:34:00.378Z]   File "__ref_L/Debug Test/Main.py_utgkhwbfdh", line 1, in <module>
09:34:00 [2020-10-20T13:34:00.378Z]   File "(none)", line 161, in trace_dispatch
09:34:00 [2020-10-20T13:34:00.378Z] org.eclipse.ease.ExitException: 
09:34:00 [2020-10-20T13:34:00.378Z] 
09:34:00 [2020-10-20T13:34:00.378Z] org.eclipse.ease.ExitException: org.eclipse.ease.ExitException: 
09:34:00 [2020-10-20T13:34:00.378Z] Start of script
09:34:00 [2020-10-20T13:34:00.378Z] include file start
09:34:00 [2020-10-20T13:34:00.378Z] include file processed
09:34:00 [2020-10-20T13:34:00.378Z] Result of testMethod = 5
09:34:00 [2020-10-20T13:34:00.634Z] End of script
09:34:00 [2020-10-20T13:34:00.634Z] Start of script
09:34:00 [2020-10-20T13:34:00.634Z] include file start
09:34:00 [2020-10-20T13:34:00.634Z] include file processed
09:34:00 [2020-10-20T13:34:00.890Z] Result of testMethod = 5
09:34:00 [2020-10-20T13:34:00.891Z] End of script
09:34:01 [2020-10-20T13:34:01.147Z] Traceback (most recent call last):
09:34:01 [2020-10-20T13:34:01.147Z]   File "(none)", line 184, in run
09:34:01 [2020-10-20T13:34:01.147Z]   File "__ref_L/Debug Test/Main.py_fuvirwomtc", line 1, in <module>
09:34:01 [2020-10-20T13:34:01.147Z]   File "(none)", line 161, in trace_dispatch
09:34:01 [2020-10-20T13:34:01.147Z] org.eclipse.ease.ExitException: 
09:34:01 [2020-10-20T13:34:01.147Z] 
09:34:01 [2020-10-20T13:34:01.147Z] org.eclipse.ease.ExitException: org.eclipse.ease.ExitException: 
09:34:01 [2020-10-20T13:34:01.147Z] Start of script
09:34:01 [2020-10-20T13:34:01.147Z] include file start
09:34:01 [2020-10-20T13:34:01.147Z] include file processed
09:34:01 [2020-10-20T13:34:01.402Z] Result of testMethod = 5
09:34:01 [2020-10-20T13:34:01.402Z] End of script
09:34:01 [2020-10-20T13:34:01.402Z] Start of script
09:34:01 [2020-10-20T13:34:01.402Z] include file start
09:34:01 [2020-10-20T13:34:01.402Z] include file processed
09:34:01 [2020-10-20T13:34:01.402Z] Result of testMethod = 5
09:34:01 [2020-10-20T13:34:01.657Z] Traceback (most recent call last):
09:34:01 [2020-10-20T13:34:01.658Z]   File "(none)", line 184, in run
09:34:01 [2020-10-20T13:34:01.658Z]   File "__ref_L/Debug Test/Main.py_hjhoewblok", line 23, in <module>
09:34:01 [2020-10-20T13:34:01.658Z]   File "(none)", line 161, in trace_dispatch
09:34:01 [2020-10-20T13:34:01.658Z] org.eclipse.ease.ExitException: 
09:34:01 [2020-10-20T13:34:01.658Z] 
09:34:01 [2020-10-20T13:34:01.658Z] org.eclipse.ease.ExitException: org.eclipse.ease.ExitException: 
09:34:01 [2020-10-20T13:34:01.913Z] Start of script
09:34:01 [2020-10-20T13:34:01.913Z] include file start
09:34:01 [2020-10-20T13:34:01.913Z] include file processed
09:34:01 [2020-10-20T13:34:01.913Z] Result of testMethod = 5
09:34:01 [2020-10-20T13:34:01.913Z] End of script
09:34:01 [2020-10-20T13:34:01.913Z] Start of script
09:34:01 [2020-10-20T13:34:01.913Z] include file start
09:34:01 [2020-10-20T13:34:01.913Z] include file processed
09:34:02 [2020-10-20T13:34:02.169Z] Result of testMethod = 5
09:34:02 [2020-10-20T13:34:02.169Z] End of script
09:34:02 [2020-10-20T13:34:02.169Z] Start of script
09:34:02 [2020-10-20T13:34:02.169Z] include file start
09:34:02 [2020-10-20T13:34:02.169Z] include file processed
09:34:02 [2020-10-20T13:34:02.169Z] Result of testMethod = 5
09:34:02 [2020-10-20T13:34:02.169Z] End of script
09:34:02 [2020-10-20T13:34:02.424Z] Start of script
09:34:02 [2020-10-20T13:34:02.424Z] include file start
09:34:02 [2020-10-20T13:34:02.424Z] include file processed
09:34:02 [2020-10-20T13:34:02.681Z] Result of testMethod = 5
09:34:02 [2020-10-20T13:34:02.681Z] End of script
09:34:02 [2020-10-20T13:34:02.681Z] Start of script
09:34:02 [2020-10-20T13:34:02.681Z] include file start
09:34:02 [2020-10-20T13:34:02.681Z] include file processed
09:34:02 [2020-10-20T13:34:02.937Z] Traceback (most recent call last):
09:34:02 [2020-10-20T13:34:02.937Z]   File "(none)", line 184, in run
09:34:02 [2020-10-20T13:34:02.937Z]   File "__ref_L/Debug Test/Main.py_jajttkcijx", line 21, in <module>
09:34:02 [2020-10-20T13:34:02.937Z]   File "__ref_L/Debug Test/Main.py_jajttkcijx", line 18, in testMethod
09:34:02 [2020-10-20T13:34:02.937Z]   File "(none)", line 161, in trace_dispatch
09:34:02 [2020-10-20T13:34:02.937Z] org.eclipse.ease.ExitException: 
09:34:02 [2020-10-20T13:34:02.937Z] 
09:34:02 [2020-10-20T13:34:02.937Z] org.eclipse.ease.ExitException: org.eclipse.ease.ExitException: 
09:34:02 [2020-10-20T13:34:02.937Z] Start of script
09:34:03 [2020-10-20T13:34:03.193Z] include file start
09:34:03 [2020-10-20T13:34:03.193Z] include file processed
09:34:03 [2020-10-20T13:34:03.193Z] Result of testMethod = 5
09:34:03 [2020-10-20T13:34:03.193Z] End of script
09:34:03 [2020-10-20T13:34:03.193Z] Start of script
09:34:03 [2020-10-20T13:34:03.193Z] include file start
09:34:03 [2020-10-20T13:34:03.193Z] include file processed
09:34:03 [2020-10-20T13:34:03.193Z] Result of testMethod = 5
09:34:03 [2020-10-20T13:34:03.448Z] Traceback (most recent call last):
09:34:03 [2020-10-20T13:34:03.448Z]   File "(none)", line 184, in run
09:34:03 [2020-10-20T13:34:03.448Z]   File "__ref_L/Debug Test/Main.py_bvuspzjqlq", line 23, in <module>
09:34:03 [2020-10-20T13:34:03.448Z]   File "(none)", line 161, in trace_dispatch
09:34:03 [2020-10-20T13:34:03.448Z] org.eclipse.ease.ExitException: 
09:34:03 [2020-10-20T13:34:03.448Z] 
09:34:03 [2020-10-20T13:34:03.448Z] org.eclipse.ease.ExitException: org.eclipse.ease.ExitException: 
09:34:03 [2020-10-20T13:34:03.703Z] Start of script
09:34:03 [2020-10-20T13:34:03.703Z] include file start
09:34:03 [2020-10-20T13:34:03.703Z] include file processed
09:34:03 [2020-10-20T13:34:03.703Z] Result of testMethod = 5
09:34:03 [2020-10-20T13:34:03.703Z] End of script
09:34:03 [2020-10-20T13:34:03.703Z] Start of script
09:34:03 [2020-10-20T13:34:03.703Z] include file start
09:34:03 [2020-10-20T13:34:03.703Z] include file processed
09:34:03 [2020-10-20T13:34:03.959Z] Result of testMethod = 5
09:34:03 [2020-10-20T13:34:03.959Z] End of script
09:34:04 [2020-10-20T13:34:04.216Z] Start of script
09:34:04 [2020-10-20T13:34:04.216Z] include file start
09:34:04 [2020-10-20T13:34:04.216Z] include file processed
09:34:04 [2020-10-20T13:34:04.216Z] Result of testMethod = 5
09:34:04 [2020-10-20T13:34:04.216Z] End of script
09:34:04 [2020-10-20T13:34:04.474Z] Start of script
09:34:04 [2020-10-20T13:34:04.474Z] include file start
09:34:04 [2020-10-20T13:34:04.474Z] include file processed
09:34:04 [2020-10-20T13:34:04.474Z] Result of testMethod = 5
09:34:04 [2020-10-20T13:34:04.474Z] End of script
09:34:04 [2020-10-20T13:34:04.732Z] Start of script
09:34:04 [2020-10-20T13:34:04.732Z] include file start
09:34:04 [2020-10-20T13:34:04.732Z] include file processed
09:34:04 [2020-10-20T13:34:04.732Z] Result of testMethod = 5
09:34:04 [2020-10-20T13:34:04.732Z] Traceback (most recent call last):
09:34:04 [2020-10-20T13:34:04.732Z]   File "(none)", line 184, in run
09:34:04 [2020-10-20T13:34:04.732Z]   File "__ref_L/Debug Test/Main.py_pidnqrqvpz", line 23, in <module>
09:34:04 [2020-10-20T13:34:04.732Z]   File "(none)", line 161, in trace_dispatch
09:34:04 [2020-10-20T13:34:04.732Z] org.eclipse.ease.ExitException: 
09:34:04 [2020-10-20T13:34:04.732Z] 
09:34:04 [2020-10-20T13:34:04.732Z] org.eclipse.ease.ExitException: org.eclipse.ease.ExitException: 
09:34:04 [2020-10-20T13:34:04.991Z] Start of script
09:34:04 [2020-10-20T13:34:04.991Z] include file start
09:34:04 [2020-10-20T13:34:04.991Z] include file processed
09:34:04 [2020-10-20T13:34:04.991Z] Result of testMethod = 5
09:34:04 [2020-10-20T13:34:04.991Z] End of script
09:34:05 [2020-10-20T13:34:05.252Z] Start of script
09:34:05 [2020-10-20T13:34:05.252Z] include file start
09:34:05 [2020-10-20T13:34:05.252Z] include file processed
09:34:05 [2020-10-20T13:34:05.252Z] Result of testMethod = 5
09:34:05 [2020-10-20T13:34:05.252Z] Traceback (most recent call last):
09:34:05 [2020-10-20T13:34:05.252Z]   File "(none)", line 184, in run
09:34:05 [2020-10-20T13:34:05.252Z]   File "__ref_L/Debug Test/Main.py_kdousrvpoc", line 23, in <module>
09:34:05 [2020-10-20T13:34:05.252Z]   File "(none)", line 161, in trace_dispatch
09:34:05 [2020-10-20T13:34:05.252Z] org.eclipse.ease.ExitException: 
09:34:05 [2020-10-20T13:34:05.252Z] 
09:34:05 [2020-10-20T13:34:05.252Z] org.eclipse.ease.ExitException: org.eclipse.ease.ExitException: 
09:34:05 [2020-10-20T13:34:05.507Z] Traceback (most recent call last):
09:34:05 [2020-10-20T13:34:05.507Z]   File "(none)", line 184, in run
09:34:05 [2020-10-20T13:34:05.507Z]   File "__ref_L/Debug Test/Main.py_jhgjmopduu", line 1, in <module>
09:34:05 [2020-10-20T13:34:05.507Z]   File "(none)", line 161, in trace_dispatch
09:34:05 [2020-10-20T13:34:05.507Z] org.eclipse.ease.ExitException: 
09:34:05 [2020-10-20T13:34:05.507Z] 
09:34:05 [2020-10-20T13:34:05.507Z] org.eclipse.ease.ExitException: org.eclipse.ease.ExitException: 
09:34:05 [2020-10-20T13:34:05.762Z] Start of script
09:34:05 [2020-10-20T13:34:05.762Z] include file start
09:34:05 [2020-10-20T13:34:05.762Z] include file processed
09:34:05 [2020-10-20T13:34:05.762Z] Result of testMethod = 5
09:34:05 [2020-10-20T13:34:05.762Z] End of script
09:34:05 [2020-10-20T13:34:05.762Z] Start of script
09:34:05 [2020-10-20T13:34:05.762Z] include file start
09:34:05 [2020-10-20T13:34:05.762Z] include file processed
09:34:06 [2020-10-20T13:34:06.019Z] Result of testMethod = 5
09:34:06 [2020-10-20T13:34:06.019Z] End of script
09:34:06 [2020-10-20T13:34:06.274Z] Start of script
09:34:06 [2020-10-20T13:34:06.274Z] include file start
09:34:06 [2020-10-20T13:34:06.274Z] include file processed
09:34:06 [2020-10-20T13:34:06.274Z] Result of testMethod = 5
09:34:06 [2020-10-20T13:34:06.274Z] End of script
09:34:06 [2020-10-20T13:34:06.274Z] Tests run: 42, Failures: 0, Errors: 0, Skipped: 0, Time elapsed: 12.362 s - in org.eclipse.ease.lang.python.jython.debugger.JythonDebugTest
09:34:06 [2020-10-20T13:34:06.274Z] disconnectProcessInSuspendedState(org.eclipse.ease.lang.python.jython.debugger.JythonDebugTest)  Time elapsed: 1.531 s
09:34:06 [2020-10-20T13:34:06.274Z] stepReturnIncludeCommand(org.eclipse.ease.lang.python.jython.debugger.JythonDebugTest)  Time elapsed: 0.21 s
09:34:06 [2020-10-20T13:34:06.274Z] arrayVariableSorting(org.eclipse.ease.lang.python.jython.debugger.JythonDebugTest)  Time elapsed: 0.311 s
09:34:06 [2020-10-20T13:34:06.274Z] stepOverOnDebugTarget(org.eclipse.ease.lang.python.jython.debugger.JythonDebugTest)  Time elapsed: 0.312 s
09:34:06 [2020-10-20T13:34:06.274Z] hasDebugTarget(org.eclipse.ease.lang.python.jython.debugger.JythonDebugTest)  Time elapsed: 0.107 s
09:34:06 [2020-10-20T13:34:06.274Z] disconnectThreadInSuspendedState(org.eclipse.ease.lang.python.jython.debugger.JythonDebugTest)  Time elapsed: 0.216 s
09:34:06 [2020-10-20T13:34:06.274Z] stepReturnOnDebugTarget(org.eclipse.ease.lang.python.jython.debugger.JythonDebugTest)  Time elapsed: 0.309 s
09:34:06 [2020-10-20T13:34:06.274Z] nullVariable(org.eclipse.ease.lang.python.jython.debugger.JythonDebugTest)  Time elapsed: 0.307 s
09:34:06 [2020-10-20T13:34:06.275Z] stepOverOnStackFrame(org.eclipse.ease.lang.python.jython.debugger.JythonDebugTest)  Time elapsed: 0.307 s
09:34:06 [2020-10-20T13:34:06.275Z] resumeOnDebugTarget(org.eclipse.ease.lang.python.jython.debugger.JythonDebugTest)  Time elapsed: 0.208 s
09:34:06 [2020-10-20T13:34:06.275Z] modifyVariableKeepingType(org.eclipse.ease.lang.python.jython.debugger.JythonDebugTest)  Time elapsed: 0.506 s
09:34:06 [2020-10-20T13:34:06.275Z] resumeOnLastIncludeLine(org.eclipse.ease.lang.python.jython.debugger.JythonDebugTest)  Time elapsed: 0.207 s
09:34:06 [2020-10-20T13:34:06.275Z] stepReturnOnStackFrame(org.eclipse.ease.lang.python.jython.debugger.JythonDebugTest)  Time elapsed: 0.307 s
09:34:06 [2020-10-20T13:34:06.275Z] terminateStackFrameInSuspendedState(org.eclipse.ease.lang.python.jython.debugger.JythonDebugTest)  Time elapsed: 0.207 s
09:34:06 [2020-10-20T13:34:06.275Z] breakpointLocation(org.eclipse.ease.lang.python.jython.debugger.JythonDebugTest)  Time elapsed: 0.207 s
09:34:06 [2020-10-20T13:34:06.275Z] stepReturnOnThread(org.eclipse.ease.lang.python.jython.debugger.JythonDebugTest)  Time elapsed: 0.308 s
09:34:06 [2020-10-20T13:34:06.275Z] javaClassVariable(org.eclipse.ease.lang.python.jython.debugger.JythonDebugTest)  Time elapsed: 0.307 s
09:34:06 [2020-10-20T13:34:06.275Z] stepIntoOnThread(org.eclipse.ease.lang.python.jython.debugger.JythonDebugTest)  Time elapsed: 0.307 s
09:34:06 [2020-10-20T13:34:06.275Z] terminateThreadInSuspendedState(org.eclipse.ease.lang.python.jython.debugger.JythonDebugTest)  Time elapsed: 0.207 s
09:34:06 [2020-10-20T13:34:06.275Z] resumeOnThread(org.eclipse.ease.lang.python.jython.debugger.JythonDebugTest)  Time elapsed: 0.206 s
09:34:06 [2020-10-20T13:34:06.275Z] stepIntoOnStackFrame(org.eclipse.ease.lang.python.jython.debugger.JythonDebugTest)  Time elapsed: 0.308 s
09:34:06 [2020-10-20T13:34:06.275Z] terminateProcessInSuspendedState(org.eclipse.ease.lang.python.jython.debugger.JythonDebugTest)  Time elapsed: 0.207 s
09:34:06 [2020-10-20T13:34:06.275Z] stepOverOnProcess(org.eclipse.ease.lang.python.jython.debugger.JythonDebugTest)  Time elapsed: 0.308 s
09:34:06 [2020-10-20T13:34:06.275Z] nativeArrayVariable(org.eclipse.ease.lang.python.jython.debugger.JythonDebugTest)  Time elapsed: 0.307 s
09:34:06 [2020-10-20T13:34:06.275Z] disconnectDebugTargetInSuspendedState(org.eclipse.ease.lang.python.jython.debugger.JythonDebugTest)  Time elapsed: 0.206 s
09:34:06 [2020-10-20T13:34:06.275Z] stepIntoOnProcess(org.eclipse.ease.lang.python.jython.debugger.JythonDebugTest)  Time elapsed: 0.306 s
09:34:06 [2020-10-20T13:34:06.275Z] terminatedState(org.eclipse.ease.lang.python.jython.debugger.JythonDebugTest)  Time elapsed: 0.105 s
09:34:06 [2020-10-20T13:34:06.275Z] stepOverIncludeCommand(org.eclipse.ease.lang.python.jython.debugger.JythonDebugTest)  Time elapsed: 0.305 s
09:34:06 [2020-10-20T13:34:06.275Z] innerScopeVariableBeforeOuterScopeVariable(org.eclipse.ease.lang.python.jython.debugger.JythonDebugTest)  Time elapsed: 0.306 s
09:34:06 [2020-10-20T13:34:06.275Z] stepIntoIncludeCommand(org.eclipse.ease.lang.python.jython.debugger.JythonDebugTest)  Time elapsed: 0.306 s
09:34:06 [2020-10-20T13:34:06.275Z] primitiveStringVariable(org.eclipse.ease.lang.python.jython.debugger.JythonDebugTest)  Time elapsed: 0.306 s
09:34:06 [2020-10-20T13:34:06.275Z] resumeOnProcess(org.eclipse.ease.lang.python.jython.debugger.JythonDebugTest)  Time elapsed: 0.206 s
09:34:06 [2020-10-20T13:34:06.275Z] stepIntoOnDebugTarget(org.eclipse.ease.lang.python.jython.debugger.JythonDebugTest)  Time elapsed: 0.307 s
09:34:06 [2020-10-20T13:34:06.275Z] stepOverOnThread(org.eclipse.ease.lang.python.jython.debugger.JythonDebugTest)  Time elapsed: 0.306 s
09:34:06 [2020-10-20T13:34:06.275Z] suspendedState(org.eclipse.ease.lang.python.jython.debugger.JythonDebugTest)  Time elapsed: 0.206 s
09:34:06 [2020-10-20T13:34:06.275Z] primitiveDoubleVariable(org.eclipse.ease.lang.python.jython.debugger.JythonDebugTest)  Time elapsed: 0.306 s
09:34:06 [2020-10-20T13:34:06.275Z] resumeOnStackFrame(org.eclipse.ease.lang.python.jython.debugger.JythonDebugTest)  Time elapsed: 0.204 s
09:34:06 [2020-10-20T13:34:06.275Z] nativeObjectVariable(org.eclipse.ease.lang.python.jython.debugger.JythonDebugTest)  Time elapsed: 0.306 s
09:34:06 [2020-10-20T13:34:06.275Z] terminateDebugTargetInSuspendedState(org.eclipse.ease.lang.python.jython.debugger.JythonDebugTest)  Time elapsed: 0.206 s
09:34:06 [2020-10-20T13:34:06.275Z] disconnectStackFrameInSuspendedState(org.eclipse.ease.lang.python.jython.debugger.JythonDebugTest)  Time elapsed: 0.205 s
09:34:06 [2020-10-20T13:34:06.275Z] stepReturnOnProcess(org.eclipse.ease.lang.python.jython.debugger.JythonDebugTest)  Time elapsed: 0.306 s
09:34:06 [2020-10-20T13:34:06.275Z] evaluateWatchExpression(org.eclipse.ease.lang.python.jython.debugger.JythonDebugTest)  Time elapsed: 0.207 s
09:34:06 [2020-10-20T13:34:06.275Z] 
09:34:06 [2020-10-20T13:34:06.275Z] Results:
09:34:06 [2020-10-20T13:34:06.275Z] 
09:34:06 [2020-10-20T13:34:06.275Z] Tests run: 42, Failures: 0, Errors: 0, Skipped: 0
09:34:06 [2020-10-20T13:34:06.275Z] 
09:34:07 [2020-10-20T13:34:07.202Z] [INFO] All tests passed!
09:34:07 [2020-10-20T13:34:07.202Z] [INFO] 
09:34:07 [2020-10-20T13:34:07.202Z] [INFO] --- maven-install-plugin:2.3.1:install (default-install) @ org.eclipse.ease.lang.python.jython.test ---
09:34:07 [2020-10-20T13:34:07.202Z] [INFO] Installing /home/jenkins/agent/workspace/ease.verify.core.target.2019-06/tests/org.eclipse.ease.lang.python.jython.test/target/org.eclipse.ease.lang.python.jython.test-0.8.0-SNAPSHOT.jar to /home/jenkins/.m2/repository/org/eclipse/ease/org.eclipse.ease.lang.python.jython.test/0.8.0-SNAPSHOT/org.eclipse.ease.lang.python.jython.test-0.8.0-SNAPSHOT.jar
09:34:07 [2020-10-20T13:34:07.202Z] [INFO] Installing /home/jenkins/agent/workspace/ease.verify.core.target.2019-06/tests/org.eclipse.ease.lang.python.jython.test/pom.xml to /home/jenkins/.m2/repository/org/eclipse/ease/org.eclipse.ease.lang.python.jython.test/0.8.0-SNAPSHOT/org.eclipse.ease.lang.python.jython.test-0.8.0-SNAPSHOT.pom
09:34:07 [2020-10-20T13:34:07.202Z] [INFO] Installing /home/jenkins/agent/workspace/ease.verify.core.target.2019-06/tests/org.eclipse.ease.lang.python.jython.test/target/org.eclipse.ease.lang.python.jython.test-0.8.0-SNAPSHOT-sources.jar to /home/jenkins/.m2/repository/org/eclipse/ease/org.eclipse.ease.lang.python.jython.test/0.8.0-SNAPSHOT/org.eclipse.ease.lang.python.jython.test-0.8.0-SNAPSHOT-sources.jar
09:34:07 [2020-10-20T13:34:07.202Z] [INFO] Installing /home/jenkins/agent/workspace/ease.verify.core.target.2019-06/tests/org.eclipse.ease.lang.python.jython.test/target/p2content.xml to /home/jenkins/.m2/repository/org/eclipse/ease/org.eclipse.ease.lang.python.jython.test/0.8.0-SNAPSHOT/org.eclipse.ease.lang.python.jython.test-0.8.0-SNAPSHOT-p2metadata.xml
09:34:07 [2020-10-20T13:34:07.202Z] [INFO] Installing /home/jenkins/agent/workspace/ease.verify.core.target.2019-06/tests/org.eclipse.ease.lang.python.jython.test/target/p2artifacts.xml to /home/jenkins/.m2/repository/org/eclipse/ease/org.eclipse.ease.lang.python.jython.test/0.8.0-SNAPSHOT/org.eclipse.ease.lang.python.jython.test-0.8.0-SNAPSHOT-p2artifacts.xml
09:34:07 [2020-10-20T13:34:07.202Z] [INFO] Installing /home/jenkins/agent/workspace/ease.verify.core.target.2019-06/tests/org.eclipse.ease.lang.python.jython.test/target/p2content.xml to /home/jenkins/.m2/repository/org/eclipse/ease/org.eclipse.ease.lang.python.jython.test/0.8.0-SNAPSHOT/org.eclipse.ease.lang.python.jython.test-0.8.0-SNAPSHOT-p2metadata.xml
09:34:07 [2020-10-20T13:34:07.202Z] [INFO] Installing /home/jenkins/agent/workspace/ease.verify.core.target.2019-06/tests/org.eclipse.ease.lang.python.jython.test/target/p2artifacts.xml to /home/jenkins/.m2/repository/org/eclipse/ease/org.eclipse.ease.lang.python.jython.test/0.8.0-SNAPSHOT/org.eclipse.ease.lang.python.jython.test-0.8.0-SNAPSHOT-p2artifacts.xml
09:34:07 [2020-10-20T13:34:07.202Z] [INFO] 
09:34:07 [2020-10-20T13:34:07.202Z] [INFO] --- tycho-p2-plugin:1.5.0:update-local-index (default-update-local-index) @ org.eclipse.ease.lang.python.jython.test ---
09:34:07 [2020-10-20T13:34:07.202Z] [INFO] 
09:34:07 [2020-10-20T13:34:07.202Z] [INFO] -----< org.eclipse.ease:org.eclipse.ease.lang.scriptarchive.test >------
09:34:07 [2020-10-20T13:34:07.202Z] [INFO] Building org.eclipse.ease.lang.scriptarchive.test 0.8.0-SNAPSHOT [44/48]
09:34:07 [2020-10-20T13:34:07.202Z] [INFO] ------------------------[ eclipse-test-plugin ]-------------------------
09:34:07 [2020-10-20T13:34:07.202Z] [INFO] 
09:34:07 [2020-10-20T13:34:07.202Z] [INFO] --- maven-clean-plugin:2.5:clean (default-clean) @ org.eclipse.ease.lang.scriptarchive.test ---
09:34:07 [2020-10-20T13:34:07.202Z] [INFO] 
09:34:07 [2020-10-20T13:34:07.202Z] [INFO] --- tycho-packaging-plugin:1.5.0:build-qualifier (default-build-qualifier) @ org.eclipse.ease.lang.scriptarchive.test ---
09:34:07 [2020-10-20T13:34:07.202Z] [INFO] The project's OSGi version is 0.8.0.I201910171213
09:34:07 [2020-10-20T13:34:07.202Z] [INFO] 
09:34:07 [2020-10-20T13:34:07.202Z] [INFO] --- tycho-packaging-plugin:1.5.0:validate-id (default-validate-id) @ org.eclipse.ease.lang.scriptarchive.test ---
09:34:07 [2020-10-20T13:34:07.202Z] [INFO] 
09:34:07 [2020-10-20T13:34:07.202Z] [INFO] --- tycho-packaging-plugin:1.5.0:validate-version (default-validate-version) @ org.eclipse.ease.lang.scriptarchive.test ---
09:34:07 [2020-10-20T13:34:07.202Z] [INFO] 
09:34:07 [2020-10-20T13:34:07.202Z] [INFO] >>> maven-javadoc-plugin:2.9.1:javadoc (build-docs) > generate-sources @ org.eclipse.ease.lang.scriptarchive.test >>>
09:34:07 [2020-10-20T13:34:07.202Z] [INFO] 
09:34:07 [2020-10-20T13:34:07.202Z] [INFO] --- tycho-packaging-plugin:1.5.0:build-qualifier (default-build-qualifier) @ org.eclipse.ease.lang.scriptarchive.test ---
09:34:07 [2020-10-20T13:34:07.202Z] [INFO] The project's OSGi version is 0.8.0.I201910171213
09:34:07 [2020-10-20T13:34:07.202Z] [INFO] 
09:34:07 [2020-10-20T13:34:07.202Z] [INFO] --- tycho-packaging-plugin:1.5.0:validate-id (default-validate-id) @ org.eclipse.ease.lang.scriptarchive.test ---
09:34:07 [2020-10-20T13:34:07.202Z] [INFO] 
09:34:07 [2020-10-20T13:34:07.202Z] [INFO] --- tycho-packaging-plugin:1.5.0:validate-version (default-validate-version) @ org.eclipse.ease.lang.scriptarchive.test ---
09:34:07 [2020-10-20T13:34:07.203Z] [INFO] 
09:34:07 [2020-10-20T13:34:07.203Z] [INFO] <<< maven-javadoc-plugin:2.9.1:javadoc (build-docs) < generate-sources @ org.eclipse.ease.lang.scriptarchive.test <<<
09:34:07 [2020-10-20T13:34:07.203Z] [INFO] 
09:34:07 [2020-10-20T13:34:07.203Z] [INFO] 
09:34:07 [2020-10-20T13:34:07.203Z] [INFO] --- maven-javadoc-plugin:2.9.1:javadoc (build-docs) @ org.eclipse.ease.lang.scriptarchive.test ---
09:34:07 [2020-10-20T13:34:07.203Z] [ERROR] Error fetching link: http://help.eclipse.org/oxygen/topic/org.eclipse.platform.doc.isv/reference/api/package-list. Ignored it.
09:34:07 [2020-10-20T13:34:07.203Z] [ERROR] Error fetching link: https://ci.eclipse.org/ease/job/ease.build.core/JavaDoc/package-list. Ignored it.
09:34:08 [2020-10-20T13:34:08.148Z] [INFO] 
09:34:08 [2020-10-20T13:34:08.148Z] Loading source files for package org.eclipse.ease.lang.scriptarchive...
09:34:08 [2020-10-20T13:34:08.148Z] Constructing Javadoc information...
09:34:08 [2020-10-20T13:34:08.148Z] WARNING: Cannot open location "/home/jenkins/agent/workspace/ease.verify.core.target.2019-06/tests/org.eclipse.ease.lang.scriptarchive.test/target/javadoc-bundle-options/package-list"
09:34:08 [2020-10-20T13:34:08.148Z] No plugin definition found, skipping
09:34:08 [2020-10-20T13:34:08.148Z] No plugin definition found, skipping
09:34:08 [2020-10-20T13:34:08.148Z] [WARNING] Javadoc Warnings
09:34:08 [2020-10-20T13:34:08.148Z] [WARNING] Picked up JAVA_TOOL_OPTIONS: -Dmaven.ext.class.path="/home/jenkins/agent/workspace/ease.verify.core.target.2019-06@tmp/withMaven4b7189ce/pipeline-maven-spy.jar" -Dorg.jenkinsci.plugins.pipeline.maven.reportsFolder="/home/jenkins/agent/workspace/ease.verify.core.target.2019-06@tmp/withMaven4b7189ce"
09:34:08 [2020-10-20T13:34:08.148Z] [WARNING] javadoc: warning - The old Doclet and Taglet APIs in the packages
09:34:08 [2020-10-20T13:34:08.148Z] [WARNING] com.sun.javadoc, com.sun.tools.doclets and their implementations
09:34:08 [2020-10-20T13:34:08.148Z] [WARNING] are planned to be removed in a future JDK release. These
09:34:08 [2020-10-20T13:34:08.148Z] [WARNING] components have been superseded by the new APIs in jdk.javadoc.doclet.
09:34:08 [2020-10-20T13:34:08.148Z] [WARNING] Users are strongly recommended to migrate to the new APIs.
09:34:08 [2020-10-20T13:34:08.148Z] [INFO] 
09:34:08 [2020-10-20T13:34:08.148Z] [INFO] --- build-helper-maven-plugin:1.9.1:add-resource (add_help) @ org.eclipse.ease.lang.scriptarchive.test ---
09:34:08 [2020-10-20T13:34:08.148Z] [INFO] 
09:34:08 [2020-10-20T13:34:08.148Z] [INFO] --- maven-resources-plugin:2.4.3:resources (default-resources) @ org.eclipse.ease.lang.scriptarchive.test ---
09:34:08 [2020-10-20T13:34:08.148Z] [INFO] Using 'UTF-8' encoding to copy filtered resources.
09:34:08 [2020-10-20T13:34:08.148Z] [INFO] skip non existing resourceDirectory /home/jenkins/agent/workspace/ease.verify.core.target.2019-06/tests/org.eclipse.ease.lang.scriptarchive.test/src/main/resources
09:34:08 [2020-10-20T13:34:08.148Z] [INFO] skip non existing resourceDirectory /home/jenkins/agent/workspace/ease.verify.core.target.2019-06/tests/org.eclipse.ease.lang.scriptarchive.test/help
09:34:08 [2020-10-20T13:34:08.148Z] [INFO] 
09:34:08 [2020-10-20T13:34:08.148Z] [INFO] --- tycho-compiler-plugin:1.5.0:compile (default-compile) @ org.eclipse.ease.lang.scriptarchive.test ---
09:34:08 [2020-10-20T13:34:08.148Z] [INFO] Compiling 1 source file to /home/jenkins/agent/workspace/ease.verify.core.target.2019-06/tests/org.eclipse.ease.lang.scriptarchive.test/target/classes
09:34:08 [2020-10-20T13:34:08.404Z] [INFO] 
09:34:08 [2020-10-20T13:34:08.404Z] [INFO] --- maven-resources-plugin:2.4.3:testResources (default-testResources) @ org.eclipse.ease.lang.scriptarchive.test ---
09:34:08 [2020-10-20T13:34:08.404Z] [INFO] Using 'UTF-8' encoding to copy filtered resources.
09:34:08 [2020-10-20T13:34:08.404Z] [INFO] skip non existing resourceDirectory /home/jenkins/agent/workspace/ease.verify.core.target.2019-06/tests/org.eclipse.ease.lang.scriptarchive.test/src/test/resources
09:34:08 [2020-10-20T13:34:08.404Z] [INFO] 
09:34:08 [2020-10-20T13:34:08.404Z] [INFO] --- tycho-source-plugin:1.5.0:plugin-source (plugin-source) @ org.eclipse.ease.lang.scriptarchive.test ---
09:34:08 [2020-10-20T13:34:08.404Z] [INFO] Building jar: /home/jenkins/agent/workspace/ease.verify.core.target.2019-06/tests/org.eclipse.ease.lang.scriptarchive.test/target/org.eclipse.ease.lang.scriptarchive.test-0.8.0-SNAPSHOT-sources.jar
09:34:08 [2020-10-20T13:34:08.404Z] [INFO] 
09:34:08 [2020-10-20T13:34:08.404Z] [INFO] --- target-platform-configuration:1.5.0:target-platform (default-target-platform) @ org.eclipse.ease.lang.scriptarchive.test ---
09:34:08 [2020-10-20T13:34:08.404Z] [INFO] 
09:34:08 [2020-10-20T13:34:08.404Z] [INFO] --- tycho-packaging-plugin:1.5.0:package-plugin (default-package-plugin) @ org.eclipse.ease.lang.scriptarchive.test ---
09:34:08 [2020-10-20T13:34:08.404Z] [INFO] Building jar: /home/jenkins/agent/workspace/ease.verify.core.target.2019-06/tests/org.eclipse.ease.lang.scriptarchive.test/target/org.eclipse.ease.lang.scriptarchive.test-0.8.0-SNAPSHOT.jar
09:34:08 [2020-10-20T13:34:08.404Z] [INFO] 
09:34:08 [2020-10-20T13:34:08.404Z] [INFO] --- tycho-p2-plugin:1.5.0:p2-metadata-default (default-p2-metadata-default) @ org.eclipse.ease.lang.scriptarchive.test ---
09:34:08 [2020-10-20T13:34:08.404Z] [INFO] 
09:34:08 [2020-10-20T13:34:08.404Z] [INFO] --- tycho-source-feature-plugin:1.5.0:source-feature (source-feature) @ org.eclipse.ease.lang.scriptarchive.test ---
09:34:08 [2020-10-20T13:34:08.404Z] [INFO] 
09:34:08 [2020-10-20T13:34:08.404Z] [INFO] --- tycho-p2-plugin:1.5.0:p2-metadata (attached-p2-metadata) @ org.eclipse.ease.lang.scriptarchive.test ---
09:34:08 [2020-10-20T13:34:08.404Z] [INFO] 
09:34:08 [2020-10-20T13:34:08.404Z] [INFO] --- tycho-surefire-plugin:1.5.0:test (default-test) @ org.eclipse.ease.lang.scriptarchive.test ---
09:34:08 [2020-10-20T13:34:08.404Z] [INFO] Expected eclipse log file: /home/jenkins/agent/workspace/ease.verify.core.target.2019-06/tests/org.eclipse.ease.lang.scriptarchive.test/target/work/data/.metadata/.log
09:34:08 [2020-10-20T13:34:08.404Z] [INFO] Command line:
09:34:08 [2020-10-20T13:34:08.404Z] 	[/opt/tools/java/openjdk/jdk-11/11.0.2+9/bin/java, -Dosgi.noShutdown=false, -Dosgi.os=linux, -Dosgi.ws=gtk, -Dosgi.arch=x86_64, -Dosgi.clean=true, -jar, /home/jenkins/.m2/repository/p2/osgi/bundle/org.eclipse.equinox.launcher/1.5.800.v20200727-1323/org.eclipse.equinox.launcher-1.5.800.v20200727-1323.jar, -data, /home/jenkins/agent/workspace/ease.verify.core.target.2019-06/tests/org.eclipse.ease.lang.scriptarchive.test/target/work/data, -install, /home/jenkins/agent/workspace/ease.verify.core.target.2019-06/tests/org.eclipse.ease.lang.scriptarchive.test/target/work, -configuration, /home/jenkins/agent/workspace/ease.verify.core.target.2019-06/tests/org.eclipse.ease.lang.scriptarchive.test/target/work/configuration, -application, org.eclipse.tycho.surefire.osgibooter.headlesstest, -testproperties, /home/jenkins/agent/workspace/ease.verify.core.target.2019-06/tests/org.eclipse.ease.lang.scriptarchive.test/target/surefire.properties]
09:34:08 [2020-10-20T13:34:08.404Z] Picked up JAVA_TOOL_OPTIONS: -Dmaven.ext.class.path="/home/jenkins/agent/workspace/ease.verify.core.target.2019-06@tmp/withMaven4b7189ce/pipeline-maven-spy.jar" -Dorg.jenkinsci.plugins.pipeline.maven.reportsFolder="/home/jenkins/agent/workspace/ease.verify.core.target.2019-06@tmp/withMaven4b7189ce" 
09:34:10 [2020-10-20T13:34:10.344Z] Running org.eclipse.ease.lang.scriptarchive.ArchiveEngineTest
09:34:10 [2020-10-20T13:34:10.599Z] We are running from a zip file!
09:34:10 [2020-10-20T13:34:10.599Z] org.eclipse.ease.ScriptExecutionException: SyntaxError: missing ; before statement (workspace://__EASE_ScriptArchive_1/scripts/Master.js#3)
09:34:10 [2020-10-20T13:34:10.599Z] this is an error
09:34:10 [2020-10-20T13:34:10.599Z]        ^
09:34:10 [2020-10-20T13:34:10.599Z] 	at Master.js,workspace://__EASE_ScriptArchive_1/scripts/Master.js
09:34:10 [2020-10-20T13:34:10.599Z] org.eclipse.ease.ScriptExecutionException: SyntaxError: missing ; before statement (workspace://__EASE_ScriptArchive_1/scripts/Master.js#3)
09:34:10 [2020-10-20T13:34:10.599Z] this is an error
09:34:10 [2020-10-20T13:34:10.599Z]        ^
09:34:10 [2020-10-20T13:34:10.599Z] 	at Master.js,workspace://__EASE_ScriptArchive_1/scripts/Master.js
09:34:10 [2020-10-20T13:34:10.599Z] Tests run: 7, Failures: 0, Errors: 0, Skipped: 0, Time elapsed: 0.405 s - in org.eclipse.ease.lang.scriptarchive.ArchiveEngineTest
09:34:10 [2020-10-20T13:34:10.599Z] executeWithManifest(org.eclipse.ease.lang.scriptarchive.ArchiveEngineTest)  Time elapsed: 0.283 s
09:34:10 [2020-10-20T13:34:10.599Z] zipFileRegistration(org.eclipse.ease.lang.scriptarchive.ArchiveEngineTest)  Time elapsed: 0.005 s
09:34:10 [2020-10-20T13:34:10.599Z] engineIdRegistration(org.eclipse.ease.lang.scriptarchive.ArchiveEngineTest)  Time elapsed: 0 s
09:34:10 [2020-10-20T13:34:10.599Z] jarFileRegistration(org.eclipse.ease.lang.scriptarchive.ArchiveEngineTest)  Time elapsed: 0 s
09:34:10 [2020-10-20T13:34:10.599Z] sarFileRegistration(org.eclipse.ease.lang.scriptarchive.ArchiveEngineTest)  Time elapsed: 0 s
09:34:10 [2020-10-20T13:34:10.599Z] executeWithErrors(org.eclipse.ease.lang.scriptarchive.ArchiveEngineTest)  Time elapsed: 0.041 s
09:34:10 [2020-10-20T13:34:10.599Z] executeWithIncludes(org.eclipse.ease.lang.scriptarchive.ArchiveEngineTest)  Time elapsed: 0.054 s
09:34:10 [2020-10-20T13:34:10.599Z] 
09:34:10 [2020-10-20T13:34:10.599Z] Results:
09:34:10 [2020-10-20T13:34:10.599Z] 
09:34:10 [2020-10-20T13:34:10.599Z] Tests run: 7, Failures: 0, Errors: 0, Skipped: 0
09:34:10 [2020-10-20T13:34:10.599Z] 
09:34:11 [2020-10-20T13:34:11.160Z] [INFO] All tests passed!
09:34:11 [2020-10-20T13:34:11.160Z] [INFO] 
09:34:11 [2020-10-20T13:34:11.160Z] [INFO] --- maven-install-plugin:2.3.1:install (default-install) @ org.eclipse.ease.lang.scriptarchive.test ---
09:34:11 [2020-10-20T13:34:11.160Z] [INFO] Installing /home/jenkins/agent/workspace/ease.verify.core.target.2019-06/tests/org.eclipse.ease.lang.scriptarchive.test/target/org.eclipse.ease.lang.scriptarchive.test-0.8.0-SNAPSHOT.jar to /home/jenkins/.m2/repository/org/eclipse/ease/org.eclipse.ease.lang.scriptarchive.test/0.8.0-SNAPSHOT/org.eclipse.ease.lang.scriptarchive.test-0.8.0-SNAPSHOT.jar
09:34:11 [2020-10-20T13:34:11.160Z] [INFO] Installing /home/jenkins/agent/workspace/ease.verify.core.target.2019-06/tests/org.eclipse.ease.lang.scriptarchive.test/pom.xml to /home/jenkins/.m2/repository/org/eclipse/ease/org.eclipse.ease.lang.scriptarchive.test/0.8.0-SNAPSHOT/org.eclipse.ease.lang.scriptarchive.test-0.8.0-SNAPSHOT.pom
09:34:11 [2020-10-20T13:34:11.160Z] [INFO] Installing /home/jenkins/agent/workspace/ease.verify.core.target.2019-06/tests/org.eclipse.ease.lang.scriptarchive.test/target/org.eclipse.ease.lang.scriptarchive.test-0.8.0-SNAPSHOT-sources.jar to /home/jenkins/.m2/repository/org/eclipse/ease/org.eclipse.ease.lang.scriptarchive.test/0.8.0-SNAPSHOT/org.eclipse.ease.lang.scriptarchive.test-0.8.0-SNAPSHOT-sources.jar
09:34:11 [2020-10-20T13:34:11.160Z] [INFO] Installing /home/jenkins/agent/workspace/ease.verify.core.target.2019-06/tests/org.eclipse.ease.lang.scriptarchive.test/target/p2content.xml to /home/jenkins/.m2/repository/org/eclipse/ease/org.eclipse.ease.lang.scriptarchive.test/0.8.0-SNAPSHOT/org.eclipse.ease.lang.scriptarchive.test-0.8.0-SNAPSHOT-p2metadata.xml
09:34:11 [2020-10-20T13:34:11.160Z] [INFO] Installing /home/jenkins/agent/workspace/ease.verify.core.target.2019-06/tests/org.eclipse.ease.lang.scriptarchive.test/target/p2artifacts.xml to /home/jenkins/.m2/repository/org/eclipse/ease/org.eclipse.ease.lang.scriptarchive.test/0.8.0-SNAPSHOT/org.eclipse.ease.lang.scriptarchive.test-0.8.0-SNAPSHOT-p2artifacts.xml
09:34:11 [2020-10-20T13:34:11.160Z] [INFO] Installing /home/jenkins/agent/workspace/ease.verify.core.target.2019-06/tests/org.eclipse.ease.lang.scriptarchive.test/target/p2content.xml to /home/jenkins/.m2/repository/org/eclipse/ease/org.eclipse.ease.lang.scriptarchive.test/0.8.0-SNAPSHOT/org.eclipse.ease.lang.scriptarchive.test-0.8.0-SNAPSHOT-p2metadata.xml
09:34:11 [2020-10-20T13:34:11.160Z] [INFO] Installing /home/jenkins/agent/workspace/ease.verify.core.target.2019-06/tests/org.eclipse.ease.lang.scriptarchive.test/target/p2artifacts.xml to /home/jenkins/.m2/repository/org/eclipse/ease/org.eclipse.ease.lang.scriptarchive.test/0.8.0-SNAPSHOT/org.eclipse.ease.lang.scriptarchive.test-0.8.0-SNAPSHOT-p2artifacts.xml
09:34:11 [2020-10-20T13:34:11.160Z] [INFO] 
09:34:11 [2020-10-20T13:34:11.160Z] [INFO] --- tycho-p2-plugin:1.5.0:update-local-index (default-update-local-index) @ org.eclipse.ease.lang.scriptarchive.test ---
09:34:11 [2020-10-20T13:34:11.160Z] [INFO] 
09:34:11 [2020-10-20T13:34:11.160Z] [INFO] --------< org.eclipse.ease:org.eclipse.ease.lang.unittest.test >--------
09:34:11 [2020-10-20T13:34:11.160Z] [INFO] Building org.eclipse.ease.lang.unittest.test 0.8.0-SNAPSHOT      [45/48]
09:34:11 [2020-10-20T13:34:11.160Z] [INFO] ------------------------[ eclipse-test-plugin ]-------------------------
09:34:11 [2020-10-20T13:34:11.160Z] [INFO] 
09:34:11 [2020-10-20T13:34:11.160Z] [INFO] --- maven-clean-plugin:2.5:clean (default-clean) @ org.eclipse.ease.lang.unittest.test ---
09:34:11 [2020-10-20T13:34:11.160Z] [INFO] 
09:34:11 [2020-10-20T13:34:11.160Z] [INFO] --- tycho-packaging-plugin:1.5.0:build-qualifier (default-build-qualifier) @ org.eclipse.ease.lang.unittest.test ---
09:34:11 [2020-10-20T13:34:11.160Z] [INFO] The project's OSGi version is 0.8.0.I202009240747
09:34:11 [2020-10-20T13:34:11.160Z] [INFO] 
09:34:11 [2020-10-20T13:34:11.160Z] [INFO] --- tycho-packaging-plugin:1.5.0:validate-id (default-validate-id) @ org.eclipse.ease.lang.unittest.test ---
09:34:11 [2020-10-20T13:34:11.160Z] [INFO] 
09:34:11 [2020-10-20T13:34:11.160Z] [INFO] --- tycho-packaging-plugin:1.5.0:validate-version (default-validate-version) @ org.eclipse.ease.lang.unittest.test ---
09:34:11 [2020-10-20T13:34:11.160Z] [INFO] 
09:34:11 [2020-10-20T13:34:11.160Z] [INFO] >>> maven-javadoc-plugin:2.9.1:javadoc (build-docs) > generate-sources @ org.eclipse.ease.lang.unittest.test >>>
09:34:11 [2020-10-20T13:34:11.160Z] [INFO] 
09:34:11 [2020-10-20T13:34:11.160Z] [INFO] --- tycho-packaging-plugin:1.5.0:build-qualifier (default-build-qualifier) @ org.eclipse.ease.lang.unittest.test ---
09:34:11 [2020-10-20T13:34:11.160Z] [INFO] The project's OSGi version is 0.8.0.I202009240747
09:34:11 [2020-10-20T13:34:11.160Z] [INFO] 
09:34:11 [2020-10-20T13:34:11.160Z] [INFO] --- tycho-packaging-plugin:1.5.0:validate-id (default-validate-id) @ org.eclipse.ease.lang.unittest.test ---
09:34:11 [2020-10-20T13:34:11.160Z] [INFO] 
09:34:11 [2020-10-20T13:34:11.161Z] [INFO] --- tycho-packaging-plugin:1.5.0:validate-version (default-validate-version) @ org.eclipse.ease.lang.unittest.test ---
09:34:11 [2020-10-20T13:34:11.161Z] [INFO] 
09:34:11 [2020-10-20T13:34:11.161Z] [INFO] <<< maven-javadoc-plugin:2.9.1:javadoc (build-docs) < generate-sources @ org.eclipse.ease.lang.unittest.test <<<
09:34:11 [2020-10-20T13:34:11.161Z] [INFO] 
09:34:11 [2020-10-20T13:34:11.161Z] [INFO] 
09:34:11 [2020-10-20T13:34:11.161Z] [INFO] --- maven-javadoc-plugin:2.9.1:javadoc (build-docs) @ org.eclipse.ease.lang.unittest.test ---
09:34:11 [2020-10-20T13:34:11.416Z] [ERROR] Error fetching link: http://help.eclipse.org/oxygen/topic/org.eclipse.platform.doc.isv/reference/api/package-list. Ignored it.
09:34:11 [2020-10-20T13:34:11.416Z] [ERROR] Error fetching link: https://ci.eclipse.org/ease/job/ease.build.core/JavaDoc/package-list. Ignored it.
09:34:12 [2020-10-20T13:34:12.353Z] [INFO] 
09:34:12 [2020-10-20T13:34:12.353Z] Loading source files for package org.eclipse.ease.lang.unittest...
09:34:12 [2020-10-20T13:34:12.353Z] Constructing Javadoc information...
09:34:12 [2020-10-20T13:34:12.353Z] WARNING: Cannot open location "/home/jenkins/agent/workspace/ease.verify.core.target.2019-06/tests/org.eclipse.ease.lang.unittest.test/target/javadoc-bundle-options/package-list"
09:34:12 [2020-10-20T13:34:12.353Z] No plugin definition found, skipping
09:34:12 [2020-10-20T13:34:12.353Z] No plugin definition found, skipping
09:34:12 [2020-10-20T13:34:12.353Z] [WARNING] Javadoc Warnings
09:34:12 [2020-10-20T13:34:12.353Z] [WARNING] Picked up JAVA_TOOL_OPTIONS: -Dmaven.ext.class.path="/home/jenkins/agent/workspace/ease.verify.core.target.2019-06@tmp/withMaven4b7189ce/pipeline-maven-spy.jar" -Dorg.jenkinsci.plugins.pipeline.maven.reportsFolder="/home/jenkins/agent/workspace/ease.verify.core.target.2019-06@tmp/withMaven4b7189ce"
09:34:12 [2020-10-20T13:34:12.353Z] [WARNING] javadoc: warning - The old Doclet and Taglet APIs in the packages
09:34:12 [2020-10-20T13:34:12.353Z] [WARNING] com.sun.javadoc, com.sun.tools.doclets and their implementations
09:34:12 [2020-10-20T13:34:12.353Z] [WARNING] are planned to be removed in a future JDK release. These
09:34:12 [2020-10-20T13:34:12.353Z] [WARNING] components have been superseded by the new APIs in jdk.javadoc.doclet.
09:34:12 [2020-10-20T13:34:12.353Z] [WARNING] Users are strongly recommended to migrate to the new APIs.
09:34:12 [2020-10-20T13:34:12.353Z] [INFO] 
09:34:12 [2020-10-20T13:34:12.353Z] [INFO] --- build-helper-maven-plugin:1.9.1:add-resource (add_help) @ org.eclipse.ease.lang.unittest.test ---
09:34:12 [2020-10-20T13:34:12.353Z] [INFO] 
09:34:12 [2020-10-20T13:34:12.353Z] [INFO] --- maven-resources-plugin:2.4.3:resources (default-resources) @ org.eclipse.ease.lang.unittest.test ---
09:34:12 [2020-10-20T13:34:12.353Z] [INFO] Using 'UTF-8' encoding to copy filtered resources.
09:34:12 [2020-10-20T13:34:12.353Z] [INFO] skip non existing resourceDirectory /home/jenkins/agent/workspace/ease.verify.core.target.2019-06/tests/org.eclipse.ease.lang.unittest.test/src/main/resources
09:34:12 [2020-10-20T13:34:12.353Z] [INFO] skip non existing resourceDirectory /home/jenkins/agent/workspace/ease.verify.core.target.2019-06/tests/org.eclipse.ease.lang.unittest.test/help
09:34:12 [2020-10-20T13:34:12.353Z] [INFO] 
09:34:12 [2020-10-20T13:34:12.353Z] [INFO] --- tycho-compiler-plugin:1.5.0:compile (default-compile) @ org.eclipse.ease.lang.unittest.test ---
09:34:12 [2020-10-20T13:34:12.353Z] [INFO] Compiling 3 source files to /home/jenkins/agent/workspace/ease.verify.core.target.2019-06/tests/org.eclipse.ease.lang.unittest.test/target/classes
09:34:12 [2020-10-20T13:34:12.609Z] [INFO] 
09:34:12 [2020-10-20T13:34:12.609Z] [INFO] --- maven-resources-plugin:2.4.3:testResources (default-testResources) @ org.eclipse.ease.lang.unittest.test ---
09:34:12 [2020-10-20T13:34:12.609Z] [INFO] Using 'UTF-8' encoding to copy filtered resources.
09:34:12 [2020-10-20T13:34:12.609Z] [INFO] skip non existing resourceDirectory /home/jenkins/agent/workspace/ease.verify.core.target.2019-06/tests/org.eclipse.ease.lang.unittest.test/src/test/resources
09:34:12 [2020-10-20T13:34:12.609Z] [INFO] 
09:34:12 [2020-10-20T13:34:12.609Z] [INFO] --- tycho-source-plugin:1.5.0:plugin-source (plugin-source) @ org.eclipse.ease.lang.unittest.test ---
09:34:12 [2020-10-20T13:34:12.609Z] [WARNING] Bundle-Name header not found in /home/jenkins/agent/workspace/ease.verify.core.target.2019-06/tests/org.eclipse.ease.lang.unittest.test/META-INF/MANIFEST.MF, fallback to Bundle-SymbolicName for source bundle
09:34:12 [2020-10-20T13:34:12.609Z] [WARNING] Bundle-Vendor header not found in /home/jenkins/agent/workspace/ease.verify.core.target.2019-06/tests/org.eclipse.ease.lang.unittest.test/META-INF/MANIFEST.MF, fallback to 'unknown' for source bundle
09:34:12 [2020-10-20T13:34:12.609Z] [INFO] Building jar: /home/jenkins/agent/workspace/ease.verify.core.target.2019-06/tests/org.eclipse.ease.lang.unittest.test/target/org.eclipse.ease.lang.unittest.test-0.8.0-SNAPSHOT-sources.jar
09:34:12 [2020-10-20T13:34:12.609Z] [INFO] 
09:34:12 [2020-10-20T13:34:12.610Z] [INFO] --- target-platform-configuration:1.5.0:target-platform (default-target-platform) @ org.eclipse.ease.lang.unittest.test ---
09:34:12 [2020-10-20T13:34:12.610Z] [INFO] 
09:34:12 [2020-10-20T13:34:12.610Z] [INFO] --- tycho-packaging-plugin:1.5.0:package-plugin (default-package-plugin) @ org.eclipse.ease.lang.unittest.test ---
09:34:12 [2020-10-20T13:34:12.610Z] [INFO] Building jar: /home/jenkins/agent/workspace/ease.verify.core.target.2019-06/tests/org.eclipse.ease.lang.unittest.test/target/org.eclipse.ease.lang.unittest.test-0.8.0-SNAPSHOT.jar
09:34:12 [2020-10-20T13:34:12.610Z] [INFO] 
09:34:12 [2020-10-20T13:34:12.610Z] [INFO] --- tycho-p2-plugin:1.5.0:p2-metadata-default (default-p2-metadata-default) @ org.eclipse.ease.lang.unittest.test ---
09:34:12 [2020-10-20T13:34:12.610Z] [INFO] 
09:34:12 [2020-10-20T13:34:12.610Z] [INFO] --- tycho-source-feature-plugin:1.5.0:source-feature (source-feature) @ org.eclipse.ease.lang.unittest.test ---
09:34:12 [2020-10-20T13:34:12.610Z] [INFO] 
09:34:12 [2020-10-20T13:34:12.610Z] [INFO] --- tycho-p2-plugin:1.5.0:p2-metadata (attached-p2-metadata) @ org.eclipse.ease.lang.unittest.test ---
09:34:12 [2020-10-20T13:34:12.610Z] [INFO] 
09:34:12 [2020-10-20T13:34:12.610Z] [INFO] --- tycho-surefire-plugin:1.5.0:test (default-test) @ org.eclipse.ease.lang.unittest.test ---
09:34:12 [2020-10-20T13:34:12.610Z] [INFO] Expected eclipse log file: /home/jenkins/agent/workspace/ease.verify.core.target.2019-06/tests/org.eclipse.ease.lang.unittest.test/target/work/data/.metadata/.log
09:34:12 [2020-10-20T13:34:12.610Z] [INFO] Command line:
09:34:12 [2020-10-20T13:34:12.610Z] 	[/opt/tools/java/openjdk/jdk-11/11.0.2+9/bin/java, -Dosgi.noShutdown=false, -Dosgi.os=linux, -Dosgi.ws=gtk, -Dosgi.arch=x86_64, -Dosgi.clean=true, -jar, /home/jenkins/.m2/repository/p2/osgi/bundle/org.eclipse.equinox.launcher/1.5.800.v20200727-1323/org.eclipse.equinox.launcher-1.5.800.v20200727-1323.jar, -data, /home/jenkins/agent/workspace/ease.verify.core.target.2019-06/tests/org.eclipse.ease.lang.unittest.test/target/work/data, -install, /home/jenkins/agent/workspace/ease.verify.core.target.2019-06/tests/org.eclipse.ease.lang.unittest.test/target/work, -configuration, /home/jenkins/agent/workspace/ease.verify.core.target.2019-06/tests/org.eclipse.ease.lang.unittest.test/target/work/configuration, -application, org.eclipse.tycho.surefire.osgibooter.headlesstest, -testproperties, /home/jenkins/agent/workspace/ease.verify.core.target.2019-06/tests/org.eclipse.ease.lang.unittest.test/target/surefire.properties]
09:34:12 [2020-10-20T13:34:12.610Z] Picked up JAVA_TOOL_OPTIONS: -Dmaven.ext.class.path="/home/jenkins/agent/workspace/ease.verify.core.target.2019-06@tmp/withMaven4b7189ce/pipeline-maven-spy.jar" -Dorg.jenkinsci.plugins.pipeline.maven.reportsFolder="/home/jenkins/agent/workspace/ease.verify.core.target.2019-06@tmp/withMaven4b7189ce" 
09:34:14 [2020-10-20T13:34:14.543Z] Running org.eclipse.ease.lang.unittest.ClassicJavaScriptTest
09:34:16 [2020-10-20T13:34:16.442Z] Tests run: 7, Failures: 0, Errors: 0, Skipped: 0, Time elapsed: 1.438 s - in org.eclipse.ease.lang.unittest.ClassicJavaScriptTest
09:34:16 [2020-10-20T13:34:16.442Z] folderStatus(org.eclipse.ease.lang.unittest.ClassicJavaScriptTest)  Time elapsed: 0.606 s
09:34:16 [2020-10-20T13:34:16.442Z] errorTestStatus(org.eclipse.ease.lang.unittest.ClassicJavaScriptTest)  Time elapsed: 0.194 s
09:34:16 [2020-10-20T13:34:16.442Z] failureTestStatus(org.eclipse.ease.lang.unittest.ClassicJavaScriptTest)  Time elapsed: 0.127 s
09:34:16 [2020-10-20T13:34:16.442Z] verifyOutput(org.eclipse.ease.lang.unittest.ClassicJavaScriptTest)  Time elapsed: 0.116 s
09:34:16 [2020-10-20T13:34:16.442Z] suiteStatus(org.eclipse.ease.lang.unittest.ClassicJavaScriptTest)  Time elapsed: 0.102 s
09:34:16 [2020-10-20T13:34:16.442Z] ignoreTestStatus(org.eclipse.ease.lang.unittest.ClassicJavaScriptTest)  Time elapsed: 0.108 s
09:34:16 [2020-10-20T13:34:16.442Z] passTestStatus(org.eclipse.ease.lang.unittest.ClassicJavaScriptTest)  Time elapsed: 0.097 s
09:34:16 [2020-10-20T13:34:16.442Z] Running org.eclipse.ease.lang.unittest.ModernJavaScriptTest
09:34:17 [2020-10-20T13:34:17.004Z] Tests run: 8, Failures: 0, Errors: 0, Skipped: 0, Time elapsed: 0.855 s - in org.eclipse.ease.lang.unittest.ModernJavaScriptTest
09:34:17 [2020-10-20T13:34:17.004Z] folderStatus(org.eclipse.ease.lang.unittest.ModernJavaScriptTest)  Time elapsed: 0.165 s
09:34:17 [2020-10-20T13:34:17.004Z] verifyOutput(org.eclipse.ease.lang.unittest.ModernJavaScriptTest)  Time elapsed: 0.119 s
09:34:17 [2020-10-20T13:34:17.004Z] suiteStatus(org.eclipse.ease.lang.unittest.ModernJavaScriptTest)  Time elapsed: 0.091 s
09:34:17 [2020-10-20T13:34:17.004Z] ignoreTestStatus(org.eclipse.ease.lang.unittest.ModernJavaScriptTest)  Time elapsed: 0.111 s
09:34:17 [2020-10-20T13:34:17.004Z] ignoreTestClassStatus(org.eclipse.ease.lang.unittest.ModernJavaScriptTest)  Time elapsed: 0.088 s
09:34:17 [2020-10-20T13:34:17.004Z] failureTestClassStatus(org.eclipse.ease.lang.unittest.ModernJavaScriptTest)  Time elapsed: 0.105 s
09:34:17 [2020-10-20T13:34:17.004Z] errorTestClassStatus(org.eclipse.ease.lang.unittest.ModernJavaScriptTest)  Time elapsed: 0.09 s
09:34:17 [2020-10-20T13:34:17.004Z] passTestClassStatus(org.eclipse.ease.lang.unittest.ModernJavaScriptTest)  Time elapsed: 0.084 s
09:34:17 [2020-10-20T13:34:17.004Z] 
09:34:17 [2020-10-20T13:34:17.004Z] Results:
09:34:17 [2020-10-20T13:34:17.004Z] 
09:34:17 [2020-10-20T13:34:17.004Z] Tests run: 15, Failures: 0, Errors: 0, Skipped: 0
09:34:17 [2020-10-20T13:34:17.004Z] 
09:34:17 [2020-10-20T13:34:17.566Z] [INFO] All tests passed!
09:34:17 [2020-10-20T13:34:17.566Z] [INFO] 
09:34:17 [2020-10-20T13:34:17.566Z] [INFO] --- maven-install-plugin:2.3.1:install (default-install) @ org.eclipse.ease.lang.unittest.test ---
09:34:17 [2020-10-20T13:34:17.566Z] [INFO] Installing /home/jenkins/agent/workspace/ease.verify.core.target.2019-06/tests/org.eclipse.ease.lang.unittest.test/target/org.eclipse.ease.lang.unittest.test-0.8.0-SNAPSHOT.jar to /home/jenkins/.m2/repository/org/eclipse/ease/org.eclipse.ease.lang.unittest.test/0.8.0-SNAPSHOT/org.eclipse.ease.lang.unittest.test-0.8.0-SNAPSHOT.jar
09:34:17 [2020-10-20T13:34:17.566Z] [INFO] Installing /home/jenkins/agent/workspace/ease.verify.core.target.2019-06/tests/org.eclipse.ease.lang.unittest.test/pom.xml to /home/jenkins/.m2/repository/org/eclipse/ease/org.eclipse.ease.lang.unittest.test/0.8.0-SNAPSHOT/org.eclipse.ease.lang.unittest.test-0.8.0-SNAPSHOT.pom
09:34:17 [2020-10-20T13:34:17.566Z] [INFO] Installing /home/jenkins/agent/workspace/ease.verify.core.target.2019-06/tests/org.eclipse.ease.lang.unittest.test/target/org.eclipse.ease.lang.unittest.test-0.8.0-SNAPSHOT-sources.jar to /home/jenkins/.m2/repository/org/eclipse/ease/org.eclipse.ease.lang.unittest.test/0.8.0-SNAPSHOT/org.eclipse.ease.lang.unittest.test-0.8.0-SNAPSHOT-sources.jar
09:34:17 [2020-10-20T13:34:17.566Z] [INFO] Installing /home/jenkins/agent/workspace/ease.verify.core.target.2019-06/tests/org.eclipse.ease.lang.unittest.test/target/p2content.xml to /home/jenkins/.m2/repository/org/eclipse/ease/org.eclipse.ease.lang.unittest.test/0.8.0-SNAPSHOT/org.eclipse.ease.lang.unittest.test-0.8.0-SNAPSHOT-p2metadata.xml
09:34:17 [2020-10-20T13:34:17.566Z] [INFO] Installing /home/jenkins/agent/workspace/ease.verify.core.target.2019-06/tests/org.eclipse.ease.lang.unittest.test/target/p2artifacts.xml to /home/jenkins/.m2/repository/org/eclipse/ease/org.eclipse.ease.lang.unittest.test/0.8.0-SNAPSHOT/org.eclipse.ease.lang.unittest.test-0.8.0-SNAPSHOT-p2artifacts.xml
09:34:17 [2020-10-20T13:34:17.567Z] [INFO] Installing /home/jenkins/agent/workspace/ease.verify.core.target.2019-06/tests/org.eclipse.ease.lang.unittest.test/target/p2content.xml to /home/jenkins/.m2/repository/org/eclipse/ease/org.eclipse.ease.lang.unittest.test/0.8.0-SNAPSHOT/org.eclipse.ease.lang.unittest.test-0.8.0-SNAPSHOT-p2metadata.xml
09:34:17 [2020-10-20T13:34:17.567Z] [INFO] Installing /home/jenkins/agent/workspace/ease.verify.core.target.2019-06/tests/org.eclipse.ease.lang.unittest.test/target/p2artifacts.xml to /home/jenkins/.m2/repository/org/eclipse/ease/org.eclipse.ease.lang.unittest.test/0.8.0-SNAPSHOT/org.eclipse.ease.lang.unittest.test-0.8.0-SNAPSHOT-p2artifacts.xml
09:34:17 [2020-10-20T13:34:17.567Z] [INFO] 
09:34:17 [2020-10-20T13:34:17.567Z] [INFO] --- tycho-p2-plugin:1.5.0:update-local-index (default-update-local-index) @ org.eclipse.ease.lang.unittest.test ---
09:34:17 [2020-10-20T13:34:17.567Z] [INFO] 
09:34:17 [2020-10-20T13:34:17.567Z] [INFO] ---------< org.eclipse.ease:org.eclipse.ease.ui.scripts.test >----------
09:34:17 [2020-10-20T13:34:17.567Z] [INFO] Building org.eclipse.ease.ui.scripts.test 0.8.0-SNAPSHOT         [46/48]
09:34:17 [2020-10-20T13:34:17.567Z] [INFO] ------------------------[ eclipse-test-plugin ]-------------------------
09:34:17 [2020-10-20T13:34:17.567Z] [INFO] 
09:34:17 [2020-10-20T13:34:17.567Z] [INFO] --- maven-clean-plugin:2.5:clean (default-clean) @ org.eclipse.ease.ui.scripts.test ---
09:34:17 [2020-10-20T13:34:17.567Z] [INFO] 
09:34:17 [2020-10-20T13:34:17.567Z] [INFO] --- tycho-packaging-plugin:1.5.0:build-qualifier (default-build-qualifier) @ org.eclipse.ease.ui.scripts.test ---
09:34:17 [2020-10-20T13:34:17.567Z] [INFO] The project's OSGi version is 0.8.0.I202009240747
09:34:17 [2020-10-20T13:34:17.567Z] [INFO] 
09:34:17 [2020-10-20T13:34:17.567Z] [INFO] --- tycho-packaging-plugin:1.5.0:validate-id (default-validate-id) @ org.eclipse.ease.ui.scripts.test ---
09:34:17 [2020-10-20T13:34:17.567Z] [INFO] 
09:34:17 [2020-10-20T13:34:17.567Z] [INFO] --- tycho-packaging-plugin:1.5.0:validate-version (default-validate-version) @ org.eclipse.ease.ui.scripts.test ---
09:34:17 [2020-10-20T13:34:17.567Z] [INFO] 
09:34:17 [2020-10-20T13:34:17.567Z] [INFO] >>> maven-javadoc-plugin:2.9.1:javadoc (build-docs) > generate-sources @ org.eclipse.ease.ui.scripts.test >>>
09:34:17 [2020-10-20T13:34:17.567Z] [INFO] 
09:34:17 [2020-10-20T13:34:17.567Z] [INFO] --- tycho-packaging-plugin:1.5.0:build-qualifier (default-build-qualifier) @ org.eclipse.ease.ui.scripts.test ---
09:34:17 [2020-10-20T13:34:17.567Z] [INFO] The project's OSGi version is 0.8.0.I202009240747
09:34:17 [2020-10-20T13:34:17.567Z] [INFO] 
09:34:17 [2020-10-20T13:34:17.567Z] [INFO] --- tycho-packaging-plugin:1.5.0:validate-id (default-validate-id) @ org.eclipse.ease.ui.scripts.test ---
09:34:17 [2020-10-20T13:34:17.567Z] [INFO] 
09:34:17 [2020-10-20T13:34:17.567Z] [INFO] --- tycho-packaging-plugin:1.5.0:validate-version (default-validate-version) @ org.eclipse.ease.ui.scripts.test ---
09:34:17 [2020-10-20T13:34:17.567Z] [INFO] 
09:34:17 [2020-10-20T13:34:17.567Z] [INFO] <<< maven-javadoc-plugin:2.9.1:javadoc (build-docs) < generate-sources @ org.eclipse.ease.ui.scripts.test <<<
09:34:17 [2020-10-20T13:34:17.567Z] [INFO] 
09:34:17 [2020-10-20T13:34:17.567Z] [INFO] 
09:34:17 [2020-10-20T13:34:17.567Z] [INFO] --- maven-javadoc-plugin:2.9.1:javadoc (build-docs) @ org.eclipse.ease.ui.scripts.test ---
09:34:17 [2020-10-20T13:34:17.823Z] [ERROR] Error fetching link: http://help.eclipse.org/oxygen/topic/org.eclipse.platform.doc.isv/reference/api/package-list. Ignored it.
09:34:17 [2020-10-20T13:34:17.823Z] [ERROR] Error fetching link: https://ci.eclipse.org/ease/job/ease.build.core/JavaDoc/package-list. Ignored it.
09:34:18 [2020-10-20T13:34:18.780Z] [INFO] 
09:34:18 [2020-10-20T13:34:18.780Z] Loading source files for package org.eclipse.ease.ui.scripts.expressions.definitions...
09:34:18 [2020-10-20T13:34:18.780Z] Constructing Javadoc information...
09:34:18 [2020-10-20T13:34:18.780Z] WARNING: Cannot open location "/home/jenkins/agent/workspace/ease.verify.core.target.2019-06/tests/org.eclipse.ease.ui.scripts.test/target/javadoc-bundle-options/package-list"
09:34:18 [2020-10-20T13:34:18.780Z] No plugin definition found, skipping
09:34:18 [2020-10-20T13:34:18.780Z] No plugin definition found, skipping
09:34:18 [2020-10-20T13:34:18.780Z] [WARNING] Javadoc Warnings
09:34:18 [2020-10-20T13:34:18.780Z] [WARNING] Picked up JAVA_TOOL_OPTIONS: -Dmaven.ext.class.path="/home/jenkins/agent/workspace/ease.verify.core.target.2019-06@tmp/withMaven4b7189ce/pipeline-maven-spy.jar" -Dorg.jenkinsci.plugins.pipeline.maven.reportsFolder="/home/jenkins/agent/workspace/ease.verify.core.target.2019-06@tmp/withMaven4b7189ce"
09:34:18 [2020-10-20T13:34:18.780Z] [WARNING] javadoc: warning - The old Doclet and Taglet APIs in the packages
09:34:18 [2020-10-20T13:34:18.780Z] [WARNING] com.sun.javadoc, com.sun.tools.doclets and their implementations
09:34:18 [2020-10-20T13:34:18.780Z] [WARNING] are planned to be removed in a future JDK release. These
09:34:18 [2020-10-20T13:34:18.780Z] [WARNING] components have been superseded by the new APIs in jdk.javadoc.doclet.
09:34:18 [2020-10-20T13:34:18.780Z] [WARNING] Users are strongly recommended to migrate to the new APIs.
09:34:18 [2020-10-20T13:34:18.780Z] [INFO] 
09:34:18 [2020-10-20T13:34:18.780Z] [INFO] --- build-helper-maven-plugin:1.9.1:add-resource (add_help) @ org.eclipse.ease.ui.scripts.test ---
09:34:18 [2020-10-20T13:34:18.780Z] [INFO] 
09:34:18 [2020-10-20T13:34:18.780Z] [INFO] --- maven-resources-plugin:2.4.3:resources (default-resources) @ org.eclipse.ease.ui.scripts.test ---
09:34:18 [2020-10-20T13:34:18.780Z] [INFO] Using 'UTF-8' encoding to copy filtered resources.
09:34:18 [2020-10-20T13:34:18.780Z] [INFO] skip non existing resourceDirectory /home/jenkins/agent/workspace/ease.verify.core.target.2019-06/tests/org.eclipse.ease.ui.scripts.test/src/main/resources
09:34:18 [2020-10-20T13:34:18.781Z] [INFO] skip non existing resourceDirectory /home/jenkins/agent/workspace/ease.verify.core.target.2019-06/tests/org.eclipse.ease.ui.scripts.test/help
09:34:18 [2020-10-20T13:34:18.781Z] [INFO] 
09:34:18 [2020-10-20T13:34:18.781Z] [INFO] --- tycho-compiler-plugin:1.5.0:compile (default-compile) @ org.eclipse.ease.ui.scripts.test ---
09:34:18 [2020-10-20T13:34:18.781Z] [INFO] Compiling 1 source file to /home/jenkins/agent/workspace/ease.verify.core.target.2019-06/tests/org.eclipse.ease.ui.scripts.test/target/classes
09:34:18 [2020-10-20T13:34:18.781Z] [INFO] 
09:34:18 [2020-10-20T13:34:18.781Z] [INFO] --- maven-resources-plugin:2.4.3:testResources (default-testResources) @ org.eclipse.ease.ui.scripts.test ---
09:34:18 [2020-10-20T13:34:18.781Z] [INFO] Using 'UTF-8' encoding to copy filtered resources.
09:34:18 [2020-10-20T13:34:18.781Z] [INFO] skip non existing resourceDirectory /home/jenkins/agent/workspace/ease.verify.core.target.2019-06/tests/org.eclipse.ease.ui.scripts.test/src/test/resources
09:34:18 [2020-10-20T13:34:18.781Z] [INFO] 
09:34:18 [2020-10-20T13:34:18.781Z] [INFO] --- tycho-source-plugin:1.5.0:plugin-source (plugin-source) @ org.eclipse.ease.ui.scripts.test ---
09:34:18 [2020-10-20T13:34:18.781Z] [INFO] Building jar: /home/jenkins/agent/workspace/ease.verify.core.target.2019-06/tests/org.eclipse.ease.ui.scripts.test/target/org.eclipse.ease.ui.scripts.test-0.8.0-SNAPSHOT-sources.jar
09:34:18 [2020-10-20T13:34:18.781Z] [INFO] 
09:34:18 [2020-10-20T13:34:18.781Z] [INFO] --- target-platform-configuration:1.5.0:target-platform (default-target-platform) @ org.eclipse.ease.ui.scripts.test ---
09:34:18 [2020-10-20T13:34:18.781Z] [INFO] 
09:34:18 [2020-10-20T13:34:18.781Z] [INFO] --- tycho-packaging-plugin:1.5.0:package-plugin (default-package-plugin) @ org.eclipse.ease.ui.scripts.test ---
09:34:18 [2020-10-20T13:34:18.781Z] [INFO] Building jar: /home/jenkins/agent/workspace/ease.verify.core.target.2019-06/tests/org.eclipse.ease.ui.scripts.test/target/org.eclipse.ease.ui.scripts.test-0.8.0-SNAPSHOT.jar
09:34:18 [2020-10-20T13:34:18.781Z] [INFO] 
09:34:18 [2020-10-20T13:34:18.781Z] [INFO] --- tycho-p2-plugin:1.5.0:p2-metadata-default (default-p2-metadata-default) @ org.eclipse.ease.ui.scripts.test ---
09:34:18 [2020-10-20T13:34:18.781Z] [INFO] 
09:34:18 [2020-10-20T13:34:18.781Z] [INFO] --- tycho-source-feature-plugin:1.5.0:source-feature (source-feature) @ org.eclipse.ease.ui.scripts.test ---
09:34:18 [2020-10-20T13:34:18.781Z] [INFO] 
09:34:18 [2020-10-20T13:34:18.781Z] [INFO] --- tycho-p2-plugin:1.5.0:p2-metadata (attached-p2-metadata) @ org.eclipse.ease.ui.scripts.test ---
09:34:18 [2020-10-20T13:34:18.781Z] [INFO] 
09:34:18 [2020-10-20T13:34:18.781Z] [INFO] --- tycho-surefire-plugin:1.5.0:test (default-test) @ org.eclipse.ease.ui.scripts.test ---
09:34:18 [2020-10-20T13:34:18.781Z] [INFO] Expected eclipse log file: /home/jenkins/agent/workspace/ease.verify.core.target.2019-06/tests/org.eclipse.ease.ui.scripts.test/target/work/data/.metadata/.log
09:34:18 [2020-10-20T13:34:18.781Z] [INFO] Command line:
09:34:18 [2020-10-20T13:34:18.781Z] 	[/opt/tools/java/openjdk/jdk-11/11.0.2+9/bin/java, -Dosgi.noShutdown=false, -Dosgi.os=linux, -Dosgi.ws=gtk, -Dosgi.arch=x86_64, -Dosgi.clean=true, -jar, /home/jenkins/.m2/repository/p2/osgi/bundle/org.eclipse.equinox.launcher/1.5.800.v20200727-1323/org.eclipse.equinox.launcher-1.5.800.v20200727-1323.jar, -data, /home/jenkins/agent/workspace/ease.verify.core.target.2019-06/tests/org.eclipse.ease.ui.scripts.test/target/work/data, -install, /home/jenkins/agent/workspace/ease.verify.core.target.2019-06/tests/org.eclipse.ease.ui.scripts.test/target/work, -configuration, /home/jenkins/agent/workspace/ease.verify.core.target.2019-06/tests/org.eclipse.ease.ui.scripts.test/target/work/configuration, -application, org.eclipse.tycho.surefire.osgibooter.headlesstest, -testproperties, /home/jenkins/agent/workspace/ease.verify.core.target.2019-06/tests/org.eclipse.ease.ui.scripts.test/target/surefire.properties]
09:34:18 [2020-10-20T13:34:18.781Z] Picked up JAVA_TOOL_OPTIONS: -Dmaven.ext.class.path="/home/jenkins/agent/workspace/ease.verify.core.target.2019-06@tmp/withMaven4b7189ce/pipeline-maven-spy.jar" -Dorg.jenkinsci.plugins.pipeline.maven.reportsFolder="/home/jenkins/agent/workspace/ease.verify.core.target.2019-06@tmp/withMaven4b7189ce" 
09:34:20 [2020-10-20T13:34:20.746Z] Running org.eclipse.ease.ui.scripts.expressions.definitions.ExpressionFactoryTest
09:34:20 [2020-10-20T13:34:20.746Z] Tests run: 14, Failures: 0, Errors: 0, Skipped: 0, Time elapsed: 0.046 s - in org.eclipse.ease.ui.scripts.expressions.definitions.ExpressionFactoryTest
09:34:20 [2020-10-20T13:34:20.746Z] loadClassWithExpression  Time elapsed: 0.007 s
09:34:20 [2020-10-20T13:34:20.746Z] createWithExpression  Time elapsed: 0 s
09:34:20 [2020-10-20T13:34:20.746Z] createReferenceExpression  Time elapsed: 0 s
09:34:20 [2020-10-20T13:34:20.746Z] loadClassReferenceExpression  Time elapsed: 0.001 s
09:34:20 [2020-10-20T13:34:20.746Z] loadClassTestExpression  Time elapsed: 0.001 s
09:34:20 [2020-10-20T13:34:20.746Z] createEqualsExpression  Time elapsed: 0 s
09:34:20 [2020-10-20T13:34:20.746Z] loadClassCountExpression  Time elapsed: 0.001 s
09:34:20 [2020-10-20T13:34:20.746Z] loadClassOrExpression  Time elapsed: 0.001 s
09:34:20 [2020-10-20T13:34:20.746Z] createTestExpression  Time elapsed: 0.001 s
09:34:20 [2020-10-20T13:34:20.746Z] createOrExpression  Time elapsed: 0 s
09:34:20 [2020-10-20T13:34:20.746Z] loadClassAndExpression  Time elapsed: 0.024 s
09:34:20 [2020-10-20T13:34:20.746Z] createAndExpression  Time elapsed: 0.001 s
09:34:20 [2020-10-20T13:34:20.746Z] loadClassEqualsExpression  Time elapsed: 0 s
09:34:20 [2020-10-20T13:34:20.746Z] createCountExpression  Time elapsed: 0.001 s
09:34:20 [2020-10-20T13:34:20.746Z] 
09:34:20 [2020-10-20T13:34:20.746Z] Results:
09:34:20 [2020-10-20T13:34:20.746Z] 
09:34:20 [2020-10-20T13:34:20.746Z] Tests run: 14, Failures: 0, Errors: 0, Skipped: 0
09:34:20 [2020-10-20T13:34:20.746Z] 
09:34:21 [2020-10-20T13:34:21.307Z] [INFO] All tests passed!
09:34:21 [2020-10-20T13:34:21.307Z] [INFO] 
09:34:21 [2020-10-20T13:34:21.307Z] [INFO] --- maven-install-plugin:2.3.1:install (default-install) @ org.eclipse.ease.ui.scripts.test ---
09:34:21 [2020-10-20T13:34:21.307Z] [INFO] Installing /home/jenkins/agent/workspace/ease.verify.core.target.2019-06/tests/org.eclipse.ease.ui.scripts.test/target/org.eclipse.ease.ui.scripts.test-0.8.0-SNAPSHOT.jar to /home/jenkins/.m2/repository/org/eclipse/ease/org.eclipse.ease.ui.scripts.test/0.8.0-SNAPSHOT/org.eclipse.ease.ui.scripts.test-0.8.0-SNAPSHOT.jar
09:34:21 [2020-10-20T13:34:21.307Z] [INFO] Installing /home/jenkins/agent/workspace/ease.verify.core.target.2019-06/tests/org.eclipse.ease.ui.scripts.test/pom.xml to /home/jenkins/.m2/repository/org/eclipse/ease/org.eclipse.ease.ui.scripts.test/0.8.0-SNAPSHOT/org.eclipse.ease.ui.scripts.test-0.8.0-SNAPSHOT.pom
09:34:21 [2020-10-20T13:34:21.307Z] [INFO] Installing /home/jenkins/agent/workspace/ease.verify.core.target.2019-06/tests/org.eclipse.ease.ui.scripts.test/target/org.eclipse.ease.ui.scripts.test-0.8.0-SNAPSHOT-sources.jar to /home/jenkins/.m2/repository/org/eclipse/ease/org.eclipse.ease.ui.scripts.test/0.8.0-SNAPSHOT/org.eclipse.ease.ui.scripts.test-0.8.0-SNAPSHOT-sources.jar
09:34:21 [2020-10-20T13:34:21.307Z] [INFO] Installing /home/jenkins/agent/workspace/ease.verify.core.target.2019-06/tests/org.eclipse.ease.ui.scripts.test/target/p2content.xml to /home/jenkins/.m2/repository/org/eclipse/ease/org.eclipse.ease.ui.scripts.test/0.8.0-SNAPSHOT/org.eclipse.ease.ui.scripts.test-0.8.0-SNAPSHOT-p2metadata.xml
09:34:21 [2020-10-20T13:34:21.308Z] [INFO] Installing /home/jenkins/agent/workspace/ease.verify.core.target.2019-06/tests/org.eclipse.ease.ui.scripts.test/target/p2artifacts.xml to /home/jenkins/.m2/repository/org/eclipse/ease/org.eclipse.ease.ui.scripts.test/0.8.0-SNAPSHOT/org.eclipse.ease.ui.scripts.test-0.8.0-SNAPSHOT-p2artifacts.xml
09:34:21 [2020-10-20T13:34:21.308Z] [INFO] Installing /home/jenkins/agent/workspace/ease.verify.core.target.2019-06/tests/org.eclipse.ease.ui.scripts.test/target/p2content.xml to /home/jenkins/.m2/repository/org/eclipse/ease/org.eclipse.ease.ui.scripts.test/0.8.0-SNAPSHOT/org.eclipse.ease.ui.scripts.test-0.8.0-SNAPSHOT-p2metadata.xml
09:34:21 [2020-10-20T13:34:21.308Z] [INFO] Installing /home/jenkins/agent/workspace/ease.verify.core.target.2019-06/tests/org.eclipse.ease.ui.scripts.test/target/p2artifacts.xml to /home/jenkins/.m2/repository/org/eclipse/ease/org.eclipse.ease.ui.scripts.test/0.8.0-SNAPSHOT/org.eclipse.ease.ui.scripts.test-0.8.0-SNAPSHOT-p2artifacts.xml
09:34:21 [2020-10-20T13:34:21.308Z] [INFO] 
09:34:21 [2020-10-20T13:34:21.308Z] [INFO] --- tycho-p2-plugin:1.5.0:update-local-index (default-update-local-index) @ org.eclipse.ease.ui.scripts.test ---
09:34:21 [2020-10-20T13:34:21.308Z] [INFO] 
09:34:21 [2020-10-20T13:34:21.308Z] [INFO] -------------< org.eclipse.ease:org.eclipse.ease.ui.test >--------------
09:34:21 [2020-10-20T13:34:21.308Z] [INFO] Building org.eclipse.ease.ui.test 0.8.0-SNAPSHOT                 [47/48]
09:34:21 [2020-10-20T13:34:21.308Z] [INFO] ------------------------[ eclipse-test-plugin ]-------------------------
09:34:21 [2020-10-20T13:34:21.308Z] [INFO] 
09:34:21 [2020-10-20T13:34:21.308Z] [INFO] --- maven-clean-plugin:2.5:clean (default-clean) @ org.eclipse.ease.ui.test ---
09:34:21 [2020-10-20T13:34:21.308Z] [INFO] 
09:34:21 [2020-10-20T13:34:21.308Z] [INFO] --- tycho-packaging-plugin:1.5.0:build-qualifier (default-build-qualifier) @ org.eclipse.ease.ui.test ---
09:34:21 [2020-10-20T13:34:21.308Z] [INFO] The project's OSGi version is 0.8.0.I201910171213
09:34:21 [2020-10-20T13:34:21.308Z] [INFO] 
09:34:21 [2020-10-20T13:34:21.308Z] [INFO] --- tycho-packaging-plugin:1.5.0:validate-id (default-validate-id) @ org.eclipse.ease.ui.test ---
09:34:21 [2020-10-20T13:34:21.308Z] [INFO] 
09:34:21 [2020-10-20T13:34:21.308Z] [INFO] --- tycho-packaging-plugin:1.5.0:validate-version (default-validate-version) @ org.eclipse.ease.ui.test ---
09:34:21 [2020-10-20T13:34:21.308Z] [INFO] 
09:34:21 [2020-10-20T13:34:21.308Z] [INFO] >>> maven-javadoc-plugin:2.9.1:javadoc (build-docs) > generate-sources @ org.eclipse.ease.ui.test >>>
09:34:21 [2020-10-20T13:34:21.308Z] [INFO] 
09:34:21 [2020-10-20T13:34:21.308Z] [INFO] --- tycho-packaging-plugin:1.5.0:build-qualifier (default-build-qualifier) @ org.eclipse.ease.ui.test ---
09:34:21 [2020-10-20T13:34:21.308Z] [INFO] The project's OSGi version is 0.8.0.I201910171213
09:34:21 [2020-10-20T13:34:21.308Z] [INFO] 
09:34:21 [2020-10-20T13:34:21.308Z] [INFO] --- tycho-packaging-plugin:1.5.0:validate-id (default-validate-id) @ org.eclipse.ease.ui.test ---
09:34:21 [2020-10-20T13:34:21.308Z] [INFO] 
09:34:21 [2020-10-20T13:34:21.308Z] [INFO] --- tycho-packaging-plugin:1.5.0:validate-version (default-validate-version) @ org.eclipse.ease.ui.test ---
09:34:21 [2020-10-20T13:34:21.308Z] [INFO] 
09:34:21 [2020-10-20T13:34:21.308Z] [INFO] <<< maven-javadoc-plugin:2.9.1:javadoc (build-docs) < generate-sources @ org.eclipse.ease.ui.test <<<
09:34:21 [2020-10-20T13:34:21.308Z] [INFO] 
09:34:21 [2020-10-20T13:34:21.308Z] [INFO] 
09:34:21 [2020-10-20T13:34:21.308Z] [INFO] --- maven-javadoc-plugin:2.9.1:javadoc (build-docs) @ org.eclipse.ease.ui.test ---
09:34:21 [2020-10-20T13:34:21.564Z] [ERROR] Error fetching link: http://help.eclipse.org/oxygen/topic/org.eclipse.platform.doc.isv/reference/api/package-list. Ignored it.
09:34:21 [2020-10-20T13:34:21.564Z] [ERROR] Error fetching link: https://ci.eclipse.org/ease/job/ease.build.core/JavaDoc/package-list. Ignored it.
09:34:22 [2020-10-20T13:34:22.491Z] [INFO] 
09:34:22 [2020-10-20T13:34:22.491Z] Loading source files for package org.eclipse.ease.ui.completion...
09:34:22 [2020-10-20T13:34:22.491Z] Loading source files for package org.eclipse.ease.ui.completion.provider...
09:34:22 [2020-10-20T13:34:22.491Z] Loading source files for package org.eclipse.ease.ui.completions.java.provider...
09:34:22 [2020-10-20T13:34:22.491Z] Loading source files for package org.eclipse.ease.ui.help.hovers...
09:34:22 [2020-10-20T13:34:22.491Z] Constructing Javadoc information...
09:34:22 [2020-10-20T13:34:22.491Z] WARNING: Cannot open location "/home/jenkins/agent/workspace/ease.verify.core.target.2019-06/tests/org.eclipse.ease.ui.test/target/javadoc-bundle-options/package-list"
09:34:22 [2020-10-20T13:34:22.491Z] [WARNING] Javadoc Warnings
09:34:22 [2020-10-20T13:34:22.491Z] [WARNING] Picked up JAVA_TOOL_OPTIONS: -Dmaven.ext.class.path="/home/jenkins/agent/workspace/ease.verify.core.target.2019-06@tmp/withMaven4b7189ce/pipeline-maven-spy.jar" -Dorg.jenkinsci.plugins.pipeline.maven.reportsFolder="/home/jenkins/agent/workspace/ease.verify.core.target.2019-06@tmp/withMaven4b7189ce"
09:34:22 [2020-10-20T13:34:22.491Z] [WARNING] javadoc: warning - The old Doclet and Taglet APIs in the packages
09:34:22 [2020-10-20T13:34:22.491Z] [WARNING] com.sun.javadoc, com.sun.tools.doclets and their implementations
09:34:22 [2020-10-20T13:34:22.491Z] [WARNING] are planned to be removed in a future JDK release. These
09:34:22 [2020-10-20T13:34:22.491Z] [WARNING] components have been superseded by the new APIs in jdk.javadoc.doclet.
09:34:22 [2020-10-20T13:34:22.491Z] [WARNING] Users are strongly recommended to migrate to the new APIs.
09:34:22 [2020-10-20T13:34:22.491Z] [INFO] 
09:34:22 [2020-10-20T13:34:22.491Z] [INFO] --- build-helper-maven-plugin:1.9.1:add-resource (add_help) @ org.eclipse.ease.ui.test ---
09:34:22 [2020-10-20T13:34:22.491Z] [INFO] 
09:34:22 [2020-10-20T13:34:22.491Z] [INFO] --- maven-resources-plugin:2.4.3:resources (default-resources) @ org.eclipse.ease.ui.test ---
09:34:22 [2020-10-20T13:34:22.491Z] [INFO] Using 'UTF-8' encoding to copy filtered resources.
09:34:22 [2020-10-20T13:34:22.491Z] [INFO] skip non existing resourceDirectory /home/jenkins/agent/workspace/ease.verify.core.target.2019-06/tests/org.eclipse.ease.ui.test/src/main/resources
09:34:22 [2020-10-20T13:34:22.491Z] [INFO] Copying 2 resources to help
09:34:22 [2020-10-20T13:34:22.491Z] [INFO] 
09:34:22 [2020-10-20T13:34:22.491Z] [INFO] --- tycho-compiler-plugin:1.5.0:compile (default-compile) @ org.eclipse.ease.ui.test ---
09:34:22 [2020-10-20T13:34:22.491Z] [INFO] Compiling 6 source files to /home/jenkins/agent/workspace/ease.verify.core.target.2019-06/tests/org.eclipse.ease.ui.test/target/classes
09:34:22 [2020-10-20T13:34:22.747Z] [INFO] 
09:34:22 [2020-10-20T13:34:22.747Z] [INFO] --- maven-resources-plugin:2.4.3:testResources (default-testResources) @ org.eclipse.ease.ui.test ---
09:34:22 [2020-10-20T13:34:22.747Z] [INFO] Using 'UTF-8' encoding to copy filtered resources.
09:34:22 [2020-10-20T13:34:22.747Z] [INFO] skip non existing resourceDirectory /home/jenkins/agent/workspace/ease.verify.core.target.2019-06/tests/org.eclipse.ease.ui.test/src/test/resources
09:34:22 [2020-10-20T13:34:22.747Z] [INFO] 
09:34:22 [2020-10-20T13:34:22.747Z] [INFO] --- tycho-source-plugin:1.5.0:plugin-source (plugin-source) @ org.eclipse.ease.ui.test ---
09:34:22 [2020-10-20T13:34:22.747Z] [WARNING] Bundle-Vendor header not found in /home/jenkins/agent/workspace/ease.verify.core.target.2019-06/tests/org.eclipse.ease.ui.test/META-INF/MANIFEST.MF, fallback to 'unknown' for source bundle
09:34:22 [2020-10-20T13:34:22.747Z] [INFO] Building jar: /home/jenkins/agent/workspace/ease.verify.core.target.2019-06/tests/org.eclipse.ease.ui.test/target/org.eclipse.ease.ui.test-0.8.0-SNAPSHOT-sources.jar
09:34:22 [2020-10-20T13:34:22.747Z] [INFO] 
09:34:22 [2020-10-20T13:34:22.747Z] [INFO] --- target-platform-configuration:1.5.0:target-platform (default-target-platform) @ org.eclipse.ease.ui.test ---
09:34:22 [2020-10-20T13:34:22.747Z] [INFO] 
09:34:22 [2020-10-20T13:34:22.747Z] [INFO] --- tycho-packaging-plugin:1.5.0:package-plugin (default-package-plugin) @ org.eclipse.ease.ui.test ---
09:34:22 [2020-10-20T13:34:22.747Z] [INFO] Building jar: /home/jenkins/agent/workspace/ease.verify.core.target.2019-06/tests/org.eclipse.ease.ui.test/target/org.eclipse.ease.ui.test-0.8.0-SNAPSHOT.jar
09:34:22 [2020-10-20T13:34:22.747Z] [INFO] 
09:34:22 [2020-10-20T13:34:22.747Z] [INFO] --- tycho-p2-plugin:1.5.0:p2-metadata-default (default-p2-metadata-default) @ org.eclipse.ease.ui.test ---
09:34:22 [2020-10-20T13:34:22.747Z] [INFO] 
09:34:22 [2020-10-20T13:34:22.747Z] [INFO] --- tycho-source-feature-plugin:1.5.0:source-feature (source-feature) @ org.eclipse.ease.ui.test ---
09:34:22 [2020-10-20T13:34:22.747Z] [INFO] 
09:34:22 [2020-10-20T13:34:22.747Z] [INFO] --- tycho-p2-plugin:1.5.0:p2-metadata (attached-p2-metadata) @ org.eclipse.ease.ui.test ---
09:34:22 [2020-10-20T13:34:22.747Z] [INFO] 
09:34:22 [2020-10-20T13:34:22.747Z] [INFO] --- tycho-surefire-plugin:1.5.0:test (default-test) @ org.eclipse.ease.ui.test ---
09:34:23 [2020-10-20T13:34:23.003Z] [INFO] Expected eclipse log file: /home/jenkins/agent/workspace/ease.verify.core.target.2019-06/tests/org.eclipse.ease.ui.test/target/work/data/.metadata/.log
09:34:23 [2020-10-20T13:34:23.003Z] [INFO] Command line:
09:34:23 [2020-10-20T13:34:23.003Z] 	[/opt/tools/java/openjdk/jdk-11/11.0.2+9/bin/java, -Dosgi.noShutdown=false, -Dosgi.os=linux, -Dosgi.ws=gtk, -Dosgi.arch=x86_64, -Dosgi.clean=true, -jar, /home/jenkins/.m2/repository/p2/osgi/bundle/org.eclipse.equinox.launcher/1.5.800.v20200727-1323/org.eclipse.equinox.launcher-1.5.800.v20200727-1323.jar, -data, /home/jenkins/agent/workspace/ease.verify.core.target.2019-06/tests/org.eclipse.ease.ui.test/target/work/data, -install, /home/jenkins/agent/workspace/ease.verify.core.target.2019-06/tests/org.eclipse.ease.ui.test/target/work, -configuration, /home/jenkins/agent/workspace/ease.verify.core.target.2019-06/tests/org.eclipse.ease.ui.test/target/work/configuration, -application, org.eclipse.tycho.surefire.osgibooter.headlesstest, -testproperties, /home/jenkins/agent/workspace/ease.verify.core.target.2019-06/tests/org.eclipse.ease.ui.test/target/surefire.properties]
09:34:23 [2020-10-20T13:34:23.003Z] Picked up JAVA_TOOL_OPTIONS: -Dmaven.ext.class.path="/home/jenkins/agent/workspace/ease.verify.core.target.2019-06@tmp/withMaven4b7189ce/pipeline-maven-spy.jar" -Dorg.jenkinsci.plugins.pipeline.maven.reportsFolder="/home/jenkins/agent/workspace/ease.verify.core.target.2019-06@tmp/withMaven4b7189ce" 
09:34:24 [2020-10-20T13:34:24.913Z] Running org.eclipse.ease.ui.completion.CompletionContextTest
09:34:24 [2020-10-20T13:34:24.913Z] Tests run: 9, Failures: 0, Errors: 0, Skipped: 0, Time elapsed: 0.065 s - in org.eclipse.ease.ui.completion.CompletionContextTest
09:34:24 [2020-10-20T13:34:24.913Z] resolveStaticClass(org.eclipse.ease.ui.completion.CompletionContextTest)  Time elapsed: 0.003 s
09:34:24 [2020-10-20T13:34:24.913Z] resolveClassWithFilter(org.eclipse.ease.ui.completion.CompletionContextTest)  Time elapsed: 0.001 s
09:34:24 [2020-10-20T13:34:24.913Z] simplifyCalls(org.eclipse.ease.ui.completion.CompletionContextTest)  Time elapsed: 0 s
09:34:24 [2020-10-20T13:34:24.913Z] resolveClass(org.eclipse.ease.ui.completion.CompletionContextTest)  Time elapsed: 0 s
09:34:24 [2020-10-20T13:34:24.913Z] replaceEscapedStringLiterals(org.eclipse.ease.ui.completion.CompletionContextTest)  Time elapsed: 0 s
09:34:24 [2020-10-20T13:34:24.913Z] replaceSimpleStringLiterals(org.eclipse.ease.ui.completion.CompletionContextTest)  Time elapsed: 0 s
09:34:24 [2020-10-20T13:34:24.913Z] resolveStaticClassWithFilter(org.eclipse.ease.ui.completion.CompletionContextTest)  Time elapsed: 0.001 s
09:34:24 [2020-10-20T13:34:24.913Z] resolveClassWithParameters(org.eclipse.ease.ui.completion.CompletionContextTest)  Time elapsed: 0 s
09:34:24 [2020-10-20T13:34:24.913Z] replaceMultipleStringLiterals(org.eclipse.ease.ui.completion.CompletionContextTest)  Time elapsed: 0 s
09:34:24 [2020-10-20T13:34:24.913Z] Running org.eclipse.ease.ui.completion.provider.AbstractFileLocationCompletionProviderTest
09:34:24 [2020-10-20T13:34:24.913Z] Tests run: 8, Failures: 0, Errors: 0, Skipped: 8, Time elapsed: 0.067 s - in org.eclipse.ease.ui.completion.provider.AbstractFileLocationCompletionProviderTest
09:34:24 [2020-10-20T13:34:24.913Z] workspaceProjectProposals(org.eclipse.ease.ui.completion.provider.AbstractFileLocationCompletionProviderTest) skipped
09:34:24 [2020-10-20T13:34:24.913Z] checkOperatingSystem(org.eclipse.ease.ui.completion.provider.AbstractFileLocationCompletionProviderTest) skipped
09:34:24 [2020-10-20T13:34:24.913Z] absoluteRootWorkspaceProposals(org.eclipse.ease.ui.completion.provider.AbstractFileLocationCompletionProviderTest) skipped
09:34:24 [2020-10-20T13:34:24.913Z] workspaceFolderProposals(org.eclipse.ease.ui.completion.provider.AbstractFileLocationCompletionProviderTest) skipped
09:34:24 [2020-10-20T13:34:24.913Z] fileSystemFolderProposals(org.eclipse.ease.ui.completion.provider.AbstractFileLocationCompletionProviderTest) skipped
09:34:24 [2020-10-20T13:34:24.913Z] workspaceProposals(org.eclipse.ease.ui.completion.provider.AbstractFileLocationCompletionProviderTest) skipped
09:34:24 [2020-10-20T13:34:24.913Z] relativeRootWorkspaceProposals(org.eclipse.ease.ui.completion.provider.AbstractFileLocationCompletionProviderTest) skipped
09:34:24 [2020-10-20T13:34:24.913Z] fileSystemRootProposals(org.eclipse.ease.ui.completion.provider.AbstractFileLocationCompletionProviderTest) skipped
09:34:24 [2020-10-20T13:34:24.913Z] Running org.eclipse.ease.ui.help.hovers.ModuleHelpTest
09:34:24 [2020-10-20T13:34:24.913Z] Tests run: 4, Failures: 0, Errors: 0, Skipped: 4, Time elapsed: 0.001 s - in org.eclipse.ease.ui.help.hovers.ModuleHelpTest
09:34:24 [2020-10-20T13:34:24.913Z] getModuleHelpLocation(org.eclipse.ease.ui.help.hovers.ModuleHelpTest) skipped
09:34:24 [2020-10-20T13:34:24.914Z] getModuleHelp(org.eclipse.ease.ui.help.hovers.ModuleHelpTest) skipped
09:34:24 [2020-10-20T13:34:24.914Z] getMethodHelp(org.eclipse.ease.ui.help.hovers.ModuleHelpTest) skipped
09:34:24 [2020-10-20T13:34:24.914Z] getConstantHelp(org.eclipse.ease.ui.help.hovers.ModuleHelpTest) skipped
09:34:24 [2020-10-20T13:34:24.914Z] Running org.eclipse.ease.ui.completions.java.provider.JavaPackagesCompletionsProviderTest
09:34:24 [2020-10-20T13:34:24.914Z] WARNING: An illegal reflective access operation has occurred
09:34:24 [2020-10-20T13:34:24.914Z] WARNING: Illegal reflective access by org.mockito.cglib.core.ReflectUtils$2 (file:/home/jenkins/.m2/repository/p2/osgi/bundle/org.mockito/1.9.5.v201605172210/org.mockito-1.9.5.v201605172210.jar) to method java.lang.ClassLoader.defineClass(java.lang.String,byte[],int,int,java.security.ProtectionDomain)
09:34:24 [2020-10-20T13:34:24.914Z] WARNING: Please consider reporting this to the maintainers of org.mockito.cglib.core.ReflectUtils$2
09:34:24 [2020-10-20T13:34:24.914Z] WARNING: Use --illegal-access=warn to enable warnings of further illegal reflective access operations
09:34:24 [2020-10-20T13:34:24.914Z] WARNING: All illegal access operations will be denied in a future release
09:34:31 [2020-10-20T13:34:31.451Z] Tests run: 4, Failures: 0, Errors: 0, Skipped: 0, Time elapsed: 5.951 s - in org.eclipse.ease.ui.completions.java.provider.JavaPackagesCompletionsProviderTest
09:34:31 [2020-10-20T13:34:31.451Z] containsJavaLangPackageProposal(org.eclipse.ease.ui.completions.java.provider.JavaPackagesCompletionsProviderTest)  Time elapsed: 0.561 s
09:34:31 [2020-10-20T13:34:31.451Z] containsOrgRootPackageProposal(org.eclipse.ease.ui.completions.java.provider.JavaPackagesCompletionsProviderTest)  Time elapsed: 0.011 s
09:34:31 [2020-10-20T13:34:31.451Z] containsJavaRootPackageProposal(org.eclipse.ease.ui.completions.java.provider.JavaPackagesCompletionsProviderTest)  Time elapsed: 0.024 s
09:34:31 [2020-10-20T13:34:31.451Z] containsOrgEclipsePackageProposal(org.eclipse.ease.ui.completions.java.provider.JavaPackagesCompletionsProviderTest)  Time elapsed: 0.052 s
09:34:31 [2020-10-20T13:34:31.451Z] Running org.eclipse.ease.ui.completions.java.provider.JavaClassCompletionsProviderTest
09:34:36 [2020-10-20T13:34:36.690Z] Tests run: 6, Failures: 0, Errors: 0, Skipped: 0, Time elapsed: 5.198 s - in org.eclipse.ease.ui.completions.java.provider.JavaClassCompletionsProviderTest
09:34:36 [2020-10-20T13:34:36.690Z] containsPackageFileCompletion(org.eclipse.ease.ui.completions.java.provider.JavaClassCompletionsProviderTest)  Time elapsed: 0.011 s
09:34:36 [2020-10-20T13:34:36.690Z] containsGlobalFileCompletion(org.eclipse.ease.ui.completions.java.provider.JavaClassCompletionsProviderTest)  Time elapsed: 0.042 s
09:34:36 [2020-10-20T13:34:36.690Z] containsJavaLangPackageProposal(org.eclipse.ease.ui.completions.java.provider.JavaClassCompletionsProviderTest)  Time elapsed: 0.057 s
09:34:36 [2020-10-20T13:34:36.690Z] containsOrgRootPackageProposal(org.eclipse.ease.ui.completions.java.provider.JavaClassCompletionsProviderTest)  Time elapsed: 0.007 s
09:34:36 [2020-10-20T13:34:36.690Z] containsJavaRootPackageProposal(org.eclipse.ease.ui.completions.java.provider.JavaClassCompletionsProviderTest)  Time elapsed: 0.006 s
09:34:36 [2020-10-20T13:34:36.690Z] containsOrgEclipsePackageProposal(org.eclipse.ease.ui.completions.java.provider.JavaClassCompletionsProviderTest)  Time elapsed: 0.045 s
09:34:36 [2020-10-20T13:34:36.691Z] 
09:34:36 [2020-10-20T13:34:36.691Z] Results:
09:34:36 [2020-10-20T13:34:36.691Z] 
09:34:36 [2020-10-20T13:34:36.691Z] Tests run: 31, Failures: 0, Errors: 0, Skipped: 12
09:34:36 [2020-10-20T13:34:36.691Z] 
09:34:37 [2020-10-20T13:34:37.252Z] [INFO] All tests passed!
09:34:37 [2020-10-20T13:34:37.252Z] [INFO] 
09:34:37 [2020-10-20T13:34:37.252Z] [INFO] --- maven-install-plugin:2.3.1:install (default-install) @ org.eclipse.ease.ui.test ---
09:34:37 [2020-10-20T13:34:37.252Z] [INFO] Installing /home/jenkins/agent/workspace/ease.verify.core.target.2019-06/tests/org.eclipse.ease.ui.test/target/org.eclipse.ease.ui.test-0.8.0-SNAPSHOT.jar to /home/jenkins/.m2/repository/org/eclipse/ease/org.eclipse.ease.ui.test/0.8.0-SNAPSHOT/org.eclipse.ease.ui.test-0.8.0-SNAPSHOT.jar
09:34:37 [2020-10-20T13:34:37.252Z] [INFO] Installing /home/jenkins/agent/workspace/ease.verify.core.target.2019-06/tests/org.eclipse.ease.ui.test/pom.xml to /home/jenkins/.m2/repository/org/eclipse/ease/org.eclipse.ease.ui.test/0.8.0-SNAPSHOT/org.eclipse.ease.ui.test-0.8.0-SNAPSHOT.pom
09:34:37 [2020-10-20T13:34:37.252Z] [INFO] Installing /home/jenkins/agent/workspace/ease.verify.core.target.2019-06/tests/org.eclipse.ease.ui.test/target/org.eclipse.ease.ui.test-0.8.0-SNAPSHOT-sources.jar to /home/jenkins/.m2/repository/org/eclipse/ease/org.eclipse.ease.ui.test/0.8.0-SNAPSHOT/org.eclipse.ease.ui.test-0.8.0-SNAPSHOT-sources.jar
09:34:37 [2020-10-20T13:34:37.252Z] [INFO] Installing /home/jenkins/agent/workspace/ease.verify.core.target.2019-06/tests/org.eclipse.ease.ui.test/target/p2content.xml to /home/jenkins/.m2/repository/org/eclipse/ease/org.eclipse.ease.ui.test/0.8.0-SNAPSHOT/org.eclipse.ease.ui.test-0.8.0-SNAPSHOT-p2metadata.xml
09:34:37 [2020-10-20T13:34:37.252Z] [INFO] Installing /home/jenkins/agent/workspace/ease.verify.core.target.2019-06/tests/org.eclipse.ease.ui.test/target/p2artifacts.xml to /home/jenkins/.m2/repository/org/eclipse/ease/org.eclipse.ease.ui.test/0.8.0-SNAPSHOT/org.eclipse.ease.ui.test-0.8.0-SNAPSHOT-p2artifacts.xml
09:34:37 [2020-10-20T13:34:37.252Z] [INFO] Installing /home/jenkins/agent/workspace/ease.verify.core.target.2019-06/tests/org.eclipse.ease.ui.test/target/p2content.xml to /home/jenkins/.m2/repository/org/eclipse/ease/org.eclipse.ease.ui.test/0.8.0-SNAPSHOT/org.eclipse.ease.ui.test-0.8.0-SNAPSHOT-p2metadata.xml
09:34:37 [2020-10-20T13:34:37.252Z] [INFO] Installing /home/jenkins/agent/workspace/ease.verify.core.target.2019-06/tests/org.eclipse.ease.ui.test/target/p2artifacts.xml to /home/jenkins/.m2/repository/org/eclipse/ease/org.eclipse.ease.ui.test/0.8.0-SNAPSHOT/org.eclipse.ease.ui.test-0.8.0-SNAPSHOT-p2artifacts.xml
09:34:37 [2020-10-20T13:34:37.252Z] [INFO] 
09:34:37 [2020-10-20T13:34:37.252Z] [INFO] --- tycho-p2-plugin:1.5.0:update-local-index (default-update-local-index) @ org.eclipse.ease.ui.test ---
09:34:37 [2020-10-20T13:34:37.252Z] [INFO] 
09:34:37 [2020-10-20T13:34:37.252Z] [INFO] ---------------------< org.eclipse.ease:ease.core >---------------------
09:34:37 [2020-10-20T13:34:37.252Z] [INFO] Building EASE (Incubation) 0.4.0-SNAPSHOT                        [48/48]
09:34:37 [2020-10-20T13:34:37.252Z] [INFO] --------------------------------[ pom ]---------------------------------
09:34:37 [2020-10-20T13:34:37.252Z] [INFO] 
09:34:37 [2020-10-20T13:34:37.252Z] [INFO] --- maven-clean-plugin:2.5:clean (default-clean) @ ease.core ---
09:34:37 [2020-10-20T13:34:37.508Z] [INFO] 
09:34:37 [2020-10-20T13:34:37.508Z] [INFO] --- maven-install-plugin:2.4:install (default-install) @ ease.core ---
09:34:37 [2020-10-20T13:34:37.508Z] [INFO] Installing /home/jenkins/agent/workspace/ease.verify.core.target.2019-06/pom.xml to /home/jenkins/.m2/repository/org/eclipse/ease/ease.core/0.4.0-SNAPSHOT/ease.core-0.4.0-SNAPSHOT.pom
09:34:37 [2020-10-20T13:34:37.508Z] [INFO] ------------------------------------------------------------------------
09:34:37 [2020-10-20T13:34:37.508Z] [INFO] Reactor Summary:
09:34:37 [2020-10-20T13:34:37.508Z] [INFO] 
09:34:37 [2020-10-20T13:34:37.508Z] [INFO] org.eclipse.ease.releng 0.8.0-SNAPSHOT ............. SUCCESS [  5.971 s]
09:34:37 [2020-10-20T13:34:37.508Z] [INFO] org.eclipse.ease.classloader 0.8.0-SNAPSHOT ........ SUCCESS [  8.848 s]
09:34:37 [2020-10-20T13:34:37.508Z] [INFO] org.eclipse.ease 0.8.0-SNAPSHOT .................... SUCCESS [  3.370 s]
09:34:37 [2020-10-20T13:34:37.508Z] [INFO] org.eclipse.ease.ui 0.8.0-SNAPSHOT ................. SUCCESS [  3.132 s]
09:34:37 [2020-10-20T13:34:37.508Z] [INFO] org.eclipse.ease.ui.completions.java 0.8.0-SNAPSHOT  SUCCESS [  2.042 s]
09:34:37 [2020-10-20T13:34:37.508Z] [INFO] org.eclipse.ease.ui.scripts 0.8.0-SNAPSHOT ......... SUCCESS [  2.820 s]
09:34:37 [2020-10-20T13:34:37.508Z] [INFO] org.eclipse.ease.lang.javascript 0.8.0-SNAPSHOT .... SUCCESS [  1.919 s]
09:34:37 [2020-10-20T13:34:37.508Z] [INFO] org.eclipse.ease.lang.scriptarchive 0.8.0-SNAPSHOT . SUCCESS [  1.471 s]
09:34:37 [2020-10-20T13:34:37.508Z] [INFO] org.eclipse.ease.lang.python 0.8.0-SNAPSHOT ........ SUCCESS [  1.814 s]
09:34:37 [2020-10-20T13:34:37.508Z] [INFO] org.eclipse.ease.lang.python.py4j 0.8.0-SNAPSHOT ... SUCCESS [  1.591 s]
09:34:37 [2020-10-20T13:34:37.508Z] [INFO] org.eclipse.ease.lang.groovy 0.8.0-SNAPSHOT ........ SUCCESS [  1.405 s]
09:34:37 [2020-10-20T13:34:37.508Z] [INFO] org.eclipse.ease.lang.groovy.interpreter 0.8.0-SNAPSHOT SUCCESS [  1.560 s]
09:34:37 [2020-10-20T13:34:37.508Z] [INFO] org.eclipse.ease.lang.unittest 0.8.0-SNAPSHOT ...... SUCCESS [  2.050 s]
09:34:37 [2020-10-20T13:34:37.508Z] [INFO] org.eclipse.ease.lang.unittest.ui 0.8.0-SNAPSHOT ... SUCCESS [  2.088 s]
09:34:37 [2020-10-20T13:34:37.508Z] [INFO] org.eclipse.ease.lang.ruby 0.8.0-SNAPSHOT .......... SUCCESS [  1.291 s]
09:34:37 [2020-10-20T13:34:37.508Z] [INFO] org.eclipse.ease.lang.ruby.jruby 0.8.0-SNAPSHOT .... SUCCESS [  1.317 s]
09:34:37 [2020-10-20T13:34:37.508Z] [INFO] org.eclipse.ease.lang.javascript.nashorn 0.8.0-SNAPSHOT SUCCESS [  1.398 s]
09:34:37 [2020-10-20T13:34:37.508Z] [INFO] org.eclipse.ease.lang.javascript.rhino 0.8.0-SNAPSHOT SUCCESS [  1.722 s]
09:34:37 [2020-10-20T13:34:37.508Z] [INFO] org.eclipse.ease.lang.python.jython 0.8.0-SNAPSHOT . SUCCESS [  1.588 s]
09:34:37 [2020-10-20T13:34:37.508Z] [INFO] org.eclipse.ease.lang.javascript.ui 0.8.0-SNAPSHOT . SUCCESS [  1.507 s]
09:34:37 [2020-10-20T13:34:37.508Z] [INFO] org.eclipse.ease.lang.jvm.compiled 0.8.0-SNAPSHOT .. SUCCESS [  1.485 s]
09:34:37 [2020-10-20T13:34:37.508Z] [INFO] org.eclipse.ease.lang.scriptarchive.ui 0.8.0-SNAPSHOT SUCCESS [  1.526 s]
09:34:37 [2020-10-20T13:34:37.508Z] [INFO] org.eclipse.ease.help 0.8.0-SNAPSHOT ............... SUCCESS [  0.199 s]
09:34:37 [2020-10-20T13:34:37.508Z] [INFO] org.eclipse.ease.feature 0.8.0-SNAPSHOT ............ SUCCESS [  0.183 s]
09:34:37 [2020-10-20T13:34:37.508Z] [INFO] org.eclipse.ease.ui.feature 0.8.0-SNAPSHOT ......... SUCCESS [  0.250 s]
09:34:37 [2020-10-20T13:34:37.508Z] [INFO] org.eclipse.ease.lang.javascript.feature 0.8.0-SNAPSHOT SUCCESS [  0.140 s]
09:34:37 [2020-10-20T13:34:37.508Z] [INFO] org.eclipse.ease.lang.python.feature 0.8.0-SNAPSHOT  SUCCESS [  0.103 s]
09:34:37 [2020-10-20T13:34:37.508Z] [INFO] org.eclipse.ease.python.jython.feature 0.8.0-SNAPSHOT SUCCESS [  0.083 s]
09:34:37 [2020-10-20T13:34:37.508Z] [INFO] org.eclipse.ease.lang.python.py4j.feature 0.8.0-SNAPSHOT SUCCESS [  0.102 s]
09:34:37 [2020-10-20T13:34:37.508Z] [INFO] org.eclipse.ease.lang.jvm.feature 0.8.0-SNAPSHOT ... SUCCESS [  0.095 s]
09:34:37 [2020-10-20T13:34:37.508Z] [INFO] org.eclipse.ease.lang.groovy.feature 0.8.0-SNAPSHOT  SUCCESS [  0.102 s]
09:34:37 [2020-10-20T13:34:37.508Z] [INFO] org.eclipse.ease.lang.ruby.feature 0.8.0-SNAPSHOT .. SUCCESS [  0.105 s]
09:34:37 [2020-10-20T13:34:37.508Z] [INFO] org.eclipse.ease.lang.scriptarchive.feature 0.8.0-SNAPSHOT SUCCESS [  0.104 s]
09:34:37 [2020-10-20T13:34:37.508Z] [INFO] org.eclipse.ease.lang.unittest.feature 0.8.0-SNAPSHOT SUCCESS [  0.105 s]
09:34:37 [2020-10-20T13:34:37.508Z] [INFO] org.eclipse.ease.releng.target 0.8.0-SNAPSHOT ...... SUCCESS [  0.009 s]
09:34:37 [2020-10-20T13:34:37.508Z] [INFO] org.eclipse.ease.releng.p2 0.8.0-SNAPSHOT .......... SUCCESS [  3.232 s]
09:34:37 [2020-10-20T13:34:37.508Z] [INFO] org.eclipse.ease.testhelper 0.8.0-SNAPSHOT ......... SUCCESS [  1.458 s]
09:34:37 [2020-10-20T13:34:37.508Z] [INFO] org.eclipse.ease.test 0.8.0-SNAPSHOT ............... SUCCESS [ 20.414 s]
09:34:37 [2020-10-20T13:34:37.508Z] [INFO] org.eclipse.ease.lang.javascript.nashorn.test 0.8.0-SNAPSHOT SUCCESS [  4.563 s]
09:34:37 [2020-10-20T13:34:37.508Z] [INFO] org.eclipse.ease.lang.javascript.rhino.test 0.8.0-SNAPSHOT SUCCESS [ 15.888 s]
09:34:37 [2020-10-20T13:34:37.508Z] [INFO] org.eclipse.ease.lang.javascript.test 0.8.0-SNAPSHOT SUCCESS [  4.053 s]
09:34:37 [2020-10-20T13:34:37.508Z] [INFO] org.eclipse.ease.lang.python.test 0.8.0-SNAPSHOT ... SUCCESS [  3.610 s]
09:34:37 [2020-10-20T13:34:37.508Z] [INFO] org.eclipse.ease.lang.python.jython.test 0.8.0-SNAPSHOT SUCCESS [ 16.659 s]
09:34:37 [2020-10-20T13:34:37.508Z] [INFO] org.eclipse.ease.lang.scriptarchive.test 0.8.0-SNAPSHOT SUCCESS [  4.225 s]
09:34:37 [2020-10-20T13:34:37.508Z] [INFO] org.eclipse.ease.lang.unittest.test 0.8.0-SNAPSHOT . SUCCESS [  6.327 s]
09:34:37 [2020-10-20T13:34:37.508Z] [INFO] org.eclipse.ease.ui.scripts.test 0.8.0-SNAPSHOT .... SUCCESS [  3.715 s]
09:34:37 [2020-10-20T13:34:37.508Z] [INFO] org.eclipse.ease.ui.test 0.8.0-SNAPSHOT ............ SUCCESS [ 15.984 s]
09:34:37 [2020-10-20T13:34:37.508Z] [INFO] EASE (Incubation) 0.4.0-SNAPSHOT ................... SUCCESS [  0.195 s]
09:34:37 [2020-10-20T13:34:37.508Z] [INFO] ------------------------------------------------------------------------
09:34:37 [2020-10-20T13:34:37.508Z] [INFO] BUILD SUCCESS
09:34:37 [2020-10-20T13:34:37.508Z] [INFO] ------------------------------------------------------------------------
09:34:37 [2020-10-20T13:34:37.508Z] [INFO] Total time:  05:09 min
09:34:37 [2020-10-20T13:34:37.508Z] [INFO] Finished at: 2020-10-20T13:34:37Z
09:34:37 [2020-10-20T13:34:37.508Z] [INFO] ------------------------------------------------------------------------
09:34:37 [2020-10-20T13:34:37.509Z] [INFO] [jenkins-event-spy] Generated /home/jenkins/agent/workspace/ease.verify.core.target.2019-06@tmp/withMaven4b7189ce/maven-spy-20201020-132927-5394297034419030983504.log