Console Output

Skipping 858 KB.. Full Log
09:38:14 [2022-05-03T13:38:14.570Z] stepReturnIncludeCommand  Time elapsed: 0.317 s
09:38:14 [2022-05-03T13:38:14.570Z] arrayVariableSorting  Time elapsed: 0.311 s
09:38:14 [2022-05-03T13:38:14.570Z] stepOverOnDebugTarget  Time elapsed: 0.411 s
09:38:14 [2022-05-03T13:38:14.570Z] disconnectThreadInSuspendedState  Time elapsed: 0.21 s
09:38:14 [2022-05-03T13:38:14.570Z] stepReturnOnDebugTarget  Time elapsed: 0.411 s
09:38:14 [2022-05-03T13:38:14.570Z] nullVariable  Time elapsed: 0.307 s
09:38:14 [2022-05-03T13:38:14.570Z] stepOverOnStackFrame  Time elapsed: 0.417 s
09:38:14 [2022-05-03T13:38:14.570Z] resumeOnDebugTarget  Time elapsed: 0.309 s
09:38:14 [2022-05-03T13:38:14.570Z] modifyVariableKeepingType  Time elapsed: 0.608 s
09:38:14 [2022-05-03T13:38:14.570Z] resumeOnLastIncludeLine  Time elapsed: 0.206 s
09:38:14 [2022-05-03T13:38:14.570Z] stepReturnOnStackFrame  Time elapsed: 0.307 s
09:38:14 [2022-05-03T13:38:14.570Z] terminateStackFrameInSuspendedState  Time elapsed: 0.207 s
09:38:14 [2022-05-03T13:38:14.570Z] breakpointLocation  Time elapsed: 0.307 s
09:38:14 [2022-05-03T13:38:14.570Z] stepReturnOnThread  Time elapsed: 0.307 s
09:38:14 [2022-05-03T13:38:14.570Z] javaClassVariable  Time elapsed: 0.309 s
09:38:14 [2022-05-03T13:38:14.570Z] stepIntoOnThread  Time elapsed: 0.308 s
09:38:14 [2022-05-03T13:38:14.570Z] terminateThreadInSuspendedState  Time elapsed: 0.208 s
09:38:14 [2022-05-03T13:38:14.570Z] resumeOnThread  Time elapsed: 0.208 s
09:38:14 [2022-05-03T13:38:14.570Z] stepIntoOnStackFrame  Time elapsed: 0.307 s
09:38:14 [2022-05-03T13:38:14.570Z] terminateProcessInSuspendedState  Time elapsed: 0.206 s
09:38:14 [2022-05-03T13:38:14.570Z] stepOverOnProcess  Time elapsed: 0.308 s
09:38:14 [2022-05-03T13:38:14.570Z] nativeArrayVariable  Time elapsed: 0.407 s
09:38:14 [2022-05-03T13:38:14.570Z] disconnectDebugTargetInSuspendedState  Time elapsed: 0.206 s
09:38:14 [2022-05-03T13:38:14.570Z] stepIntoOnProcess  Time elapsed: 0.307 s
09:38:14 [2022-05-03T13:38:14.570Z] terminatedState  Time elapsed: 0.104 s
09:38:14 [2022-05-03T13:38:14.570Z] stepOverIncludeCommand  Time elapsed: 0.308 s
09:38:14 [2022-05-03T13:38:14.570Z] innerScopeVariableBeforeOuterScopeVariable  Time elapsed: 0.306 s
09:38:14 [2022-05-03T13:38:14.570Z] stepIntoIncludeCommand  Time elapsed: 0.307 s
09:38:14 [2022-05-03T13:38:14.570Z] primitiveStringVariable  Time elapsed: 0.305 s
09:38:14 [2022-05-03T13:38:14.570Z] resumeOnProcess  Time elapsed: 0.207 s
09:38:14 [2022-05-03T13:38:14.570Z] stepIntoOnDebugTarget  Time elapsed: 0.306 s
09:38:14 [2022-05-03T13:38:14.570Z] stepOverOnThread  Time elapsed: 0.308 s
09:38:14 [2022-05-03T13:38:14.570Z] suspendedState  Time elapsed: 0.205 s
09:38:14 [2022-05-03T13:38:14.570Z] primitiveDoubleVariable  Time elapsed: 0.406 s
09:38:14 [2022-05-03T13:38:14.570Z] resumeOnStackFrame  Time elapsed: 0.205 s
09:38:14 [2022-05-03T13:38:14.570Z] nativeObjectVariable  Time elapsed: 0.306 s
09:38:14 [2022-05-03T13:38:14.570Z] terminateDebugTargetInSuspendedState  Time elapsed: 0.206 s
09:38:14 [2022-05-03T13:38:14.570Z] disconnectStackFrameInSuspendedState  Time elapsed: 0.308 s
09:38:14 [2022-05-03T13:38:14.570Z] stepReturnOnProcess  Time elapsed: 0.31 s
09:38:14 [2022-05-03T13:38:14.570Z] evaluateWatchExpression  Time elapsed: 0.236 s
09:38:14 [2022-05-03T13:38:14.570Z] 
09:38:14 [2022-05-03T13:38:14.570Z] Results:
09:38:14 [2022-05-03T13:38:14.570Z] 
09:38:14 [2022-05-03T13:38:14.570Z] Tests run: 41, Failures: 0, Errors: 0, Skipped: 0
09:38:14 [2022-05-03T13:38:14.570Z] 
09:38:14 [2022-05-03T13:38:14.826Z] [INFO] All tests passed!
09:38:14 [2022-05-03T13:38:14.826Z] [INFO] 
09:38:14 [2022-05-03T13:38:14.826Z] [INFO] --- maven-pmd-plugin:3.16.0:pmd (pmd-integration) @ org.eclipse.ease.lang.python.jython.test ---
09:38:14 [2022-05-03T13:38:14.826Z] [INFO] PMD version: 6.42.0
09:38:15 [2022-05-03T13:38:15.085Z] [INFO] 
09:38:15 [2022-05-03T13:38:15.085Z] [INFO] --- maven-pmd-plugin:3.16.0:cpd (pmd-integration) @ org.eclipse.ease.lang.python.jython.test ---
09:38:15 [2022-05-03T13:38:15.085Z] [INFO] PMD version: 6.42.0
09:38:15 [2022-05-03T13:38:15.085Z] [INFO] 
09:38:15 [2022-05-03T13:38:15.085Z] [INFO] --- spotbugs-maven-plugin:4.1.4:spotbugs (spotbugs-integration) @ org.eclipse.ease.lang.python.jython.test ---
09:38:15 [2022-05-03T13:38:15.085Z] [INFO] Fork Value is false
09:38:15 [2022-05-03T13:38:15.341Z]      [java] JVM args ignored when same JVM is used.
09:38:18 [2022-05-03T13:38:18.679Z] [INFO] Done SpotBugs Analysis....
09:38:18 [2022-05-03T13:38:18.679Z] [INFO] 
09:38:18 [2022-05-03T13:38:18.679Z] [INFO] --- maven-checkstyle-plugin:3.1.1:check (checkstyle-integration) @ org.eclipse.ease.lang.python.jython.test ---
09:38:18 [2022-05-03T13:38:18.679Z] [INFO] You have 0 Checkstyle violations.
09:38:18 [2022-05-03T13:38:18.679Z] [INFO] 
09:38:18 [2022-05-03T13:38:18.679Z] [INFO] --- maven-install-plugin:2.3.1:install (default-install) @ org.eclipse.ease.lang.python.jython.test ---
09:38:18 [2022-05-03T13:38:18.679Z] [INFO] Installing /home/jenkins/agent/workspace/ease.verify.core.target.2019-06/tests/org.eclipse.ease.lang.python.jython.test/target/org.eclipse.ease.lang.python.jython.test-0.9.0-SNAPSHOT.jar to /home/jenkins/.m2/repository/org/eclipse/ease/org.eclipse.ease.lang.python.jython.test/0.9.0-SNAPSHOT/org.eclipse.ease.lang.python.jython.test-0.9.0-SNAPSHOT.jar
09:38:18 [2022-05-03T13:38:18.679Z] [INFO] Installing /home/jenkins/agent/workspace/ease.verify.core.target.2019-06/tests/org.eclipse.ease.lang.python.jython.test/pom.xml to /home/jenkins/.m2/repository/org/eclipse/ease/org.eclipse.ease.lang.python.jython.test/0.9.0-SNAPSHOT/org.eclipse.ease.lang.python.jython.test-0.9.0-SNAPSHOT.pom
09:38:18 [2022-05-03T13:38:18.679Z] [INFO] Installing /home/jenkins/agent/workspace/ease.verify.core.target.2019-06/tests/org.eclipse.ease.lang.python.jython.test/target/p2content.xml to /home/jenkins/.m2/repository/org/eclipse/ease/org.eclipse.ease.lang.python.jython.test/0.9.0-SNAPSHOT/org.eclipse.ease.lang.python.jython.test-0.9.0-SNAPSHOT-p2metadata.xml
09:38:18 [2022-05-03T13:38:18.679Z] [INFO] Installing /home/jenkins/agent/workspace/ease.verify.core.target.2019-06/tests/org.eclipse.ease.lang.python.jython.test/target/p2artifacts.xml to /home/jenkins/.m2/repository/org/eclipse/ease/org.eclipse.ease.lang.python.jython.test/0.9.0-SNAPSHOT/org.eclipse.ease.lang.python.jython.test-0.9.0-SNAPSHOT-p2artifacts.xml
09:38:18 [2022-05-03T13:38:18.679Z] [INFO] 
09:38:18 [2022-05-03T13:38:18.679Z] [INFO] --- tycho-p2-plugin:2.2.0:update-local-index (default-update-local-index) @ org.eclipse.ease.lang.python.jython.test ---
09:38:18 [2022-05-03T13:38:18.680Z] [INFO] 
09:38:18 [2022-05-03T13:38:18.680Z] [INFO] -----< org.eclipse.ease:org.eclipse.ease.lang.scriptarchive.test >------
09:38:18 [2022-05-03T13:38:18.680Z] [INFO] Building org.eclipse.ease.lang.scriptarchive.test 0.9.0-SNAPSHOT [43/49]
09:38:18 [2022-05-03T13:38:18.680Z] [INFO] ------------------------[ eclipse-test-plugin ]-------------------------
09:38:18 [2022-05-03T13:38:18.680Z] [INFO] 
09:38:18 [2022-05-03T13:38:18.680Z] [INFO] --- maven-clean-plugin:2.5:clean (default-clean) @ org.eclipse.ease.lang.scriptarchive.test ---
09:38:18 [2022-05-03T13:38:18.680Z] [INFO] 
09:38:18 [2022-05-03T13:38:18.680Z] [INFO] --- tycho-packaging-plugin:2.2.0:build-qualifier (default-build-qualifier) @ org.eclipse.ease.lang.scriptarchive.test ---
09:38:18 [2022-05-03T13:38:18.680Z] [INFO] The project's OSGi version is 0.9.0.I202106220815
09:38:18 [2022-05-03T13:38:18.680Z] [INFO] 
09:38:18 [2022-05-03T13:38:18.680Z] [INFO] --- tycho-packaging-plugin:2.2.0:validate-id (default-validate-id) @ org.eclipse.ease.lang.scriptarchive.test ---
09:38:18 [2022-05-03T13:38:18.680Z] [INFO] 
09:38:18 [2022-05-03T13:38:18.680Z] [INFO] --- tycho-packaging-plugin:2.2.0:validate-version (default-validate-version) @ org.eclipse.ease.lang.scriptarchive.test ---
09:38:18 [2022-05-03T13:38:18.680Z] [INFO] 
09:38:18 [2022-05-03T13:38:18.680Z] [INFO] --- maven-resources-plugin:2.4.3:resources (default-resources) @ org.eclipse.ease.lang.scriptarchive.test ---
09:38:18 [2022-05-03T13:38:18.680Z] [INFO] Using 'UTF-8' encoding to copy filtered resources.
09:38:18 [2022-05-03T13:38:18.680Z] [INFO] skip non existing resourceDirectory /home/jenkins/agent/workspace/ease.verify.core.target.2019-06/tests/org.eclipse.ease.lang.scriptarchive.test/src/main/resources
09:38:18 [2022-05-03T13:38:18.680Z] [INFO] 
09:38:18 [2022-05-03T13:38:18.680Z] [INFO] --- tycho-compiler-plugin:2.2.0:compile (default-compile) @ org.eclipse.ease.lang.scriptarchive.test ---
09:38:18 [2022-05-03T13:38:18.680Z] [INFO] Compiling 1 source file to /home/jenkins/agent/workspace/ease.verify.core.target.2019-06/tests/org.eclipse.ease.lang.scriptarchive.test/target/classes
09:38:18 [2022-05-03T13:38:18.680Z] [INFO] 
09:38:18 [2022-05-03T13:38:18.680Z] [INFO] --- maven-resources-plugin:2.4.3:testResources (default-testResources) @ org.eclipse.ease.lang.scriptarchive.test ---
09:38:18 [2022-05-03T13:38:18.680Z] [INFO] Using 'UTF-8' encoding to copy filtered resources.
09:38:18 [2022-05-03T13:38:18.680Z] [INFO] skip non existing resourceDirectory /home/jenkins/agent/workspace/ease.verify.core.target.2019-06/tests/org.eclipse.ease.lang.scriptarchive.test/src/test/resources
09:38:18 [2022-05-03T13:38:18.680Z] [INFO] 
09:38:18 [2022-05-03T13:38:18.680Z] [INFO] --- target-platform-configuration:2.2.0:target-platform (default-target-platform) @ org.eclipse.ease.lang.scriptarchive.test ---
09:38:18 [2022-05-03T13:38:18.680Z] [INFO] 
09:38:18 [2022-05-03T13:38:18.680Z] [INFO] --- tycho-packaging-plugin:2.2.0:package-plugin (default-package-plugin) @ org.eclipse.ease.lang.scriptarchive.test ---
09:38:18 [2022-05-03T13:38:18.680Z] [INFO] Building jar: /home/jenkins/agent/workspace/ease.verify.core.target.2019-06/tests/org.eclipse.ease.lang.scriptarchive.test/target/org.eclipse.ease.lang.scriptarchive.test-0.9.0-SNAPSHOT.jar
09:38:18 [2022-05-03T13:38:18.680Z] [INFO] 
09:38:18 [2022-05-03T13:38:18.680Z] [INFO] --- tycho-p2-plugin:2.2.0:p2-metadata-default (default-p2-metadata-default) @ org.eclipse.ease.lang.scriptarchive.test ---
09:38:18 [2022-05-03T13:38:18.680Z] [INFO] 
09:38:18 [2022-05-03T13:38:18.680Z] [INFO] --- jacoco-maven-plugin:0.8.6:prepare-agent (jacoco-initialize) @ org.eclipse.ease.lang.scriptarchive.test ---
09:38:18 [2022-05-03T13:38:18.680Z] [INFO] tycho.testArgLine set to -javaagent:/home/jenkins/.m2/repository/org/jacoco/org.jacoco.agent/0.8.6/org.jacoco.agent-0.8.6-runtime.jar=destfile=/home/jenkins/agent/workspace/ease.verify.core.target.2019-06/tests/org.eclipse.ease.lang.scriptarchive.test/target/jacoco.exec,output=file
09:38:18 [2022-05-03T13:38:18.680Z] [INFO] 
09:38:18 [2022-05-03T13:38:18.680Z] [INFO] --- tycho-surefire-plugin:2.2.0:test (default-test) @ org.eclipse.ease.lang.scriptarchive.test ---
09:38:18 [2022-05-03T13:38:18.680Z] [INFO] Executing Test Runtime with timeout 0, logs (if any) will be placed at: /home/jenkins/agent/workspace/ease.verify.core.target.2019-06/tests/org.eclipse.ease.lang.scriptarchive.test/target/work/data/.metadata/.log
09:38:18 [2022-05-03T13:38:18.680Z] [INFO] Command line:
09:38:18 [2022-05-03T13:38:18.681Z] 	[/opt/tools/java/openjdk/jdk-15/15.0.2+7/bin/java, -Dosgi.noShutdown=false, -Dosgi.os=linux, -Dosgi.ws=gtk, -Dosgi.arch=x86_64, -javaagent:/home/jenkins/.m2/repository/org/jacoco/org.jacoco.agent/0.8.6/org.jacoco.agent-0.8.6-runtime.jar=destfile=/home/jenkins/agent/workspace/ease.verify.core.target.2019-06/tests/org.eclipse.ease.lang.scriptarchive.test/target/jacoco.exec,output=file, -Dosgi.clean=true, -jar, /home/jenkins/.m2/repository/p2/osgi/bundle/org.eclipse.equinox.launcher/1.6.300.v20210813-1054/org.eclipse.equinox.launcher-1.6.300.v20210813-1054.jar, -data, /home/jenkins/agent/workspace/ease.verify.core.target.2019-06/tests/org.eclipse.ease.lang.scriptarchive.test/target/work/data, -install, /home/jenkins/agent/workspace/ease.verify.core.target.2019-06/tests/org.eclipse.ease.lang.scriptarchive.test/target/work, -configuration, /home/jenkins/agent/workspace/ease.verify.core.target.2019-06/tests/org.eclipse.ease.lang.scriptarchive.test/target/work/configuration, -application, org.eclipse.tycho.surefire.osgibooter.headlesstest, -testproperties, /home/jenkins/agent/workspace/ease.verify.core.target.2019-06/tests/org.eclipse.ease.lang.scriptarchive.test/target/surefire.properties]
09:38:18 [2022-05-03T13:38:18.681Z] Picked up JAVA_TOOL_OPTIONS: -Dmaven.ext.class.path="/home/jenkins/agent/workspace/ease.verify.core.target.2019-06@tmp/withMaven42d6f10b/pipeline-maven-spy.jar" -Dorg.jenkinsci.plugins.pipeline.maven.reportsFolder="/home/jenkins/agent/workspace/ease.verify.core.target.2019-06@tmp/withMaven42d6f10b" 
09:38:23 [2022-05-03T13:38:23.971Z] Running org.eclipse.ease.lang.scriptarchive.ArchiveEngineTest
09:38:23 [2022-05-03T13:38:23.971Z] We are running from a zip file!
09:38:24 [2022-05-03T13:38:24.241Z] org.eclipse.ease.ScriptExecutionException: SyntaxError: missing ; before statement (workspace://__EASE_ScriptArchive_1/scripts/Master.js#3)
09:38:24 [2022-05-03T13:38:24.241Z] this is an error
09:38:24 [2022-05-03T13:38:24.241Z]        ^
09:38:24 [2022-05-03T13:38:24.241Z] 	at Master.js,workspace://__EASE_ScriptArchive_1/scripts/Master.js
09:38:24 [2022-05-03T13:38:24.241Z] org.eclipse.ease.ScriptExecutionException: SyntaxError: missing ; before statement (workspace://__EASE_ScriptArchive_1/scripts/Master.js#3)
09:38:24 [2022-05-03T13:38:24.241Z] this is an error
09:38:24 [2022-05-03T13:38:24.241Z]        ^
09:38:24 [2022-05-03T13:38:24.241Z] 	at Master.js,workspace://__EASE_ScriptArchive_1/scripts/Master.js
09:38:24 [2022-05-03T13:38:24.241Z] Tests run: 7, Failures: 0, Errors: 0, Skipped: 0, Time elapsed: 1.288 s - in org.eclipse.ease.lang.scriptarchive.ArchiveEngineTest
09:38:24 [2022-05-03T13:38:24.241Z] executeWithManifest  Time elapsed: 1.046 s
09:38:24 [2022-05-03T13:38:24.241Z] zipFileRegistration  Time elapsed: 0.019 s
09:38:24 [2022-05-03T13:38:24.241Z] engineIdRegistration  Time elapsed: 0 s
09:38:24 [2022-05-03T13:38:24.241Z] jarFileRegistration  Time elapsed: 0.001 s
09:38:24 [2022-05-03T13:38:24.241Z] sarFileRegistration  Time elapsed: 0.001 s
09:38:24 [2022-05-03T13:38:24.241Z] executeWithErrors  Time elapsed: 0.113 s
09:38:24 [2022-05-03T13:38:24.241Z] executeWithIncludes  Time elapsed: 0.087 s
09:38:24 [2022-05-03T13:38:24.241Z] 
09:38:24 [2022-05-03T13:38:24.241Z] Results:
09:38:24 [2022-05-03T13:38:24.241Z] 
09:38:24 [2022-05-03T13:38:24.241Z] Tests run: 7, Failures: 0, Errors: 0, Skipped: 0
09:38:24 [2022-05-03T13:38:24.241Z] 
09:38:24 [2022-05-03T13:38:24.841Z] [INFO] All tests passed!
09:38:24 [2022-05-03T13:38:24.841Z] [INFO] 
09:38:24 [2022-05-03T13:38:24.841Z] [INFO] --- maven-pmd-plugin:3.16.0:pmd (pmd-integration) @ org.eclipse.ease.lang.scriptarchive.test ---
09:38:24 [2022-05-03T13:38:24.841Z] [INFO] PMD version: 6.42.0
09:38:25 [2022-05-03T13:38:25.140Z] [INFO] 
09:38:25 [2022-05-03T13:38:25.141Z] [INFO] --- maven-pmd-plugin:3.16.0:cpd (pmd-integration) @ org.eclipse.ease.lang.scriptarchive.test ---
09:38:25 [2022-05-03T13:38:25.141Z] [INFO] PMD version: 6.42.0
09:38:25 [2022-05-03T13:38:25.141Z] [INFO] 
09:38:25 [2022-05-03T13:38:25.141Z] [INFO] --- spotbugs-maven-plugin:4.1.4:spotbugs (spotbugs-integration) @ org.eclipse.ease.lang.scriptarchive.test ---
09:38:25 [2022-05-03T13:38:25.141Z] [INFO] Fork Value is false
09:38:25 [2022-05-03T13:38:25.141Z]      [java] JVM args ignored when same JVM is used.
09:38:28 [2022-05-03T13:38:28.540Z] [INFO] Done SpotBugs Analysis....
09:38:28 [2022-05-03T13:38:28.540Z] [INFO] 
09:38:28 [2022-05-03T13:38:28.540Z] [INFO] --- maven-checkstyle-plugin:3.1.1:check (checkstyle-integration) @ org.eclipse.ease.lang.scriptarchive.test ---
09:38:28 [2022-05-03T13:38:28.540Z] [INFO] You have 0 Checkstyle violations.
09:38:28 [2022-05-03T13:38:28.540Z] [INFO] 
09:38:28 [2022-05-03T13:38:28.540Z] [INFO] --- maven-install-plugin:2.3.1:install (default-install) @ org.eclipse.ease.lang.scriptarchive.test ---
09:38:28 [2022-05-03T13:38:28.540Z] [INFO] Installing /home/jenkins/agent/workspace/ease.verify.core.target.2019-06/tests/org.eclipse.ease.lang.scriptarchive.test/target/org.eclipse.ease.lang.scriptarchive.test-0.9.0-SNAPSHOT.jar to /home/jenkins/.m2/repository/org/eclipse/ease/org.eclipse.ease.lang.scriptarchive.test/0.9.0-SNAPSHOT/org.eclipse.ease.lang.scriptarchive.test-0.9.0-SNAPSHOT.jar
09:38:28 [2022-05-03T13:38:28.540Z] [INFO] Installing /home/jenkins/agent/workspace/ease.verify.core.target.2019-06/tests/org.eclipse.ease.lang.scriptarchive.test/pom.xml to /home/jenkins/.m2/repository/org/eclipse/ease/org.eclipse.ease.lang.scriptarchive.test/0.9.0-SNAPSHOT/org.eclipse.ease.lang.scriptarchive.test-0.9.0-SNAPSHOT.pom
09:38:28 [2022-05-03T13:38:28.540Z] [INFO] Installing /home/jenkins/agent/workspace/ease.verify.core.target.2019-06/tests/org.eclipse.ease.lang.scriptarchive.test/target/p2content.xml to /home/jenkins/.m2/repository/org/eclipse/ease/org.eclipse.ease.lang.scriptarchive.test/0.9.0-SNAPSHOT/org.eclipse.ease.lang.scriptarchive.test-0.9.0-SNAPSHOT-p2metadata.xml
09:38:28 [2022-05-03T13:38:28.540Z] [INFO] Installing /home/jenkins/agent/workspace/ease.verify.core.target.2019-06/tests/org.eclipse.ease.lang.scriptarchive.test/target/p2artifacts.xml to /home/jenkins/.m2/repository/org/eclipse/ease/org.eclipse.ease.lang.scriptarchive.test/0.9.0-SNAPSHOT/org.eclipse.ease.lang.scriptarchive.test-0.9.0-SNAPSHOT-p2artifacts.xml
09:38:28 [2022-05-03T13:38:28.540Z] [INFO] 
09:38:28 [2022-05-03T13:38:28.540Z] [INFO] --- tycho-p2-plugin:2.2.0:update-local-index (default-update-local-index) @ org.eclipse.ease.lang.scriptarchive.test ---
09:38:28 [2022-05-03T13:38:28.540Z] [INFO] 
09:38:28 [2022-05-03T13:38:28.540Z] [INFO] --------< org.eclipse.ease:org.eclipse.ease.lang.unittest.test >--------
09:38:28 [2022-05-03T13:38:28.540Z] [INFO] Building org.eclipse.ease.lang.unittest.test 0.9.0-SNAPSHOT      [44/49]
09:38:28 [2022-05-03T13:38:28.540Z] [INFO] ------------------------[ eclipse-test-plugin ]-------------------------
09:38:28 [2022-05-03T13:38:28.540Z] [INFO] 
09:38:28 [2022-05-03T13:38:28.540Z] [INFO] --- maven-clean-plugin:2.5:clean (default-clean) @ org.eclipse.ease.lang.unittest.test ---
09:38:28 [2022-05-03T13:38:28.540Z] [INFO] 
09:38:28 [2022-05-03T13:38:28.540Z] [INFO] --- tycho-packaging-plugin:2.2.0:build-qualifier (default-build-qualifier) @ org.eclipse.ease.lang.unittest.test ---
09:38:28 [2022-05-03T13:38:28.540Z] [INFO] The project's OSGi version is 0.9.0.I202204291053
09:38:28 [2022-05-03T13:38:28.540Z] [INFO] 
09:38:28 [2022-05-03T13:38:28.540Z] [INFO] --- tycho-packaging-plugin:2.2.0:validate-id (default-validate-id) @ org.eclipse.ease.lang.unittest.test ---
09:38:28 [2022-05-03T13:38:28.540Z] [INFO] 
09:38:28 [2022-05-03T13:38:28.540Z] [INFO] --- tycho-packaging-plugin:2.2.0:validate-version (default-validate-version) @ org.eclipse.ease.lang.unittest.test ---
09:38:28 [2022-05-03T13:38:28.540Z] [INFO] 
09:38:28 [2022-05-03T13:38:28.540Z] [INFO] --- maven-resources-plugin:2.4.3:resources (default-resources) @ org.eclipse.ease.lang.unittest.test ---
09:38:28 [2022-05-03T13:38:28.540Z] [INFO] Using 'UTF-8' encoding to copy filtered resources.
09:38:28 [2022-05-03T13:38:28.540Z] [INFO] skip non existing resourceDirectory /home/jenkins/agent/workspace/ease.verify.core.target.2019-06/tests/org.eclipse.ease.lang.unittest.test/src/main/resources
09:38:28 [2022-05-03T13:38:28.540Z] [INFO] 
09:38:28 [2022-05-03T13:38:28.541Z] [INFO] --- tycho-compiler-plugin:2.2.0:compile (default-compile) @ org.eclipse.ease.lang.unittest.test ---
09:38:28 [2022-05-03T13:38:28.541Z] [INFO] Compiling 9 source files to /home/jenkins/agent/workspace/ease.verify.core.target.2019-06/tests/org.eclipse.ease.lang.unittest.test/target/classes
09:38:28 [2022-05-03T13:38:28.842Z] [INFO] 
09:38:28 [2022-05-03T13:38:28.842Z] [INFO] --- maven-resources-plugin:2.4.3:testResources (default-testResources) @ org.eclipse.ease.lang.unittest.test ---
09:38:28 [2022-05-03T13:38:28.842Z] [INFO] Using 'UTF-8' encoding to copy filtered resources.
09:38:28 [2022-05-03T13:38:28.842Z] [INFO] skip non existing resourceDirectory /home/jenkins/agent/workspace/ease.verify.core.target.2019-06/tests/org.eclipse.ease.lang.unittest.test/src/test/resources
09:38:28 [2022-05-03T13:38:28.842Z] [INFO] 
09:38:28 [2022-05-03T13:38:28.842Z] [INFO] --- target-platform-configuration:2.2.0:target-platform (default-target-platform) @ org.eclipse.ease.lang.unittest.test ---
09:38:28 [2022-05-03T13:38:28.842Z] [INFO] 
09:38:28 [2022-05-03T13:38:28.842Z] [INFO] --- tycho-packaging-plugin:2.2.0:package-plugin (default-package-plugin) @ org.eclipse.ease.lang.unittest.test ---
09:38:28 [2022-05-03T13:38:28.842Z] [INFO] Building jar: /home/jenkins/agent/workspace/ease.verify.core.target.2019-06/tests/org.eclipse.ease.lang.unittest.test/target/org.eclipse.ease.lang.unittest.test-0.9.0-SNAPSHOT.jar
09:38:28 [2022-05-03T13:38:28.842Z] [INFO] 
09:38:28 [2022-05-03T13:38:28.842Z] [INFO] --- tycho-p2-plugin:2.2.0:p2-metadata-default (default-p2-metadata-default) @ org.eclipse.ease.lang.unittest.test ---
09:38:28 [2022-05-03T13:38:28.842Z] [INFO] 
09:38:28 [2022-05-03T13:38:28.842Z] [INFO] --- jacoco-maven-plugin:0.8.6:prepare-agent (jacoco-initialize) @ org.eclipse.ease.lang.unittest.test ---
09:38:28 [2022-05-03T13:38:28.843Z] [INFO] tycho.testArgLine set to -javaagent:/home/jenkins/.m2/repository/org/jacoco/org.jacoco.agent/0.8.6/org.jacoco.agent-0.8.6-runtime.jar=destfile=/home/jenkins/agent/workspace/ease.verify.core.target.2019-06/tests/org.eclipse.ease.lang.unittest.test/target/jacoco.exec,output=file
09:38:28 [2022-05-03T13:38:28.843Z] [INFO] 
09:38:28 [2022-05-03T13:38:28.843Z] [INFO] --- tycho-surefire-plugin:2.2.0:test (default-test) @ org.eclipse.ease.lang.unittest.test ---
09:38:29 [2022-05-03T13:38:29.100Z] [INFO] Executing Test Runtime with timeout 0, logs (if any) will be placed at: /home/jenkins/agent/workspace/ease.verify.core.target.2019-06/tests/org.eclipse.ease.lang.unittest.test/target/work/data/.metadata/.log
09:38:29 [2022-05-03T13:38:29.100Z] [INFO] Command line:
09:38:29 [2022-05-03T13:38:29.101Z] 	[/opt/tools/java/openjdk/jdk-15/15.0.2+7/bin/java, -Dosgi.noShutdown=false, -Dosgi.os=linux, -Dosgi.ws=gtk, -Dosgi.arch=x86_64, -javaagent:/home/jenkins/.m2/repository/org/jacoco/org.jacoco.agent/0.8.6/org.jacoco.agent-0.8.6-runtime.jar=destfile=/home/jenkins/agent/workspace/ease.verify.core.target.2019-06/tests/org.eclipse.ease.lang.unittest.test/target/jacoco.exec,output=file, -Dosgi.clean=true, -jar, /home/jenkins/.m2/repository/p2/osgi/bundle/org.eclipse.equinox.launcher/1.6.300.v20210813-1054/org.eclipse.equinox.launcher-1.6.300.v20210813-1054.jar, -data, /home/jenkins/agent/workspace/ease.verify.core.target.2019-06/tests/org.eclipse.ease.lang.unittest.test/target/work/data, -install, /home/jenkins/agent/workspace/ease.verify.core.target.2019-06/tests/org.eclipse.ease.lang.unittest.test/target/work, -configuration, /home/jenkins/agent/workspace/ease.verify.core.target.2019-06/tests/org.eclipse.ease.lang.unittest.test/target/work/configuration, -application, org.eclipse.tycho.surefire.osgibooter.headlesstest, -testproperties, /home/jenkins/agent/workspace/ease.verify.core.target.2019-06/tests/org.eclipse.ease.lang.unittest.test/target/surefire.properties]
09:38:29 [2022-05-03T13:38:29.101Z] Picked up JAVA_TOOL_OPTIONS: -Dmaven.ext.class.path="/home/jenkins/agent/workspace/ease.verify.core.target.2019-06@tmp/withMaven42d6f10b/pipeline-maven-spy.jar" -Dorg.jenkinsci.plugins.pipeline.maven.reportsFolder="/home/jenkins/agent/workspace/ease.verify.core.target.2019-06@tmp/withMaven42d6f10b" 
09:38:34 [2022-05-03T13:38:34.372Z] Running org.eclipse.ease.lang.unittest.runtime.impl.TestTest
09:38:35 [2022-05-03T13:38:35.779Z] Tests run: 30, Failures: 0, Errors: 0, Skipped: 0, Time elapsed: 1.582 s - in org.eclipse.ease.lang.unittest.runtime.impl.TestTest
09:38:35 [2022-05-03T13:38:35.779Z] reset_clears_results  Time elapsed: 0.08 s
09:38:35 [2022-05-03T13:38:35.779Z] hasError_is_false_when_no_error_exists  Time elapsed: 0.002 s
09:38:35 [2022-05-03T13:38:35.779Z] getDuration_is_0_for_not_executed_test  Time elapsed: 0.001 s
09:38:35 [2022-05-03T13:38:35.779Z] getStatus_is_DISABLED_when_1_result_is_disabled  Time elapsed: 0.003 s
09:38:35 [2022-05-03T13:38:35.779Z] reset_clears_status  Time elapsed: 0.178 s
09:38:35 [2022-05-03T13:38:35.779Z] getResults_FAILURE_returns_only_matching_results  Time elapsed: 0.001 s
09:38:35 [2022-05-03T13:38:35.779Z] isDisabled_is_false_for_finished_test  Time elapsed: 0.001 s
09:38:35 [2022-05-03T13:38:35.779Z] getStatus_is_DISABLED_when_entity_status_is_disabled  Time elapsed: 0.001 s
09:38:35 [2022-05-03T13:38:35.779Z] getStatus_is_status_of_worst_result  Time elapsed: 0.001 s
09:38:35 [2022-05-03T13:38:35.779Z] getEstimatedDuration_is_minus_1_by_default  Time elapsed: 0 s
09:38:35 [2022-05-03T13:38:35.779Z] getDuration_returns_current_execution_time_for_running_test  Time elapsed: 0.201 s
09:38:35 [2022-05-03T13:38:35.779Z] setDisabled_marks_test_as_disabled  Time elapsed: 0.001 s
09:38:35 [2022-05-03T13:38:35.779Z] getStatus_is_entity_status_if_it_is_the_worst_status  Time elapsed: 0.001 s
09:38:35 [2022-05-03T13:38:35.779Z] reset_clears_timestamps  Time elapsed: 0.001 s
09:38:35 [2022-05-03T13:38:35.779Z] getResource_returns_parent_resource  Time elapsed: 0.009 s
09:38:35 [2022-05-03T13:38:35.779Z] isDisabled_is_true_when_1_result_is_DISABLED  Time elapsed: 0.001 s
09:38:35 [2022-05-03T13:38:35.779Z] getFullPath_returns_test_name  Time elapsed: 0.001 s
09:38:35 [2022-05-03T13:38:35.779Z] getDuration_returns_execution_time_for_completed_test  Time elapsed: 0.101 s
09:38:35 [2022-05-03T13:38:35.779Z] addError_adds_error_result  Time elapsed: 0.589 s
09:38:35 [2022-05-03T13:38:35.779Z] getFullPath_returns_parent_path_and_test_name  Time elapsed: 0 s
09:38:35 [2022-05-03T13:38:35.779Z] reset_clears_metadata  Time elapsed: 0.002 s
09:38:35 [2022-05-03T13:38:35.779Z] getRoot_returns_root_element  Time elapsed: 0 s
09:38:35 [2022-05-03T13:38:35.779Z] hasError_is_true_when_error_exists  Time elapsed: 0.001 s
09:38:35 [2022-05-03T13:38:35.780Z] setEntityStatus_FINISHED_sets_end_timestamp  Time elapsed: 0.001 s
09:38:35 [2022-05-03T13:38:35.780Z] getWorstResult_returns_worst_execution_result  Time elapsed: 0.001 s
09:38:35 [2022-05-03T13:38:35.780Z] getTestSuite_returns_master_suite  Time elapsed: 0.002 s
09:38:35 [2022-05-03T13:38:35.780Z] isDisabled_is_true_when_status_is_DISABLED  Time elapsed: 0 s
09:38:35 [2022-05-03T13:38:35.780Z] setEntityStatus_RUNNING_sets_start_timestamp  Time elapsed: 0 s
09:38:35 [2022-05-03T13:38:35.780Z] setEndTimestamp_verifies_duration_limit  Time elapsed: 0.025 s
09:38:35 [2022-05-03T13:38:35.780Z] setStackTrace_stores_a_clone_of_the_trace  Time elapsed: 0.346 s
09:38:35 [2022-05-03T13:38:35.780Z] Running org.eclipse.ease.lang.unittest.runtime.impl.TestContainerTest
09:38:35 [2022-05-03T13:38:35.780Z] Tests run: 38, Failures: 0, Errors: 0, Skipped: 1, Time elapsed: 0.355 s - in org.eclipse.ease.lang.unittest.runtime.impl.TestContainerTest
09:38:35 [2022-05-03T13:38:35.780Z] reset_clears_results  Time elapsed: 0 s
09:38:35 [2022-05-03T13:38:35.780Z] hasError_is_false_when_no_error_exists  Time elapsed: 0.001 s
09:38:35 [2022-05-03T13:38:35.780Z] getDuration_is_0_for_not_executed_test  Time elapsed: 0 s
09:38:35 [2022-05-03T13:38:35.780Z] getStatus_is_DISABLED_when_1_result_is_disabled  Time elapsed: 0 s
09:38:35 [2022-05-03T13:38:35.780Z] reset_clears_status  Time elapsed: 0 s
09:38:35 [2022-05-03T13:38:35.780Z] getResults_FAILURE_returns_only_matching_results  Time elapsed: 0 s
09:38:35 [2022-05-03T13:38:35.780Z] isDisabled_is_false_for_finished_test  Time elapsed: 0.001 s
09:38:35 [2022-05-03T13:38:35.780Z] getStatus_is_DISABLED_when_entity_status_is_disabled  Time elapsed: 0 s
09:38:35 [2022-05-03T13:38:35.780Z] getStatus_is_status_of_worst_result  Time elapsed: 0 s
09:38:35 [2022-05-03T13:38:35.780Z] getEstimatedDuration_is_minus_1_by_default  Time elapsed: 0 s
09:38:35 [2022-05-03T13:38:35.780Z] getDuration_returns_current_execution_time_for_running_test  Time elapsed: 0.201 s
09:38:35 [2022-05-03T13:38:35.780Z] setDisabled_marks_test_as_disabled  Time elapsed: 0.001 s
09:38:35 [2022-05-03T13:38:35.780Z] getStatus_is_entity_status_if_it_is_the_worst_status  Time elapsed: 0 s
09:38:35 [2022-05-03T13:38:35.780Z] reset_clears_timestamps  Time elapsed: 0 s
09:38:35 [2022-05-03T13:38:35.780Z] isDisabled_is_true_when_1_result_is_DISABLED  Time elapsed: 0 s
09:38:35 [2022-05-03T13:38:35.780Z] getFullPath_returns_test_name  Time elapsed: 0.001 s
09:38:35 [2022-05-03T13:38:35.780Z] getDuration_returns_execution_time_for_completed_test  Time elapsed: 0.101 s
09:38:35 [2022-05-03T13:38:35.780Z] addError_adds_error_result  Time elapsed: 0.001 s
09:38:35 [2022-05-03T13:38:35.780Z] getFullPath_returns_parent_path_and_test_name  Time elapsed: 0 s
09:38:35 [2022-05-03T13:38:35.780Z] reset_clears_metadata  Time elapsed: 0 s
09:38:35 [2022-05-03T13:38:35.780Z] getRoot_returns_root_element  Time elapsed: 0 s
09:38:35 [2022-05-03T13:38:35.780Z] hasError_is_true_when_error_exists  Time elapsed: 0 s
09:38:35 [2022-05-03T13:38:35.780Z] setEntityStatus_FINISHED_sets_end_timestamp  Time elapsed: 0.001 s
09:38:35 [2022-05-03T13:38:35.780Z] getWorstResult_returns_worst_execution_result  Time elapsed: 0 s
09:38:35 [2022-05-03T13:38:35.780Z] getTestSuite_returns_master_suite  Time elapsed: 0.001 s
09:38:35 [2022-05-03T13:38:35.780Z] isDisabled_is_true_when_status_is_DISABLED  Time elapsed: 0 s
09:38:35 [2022-05-03T13:38:35.780Z] setEntityStatus_RUNNING_sets_start_timestamp  Time elapsed: 0.001 s
09:38:35 [2022-05-03T13:38:35.780Z] hasError_queries_children_for_error_status  Time elapsed: 0.002 s
09:38:35 [2022-05-03T13:38:35.780Z] setTerminated_terminates_children_too  Time elapsed: 0.001 s
09:38:35 [2022-05-03T13:38:35.780Z] getTest_is_null_when_child_test_does_not_exist  Time elapsed: 0 s
09:38:35 [2022-05-03T13:38:35.780Z] getTest_returns_child_with_matching_name  Time elapsed: 0.001 s
09:38:35 [2022-05-03T13:38:35.780Z] getEstimatedDuration_sums_child_estimations  Time elapsed: 0 s
09:38:35 [2022-05-03T13:38:35.780Z] reset_deletes_children_of_type_ITest  Time elapsed: 0.001 s
09:38:35 [2022-05-03T13:38:35.780Z] getResource_returns_parent_resource skipped
09:38:35 [2022-05-03T13:38:35.780Z] getStatus_returns_worst_child_status  Time elapsed: 0 s
09:38:35 [2022-05-03T13:38:35.780Z] getChildContainers_returns_only_containers  Time elapsed: 0 s
09:38:35 [2022-05-03T13:38:35.780Z] getStatus_returns_entity_status  Time elapsed: 0 s
09:38:35 [2022-05-03T13:38:35.780Z] run_executes_each_child  Time elapsed: 0.029 s
09:38:35 [2022-05-03T13:38:35.780Z] Running org.eclipse.ease.lang.unittest.runtime.impl.TestEntityTest
09:38:36 [2022-05-03T13:38:36.343Z] Tests run: 28, Failures: 0, Errors: 0, Skipped: 0, Time elapsed: 0.317 s - in org.eclipse.ease.lang.unittest.runtime.impl.TestEntityTest
09:38:36 [2022-05-03T13:38:36.343Z] reset_clears_results  Time elapsed: 0 s
09:38:36 [2022-05-03T13:38:36.343Z] hasError_is_false_when_no_error_exists  Time elapsed: 0.001 s
09:38:36 [2022-05-03T13:38:36.343Z] getDuration_is_0_for_not_executed_test  Time elapsed: 0 s
09:38:36 [2022-05-03T13:38:36.343Z] getStatus_is_DISABLED_when_1_result_is_disabled  Time elapsed: 0 s
09:38:36 [2022-05-03T13:38:36.343Z] reset_clears_status  Time elapsed: 0 s
09:38:36 [2022-05-03T13:38:36.343Z] getResults_FAILURE_returns_only_matching_results  Time elapsed: 0 s
09:38:36 [2022-05-03T13:38:36.343Z] isDisabled_is_false_for_finished_test  Time elapsed: 0 s
09:38:36 [2022-05-03T13:38:36.343Z] getStatus_is_DISABLED_when_entity_status_is_disabled  Time elapsed: 0.001 s
09:38:36 [2022-05-03T13:38:36.343Z] getStatus_is_status_of_worst_result  Time elapsed: 0.001 s
09:38:36 [2022-05-03T13:38:36.343Z] getEstimatedDuration_is_minus_1_by_default  Time elapsed: 0 s
09:38:36 [2022-05-03T13:38:36.343Z] getDuration_returns_current_execution_time_for_running_test  Time elapsed: 0.201 s
09:38:36 [2022-05-03T13:38:36.343Z] setDisabled_marks_test_as_disabled  Time elapsed: 0.001 s
09:38:36 [2022-05-03T13:38:36.343Z] getStatus_is_entity_status_if_it_is_the_worst_status  Time elapsed: 0.001 s
09:38:36 [2022-05-03T13:38:36.343Z] reset_clears_timestamps  Time elapsed: 0 s
09:38:36 [2022-05-03T13:38:36.343Z] getResource_returns_parent_resource  Time elapsed: 0 s
09:38:36 [2022-05-03T13:38:36.343Z] isDisabled_is_true_when_1_result_is_DISABLED  Time elapsed: 0 s
09:38:36 [2022-05-03T13:38:36.343Z] getFullPath_returns_test_name  Time elapsed: 0 s
09:38:36 [2022-05-03T13:38:36.343Z] getDuration_returns_execution_time_for_completed_test  Time elapsed: 0.1 s
09:38:36 [2022-05-03T13:38:36.343Z] addError_adds_error_result  Time elapsed: 0.001 s
09:38:36 [2022-05-03T13:38:36.343Z] getFullPath_returns_parent_path_and_test_name  Time elapsed: 0.001 s
09:38:36 [2022-05-03T13:38:36.343Z] reset_clears_metadata  Time elapsed: 0 s
09:38:36 [2022-05-03T13:38:36.343Z] getRoot_returns_root_element  Time elapsed: 0 s
09:38:36 [2022-05-03T13:38:36.343Z] hasError_is_true_when_error_exists  Time elapsed: 0.001 s
09:38:36 [2022-05-03T13:38:36.343Z] setEntityStatus_FINISHED_sets_end_timestamp  Time elapsed: 0 s
09:38:36 [2022-05-03T13:38:36.343Z] getWorstResult_returns_worst_execution_result  Time elapsed: 0.001 s
09:38:36 [2022-05-03T13:38:36.343Z] getTestSuite_returns_master_suite  Time elapsed: 0 s
09:38:36 [2022-05-03T13:38:36.343Z] isDisabled_is_true_when_status_is_DISABLED  Time elapsed: 0 s
09:38:36 [2022-05-03T13:38:36.343Z] setEntityStatus_RUNNING_sets_start_timestamp  Time elapsed: 0 s
09:38:36 [2022-05-03T13:38:36.343Z] Running org.eclipse.ease.lang.unittest.runtime.impl.TestFileTest
09:38:36 [2022-05-03T13:38:36.907Z] Tests run: 43, Failures: 0, Errors: 0, Skipped: 2, Time elapsed: 0.558 s - in org.eclipse.ease.lang.unittest.runtime.impl.TestFileTest
09:38:36 [2022-05-03T13:38:36.907Z] reset_clears_results  Time elapsed: 0.001 s
09:38:36 [2022-05-03T13:38:36.907Z] hasError_is_false_when_no_error_exists  Time elapsed: 0.001 s
09:38:36 [2022-05-03T13:38:36.907Z] getDuration_is_0_for_not_executed_test  Time elapsed: 0.001 s
09:38:36 [2022-05-03T13:38:36.907Z] getStatus_is_DISABLED_when_1_result_is_disabled  Time elapsed: 0.001 s
09:38:36 [2022-05-03T13:38:36.907Z] reset_clears_status  Time elapsed: 0.001 s
09:38:36 [2022-05-03T13:38:36.907Z] getResults_FAILURE_returns_only_matching_results  Time elapsed: 0 s
09:38:36 [2022-05-03T13:38:36.907Z] isDisabled_is_false_for_finished_test  Time elapsed: 0.001 s
09:38:36 [2022-05-03T13:38:36.907Z] getStatus_is_DISABLED_when_entity_status_is_disabled  Time elapsed: 0.001 s
09:38:36 [2022-05-03T13:38:36.907Z] getStatus_is_status_of_worst_result  Time elapsed: 0 s
09:38:36 [2022-05-03T13:38:36.907Z] getEstimatedDuration_is_minus_1_by_default  Time elapsed: 0 s
09:38:36 [2022-05-03T13:38:36.907Z] getDuration_returns_current_execution_time_for_running_test  Time elapsed: 0.2 s
09:38:36 [2022-05-03T13:38:36.907Z] setDisabled_marks_test_as_disabled  Time elapsed: 0 s
09:38:36 [2022-05-03T13:38:36.908Z] getStatus_is_entity_status_if_it_is_the_worst_status  Time elapsed: 0.001 s
09:38:36 [2022-05-03T13:38:36.908Z] reset_clears_timestamps  Time elapsed: 0 s
09:38:36 [2022-05-03T13:38:36.908Z] isDisabled_is_true_when_1_result_is_DISABLED  Time elapsed: 0 s
09:38:36 [2022-05-03T13:38:36.908Z] getFullPath_returns_test_name  Time elapsed: 0 s
09:38:36 [2022-05-03T13:38:36.908Z] getDuration_returns_execution_time_for_completed_test  Time elapsed: 0.101 s
09:38:36 [2022-05-03T13:38:36.908Z] addError_adds_error_result  Time elapsed: 0 s
09:38:36 [2022-05-03T13:38:36.908Z] getFullPath_returns_parent_path_and_test_name  Time elapsed: 0 s
09:38:36 [2022-05-03T13:38:36.908Z] reset_clears_metadata  Time elapsed: 0 s
09:38:36 [2022-05-03T13:38:36.908Z] getRoot_returns_root_element  Time elapsed: 0 s
09:38:36 [2022-05-03T13:38:36.908Z] hasError_is_true_when_error_exists  Time elapsed: 0 s
09:38:36 [2022-05-03T13:38:36.908Z] setEntityStatus_FINISHED_sets_end_timestamp  Time elapsed: 0 s
09:38:36 [2022-05-03T13:38:36.908Z] getWorstResult_returns_worst_execution_result  Time elapsed: 0.001 s
09:38:36 [2022-05-03T13:38:36.908Z] getTestSuite_returns_master_suite  Time elapsed: 0 s
09:38:36 [2022-05-03T13:38:36.908Z] isDisabled_is_true_when_status_is_DISABLED  Time elapsed: 0 s
09:38:36 [2022-05-03T13:38:36.908Z] setEntityStatus_RUNNING_sets_start_timestamp  Time elapsed: 0 s
09:38:36 [2022-05-03T13:38:36.908Z] hasError_queries_children_for_error_status  Time elapsed: 0.001 s
09:38:36 [2022-05-03T13:38:36.908Z] setTerminated_terminates_children_too  Time elapsed: 0 s
09:38:36 [2022-05-03T13:38:36.908Z] getTest_is_null_when_child_test_does_not_exist  Time elapsed: 0.001 s
09:38:36 [2022-05-03T13:38:36.908Z] getTest_returns_child_with_matching_name  Time elapsed: 0 s
09:38:36 [2022-05-03T13:38:36.908Z] getEstimatedDuration_sums_child_estimations  Time elapsed: 0 s
09:38:36 [2022-05-03T13:38:36.908Z] reset_deletes_children_of_type_ITest  Time elapsed: 0 s
09:38:36 [2022-05-03T13:38:36.908Z] getResource_returns_parent_resource skipped
09:38:36 [2022-05-03T13:38:36.908Z] getStatus_returns_worst_child_status  Time elapsed: 0 s
09:38:36 [2022-05-03T13:38:36.908Z] getChildContainers_returns_only_containers  Time elapsed: 0 s
09:38:36 [2022-05-03T13:38:36.908Z] getStatus_returns_entity_status  Time elapsed: 0 s
09:38:36 [2022-05-03T13:38:36.908Z] getEstimatedDuration_is_0_for_disabled_status  Time elapsed: 0.001 s
09:38:36 [2022-05-03T13:38:36.908Z] run_adds_error_when_no_engine_is_found  Time elapsed: 0 s
09:38:36 [2022-05-03T13:38:36.908Z] reset_removes_error_markers_from_files  Time elapsed: 0.154 s
09:38:36 [2022-05-03T13:38:36.908Z] reset_disables_TestFile_when_set_in_suite_description  Time elapsed: 0.077 s
09:38:36 [2022-05-03T13:38:36.908Z] run_does_not_execute_disabled_tests  Time elapsed: 0.001 s
09:38:36 [2022-05-03T13:38:36.908Z] run_executes_each_child skipped
09:38:36 [2022-05-03T13:38:36.908Z] Running org.eclipse.ease.lang.unittest.ClassicJavaScriptTest
09:38:38 [2022-05-03T13:38:38.806Z] Tests run: 7, Failures: 0, Errors: 0, Skipped: 0, Time elapsed: 2.12 s - in org.eclipse.ease.lang.unittest.ClassicJavaScriptTest
09:38:38 [2022-05-03T13:38:38.806Z] folderStatus  Time elapsed: 0.98 s
09:38:38 [2022-05-03T13:38:38.806Z] errorTestStatus  Time elapsed: 0.22 s
09:38:38 [2022-05-03T13:38:38.806Z] failureTestStatus  Time elapsed: 0.204 s
09:38:38 [2022-05-03T13:38:38.806Z] verifyOutput  Time elapsed: 0.185 s
09:38:38 [2022-05-03T13:38:38.806Z] suiteStatus  Time elapsed: 0.131 s
09:38:38 [2022-05-03T13:38:38.806Z] ignoreTestStatus  Time elapsed: 0.123 s
09:38:38 [2022-05-03T13:38:38.806Z] passTestStatus  Time elapsed: 0.176 s
09:38:38 [2022-05-03T13:38:38.806Z] Running org.eclipse.ease.lang.unittest.ModernJavaScriptTest
09:38:40 [2022-05-03T13:38:40.178Z] Tests run: 8, Failures: 0, Errors: 0, Skipped: 0, Time elapsed: 1.328 s - in org.eclipse.ease.lang.unittest.ModernJavaScriptTest
09:38:40 [2022-05-03T13:38:40.178Z] folderStatus  Time elapsed: 0.211 s
09:38:40 [2022-05-03T13:38:40.178Z] verifyOutput  Time elapsed: 0.206 s
09:38:40 [2022-05-03T13:38:40.178Z] suiteStatus  Time elapsed: 0.174 s
09:38:40 [2022-05-03T13:38:40.178Z] ignoreTestStatus  Time elapsed: 0.163 s
09:38:40 [2022-05-03T13:38:40.178Z] ignoreTestClassStatus  Time elapsed: 0.17 s
09:38:40 [2022-05-03T13:38:40.178Z] failureTestClassStatus  Time elapsed: 0.153 s
09:38:40 [2022-05-03T13:38:40.178Z] errorTestClassStatus  Time elapsed: 0.145 s
09:38:40 [2022-05-03T13:38:40.178Z] passTestClassStatus  Time elapsed: 0.102 s
09:38:40 [2022-05-03T13:38:40.178Z] Running org.eclipse.ease.lang.unittest.adapters.HeadlessResultAdapterTest
09:38:40 [2022-05-03T13:38:40.438Z] Tests run: 7, Failures: 0, Errors: 0, Skipped: 0, Time elapsed: 0.069 s - in org.eclipse.ease.lang.unittest.adapters.HeadlessResultAdapterTest
09:38:40 [2022-05-03T13:38:40.438Z] getAdapter_declines_to_adapt_generic_object  Time elapsed: 0.002 s
09:38:40 [2022-05-03T13:38:40.438Z] getAdapter_adapts_testsuite_with_failures_to_100  Time elapsed: 0.06 s
09:38:40 [2022-05-03T13:38:40.438Z] adapter_can_be_called_via_adapter_framework  Time elapsed: 0.002 s
09:38:40 [2022-05-03T13:38:40.438Z] getAdapter_adapts_testsuite_with_errors_to_200  Time elapsed: 0.001 s
09:38:40 [2022-05-03T13:38:40.438Z] getAdapterList_returns_only_ITestSuite  Time elapsed: 0.002 s
09:38:40 [2022-05-03T13:38:40.438Z] getAdapter_adapts_testsuite_with_no_errors_to_0  Time elapsed: 0 s
09:38:40 [2022-05-03T13:38:40.438Z] getAdapter_declines_to_adapt_to_Boolean  Time elapsed: 0 s
09:38:40 [2022-05-03T13:38:40.438Z] Running org.eclipse.ease.lang.unittest.definition.impl.TestSuiteDefinitionTest
09:38:40 [2022-05-03T13:38:40.438Z] Tests run: 4, Failures: 0, Errors: 0, Skipped: 0, Time elapsed: 0.006 s - in org.eclipse.ease.lang.unittest.definition.impl.TestSuiteDefinitionTest
09:38:40 [2022-05-03T13:38:40.438Z] setVariable_sets_new_variable  Time elapsed: 0.002 s
09:38:40 [2022-05-03T13:38:40.438Z] setVariable_updates_existing_variable  Time elapsed: 0.001 s
09:38:40 [2022-05-03T13:38:40.438Z] setFlag_throws_on_unknown_flag  Time elapsed: 0.002 s
09:38:40 [2022-05-03T13:38:40.438Z] setFlag_sets_flag  Time elapsed: 0.001 s
09:38:40 [2022-05-03T13:38:40.438Z] 
09:38:40 [2022-05-03T13:38:40.438Z] Results:
09:38:40 [2022-05-03T13:38:40.438Z] 
09:38:40 [2022-05-03T13:38:40.438Z] Tests run: 165, Failures: 0, Errors: 0, Skipped: 3
09:38:40 [2022-05-03T13:38:40.438Z] 
09:38:40 [2022-05-03T13:38:40.696Z] [INFO] All tests passed!
09:38:40 [2022-05-03T13:38:40.696Z] [INFO] 
09:38:40 [2022-05-03T13:38:40.696Z] [INFO] --- maven-pmd-plugin:3.16.0:pmd (pmd-integration) @ org.eclipse.ease.lang.unittest.test ---
09:38:40 [2022-05-03T13:38:40.696Z] [INFO] PMD version: 6.42.0
09:38:41 [2022-05-03T13:38:41.644Z] [INFO] 
09:38:41 [2022-05-03T13:38:41.644Z] [INFO] --- maven-pmd-plugin:3.16.0:cpd (pmd-integration) @ org.eclipse.ease.lang.unittest.test ---
09:38:41 [2022-05-03T13:38:41.644Z] [INFO] PMD version: 6.42.0
09:38:41 [2022-05-03T13:38:41.902Z] [INFO] 
09:38:41 [2022-05-03T13:38:41.902Z] [INFO] --- spotbugs-maven-plugin:4.1.4:spotbugs (spotbugs-integration) @ org.eclipse.ease.lang.unittest.test ---
09:38:41 [2022-05-03T13:38:41.902Z] [INFO] Fork Value is false
09:38:41 [2022-05-03T13:38:41.902Z]      [java] JVM args ignored when same JVM is used.
09:38:46 [2022-05-03T13:38:46.138Z] [INFO] Done SpotBugs Analysis....
09:38:46 [2022-05-03T13:38:46.138Z] [INFO] 
09:38:46 [2022-05-03T13:38:46.138Z] [INFO] --- maven-checkstyle-plugin:3.1.1:check (checkstyle-integration) @ org.eclipse.ease.lang.unittest.test ---
09:38:46 [2022-05-03T13:38:46.138Z] [INFO] You have 0 Checkstyle violations.
09:38:46 [2022-05-03T13:38:46.138Z] [INFO] 
09:38:46 [2022-05-03T13:38:46.138Z] [INFO] --- maven-install-plugin:2.3.1:install (default-install) @ org.eclipse.ease.lang.unittest.test ---
09:38:46 [2022-05-03T13:38:46.138Z] [INFO] Installing /home/jenkins/agent/workspace/ease.verify.core.target.2019-06/tests/org.eclipse.ease.lang.unittest.test/target/org.eclipse.ease.lang.unittest.test-0.9.0-SNAPSHOT.jar to /home/jenkins/.m2/repository/org/eclipse/ease/org.eclipse.ease.lang.unittest.test/0.9.0-SNAPSHOT/org.eclipse.ease.lang.unittest.test-0.9.0-SNAPSHOT.jar
09:38:46 [2022-05-03T13:38:46.138Z] [INFO] Installing /home/jenkins/agent/workspace/ease.verify.core.target.2019-06/tests/org.eclipse.ease.lang.unittest.test/pom.xml to /home/jenkins/.m2/repository/org/eclipse/ease/org.eclipse.ease.lang.unittest.test/0.9.0-SNAPSHOT/org.eclipse.ease.lang.unittest.test-0.9.0-SNAPSHOT.pom
09:38:46 [2022-05-03T13:38:46.138Z] [INFO] Installing /home/jenkins/agent/workspace/ease.verify.core.target.2019-06/tests/org.eclipse.ease.lang.unittest.test/target/p2content.xml to /home/jenkins/.m2/repository/org/eclipse/ease/org.eclipse.ease.lang.unittest.test/0.9.0-SNAPSHOT/org.eclipse.ease.lang.unittest.test-0.9.0-SNAPSHOT-p2metadata.xml
09:38:46 [2022-05-03T13:38:46.138Z] [INFO] Installing /home/jenkins/agent/workspace/ease.verify.core.target.2019-06/tests/org.eclipse.ease.lang.unittest.test/target/p2artifacts.xml to /home/jenkins/.m2/repository/org/eclipse/ease/org.eclipse.ease.lang.unittest.test/0.9.0-SNAPSHOT/org.eclipse.ease.lang.unittest.test-0.9.0-SNAPSHOT-p2artifacts.xml
09:38:46 [2022-05-03T13:38:46.138Z] [INFO] 
09:38:46 [2022-05-03T13:38:46.138Z] [INFO] --- tycho-p2-plugin:2.2.0:update-local-index (default-update-local-index) @ org.eclipse.ease.lang.unittest.test ---
09:38:46 [2022-05-03T13:38:46.138Z] [INFO] 
09:38:46 [2022-05-03T13:38:46.138Z] [INFO] ---------< org.eclipse.ease:org.eclipse.ease.ui.scripts.test >----------
09:38:46 [2022-05-03T13:38:46.138Z] [INFO] Building org.eclipse.ease.ui.scripts.test 0.9.0-SNAPSHOT         [45/49]
09:38:46 [2022-05-03T13:38:46.138Z] [INFO] ------------------------[ eclipse-test-plugin ]-------------------------
09:38:46 [2022-05-03T13:38:46.138Z] [INFO] 
09:38:46 [2022-05-03T13:38:46.138Z] [INFO] --- maven-clean-plugin:2.5:clean (default-clean) @ org.eclipse.ease.ui.scripts.test ---
09:38:46 [2022-05-03T13:38:46.138Z] [INFO] 
09:38:46 [2022-05-03T13:38:46.138Z] [INFO] --- tycho-packaging-plugin:2.2.0:build-qualifier (default-build-qualifier) @ org.eclipse.ease.ui.scripts.test ---
09:38:46 [2022-05-03T13:38:46.138Z] [INFO] The project's OSGi version is 0.9.0.I202106220815
09:38:46 [2022-05-03T13:38:46.138Z] [INFO] 
09:38:46 [2022-05-03T13:38:46.138Z] [INFO] --- tycho-packaging-plugin:2.2.0:validate-id (default-validate-id) @ org.eclipse.ease.ui.scripts.test ---
09:38:46 [2022-05-03T13:38:46.138Z] [INFO] 
09:38:46 [2022-05-03T13:38:46.138Z] [INFO] --- tycho-packaging-plugin:2.2.0:validate-version (default-validate-version) @ org.eclipse.ease.ui.scripts.test ---
09:38:46 [2022-05-03T13:38:46.138Z] [INFO] 
09:38:46 [2022-05-03T13:38:46.139Z] [INFO] --- maven-resources-plugin:2.4.3:resources (default-resources) @ org.eclipse.ease.ui.scripts.test ---
09:38:46 [2022-05-03T13:38:46.139Z] [INFO] Using 'UTF-8' encoding to copy filtered resources.
09:38:46 [2022-05-03T13:38:46.139Z] [INFO] skip non existing resourceDirectory /home/jenkins/agent/workspace/ease.verify.core.target.2019-06/tests/org.eclipse.ease.ui.scripts.test/src/main/resources
09:38:46 [2022-05-03T13:38:46.139Z] [INFO] 
09:38:46 [2022-05-03T13:38:46.139Z] [INFO] --- tycho-compiler-plugin:2.2.0:compile (default-compile) @ org.eclipse.ease.ui.scripts.test ---
09:38:46 [2022-05-03T13:38:46.139Z] [INFO] Compiling 1 source file to /home/jenkins/agent/workspace/ease.verify.core.target.2019-06/tests/org.eclipse.ease.ui.scripts.test/target/classes
09:38:46 [2022-05-03T13:38:46.397Z] [INFO] 
09:38:46 [2022-05-03T13:38:46.397Z] [INFO] --- maven-resources-plugin:2.4.3:testResources (default-testResources) @ org.eclipse.ease.ui.scripts.test ---
09:38:46 [2022-05-03T13:38:46.397Z] [INFO] Using 'UTF-8' encoding to copy filtered resources.
09:38:46 [2022-05-03T13:38:46.397Z] [INFO] skip non existing resourceDirectory /home/jenkins/agent/workspace/ease.verify.core.target.2019-06/tests/org.eclipse.ease.ui.scripts.test/src/test/resources
09:38:46 [2022-05-03T13:38:46.397Z] [INFO] 
09:38:46 [2022-05-03T13:38:46.397Z] [INFO] --- target-platform-configuration:2.2.0:target-platform (default-target-platform) @ org.eclipse.ease.ui.scripts.test ---
09:38:46 [2022-05-03T13:38:46.397Z] [INFO] 
09:38:46 [2022-05-03T13:38:46.397Z] [INFO] --- tycho-packaging-plugin:2.2.0:package-plugin (default-package-plugin) @ org.eclipse.ease.ui.scripts.test ---
09:38:46 [2022-05-03T13:38:46.397Z] [INFO] Building jar: /home/jenkins/agent/workspace/ease.verify.core.target.2019-06/tests/org.eclipse.ease.ui.scripts.test/target/org.eclipse.ease.ui.scripts.test-0.9.0-SNAPSHOT.jar
09:38:46 [2022-05-03T13:38:46.397Z] [INFO] 
09:38:46 [2022-05-03T13:38:46.397Z] [INFO] --- tycho-p2-plugin:2.2.0:p2-metadata-default (default-p2-metadata-default) @ org.eclipse.ease.ui.scripts.test ---
09:38:46 [2022-05-03T13:38:46.397Z] [INFO] 
09:38:46 [2022-05-03T13:38:46.397Z] [INFO] --- jacoco-maven-plugin:0.8.6:prepare-agent (jacoco-initialize) @ org.eclipse.ease.ui.scripts.test ---
09:38:46 [2022-05-03T13:38:46.397Z] [INFO] tycho.testArgLine set to -javaagent:/home/jenkins/.m2/repository/org/jacoco/org.jacoco.agent/0.8.6/org.jacoco.agent-0.8.6-runtime.jar=destfile=/home/jenkins/agent/workspace/ease.verify.core.target.2019-06/tests/org.eclipse.ease.ui.scripts.test/target/jacoco.exec,output=file
09:38:46 [2022-05-03T13:38:46.397Z] [INFO] 
09:38:46 [2022-05-03T13:38:46.397Z] [INFO] --- tycho-surefire-plugin:2.2.0:test (default-test) @ org.eclipse.ease.ui.scripts.test ---
09:38:46 [2022-05-03T13:38:46.397Z] [INFO] Executing Test Runtime with timeout 0, logs (if any) will be placed at: /home/jenkins/agent/workspace/ease.verify.core.target.2019-06/tests/org.eclipse.ease.ui.scripts.test/target/work/data/.metadata/.log
09:38:46 [2022-05-03T13:38:46.397Z] [INFO] Command line:
09:38:46 [2022-05-03T13:38:46.398Z] 	[/opt/tools/java/openjdk/jdk-15/15.0.2+7/bin/java, -Dosgi.noShutdown=false, -Dosgi.os=linux, -Dosgi.ws=gtk, -Dosgi.arch=x86_64, -javaagent:/home/jenkins/.m2/repository/org/jacoco/org.jacoco.agent/0.8.6/org.jacoco.agent-0.8.6-runtime.jar=destfile=/home/jenkins/agent/workspace/ease.verify.core.target.2019-06/tests/org.eclipse.ease.ui.scripts.test/target/jacoco.exec,output=file, -Dosgi.clean=true, -jar, /home/jenkins/.m2/repository/p2/osgi/bundle/org.eclipse.equinox.launcher/1.6.300.v20210813-1054/org.eclipse.equinox.launcher-1.6.300.v20210813-1054.jar, -data, /home/jenkins/agent/workspace/ease.verify.core.target.2019-06/tests/org.eclipse.ease.ui.scripts.test/target/work/data, -install, /home/jenkins/agent/workspace/ease.verify.core.target.2019-06/tests/org.eclipse.ease.ui.scripts.test/target/work, -configuration, /home/jenkins/agent/workspace/ease.verify.core.target.2019-06/tests/org.eclipse.ease.ui.scripts.test/target/work/configuration, -application, org.eclipse.tycho.surefire.osgibooter.headlesstest, -testproperties, /home/jenkins/agent/workspace/ease.verify.core.target.2019-06/tests/org.eclipse.ease.ui.scripts.test/target/surefire.properties]
09:38:46 [2022-05-03T13:38:46.398Z] Picked up JAVA_TOOL_OPTIONS: -Dmaven.ext.class.path="/home/jenkins/agent/workspace/ease.verify.core.target.2019-06@tmp/withMaven42d6f10b/pipeline-maven-spy.jar" -Dorg.jenkinsci.plugins.pipeline.maven.reportsFolder="/home/jenkins/agent/workspace/ease.verify.core.target.2019-06@tmp/withMaven42d6f10b" 
09:38:51 [2022-05-03T13:38:51.746Z] Running org.eclipse.ease.ui.scripts.expressions.definitions.ExpressionFactoryTest
09:38:51 [2022-05-03T13:38:51.746Z] Tests run: 14, Failures: 0, Errors: 0, Skipped: 0, Time elapsed: 0.106 s - in org.eclipse.ease.ui.scripts.expressions.definitions.ExpressionFactoryTest
09:38:51 [2022-05-03T13:38:51.746Z] loadClassWithExpression  Time elapsed: 0.042 s
09:38:51 [2022-05-03T13:38:51.746Z] createWithExpression  Time elapsed: 0.001 s
09:38:51 [2022-05-03T13:38:51.746Z] createReferenceExpression  Time elapsed: 0.002 s
09:38:51 [2022-05-03T13:38:51.746Z] loadClassReferenceExpression  Time elapsed: 0.001 s
09:38:51 [2022-05-03T13:38:51.746Z] loadClassTestExpression  Time elapsed: 0.002 s
09:38:51 [2022-05-03T13:38:51.746Z] createEqualsExpression  Time elapsed: 0.001 s
09:38:51 [2022-05-03T13:38:51.746Z] loadClassCountExpression  Time elapsed: 0.02 s
09:38:51 [2022-05-03T13:38:51.746Z] loadClassOrExpression  Time elapsed: 0.001 s
09:38:51 [2022-05-03T13:38:51.746Z] createTestExpression  Time elapsed: 0.005 s
09:38:51 [2022-05-03T13:38:51.746Z] createOrExpression  Time elapsed: 0.002 s
09:38:51 [2022-05-03T13:38:51.746Z] loadClassAndExpression  Time elapsed: 0.001 s
09:38:51 [2022-05-03T13:38:51.746Z] createAndExpression  Time elapsed: 0.001 s
09:38:51 [2022-05-03T13:38:51.746Z] loadClassEqualsExpression  Time elapsed: 0.001 s
09:38:51 [2022-05-03T13:38:51.746Z] createCountExpression  Time elapsed: 0.001 s
09:38:51 [2022-05-03T13:38:51.746Z] 
09:38:51 [2022-05-03T13:38:51.746Z] Results:
09:38:51 [2022-05-03T13:38:51.746Z] 
09:38:51 [2022-05-03T13:38:51.746Z] Tests run: 14, Failures: 0, Errors: 0, Skipped: 0
09:38:51 [2022-05-03T13:38:51.746Z] 
09:38:51 [2022-05-03T13:38:51.746Z] [INFO] All tests passed!
09:38:51 [2022-05-03T13:38:51.746Z] [INFO] 
09:38:51 [2022-05-03T13:38:51.746Z] [INFO] --- maven-pmd-plugin:3.16.0:pmd (pmd-integration) @ org.eclipse.ease.ui.scripts.test ---
09:38:51 [2022-05-03T13:38:51.746Z] [INFO] PMD version: 6.42.0
09:38:51 [2022-05-03T13:38:51.746Z] [INFO] 
09:38:51 [2022-05-03T13:38:51.746Z] [INFO] --- maven-pmd-plugin:3.16.0:cpd (pmd-integration) @ org.eclipse.ease.ui.scripts.test ---
09:38:51 [2022-05-03T13:38:51.746Z] [INFO] PMD version: 6.42.0
09:38:51 [2022-05-03T13:38:51.746Z] [INFO] 
09:38:51 [2022-05-03T13:38:51.746Z] [INFO] --- spotbugs-maven-plugin:4.1.4:spotbugs (spotbugs-integration) @ org.eclipse.ease.ui.scripts.test ---
09:38:51 [2022-05-03T13:38:51.746Z] [INFO] Fork Value is false
09:38:51 [2022-05-03T13:38:51.746Z]      [java] JVM args ignored when same JVM is used.
09:38:54 [2022-05-03T13:38:54.338Z] [INFO] Done SpotBugs Analysis....
09:38:54 [2022-05-03T13:38:54.339Z] [INFO] 
09:38:54 [2022-05-03T13:38:54.339Z] [INFO] --- maven-checkstyle-plugin:3.1.1:check (checkstyle-integration) @ org.eclipse.ease.ui.scripts.test ---
09:38:54 [2022-05-03T13:38:54.339Z] [INFO] You have 0 Checkstyle violations.
09:38:54 [2022-05-03T13:38:54.339Z] [INFO] 
09:38:54 [2022-05-03T13:38:54.339Z] [INFO] --- maven-install-plugin:2.3.1:install (default-install) @ org.eclipse.ease.ui.scripts.test ---
09:38:54 [2022-05-03T13:38:54.339Z] [INFO] Installing /home/jenkins/agent/workspace/ease.verify.core.target.2019-06/tests/org.eclipse.ease.ui.scripts.test/target/org.eclipse.ease.ui.scripts.test-0.9.0-SNAPSHOT.jar to /home/jenkins/.m2/repository/org/eclipse/ease/org.eclipse.ease.ui.scripts.test/0.9.0-SNAPSHOT/org.eclipse.ease.ui.scripts.test-0.9.0-SNAPSHOT.jar
09:38:54 [2022-05-03T13:38:54.339Z] [INFO] Installing /home/jenkins/agent/workspace/ease.verify.core.target.2019-06/tests/org.eclipse.ease.ui.scripts.test/pom.xml to /home/jenkins/.m2/repository/org/eclipse/ease/org.eclipse.ease.ui.scripts.test/0.9.0-SNAPSHOT/org.eclipse.ease.ui.scripts.test-0.9.0-SNAPSHOT.pom
09:38:54 [2022-05-03T13:38:54.339Z] [INFO] Installing /home/jenkins/agent/workspace/ease.verify.core.target.2019-06/tests/org.eclipse.ease.ui.scripts.test/target/p2content.xml to /home/jenkins/.m2/repository/org/eclipse/ease/org.eclipse.ease.ui.scripts.test/0.9.0-SNAPSHOT/org.eclipse.ease.ui.scripts.test-0.9.0-SNAPSHOT-p2metadata.xml
09:38:54 [2022-05-03T13:38:54.339Z] [INFO] Installing /home/jenkins/agent/workspace/ease.verify.core.target.2019-06/tests/org.eclipse.ease.ui.scripts.test/target/p2artifacts.xml to /home/jenkins/.m2/repository/org/eclipse/ease/org.eclipse.ease.ui.scripts.test/0.9.0-SNAPSHOT/org.eclipse.ease.ui.scripts.test-0.9.0-SNAPSHOT-p2artifacts.xml
09:38:54 [2022-05-03T13:38:54.339Z] [INFO] 
09:38:54 [2022-05-03T13:38:54.339Z] [INFO] --- tycho-p2-plugin:2.2.0:update-local-index (default-update-local-index) @ org.eclipse.ease.ui.scripts.test ---
09:38:54 [2022-05-03T13:38:54.339Z] [INFO] 
09:38:54 [2022-05-03T13:38:54.339Z] [INFO] -------------< org.eclipse.ease:org.eclipse.ease.ui.test >--------------
09:38:54 [2022-05-03T13:38:54.339Z] [INFO] Building org.eclipse.ease.ui.test 0.9.0-SNAPSHOT                 [46/49]
09:38:54 [2022-05-03T13:38:54.339Z] [INFO] ------------------------[ eclipse-test-plugin ]-------------------------
09:38:54 [2022-05-03T13:38:54.339Z] [INFO] 
09:38:54 [2022-05-03T13:38:54.339Z] [INFO] --- maven-clean-plugin:2.5:clean (default-clean) @ org.eclipse.ease.ui.test ---
09:38:54 [2022-05-03T13:38:54.339Z] [INFO] 
09:38:54 [2022-05-03T13:38:54.339Z] [INFO] --- tycho-packaging-plugin:2.2.0:build-qualifier (default-build-qualifier) @ org.eclipse.ease.ui.test ---
09:38:54 [2022-05-03T13:38:54.339Z] [INFO] The project's OSGi version is 0.9.0.I202204260917
09:38:54 [2022-05-03T13:38:54.339Z] [INFO] 
09:38:54 [2022-05-03T13:38:54.339Z] [INFO] --- tycho-packaging-plugin:2.2.0:validate-id (default-validate-id) @ org.eclipse.ease.ui.test ---
09:38:54 [2022-05-03T13:38:54.339Z] [INFO] 
09:38:54 [2022-05-03T13:38:54.339Z] [INFO] --- tycho-packaging-plugin:2.2.0:validate-version (default-validate-version) @ org.eclipse.ease.ui.test ---
09:38:54 [2022-05-03T13:38:54.339Z] [INFO] 
09:38:54 [2022-05-03T13:38:54.339Z] [INFO] --- maven-resources-plugin:2.4.3:resources (default-resources) @ org.eclipse.ease.ui.test ---
09:38:54 [2022-05-03T13:38:54.339Z] [INFO] Using 'UTF-8' encoding to copy filtered resources.
09:38:54 [2022-05-03T13:38:54.339Z] [INFO] skip non existing resourceDirectory /home/jenkins/agent/workspace/ease.verify.core.target.2019-06/tests/org.eclipse.ease.ui.test/src/main/resources
09:38:54 [2022-05-03T13:38:54.339Z] [INFO] 
09:38:54 [2022-05-03T13:38:54.339Z] [INFO] --- tycho-compiler-plugin:2.2.0:compile (default-compile) @ org.eclipse.ease.ui.test ---
09:38:54 [2022-05-03T13:38:54.339Z] [INFO] Compiling 31 source files to /home/jenkins/agent/workspace/ease.verify.core.target.2019-06/tests/org.eclipse.ease.ui.test/target/classes
09:38:55 [2022-05-03T13:38:55.271Z] [INFO] 
09:38:55 [2022-05-03T13:38:55.271Z] [INFO] --- maven-resources-plugin:2.4.3:testResources (default-testResources) @ org.eclipse.ease.ui.test ---
09:38:55 [2022-05-03T13:38:55.271Z] [INFO] Using 'UTF-8' encoding to copy filtered resources.
09:38:55 [2022-05-03T13:38:55.271Z] [INFO] skip non existing resourceDirectory /home/jenkins/agent/workspace/ease.verify.core.target.2019-06/tests/org.eclipse.ease.ui.test/src/test/resources
09:38:55 [2022-05-03T13:38:55.271Z] [INFO] 
09:38:55 [2022-05-03T13:38:55.271Z] [INFO] --- target-platform-configuration:2.2.0:target-platform (default-target-platform) @ org.eclipse.ease.ui.test ---
09:38:55 [2022-05-03T13:38:55.271Z] [INFO] 
09:38:55 [2022-05-03T13:38:55.271Z] [INFO] --- tycho-packaging-plugin:2.2.0:package-plugin (default-package-plugin) @ org.eclipse.ease.ui.test ---
09:38:55 [2022-05-03T13:38:55.271Z] [INFO] Building jar: /home/jenkins/agent/workspace/ease.verify.core.target.2019-06/tests/org.eclipse.ease.ui.test/target/org.eclipse.ease.ui.test-0.9.0-SNAPSHOT.jar
09:38:55 [2022-05-03T13:38:55.271Z] [INFO] 
09:38:55 [2022-05-03T13:38:55.271Z] [INFO] --- tycho-p2-plugin:2.2.0:p2-metadata-default (default-p2-metadata-default) @ org.eclipse.ease.ui.test ---
09:38:55 [2022-05-03T13:38:55.271Z] [INFO] 
09:38:55 [2022-05-03T13:38:55.271Z] [INFO] --- jacoco-maven-plugin:0.8.6:prepare-agent (jacoco-initialize) @ org.eclipse.ease.ui.test ---
09:38:55 [2022-05-03T13:38:55.271Z] [INFO] tycho.testArgLine set to -javaagent:/home/jenkins/.m2/repository/org/jacoco/org.jacoco.agent/0.8.6/org.jacoco.agent-0.8.6-runtime.jar=destfile=/home/jenkins/agent/workspace/ease.verify.core.target.2019-06/tests/org.eclipse.ease.ui.test/target/jacoco.exec,output=file
09:38:55 [2022-05-03T13:38:55.271Z] [INFO] 
09:38:55 [2022-05-03T13:38:55.271Z] [INFO] --- tycho-surefire-plugin:2.2.0:test (default-test) @ org.eclipse.ease.ui.test ---
09:38:55 [2022-05-03T13:38:55.541Z] [INFO] Executing Test Runtime with timeout 0, logs (if any) will be placed at: /home/jenkins/agent/workspace/ease.verify.core.target.2019-06/tests/org.eclipse.ease.ui.test/target/work/data/.metadata/.log
09:38:55 [2022-05-03T13:38:55.541Z] [INFO] Command line:
09:38:55 [2022-05-03T13:38:55.541Z] 	[/opt/tools/java/openjdk/jdk-15/15.0.2+7/bin/java, -Dosgi.noShutdown=false, -Dosgi.os=linux, -Dosgi.ws=gtk, -Dosgi.arch=x86_64, -javaagent:/home/jenkins/.m2/repository/org/jacoco/org.jacoco.agent/0.8.6/org.jacoco.agent-0.8.6-runtime.jar=destfile=/home/jenkins/agent/workspace/ease.verify.core.target.2019-06/tests/org.eclipse.ease.ui.test/target/jacoco.exec,output=file, -Dosgi.clean=true, -jar, /home/jenkins/.m2/repository/p2/osgi/bundle/org.eclipse.equinox.launcher/1.6.300.v20210813-1054/org.eclipse.equinox.launcher-1.6.300.v20210813-1054.jar, -data, /home/jenkins/agent/workspace/ease.verify.core.target.2019-06/tests/org.eclipse.ease.ui.test/target/work/data, -install, /home/jenkins/agent/workspace/ease.verify.core.target.2019-06/tests/org.eclipse.ease.ui.test/target/work, -configuration, /home/jenkins/agent/workspace/ease.verify.core.target.2019-06/tests/org.eclipse.ease.ui.test/target/work/configuration, -application, org.eclipse.tycho.surefire.osgibooter.headlesstest, -testproperties, /home/jenkins/agent/workspace/ease.verify.core.target.2019-06/tests/org.eclipse.ease.ui.test/target/surefire.properties]
09:38:55 [2022-05-03T13:38:55.541Z] Picked up JAVA_TOOL_OPTIONS: -Dmaven.ext.class.path="/home/jenkins/agent/workspace/ease.verify.core.target.2019-06@tmp/withMaven42d6f10b/pipeline-maven-spy.jar" -Dorg.jenkinsci.plugins.pipeline.maven.reportsFolder="/home/jenkins/agent/workspace/ease.verify.core.target.2019-06@tmp/withMaven42d6f10b" 
09:39:00 [2022-05-03T13:39:00.921Z] Running org.eclipse.ease.ui.completion.BasicContextTest
09:39:01 [2022-05-03T13:39:01.853Z] Tests run: 12, Failures: 0, Errors: 0, Skipped: 0, Time elapsed: 1.28 s - in org.eclipse.ease.ui.completion.BasicContextTest
09:39:01 [2022-05-03T13:39:01.853Z] isValid_equals_true  Time elapsed: 0.066 s
09:39:01 [2022-05-03T13:39:01.853Z] getScriptEngine_returns_engine  Time elapsed: 1.154 s
09:39:01 [2022-05-03T13:39:01.853Z] getFilter_removes_string_literal_start  Time elapsed: 0.004 s
09:39:01 [2022-05-03T13:39:01.853Z] getLoadedModules_detects_modules_from_ScriptEngine  Time elapsed: 0.007 s
09:39:01 [2022-05-03T13:39:01.853Z] getFilter_contains_parameter_prefix  Time elapsed: 0.001 s
09:39:01 [2022-05-03T13:39:01.853Z] getLoadedModules_contains_environment_on_resource  Time elapsed: 0.001 s
09:39:01 [2022-05-03T13:39:01.853Z] getLoadedModules_does_not_contain_environment_twice_on_resource  Time elapsed: 0.001 s
09:39:01 [2022-05-03T13:39:01.853Z] getFilter_is_empty  Time elapsed: 0.001 s
09:39:01 [2022-05-03T13:39:01.853Z] getFilter_keeps_spaces_in_string_literal  Time elapsed: 0.001 s
09:39:01 [2022-05-03T13:39:01.853Z] getLoadedModules_detects_loadModule_commands  Time elapsed: 0.001 s
09:39:01 [2022-05-03T13:39:01.853Z] getFilter_is_empty_for_empty_input  Time elapsed: 0 s
09:39:01 [2022-05-03T13:39:01.853Z] isInvalid_equals_true  Time elapsed: 0.002 s
09:39:01 [2022-05-03T13:39:01.853Z] Running org.eclipse.ease.ui.completion.provider.AbstractCompletionProviderTest
09:39:02 [2022-05-03T13:39:02.114Z] Tests run: 16, Failures: 0, Errors: 0, Skipped: 0, Time elapsed: 0.148 s - in org.eclipse.ease.ui.completion.provider.AbstractCompletionProviderTest
09:39:02 [2022-05-03T13:39:02.114Z] isStringParameter_equals_true{String}[1]  Time elapsed: 0.023 s
09:39:02 [2022-05-03T13:39:02.114Z] isStringParameter_equals_true{String}[2]  Time elapsed: 0.001 s
09:39:02 [2022-05-03T13:39:02.114Z] isStringParameter_equals_true{String}[3]  Time elapsed: 0.002 s
09:39:02 [2022-05-03T13:39:02.114Z] isStringParameter_equals_true{String}[4]  Time elapsed: 0.002 s
09:39:02 [2022-05-03T13:39:02.114Z] isMethodParameter_equals_true  Time elapsed: 0.001 s
09:39:02 [2022-05-03T13:39:02.114Z] isMethodParameter_equals_true_for_2nd_parameter  Time elapsed: 0.001 s
09:39:02 [2022-05-03T13:39:02.114Z] isValid_equals_false_for_invalid_context  Time elapsed: 0.027 s
09:39:02 [2022-05-03T13:39:02.114Z] isStringParameter_equals_false{String}[1]  Time elapsed: 0.001 s
09:39:02 [2022-05-03T13:39:02.114Z] isStringParameter_equals_false{String}[2]  Time elapsed: 0.001 s
09:39:02 [2022-05-03T13:39:02.114Z] isStringParameter_equals_false{String}[3]  Time elapsed: 0 s
09:39:02 [2022-05-03T13:39:02.114Z] isStringParameter_equals_false{String}[4]  Time elapsed: 0.001 s
09:39:02 [2022-05-03T13:39:02.114Z] isStringParameter_equals_false{String}[5]  Time elapsed: 0.002 s
09:39:02 [2022-05-03T13:39:02.114Z] isMethodParameter_equals_false_when_no_method_is_detected  Time elapsed: 0.001 s
09:39:02 [2022-05-03T13:39:02.114Z] isValid_equals_true_for_valid_context  Time elapsed: 0.001 s
09:39:02 [2022-05-03T13:39:02.114Z] isMethodParameter_equals_false_for_wrong_method_name  Time elapsed: 0.001 s
09:39:02 [2022-05-03T13:39:02.114Z] isMethodParameter_equals_false_for_wrong_parameter_index  Time elapsed: 0.001 s
09:39:02 [2022-05-03T13:39:02.114Z] Running org.eclipse.ease.ui.completion.provider.VariablesCompletionProviderTest
09:39:02 [2022-05-03T13:39:02.114Z] Tests run: 18, Failures: 0, Errors: 0, Skipped: 0, Time elapsed: 0.104 s - in org.eclipse.ease.ui.completion.provider.VariablesCompletionProviderTest
09:39:02 [2022-05-03T13:39:02.114Z] prepareProposals_instance_contains_integer_variable  Time elapsed: 0.06 s
09:39:02 [2022-05-03T13:39:02.114Z] prepareProposals_instance_contains_string_variable  Time elapsed: 0.002 s
09:39:02 [2022-05-03T13:39:02.114Z] prepareProposals_instance_contains_string_variable_for_filter_input_case_insensitive  Time elapsed: 0.003 s
09:39:02 [2022-05-03T13:39:02.114Z] prepareProposals_instance_contains_string_variable_for_filter_input  Time elapsed: 0.001 s
09:39:02 [2022-05-03T13:39:02.114Z] prepareProposals_does_not_contain_internal_variable  Time elapsed: 0.002 s
09:39:02 [2022-05-03T13:39:02.114Z] isActive_equals_false{String}[1]  Time elapsed: 0.001 s
09:39:02 [2022-05-03T13:39:02.114Z] isActive_equals_false{String}[2]  Time elapsed: 0.001 s
09:39:02 [2022-05-03T13:39:02.114Z] isActive_equals_false{String}[3]  Time elapsed: 0.001 s
09:39:02 [2022-05-03T13:39:02.114Z] isActive_equals_false{String}[4]  Time elapsed: 0.002 s
09:39:02 [2022-05-03T13:39:02.114Z] isActive_equals_false{String}[5]  Time elapsed: 0.002 s
09:39:02 [2022-05-03T13:39:02.114Z] isActive_equals_true{String}[1]  Time elapsed: 0.002 s
09:39:02 [2022-05-03T13:39:02.115Z] isActive_equals_true{String}[2]  Time elapsed: 0.001 s
09:39:02 [2022-05-03T13:39:02.115Z] isActive_equals_true{String}[3]  Time elapsed: 0.001 s
09:39:02 [2022-05-03T13:39:02.115Z] isActive_equals_true{String}[4]  Time elapsed: 0.002 s
09:39:02 [2022-05-03T13:39:02.115Z] isActive_equals_true{String}[5]  Time elapsed: 0.002 s
09:39:02 [2022-05-03T13:39:02.115Z] isActive_equals_true{String}[6]  Time elapsed: 0.002 s
09:39:02 [2022-05-03T13:39:02.115Z] isActive_equals_true{String}[7]  Time elapsed: 0.002 s
09:39:02 [2022-05-03T13:39:02.115Z] isActive_equals_true{String}[8]  Time elapsed: 0.002 s
09:39:02 [2022-05-03T13:39:02.115Z] Running org.eclipse.ease.ui.completion.provider.LoadModuleCompletionProviderTest
09:39:02 [2022-05-03T13:39:02.396Z] Tests run: 12, Failures: 0, Errors: 0, Skipped: 0, Time elapsed: 0.063 s - in org.eclipse.ease.ui.completion.provider.LoadModuleCompletionProviderTest
09:39:02 [2022-05-03T13:39:02.396Z] getProposals_contains_root_entry_with_absolute_filter  Time elapsed: 0.033 s
09:39:02 [2022-05-03T13:39:02.396Z] getProposals_contains_root_entry_with_relative_filter  Time elapsed: 0.002 s
09:39:02 [2022-05-03T13:39:02.396Z] getProposals_contains_category_with_relative_filter  Time elapsed: 0.002 s
09:39:02 [2022-05-03T13:39:02.396Z] getProposals_does_not_contain_root_entry_on_filter_mismatch  Time elapsed: 0.002 s
09:39:02 [2022-05-03T13:39:02.396Z] isActive_equals_false{String}[1]  Time elapsed: 0.002 s
09:39:02 [2022-05-03T13:39:02.396Z] isActive_equals_false{String}[2]  Time elapsed: 0.001 s
09:39:02 [2022-05-03T13:39:02.396Z] isActive_equals_false{String}[3]  Time elapsed: 0.002 s
09:39:02 [2022-05-03T13:39:02.396Z] getProposals_contains_root_entry  Time elapsed: 0.003 s
09:39:02 [2022-05-03T13:39:02.396Z] isActive_equals_true{String}[1]  Time elapsed: 0.001 s
09:39:02 [2022-05-03T13:39:02.396Z] isActive_equals_true{String}[2]  Time elapsed: 0.001 s
09:39:02 [2022-05-03T13:39:02.396Z] getProposals_contains_child_entry_with_absolute_filter  Time elapsed: 0.002 s
09:39:02 [2022-05-03T13:39:02.396Z] getProposals_does_not_contain_entry_on_completed_input  Time elapsed: 0.001 s
09:39:02 [2022-05-03T13:39:02.396Z] Running org.eclipse.ease.ui.completion.provider.AbstractPathCompletionProviderTest
09:39:02 [2022-05-03T13:39:02.396Z] Tests run: 11, Failures: 0, Errors: 0, Skipped: 0, Time elapsed: 0.008 s - in org.eclipse.ease.ui.completion.provider.AbstractPathCompletionProviderTest
09:39:02 [2022-05-03T13:39:02.396Z] filter_keeps_only_lower_level_on_matching_filter  Time elapsed: 0.001 s
09:39:02 [2022-05-03T13:39:02.396Z] filter_removes_nothing_if_context_is_empty  Time elapsed: 0.001 s
09:39:02 [2022-05-03T13:39:02.396Z] getPathsFromElements_is_empty_for_root_elements_only  Time elapsed: 0 s
09:39:02 [2022-05-03T13:39:02.396Z] filter_keeps_only_1st_level_on_empty_filter  Time elapsed: 0 s
09:39:02 [2022-05-03T13:39:02.396Z] filter_keeps_only_1st_level_on_matching_filter  Time elapsed: 0.001 s
09:39:02 [2022-05-03T13:39:02.396Z] getPathsFromElements_is_empty_for_empty_element  Time elapsed: 0 s
09:39:02 [2022-05-03T13:39:02.397Z] filter_removes_mismatches_on_same_level  Time elapsed: 0.001 s
09:39:02 [2022-05-03T13:39:02.397Z] filter_matches_next_level  Time elapsed: 0.001 s
09:39:02 [2022-05-03T13:39:02.397Z] filter_matches_relative_paths  Time elapsed: 0 s
09:39:02 [2022-05-03T13:39:02.397Z] getPathsFromElements_contains_parent_paths  Time elapsed: 0 s
09:39:02 [2022-05-03T13:39:02.397Z] getPathsFromElements_contains_all_hierarchies  Time elapsed: 0.001 s
09:39:02 [2022-05-03T13:39:02.397Z] Running org.eclipse.ease.ui.completion.provider.LoadedModuleCompletionProviderTest
09:39:02 [2022-05-03T13:39:02.397Z] Tests run: 15, Failures: 0, Errors: 0, Skipped: 0, Time elapsed: 0.073 s - in org.eclipse.ease.ui.completion.provider.LoadedModuleCompletionProviderTest
09:39:02 [2022-05-03T13:39:02.397Z] method_proposal_contains_opening_bracket_when_method_has_mandatory_parameters  Time elapsed: 0.013 s
09:39:02 [2022-05-03T13:39:02.397Z] method_proposal_contains_full_method_call_when_method_has_only_optional_parameters  Time elapsed: 0.004 s
09:39:02 [2022-05-03T13:39:02.397Z] getProposals_contains_constant_methods  Time elapsed: 0.003 s
09:39:02 [2022-05-03T13:39:02.397Z] getProposals_contains_module_methods  Time elapsed: 0.031 s
09:39:02 [2022-05-03T13:39:02.397Z] isActive_equals_false{String}[1]  Time elapsed: 0 s
09:39:02 [2022-05-03T13:39:02.397Z] isActive_equals_false{String}[2]  Time elapsed: 0 s
09:39:02 [2022-05-03T13:39:02.397Z] isActive_equals_false{String}[3]  Time elapsed: 0.001 s
09:39:02 [2022-05-03T13:39:02.397Z] isActive_equals_false{String}[4]  Time elapsed: 0.001 s
09:39:02 [2022-05-03T13:39:02.397Z] isActive_equals_true{String}[1]  Time elapsed: 0.001 s
09:39:02 [2022-05-03T13:39:02.397Z] isActive_equals_true{String}[2]  Time elapsed: 0 s
09:39:02 [2022-05-03T13:39:02.397Z] isActive_equals_true{String}[3]  Time elapsed: 0.001 s
09:39:02 [2022-05-03T13:39:02.397Z] isActive_equals_true{String}[4]  Time elapsed: 0.001 s
09:39:02 [2022-05-03T13:39:02.397Z] isActive_equals_true{String}[5]  Time elapsed: 0.001 s
09:39:02 [2022-05-03T13:39:02.397Z] isActive_equals_true{String}[6]  Time elapsed: 0.001 s
09:39:02 [2022-05-03T13:39:02.397Z] method_proposal_contains_full_method_call_when_method_has_no_parameters  Time elapsed: 0.004 s
09:39:02 [2022-05-03T13:39:02.397Z] Running org.eclipse.ease.ui.completion.provider.LocationResolverTest
09:39:02 [2022-05-03T13:39:02.397Z] Tests run: 1, Failures: 0, Errors: 0, Skipped: 0, Time elapsed: 0.004 s - in org.eclipse.ease.ui.completion.provider.LocationResolverTest
09:39:02 [2022-05-03T13:39:02.397Z] getParentString_has_no_trailing_slashes  Time elapsed: 0.003 s
09:39:02 [2022-05-03T13:39:02.397Z] Running org.eclipse.ease.ui.completion.provider.AbstractFileLocationCompletionProviderTest
09:39:02 [2022-05-03T13:39:02.653Z] Tests run: 22, Failures: 0, Errors: 0, Skipped: 0, Time elapsed: 0.206 s - in org.eclipse.ease.ui.completion.provider.AbstractFileLocationCompletionProviderTest
09:39:02 [2022-05-03T13:39:02.653Z] getProposals_does_not_contain_back_proposal_for_project  Time elapsed: 0.148 s
09:39:02 [2022-05-03T13:39:02.653Z] getProposals_does_not_contain_project_root_with_file_resource  Time elapsed: 0.001 s
09:39:02 [2022-05-03T13:39:02.653Z] getProposals_contains_project_root_files_for_project_root  Time elapsed: 0 s
09:39:02 [2022-05-03T13:39:02.653Z] getProposals_contains_files_for_workspace_folder  Time elapsed: 0 s
09:39:02 [2022-05-03T13:39:02.653Z] getProposals_contains_back_for_workspace_folder  Time elapsed: 0.001 s
09:39:02 [2022-05-03T13:39:02.653Z] getProposals_contains_root_file_systems  Time elapsed: 0.001 s
09:39:02 [2022-05-03T13:39:02.653Z] getProposals_contains_files_for_project  Time elapsed: 0 s
09:39:02 [2022-05-03T13:39:02.654Z] back_proposal_contains_correct_replacement_string_for_absolute_workspace_folder_link  Time elapsed: 0.001 s
09:39:02 [2022-05-03T13:39:02.654Z] getProposals_does_not_contain_project_root_without_resource  Time elapsed: 0 s
09:39:02 [2022-05-03T13:39:02.654Z] getProposals_contains_project_root_with_workspace_resource  Time elapsed: 0 s
09:39:02 [2022-05-03T13:39:02.654Z] getProposals_contains_back_for_project_folder  Time elapsed: 0 s
09:39:02 [2022-05-03T13:39:02.654Z] getProposals_contains_project_root_folders_for_workspace_project_with_back_path  Time elapsed: 0 s
09:39:02 [2022-05-03T13:39:02.654Z] getProposals_contains_projects_for_workspace_root  Time elapsed: 0 s
09:39:02 [2022-05-03T13:39:02.654Z] getProposals_contains_project_root_folders_for_workspace_project  Time elapsed: 0.011 s
09:39:02 [2022-05-03T13:39:02.654Z] getProposals_contains_filesystem_root  Time elapsed: 0.001 s
09:39:02 [2022-05-03T13:39:02.654Z] getProposals_contains_files_for_project_folder  Time elapsed: 0.001 s
09:39:02 [2022-05-03T13:39:02.654Z] getProposals_contains_workspace_root  Time elapsed: 0.001 s
09:39:02 [2022-05-03T13:39:02.654Z] getProposals_does_not_contain_back_proposal  Time elapsed: 0.001 s
09:39:02 [2022-05-03T13:39:02.654Z] getProposals_contains_files_for_filesystem  Time elapsed: 0.001 s
09:39:02 [2022-05-03T13:39:02.654Z] getProposals_contains_project_root_files_for_workspace_project  Time elapsed: 0.001 s
09:39:02 [2022-05-03T13:39:02.654Z] getProposals_contains_back_for_filesystem  Time elapsed: 0.001 s
09:39:02 [2022-05-03T13:39:02.654Z] back_proposal_contains_correct_replacement_string_for_relative_workspace_folder_link  Time elapsed: 0.001 s
09:39:02 [2022-05-03T13:39:02.654Z] Running org.eclipse.ease.ui.completion.CodeCompletionAggregatorTest
09:39:02 [2022-05-03T13:39:02.910Z] Tests run: 4, Failures: 0, Errors: 0, Skipped: 0, Time elapsed: 0.188 s - in org.eclipse.ease.ui.completion.CodeCompletionAggregatorTest
09:39:02 [2022-05-03T13:39:02.910Z] context_for_empty_input  Time elapsed: 0.178 s
09:39:02 [2022-05-03T13:39:02.910Z] context_for_root_package_with_suffix  Time elapsed: 0.003 s
09:39:02 [2022-05-03T13:39:02.910Z] getProposals_contains_proposal_from_local_provider  Time elapsed: 0.003 s
09:39:02 [2022-05-03T13:39:02.910Z] context_for_root_package  Time elapsed: 0.001 s
09:39:02 [2022-05-03T13:39:02.910Z] Running org.eclipse.ease.ui.completion.ScriptCompletionProposalTest
09:39:02 [2022-05-03T13:39:02.910Z] Tests run: 8, Failures: 0, Errors: 0, Skipped: 0, Time elapsed: 0.004 s - in org.eclipse.ease.ui.completion.ScriptCompletionProposalTest
09:39:02 [2022-05-03T13:39:02.910Z] getCursorPosition_equals_end_of_inserted_text  Time elapsed: 0 s
09:39:02 [2022-05-03T13:39:02.911Z] getCursorPosition_equals_end_of_appended_text  Time elapsed: 0.001 s
09:39:02 [2022-05-03T13:39:02.911Z] compareTo_lists_higher_priority_first  Time elapsed: 0 s
09:39:02 [2022-05-03T13:39:02.911Z] getContent_inserts_replacement_text  Time elapsed: 0 s
09:39:02 [2022-05-03T13:39:02.911Z] getCursorPosition_equals_end_of_set_text  Time elapsed: 0.001 s
09:39:02 [2022-05-03T13:39:02.911Z] getContent_sets_replacement_text  Time elapsed: 0 s
09:39:02 [2022-05-03T13:39:02.911Z] compareTo_lists_same_prio_in_alphabetic_order  Time elapsed: 0 s
09:39:02 [2022-05-03T13:39:02.911Z] getContent_appends_replacement_text  Time elapsed: 0.001 s
09:39:02 [2022-05-03T13:39:02.911Z] Running org.eclipse.ease.ui.completion.tokenizer.BracketMatcherTest
09:39:02 [2022-05-03T13:39:02.911Z] Tests run: 9, Failures: 0, Errors: 0, Skipped: 0, Time elapsed: 0.003 s - in org.eclipse.ease.ui.completion.tokenizer.BracketMatcherTest
09:39:02 [2022-05-03T13:39:02.911Z] getOpenBrackets_returns_open_brackets_only  Time elapsed: 0.001 s
09:39:02 [2022-05-03T13:39:02.911Z] getBrackets_detects_1  Time elapsed: 0 s
09:39:02 [2022-05-03T13:39:02.911Z] getBrackets_detects_2  Time elapsed: 0 s
09:39:02 [2022-05-03T13:39:02.911Z] getBrackets_detects_3  Time elapsed: 0.001 s
09:39:02 [2022-05-03T13:39:02.911Z] hasOpenBrackets_equals_true  Time elapsed: 0 s
09:39:02 [2022-05-03T13:39:02.911Z] getBrackets_is_empty  Time elapsed: 0 s
09:39:02 [2022-05-03T13:39:02.911Z] hasOpenBrackets_equals_false  Time elapsed: 0.001 s
09:39:02 [2022-05-03T13:39:02.911Z] getBrackets_detects_open_brackets  Time elapsed: 0 s
09:39:02 [2022-05-03T13:39:02.911Z] getBrackets_detects_nested  Time elapsed: 0 s
09:39:02 [2022-05-03T13:39:02.911Z] Running org.eclipse.ease.ui.completion.tokenizer.TokenListTest
09:39:02 [2022-05-03T13:39:02.911Z] Tests run: 1, Failures: 0, Errors: 0, Skipped: 0, Time elapsed: 0.001 s - in org.eclipse.ease.ui.completion.tokenizer.TokenListTest
09:39:02 [2022-05-03T13:39:02.911Z] new_TokenList_is_empty  Time elapsed: 0.001 s
09:39:02 [2022-05-03T13:39:02.911Z] Running org.eclipse.ease.ui.completion.tokenizer.InputTokenizerTest
09:39:02 [2022-05-03T13:39:02.911Z] Tests run: 68, Failures: 0, Errors: 0, Skipped: 0, Time elapsed: 0.092 s - in org.eclipse.ease.ui.completion.tokenizer.InputTokenizerTest
09:39:02 [2022-05-03T13:39:02.911Z] getTokens_detects_method_chaining  Time elapsed: 0.001 s
09:39:02 [2022-05-03T13:39:02.911Z] isDelimiter_equals_true{String}[1]  Time elapsed: 0 s
09:39:02 [2022-05-03T13:39:02.911Z] isDelimiter_equals_true{String}[2]  Time elapsed: 0 s
09:39:02 [2022-05-03T13:39:02.911Z] isDelimiter_equals_true{String}[3]  Time elapsed: 0 s
09:39:02 [2022-05-03T13:39:02.911Z] isDelimiter_equals_true{String}[4]  Time elapsed: 0 s
09:39:02 [2022-05-03T13:39:02.911Z] isDelimiter_equals_true{String}[5]  Time elapsed: 0 s
09:39:02 [2022-05-03T13:39:02.911Z] isDelimiter_equals_true{String}[6]  Time elapsed: 0.001 s
09:39:02 [2022-05-03T13:39:02.911Z] isDelimiter_equals_true{String}[7]  Time elapsed: 0 s
09:39:02 [2022-05-03T13:39:02.911Z] getTokens_detects_package_fragments  Time elapsed: 0 s
09:39:02 [2022-05-03T13:39:02.911Z] getTokens_detects_javascript_method_call  Time elapsed: 0 s
09:39:02 [2022-05-03T13:39:02.911Z] getTokens_detects_incomplete_package  Time elapsed: 0.001 s
09:39:02 [2022-05-03T13:39:02.911Z] getTokens_detects_module_methods_call_chain  Time elapsed: 0.001 s
09:39:02 [2022-05-03T13:39:02.911Z] getTokens_splits_string_literal  Time elapsed: 0 s
09:39:02 [2022-05-03T13:39:02.911Z] getTokens_detects_static_method_call  Time elapsed: 0.001 s
09:39:02 [2022-05-03T13:39:02.911Z] getTokens_detects_method_call_chain  Time elapsed: 0 s
09:39:02 [2022-05-03T13:39:02.911Z] getTokens_simplifies_multiply_operations  Time elapsed: 0 s
09:39:02 [2022-05-03T13:39:02.911Z] getTokens_detects_method_call_parameter_prefix  Time elapsed: 0.001 s
09:39:02 [2022-05-03T13:39:02.911Z] getTokens_detects_method_call_parameters_with_prefix  Time elapsed: 0 s
09:39:02 [2022-05-03T13:39:02.911Z] getTokens_detects_package  Time elapsed: 0.001 s
09:39:02 [2022-05-03T13:39:02.911Z] getTokens_detects_partial_package  Time elapsed: 0 s
09:39:02 [2022-05-03T13:39:02.911Z] getTokens_simplifies_plus_operations  Time elapsed: 0.001 s
09:39:02 [2022-05-03T13:39:02.911Z] getTokens_detects_class  Time elapsed: 0 s
09:39:02 [2022-05-03T13:39:02.911Z] getTokens_detects_opened_module_method  Time elapsed: 0.002 s
09:39:02 [2022-05-03T13:39:02.911Z] getTokens_simplifies_brackets_recursively  Time elapsed: 0 s
09:39:02 [2022-05-03T13:39:02.911Z] getTokens_detects_method_call_parameter  Time elapsed: 0 s
09:39:02 [2022-05-03T13:39:02.911Z] getTokens_simplifies_brackets  Time elapsed: 0.001 s
09:39:02 [2022-05-03T13:39:02.911Z] getTokens_removes_new_operator  Time elapsed: 0 s
09:39:02 [2022-05-03T13:39:02.911Z] isDelimiter_equals_false{String}[1]  Time elapsed: 0 s
09:39:02 [2022-05-03T13:39:02.911Z] isDelimiter_equals_false{String}[2]  Time elapsed: 0 s
09:39:02 [2022-05-03T13:39:02.911Z] isDelimiter_equals_false{String}[3]  Time elapsed: 0 s
09:39:02 [2022-05-03T13:39:02.911Z] getTokens_detects_method_call_parameters  Time elapsed: 0 s
09:39:02 [2022-05-03T13:39:02.911Z] getTokens_detects_class_instantiation  Time elapsed: 0.001 s
09:39:02 [2022-05-03T13:39:02.911Z] getTokens_detects_method_call  Time elapsed: 0.001 s
09:39:02 [2022-05-03T13:39:02.911Z] getTokens_simplifies_divide_operations  Time elapsed: 0 s
09:39:02 [2022-05-03T13:39:02.911Z] getTokens_removes_left_hand_side_of_assignment  Time elapsed: 0 s
09:39:02 [2022-05-03T13:39:02.911Z] getTokens_detects_javascript_class_instantiation  Time elapsed: 0.001 s
09:39:02 [2022-05-03T13:39:02.911Z] getTokens_simplifies_for_loop  Time elapsed: 0 s
09:39:02 [2022-05-03T13:39:02.911Z] getTokens_detects_resolved_javascript_variable_2  Time elapsed: 0.001 s
09:39:02 [2022-05-03T13:39:02.911Z] getTokens_simplifies_minus_operations  Time elapsed: 0 s
09:39:02 [2022-05-03T13:39:02.911Z] getTokens_detects_class_instantiation_2  Time elapsed: 0 s
09:39:02 [2022-05-03T13:39:02.911Z] getTokens_detects_class_instantiation_3  Time elapsed: 0 s
09:39:02 [2022-05-03T13:39:02.911Z] getTokens_simplifies_assignments  Time elapsed: 0.001 s
09:39:02 [2022-05-03T13:39:02.911Z] getTokens_detects_inner_class  Time elapsed: 0 s
09:39:02 [2022-05-03T13:39:02.911Z] getTokens_detects_static_method_call_with_dot_prefix  Time elapsed: 0 s
09:39:02 [2022-05-03T13:39:02.911Z] getTokens_detects_class_2  Time elapsed: 0 s
09:39:02 [2022-05-03T13:39:02.911Z] isTextFilter_equals_false{String}[1]  Time elapsed: 0 s
09:39:02 [2022-05-03T13:39:02.911Z] isTextFilter_equals_false{String}[2]  Time elapsed: 0 s
09:39:02 [2022-05-03T13:39:02.911Z] isTextFilter_equals_false{String}[3]  Time elapsed: 0.001 s
09:39:02 [2022-05-03T13:39:02.911Z] isTextFilter_equals_false{String}[4]  Time elapsed: 0 s
09:39:02 [2022-05-03T13:39:02.911Z] isTextFilter_equals_false{String}[5]  Time elapsed: 0 s
09:39:02 [2022-05-03T13:39:02.911Z] getTokens_does_not_split_within_string_literal  Time elapsed: 0 s
09:39:02 [2022-05-03T13:39:02.911Z] getTokens_1  Time elapsed: 0 s
09:39:02 [2022-05-03T13:39:02.911Z] isTextFilter_equals_true{String}[1]  Time elapsed: 0 s
09:39:02 [2022-05-03T13:39:02.911Z] isTextFilter_equals_true{String}[2]  Time elapsed: 0.001 s
09:39:02 [2022-05-03T13:39:02.911Z] getTokens_detects_opened_module_method_with_filter  Time elapsed: 0 s
09:39:02 [2022-05-03T13:39:02.911Z] getTokens_detects_method_call_request_with_filter  Time elapsed: 0 s
09:39:02 [2022-05-03T13:39:02.911Z] getTokens_for_empty_input  Time elapsed: 0 s
09:39:02 [2022-05-03T13:39:02.911Z] getTokens_detects_package_with_class_prefix  Time elapsed: 0.001 s
09:39:02 [2022-05-03T13:39:02.911Z] getTokens_detects_module_methods  Time elapsed: 0.001 s
09:39:02 [2022-05-03T13:39:02.911Z] getTokens_detects_completed_method  Time elapsed: 0 s
09:39:02 [2022-05-03T13:39:02.912Z] getTokens_detects_resolved_javascript_variable_with_method  Time elapsed: 0.001 s
09:39:02 [2022-05-03T13:39:02.912Z] getTokens_detects_resolved_javascript_variable  Time elapsed: 0.001 s
09:39:02 [2022-05-03T13:39:02.912Z] getTokens_simplifies_string_literal_1  Time elapsed: 0 s
09:39:02 [2022-05-03T13:39:02.912Z] getTokens_simplifies_string_literal_2  Time elapsed: 0.001 s
09:39:02 [2022-05-03T13:39:02.912Z] getTokens_is_empty_after_string_literal  Time elapsed: 0.001 s
09:39:02 [2022-05-03T13:39:02.912Z] getTokens_detects_static_method_call_chain  Time elapsed: 0 s
09:39:02 [2022-05-03T13:39:02.912Z] getTokens_detects_opened_module_method_with_parameter  Time elapsed: 0 s
09:39:02 [2022-05-03T13:39:02.912Z] getTokens_detects_javascript_object_call  Time elapsed: 0.001 s
09:39:02 [2022-05-03T13:39:02.912Z] Running org.eclipse.ease.ui.view.DropinsSelectionProviderTest
09:39:03 [2022-05-03T13:39:03.865Z] Tests run: 3, Failures: 0, Errors: 0, Skipped: 0, Time elapsed: 0.776 s - in org.eclipse.ease.ui.view.DropinsSelectionProviderTest
09:39:03 [2022-05-03T13:39:03.866Z] removeSelectionChangedListener_unregisters_listener  Time elapsed: 0.771 s
09:39:03 [2022-05-03T13:39:03.866Z] getSelection_is_not_null  Time elapsed: 0.003 s
09:39:03 [2022-05-03T13:39:03.866Z] addSelectionChangedListener_registers_listener  Time elapsed: 0.001 s
09:39:03 [2022-05-03T13:39:03.866Z] Running org.eclipse.ease.ui.views.shell.dropins.variables.ContentLabelProviderTest
09:39:03 [2022-05-03T13:39:03.866Z] Tests run: 1, Failures: 0, Errors: 0, Skipped: 0, Time elapsed: 0.146 s - in org.eclipse.ease.ui.views.shell.dropins.variables.ContentLabelProviderTest
09:39:03 [2022-05-03T13:39:03.866Z] getText_returns_variable_content  Time elapsed: 0.145 s
09:39:03 [2022-05-03T13:39:03.866Z] Running org.eclipse.ease.ui.views.shell.dropins.variables.VariablesContentProviderTest
09:39:03 [2022-05-03T13:39:03.866Z] Tests run: 5, Failures: 0, Errors: 0, Skipped: 0, Time elapsed: 0.051 s - in org.eclipse.ease.ui.views.shell.dropins.variables.VariablesContentProviderTest
09:39:03 [2022-05-03T13:39:03.866Z] hasChildren_true_when_child_nodes_are_available  Time elapsed: 0.002 s
09:39:03 [2022-05-03T13:39:03.866Z] getChildren_is_empty_when_no_child_nodes_are_available  Time elapsed: 0.001 s
09:39:03 [2022-05-03T13:39:03.866Z] getElements_contains_variables_from_engine  Time elapsed: 0.044 s
09:39:03 [2022-05-03T13:39:03.866Z] hasChildren_false_when_no_child_nodes_are_available  Time elapsed: 0.001 s
09:39:03 [2022-05-03T13:39:03.866Z] getChildren_not_empty_when_child_nodes_are_available  Time elapsed: 0.001 s
09:39:03 [2022-05-03T13:39:03.866Z] Running org.eclipse.ease.ui.views.shell.dropins.variables.HiddenVariablesFilterTest
09:39:03 [2022-05-03T13:39:03.866Z] Tests run: 3, Failures: 0, Errors: 0, Skipped: 0, Time elapsed: 0.004 s - in org.eclipse.ease.ui.views.shell.dropins.variables.HiddenVariablesFilterTest
09:39:03 [2022-05-03T13:39:03.866Z] select_accepts_unknown_classes  Time elapsed: 0.001 s
09:39:03 [2022-05-03T13:39:03.866Z] select_accepts_script_variables  Time elapsed: 0 s
09:39:03 [2022-05-03T13:39:03.866Z] select_declines_hidden_script_variables  Time elapsed: 0 s
09:39:03 [2022-05-03T13:39:03.866Z] Running org.eclipse.ease.ui.views.shell.dropins.variables.VariablesComparatorTest
09:39:04 [2022-05-03T13:39:04.138Z] Tests run: 1, Failures: 0, Errors: 0, Skipped: 0, Time elapsed: 0.091 s - in org.eclipse.ease.ui.views.shell.dropins.variables.VariablesComparatorTest
09:39:04 [2022-05-03T13:39:04.138Z] lastExecutionResult_comes_before_debugVariable  Time elapsed: 0.091 s
09:39:04 [2022-05-03T13:39:04.138Z] Running org.eclipse.ease.ui.views.shell.dropins.variables.VariablesLabelProviderTest
09:39:04 [2022-05-03T13:39:04.138Z] Tests run: 1, Failures: 0, Errors: 0, Skipped: 0, Time elapsed: 0.003 s - in org.eclipse.ease.ui.views.shell.dropins.variables.VariablesLabelProviderTest
09:39:04 [2022-05-03T13:39:04.138Z] getText_returns_variable_name  Time elapsed: 0.003 s
09:39:04 [2022-05-03T13:39:04.138Z] Running org.eclipse.ease.ui.views.shell.dropins.AbstractDropinTest
09:39:04 [2022-05-03T13:39:04.138Z] Tests run: 3, Failures: 0, Errors: 0, Skipped: 0, Time elapsed: 0.028 s - in org.eclipse.ease.ui.views.shell.dropins.AbstractDropinTest
09:39:04 [2022-05-03T13:39:04.138Z] getSelectionProvider_is_not_null  Time elapsed: 0.027 s
09:39:04 [2022-05-03T13:39:04.138Z] getScriptEngine_returns_current_script_engine  Time elapsed: 0.001 s
09:39:04 [2022-05-03T13:39:04.138Z] getSelectionProvider_getSelection_is_empty  Time elapsed: 0 s
09:39:04 [2022-05-03T13:39:04.138Z] Running org.eclipse.ease.ui.views.shell.dropins.DropinToolsTest
09:39:04 [2022-05-03T13:39:04.138Z] 
09:39:04 [2022-05-03T13:39:04.138Z] (java:2573): Gdk-CRITICAL **: 13:39:03.945: gdk_threads_set_lock_functions: assertion 'gdk_threads_lock == NULL && gdk_threads_unlock == NULL' failed
09:39:04 [2022-05-03T13:39:04.138Z] 
09:39:04 [2022-05-03T13:39:04.138Z] (java:2573): Gdk-CRITICAL **: 13:39:03.947: gdk_threads_set_lock_functions: assertion 'gdk_threads_lock == NULL && gdk_threads_unlock == NULL' failed
09:39:04 [2022-05-03T13:39:04.138Z] 
09:39:04 [2022-05-03T13:39:04.138Z] (java:2573): Gdk-CRITICAL **: 13:39:03.952: gdk_threads_set_lock_functions: assertion 'gdk_threads_lock == NULL && gdk_threads_unlock == NULL' failed
09:39:04 [2022-05-03T13:39:04.138Z] 
09:39:04 [2022-05-03T13:39:04.138Z] (java:2573): Gdk-CRITICAL **: 13:39:03.954: gdk_threads_set_lock_functions: assertion 'gdk_threads_lock == NULL && gdk_threads_unlock == NULL' failed
09:39:04 [2022-05-03T13:39:04.138Z] 
09:39:04 [2022-05-03T13:39:04.138Z] (java:2573): Gdk-CRITICAL **: 13:39:03.955: gdk_threads_set_lock_functions: assertion 'gdk_threads_lock == NULL && gdk_threads_unlock == NULL' failed
09:39:04 [2022-05-03T13:39:04.138Z] Tests run: 3, Failures: 0, Errors: 0, Skipped: 1, Time elapsed: 0.056 s - in org.eclipse.ease.ui.views.shell.dropins.DropinToolsTest
09:39:04 [2022-05-03T13:39:04.138Z] getAvailableDropins_does_not_contain_InvalidDropin  Time elapsed: 0.049 s
09:39:04 [2022-05-03T13:39:04.138Z] getAvailableDropins_contains_DummyDropin skipped
09:39:04 [2022-05-03T13:39:04.138Z] getAvailableDropins_is_not_null  Time elapsed: 0.005 s
09:39:04 [2022-05-03T13:39:04.138Z] Running org.eclipse.ease.ui.views.shell.dropins.modules.ModulesStackLabelProviderTest
09:39:04 [2022-05-03T13:39:04.138Z] Tests run: 2, Failures: 0, Errors: 0, Skipped: 0, Time elapsed: 0.002 s - in org.eclipse.ease.ui.views.shell.dropins.modules.ModulesStackLabelProviderTest
09:39:04 [2022-05-03T13:39:04.138Z] getText_returns_definition_name  Time elapsed: 0.001 s
09:39:04 [2022-05-03T13:39:04.138Z] getText_returns_full_class_name_name  Time elapsed: 0 s
09:39:04 [2022-05-03T13:39:04.138Z] Running org.eclipse.ease.ui.views.shell.dropins.modules.ModulesStackContentProviderTest
09:39:04 [2022-05-03T13:39:04.138Z] Tests run: 2, Failures: 0, Errors: 0, Skipped: 0, Time elapsed: 0.023 s - in org.eclipse.ease.ui.views.shell.dropins.modules.ModulesStackContentProviderTest
09:39:04 [2022-05-03T13:39:04.138Z] getElements_returns_modules  Time elapsed: 0.022 s
09:39:04 [2022-05-03T13:39:04.138Z] getElements_returns_empty_list_without_environment  Time elapsed: 0.001 s
09:39:04 [2022-05-03T13:39:04.138Z] Running org.eclipse.ease.ui.help.hovers.ModuleHelpTest
09:39:04 [2022-05-03T13:39:04.138Z] Tests run: 4, Failures: 0, Errors: 0, Skipped: 4, Time elapsed: 0.001 s - in org.eclipse.ease.ui.help.hovers.ModuleHelpTest
09:39:04 [2022-05-03T13:39:04.138Z] getModuleHelpLocation skipped
09:39:04 [2022-05-03T13:39:04.138Z] getModuleHelp skipped
09:39:04 [2022-05-03T13:39:04.138Z] getMethodHelp skipped
09:39:04 [2022-05-03T13:39:04.138Z] getConstantHelp skipped
09:39:04 [2022-05-03T13:39:04.138Z] Running org.eclipse.ease.ui.dnd.ResourceDropHandlerTest
09:39:04 [2022-05-03T13:39:04.395Z] Tests run: 4, Failures: 0, Errors: 0, Skipped: 0, Time elapsed: 0.204 s - in org.eclipse.ease.ui.dnd.ResourceDropHandlerTest
09:39:04 [2022-05-03T13:39:04.395Z] performDrop_includes_URI_instance  Time elapsed: 0.022 s
09:39:04 [2022-05-03T13:39:04.395Z] performDrop_includes_File_instance  Time elapsed: 0.083 s
09:39:04 [2022-05-03T13:39:04.395Z] accepts_returns_false_for_String_input  Time elapsed: 0.004 s
09:39:04 [2022-05-03T13:39:04.395Z] performDrop_includes_IFile_instance  Time elapsed: 0.093 s
09:39:04 [2022-05-03T13:39:04.395Z] Running org.eclipse.ease.ui.dnd.ModulesDropHandlerTest
09:39:04 [2022-05-03T13:39:04.395Z] Tests run: 5, Failures: 0, Errors: 0, Skipped: 0, Time elapsed: 0.082 s - in org.eclipse.ease.ui.dnd.ModulesDropHandlerTest
09:39:04 [2022-05-03T13:39:04.395Z] accepts_true_for_ModuleEntry  Time elapsed: 0.015 s
09:39:04 [2022-05-03T13:39:04.395Z] performDrop_of_Method_executes_with_default_parameters_on_DROP_COPY  Time elapsed: 0.027 s
09:39:04 [2022-05-03T13:39:04.395Z] performDrop_of_ModuleEntry_loads_module  Time elapsed: 0.003 s
09:39:04 [2022-05-03T13:39:04.395Z] accepts_true_for_ModuleDefinition  Time elapsed: 0.034 s
09:39:04 [2022-05-03T13:39:04.395Z] performDrop_of_ModuleDefinition_loads_module  Time elapsed: 0.002 s
09:39:04 [2022-05-03T13:39:04.395Z] 
09:39:04 [2022-05-03T13:39:04.395Z] Results:
09:39:04 [2022-05-03T13:39:04.395Z] 
09:39:04 [2022-05-03T13:39:04.395Z] Tests run: 234, Failures: 0, Errors: 0, Skipped: 5
09:39:04 [2022-05-03T13:39:04.395Z] 
09:39:04 [2022-05-03T13:39:04.652Z] [INFO] All tests passed!
09:39:04 [2022-05-03T13:39:04.652Z] [INFO] 
09:39:04 [2022-05-03T13:39:04.652Z] [INFO] --- maven-pmd-plugin:3.16.0:pmd (pmd-integration) @ org.eclipse.ease.ui.test ---
09:39:04 [2022-05-03T13:39:04.652Z] [INFO] PMD version: 6.42.0
09:39:06 [2022-05-03T13:39:06.602Z] [INFO] 
09:39:06 [2022-05-03T13:39:06.603Z] [INFO] --- maven-pmd-plugin:3.16.0:cpd (pmd-integration) @ org.eclipse.ease.ui.test ---
09:39:06 [2022-05-03T13:39:06.603Z] [INFO] PMD version: 6.42.0
09:39:06 [2022-05-03T13:39:06.603Z] [INFO] 
09:39:06 [2022-05-03T13:39:06.603Z] [INFO] --- spotbugs-maven-plugin:4.1.4:spotbugs (spotbugs-integration) @ org.eclipse.ease.ui.test ---
09:39:06 [2022-05-03T13:39:06.603Z] [INFO] Fork Value is false
09:39:06 [2022-05-03T13:39:06.603Z]      [java] JVM args ignored when same JVM is used.
09:39:13 [2022-05-03T13:39:13.165Z] [INFO] Done SpotBugs Analysis....
09:39:13 [2022-05-03T13:39:13.165Z] [INFO] 
09:39:13 [2022-05-03T13:39:13.165Z] [INFO] --- maven-checkstyle-plugin:3.1.1:check (checkstyle-integration) @ org.eclipse.ease.ui.test ---
09:39:13 [2022-05-03T13:39:13.165Z] [INFO] You have 0 Checkstyle violations.
09:39:13 [2022-05-03T13:39:13.165Z] [INFO] 
09:39:13 [2022-05-03T13:39:13.165Z] [INFO] --- maven-install-plugin:2.3.1:install (default-install) @ org.eclipse.ease.ui.test ---
09:39:13 [2022-05-03T13:39:13.165Z] [INFO] Installing /home/jenkins/agent/workspace/ease.verify.core.target.2019-06/tests/org.eclipse.ease.ui.test/target/org.eclipse.ease.ui.test-0.9.0-SNAPSHOT.jar to /home/jenkins/.m2/repository/org/eclipse/ease/org.eclipse.ease.ui.test/0.9.0-SNAPSHOT/org.eclipse.ease.ui.test-0.9.0-SNAPSHOT.jar
09:39:13 [2022-05-03T13:39:13.165Z] [INFO] Installing /home/jenkins/agent/workspace/ease.verify.core.target.2019-06/tests/org.eclipse.ease.ui.test/pom.xml to /home/jenkins/.m2/repository/org/eclipse/ease/org.eclipse.ease.ui.test/0.9.0-SNAPSHOT/org.eclipse.ease.ui.test-0.9.0-SNAPSHOT.pom
09:39:13 [2022-05-03T13:39:13.165Z] [INFO] Installing /home/jenkins/agent/workspace/ease.verify.core.target.2019-06/tests/org.eclipse.ease.ui.test/target/p2content.xml to /home/jenkins/.m2/repository/org/eclipse/ease/org.eclipse.ease.ui.test/0.9.0-SNAPSHOT/org.eclipse.ease.ui.test-0.9.0-SNAPSHOT-p2metadata.xml
09:39:13 [2022-05-03T13:39:13.165Z] [INFO] Installing /home/jenkins/agent/workspace/ease.verify.core.target.2019-06/tests/org.eclipse.ease.ui.test/target/p2artifacts.xml to /home/jenkins/.m2/repository/org/eclipse/ease/org.eclipse.ease.ui.test/0.9.0-SNAPSHOT/org.eclipse.ease.ui.test-0.9.0-SNAPSHOT-p2artifacts.xml
09:39:13 [2022-05-03T13:39:13.165Z] [INFO] 
09:39:13 [2022-05-03T13:39:13.165Z] [INFO] --- tycho-p2-plugin:2.2.0:update-local-index (default-update-local-index) @ org.eclipse.ease.ui.test ---
09:39:13 [2022-05-03T13:39:13.165Z] [INFO] 
09:39:13 [2022-05-03T13:39:13.165Z] [INFO] -----< org.eclipse.ease:org.eclipse.ease.ui.completions.java.test >-----
09:39:13 [2022-05-03T13:39:13.165Z] [INFO] Building org.eclipse.ease.ui.completions.java.test 0.9.0-SNAPSHOT [47/49]
09:39:13 [2022-05-03T13:39:13.165Z] [INFO] ------------------------[ eclipse-test-plugin ]-------------------------
09:39:13 [2022-05-03T13:39:13.165Z] [INFO] 
09:39:13 [2022-05-03T13:39:13.165Z] [INFO] --- maven-clean-plugin:2.5:clean (default-clean) @ org.eclipse.ease.ui.completions.java.test ---
09:39:13 [2022-05-03T13:39:13.165Z] [INFO] 
09:39:13 [2022-05-03T13:39:13.166Z] [INFO] --- tycho-packaging-plugin:2.2.0:build-qualifier (default-build-qualifier) @ org.eclipse.ease.ui.completions.java.test ---
09:39:13 [2022-05-03T13:39:13.166Z] [INFO] The project's OSGi version is 0.9.0.I202110141644
09:39:13 [2022-05-03T13:39:13.166Z] [INFO] 
09:39:13 [2022-05-03T13:39:13.166Z] [INFO] --- tycho-packaging-plugin:2.2.0:validate-id (default-validate-id) @ org.eclipse.ease.ui.completions.java.test ---
09:39:13 [2022-05-03T13:39:13.166Z] [INFO] 
09:39:13 [2022-05-03T13:39:13.166Z] [INFO] --- tycho-packaging-plugin:2.2.0:validate-version (default-validate-version) @ org.eclipse.ease.ui.completions.java.test ---
09:39:13 [2022-05-03T13:39:13.166Z] [INFO] 
09:39:13 [2022-05-03T13:39:13.166Z] [INFO] --- maven-resources-plugin:2.4.3:resources (default-resources) @ org.eclipse.ease.ui.completions.java.test ---
09:39:13 [2022-05-03T13:39:13.166Z] [INFO] Using 'UTF-8' encoding to copy filtered resources.
09:39:13 [2022-05-03T13:39:13.166Z] [INFO] skip non existing resourceDirectory /home/jenkins/agent/workspace/ease.verify.core.target.2019-06/tests/org.eclipse.ease.ui.completions.java.test/src/main/resources
09:39:13 [2022-05-03T13:39:13.166Z] [INFO] 
09:39:13 [2022-05-03T13:39:13.166Z] [INFO] --- tycho-compiler-plugin:2.2.0:compile (default-compile) @ org.eclipse.ease.ui.completions.java.test ---
09:39:13 [2022-05-03T13:39:13.166Z] [INFO] Compiling 4 source files to /home/jenkins/agent/workspace/ease.verify.core.target.2019-06/tests/org.eclipse.ease.ui.completions.java.test/target/classes
09:39:13 [2022-05-03T13:39:13.166Z] [INFO] 
09:39:13 [2022-05-03T13:39:13.166Z] [INFO] --- maven-resources-plugin:2.4.3:testResources (default-testResources) @ org.eclipse.ease.ui.completions.java.test ---
09:39:13 [2022-05-03T13:39:13.166Z] [INFO] Using 'UTF-8' encoding to copy filtered resources.
09:39:13 [2022-05-03T13:39:13.166Z] [INFO] skip non existing resourceDirectory /home/jenkins/agent/workspace/ease.verify.core.target.2019-06/tests/org.eclipse.ease.ui.completions.java.test/src/test/resources
09:39:13 [2022-05-03T13:39:13.166Z] [INFO] 
09:39:13 [2022-05-03T13:39:13.166Z] [INFO] --- target-platform-configuration:2.2.0:target-platform (default-target-platform) @ org.eclipse.ease.ui.completions.java.test ---
09:39:13 [2022-05-03T13:39:13.166Z] [INFO] 
09:39:13 [2022-05-03T13:39:13.166Z] [INFO] --- tycho-packaging-plugin:2.2.0:package-plugin (default-package-plugin) @ org.eclipse.ease.ui.completions.java.test ---
09:39:13 [2022-05-03T13:39:13.166Z] [INFO] Building jar: /home/jenkins/agent/workspace/ease.verify.core.target.2019-06/tests/org.eclipse.ease.ui.completions.java.test/target/org.eclipse.ease.ui.completions.java.test-0.9.0-SNAPSHOT.jar
09:39:13 [2022-05-03T13:39:13.166Z] [INFO] 
09:39:13 [2022-05-03T13:39:13.166Z] [INFO] --- tycho-p2-plugin:2.2.0:p2-metadata-default (default-p2-metadata-default) @ org.eclipse.ease.ui.completions.java.test ---
09:39:13 [2022-05-03T13:39:13.166Z] [INFO] 
09:39:13 [2022-05-03T13:39:13.166Z] [INFO] --- jacoco-maven-plugin:0.8.6:prepare-agent (jacoco-initialize) @ org.eclipse.ease.ui.completions.java.test ---
09:39:13 [2022-05-03T13:39:13.166Z] [INFO] tycho.testArgLine set to -javaagent:/home/jenkins/.m2/repository/org/jacoco/org.jacoco.agent/0.8.6/org.jacoco.agent-0.8.6-runtime.jar=destfile=/home/jenkins/agent/workspace/ease.verify.core.target.2019-06/tests/org.eclipse.ease.ui.completions.java.test/target/jacoco.exec,output=file
09:39:13 [2022-05-03T13:39:13.166Z] [INFO] 
09:39:13 [2022-05-03T13:39:13.166Z] [INFO] --- tycho-surefire-plugin:2.2.0:test (default-test) @ org.eclipse.ease.ui.completions.java.test ---
09:39:13 [2022-05-03T13:39:13.166Z] [INFO] Executing Test Runtime with timeout 0, logs (if any) will be placed at: /home/jenkins/agent/workspace/ease.verify.core.target.2019-06/tests/org.eclipse.ease.ui.completions.java.test/target/work/data/.metadata/.log
09:39:13 [2022-05-03T13:39:13.166Z] [INFO] Command line:
09:39:13 [2022-05-03T13:39:13.167Z] 	[/opt/tools/java/openjdk/jdk-15/15.0.2+7/bin/java, -Dosgi.noShutdown=false, -Dosgi.os=linux, -Dosgi.ws=gtk, -Dosgi.arch=x86_64, -javaagent:/home/jenkins/.m2/repository/org/jacoco/org.jacoco.agent/0.8.6/org.jacoco.agent-0.8.6-runtime.jar=destfile=/home/jenkins/agent/workspace/ease.verify.core.target.2019-06/tests/org.eclipse.ease.ui.completions.java.test/target/jacoco.exec,output=file, -Dosgi.clean=true, -jar, /home/jenkins/.m2/repository/p2/osgi/bundle/org.eclipse.equinox.launcher/1.6.300.v20210813-1054/org.eclipse.equinox.launcher-1.6.300.v20210813-1054.jar, -data, /home/jenkins/agent/workspace/ease.verify.core.target.2019-06/tests/org.eclipse.ease.ui.completions.java.test/target/work/data, -install, /home/jenkins/agent/workspace/ease.verify.core.target.2019-06/tests/org.eclipse.ease.ui.completions.java.test/target/work, -configuration, /home/jenkins/agent/workspace/ease.verify.core.target.2019-06/tests/org.eclipse.ease.ui.completions.java.test/target/work/configuration, -application, org.eclipse.tycho.surefire.osgibooter.headlesstest, -testproperties, /home/jenkins/agent/workspace/ease.verify.core.target.2019-06/tests/org.eclipse.ease.ui.completions.java.test/target/surefire.properties]
09:39:13 [2022-05-03T13:39:13.167Z] Picked up JAVA_TOOL_OPTIONS: -Dmaven.ext.class.path="/home/jenkins/agent/workspace/ease.verify.core.target.2019-06@tmp/withMaven42d6f10b/pipeline-maven-spy.jar" -Dorg.jenkinsci.plugins.pipeline.maven.reportsFolder="/home/jenkins/agent/workspace/ease.verify.core.target.2019-06@tmp/withMaven42d6f10b" 
09:39:18 [2022-05-03T13:39:18.439Z] Running org.eclipse.ease.ui.completions.java.provider.JavaPackagesCompletionProviderTest
09:39:19 [2022-05-03T13:39:19.003Z] Tests run: 28, Failures: 0, Errors: 0, Skipped: 0, Time elapsed: 1.477 s - in org.eclipse.ease.ui.completions.java.provider.JavaPackagesCompletionProviderTest
09:39:19 [2022-05-03T13:39:19.003Z] proposal_java_preserves_suffix  Time elapsed: 0.991 s
09:39:19 [2022-05-03T13:39:19.003Z] proposal_java_appends_to_prefix  Time elapsed: 0.001 s
09:39:19 [2022-05-03T13:39:19.003Z] prepareProposals_instance_contains_root_package_after_new_keyword  Time elapsed: 0.001 s
09:39:19 [2022-05-03T13:39:19.003Z] proposal_java_replaces_filter  Time elapsed: 0 s
09:39:19 [2022-05-03T13:39:19.003Z] prepareProposals_instance_contains_sub_package  Time elapsed: 0 s
09:39:19 [2022-05-03T13:39:19.003Z] prepareProposals_instance_contains_3rd_level  Time elapsed: 0 s
09:39:19 [2022-05-03T13:39:19.003Z] isActive_equals_false{String}[1]  Time elapsed: 0.039 s
09:39:19 [2022-05-03T13:39:19.003Z] isActive_equals_false{String}[2]  Time elapsed: 0.001 s
09:39:19 [2022-05-03T13:39:19.003Z] isActive_equals_false{String}[3]  Time elapsed: 0.018 s
09:39:19 [2022-05-03T13:39:19.003Z] isActive_equals_false{String}[4]  Time elapsed: 0.001 s
09:39:19 [2022-05-03T13:39:19.003Z] prepareProposals_contains_root_package{String}[1]  Time elapsed: 0.001 s
09:39:19 [2022-05-03T13:39:19.003Z] prepareProposals_contains_root_package{String}[2]  Time elapsed: 0 s
09:39:19 [2022-05-03T13:39:19.003Z] prepareProposals_contains_root_package{String}[3]  Time elapsed: 0.001 s
09:39:19 [2022-05-03T13:39:19.003Z] isActive_equals_true{String}[1]  Time elapsed: 0.001 s
09:39:19 [2022-05-03T13:39:19.003Z] isActive_equals_true{String}[2]  Time elapsed: 0.001 s
09:39:19 [2022-05-03T13:39:19.003Z] isActive_equals_true{String}[3]  Time elapsed: 0.001 s
09:39:19 [2022-05-03T13:39:19.003Z] isActive_equals_true{String}[4]  Time elapsed: 0 s
09:39:19 [2022-05-03T13:39:19.003Z] isActive_equals_true{String}[5]  Time elapsed: 0.001 s
09:39:19 [2022-05-03T13:39:19.003Z] isActive_equals_true{String}[6]  Time elapsed: 0.001 s
09:39:19 [2022-05-03T13:39:19.003Z] isActive_equals_true{String}[7]  Time elapsed: 0 s
09:39:19 [2022-05-03T13:39:19.003Z] isActive_equals_true{String}[8]  Time elapsed: 0.001 s
09:39:19 [2022-05-03T13:39:19.003Z] isActive_equals_true{String}[9]  Time elapsed: 0.002 s
09:39:19 [2022-05-03T13:39:19.003Z] isActive_equals_true{String}[10]  Time elapsed: 0.001 s
09:39:19 [2022-05-03T13:39:19.003Z] isActive_equals_true{String}[11]  Time elapsed: 0.001 s
09:39:19 [2022-05-03T13:39:19.003Z] isActive_equals_true{String}[12]  Time elapsed: 0.001 s
09:39:19 [2022-05-03T13:39:19.003Z] isActive_equals_true{String}[13]  Time elapsed: 0 s
09:39:19 [2022-05-03T13:39:19.003Z] isActive_equals_true{String}[14]  Time elapsed: 0.001 s
09:39:19 [2022-05-03T13:39:19.003Z] prepareProposals_is_empty_for_exact_class_context  Time elapsed: 0 s
09:39:19 [2022-05-03T13:39:19.003Z] Running org.eclipse.ease.ui.completions.java.provider.JavaClassCompletionProviderTest
09:39:19 [2022-05-03T13:39:19.567Z] Tests run: 16, Failures: 0, Errors: 0, Skipped: 0, Time elapsed: 0.461 s - in org.eclipse.ease.ui.completions.java.provider.JavaClassCompletionProviderTest
09:39:19 [2022-05-03T13:39:19.567Z] prepareProposals_instance_contains_class_for_package_context_with_filter  Time elapsed: 0.003 s
09:39:19 [2022-05-03T13:39:19.567Z] prepareProposals_instance_contains_inner_class_for_class_context  Time elapsed: 0.009 s
09:39:19 [2022-05-03T13:39:19.567Z] prepareProposals_instance_contains_class_for_package_context  Time elapsed: 0.004 s
09:39:19 [2022-05-03T13:39:19.568Z] prepareProposals_instance_contains_class_for_partial_context  Time elapsed: 0.024 s
09:39:19 [2022-05-03T13:39:19.568Z] prepareProposals_instance_contains_inner_class_for_class_context_with_filter  Time elapsed: 0.001 s
09:39:19 [2022-05-03T13:39:19.568Z] prepareProposals_instance_contains_class_for_global_context  Time elapsed: 0.405 s
09:39:19 [2022-05-03T13:39:19.568Z] prepareProposals_does_not_contain_inner_class_for_a_given_inner_class_context  Time elapsed: 0.001 s
09:39:19 [2022-05-03T13:39:19.568Z] isActive_equals_false{String}[1]  Time elapsed: 0 s
09:39:19 [2022-05-03T13:39:19.568Z] isActive_equals_false{String}[2]  Time elapsed: 0.001 s
09:39:19 [2022-05-03T13:39:19.568Z] isActive_equals_true{String}[1]  Time elapsed: 0 s
09:39:19 [2022-05-03T13:39:19.568Z] isActive_equals_true{String}[2]  Time elapsed: 0.001 s
09:39:19 [2022-05-03T13:39:19.568Z] isActive_equals_true{String}[3]  Time elapsed: 0 s
09:39:19 [2022-05-03T13:39:19.568Z] isActive_equals_true{String}[4]  Time elapsed: 0.001 s
09:39:19 [2022-05-03T13:39:19.568Z] isActive_equals_true{String}[5]  Time elapsed: 0 s
09:39:19 [2022-05-03T13:39:19.568Z] isActive_equals_true{String}[6]  Time elapsed: 0 s
09:39:19 [2022-05-03T13:39:19.568Z] prepareProposals_is_empty_for_exact_class_context  Time elapsed: 0.001 s
09:39:19 [2022-05-03T13:39:19.568Z] Running org.eclipse.ease.ui.completions.java.provider.JavaMethodCompletionProviderTest
09:39:19 [2022-05-03T13:39:19.568Z] Tests run: 23, Failures: 0, Errors: 0, Skipped: 0, Time elapsed: 0.09 s - in org.eclipse.ease.ui.completions.java.provider.JavaMethodCompletionProviderTest
09:39:19 [2022-05-03T13:39:19.568Z] prepareProposals_class_does_not_contain_isntance_methods  Time elapsed: 0.028 s
09:39:19 [2022-05-03T13:39:19.568Z] prepareProposals_instance_contains_method_with_filter  Time elapsed: 0 s
09:39:19 [2022-05-03T13:39:19.568Z] prepareProposals_method_contains_instance_methods  Time elapsed: 0.001 s
09:39:19 [2022-05-03T13:39:19.568Z] prepareProposals_instance_contains_instance_methods  Time elapsed: 0.001 s
09:39:19 [2022-05-03T13:39:19.568Z] prepareProposals_class_contains_static_methods  Time elapsed: 0.001 s
09:39:19 [2022-05-03T13:39:19.568Z] proposal_replacement_string_contains_leading_dot  Time elapsed: 0.001 s
09:39:19 [2022-05-03T13:39:19.568Z] prepareProposals_instance_does_not_contain_static_methods  Time elapsed: 0.001 s
09:39:19 [2022-05-03T13:39:19.568Z] prepareProposals_class_contains_static_fields  Time elapsed: 0.001 s
09:39:19 [2022-05-03T13:39:19.568Z] prepareProposals_instance_does_not_contain_static_fields  Time elapsed: 0.001 s
09:39:19 [2022-05-03T13:39:19.568Z] prepareProposals_does_not_contain_methods_of_base_class_for_method_context  Time elapsed: 0.001 s
09:39:19 [2022-05-03T13:39:19.568Z] isActive_equals_false{String}[1]  Time elapsed: 0 s
09:39:19 [2022-05-03T13:39:19.568Z] isActive_equals_false{String}[2]  Time elapsed: 0.001 s
09:39:19 [2022-05-03T13:39:19.568Z] isActive_equals_false{String}[3]  Time elapsed: 0 s
09:39:19 [2022-05-03T13:39:19.568Z] isActive_equals_true{String}[1]  Time elapsed: 0 s
09:39:19 [2022-05-03T13:39:19.568Z] isActive_equals_true{String}[2]  Time elapsed: 0.001 s
09:39:19 [2022-05-03T13:39:19.568Z] isActive_equals_true{String}[3]  Time elapsed: 0 s
09:39:19 [2022-05-03T13:39:19.568Z] isActive_equals_true{String}[4]  Time elapsed: 0.001 s
09:39:19 [2022-05-03T13:39:19.568Z] isActive_equals_true{String}[5]  Time elapsed: 0.001 s
09:39:19 [2022-05-03T13:39:19.568Z] isActive_equals_true{String}[6]  Time elapsed: 0.001 s
09:39:19 [2022-05-03T13:39:19.568Z] isActive_equals_true{String}[7]  Time elapsed: 0.001 s
09:39:19 [2022-05-03T13:39:19.568Z] isActive_equals_true{String}[8]  Time elapsed: 0 s
09:39:19 [2022-05-03T13:39:19.568Z] isActive_equals_true{String}[9]  Time elapsed: 0 s
09:39:19 [2022-05-03T13:39:19.568Z] isActive_equals_true{String}[10]  Time elapsed: 0 s
09:39:19 [2022-05-03T13:39:19.568Z] Running org.eclipse.ease.ui.completions.java.provider.JavaResourcesTest
09:39:19 [2022-05-03T13:39:19.568Z] Tests run: 5, Failures: 0, Errors: 0, Skipped: 0, Time elapsed: 0.002 s - in org.eclipse.ease.ui.completions.java.provider.JavaResourcesTest
09:39:19 [2022-05-03T13:39:19.568Z] getClasses_with_filter_is_populated  Time elapsed: 0 s
09:39:19 [2022-05-03T13:39:19.568Z] getClasses_is_populated  Time elapsed: 0 s
09:39:19 [2022-05-03T13:39:19.568Z] singleton_exists  Time elapsed: 0 s
09:39:19 [2022-05-03T13:39:19.568Z] getPackages_is_populated  Time elapsed: 0 s
09:39:19 [2022-05-03T13:39:19.568Z] getClasses_with_filter_contains_File_class  Time elapsed: 0 s
09:39:19 [2022-05-03T13:39:19.825Z] 
09:39:19 [2022-05-03T13:39:19.825Z] Results:
09:39:19 [2022-05-03T13:39:19.825Z] 
09:39:19 [2022-05-03T13:39:19.825Z] Tests run: 72, Failures: 0, Errors: 0, Skipped: 0
09:39:19 [2022-05-03T13:39:19.825Z] 
09:39:20 [2022-05-03T13:39:20.389Z] [INFO] All tests passed!
09:39:20 [2022-05-03T13:39:20.389Z] [INFO] 
09:39:20 [2022-05-03T13:39:20.389Z] [INFO] --- maven-pmd-plugin:3.16.0:pmd (pmd-integration) @ org.eclipse.ease.ui.completions.java.test ---
09:39:20 [2022-05-03T13:39:20.646Z] [INFO] PMD version: 6.42.0
09:39:20 [2022-05-03T13:39:20.902Z] [INFO] 
09:39:20 [2022-05-03T13:39:20.902Z] [INFO] --- maven-pmd-plugin:3.16.0:cpd (pmd-integration) @ org.eclipse.ease.ui.completions.java.test ---
09:39:20 [2022-05-03T13:39:20.902Z] [INFO] PMD version: 6.42.0
09:39:20 [2022-05-03T13:39:20.902Z] [INFO] 
09:39:20 [2022-05-03T13:39:20.902Z] [INFO] --- spotbugs-maven-plugin:4.1.4:spotbugs (spotbugs-integration) @ org.eclipse.ease.ui.completions.java.test ---
09:39:20 [2022-05-03T13:39:20.902Z] [INFO] Fork Value is false
09:39:20 [2022-05-03T13:39:20.902Z]      [java] JVM args ignored when same JVM is used.
09:39:24 [2022-05-03T13:39:24.186Z] [INFO] Done SpotBugs Analysis....
09:39:24 [2022-05-03T13:39:24.186Z] [INFO] 
09:39:24 [2022-05-03T13:39:24.186Z] [INFO] --- maven-checkstyle-plugin:3.1.1:check (checkstyle-integration) @ org.eclipse.ease.ui.completions.java.test ---
09:39:24 [2022-05-03T13:39:24.186Z] [INFO] You have 0 Checkstyle violations.
09:39:24 [2022-05-03T13:39:24.186Z] [INFO] 
09:39:24 [2022-05-03T13:39:24.186Z] [INFO] --- maven-install-plugin:2.3.1:install (default-install) @ org.eclipse.ease.ui.completions.java.test ---
09:39:24 [2022-05-03T13:39:24.186Z] [INFO] Installing /home/jenkins/agent/workspace/ease.verify.core.target.2019-06/tests/org.eclipse.ease.ui.completions.java.test/target/org.eclipse.ease.ui.completions.java.test-0.9.0-SNAPSHOT.jar to /home/jenkins/.m2/repository/org/eclipse/ease/org.eclipse.ease.ui.completions.java.test/0.9.0-SNAPSHOT/org.eclipse.ease.ui.completions.java.test-0.9.0-SNAPSHOT.jar
09:39:24 [2022-05-03T13:39:24.186Z] [INFO] Installing /home/jenkins/agent/workspace/ease.verify.core.target.2019-06/tests/org.eclipse.ease.ui.completions.java.test/pom.xml to /home/jenkins/.m2/repository/org/eclipse/ease/org.eclipse.ease.ui.completions.java.test/0.9.0-SNAPSHOT/org.eclipse.ease.ui.completions.java.test-0.9.0-SNAPSHOT.pom
09:39:24 [2022-05-03T13:39:24.186Z] [INFO] Installing /home/jenkins/agent/workspace/ease.verify.core.target.2019-06/tests/org.eclipse.ease.ui.completions.java.test/target/p2content.xml to /home/jenkins/.m2/repository/org/eclipse/ease/org.eclipse.ease.ui.completions.java.test/0.9.0-SNAPSHOT/org.eclipse.ease.ui.completions.java.test-0.9.0-SNAPSHOT-p2metadata.xml
09:39:24 [2022-05-03T13:39:24.186Z] [INFO] Installing /home/jenkins/agent/workspace/ease.verify.core.target.2019-06/tests/org.eclipse.ease.ui.completions.java.test/target/p2artifacts.xml to /home/jenkins/.m2/repository/org/eclipse/ease/org.eclipse.ease.ui.completions.java.test/0.9.0-SNAPSHOT/org.eclipse.ease.ui.completions.java.test-0.9.0-SNAPSHOT-p2artifacts.xml
09:39:24 [2022-05-03T13:39:24.186Z] [INFO] 
09:39:24 [2022-05-03T13:39:24.186Z] [INFO] --- tycho-p2-plugin:2.2.0:update-local-index (default-update-local-index) @ org.eclipse.ease.ui.completions.java.test ---
09:39:24 [2022-05-03T13:39:24.186Z] [INFO] 
09:39:24 [2022-05-03T13:39:24.186Z] [INFO] ---------< org.eclipse.ease:org.eclipse.ease.releng.coverage >----------
09:39:24 [2022-05-03T13:39:24.186Z] [INFO] Building org.eclipse.ease.releng.coverage 0.9.0-SNAPSHOT         [48/49]
09:39:24 [2022-05-03T13:39:24.186Z] [INFO] --------------------------------[ pom ]---------------------------------
09:39:24 [2022-05-03T13:39:24.186Z] [INFO] 
09:39:24 [2022-05-03T13:39:24.186Z] [INFO] --- maven-clean-plugin:2.5:clean (default-clean) @ org.eclipse.ease.releng.coverage ---
09:39:24 [2022-05-03T13:39:24.186Z] [INFO] 
09:39:24 [2022-05-03T13:39:24.186Z] [INFO] --- jacoco-maven-plugin:0.8.6:report-aggregate (default) @ org.eclipse.ease.releng.coverage ---
09:39:24 [2022-05-03T13:39:24.186Z] [INFO] Loading execution data file /home/jenkins/agent/workspace/ease.verify.core.target.2019-06/tests/org.eclipse.ease.test/target/jacoco.exec
09:39:24 [2022-05-03T13:39:24.186Z] [INFO] Loading execution data file /home/jenkins/agent/workspace/ease.verify.core.target.2019-06/tests/org.eclipse.ease.lang.javascript.rhino.test/target/jacoco.exec
09:39:24 [2022-05-03T13:39:24.186Z] [INFO] Loading execution data file /home/jenkins/agent/workspace/ease.verify.core.target.2019-06/tests/org.eclipse.ease.lang.javascript.test/target/jacoco.exec
09:39:24 [2022-05-03T13:39:24.186Z] [INFO] Loading execution data file /home/jenkins/agent/workspace/ease.verify.core.target.2019-06/tests/org.eclipse.ease.lang.python.test/target/jacoco.exec
09:39:24 [2022-05-03T13:39:24.186Z] [INFO] Loading execution data file /home/jenkins/agent/workspace/ease.verify.core.target.2019-06/tests/org.eclipse.ease.lang.python.jython.test/target/jacoco.exec
09:39:24 [2022-05-03T13:39:24.186Z] [INFO] Loading execution data file /home/jenkins/agent/workspace/ease.verify.core.target.2019-06/tests/org.eclipse.ease.lang.scriptarchive.test/target/jacoco.exec
09:39:24 [2022-05-03T13:39:24.186Z] [INFO] Loading execution data file /home/jenkins/agent/workspace/ease.verify.core.target.2019-06/tests/org.eclipse.ease.lang.unittest.test/target/jacoco.exec
09:39:24 [2022-05-03T13:39:24.186Z] [INFO] Loading execution data file /home/jenkins/agent/workspace/ease.verify.core.target.2019-06/tests/org.eclipse.ease.ui.scripts.test/target/jacoco.exec
09:39:24 [2022-05-03T13:39:24.186Z] [INFO] Loading execution data file /home/jenkins/agent/workspace/ease.verify.core.target.2019-06/tests/org.eclipse.ease.ui.test/target/jacoco.exec
09:39:24 [2022-05-03T13:39:24.186Z] [INFO] Loading execution data file /home/jenkins/agent/workspace/ease.verify.core.target.2019-06/tests/org.eclipse.ease.ui.completions.java.test/target/jacoco.exec
09:39:24 [2022-05-03T13:39:24.442Z] [INFO] Analyzed bundle 'org.eclipse.ease' with 105 classes
09:39:24 [2022-05-03T13:39:24.700Z] [INFO] Analyzed bundle 'org.eclipse.ease.classloader' with 1 classes
09:39:24 [2022-05-03T13:39:24.957Z] [INFO] Analyzed bundle 'org.eclipse.ease.ui' with 215 classes
09:39:25 [2022-05-03T13:39:25.214Z] [INFO] Analyzed bundle 'org.eclipse.ease.ui.completions.java' with 14 classes
09:39:25 [2022-05-03T13:39:25.214Z] [INFO] Analyzed bundle 'org.eclipse.ease.ui.scripts' with 154 classes
09:39:25 [2022-05-03T13:39:25.214Z] [INFO] Analyzed bundle 'org.eclipse.ease.help' with 0 classes
09:39:25 [2022-05-03T13:39:25.214Z] [INFO] Analyzed bundle 'org.eclipse.ease.lang.javascript' with 5 classes
09:39:25 [2022-05-03T13:39:25.214Z] [INFO] Analyzed bundle 'org.eclipse.ease.lang.javascript.ui' with 4 classes
09:39:25 [2022-05-03T13:39:25.214Z] [INFO] Analyzed bundle 'org.eclipse.ease.lang.javascript.rhino' with 21 classes
09:39:25 [2022-05-03T13:39:25.474Z] [INFO] Analyzed bundle 'org.eclipse.ease.lang.javascript.nashorn' with 2 classes
09:39:25 [2022-05-03T13:39:25.474Z] [INFO] Analyzed bundle 'org.eclipse.ease.lang.python' with 23 classes
09:39:25 [2022-05-03T13:39:25.474Z] [INFO] Analyzed bundle 'org.eclipse.ease.lang.python.jython' with 13 classes
09:39:25 [2022-05-03T13:39:25.474Z] [INFO] Analyzed bundle 'org.eclipse.ease.lang.python.py4j' with 11 classes
09:39:25 [2022-05-03T13:39:25.474Z] [INFO] Analyzed bundle 'org.eclipse.ease.lang.jvm.compiled' with 2 classes
09:39:25 [2022-05-03T13:39:25.474Z] [INFO] Analyzed bundle 'org.eclipse.ease.lang.groovy' with 3 classes
09:39:25 [2022-05-03T13:39:25.474Z] [INFO] Analyzed bundle 'org.eclipse.ease.lang.groovy.interpreter' with 3 classes
09:39:25 [2022-05-03T13:39:25.474Z] [INFO] Analyzed bundle 'org.eclipse.ease.lang.ruby' with 3 classes
09:39:25 [2022-05-03T13:39:25.474Z] [INFO] Analyzed bundle 'org.eclipse.ease.lang.ruby.jruby' with 2 classes
09:39:25 [2022-05-03T13:39:25.474Z] [INFO] Analyzed bundle 'org.eclipse.ease.lang.scriptarchive' with 3 classes
09:39:25 [2022-05-03T13:39:25.474Z] [INFO] Analyzed bundle 'org.eclipse.ease.lang.scriptarchive.ui' with 8 classes
09:39:25 [2022-05-03T13:39:25.474Z] [INFO] Analyzed bundle 'org.eclipse.ease.lang.unittest' with 51 classes
09:39:25 [2022-05-03T13:39:25.760Z] [INFO] Analyzed bundle 'org.eclipse.ease.lang.unittest.ui' with 79 classes
09:39:25 [2022-05-03T13:39:25.760Z] [INFO] 
09:39:25 [2022-05-03T13:39:25.760Z] [INFO] --- maven-install-plugin:2.4:install (default-install) @ org.eclipse.ease.releng.coverage ---
09:39:25 [2022-05-03T13:39:25.761Z] [INFO] Installing /home/jenkins/agent/workspace/ease.verify.core.target.2019-06/releng/org.eclipse.ease.releng.coverage/pom.xml to /home/jenkins/.m2/repository/org/eclipse/ease/org.eclipse.ease.releng.coverage/0.9.0-SNAPSHOT/org.eclipse.ease.releng.coverage-0.9.0-SNAPSHOT.pom
09:39:25 [2022-05-03T13:39:25.761Z] [INFO] 
09:39:25 [2022-05-03T13:39:25.761Z] [INFO] ---------------------< org.eclipse.ease:ease.core >---------------------
09:39:25 [2022-05-03T13:39:25.761Z] [INFO] Building EASE (Incubation) 0.4.0-SNAPSHOT                        [49/49]
09:39:25 [2022-05-03T13:39:25.761Z] [INFO] --------------------------------[ pom ]---------------------------------
09:39:26 [2022-05-03T13:39:26.027Z] [INFO] 
09:39:26 [2022-05-03T13:39:26.028Z] [INFO] --- maven-clean-plugin:2.5:clean (default-clean) @ ease.core ---
09:39:26 [2022-05-03T13:39:26.028Z] [INFO] 
09:39:26 [2022-05-03T13:39:26.028Z] [INFO] --- maven-install-plugin:2.4:install (default-install) @ ease.core ---
09:39:26 [2022-05-03T13:39:26.028Z] [INFO] Installing /home/jenkins/agent/workspace/ease.verify.core.target.2019-06/pom.xml to /home/jenkins/.m2/repository/org/eclipse/ease/ease.core/0.4.0-SNAPSHOT/ease.core-0.4.0-SNAPSHOT.pom
09:39:26 [2022-05-03T13:39:26.028Z] [INFO] ------------------------------------------------------------------------
09:39:26 [2022-05-03T13:39:26.028Z] [INFO] Reactor Summary:
09:39:26 [2022-05-03T13:39:26.028Z] [INFO] 
09:39:26 [2022-05-03T13:39:26.028Z] [INFO] org.eclipse.ease.classloader 0.9.0-SNAPSHOT ........ SUCCESS [ 43.956 s]
09:39:26 [2022-05-03T13:39:26.028Z] [INFO] org.eclipse.ease 0.9.0-SNAPSHOT .................... SUCCESS [ 24.575 s]
09:39:26 [2022-05-03T13:39:26.028Z] [INFO] org.eclipse.ease.ui 0.9.0-SNAPSHOT ................. SUCCESS [ 28.967 s]
09:39:26 [2022-05-03T13:39:26.028Z] [INFO] org.eclipse.ease.ui.completions.java 0.9.0-SNAPSHOT  SUCCESS [ 10.157 s]
09:39:26 [2022-05-03T13:39:26.028Z] [INFO] org.eclipse.ease.ui.scripts 0.9.0-SNAPSHOT ......... SUCCESS [ 23.449 s]
09:39:26 [2022-05-03T13:39:26.028Z] [INFO] org.eclipse.ease.releng 0.9.0-SNAPSHOT ............. SUCCESS [  0.472 s]
09:39:26 [2022-05-03T13:39:26.028Z] [INFO] org.eclipse.ease.lang.javascript 0.9.0-SNAPSHOT .... SUCCESS [  7.336 s]
09:39:26 [2022-05-03T13:39:26.028Z] [INFO] org.eclipse.ease.lang.scriptarchive 0.9.0-SNAPSHOT . SUCCESS [  6.758 s]
09:39:26 [2022-05-03T13:39:26.028Z] [INFO] org.eclipse.ease.lang.python 0.9.0-SNAPSHOT ........ SUCCESS [  9.531 s]
09:39:26 [2022-05-03T13:39:26.028Z] [INFO] org.eclipse.ease.lang.python.py4j 0.9.0-SNAPSHOT ... SUCCESS [  8.621 s]
09:39:26 [2022-05-03T13:39:26.028Z] [INFO] org.eclipse.ease.lang.groovy 0.9.0-SNAPSHOT ........ SUCCESS [  5.582 s]
09:39:26 [2022-05-03T13:39:26.028Z] [INFO] org.eclipse.ease.lang.groovy.interpreter 0.9.0-SNAPSHOT SUCCESS [  7.064 s]
09:39:26 [2022-05-03T13:39:26.028Z] [INFO] org.eclipse.ease.lang.unittest 0.9.0-SNAPSHOT ...... SUCCESS [ 13.901 s]
09:39:26 [2022-05-03T13:39:26.028Z] [INFO] org.eclipse.ease.lang.unittest.ui 0.9.0-SNAPSHOT ... SUCCESS [ 16.080 s]
09:39:26 [2022-05-03T13:39:26.028Z] [INFO] org.eclipse.ease.lang.ruby 0.9.0-SNAPSHOT .......... SUCCESS [  6.809 s]
09:39:26 [2022-05-03T13:39:26.028Z] [INFO] org.eclipse.ease.lang.ruby.jruby 0.9.0-SNAPSHOT .... SUCCESS [  6.645 s]
09:39:26 [2022-05-03T13:39:26.028Z] [INFO] org.eclipse.ease.lang.javascript.nashorn 0.9.0-SNAPSHOT SUCCESS [  7.115 s]
09:39:26 [2022-05-03T13:39:26.028Z] [INFO] org.eclipse.ease.lang.javascript.rhino 0.9.0-SNAPSHOT SUCCESS [ 10.524 s]
09:39:26 [2022-05-03T13:39:26.028Z] [INFO] org.eclipse.ease.lang.python.jython 0.9.0-SNAPSHOT . SUCCESS [  9.886 s]
09:39:26 [2022-05-03T13:39:26.028Z] [INFO] org.eclipse.ease.lang.javascript.ui 0.9.0-SNAPSHOT . SUCCESS [  7.444 s]
09:39:26 [2022-05-03T13:39:26.028Z] [INFO] org.eclipse.ease.lang.jvm.compiled 0.9.0-SNAPSHOT .. SUCCESS [  7.025 s]
09:39:26 [2022-05-03T13:39:26.028Z] [INFO] org.eclipse.ease.lang.scriptarchive.ui 0.9.0-SNAPSHOT SUCCESS [  8.420 s]
09:39:26 [2022-05-03T13:39:26.028Z] [INFO] org.eclipse.ease.help 0.9.0-SNAPSHOT ............... SUCCESS [ 10.318 s]
09:39:26 [2022-05-03T13:39:26.028Z] [INFO] org.eclipse.ease.feature 0.9.0-SNAPSHOT ............ SUCCESS [  0.198 s]
09:39:26 [2022-05-03T13:39:26.028Z] [INFO] org.eclipse.ease.ui.feature 0.9.0-SNAPSHOT ......... SUCCESS [  0.177 s]
09:39:26 [2022-05-03T13:39:26.028Z] [INFO] org.eclipse.ease.lang.javascript.feature 0.9.0-SNAPSHOT SUCCESS [  0.106 s]
09:39:26 [2022-05-03T13:39:26.028Z] [INFO] org.eclipse.ease.lang.python.feature 0.9.0-SNAPSHOT  SUCCESS [  0.089 s]
09:39:26 [2022-05-03T13:39:26.028Z] [INFO] org.eclipse.ease.python.jython.feature 0.9.0-SNAPSHOT SUCCESS [  0.095 s]
09:39:26 [2022-05-03T13:39:26.028Z] [INFO] org.eclipse.ease.lang.python.py4j.feature 0.9.0-SNAPSHOT SUCCESS [  0.097 s]
09:39:26 [2022-05-03T13:39:26.028Z] [INFO] org.eclipse.ease.lang.jvm.feature 0.9.0-SNAPSHOT ... SUCCESS [  0.096 s]
09:39:26 [2022-05-03T13:39:26.028Z] [INFO] org.eclipse.ease.lang.groovy.feature 0.9.0-SNAPSHOT  SUCCESS [  0.088 s]
09:39:26 [2022-05-03T13:39:26.028Z] [INFO] org.eclipse.ease.lang.ruby.feature 0.9.0-SNAPSHOT .. SUCCESS [  0.044 s]
09:39:26 [2022-05-03T13:39:26.028Z] [INFO] org.eclipse.ease.lang.scriptarchive.feature 0.9.0-SNAPSHOT SUCCESS [  0.083 s]
09:39:26 [2022-05-03T13:39:26.028Z] [INFO] org.eclipse.ease.lang.unittest.feature 0.9.0-SNAPSHOT SUCCESS [  0.221 s]
09:39:26 [2022-05-03T13:39:26.028Z] [INFO] org.eclipse.ease.releng.target 0.9.0-SNAPSHOT ...... SUCCESS [  0.053 s]
09:39:26 [2022-05-03T13:39:26.028Z] [INFO] org.eclipse.ease.releng.p2 0.9.0-SNAPSHOT .......... SUCCESS [  5.843 s]
09:39:26 [2022-05-03T13:39:26.028Z] [INFO] org.eclipse.ease.testhelper 0.9.0-SNAPSHOT ......... SUCCESS [ 20.415 s]
09:39:26 [2022-05-03T13:39:26.028Z] [INFO] org.eclipse.ease.test 0.9.0-SNAPSHOT ............... SUCCESS [ 31.853 s]
09:39:26 [2022-05-03T13:39:26.028Z] [INFO] org.eclipse.ease.lang.javascript.rhino.test 0.9.0-SNAPSHOT SUCCESS [ 24.363 s]
09:39:26 [2022-05-03T13:39:26.028Z] [INFO] org.eclipse.ease.lang.javascript.test 0.9.0-SNAPSHOT SUCCESS [  8.754 s]
09:39:26 [2022-05-03T13:39:26.028Z] [INFO] org.eclipse.ease.lang.python.test 0.9.0-SNAPSHOT ... SUCCESS [ 11.418 s]
09:39:26 [2022-05-03T13:39:26.028Z] [INFO] org.eclipse.ease.lang.python.jython.test 0.9.0-SNAPSHOT SUCCESS [ 26.923 s]
09:39:26 [2022-05-03T13:39:26.028Z] [INFO] org.eclipse.ease.lang.scriptarchive.test 0.9.0-SNAPSHOT SUCCESS [ 10.194 s]
09:39:26 [2022-05-03T13:39:26.028Z] [INFO] org.eclipse.ease.lang.unittest.test 0.9.0-SNAPSHOT . SUCCESS [ 17.779 s]
09:39:26 [2022-05-03T13:39:26.028Z] [INFO] org.eclipse.ease.ui.scripts.test 0.9.0-SNAPSHOT .... SUCCESS [  8.056 s]
09:39:26 [2022-05-03T13:39:26.028Z] [INFO] org.eclipse.ease.ui.test 0.9.0-SNAPSHOT ............ SUCCESS [ 18.286 s]
09:39:26 [2022-05-03T13:39:26.028Z] [INFO] org.eclipse.ease.ui.completions.java.test 0.9.0-SNAPSHOT SUCCESS [ 11.539 s]
09:39:26 [2022-05-03T13:39:26.028Z] [INFO] org.eclipse.ease.releng.coverage 0.9.0-SNAPSHOT .... SUCCESS [  1.680 s]
09:39:26 [2022-05-03T13:39:26.028Z] [INFO] EASE (Incubation) 0.4.0-SNAPSHOT ................... SUCCESS [  0.318 s]
09:39:26 [2022-05-03T13:39:26.028Z] [INFO] ------------------------------------------------------------------------
09:39:26 [2022-05-03T13:39:26.028Z] [INFO] BUILD SUCCESS
09:39:26 [2022-05-03T13:39:26.028Z] [INFO] ------------------------------------------------------------------------
09:39:26 [2022-05-03T13:39:26.028Z] [INFO] Total time:  09:55 min
09:39:26 [2022-05-03T13:39:26.028Z] [INFO] Finished at: 2022-05-03T13:39:25Z
09:39:26 [2022-05-03T13:39:26.028Z] [INFO] ------------------------------------------------------------------------
09:39:26 [2022-05-03T13:39:26.029Z] [INFO] [jenkins-event-spy] Generated /home/jenkins/agent/workspace/ease.verify.core.target.2019-06@tmp/withMaven42d6f10b/maven-spy-20220503-132930-18913040945229288910281.log
[Pipeline] }
09:39:27 [2022-05-03T13:39:27.235Z] [withMaven] junitPublisher - Archive test results for Maven artifact org.eclipse.ease:org.eclipse.ease.test:eclipse-test-plugin:0.9.0-SNAPSHOT generated by tycho-surefire-plugin:test (default-test): tests/org.eclipse.ease.test/target/surefire-reports/*.xml
09:39:27 [2022-05-03T13:39:27.235Z] [withMaven] junitPublisher - Archive test results for Maven artifact org.eclipse.ease:org.eclipse.ease.lang.javascript.rhino.test:eclipse-test-plugin:0.9.0-SNAPSHOT generated by tycho-surefire-plugin:test (default-test): tests/org.eclipse.ease.lang.javascript.rhino.test/target/surefire-reports/*.xml
09:39:27 [2022-05-03T13:39:27.235Z] [withMaven] junitPublisher - Archive test results for Maven artifact org.eclipse.ease:org.eclipse.ease.lang.javascript.test:eclipse-test-plugin:0.9.0-SNAPSHOT generated by tycho-surefire-plugin:test (default-test): tests/org.eclipse.ease.lang.javascript.test/target/surefire-reports/*.xml
09:39:27 [2022-05-03T13:39:27.235Z] [withMaven] junitPublisher - Archive test results for Maven artifact org.eclipse.ease:org.eclipse.ease.lang.python.test:eclipse-test-plugin:0.9.0-SNAPSHOT generated by tycho-surefire-plugin:test (default-test): tests/org.eclipse.ease.lang.python.test/target/surefire-reports/*.xml
09:39:27 [2022-05-03T13:39:27.235Z] [withMaven] junitPublisher - Archive test results for Maven artifact org.eclipse.ease:org.eclipse.ease.lang.python.jython.test:eclipse-test-plugin:0.9.0-SNAPSHOT generated by tycho-surefire-plugin:test (default-test): tests/org.eclipse.ease.lang.python.jython.test/target/surefire-reports/*.xml
09:39:27 [2022-05-03T13:39:27.236Z] [withMaven] junitPublisher - Archive test results for Maven artifact org.eclipse.ease:org.eclipse.ease.lang.scriptarchive.test:eclipse-test-plugin:0.9.0-SNAPSHOT generated by tycho-surefire-plugin:test (default-test): tests/org.eclipse.ease.lang.scriptarchive.test/target/surefire-reports/*.xml
09:39:27 [2022-05-03T13:39:27.236Z] [withMaven] junitPublisher - Archive test results for Maven artifact org.eclipse.ease:org.eclipse.ease.lang.unittest.test:eclipse-test-plugin:0.9.0-SNAPSHOT generated by tycho-surefire-plugin:test (default-test): tests/org.eclipse.ease.lang.unittest.test/target/surefire-reports/*.xml
09:39:27 [2022-05-03T13:39:27.236Z] [withMaven] junitPublisher - Archive test results for Maven artifact org.eclipse.ease:org.eclipse.ease.ui.scripts.test:eclipse-test-plugin:0.9.0-SNAPSHOT generated by tycho-surefire-plugin:test (default-test): tests/org.eclipse.ease.ui.scripts.test/target/surefire-reports/*.xml
09:39:27 [2022-05-03T13:39:27.236Z] [withMaven] junitPublisher - Archive test results for Maven artifact org.eclipse.ease:org.eclipse.ease.ui.test:eclipse-test-plugin:0.9.0-SNAPSHOT generated by tycho-surefire-plugin:test (default-test): tests/org.eclipse.ease.ui.test/target/surefire-reports/*.xml
09:39:27 [2022-05-03T13:39:27.236Z] [withMaven] junitPublisher - Archive test results for Maven artifact org.eclipse.ease:org.eclipse.ease.ui.completions.java.test:eclipse-test-plugin:0.9.0-SNAPSHOT generated by tycho-surefire-plugin:test (default-test): tests/org.eclipse.ease.ui.completions.java.test/target/surefire-reports/*.xml
09:39:27 [2022-05-03T13:39:27.237Z] [withMaven] junitPublisher - Jenkins JUnit Attachments Plugin not found, can't publish test attachments.Recording test results
09:39:29 [2022-05-03T13:39:29.769Z] [withMaven] Jenkins JaCoCo Plugin not found, don't display org.jacoco:jacoco-maven-plugin:prepare-agent[-integration] results in pipeline screen.
09:39:29 [2022-05-03T13:39:29.772Z] [withMaven] Jenkins FindBugs Plugin not found, don't display com.github.spotbugs:spotbugs-maven-plugin:spotbugs results in pipeline screen.
09:39:29 [2022-05-03T13:39:29.774Z] [withMaven] Publishers: Pipeline Graph Publisher: 58 ms, Invoker Publisher: 1 ms, Junit Publisher: 495 ms, Concordion Publisher: 1 ms, Dependencies Fingerprint Publisher: 2026 ms, Findbugs Publisher: 1 ms, Jacoco Publisher: 2 ms, SpotBugs Publisher: 1 ms
[Pipeline] // withMaven
[Pipeline] }
[Pipeline] // stage
[Pipeline] stage
[Pipeline] { (Test)
[Pipeline] sh
09:39:30 [2022-05-03T13:39:30.083Z] + cp 'releng/org.eclipse.ease.releng.target/previous targets/2019-06.target' releng/org.eclipse.ease.releng.target/org.eclipse.ease.releng.target.target
[Pipeline] withMaven
09:39:30 [2022-05-03T13:39:30.093Z] [withMaven] Options: [org.jenkinsci.plugins.pipeline.maven.publishers.GeneratedArtifactsPublisher[disabled=true], org.jenkinsci.plugins.pipeline.maven.publishers.FindbugsAnalysisPublisher[disabled='false', healthy='', unHealthy='', thresholdLimit='low'], org.jenkinsci.plugins.pipeline.maven.publishers.TasksScannerPublisher[disabled='true', healthy='', unHealthy='', thresholdLimit='low']]
09:39:30 [2022-05-03T13:39:30.094Z] [withMaven] Available options: 
09:39:30 [2022-05-03T13:39:30.094Z] [withMaven] using JDK installation openjdk-jdk15-latest
09:39:30 [2022-05-03T13:39:30.099Z] [withMaven] using Maven installation 'apache-maven-latest'
[Pipeline] {
[Pipeline] sh
09:39:30 [2022-05-03T13:39:30.387Z] + mvn integration-test -f releng/org.eclipse.ease.releng/target-tests-pom.xml
09:39:30 [2022-05-03T13:39:30.388Z] ----- withMaven Wrapper script -----
09:39:30 [2022-05-03T13:39:30.388Z] Picked up JAVA_TOOL_OPTIONS: -Dmaven.ext.class.path="/home/jenkins/agent/workspace/ease.verify.core.target.2019-06@tmp/withMavena54e639d/pipeline-maven-spy.jar" -Dorg.jenkinsci.plugins.pipeline.maven.reportsFolder="/home/jenkins/agent/workspace/ease.verify.core.target.2019-06@tmp/withMavena54e639d" 
09:39:30 [2022-05-03T13:39:30.645Z] Apache Maven 3.8.5 (3599d3414f046de2324203b78ddcf9b5e4388aa0)
09:39:30 [2022-05-03T13:39:30.645Z] Maven home: /opt/tools/apache-maven/latest
09:39:30 [2022-05-03T13:39:30.645Z] Java version: 15.0.2, vendor: Oracle Corporation, runtime: /opt/tools/java/openjdk/jdk-15/15.0.2+7
09:39:30 [2022-05-03T13:39:30.645Z] Default locale: en_US, platform encoding: UTF-8
09:39:30 [2022-05-03T13:39:30.645Z] OS name: "linux", version: "5.14.14-200.fc34.x86_64", arch: "amd64", family: "unix"
09:39:31 [2022-05-03T13:39:31.577Z] [INFO] [jenkins-event-spy] Generate /home/jenkins/agent/workspace/ease.verify.core.target.2019-06@tmp/withMavena54e639d/maven-spy-20220503-133931-51410220210756102385506.log.tmp ...
09:39:31 [2022-05-03T13:39:31.833Z] [INFO] Scanning for projects...
09:39:38 [2022-05-03T13:39:38.376Z] [INFO] Computing target platform for MavenProject: org.eclipse.ease:org.eclipse.ease.test:0.9.0-SNAPSHOT @ /home/jenkins/agent/workspace/ease.verify.core.target.2019-06/tests/org.eclipse.ease.test/pom.xml
09:40:04 [2022-05-03T13:40:04.930Z] [INFO] [jenkins-event-spy] Generated /home/jenkins/agent/workspace/ease.verify.core.target.2019-06@tmp/withMavena54e639d/maven-spy-20220503-133931-51410220210756102385506.log
09:40:04 [2022-05-03T13:40:04.930Z] [ERROR] Failed to resolve target definition /home/jenkins/agent/workspace/ease.verify.core.target.2019-06/releng/org.eclipse.ease.releng.target/org.eclipse.ease.releng.target.target: Failed to load p2 metadata repository from location http://www.pydev.org/updates: Unable to read repository at http://www.pydev.org/updates. No repository found at https://github.com/fabioz/Pydev/releases/download/pydev_9_3_0. -> [Help 1]
09:40:04 [2022-05-03T13:40:04.930Z] [ERROR] 
09:40:04 [2022-05-03T13:40:04.930Z] [ERROR] To see the full stack trace of the errors, re-run Maven with the -e switch.
09:40:04 [2022-05-03T13:40:04.930Z] [ERROR] Re-run Maven using the -X switch to enable full debug logging.
09:40:04 [2022-05-03T13:40:04.930Z] [ERROR] 
09:40:04 [2022-05-03T13:40:04.930Z] [ERROR] For more information about the errors and possible solutions, please read the following articles:
09:40:04 [2022-05-03T13:40:04.931Z] [ERROR] [Help 1] http://cwiki.apache.org/confluence/display/MAVEN/MavenExecutionException
[Pipeline] }
09:40:04 [2022-05-03T13:40:04.960Z] [withMaven] Publishers: 
[Pipeline] // withMaven
[Pipeline] }
[Pipeline] // stage
[Pipeline] stage
[Pipeline] { (Declarative: Post Actions)
[Pipeline] archiveArtifacts
09:40:04 [2022-05-03T13:40:04.997Z] Archiving artifacts
[Pipeline] emailext
09:42:02 [2022-05-03T13:42:02.891Z] Sending email to: christian.pontesegger@web.de
[Pipeline] }
[Pipeline] // stage
[Pipeline] }
[Pipeline] // timeout
[Pipeline] }
[Pipeline] // timestamps
[Pipeline] }
[Pipeline] // node
[Pipeline] End of Pipeline
ERROR: script returned exit code 1
Finished: FAILURE