Console Output

Skipping 1,011 KB.. Full Log
09:39:08 [2022-02-01T14:39:08.742Z] [INFO] Fetching org.eclipse.e4.ui.di_1.2.600.v20190510-1100.jar from http://download.eclipse.org/releases/2019-06/201906191000/plugins/ (17.17kB)
09:39:08 [2022-02-01T14:39:08.742Z] [INFO] Fetching org.eclipse.e4.ui.model.workbench_2.1.400.v20190513-2118.jar from http://download.eclipse.org/releases/2019-06/201906191000/plugins/ (399.24kB)
09:39:09 [2022-02-01T14:39:09.000Z] [INFO] Fetching org.eclipse.e4.ui.services_1.3.500.v20190513-2118.jar from http://download.eclipse.org/releases/2019-06/201906191000/plugins/ (24.6kB)
09:39:09 [2022-02-01T14:39:09.000Z] [INFO] Fetching org.eclipse.equinox.event_1.5.100.v20190528-1257.jar from http://download.eclipse.org/releases/2019-06/201906191000/plugins/ (34.71kB)
09:39:09 [2022-02-01T14:39:09.000Z] [INFO] Fetching org.eclipse.e4.ui.widgets_1.2.400.v20190510-1100.jar from http://download.eclipse.org/releases/2019-06/201906191000/plugins/ (13.14kB)
09:39:09 [2022-02-01T14:39:09.274Z] [INFO] Fetching org.eclipse.e4.ui.workbench_1.10.0.v20190529-1505.jar from http://download.eclipse.org/releases/2019-06/201906191000/plugins/ (249.47kB)
09:39:09 [2022-02-01T14:39:09.274Z] [INFO] Fetching org.eclipse.e4.ui.workbench.addons.swt_1.3.500.v20190513-2118.jar from http://download.eclipse.org/releases/2019-06/201906191000/plugins/ (114.85kB)
09:39:09 [2022-02-01T14:39:09.542Z] [INFO] Fetching org.eclipse.e4.ui.workbench.renderers.swt_0.14.700.v20190517-1525.jar from http://download.eclipse.org/releases/2019-06/201906191000/plugins/ (246.23kB)
09:39:09 [2022-02-01T14:39:09.542Z] [INFO] Fetching org.eclipse.e4.ui.workbench.swt_0.14.600.v20190513-2118.jar from http://download.eclipse.org/releases/2019-06/201906191000/plugins/ (171.18kB)
09:39:09 [2022-02-01T14:39:09.839Z] [INFO] Fetching org.eclipse.jface.databinding_1.9.0.v20190519-0933.jar from http://download.eclipse.org/releases/2019-06/201906191000/plugins/ (293.48kB)
09:39:09 [2022-02-01T14:39:09.839Z] [INFO] Fetching org.eclipse.e4.ui.workbench3_0.15.100.v20190513-2118.jar from http://download.eclipse.org/releases/2019-06/201906191000/plugins/ (20.82kB)
09:39:10 [2022-02-01T14:39:10.123Z] [INFO] Fetching org.eclipse.wst.jsdt.ui_2.0.301.v201903222101.jar from http://download.eclipse.org/releases/2019-06/201906191000/plugins/ (8.17MB)
09:39:10 [2022-02-01T14:39:10.696Z] [INFO] Fetching org.eclipse.wst.jsdt.debug.ui_1.0.600.v201903222047.jar from http://download.eclipse.org/releases/2019-06/201906191000/plugins/ (239.66kB)
09:39:10 [2022-02-01T14:39:10.696Z] [INFO] Fetching org.mockito_2.23.0.v20190527-1420.jar from https://download.eclipse.org/tools/orbit/downloads/drops2/R20190602212107/repository/plugins/ (618.14kB)
09:39:10 [2022-02-01T14:39:10.962Z] [INFO] Fetching org.eclipse.equinox.p2.engine_2.6.300.v20190318-1320.jar from http://download.eclipse.org/releases/2019-06/201906191000/plugins/ (209.97kB)
09:39:10 [2022-02-01T14:39:10.962Z] [INFO] Fetching org.eclipse.ui.views.properties.tabbed_3.8.500.v20190513-2118.jar from http://download.eclipse.org/releases/2019-06/201906191000/plugins/ (107.7kB)
09:39:11 [2022-02-01T14:39:11.224Z] [INFO] Fetching org.eclipse.equinox.concurrent_1.1.300.v20190514-1046.jar from http://download.eclipse.org/releases/2019-06/201906191000/plugins/ (25.96kB)
09:39:11 [2022-02-01T14:39:11.224Z] [INFO] Fetching org.eclipse.emf.common_2.16.0.v20190528-0845.jar from http://download.eclipse.org/releases/2019-06/201906191000/plugins/ (366.92kB)
09:39:11 [2022-02-01T14:39:11.496Z] [INFO] Fetching org.eclipse.equinox.bidi_1.2.0.v20190514-1046.jar from http://download.eclipse.org/releases/2019-06/201906191000/plugins/ (50.03kB)
09:39:11 [2022-02-01T14:39:11.497Z] [INFO] Fetching org.eclipse.equinox.launcher_1.5.400.v20190515-0925.jar from http://download.eclipse.org/releases/2019-06/201906191000/plugins/ (51.81kB)
09:39:11 [2022-02-01T14:39:11.754Z] [INFO] Fetching org.eclipse.equinox.p2.core_2.6.0.v20190215-2242.jar from http://download.eclipse.org/releases/2019-06/201906191000/plugins/ (74.89kB)
09:39:11 [2022-02-01T14:39:11.755Z] [INFO] Fetching org.eclipse.equinox.p2.metadata_2.4.400.v20190409-0548.jar from http://download.eclipse.org/releases/2019-06/201906191000/plugins/ (352kB)
09:39:12 [2022-02-01T14:39:12.016Z] [INFO] Fetching org.eclipse.equinox.p2.metadata.repository_1.3.100.v20180822-1302.jar from http://download.eclipse.org/releases/2019-06/201906191000/plugins/ (130.41kB)
09:39:12 [2022-02-01T14:39:12.016Z] [INFO] Fetching org.eclipse.equinox.p2.repository_2.4.400.v20190318-1320.jar from http://download.eclipse.org/releases/2019-06/201906191000/plugins/ (137.99kB)
09:39:12 [2022-02-01T14:39:12.293Z] [INFO] Fetching org.tukaani.xz_1.8.0.v20180207-1613.jar from http://download.eclipse.org/releases/2019-06/201906191000/plugins/ (125.23kB)
09:39:12 [2022-02-01T14:39:12.293Z] [INFO] Fetching org.eclipse.ltk.core.refactoring_3.10.100.v20190510-0840.jar from http://download.eclipse.org/releases/2019-06/201906191000/plugins/ (349.76kB)
09:39:12 [2022-02-01T14:39:12.771Z] [INFO] Fetching org.eclipse.ltk.ui.refactoring_3.9.400.v20190510-0840.jar from http://download.eclipse.org/releases/2019-06/201906191000/plugins/ (500.49kB)
09:39:12 [2022-02-01T14:39:12.771Z] [INFO] Fetching org.eclipse.ui.navigator_3.8.0.v20190519-2104.jar from http://download.eclipse.org/releases/2019-06/201906191000/plugins/ (430.78kB)
09:39:12 [2022-02-01T14:39:12.771Z] [INFO] Fetching org.eclipse.team.core_3.8.600.v20190519-2354.jar from http://download.eclipse.org/releases/2019-06/201906191000/plugins/ (399.23kB)
09:39:13 [2022-02-01T14:39:13.030Z] [INFO] Fetching org.eclipse.team.ui_3.8.500.v20190519-2354.jar from http://download.eclipse.org/releases/2019-06/201906191000/plugins/ (1.4MB)
09:39:13 [2022-02-01T14:39:13.030Z] [INFO] Fetching org.eclipse.search_3.11.600.v20190519-2344.jar from http://download.eclipse.org/releases/2019-06/201906191000/plugins/ (541.76kB)
09:39:13 [2022-02-01T14:39:13.303Z] [INFO] Fetching org.eclipse.swt.gtk.linux.x86_64_3.111.0.v20190605-1801.jar from http://download.eclipse.org/releases/2019-06/201906191000/plugins/ (2.07MB)
09:39:13 [2022-02-01T14:39:13.303Z] [INFO] Fetching org.eclipse.ui.ide.application_1.3.300.v20190513-2118.jar from http://download.eclipse.org/releases/2019-06/201906191000/plugins/ (104.95kB)
09:39:13 [2022-02-01T14:39:13.562Z] [INFO] Fetching org.eclipse.ui.navigator.resources_3.6.500.v20190519-2104.jar from http://download.eclipse.org/releases/2019-06/201906191000/plugins/ (166.25kB)
09:39:13 [2022-02-01T14:39:13.562Z] [INFO] Fetching org.eclipse.urischeme_1.0.300.v20190514-0858.jar from http://download.eclipse.org/releases/2019-06/201906191000/plugins/ (46.92kB)
09:39:13 [2022-02-01T14:39:13.821Z] [INFO] Fetching org.eclipse.wst.common.frameworks_1.2.202.v202007142017.jar from https://download.eclipse.org/releases/2021-06/202106161001/plugins/ (117.72kB)
09:39:13 [2022-02-01T14:39:13.821Z] [INFO] Fetching org.eclipse.wst.jsdt.core_2.0.302.v201903222047.jar from http://download.eclipse.org/releases/2019-06/201906191000/plugins/ (3.65MB)
09:39:14 [2022-02-01T14:39:14.084Z] [INFO] Fetching org.eclipse.wst.jsdt.debug.core_3.2.200.v201903222047.jar from http://download.eclipse.org/releases/2019-06/201906191000/plugins/ (159.59kB)
09:39:14 [2022-02-01T14:39:14.347Z] [INFO] Computing target platform for MavenProject: org.eclipse.ease:org.eclipse.ease.lang.javascript.rhino.test:0.9.0-SNAPSHOT @ /home/jenkins/agent/workspace/ease.verify.core.target.2019-06/tests/org.eclipse.ease.lang.javascript.rhino.test/pom.xml
09:39:14 [2022-02-01T14:39:14.347Z] [INFO] Resolving dependencies of MavenProject: org.eclipse.ease:org.eclipse.ease.lang.javascript.rhino.test:0.9.0-SNAPSHOT @ /home/jenkins/agent/workspace/ease.verify.core.target.2019-06/tests/org.eclipse.ease.lang.javascript.rhino.test/pom.xml
09:39:14 [2022-02-01T14:39:14.347Z] [WARNING] The following locally built units have been used to resolve project dependencies:
09:39:14 [2022-02-01T14:39:14.347Z] [WARNING]   org.eclipse.ease/0.9.0.I202111221312
09:39:14 [2022-02-01T14:39:14.347Z] [WARNING]   org.eclipse.ease.testhelper/0.9.0.I202111031431
09:39:14 [2022-02-01T14:39:14.347Z] [WARNING]   org.eclipse.ease.ui/0.9.0.I202201141255
09:39:14 [2022-02-01T14:39:14.347Z] [WARNING]   org.eclipse.ease.lang.javascript.rhino/0.9.0.I202111181115
09:39:14 [2022-02-01T14:39:14.347Z] [WARNING]   org.eclipse.ease.lang.javascript/0.9.0.I202110141644
09:39:14 [2022-02-01T14:39:14.347Z] [WARNING]   org.eclipse.ease.classloader/0.9.0.I202106220815
09:39:14 [2022-02-01T14:39:14.347Z] [INFO] Resolving class path of MavenProject: org.eclipse.ease:org.eclipse.ease.lang.javascript.rhino.test:0.9.0-SNAPSHOT @ /home/jenkins/agent/workspace/ease.verify.core.target.2019-06/tests/org.eclipse.ease.lang.javascript.rhino.test/pom.xml
09:39:14 [2022-02-01T14:39:14.348Z] [INFO] Computing target platform for MavenProject: org.eclipse.ease:org.eclipse.ease.lang.javascript.test:0.9.0-SNAPSHOT @ /home/jenkins/agent/workspace/ease.verify.core.target.2019-06/tests/org.eclipse.ease.lang.javascript.test/pom.xml
09:39:14 [2022-02-01T14:39:14.348Z] [INFO] Resolving dependencies of MavenProject: org.eclipse.ease:org.eclipse.ease.lang.javascript.test:0.9.0-SNAPSHOT @ /home/jenkins/agent/workspace/ease.verify.core.target.2019-06/tests/org.eclipse.ease.lang.javascript.test/pom.xml
09:39:14 [2022-02-01T14:39:14.348Z] [WARNING] The following locally built units have been used to resolve project dependencies:
09:39:14 [2022-02-01T14:39:14.348Z] [WARNING]   org.eclipse.ease/0.9.0.I202111221312
09:39:14 [2022-02-01T14:39:14.348Z] [WARNING]   org.eclipse.ease.ui/0.9.0.I202201141255
09:39:14 [2022-02-01T14:39:14.348Z] [WARNING]   org.eclipse.ease.lang.javascript.rhino/0.9.0.I202111181115
09:39:14 [2022-02-01T14:39:14.348Z] [WARNING]   org.eclipse.ease.lang.javascript/0.9.0.I202110141644
09:39:14 [2022-02-01T14:39:14.348Z] [WARNING]   org.eclipse.ease.classloader/0.9.0.I202106220815
09:39:14 [2022-02-01T14:39:14.348Z] [INFO] Resolving class path of MavenProject: org.eclipse.ease:org.eclipse.ease.lang.javascript.test:0.9.0-SNAPSHOT @ /home/jenkins/agent/workspace/ease.verify.core.target.2019-06/tests/org.eclipse.ease.lang.javascript.test/pom.xml
09:39:14 [2022-02-01T14:39:14.348Z] [INFO] Computing target platform for MavenProject: org.eclipse.ease:org.eclipse.ease.lang.python.test:0.9.0-SNAPSHOT @ /home/jenkins/agent/workspace/ease.verify.core.target.2019-06/tests/org.eclipse.ease.lang.python.test/pom.xml
09:39:14 [2022-02-01T14:39:14.348Z] [INFO] Resolving dependencies of MavenProject: org.eclipse.ease:org.eclipse.ease.lang.python.test:0.9.0-SNAPSHOT @ /home/jenkins/agent/workspace/ease.verify.core.target.2019-06/tests/org.eclipse.ease.lang.python.test/pom.xml
09:39:14 [2022-02-01T14:39:14.615Z] [WARNING] The following locally built units have been used to resolve project dependencies:
09:39:14 [2022-02-01T14:39:14.615Z] [WARNING]   org.eclipse.ease/0.9.0.I202111221312
09:39:14 [2022-02-01T14:39:14.615Z] [WARNING]   org.eclipse.ease.ui/0.9.0.I202201141255
09:39:14 [2022-02-01T14:39:14.615Z] [WARNING]   org.eclipse.ease.lang.python/0.9.0.I202112011324
09:39:14 [2022-02-01T14:39:14.615Z] [WARNING]   org.eclipse.ease.classloader/0.9.0.I202106220815
09:39:14 [2022-02-01T14:39:14.615Z] [INFO] Resolving class path of MavenProject: org.eclipse.ease:org.eclipse.ease.lang.python.test:0.9.0-SNAPSHOT @ /home/jenkins/agent/workspace/ease.verify.core.target.2019-06/tests/org.eclipse.ease.lang.python.test/pom.xml
09:39:14 [2022-02-01T14:39:14.616Z] [INFO] Computing target platform for MavenProject: org.eclipse.ease:org.eclipse.ease.lang.python.jython.test:0.9.0-SNAPSHOT @ /home/jenkins/agent/workspace/ease.verify.core.target.2019-06/tests/org.eclipse.ease.lang.python.jython.test/pom.xml
09:39:14 [2022-02-01T14:39:14.616Z] [INFO] Resolving dependencies of MavenProject: org.eclipse.ease:org.eclipse.ease.lang.python.jython.test:0.9.0-SNAPSHOT @ /home/jenkins/agent/workspace/ease.verify.core.target.2019-06/tests/org.eclipse.ease.lang.python.jython.test/pom.xml
09:39:14 [2022-02-01T14:39:14.616Z] [WARNING] The following locally built units have been used to resolve project dependencies:
09:39:14 [2022-02-01T14:39:14.616Z] [WARNING]   org.eclipse.ease/0.9.0.I202111221312
09:39:14 [2022-02-01T14:39:14.616Z] [WARNING]   org.eclipse.ease.testhelper/0.9.0.I202111031431
09:39:14 [2022-02-01T14:39:14.616Z] [WARNING]   org.eclipse.ease.ui/0.9.0.I202201141255
09:39:14 [2022-02-01T14:39:14.616Z] [WARNING]   org.eclipse.ease.lang.python/0.9.0.I202112011324
09:39:14 [2022-02-01T14:39:14.616Z] [WARNING]   org.eclipse.ease.classloader/0.9.0.I202106220815
09:39:14 [2022-02-01T14:39:14.616Z] [WARNING]   org.eclipse.ease.lang.python.jython/0.9.0.I202112011324
09:39:14 [2022-02-01T14:39:14.616Z] [INFO] Resolving class path of MavenProject: org.eclipse.ease:org.eclipse.ease.lang.python.jython.test:0.9.0-SNAPSHOT @ /home/jenkins/agent/workspace/ease.verify.core.target.2019-06/tests/org.eclipse.ease.lang.python.jython.test/pom.xml
09:39:14 [2022-02-01T14:39:14.879Z] [INFO] Computing target platform for MavenProject: org.eclipse.ease:org.eclipse.ease.lang.scriptarchive.test:0.9.0-SNAPSHOT @ /home/jenkins/agent/workspace/ease.verify.core.target.2019-06/tests/org.eclipse.ease.lang.scriptarchive.test/pom.xml
09:39:14 [2022-02-01T14:39:14.879Z] [INFO] Resolving dependencies of MavenProject: org.eclipse.ease:org.eclipse.ease.lang.scriptarchive.test:0.9.0-SNAPSHOT @ /home/jenkins/agent/workspace/ease.verify.core.target.2019-06/tests/org.eclipse.ease.lang.scriptarchive.test/pom.xml
09:39:14 [2022-02-01T14:39:14.879Z] [WARNING] The following locally built units have been used to resolve project dependencies:
09:39:14 [2022-02-01T14:39:14.879Z] [WARNING]   org.eclipse.ease/0.9.0.I202111221312
09:39:14 [2022-02-01T14:39:14.880Z] [WARNING]   org.eclipse.ease.ui/0.9.0.I202201141255
09:39:14 [2022-02-01T14:39:14.880Z] [WARNING]   org.eclipse.ease.lang.scriptarchive/0.9.0.I202111181115
09:39:14 [2022-02-01T14:39:14.880Z] [WARNING]   org.eclipse.ease.lang.javascript.rhino/0.9.0.I202111181115
09:39:14 [2022-02-01T14:39:14.880Z] [WARNING]   org.eclipse.ease.lang.javascript/0.9.0.I202110141644
09:39:14 [2022-02-01T14:39:14.880Z] [WARNING]   org.eclipse.ease.classloader/0.9.0.I202106220815
09:39:14 [2022-02-01T14:39:14.880Z] [INFO] Resolving class path of MavenProject: org.eclipse.ease:org.eclipse.ease.lang.scriptarchive.test:0.9.0-SNAPSHOT @ /home/jenkins/agent/workspace/ease.verify.core.target.2019-06/tests/org.eclipse.ease.lang.scriptarchive.test/pom.xml
09:39:14 [2022-02-01T14:39:14.880Z] [INFO] Computing target platform for MavenProject: org.eclipse.ease:org.eclipse.ease.ui.test:0.9.0-SNAPSHOT @ /home/jenkins/agent/workspace/ease.verify.core.target.2019-06/tests/org.eclipse.ease.ui.test/pom.xml
09:39:14 [2022-02-01T14:39:14.880Z] [INFO] Resolving dependencies of MavenProject: org.eclipse.ease:org.eclipse.ease.ui.test:0.9.0-SNAPSHOT @ /home/jenkins/agent/workspace/ease.verify.core.target.2019-06/tests/org.eclipse.ease.ui.test/pom.xml
09:39:14 [2022-02-01T14:39:14.880Z] [WARNING] The following locally built units have been used to resolve project dependencies:
09:39:14 [2022-02-01T14:39:14.880Z] [WARNING]   org.eclipse.ease/0.9.0.I202111221312
09:39:14 [2022-02-01T14:39:14.880Z] [WARNING]   org.eclipse.ease.ui/0.9.0.I202201141255
09:39:14 [2022-02-01T14:39:14.880Z] [WARNING]   org.eclipse.ease.classloader/0.9.0.I202106220815
09:39:14 [2022-02-01T14:39:14.880Z] [INFO] Resolving class path of MavenProject: org.eclipse.ease:org.eclipse.ease.ui.test:0.9.0-SNAPSHOT @ /home/jenkins/agent/workspace/ease.verify.core.target.2019-06/tests/org.eclipse.ease.ui.test/pom.xml
09:39:14 [2022-02-01T14:39:14.880Z] [INFO] Fetching javax.servlet_3.1.0.v201410161800.jar from http://download.eclipse.org/releases/2019-06/201906191000/plugins/ (102.77kB)
09:39:15 [2022-02-01T14:39:15.143Z] [INFO] Fetching org.apache.lucene.analyzers-common_8.0.0.v20190404-1858.jar from http://download.eclipse.org/releases/2019-06/201906191000/plugins/ (1.65MB)
09:39:15 [2022-02-01T14:39:15.143Z] [INFO] Fetching org.apache.lucene.core_8.0.0.v20190404-1858.jar from http://download.eclipse.org/releases/2019-06/201906191000/plugins/ (3.17MB)
09:39:15 [2022-02-01T14:39:15.401Z] [INFO] Fetching org.apache.lucene.analyzers-smartcn_8.0.0.v20190404-1858.jar from http://download.eclipse.org/releases/2019-06/201906191000/plugins/ (3.45MB)
09:39:15 [2022-02-01T14:39:15.667Z] [INFO] Fetching org.eclipse.help.ui_4.1.500.v20190519-2119.jar from http://download.eclipse.org/releases/2019-06/201906191000/plugins/ (526.3kB)
09:39:15 [2022-02-01T14:39:15.924Z] [INFO] Fetching org.eclipse.help.webapp_3.9.500.v20190517-1202.jar from http://download.eclipse.org/releases/2019-06/201906191000/plugins/ (683.12kB)
09:39:16 [2022-02-01T14:39:16.182Z] [INFO] Fetching org.eclipse.equinox.http.jetty_3.7.100.v20190516-1504.jar from http://download.eclipse.org/releases/2019-06/201906191000/plugins/ (28.73kB)
09:39:16 [2022-02-01T14:39:16.182Z] [INFO] Fetching org.eclipse.ui.browser_3.6.400.v20190513-2118.jar from http://download.eclipse.org/releases/2019-06/201906191000/plugins/ (202.56kB)
09:39:16 [2022-02-01T14:39:16.440Z] [INFO] Fetching org.eclipse.equinox.http.servlet_1.6.100.v20190516-1504.jar from http://download.eclipse.org/releases/2019-06/201906191000/plugins/ (229.63kB)
09:39:16 [2022-02-01T14:39:16.440Z] [INFO] Fetching org.eclipse.jetty.http_9.4.18.v20190429.jar from http://download.eclipse.org/releases/2019-06/201906191000/plugins/ (211.63kB)
09:39:16 [2022-02-01T14:39:16.698Z] [INFO] Fetching org.eclipse.jetty.server_9.4.18.v20190429.jar from http://download.eclipse.org/releases/2019-06/201906191000/plugins/ (666.13kB)
09:39:16 [2022-02-01T14:39:16.698Z] [INFO] Fetching org.eclipse.jetty.servlet_9.4.18.v20190429.jar from http://download.eclipse.org/releases/2019-06/201906191000/plugins/ (127.95kB)
09:39:16 [2022-02-01T14:39:16.698Z] [INFO] Fetching org.eclipse.jetty.util_9.4.18.v20190429.jar from http://download.eclipse.org/releases/2019-06/201906191000/plugins/ (548.93kB)
09:39:16 [2022-02-01T14:39:16.956Z] [INFO] Fetching org.eclipse.equinox.http.registry_1.1.700.v20190214-1948.jar from http://download.eclipse.org/releases/2019-06/201906191000/plugins/ (45.33kB)
09:39:16 [2022-02-01T14:39:16.956Z] [INFO] Fetching org.eclipse.equinox.jsp.jasper_1.1.200.v20190214-1948.jar from http://download.eclipse.org/releases/2019-06/201906191000/plugins/ (27.77kB)
09:39:17 [2022-02-01T14:39:17.214Z] [INFO] Fetching org.eclipse.equinox.jsp.jasper.registry_1.1.200.v20190214-1948.jar from http://download.eclipse.org/releases/2019-06/201906191000/plugins/ (12.52kB)
09:39:17 [2022-02-01T14:39:17.214Z] [INFO] Fetching org.eclipse.help.base_4.2.600.v20190605-1800.jar from http://download.eclipse.org/releases/2019-06/201906191000/plugins/ (430.88kB)
09:39:17 [2022-02-01T14:39:17.473Z] [INFO] Fetching org.eclipse.jetty.io_9.4.18.v20190429.jar from http://download.eclipse.org/releases/2019-06/201906191000/plugins/ (167.49kB)
09:39:17 [2022-02-01T14:39:17.473Z] [INFO] Fetching org.eclipse.jetty.security_9.4.18.v20190429.jar from http://download.eclipse.org/releases/2019-06/201906191000/plugins/ (124.9kB)
09:39:17 [2022-02-01T14:39:17.735Z] [WARNING] The project org.eclipse.ease:org.eclipse.ease.releng:pom:0.9.0-SNAPSHOT uses prerequisites which is only intended for maven-plugin projects but not for non maven-plugin projects. For such purposes you should use the maven-enforcer-plugin. See https://maven.apache.org/enforcer/enforcer-rules/requireMavenVersion.html
09:39:17 [2022-02-01T14:39:17.735Z] [WARNING] [jenkins-event-spy] Unexpected Maven project file name 'target-tests-pom.xml', problems may occur
09:39:17 [2022-02-01T14:39:17.735Z] [INFO] ------------------------------------------------------------------------
09:39:17 [2022-02-01T14:39:17.735Z] [INFO] Reactor Build Order:
09:39:17 [2022-02-01T14:39:17.735Z] [INFO] 
09:39:17 [2022-02-01T14:39:17.735Z] [INFO] org.eclipse.ease.releng                                            [pom]
09:39:17 [2022-02-01T14:39:17.735Z] [INFO] org.eclipse.ease.releng.target               [eclipse-target-definition]
09:39:17 [2022-02-01T14:39:17.735Z] [INFO] org.eclipse.ease.test                              [eclipse-test-plugin]
09:39:17 [2022-02-01T14:39:17.735Z] [INFO] org.eclipse.ease.lang.javascript.rhino.test        [eclipse-test-plugin]
09:39:17 [2022-02-01T14:39:17.735Z] [INFO] org.eclipse.ease.lang.javascript.test              [eclipse-test-plugin]
09:39:17 [2022-02-01T14:39:17.735Z] [INFO] org.eclipse.ease.lang.python.test                  [eclipse-test-plugin]
09:39:17 [2022-02-01T14:39:17.735Z] [INFO] org.eclipse.ease.lang.python.jython.test           [eclipse-test-plugin]
09:39:17 [2022-02-01T14:39:17.735Z] [INFO] org.eclipse.ease.lang.scriptarchive.test           [eclipse-test-plugin]
09:39:17 [2022-02-01T14:39:17.735Z] [INFO] org.eclipse.ease.ui.test                           [eclipse-test-plugin]
09:39:17 [2022-02-01T14:39:17.735Z] [WARNING] [jenkins-event-spy] Unexpected Maven project file name 'target-tests-pom.xml', problems may occur
09:39:17 [2022-02-01T14:39:17.735Z] [INFO] 
09:39:17 [2022-02-01T14:39:17.735Z] [INFO] --------------< org.eclipse.ease:org.eclipse.ease.releng >--------------
09:39:17 [2022-02-01T14:39:17.735Z] [INFO] Building org.eclipse.ease.releng 0.9.0-SNAPSHOT                    [1/9]
09:39:17 [2022-02-01T14:39:17.735Z] [INFO] --------------------------------[ pom ]---------------------------------
09:39:17 [2022-02-01T14:39:17.735Z] [WARNING] [jenkins-event-spy] Unexpected Maven project file name 'target-tests-pom.xml', problems may occur
09:39:17 [2022-02-01T14:39:17.735Z] [INFO] 
09:39:17 [2022-02-01T14:39:17.735Z] [INFO] ----------< org.eclipse.ease:org.eclipse.ease.releng.target >-----------
09:39:17 [2022-02-01T14:39:17.735Z] [INFO] Building org.eclipse.ease.releng.target 0.9.0-SNAPSHOT             [2/9]
09:39:17 [2022-02-01T14:39:17.735Z] [INFO] ---------------------[ eclipse-target-definition ]----------------------
09:39:17 [2022-02-01T14:39:17.735Z] [INFO] 
09:39:17 [2022-02-01T14:39:17.735Z] [INFO] --- tycho-packaging-plugin:2.2.0:package-target-definition (default-package-target-definition) @ org.eclipse.ease.releng.target ---
09:39:17 [2022-02-01T14:39:17.993Z] [INFO] 
09:39:17 [2022-02-01T14:39:17.993Z] [INFO] ---------------< org.eclipse.ease:org.eclipse.ease.test >---------------
09:39:17 [2022-02-01T14:39:17.993Z] [INFO] Building org.eclipse.ease.test 0.9.0-SNAPSHOT                      [3/9]
09:39:17 [2022-02-01T14:39:17.993Z] [INFO] ------------------------[ eclipse-test-plugin ]-------------------------
09:39:17 [2022-02-01T14:39:17.993Z] [INFO] 
09:39:17 [2022-02-01T14:39:17.993Z] [INFO] --- tycho-packaging-plugin:2.2.0:build-qualifier (default-build-qualifier) @ org.eclipse.ease.test ---
09:39:17 [2022-02-01T14:39:17.993Z] [INFO] The project's OSGi version is 0.9.0.I202111221312
09:39:17 [2022-02-01T14:39:17.993Z] [INFO] 
09:39:17 [2022-02-01T14:39:17.993Z] [INFO] --- tycho-packaging-plugin:2.2.0:validate-id (default-validate-id) @ org.eclipse.ease.test ---
09:39:18 [2022-02-01T14:39:18.251Z] [INFO] 
09:39:18 [2022-02-01T14:39:18.251Z] [INFO] --- tycho-packaging-plugin:2.2.0:validate-version (default-validate-version) @ org.eclipse.ease.test ---
09:39:18 [2022-02-01T14:39:18.251Z] [INFO] 
09:39:18 [2022-02-01T14:39:18.251Z] [INFO] --- maven-resources-plugin:2.4.3:resources (default-resources) @ org.eclipse.ease.test ---
09:39:18 [2022-02-01T14:39:18.251Z] [INFO] Using 'UTF-8' encoding to copy filtered resources.
09:39:18 [2022-02-01T14:39:18.251Z] [INFO] skip non existing resourceDirectory /home/jenkins/agent/workspace/ease.verify.core.target.2019-06/tests/org.eclipse.ease.test/src/main/resources
09:39:18 [2022-02-01T14:39:18.251Z] [INFO] 
09:39:18 [2022-02-01T14:39:18.251Z] [INFO] --- tycho-compiler-plugin:2.2.0:compile (default-compile) @ org.eclipse.ease.test ---
09:39:18 [2022-02-01T14:39:18.509Z] [INFO] Nothing to compile - all classes are up to date
09:39:18 [2022-02-01T14:39:18.509Z] [INFO] 
09:39:18 [2022-02-01T14:39:18.509Z] [INFO] --- maven-resources-plugin:2.4.3:testResources (default-testResources) @ org.eclipse.ease.test ---
09:39:18 [2022-02-01T14:39:18.509Z] [INFO] Using 'UTF-8' encoding to copy filtered resources.
09:39:18 [2022-02-01T14:39:18.510Z] [INFO] skip non existing resourceDirectory /home/jenkins/agent/workspace/ease.verify.core.target.2019-06/tests/org.eclipse.ease.test/src/test/resources
09:39:18 [2022-02-01T14:39:18.510Z] [INFO] 
09:39:18 [2022-02-01T14:39:18.510Z] [INFO] --- target-platform-configuration:2.2.0:target-platform (default-target-platform) @ org.eclipse.ease.test ---
09:39:18 [2022-02-01T14:39:18.510Z] [INFO] 
09:39:18 [2022-02-01T14:39:18.510Z] [INFO] --- tycho-packaging-plugin:2.2.0:package-plugin (default-package-plugin) @ org.eclipse.ease.test ---
09:39:18 [2022-02-01T14:39:18.510Z] [INFO] Building jar: /home/jenkins/agent/workspace/ease.verify.core.target.2019-06/tests/org.eclipse.ease.test/target/org.eclipse.ease.test-0.9.0-SNAPSHOT.jar
09:39:18 [2022-02-01T14:39:18.839Z] [INFO] 
09:39:18 [2022-02-01T14:39:18.839Z] [INFO] --- tycho-p2-plugin:2.2.0:p2-metadata-default (default-p2-metadata-default) @ org.eclipse.ease.test ---
09:39:18 [2022-02-01T14:39:18.839Z] [INFO] 
09:39:18 [2022-02-01T14:39:18.839Z] [INFO] --- jacoco-maven-plugin:0.8.6:prepare-agent (jacoco-initialize) @ org.eclipse.ease.test ---
09:39:18 [2022-02-01T14:39:18.839Z] [WARNING] The artifact xml-apis:xml-apis:jar:2.0.2 has been relocated to xml-apis:xml-apis:jar:1.0.b2
09:39:19 [2022-02-01T14:39:19.308Z] [INFO] tycho.testArgLine set to -javaagent:/home/jenkins/.m2/repository/org/jacoco/org.jacoco.agent/0.8.6/org.jacoco.agent-0.8.6-runtime.jar=destfile=/home/jenkins/agent/workspace/ease.verify.core.target.2019-06/tests/org.eclipse.ease.test/target/jacoco.exec,output=file
09:39:19 [2022-02-01T14:39:19.308Z] [INFO] 
09:39:19 [2022-02-01T14:39:19.308Z] [INFO] --- tycho-surefire-plugin:2.2.0:test (default-test) @ org.eclipse.ease.test ---
09:39:19 [2022-02-01T14:39:19.308Z] [INFO] Fetching org.junit_4.12.0.v201504281640.jar from http://download.eclipse.org/releases/2019-06/201906191000/plugins/ (284.2kB)
09:39:19 [2022-02-01T14:39:19.308Z] [INFO] Executing Test Runtime with timeout 0, logs (if any) will be placed at: /home/jenkins/agent/workspace/ease.verify.core.target.2019-06/tests/org.eclipse.ease.test/target/work/data/.metadata/.log
09:39:19 [2022-02-01T14:39:19.308Z] [INFO] Command line:
09:39:19 [2022-02-01T14:39:19.308Z] 	[/opt/tools/java/openjdk/jdk-15/15.0.2+7/bin/java, -Dosgi.noShutdown=false, -Dosgi.os=linux, -Dosgi.ws=gtk, -Dosgi.arch=x86_64, -javaagent:/home/jenkins/.m2/repository/org/jacoco/org.jacoco.agent/0.8.6/org.jacoco.agent-0.8.6-runtime.jar=destfile=/home/jenkins/agent/workspace/ease.verify.core.target.2019-06/tests/org.eclipse.ease.test/target/jacoco.exec,output=file, -Dosgi.clean=true, -jar, /home/jenkins/.m2/repository/p2/osgi/bundle/org.eclipse.equinox.launcher/1.5.400.v20190515-0925/org.eclipse.equinox.launcher-1.5.400.v20190515-0925.jar, -data, /home/jenkins/agent/workspace/ease.verify.core.target.2019-06/tests/org.eclipse.ease.test/target/work/data, -install, /home/jenkins/agent/workspace/ease.verify.core.target.2019-06/tests/org.eclipse.ease.test/target/work, -configuration, /home/jenkins/agent/workspace/ease.verify.core.target.2019-06/tests/org.eclipse.ease.test/target/work/configuration, -application, org.eclipse.tycho.surefire.osgibooter.headlesstest, -testproperties, /home/jenkins/agent/workspace/ease.verify.core.target.2019-06/tests/org.eclipse.ease.test/target/surefire.properties]
09:39:19 [2022-02-01T14:39:19.308Z] Picked up JAVA_TOOL_OPTIONS: -Dmaven.ext.class.path="/home/jenkins/agent/workspace/ease.verify.core.target.2019-06@tmp/withMaven348621a9/pipeline-maven-spy.jar" -Dorg.jenkinsci.plugins.pipeline.maven.reportsFolder="/home/jenkins/agent/workspace/ease.verify.core.target.2019-06@tmp/withMaven348621a9" 
09:39:24 [2022-02-01T14:39:24.635Z] Running org.eclipse.ease.AbstractReplScriptEngineTest
09:39:24 [2022-02-01T14:39:24.635Z] org.eclipse.ease.ScriptEngineException: Security check failed: org.eclipse.ease.AbstractScriptEngineTest$$Lambda$406/0x0000000800da3e28@565f4a81
09:39:24 [2022-02-01T14:39:24.635Z] 	at org.eclipse.ease.AbstractScriptEngine.inject(AbstractScriptEngine.java:180)
09:39:24 [2022-02-01T14:39:24.635Z] 	at org.eclipse.ease.AbstractScriptEngine.run(AbstractScriptEngine.java:243)
09:39:24 [2022-02-01T14:39:24.635Z] 	at org.eclipse.core.internal.jobs.Worker.run(Worker.java:63)
09:39:29 [2022-02-01T14:39:29.949Z] not startednot startedfoofoonot startedfoonot startedjava.lang.RuntimeException: ERROR
09:39:29 [2022-02-01T14:39:29.949Z] 	at org.eclipse.ease.AbstractScriptEngineTest$MockedScriptEngine.execute(AbstractScriptEngineTest.java:730)
09:39:29 [2022-02-01T14:39:29.949Z] 	at org.eclipse.ease.AbstractScriptEngine.inject(AbstractScriptEngine.java:190)
09:39:29 [2022-02-01T14:39:29.949Z] 	at org.eclipse.ease.AbstractScriptEngine.run(AbstractScriptEngine.java:243)
09:39:29 [2022-02-01T14:39:29.949Z] 	at org.eclipse.core.internal.jobs.Worker.run(Worker.java:63)
09:39:30 [2022-02-01T14:39:30.883Z] foofoofooTests run: 67, Failures: 0, Errors: 0, Skipped: 0, Time elapsed: 6.797 s - in org.eclipse.ease.AbstractReplScriptEngineTest
09:39:30 [2022-02-01T14:39:30.883Z] terminate_via_monitor_cancellation  Time elapsed: 0.312 s
09:39:30 [2022-02-01T14:39:30.883Z] addSecurityCheck_adds_failing_check  Time elapsed: 0.004 s
09:39:30 [2022-02-01T14:39:30.883Z] getMonitor_not_equals_null_for_running_engine  Time elapsed: 0.003 s
09:39:30 [2022-02-01T14:39:30.883Z] buffered_variables_are_injected_into_the_engine  Time elapsed: 0.001 s
09:39:30 [2022-02-01T14:39:30.883Z] getDescription_returns_engine_description  Time elapsed: 0.707 s
09:39:30 [2022-02-01T14:39:30.883Z] getLaunch_returns_previously_set_launch  Time elapsed: 0.085 s
09:39:30 [2022-02-01T14:39:30.883Z] setCloseStreamsOnTerminate_closes_streams  Time elapsed: 1.122 s
09:39:30 [2022-02-01T14:39:30.883Z] getDescription_returns_null_by_default  Time elapsed: 0.001 s
09:39:30 [2022-02-01T14:39:30.883Z] constructor_sets_job_name  Time elapsed: 0.001 s
09:39:30 [2022-02-01T14:39:30.883Z] inject_executes_code_in_the_middle_of_a_script  Time elapsed: 0.001 s
09:39:30 [2022-02-01T14:39:30.883Z] getVariable_returns_buffered_variable  Time elapsed: 0 s
09:39:30 [2022-02-01T14:39:30.883Z] setErrorStream_to_null_resets_error_stream  Time elapsed: 0 s
09:39:30 [2022-02-01T14:39:30.883Z] streams_are_not_closed_by_default_on_engine_termination  Time elapsed: 0.002 s
09:39:30 [2022-02-01T14:39:30.883Z] execute_valid_code_and_terminate  Time elapsed: 0.001 s
09:39:30 [2022-02-01T14:39:30.883Z] getMonitor_equals_null_for_terminated_engine  Time elapsed: 1.001 s
09:39:30 [2022-02-01T14:39:30.883Z] setInputStream_changes_input_stream  Time elapsed: 0.001 s
09:39:30 [2022-02-01T14:39:30.883Z] setOutputStream_to_null_resets_output_stream  Time elapsed: 0 s
09:39:30 [2022-02-01T14:39:30.884Z] getExecutedFile_returns_script_resource  Time elapsed: 0.129 s
09:39:30 [2022-02-01T14:39:30.884Z] isFinished_equals_true_for_finished_engine  Time elapsed: 0.001 s
09:39:30 [2022-02-01T14:39:30.884Z] terminate_stops_running_engine  Time elapsed: 0.202 s
09:39:30 [2022-02-01T14:39:30.884Z] isFinished_equals_false_for_not_started_engine  Time elapsed: 0 s
09:39:30 [2022-02-01T14:39:30.884Z] isJob  Time elapsed: 0.001 s
09:39:30 [2022-02-01T14:39:30.884Z] getVariables_returns_all_buffered_variables  Time elapsed: 0.001 s
09:39:30 [2022-02-01T14:39:30.884Z] getVariable_is_null_for_non_existing_variable  Time elapsed: 0.001 s
09:39:30 [2022-02-01T14:39:30.884Z] setInputStream_to_null_resets_input_stream  Time elapsed: 0 s
09:39:30 [2022-02-01T14:39:30.884Z] getInputStream_defaults_to_system_in  Time elapsed: 0 s
09:39:30 [2022-02-01T14:39:30.884Z] getOutputStream_defaults_to_system_in  Time elapsed: 0 s
09:39:30 [2022-02-01T14:39:30.884Z] getStackTrace_returns_stack_of_size_1_during_execution  Time elapsed: 0.002 s
09:39:30 [2022-02-01T14:39:30.884Z] setOutputStream_changes_output_stream  Time elapsed: 0.001 s
09:39:30 [2022-02-01T14:39:30.884Z] getLaunch_is_null_by_default  Time elapsed: 0.001 s
09:39:30 [2022-02-01T14:39:30.884Z] setErrorStream_changes_error_stream  Time elapsed: 0.001 s
09:39:30 [2022-02-01T14:39:30.884Z] getMonitor_equals_null_for_not_started_engine  Time elapsed: 0.001 s
09:39:30 [2022-02-01T14:39:30.884Z] terminate_does_nothing_for_non_launched_engine  Time elapsed: 0.001 s
09:39:30 [2022-02-01T14:39:30.884Z] removeExecutionListener_removes_an_engine_listener  Time elapsed: 0.02 s
09:39:30 [2022-02-01T14:39:30.884Z] getStackTrace_returns_empty_trace_for_terminated_engine  Time elapsed: 0.001 s
09:39:30 [2022-02-01T14:39:30.884Z] addExecutionListener_adds_an_engine_listener  Time elapsed: 0.005 s
09:39:30 [2022-02-01T14:39:30.884Z] getExecutedFile_returns_null_for_dynamic_code  Time elapsed: 0.001 s
09:39:30 [2022-02-01T14:39:30.884Z] execute_schedules_script  Time elapsed: 0 s
09:39:30 [2022-02-01T14:39:30.884Z] hasVariable_is_true_when_variable_is_set  Time elapsed: 0.001 s
09:39:30 [2022-02-01T14:39:30.884Z] addSecurityCheck_adds_passing_check  Time elapsed: 0.019 s
09:39:30 [2022-02-01T14:39:30.884Z] getStackTrace_returns_empty_trace_for_fresh_engine  Time elapsed: 0 s
09:39:30 [2022-02-01T14:39:30.884Z] joinEngine_waits_for_x_ms  Time elapsed: 1.05 s
09:39:30 [2022-02-01T14:39:30.884Z] hasVariable_is_false_when_no_variable_is_set  Time elapsed: 0 s
09:39:30 [2022-02-01T14:39:30.884Z] getErrorStream_defaults_to_system_err  Time elapsed: 0.001 s
09:39:30 [2022-02-01T14:39:30.884Z] execute_processes_script_when_engine_is_started  Time elapsed: 0.001 s
09:39:30 [2022-02-01T14:39:30.884Z] setCloseStreamsOnTerminate_keeps_streams_open  Time elapsed: 0.001 s
09:39:30 [2022-02-01T14:39:30.884Z] getExecutedFile_returns_execution_root_file  Time elapsed: 0.001 s
09:39:30 [2022-02-01T14:39:30.884Z] joinEngine_waits_for_engine_to_terminate  Time elapsed: 1.052 s
09:39:30 [2022-02-01T14:39:30.884Z] execute_errorous_code_and_terminate  Time elapsed: 0.002 s
09:39:30 [2022-02-01T14:39:30.884Z] getType_for_Byte_returns_JAVA_PRIMITIVE  Time elapsed: 0.001 s
09:39:30 [2022-02-01T14:39:30.884Z] getType_for_Long_returns_JAVA_PRIMITIVE  Time elapsed: 0 s
09:39:30 [2022-02-01T14:39:30.884Z] getType_for_String_returns_JAVA_OBJECT  Time elapsed: 0.001 s
09:39:30 [2022-02-01T14:39:30.884Z] getType_for_Character_returns_JAVA_PRIMITIVE  Time elapsed: 0.001 s
09:39:30 [2022-02-01T14:39:30.884Z] getLastExecutionResult_is_null_on_new_engine  Time elapsed: 0.003 s
09:39:30 [2022-02-01T14:39:30.884Z] getDefinedVariables_returns_debug_variables  Time elapsed: 0.002 s
09:39:30 [2022-02-01T14:39:30.884Z] getType_for_Double_returns_JAVA_PRIMITIVE  Time elapsed: 0 s
09:39:30 [2022-02-01T14:39:30.884Z] getType_for_Boolean_returns_JAVA_PRIMITIVE  Time elapsed: 0 s
09:39:30 [2022-02-01T14:39:30.884Z] getType_for_null_returns_NULL  Time elapsed: 0.001 s
09:39:30 [2022-02-01T14:39:30.884Z] getType_for_Integer_returns_JAVA_PRIMITIVE  Time elapsed: 0 s
09:39:30 [2022-02-01T14:39:30.884Z] getType_for_Float_returns_JAVA_PRIMITIVE  Time elapsed: 0.001 s
09:39:30 [2022-02-01T14:39:30.884Z] getLastExecutionResult_returns_last_result  Time elapsed: 0.001 s
09:39:30 [2022-02-01T14:39:30.884Z] terminate_stops_interactive_engine  Time elapsed: 0.001 s
09:39:30 [2022-02-01T14:39:30.884Z] getLastExecutionResult_is_null_after_engine_termination  Time elapsed: 0.001 s
09:39:30 [2022-02-01T14:39:30.884Z] getType_for_Short_returns_JAVA_PRIMITIVE  Time elapsed: 0 s
09:39:30 [2022-02-01T14:39:30.884Z] setTerminateOnIdle_keeps_engine_running  Time elapsed: 1.001 s
09:39:30 [2022-02-01T14:39:30.884Z] getType_for_VOID_returns_VOID  Time elapsed: 0.001 s
09:39:30 [2022-02-01T14:39:30.884Z] interactive_engine_executes_incoming_code  Time elapsed: 0.001 s
09:39:30 [2022-02-01T14:39:30.884Z] Running org.eclipse.ease.modules.BootStrapperTest
09:39:30 [2022-02-01T14:39:30.884Z] Tests run: 1, Failures: 0, Errors: 0, Skipped: 0, Time elapsed: 0.094 s - in org.eclipse.ease.modules.BootStrapperTest
09:39:30 [2022-02-01T14:39:30.884Z] createEngine_creates_wrapper_code_for_EnvironmentModule  Time elapsed: 0.094 s
09:39:30 [2022-02-01T14:39:30.884Z] Running org.eclipse.ease.modules.ModuleTrackerTest
09:39:30 [2022-02-01T14:39:30.884Z] Tests run: 11, Failures: 0, Errors: 0, Skipped: 0, Time elapsed: 0.067 s - in org.eclipse.ease.modules.ModuleTrackerTest
09:39:30 [2022-02-01T14:39:30.884Z] state_setWrapped_pushes_module_on_top_of_stack  Time elapsed: 0.061 s
09:39:30 [2022-02-01T14:39:30.884Z] state_iisWrapped_is_false_after_definition_is_loaded  Time elapsed: 0 s
09:39:30 [2022-02-01T14:39:30.884Z] state_isWrapped_is_true_after_wrapping_the_module  Time elapsed: 0 s
09:39:30 [2022-02-01T14:39:30.884Z] getOrCreateModuleState_returns_existing_state  Time elapsed: 0.001 s
09:39:30 [2022-02-01T14:39:30.884Z] new_tracker_does_not_contain_modules  Time elapsed: 0 s
09:39:30 [2022-02-01T14:39:30.885Z] state_isLoaded_is_false_when_no_instance_is_set  Time elapsed: 0 s
09:39:30 [2022-02-01T14:39:30.885Z] getOrCreateModuleState_creates_new_module_state  Time elapsed: 0 s
09:39:30 [2022-02-01T14:39:30.885Z] state_isLoaded_is_true_when_instance_is_set  Time elapsed: 0 s
09:39:30 [2022-02-01T14:39:30.885Z] getModuleState_is_null_when_module_is_not_available  Time elapsed: 0 s
09:39:30 [2022-02-01T14:39:30.885Z] addModule_adds_a_module_state  Time elapsed: 0.001 s
09:39:30 [2022-02-01T14:39:30.885Z] addModule_adds_on_top_of_stack  Time elapsed: 0 s
09:39:30 [2022-02-01T14:39:30.885Z] Running org.eclipse.ease.modules.EnvironmentModuleTest
09:39:30 [2022-02-01T14:39:30.885Z] Tests run: 37, Failures: 0, Errors: 0, Skipped: 0, Time elapsed: 0.064 s - in org.eclipse.ease.modules.EnvironmentModuleTest
09:39:30 [2022-02-01T14:39:30.885Z] readInput_blocking_reads_single_line_on_each_call  Time elapsed: 0.005 s
09:39:30 [2022-02-01T14:39:30.885Z] addModuleListener_informs_listener_on_module_load  Time elapsed: 0.012 s
09:39:30 [2022-02-01T14:39:30.885Z] getModule_by_class_finds_environment_module  Time elapsed: 0.001 s
09:39:30 [2022-02-01T14:39:30.885Z] hasMethodCallback_is_true_when_a_callbackProvider_is_registered_for_a_method  Time elapsed: 0.012 s
09:39:30 [2022-02-01T14:39:30.885Z] preMethodCallback_calls_callbackProvider  Time elapsed: 0.001 s
09:39:30 [2022-02-01T14:39:30.885Z] printError_multiple_prints_same_error_multiple_times  Time elapsed: 0.001 s
09:39:30 [2022-02-01T14:39:30.885Z] printError_writes_to_error_stream  Time elapsed: 0 s
09:39:30 [2022-02-01T14:39:30.885Z] exit_sets_script_return_code  Time elapsed: 0 s
09:39:30 [2022-02-01T14:39:30.885Z] getModules_contains_environment_module  Time elapsed: 0.001 s
09:39:30 [2022-02-01T14:39:30.885Z] loadJar_registers_URL  Time elapsed: 0.002 s
09:39:30 [2022-02-01T14:39:30.885Z] wrap_wraps_instance_methods  Time elapsed: 0.002 s
09:39:30 [2022-02-01T14:39:30.885Z] include_executes_referenced_resource  Time elapsed: 0.001 s
09:39:30 [2022-02-01T14:39:30.885Z] readInput_filters_carriage_return  Time elapsed: 0.001 s
09:39:30 [2022-02-01T14:39:30.885Z] print_false_writes_to_output_string  Time elapsed: 0.001 s
09:39:30 [2022-02-01T14:39:30.885Z] addModuleListener_sends_reloaded_event  Time elapsed: 0.001 s
09:39:30 [2022-02-01T14:39:30.885Z] printError_once_prints_same_error_only_once  Time elapsed: 0.001 s
09:39:30 [2022-02-01T14:39:30.885Z] print_true_appends_line_feed  Time elapsed: 0.001 s
09:39:30 [2022-02-01T14:39:30.885Z] readInput_nonBlocking_is_firstLine_when_data_is_availble  Time elapsed: 0.001 s
09:39:30 [2022-02-01T14:39:30.885Z] getModules_contains_loaded_module  Time elapsed: 0.001 s
09:39:30 [2022-02-01T14:39:30.885Z] getModule_by_class_returns_null_for_unknown_module  Time elapsed: 0 s
09:39:30 [2022-02-01T14:39:30.885Z] exit_throws_exception  Time elapsed: 0.001 s
09:39:30 [2022-02-01T14:39:30.885Z] execute_injects_script_code  Time elapsed: 0.001 s
09:39:30 [2022-02-01T14:39:30.885Z] readInput_blocking_stops_when_stream_is_closed  Time elapsed: 0 s
09:39:30 [2022-02-01T14:39:30.885Z] getScriptEngine_returns_engine_instance  Time elapsed: 0.001 s
09:39:30 [2022-02-01T14:39:30.885Z] getWrappedVariableName_returns_unique_name_per_class  Time elapsed: 0 s
09:39:30 [2022-02-01T14:39:30.885Z] getModuleDefinition_returns_environment_definition  Time elapsed: 0.001 s
09:39:30 [2022-02-01T14:39:30.885Z] hasMethodCallback_is_false_when_no_callbackProvider_is_registered  Time elapsed: 0.001 s
09:39:30 [2022-02-01T14:39:30.885Z] getModule_by_class_finds_loaded_module  Time elapsed: 0.002 s
09:39:30 [2022-02-01T14:39:30.885Z] hasMethodCallback_is_false_when_method_is_not_registered  Time elapsed: 0 s
09:39:30 [2022-02-01T14:39:30.885Z] loadModule_throws_on_unknown_module  Time elapsed: 0.001 s
09:39:30 [2022-02-01T14:39:30.885Z] getModule_by_name_finds_environment_module  Time elapsed: 0.001 s
09:39:30 [2022-02-01T14:39:30.885Z] getModule_by_name_finds_loaded_module  Time elapsed: 0.001 s
09:39:30 [2022-02-01T14:39:30.885Z] removeModuleListener_stops_sending_events_to_listener  Time elapsed: 0.001 s
09:39:30 [2022-02-01T14:39:30.885Z] include_throws_on_invalid_resource  Time elapsed: 0.001 s
09:39:30 [2022-02-01T14:39:30.885Z] postMethodCallback_calls_callbackProvider  Time elapsed: 0.001 s
09:39:30 [2022-02-01T14:39:30.885Z] readInput_nonBlocking_is_empty_when_no_data_is_availble  Time elapsed: 0 s
09:39:30 [2022-02-01T14:39:30.885Z] getModule_by_name_returns_null_for_unknonw_module  Time elapsed: 0 s
09:39:30 [2022-02-01T14:39:30.885Z] Running org.eclipse.ease.modules.ModuleDocumentationTest
09:39:30 [2022-02-01T14:39:30.885Z] Tests run: 1, Failures: 0, Errors: 0, Skipped: 0, Time elapsed: 0.001 s - in org.eclipse.ease.modules.ModuleDocumentationTest
09:39:30 [2022-02-01T14:39:30.885Z] module_documentation_exists  Time elapsed: 0.001 s
09:39:30 [2022-02-01T14:39:30.885Z] Running org.eclipse.ease.modules.ScriptParameterTest
09:39:30 [2022-02-01T14:39:30.885Z] Tests run: 6, Failures: 0, Errors: 0, Skipped: 0, Time elapsed: 0.005 s - in org.eclipse.ease.modules.ScriptParameterTest
09:39:30 [2022-02-01T14:39:30.885Z] getDefaultValue_null_when_annotation_has_no_default_value  Time elapsed: 0.002 s
09:39:30 [2022-02-01T14:39:30.885Z] isOptional_false_when_annotation_is_missing  Time elapsed: 0 s
09:39:30 [2022-02-01T14:39:30.885Z] isOptional_false_when_annotation_has_no_default_value  Time elapsed: 0 s
09:39:30 [2022-02-01T14:39:30.885Z] getDefaultValue_has_value_when_annotation_with_default_value_exists  Time elapsed: 0 s
09:39:30 [2022-02-01T14:39:30.885Z] getDefaultValue_null_when_annotation_is_missing  Time elapsed: 0 s
09:39:30 [2022-02-01T14:39:30.885Z] isOptional_true_when_annotation_with_default_value_exists  Time elapsed: 0 s
09:39:30 [2022-02-01T14:39:30.885Z] Running org.eclipse.ease.modules.ModuleDefinitionTest
09:39:30 [2022-02-01T14:39:30.885Z] Tests run: 2, Failures: 0, Errors: 0, Skipped: 0, Time elapsed: 0.001 s - in org.eclipse.ease.modules.ModuleDefinitionTest
09:39:30 [2022-02-01T14:39:30.885Z] forInstance_returns_definition  Time elapsed: 0.001 s
09:39:30 [2022-02-01T14:39:30.886Z] forInstance_returns_null  Time elapsed: 0 s
09:39:30 [2022-02-01T14:39:30.886Z] Running org.eclipse.ease.applications.RunHeadlessScriptTest
09:39:31 [2022-02-01T14:39:31.452Z] org.eclipse.ease.ScriptExecutionException: SyntaxError: missing ; before statement (file:///home/jenkins/agent/workspace/ease.verify.core.target.2019-06/tests/org.eclipse.ease.test/resources/throwsException.js#1)
09:39:31 [2022-02-01T14:39:31.452Z] this does not work;
09:39:31 [2022-02-01T14:39:31.452Z]          ^
09:39:31 [2022-02-01T14:39:31.452Z] 	at throwsException.js,file:///home/jenkins/agent/workspace/ease.verify.core.target.2019-06/tests/org.eclipse.ease.test/resources/throwsException.js
09:39:31 [2022-02-01T14:39:31.452Z] ERROR: invalid command line argument
09:39:31 [2022-02-01T14:39:31.452Z] 	invalid argument: -unknown
09:39:31 [2022-02-01T14:39:31.452Z] 
09:39:31 [2022-02-01T14:39:31.452Z] SYNTAX: [-workspace <workspace location> [-refreshWorkspace]] [-engine <engineID>]-script <script name> <script parameters>
09:39:31 [2022-02-01T14:39:31.452Z] 
09:39:31 [2022-02-01T14:39:31.452Z] 		<script name> is a path like 'file://C/myfolder/myscript.js'
09:39:31 [2022-02-01T14:39:31.452Z] 		<engineID> provides a dedicated script engine ID. Use org.eclipse.ease.listEngines application.
09:39:31 [2022-02-01T14:39:31.452Z] 		<workspace location> is a file system path like 'C:\somefolder\myworkspace'
09:39:31 [2022-02-01T14:39:31.452Z] 			if you provide a workspace you can use workspace:// identifiers in your scripts
09:39:31 [2022-02-01T14:39:31.452Z] 			if you provide a workspace you may ask to refresh it first prior to script execution
09:39:31 [2022-02-01T14:39:31.452Z] 		<script parameters> will be passed to the script as String[] in the variable 'argv'
09:39:31 [2022-02-01T14:39:31.452Z] ERROR: invalid command line argument
09:39:31 [2022-02-01T14:39:31.452Z] 	script name is missing
09:39:31 [2022-02-01T14:39:31.452Z] 
09:39:31 [2022-02-01T14:39:31.452Z] SYNTAX: [-workspace <workspace location> [-refreshWorkspace]] [-engine <engineID>]-script <script name> <script parameters>
09:39:31 [2022-02-01T14:39:31.452Z] 
09:39:31 [2022-02-01T14:39:31.452Z] 		<script name> is a path like 'file://C/myfolder/myscript.js'
09:39:31 [2022-02-01T14:39:31.452Z] 		<engineID> provides a dedicated script engine ID. Use org.eclipse.ease.listEngines application.
09:39:31 [2022-02-01T14:39:31.452Z] 		<workspace location> is a file system path like 'C:\somefolder\myworkspace'
09:39:31 [2022-02-01T14:39:31.452Z] 			if you provide a workspace you can use workspace:// identifiers in your scripts
09:39:31 [2022-02-01T14:39:31.452Z] 			if you provide a workspace you may ask to refresh it first prior to script execution
09:39:31 [2022-02-01T14:39:31.452Z] 		<script parameters> will be passed to the script as String[] in the variable 'argv'
09:39:31 [2022-02-01T14:39:31.452Z] SYNTAX: [-workspace <workspace location> [-refreshWorkspace]] [-engine <engineID>]-script <script name> <script parameters>
09:39:31 [2022-02-01T14:39:31.452Z] 
09:39:31 [2022-02-01T14:39:31.452Z] 		<script name> is a path like 'file://C/myfolder/myscript.js'
09:39:31 [2022-02-01T14:39:31.452Z] 		<engineID> provides a dedicated script engine ID. Use org.eclipse.ease.listEngines application.
09:39:31 [2022-02-01T14:39:31.452Z] 		<workspace location> is a file system path like 'C:\somefolder\myworkspace'
09:39:31 [2022-02-01T14:39:31.452Z] 			if you provide a workspace you can use workspace:// identifiers in your scripts
09:39:31 [2022-02-01T14:39:31.452Z] 			if you provide a workspace you may ask to refresh it first prior to script execution
09:39:31 [2022-02-01T14:39:31.452Z] 		<script parameters> will be passed to the script as String[] in the variable 'argv'
09:39:31 [2022-02-01T14:39:31.711Z] Hello World
09:39:31 [2022-02-01T14:39:31.711Z] ERROR: invalid command line argument
09:39:31 [2022-02-01T14:39:31.711Z] 	workspace name is missing
09:39:31 [2022-02-01T14:39:31.711Z] 
09:39:31 [2022-02-01T14:39:31.711Z] SYNTAX: [-workspace <workspace location> [-refreshWorkspace]] [-engine <engineID>]-script <script name> <script parameters>
09:39:31 [2022-02-01T14:39:31.711Z] 
09:39:31 [2022-02-01T14:39:31.711Z] 		<script name> is a path like 'file://C/myfolder/myscript.js'
09:39:31 [2022-02-01T14:39:31.711Z] 		<engineID> provides a dedicated script engine ID. Use org.eclipse.ease.listEngines application.
09:39:31 [2022-02-01T14:39:31.711Z] 		<workspace location> is a file system path like 'C:\somefolder\myworkspace'
09:39:31 [2022-02-01T14:39:31.711Z] 			if you provide a workspace you can use workspace:// identifiers in your scripts
09:39:31 [2022-02-01T14:39:31.711Z] 			if you provide a workspace you may ask to refresh it first prior to script execution
09:39:31 [2022-02-01T14:39:31.711Z] 		<script parameters> will be passed to the script as String[] in the variable 'argv'
09:39:31 [2022-02-01T14:39:31.711Z] ERROR: invalid command line argument
09:39:31 [2022-02-01T14:39:31.711Z] 	engine ID is missing
09:39:31 [2022-02-01T14:39:31.711Z] 
09:39:31 [2022-02-01T14:39:31.711Z] SYNTAX: [-workspace <workspace location> [-refreshWorkspace]] [-engine <engineID>]-script <script name> <script parameters>
09:39:31 [2022-02-01T14:39:31.711Z] 
09:39:31 [2022-02-01T14:39:31.711Z] 		<script name> is a path like 'file://C/myfolder/myscript.js'
09:39:31 [2022-02-01T14:39:31.711Z] 		<engineID> provides a dedicated script engine ID. Use org.eclipse.ease.listEngines application.
09:39:31 [2022-02-01T14:39:31.711Z] 		<workspace location> is a file system path like 'C:\somefolder\myworkspace'
09:39:31 [2022-02-01T14:39:31.711Z] 			if you provide a workspace you can use workspace:// identifiers in your scripts
09:39:31 [2022-02-01T14:39:31.711Z] 			if you provide a workspace you may ask to refresh it first prior to script execution
09:39:31 [2022-02-01T14:39:31.711Z] 		<script parameters> will be passed to the script as String[] in the variable 'argv'
09:39:31 [2022-02-01T14:39:31.711Z] Tests run: 12, Failures: 0, Errors: 0, Skipped: 0, Time elapsed: 0.72 s - in org.eclipse.ease.applications.RunHeadlessScriptTest
09:39:31 [2022-02-01T14:39:31.711Z] start_error_when_script_throws  Time elapsed: 0.526 s
09:39:31 [2022-02-01T14:39:31.711Z] start_error_when_engine_ID_is_invalid  Time elapsed: 0.002 s
09:39:31 [2022-02-01T14:39:31.711Z] start_error_when_argument_is_unknown  Time elapsed: 0.001 s
09:39:31 [2022-02-01T14:39:31.711Z] start_error_when_script_location_is_missing  Time elapsed: 0.001 s
09:39:31 [2022-02-01T14:39:31.711Z] start_error_when_help_is_set  Time elapsed: 0.001 s
09:39:31 [2022-02-01T14:39:31.711Z] start_error_when_script_location_is_invalid  Time elapsed: 0.001 s
09:39:31 [2022-02-01T14:39:31.711Z] start_script  Time elapsed: 0 s
09:39:31 [2022-02-01T14:39:31.711Z] start_executes_script_with_return_value  Time elapsed: 0.079 s
09:39:31 [2022-02-01T14:39:31.711Z] start_executes_hello_world  Time elapsed: 0.071 s
09:39:31 [2022-02-01T14:39:31.711Z] start_error_when_workspace_location_is_missing  Time elapsed: 0.001 s
09:39:31 [2022-02-01T14:39:31.711Z] start_executes_script_arguments  Time elapsed: 0.032 s
09:39:31 [2022-02-01T14:39:31.711Z] start_error_when_engine_ID_is_missing  Time elapsed: 0.001 s
09:39:31 [2022-02-01T14:39:31.711Z] Running org.eclipse.ease.tools.RunnableWithResultTest
09:39:31 [2022-02-01T14:39:31.711Z] Tests run: 2, Failures: 0, Errors: 0, Skipped: 0, Time elapsed: 0.001 s - in org.eclipse.ease.tools.RunnableWithResultTest
09:39:31 [2022-02-01T14:39:31.711Z] testException  Time elapsed: 0 s
09:39:31 [2022-02-01T14:39:31.711Z] testResult  Time elapsed: 0 s
09:39:31 [2022-02-01T14:39:31.711Z] Running org.eclipse.ease.tools.StringToolsTest
09:39:31 [2022-02-01T14:39:31.711Z] Tests run: 8, Failures: 0, Errors: 0, Skipped: 0, Time elapsed: 0.006 s - in org.eclipse.ease.tools.StringToolsTest
09:39:31 [2022-02-01T14:39:31.711Z] parseArgumentsNull  Time elapsed: 0.001 s
09:39:31 [2022-02-01T14:39:31.711Z] parseArgumentsQuotedSingle  Time elapsed: 0 s
09:39:31 [2022-02-01T14:39:31.711Z] parseArgumentsEmpty  Time elapsed: 0.001 s
09:39:31 [2022-02-01T14:39:31.711Z] parseArgumentsMixedMultiple  Time elapsed: 0 s
09:39:31 [2022-02-01T14:39:31.711Z] parseArgumentsMixedMultipleLines  Time elapsed: 0.001 s
09:39:31 [2022-02-01T14:39:31.711Z] parseArgumentsNonQuotedMultiple  Time elapsed: 0 s
09:39:31 [2022-02-01T14:39:31.711Z] parseArgumentsNonQuotedSingle  Time elapsed: 0.001 s
09:39:31 [2022-02-01T14:39:31.711Z] parseArgumentsQuotedMultiple  Time elapsed: 0 s
09:39:31 [2022-02-01T14:39:31.711Z] Running org.eclipse.ease.tools.PlatformExtensionTest
09:39:31 [2022-02-01T14:39:31.711Z] Tests run: 8, Failures: 0, Errors: 0, Skipped: 0, Time elapsed: 0.005 s - in org.eclipse.ease.tools.PlatformExtensionTest
09:39:31 [2022-02-01T14:39:31.711Z] createFor_returns_non_empty_collection  Time elapsed: 0.001 s
09:39:31 [2022-02-01T14:39:31.712Z] getConfigurationElement_is_not_null  Time elapsed: 0 s
09:39:31 [2022-02-01T14:39:31.712Z] createInstance_returns_class_instance  Time elapsed: 0.001 s
09:39:31 [2022-02-01T14:39:31.712Z] createInstance_throws_for_invalid_type  Time elapsed: 0.001 s
09:39:31 [2022-02-01T14:39:31.712Z] createForName_returns_non_empty_collection  Time elapsed: 0 s
09:39:31 [2022-02-01T14:39:31.712Z] getAttribute_is_not_null_for_known_attribute  Time elapsed: 0 s
09:39:31 [2022-02-01T14:39:31.712Z] createFor_returns_empty_collection  Time elapsed: 0 s
09:39:31 [2022-02-01T14:39:31.712Z] getAttribute_is_null_for_unknown_attribute  Time elapsed: 0 s
09:39:31 [2022-02-01T14:39:31.712Z] Running org.eclipse.ease.tools.ResourceToolsTest
09:39:31 [2022-02-01T14:39:31.969Z] Tests run: 47, Failures: 0, Errors: 0, Skipped: 0, Time elapsed: 0.22 s - in org.eclipse.ease.tools.ResourceToolsTest
09:39:31 [2022-02-01T14:39:31.969Z] resolveScriptLocation  Time elapsed: 0.154 s
09:39:31 [2022-02-01T14:39:31.969Z] getWorkspaceInputStream  Time elapsed: 0.001 s
09:39:31 [2022-02-01T14:39:31.969Z] resolvePlatformURI  Time elapsed: 0 s
09:39:31 [2022-02-01T14:39:31.969Z] resolveScriptLocationWithSpacesInPath  Time elapsed: 0.004 s
09:39:31 [2022-02-01T14:39:31.969Z] resolveURL  Time elapsed: 0.001 s
09:39:31 [2022-02-01T14:39:31.969Z] invalidIsAbsolute  Time elapsed: 0.001 s
09:39:31 [2022-02-01T14:39:31.969Z] getFilesystemInputStream  Time elapsed: 0.001 s
09:39:31 [2022-02-01T14:39:31.969Z] toRelativeLocationInWorkspace  Time elapsed: 0 s
09:39:31 [2022-02-01T14:39:31.969Z] checkOperatingSystem  Time elapsed: 0.001 s
09:39:31 [2022-02-01T14:39:31.969Z] inputStreamToString  Time elapsed: 0 s
09:39:31 [2022-02-01T14:39:31.969Z] fileSystemToAbsoluteLocationOnLinux  Time elapsed: 0 s
09:39:31 [2022-02-01T14:39:31.969Z] exists  Time elapsed: 0 s
09:39:31 [2022-02-01T14:39:31.969Z] resolveRelativeInWorkspace  Time elapsed: 0.002 s
09:39:31 [2022-02-01T14:39:31.969Z] isFile  Time elapsed: 0 s
09:39:31 [2022-02-01T14:39:31.970Z] invalidToFile  Time elapsed: 0.001 s
09:39:31 [2022-02-01T14:39:31.970Z] resolveAbsoluteInFileSystem  Time elapsed: 0.001 s
09:39:31 [2022-02-01T14:39:31.970Z] resolveWindowsRoot  Time elapsed: 0 s
09:39:31 [2022-02-01T14:39:31.970Z] resolveRelativeInFileSystemOnWindows  Time elapsed: 0 s
09:39:31 [2022-02-01T14:39:31.970Z] isAbsoluteFileSystemPathOnWindows  Time elapsed: 0.001 s
09:39:31 [2022-02-01T14:39:31.970Z] readerToString  Time elapsed: 0 s
09:39:31 [2022-02-01T14:39:31.970Z] workspaceFileToString  Time elapsed: 0.001 s
09:39:31 [2022-02-01T14:39:31.970Z] toFile  Time elapsed: 0.001 s
09:39:31 [2022-02-01T14:39:31.970Z] toProjectRelativeLocation  Time elapsed: 0 s
09:39:31 [2022-02-01T14:39:31.970Z] getInvalidInputStream  Time elapsed: 0.003 s
09:39:31 [2022-02-01T14:39:31.970Z] resolveRelativeInFileSystemOnLinux  Time elapsed: 0 s
09:39:31 [2022-02-01T14:39:31.970Z] isFolder  Time elapsed: 0.001 s
09:39:31 [2022-02-01T14:39:31.970Z] fileSystemToAbsoluteLocationOnWindows  Time elapsed: 0 s
09:39:31 [2022-02-01T14:39:31.970Z] isAbsoluteWorkspacePath  Time elapsed: 0 s
09:39:31 [2022-02-01T14:39:31.970Z] isAbsoluteFileSystemPathOnLinux  Time elapsed: 0 s
09:39:31 [2022-02-01T14:39:31.970Z] resolveInvalid  Time elapsed: 0 s
09:39:31 [2022-02-01T14:39:31.970Z] resolveAbsoluteInFileSystemOnWindows  Time elapsed: 0.001 s
09:39:31 [2022-02-01T14:39:31.970Z] resolveScriptLocationWithSpacesInDomain  Time elapsed: 0 s
09:39:31 [2022-02-01T14:39:31.970Z] resolveRelativefromWorkspaceToFilesystem  Time elapsed: 0.001 s
09:39:31 [2022-02-01T14:39:31.970Z] resolveRelativeWithoutBaseFile  Time elapsed: 0 s
09:39:31 [2022-02-01T14:39:31.970Z] resolveInWorkspace  Time elapsed: 0 s
09:39:31 [2022-02-01T14:39:31.970Z] resolveScriptLocationWithSpecialCharactersInPath  Time elapsed: 0.001 s
09:39:31 [2022-02-01T14:39:31.970Z] filesystemFileToString  Time elapsed: 0.001 s
09:39:31 [2022-02-01T14:39:31.970Z] createURI  Time elapsed: 0.001 s
09:39:31 [2022-02-01T14:39:31.970Z] uriToAbsoluteLocation  Time elapsed: 0 s
09:39:31 [2022-02-01T14:39:31.970Z] createFolder  Time elapsed: 0.003 s
09:39:31 [2022-02-01T14:39:31.970Z] workspaceToAbsoluteLocation  Time elapsed: 0 s
09:39:31 [2022-02-01T14:39:31.970Z] resolveAbsoluteInFileSystemOnLinux  Time elapsed: 0.001 s
09:39:31 [2022-02-01T14:39:31.970Z] invalidToString  Time elapsed: 0 s
09:39:31 [2022-02-01T14:39:31.970Z] resolveRelativeURIs  Time elapsed: 0.001 s
09:39:31 [2022-02-01T14:39:31.970Z] resolveRelativeInFileSystem  Time elapsed: 0.001 s
09:39:31 [2022-02-01T14:39:31.970Z] resolveScriptLocationWithSpecialCharactersInDomain  Time elapsed: 0.004 s
09:39:31 [2022-02-01T14:39:31.970Z] isAbsoluteURL  Time elapsed: 0.001 s
09:39:31 [2022-02-01T14:39:31.970Z] Running org.eclipse.ease.AbstractCodeParserTest
09:39:31 [2022-02-01T14:39:31.970Z] Tests run: 5, Failures: 0, Errors: 0, Skipped: 0, Time elapsed: 0.022 s - in org.eclipse.ease.AbstractCodeParserTest
09:39:31 [2022-02-01T14:39:31.970Z] parseCode  Time elapsed: 0.018 s
09:39:31 [2022-02-01T14:39:31.970Z] parseLineHeader  Time elapsed: 0.001 s
09:39:31 [2022-02-01T14:39:31.970Z] parseBlockAfterWhitespace  Time elapsed: 0.001 s
09:39:31 [2022-02-01T14:39:31.970Z] parseEmpty  Time elapsed: 0 s
09:39:31 [2022-02-01T14:39:31.970Z] parseBlockHeader  Time elapsed: 0 s
09:39:31 [2022-02-01T14:39:31.970Z] Running org.eclipse.ease.AbstractCodeFactoryTest
09:39:31 [2022-02-01T14:39:31.970Z] Tests run: 1, Failures: 0, Errors: 0, Skipped: 0, Time elapsed: 0.054 s - in org.eclipse.ease.AbstractCodeFactoryTest
09:39:31 [2022-02-01T14:39:31.970Z] createNewKeywordHeader  Time elapsed: 0.054 s
09:39:31 [2022-02-01T14:39:31.970Z] Running org.eclipse.ease.ScriptResultTest
09:39:36 [2022-02-01T14:39:36.154Z] Tests run: 17, Failures: 0, Errors: 0, Skipped: 0, Time elapsed: 3.771 s - in org.eclipse.ease.ScriptResultTest
09:39:36 [2022-02-01T14:39:36.154Z] setResult_after_setException_throws  Time elapsed: 0.051 s
09:39:36 [2022-02-01T14:39:36.154Z] setResult_after_setResult_throws  Time elapsed: 0.001 s
09:39:36 [2022-02-01T14:39:36.154Z] isDone_true_when_exception_was_thrown  Time elapsed: 0 s
09:39:36 [2022-02-01T14:39:36.154Z] get_returns_ready_execution_result  Time elapsed: 0.001 s
09:39:36 [2022-02-01T14:39:36.154Z] get_waits_for_execution_result  Time elapsed: 0.551 s
09:39:36 [2022-02-01T14:39:36.154Z] get_with_timeout_waits_for_execution_result  Time elapsed: 0.551 s
09:39:36 [2022-02-01T14:39:36.154Z] get_throws_execution_exception  Time elapsed: 0 s
09:39:36 [2022-02-01T14:39:36.154Z] get_with_milliseconds_timeout_waits_for_execution_result  Time elapsed: 0.501 s
09:39:36 [2022-02-01T14:39:36.154Z] setException_after_setException_throws  Time elapsed: 0.001 s
09:39:36 [2022-02-01T14:39:36.154Z] isDone_false_on_new_ScriptResult  Time elapsed: 0 s
09:39:36 [2022-02-01T14:39:36.155Z] get_milliseconds_times_out  Time elapsed: 0.502 s
09:39:36 [2022-02-01T14:39:36.155Z] get_times_out  Time elapsed: 0.501 s
09:39:36 [2022-02-01T14:39:36.155Z] get_waits_for_execution_exception  Time elapsed: 0.552 s
09:39:36 [2022-02-01T14:39:36.155Z] setException_after_setResult_throws  Time elapsed: 0.001 s
09:39:36 [2022-02-01T14:39:36.155Z] isDone_true_when_result_is_null  Time elapsed: 0 s
09:39:36 [2022-02-01T14:39:36.155Z] isDone_true_when_result_is_ready  Time elapsed: 0 s
09:39:36 [2022-02-01T14:39:36.155Z] get_with_timeout_waits_for_execution_exception  Time elapsed: 0.552 s
09:39:36 [2022-02-01T14:39:36.155Z] Running org.eclipse.ease.ScriptTest
09:39:36 [2022-02-01T14:39:36.155Z] Tests run: 13, Failures: 0, Errors: 0, Skipped: 0, Time elapsed: 0.014 s - in org.eclipse.ease.ScriptTest
09:39:36 [2022-02-01T14:39:36.155Z] codeFromScriptable  Time elapsed: 0.007 s
09:39:36 [2022-02-01T14:39:36.155Z] codeFromFilesystemFile  Time elapsed: 0.001 s
09:39:36 [2022-02-01T14:39:36.155Z] getCodeStream  Time elapsed: 0 s
09:39:36 [2022-02-01T14:39:36.155Z] getFile  Time elapsed: 0.001 s
09:39:36 [2022-02-01T14:39:36.155Z] codeFromStringBuilder  Time elapsed: 0 s
09:39:36 [2022-02-01T14:39:36.155Z] getResult  Time elapsed: 0.001 s
09:39:36 [2022-02-01T14:39:36.155Z] getException  Time elapsed: 0.001 s
09:39:36 [2022-02-01T14:39:36.155Z] codeFromWorkspaceFile  Time elapsed: 0.001 s
09:39:36 [2022-02-01T14:39:36.155Z] codeFromInputStream  Time elapsed: 0 s
09:39:36 [2022-02-01T14:39:36.155Z] getTitle  Time elapsed: 0.001 s
09:39:36 [2022-02-01T14:39:36.155Z] getCommand  Time elapsed: 0 s
09:39:36 [2022-02-01T14:39:36.155Z] codeFromReader  Time elapsed: 0.001 s
09:39:36 [2022-02-01T14:39:36.155Z] codeFromString  Time elapsed: 0 s
09:39:36 [2022-02-01T14:39:36.155Z] Running org.eclipse.ease.adapters.ScriptableAdapterTest
09:39:36 [2022-02-01T14:39:36.155Z] Tests run: 5, Failures: 0, Errors: 0, Skipped: 0, Time elapsed: 0.012 s - in org.eclipse.ease.adapters.ScriptableAdapterTest
09:39:36 [2022-02-01T14:39:36.155Z] adaptURI  Time elapsed: 0.009 s
09:39:36 [2022-02-01T14:39:36.155Z] adaptURL  Time elapsed: 0.001 s
09:39:36 [2022-02-01T14:39:36.155Z] adaptWorkspaceFile  Time elapsed: 0 s
09:39:36 [2022-02-01T14:39:36.155Z] getAdapterList  Time elapsed: 0.001 s
09:39:36 [2022-02-01T14:39:36.155Z] adaptFilesystemFile  Time elapsed: 0 s
09:39:36 [2022-02-01T14:39:36.155Z] Running org.eclipse.ease.sign.SignatureHelperTest
09:39:36 [2022-02-01T14:39:36.155Z] Tests run: 1, Failures: 0, Errors: 0, Skipped: 0, Time elapsed: 0.015 s - in org.eclipse.ease.sign.SignatureHelperTest
09:39:36 [2022-02-01T14:39:36.155Z] certificateTest  Time elapsed: 0.015 s
09:39:36 [2022-02-01T14:39:36.155Z] Running org.eclipse.ease.sign.VerifySignatureTest
09:39:36 [2022-02-01T14:39:36.155Z] Tests run: 1, Failures: 0, Errors: 0, Skipped: 0, Time elapsed: 0.004 s - in org.eclipse.ease.sign.VerifySignatureTest
09:39:36 [2022-02-01T14:39:36.155Z] testWithNonCodeParserScriptType  Time elapsed: 0.003 s
09:39:36 [2022-02-01T14:39:36.155Z] Running org.eclipse.ease.AbstractScriptEngineTest
09:39:36 [2022-02-01T14:39:36.155Z] org.eclipse.ease.ScriptEngineException: Security check failed: org.eclipse.ease.AbstractScriptEngineTest$$Lambda$406/0x0000000800da3e28@565f4a81
09:39:36 [2022-02-01T14:39:36.155Z] 	at org.eclipse.ease.AbstractScriptEngine.inject(AbstractScriptEngine.java:180)
09:39:36 [2022-02-01T14:39:36.155Z] 	at org.eclipse.ease.AbstractScriptEngine.run(AbstractScriptEngine.java:243)
09:39:36 [2022-02-01T14:39:36.155Z] 	at org.eclipse.core.internal.jobs.Worker.run(Worker.java:63)
09:39:42 [2022-02-01T14:39:42.677Z] not startednot startedfoofoonot startedfoonot startedjava.lang.RuntimeException: ERROR
09:39:42 [2022-02-01T14:39:42.677Z] 	at org.eclipse.ease.AbstractScriptEngineTest$MockedScriptEngine.execute(AbstractScriptEngineTest.java:730)
09:39:42 [2022-02-01T14:39:42.677Z] 	at org.eclipse.ease.AbstractScriptEngine.inject(AbstractScriptEngine.java:190)
09:39:42 [2022-02-01T14:39:42.677Z] 	at org.eclipse.ease.AbstractScriptEngine.run(AbstractScriptEngine.java:243)
09:39:42 [2022-02-01T14:39:42.677Z] 	at org.eclipse.core.internal.jobs.Worker.run(Worker.java:63)
09:39:42 [2022-02-01T14:39:42.677Z] Tests run: 49, Failures: 0, Errors: 0, Skipped: 0, Time elapsed: 6.536 s - in org.eclipse.ease.AbstractScriptEngineTest
09:39:42 [2022-02-01T14:39:42.677Z] terminate_via_monitor_cancellation  Time elapsed: 0.203 s
09:39:42 [2022-02-01T14:39:42.677Z] addSecurityCheck_adds_failing_check  Time elapsed: 0.001 s
09:39:42 [2022-02-01T14:39:42.677Z] getMonitor_not_equals_null_for_running_engine  Time elapsed: 0 s
09:39:42 [2022-02-01T14:39:42.677Z] buffered_variables_are_injected_into_the_engine  Time elapsed: 0 s
09:39:42 [2022-02-01T14:39:42.677Z] getDescription_returns_engine_description  Time elapsed: 0 s
09:39:42 [2022-02-01T14:39:42.677Z] getLaunch_returns_previously_set_launch  Time elapsed: 0 s
09:39:42 [2022-02-01T14:39:42.677Z] setCloseStreamsOnTerminate_closes_streams  Time elapsed: 1.001 s
09:39:42 [2022-02-01T14:39:42.677Z] getDescription_returns_null_by_default  Time elapsed: 0 s
09:39:42 [2022-02-01T14:39:42.677Z] constructor_sets_job_name  Time elapsed: 0 s
09:39:42 [2022-02-01T14:39:42.677Z] inject_executes_code_in_the_middle_of_a_script  Time elapsed: 0 s
09:39:42 [2022-02-01T14:39:42.677Z] getVariable_returns_buffered_variable  Time elapsed: 0 s
09:39:42 [2022-02-01T14:39:42.677Z] setErrorStream_to_null_resets_error_stream  Time elapsed: 0 s
09:39:42 [2022-02-01T14:39:42.677Z] streams_are_not_closed_by_default_on_engine_termination  Time elapsed: 1.001 s
09:39:42 [2022-02-01T14:39:42.677Z] execute_valid_code_and_terminate  Time elapsed: 1.001 s
09:39:42 [2022-02-01T14:39:42.677Z] getMonitor_equals_null_for_terminated_engine  Time elapsed: 0.001 s
09:39:42 [2022-02-01T14:39:42.677Z] setInputStream_changes_input_stream  Time elapsed: 0 s
09:39:42 [2022-02-01T14:39:42.677Z] setOutputStream_to_null_resets_output_stream  Time elapsed: 0 s
09:39:42 [2022-02-01T14:39:42.677Z] getExecutedFile_returns_script_resource  Time elapsed: 0.001 s
09:39:42 [2022-02-01T14:39:42.677Z] isFinished_equals_true_for_finished_engine  Time elapsed: 0.001 s
09:39:42 [2022-02-01T14:39:42.677Z] terminate_stops_running_engine  Time elapsed: 1.202 s
09:39:42 [2022-02-01T14:39:42.677Z] isFinished_equals_false_for_not_started_engine  Time elapsed: 0 s
09:39:42 [2022-02-01T14:39:42.677Z] isJob  Time elapsed: 0.001 s
09:39:42 [2022-02-01T14:39:42.677Z] getVariables_returns_all_buffered_variables  Time elapsed: 0 s
09:39:42 [2022-02-01T14:39:42.677Z] getVariable_is_null_for_non_existing_variable  Time elapsed: 0 s
09:39:42 [2022-02-01T14:39:42.677Z] setInputStream_to_null_resets_input_stream  Time elapsed: 0.001 s
09:39:42 [2022-02-01T14:39:42.677Z] getInputStream_defaults_to_system_in  Time elapsed: 0 s
09:39:42 [2022-02-01T14:39:42.677Z] getOutputStream_defaults_to_system_in  Time elapsed: 0 s
09:39:42 [2022-02-01T14:39:42.677Z] getStackTrace_returns_stack_of_size_1_during_execution  Time elapsed: 0.001 s
09:39:42 [2022-02-01T14:39:42.677Z] setOutputStream_changes_output_stream  Time elapsed: 0 s
09:39:42 [2022-02-01T14:39:42.677Z] getLaunch_is_null_by_default  Time elapsed: 0.001 s
09:39:42 [2022-02-01T14:39:42.677Z] setErrorStream_changes_error_stream  Time elapsed: 0 s
09:39:42 [2022-02-01T14:39:42.677Z] getMonitor_equals_null_for_not_started_engine  Time elapsed: 0 s
09:39:42 [2022-02-01T14:39:42.678Z] terminate_does_nothing_for_non_launched_engine  Time elapsed: 0.001 s
09:39:42 [2022-02-01T14:39:42.678Z] removeExecutionListener_removes_an_engine_listener  Time elapsed: 0 s
09:39:42 [2022-02-01T14:39:42.678Z] getStackTrace_returns_empty_trace_for_terminated_engine  Time elapsed: 0.001 s
09:39:42 [2022-02-01T14:39:42.678Z] addExecutionListener_adds_an_engine_listener  Time elapsed: 0.001 s
09:39:42 [2022-02-01T14:39:42.678Z] getExecutedFile_returns_null_for_dynamic_code  Time elapsed: 0.001 s
09:39:42 [2022-02-01T14:39:42.678Z] execute_schedules_script  Time elapsed: 0 s
09:39:42 [2022-02-01T14:39:42.678Z] hasVariable_is_true_when_variable_is_set  Time elapsed: 0 s
09:39:42 [2022-02-01T14:39:42.678Z] addSecurityCheck_adds_passing_check  Time elapsed: 0.001 s
09:39:42 [2022-02-01T14:39:42.678Z] getStackTrace_returns_empty_trace_for_fresh_engine  Time elapsed: 0 s
09:39:42 [2022-02-01T14:39:42.678Z] joinEngine_waits_for_x_ms  Time elapsed: 1.051 s
09:39:42 [2022-02-01T14:39:42.678Z] hasVariable_is_false_when_no_variable_is_set  Time elapsed: 0 s
09:39:42 [2022-02-01T14:39:42.678Z] getErrorStream_defaults_to_system_err  Time elapsed: 0 s
09:39:42 [2022-02-01T14:39:42.678Z] execute_processes_script_when_engine_is_started  Time elapsed: 0.001 s
09:39:42 [2022-02-01T14:39:42.678Z] setCloseStreamsOnTerminate_keeps_streams_open  Time elapsed: 0.001 s
09:39:42 [2022-02-01T14:39:42.678Z] getExecutedFile_returns_execution_root_file  Time elapsed: 0.001 s
09:39:42 [2022-02-01T14:39:42.678Z] joinEngine_waits_for_engine_to_terminate  Time elapsed: 1.051 s
09:39:42 [2022-02-01T14:39:42.678Z] execute_errorous_code_and_terminate  Time elapsed: 0.001 s
09:39:42 [2022-02-01T14:39:42.678Z] 
09:39:42 [2022-02-01T14:39:42.678Z] Results:
09:39:42 [2022-02-01T14:39:42.678Z] 
09:39:42 [2022-02-01T14:39:42.678Z] Tests run: 294, Failures: 0, Errors: 0, Skipped: 0
09:39:42 [2022-02-01T14:39:42.678Z] 
09:39:42 [2022-02-01T14:39:42.936Z] Job found still running after platform shutdown.  Jobs should be canceled by the plugin that scheduled them during shutdown: org.eclipse.ease.AbstractReplScriptEngineTest$MockedScriptEngine
09:39:42 [2022-02-01T14:39:42.936Z] Job found still running after platform shutdown.  Jobs should be canceled by the plugin that scheduled them during shutdown: org.eclipse.ease.AbstractReplScriptEngineTest$MockedScriptEngine
09:39:42 [2022-02-01T14:39:42.936Z] Job found still running after platform shutdown.  Jobs should be canceled by the plugin that scheduled them during shutdown: org.eclipse.ease.AbstractReplScriptEngineTest$MockedScriptEngine
09:39:42 [2022-02-01T14:39:42.936Z] [INFO] All tests passed!
09:39:42 [2022-02-01T14:39:42.936Z] [INFO] 
09:39:42 [2022-02-01T14:39:42.936Z] [INFO] ----< org.eclipse.ease:org.eclipse.ease.lang.javascript.rhino.test >----
09:39:42 [2022-02-01T14:39:42.936Z] [INFO] Building org.eclipse.ease.lang.javascript.rhino.test 0.9.0-SNAPSHOT [4/9]
09:39:42 [2022-02-01T14:39:42.936Z] [INFO] ------------------------[ eclipse-test-plugin ]-------------------------
09:39:42 [2022-02-01T14:39:42.936Z] [INFO] 
09:39:42 [2022-02-01T14:39:42.937Z] [INFO] --- tycho-packaging-plugin:2.2.0:build-qualifier (default-build-qualifier) @ org.eclipse.ease.lang.javascript.rhino.test ---
09:39:42 [2022-02-01T14:39:42.937Z] [INFO] The project's OSGi version is 0.9.0.I202106220815
09:39:42 [2022-02-01T14:39:42.937Z] [INFO] 
09:39:42 [2022-02-01T14:39:42.937Z] [INFO] --- tycho-packaging-plugin:2.2.0:validate-id (default-validate-id) @ org.eclipse.ease.lang.javascript.rhino.test ---
09:39:42 [2022-02-01T14:39:42.937Z] [INFO] 
09:39:42 [2022-02-01T14:39:42.937Z] [INFO] --- tycho-packaging-plugin:2.2.0:validate-version (default-validate-version) @ org.eclipse.ease.lang.javascript.rhino.test ---
09:39:42 [2022-02-01T14:39:42.937Z] [INFO] 
09:39:42 [2022-02-01T14:39:42.937Z] [INFO] --- maven-resources-plugin:2.4.3:resources (default-resources) @ org.eclipse.ease.lang.javascript.rhino.test ---
09:39:42 [2022-02-01T14:39:42.937Z] [INFO] Using 'UTF-8' encoding to copy filtered resources.
09:39:42 [2022-02-01T14:39:42.937Z] [INFO] skip non existing resourceDirectory /home/jenkins/agent/workspace/ease.verify.core.target.2019-06/tests/org.eclipse.ease.lang.javascript.rhino.test/src/main/resources
09:39:42 [2022-02-01T14:39:42.937Z] [INFO] 
09:39:42 [2022-02-01T14:39:42.937Z] [INFO] --- tycho-compiler-plugin:2.2.0:compile (default-compile) @ org.eclipse.ease.lang.javascript.rhino.test ---
09:39:42 [2022-02-01T14:39:42.937Z] [INFO] Nothing to compile - all classes are up to date
09:39:42 [2022-02-01T14:39:42.937Z] [INFO] 
09:39:42 [2022-02-01T14:39:42.937Z] [INFO] --- maven-resources-plugin:2.4.3:testResources (default-testResources) @ org.eclipse.ease.lang.javascript.rhino.test ---
09:39:42 [2022-02-01T14:39:42.937Z] [INFO] Using 'UTF-8' encoding to copy filtered resources.
09:39:42 [2022-02-01T14:39:42.937Z] [INFO] skip non existing resourceDirectory /home/jenkins/agent/workspace/ease.verify.core.target.2019-06/tests/org.eclipse.ease.lang.javascript.rhino.test/src/test/resources
09:39:42 [2022-02-01T14:39:42.937Z] [INFO] 
09:39:42 [2022-02-01T14:39:42.937Z] [INFO] --- target-platform-configuration:2.2.0:target-platform (default-target-platform) @ org.eclipse.ease.lang.javascript.rhino.test ---
09:39:42 [2022-02-01T14:39:42.937Z] [INFO] 
09:39:42 [2022-02-01T14:39:42.937Z] [INFO] --- tycho-packaging-plugin:2.2.0:package-plugin (default-package-plugin) @ org.eclipse.ease.lang.javascript.rhino.test ---
09:39:42 [2022-02-01T14:39:42.937Z] [INFO] Building jar: /home/jenkins/agent/workspace/ease.verify.core.target.2019-06/tests/org.eclipse.ease.lang.javascript.rhino.test/target/org.eclipse.ease.lang.javascript.rhino.test-0.9.0-SNAPSHOT.jar
09:39:42 [2022-02-01T14:39:42.937Z] [INFO] 
09:39:42 [2022-02-01T14:39:42.937Z] [INFO] --- tycho-p2-plugin:2.2.0:p2-metadata-default (default-p2-metadata-default) @ org.eclipse.ease.lang.javascript.rhino.test ---
09:39:42 [2022-02-01T14:39:42.937Z] [INFO] 
09:39:42 [2022-02-01T14:39:42.937Z] [INFO] --- jacoco-maven-plugin:0.8.6:prepare-agent (jacoco-initialize) @ org.eclipse.ease.lang.javascript.rhino.test ---
09:39:42 [2022-02-01T14:39:42.937Z] [INFO] tycho.testArgLine set to -javaagent:/home/jenkins/.m2/repository/org/jacoco/org.jacoco.agent/0.8.6/org.jacoco.agent-0.8.6-runtime.jar=destfile=/home/jenkins/agent/workspace/ease.verify.core.target.2019-06/tests/org.eclipse.ease.lang.javascript.rhino.test/target/jacoco.exec,output=file
09:39:42 [2022-02-01T14:39:42.937Z] [INFO] 
09:39:42 [2022-02-01T14:39:42.937Z] [INFO] --- tycho-surefire-plugin:2.2.0:test (default-test) @ org.eclipse.ease.lang.javascript.rhino.test ---
09:39:43 [2022-02-01T14:39:43.233Z] [INFO] Executing Test Runtime with timeout 0, logs (if any) will be placed at: /home/jenkins/agent/workspace/ease.verify.core.target.2019-06/tests/org.eclipse.ease.lang.javascript.rhino.test/target/work/data/.metadata/.log
09:39:43 [2022-02-01T14:39:43.233Z] [INFO] Command line:
09:39:43 [2022-02-01T14:39:43.233Z] 	[/opt/tools/java/openjdk/jdk-15/15.0.2+7/bin/java, -Dosgi.noShutdown=false, -Dosgi.os=linux, -Dosgi.ws=gtk, -Dosgi.arch=x86_64, -javaagent:/home/jenkins/.m2/repository/org/jacoco/org.jacoco.agent/0.8.6/org.jacoco.agent-0.8.6-runtime.jar=destfile=/home/jenkins/agent/workspace/ease.verify.core.target.2019-06/tests/org.eclipse.ease.lang.javascript.rhino.test/target/jacoco.exec,output=file, -Dosgi.clean=true, -jar, /home/jenkins/.m2/repository/p2/osgi/bundle/org.eclipse.equinox.launcher/1.5.400.v20190515-0925/org.eclipse.equinox.launcher-1.5.400.v20190515-0925.jar, -data, /home/jenkins/agent/workspace/ease.verify.core.target.2019-06/tests/org.eclipse.ease.lang.javascript.rhino.test/target/work/data, -install, /home/jenkins/agent/workspace/ease.verify.core.target.2019-06/tests/org.eclipse.ease.lang.javascript.rhino.test/target/work, -configuration, /home/jenkins/agent/workspace/ease.verify.core.target.2019-06/tests/org.eclipse.ease.lang.javascript.rhino.test/target/work/configuration, -application, org.eclipse.tycho.surefire.osgibooter.headlesstest, -testproperties, /home/jenkins/agent/workspace/ease.verify.core.target.2019-06/tests/org.eclipse.ease.lang.javascript.rhino.test/target/surefire.properties]
09:39:43 [2022-02-01T14:39:43.234Z] Picked up JAVA_TOOL_OPTIONS: -Dmaven.ext.class.path="/home/jenkins/agent/workspace/ease.verify.core.target.2019-06@tmp/withMaven348621a9/pipeline-maven-spy.jar" -Dorg.jenkinsci.plugins.pipeline.maven.reportsFolder="/home/jenkins/agent/workspace/ease.verify.core.target.2019-06@tmp/withMaven348621a9" 
09:39:47 [2022-02-01T14:39:47.446Z] Running org.eclipse.ease.lang.javascript.rhino.RhinoScriptEngineTest
09:39:48 [2022-02-01T14:39:48.033Z] org.eclipse.ease.ScriptExecutionException: JavaError: java.lang.Exception
09:39:48 [2022-02-01T14:39:48.034Z] 	at <unknown source>
09:39:48 [2022-02-01T14:39:48.034Z] 
09:39:48 [2022-02-01T14:39:48.034Z] Java Stacktrace:
09:39:48 [2022-02-01T14:39:48.034Z] java.lang.Exception
09:39:48 [2022-02-01T14:39:48.034Z] 	at java.base/jdk.internal.reflect.NativeConstructorAccessorImpl.newInstance0(Native Method)
09:39:48 [2022-02-01T14:39:48.034Z] 	at java.base/jdk.internal.reflect.NativeConstructorAccessorImpl.newInstance(NativeConstructorAccessorImpl.java:64)
09:39:48 [2022-02-01T14:39:48.034Z] 	at java.base/jdk.internal.reflect.DelegatingConstructorAccessorImpl.newInstance(DelegatingConstructorAccessorImpl.java:45)
09:39:48 [2022-02-01T14:39:48.034Z] 	at java.base/java.lang.reflect.Constructor.newInstanceWithCaller(Constructor.java:500)
09:39:48 [2022-02-01T14:39:48.034Z] 	at java.base/java.lang.reflect.Constructor.newInstance(Constructor.java:481)
09:39:48 [2022-02-01T14:39:48.034Z] 	at org.mozilla.javascript.MemberBox.newInstance(MemberBox.java:159)
09:39:48 [2022-02-01T14:39:48.034Z] 	at org.mozilla.javascript.NativeJavaClass.constructInternal(NativeJavaClass.java:266)
09:39:48 [2022-02-01T14:39:48.034Z] 	at org.mozilla.javascript.NativeJavaClass.constructSpecific(NativeJavaClass.java:205)
09:39:48 [2022-02-01T14:39:48.034Z] 	at org.mozilla.javascript.NativeJavaClass.construct(NativeJavaClass.java:166)
09:39:48 [2022-02-01T14:39:48.034Z] 	at org.mozilla.javascript.ScriptRuntime.newObject(ScriptRuntime.java:2655)
09:39:48 [2022-02-01T14:39:48.034Z] 	at org.mozilla.javascript.gen.c_9._c_script_0(Unknown Source)
09:39:48 [2022-02-01T14:39:48.034Z] 	at org.mozilla.javascript.gen.c_9.call(Unknown Source)
09:39:48 [2022-02-01T14:39:48.034Z] 	at org.mozilla.javascript.ContextFactory.doTopCall(ContextFactory.java:405)
09:39:48 [2022-02-01T14:39:48.034Z] 	at org.mozilla.javascript.ScriptRuntime.doTopCall(ScriptRuntime.java:3508)
09:39:48 [2022-02-01T14:39:48.034Z] 	at org.mozilla.javascript.gen.c_9.call(Unknown Source)
09:39:48 [2022-02-01T14:39:48.034Z] 	at org.mozilla.javascript.gen.c_9.exec(Unknown Source)
09:39:48 [2022-02-01T14:39:48.034Z] 	at org.mozilla.javascript.Context.evaluateReader(Context.java:1293)
09:39:48 [2022-02-01T14:39:48.034Z] 	at org.eclipse.ease.lang.javascript.rhino.RhinoScriptEngine.internalExecute(RhinoScriptEngine.java:226)
09:39:48 [2022-02-01T14:39:48.034Z] 	at org.eclipse.ease.lang.javascript.rhino.RhinoScriptEngine.execute(RhinoScriptEngine.java:205)
09:39:48 [2022-02-01T14:39:48.034Z] 	at org.eclipse.ease.AbstractScriptEngine.inject(AbstractScriptEngine.java:190)
09:39:48 [2022-02-01T14:39:48.034Z] 	at org.eclipse.ease.AbstractScriptEngine.run(AbstractScriptEngine.java:243)
09:39:48 [2022-02-01T14:39:48.034Z] 	at org.eclipse.core.internal.jobs.Worker.run(Worker.java:63)
09:39:48 [2022-02-01T14:39:48.034Z] org.eclipse.ease.ScriptExecutionException: ScriptException: test
09:39:48 [2022-02-01T14:39:48.034Z] 	at <unknown source>
09:39:48 [2022-02-01T14:39:48.034Z] org.eclipse.ease.ScriptExecutionException: ScriptException: JavaScript
09:39:48 [2022-02-01T14:39:48.034Z] 	at <unknown source>
09:39:48 [2022-02-01T14:39:48.034Z] org.eclipse.ease.ScriptExecutionException: SyntaxError: unterminated string literal (#1)
09:39:48 [2022-02-01T14:39:48.034Z] 'asdf
09:39:48 [2022-02-01T14:39:48.034Z]     ^
09:39:48 [2022-02-01T14:39:48.034Z] 	at <unknown source>
09:39:48 [2022-02-01T14:39:48.292Z] org.eclipse.ease.ScriptExecutionException: TypeError: Cannot call method "foobar" of undefined
09:39:48 [2022-02-01T14:39:48.292Z] 	at <unknown source>
09:39:48 [2022-02-01T14:39:48.292Z] org.eclipse.ease.ScriptExecutionException: JavaError: NotThere cannot be found by org.mozilla.javascript_1.7.10.v20190430-1943
09:39:48 [2022-02-01T14:39:48.292Z] 	at <unknown source>
09:39:48 [2022-02-01T14:39:48.292Z] 
09:39:48 [2022-02-01T14:39:48.292Z] Java Stacktrace:
09:39:48 [2022-02-01T14:39:48.292Z] java.lang.ClassNotFoundException: NotThere cannot be found by org.mozilla.javascript_1.7.10.v20190430-1943
09:39:48 [2022-02-01T14:39:48.292Z] 	at org.eclipse.osgi.internal.loader.BundleLoader.findClassInternal(BundleLoader.java:512)
09:39:48 [2022-02-01T14:39:48.292Z] 	at org.eclipse.osgi.internal.loader.BundleLoader.findClass(BundleLoader.java:423)
09:39:48 [2022-02-01T14:39:48.292Z] 	at org.eclipse.osgi.internal.loader.BundleLoader.findClass(BundleLoader.java:415)
09:39:48 [2022-02-01T14:39:48.292Z] 	at org.eclipse.osgi.internal.loader.ModuleClassLoader.loadClass(ModuleClassLoader.java:155)
09:39:48 [2022-02-01T14:39:48.292Z] 	at java.base/java.lang.ClassLoader.loadClass(ClassLoader.java:522)
09:39:48 [2022-02-01T14:39:48.292Z] 	at java.base/java.lang.Class.forName0(Native Method)
09:39:48 [2022-02-01T14:39:48.292Z] 	at java.base/java.lang.Class.forName(Class.java:377)
09:39:48 [2022-02-01T14:39:48.293Z] 	at java.base/jdk.internal.reflect.NativeMethodAccessorImpl.invoke0(Native Method)
09:39:48 [2022-02-01T14:39:48.293Z] 	at java.base/jdk.internal.reflect.NativeMethodAccessorImpl.invoke(NativeMethodAccessorImpl.java:64)
09:39:48 [2022-02-01T14:39:48.293Z] 	at java.base/jdk.internal.reflect.DelegatingMethodAccessorImpl.invoke(DelegatingMethodAccessorImpl.java:43)
09:39:48 [2022-02-01T14:39:48.293Z] 	at java.base/java.lang.reflect.Method.invoke(Method.java:564)
09:39:48 [2022-02-01T14:39:48.293Z] 	at org.mozilla.javascript.MemberBox.invoke(MemberBox.java:126)
09:39:48 [2022-02-01T14:39:48.293Z] 	at org.mozilla.javascript.NativeJavaMethod.call(NativeJavaMethod.java:225)
09:39:48 [2022-02-01T14:39:48.293Z] 	at org.mozilla.javascript.optimizer.OptRuntime.call1(OptRuntime.java:32)
09:39:48 [2022-02-01T14:39:48.293Z] 	at org.mozilla.javascript.gen.c_32._c_script_0(Unknown Source)
09:39:48 [2022-02-01T14:39:48.293Z] 	at org.mozilla.javascript.gen.c_32.call(Unknown Source)
09:39:48 [2022-02-01T14:39:48.293Z] 	at org.mozilla.javascript.ContextFactory.doTopCall(ContextFactory.java:405)
09:39:48 [2022-02-01T14:39:48.293Z] 	at org.mozilla.javascript.ScriptRuntime.doTopCall(ScriptRuntime.java:3508)
09:39:48 [2022-02-01T14:39:48.293Z] 	at org.mozilla.javascript.gen.c_32.call(Unknown Source)
09:39:48 [2022-02-01T14:39:48.293Z] 	at org.mozilla.javascript.gen.c_32.exec(Unknown Source)
09:39:48 [2022-02-01T14:39:48.293Z] 	at org.mozilla.javascript.Context.evaluateReader(Context.java:1293)
09:39:48 [2022-02-01T14:39:48.293Z] 	at org.eclipse.ease.lang.javascript.rhino.RhinoScriptEngine.internalExecute(RhinoScriptEngine.java:226)
09:39:48 [2022-02-01T14:39:48.293Z] 	at org.eclipse.ease.lang.javascript.rhino.RhinoScriptEngine.execute(RhinoScriptEngine.java:205)
09:39:48 [2022-02-01T14:39:48.293Z] 	at org.eclipse.ease.AbstractScriptEngine.inject(AbstractScriptEngine.java:190)
09:39:48 [2022-02-01T14:39:48.293Z] 	at org.eclipse.ease.AbstractScriptEngine.run(AbstractScriptEngine.java:243)
09:39:48 [2022-02-01T14:39:48.293Z] 	at org.eclipse.core.internal.jobs.Worker.run(Worker.java:63)
09:39:48 [2022-02-01T14:39:48.293Z] Tests run: 11, Failures: 0, Errors: 0, Skipped: 0, Time elapsed: 0.979 s - in org.eclipse.ease.lang.javascript.rhino.RhinoScriptEngineTest
09:39:48 [2022-02-01T14:39:48.293Z] execute_java_class_instantiation  Time elapsed: 0.469 s
09:39:48 [2022-02-01T14:39:48.293Z] execute_environment_module_code_with_optional_parameters  Time elapsed: 0.041 s
09:39:48 [2022-02-01T14:39:48.293Z] execute_throws_java_exception  Time elapsed: 0.078 s
09:39:48 [2022-02-01T14:39:48.293Z] execute_throws_java_class  Time elapsed: 0.027 s
09:39:48 [2022-02-01T14:39:48.293Z] execute_javascript_assignment  Time elapsed: 0.073 s
09:39:48 [2022-02-01T14:39:48.293Z] execute_eclipse_class_instantiation  Time elapsed: 0.026 s
09:39:48 [2022-02-01T14:39:48.293Z] execute_throws_javascript_object  Time elapsed: 0.066 s
09:39:48 [2022-02-01T14:39:48.293Z] execute_throws_syntax_error  Time elapsed: 0.03 s
09:39:48 [2022-02-01T14:39:48.293Z] execute_throws_javascript_runtime_error  Time elapsed: 0.053 s
09:39:48 [2022-02-01T14:39:48.293Z] execute_environment_module_code  Time elapsed: 0.023 s
09:39:48 [2022-02-01T14:39:48.293Z] execute_throws_wrapped_java_exception  Time elapsed: 0.069 s
09:39:48 [2022-02-01T14:39:48.293Z] Running org.eclipse.ease.lang.javascript.rhino.RhinoEnvironmentTest
09:39:49 [2022-02-01T14:39:49.251Z] Tests run: 5, Failures: 0, Errors: 0, Skipped: 0, Time elapsed: 0.884 s - in org.eclipse.ease.lang.javascript.rhino.RhinoEnvironmentTest
09:39:49 [2022-02-01T14:39:49.251Z] reloadEnvironment  Time elapsed: 0.073 s
09:39:49 [2022-02-01T14:39:49.251Z] bootstrappedEnvironment  Time elapsed: 0.027 s
09:39:49 [2022-02-01T14:39:49.251Z] postMethodCallback  Time elapsed: 0.626 s
09:39:49 [2022-02-01T14:39:49.251Z] preMethodCallback  Time elapsed: 0.07 s
09:39:49 [2022-02-01T14:39:49.251Z] reloadFunctionDefinitions  Time elapsed: 0.087 s
09:39:49 [2022-02-01T14:39:49.251Z] Running org.eclipse.ease.lang.javascript.rhino.RhinoDebuggerEngineTest
09:39:49 [2022-02-01T14:39:49.535Z] org.eclipse.ease.ScriptExecutionException: JavaError: java.lang.Exception
09:39:49 [2022-02-01T14:39:49.535Z] 
09:39:49 [2022-02-01T14:39:49.535Z] Java Stacktrace:
09:39:49 [2022-02-01T14:39:49.535Z] java.lang.Exception
09:39:49 [2022-02-01T14:39:49.535Z] 	at java.base/jdk.internal.reflect.NativeConstructorAccessorImpl.newInstance0(Native Method)
09:39:49 [2022-02-01T14:39:49.535Z] 	at java.base/jdk.internal.reflect.NativeConstructorAccessorImpl.newInstance(NativeConstructorAccessorImpl.java:64)
09:39:49 [2022-02-01T14:39:49.535Z] 	at java.base/jdk.internal.reflect.DelegatingConstructorAccessorImpl.newInstance(DelegatingConstructorAccessorImpl.java:45)
09:39:49 [2022-02-01T14:39:49.535Z] 	at java.base/java.lang.reflect.Constructor.newInstanceWithCaller(Constructor.java:500)
09:39:49 [2022-02-01T14:39:49.535Z] 	at java.base/java.lang.reflect.Constructor.newInstance(Constructor.java:481)
09:39:49 [2022-02-01T14:39:49.535Z] 	at org.mozilla.javascript.MemberBox.newInstance(MemberBox.java:159)
09:39:49 [2022-02-01T14:39:49.535Z] 	at org.mozilla.javascript.NativeJavaClass.constructInternal(NativeJavaClass.java:266)
09:39:49 [2022-02-01T14:39:49.535Z] 	at org.mozilla.javascript.NativeJavaClass.constructSpecific(NativeJavaClass.java:205)
09:39:49 [2022-02-01T14:39:49.535Z] 	at org.mozilla.javascript.NativeJavaClass.construct(NativeJavaClass.java:166)
09:39:49 [2022-02-01T14:39:49.535Z] 	at org.mozilla.javascript.Interpreter.interpretLoop(Interpreter.java:1617)
09:39:49 [2022-02-01T14:39:49.535Z] 	at org.mozilla.javascript.Interpreter.interpret(Interpreter.java:911)
09:39:49 [2022-02-01T14:39:49.535Z] 	at org.mozilla.javascript.InterpretedFunction.call(InterpretedFunction.java:109)
09:39:49 [2022-02-01T14:39:49.535Z] 	at org.mozilla.javascript.ContextFactory.doTopCall(ContextFactory.java:405)
09:39:49 [2022-02-01T14:39:49.535Z] 	at org.mozilla.javascript.ScriptRuntime.doTopCall(ScriptRuntime.java:3508)
09:39:49 [2022-02-01T14:39:49.535Z] 	at org.mozilla.javascript.InterpretedFunction.exec(InterpretedFunction.java:120)
09:39:49 [2022-02-01T14:39:49.535Z] 	at org.mozilla.javascript.Context.evaluateReader(Context.java:1293)
09:39:49 [2022-02-01T14:39:49.535Z] 	at org.eclipse.ease.lang.javascript.rhino.RhinoScriptEngine.internalExecute(RhinoScriptEngine.java:226)
09:39:49 [2022-02-01T14:39:49.535Z] 	at org.eclipse.ease.lang.javascript.rhino.RhinoScriptEngine.execute(RhinoScriptEngine.java:205)
09:39:49 [2022-02-01T14:39:49.535Z] 	at org.eclipse.ease.AbstractScriptEngine.inject(AbstractScriptEngine.java:190)
09:39:49 [2022-02-01T14:39:49.535Z] 	at org.eclipse.ease.AbstractScriptEngine.run(AbstractScriptEngine.java:243)
09:39:49 [2022-02-01T14:39:49.535Z] 	at org.eclipse.core.internal.jobs.Worker.run(Worker.java:63)
09:39:49 [2022-02-01T14:39:49.535Z] org.eclipse.ease.ScriptExecutionException: ScriptException: test
09:39:49 [2022-02-01T14:39:49.535Z] org.eclipse.ease.ScriptExecutionException: ScriptException: JavaScript
09:39:49 [2022-02-01T14:39:49.535Z] org.eclipse.ease.ScriptExecutionException: SyntaxError: unterminated string literal (#1)
09:39:49 [2022-02-01T14:39:49.535Z] 'asdf
09:39:49 [2022-02-01T14:39:49.535Z]     ^
09:39:49 [2022-02-01T14:39:49.535Z] 	at <unknown source>:1
09:39:49 [2022-02-01T14:39:49.535Z] org.eclipse.ease.ScriptExecutionException: TypeError: Cannot call method "foobar" of undefined
09:39:49 [2022-02-01T14:39:49.793Z] org.eclipse.ease.ScriptExecutionException: JavaError: NotThere cannot be found by org.mozilla.javascript_1.7.10.v20190430-1943
09:39:49 [2022-02-01T14:39:49.794Z] 
09:39:49 [2022-02-01T14:39:49.794Z] Java Stacktrace:
09:39:49 [2022-02-01T14:39:49.794Z] java.lang.ClassNotFoundException: NotThere cannot be found by org.mozilla.javascript_1.7.10.v20190430-1943
09:39:49 [2022-02-01T14:39:49.794Z] 	at org.eclipse.osgi.internal.loader.BundleLoader.findClassInternal(BundleLoader.java:512)
09:39:49 [2022-02-01T14:39:49.794Z] 	at org.eclipse.osgi.internal.loader.BundleLoader.findClass(BundleLoader.java:423)
09:39:49 [2022-02-01T14:39:49.794Z] 	at org.eclipse.osgi.internal.loader.BundleLoader.findClass(BundleLoader.java:415)
09:39:49 [2022-02-01T14:39:49.794Z] 	at org.eclipse.osgi.internal.loader.ModuleClassLoader.loadClass(ModuleClassLoader.java:155)
09:39:49 [2022-02-01T14:39:49.794Z] 	at java.base/java.lang.ClassLoader.loadClass(ClassLoader.java:522)
09:39:49 [2022-02-01T14:39:49.794Z] 	at java.base/java.lang.Class.forName0(Native Method)
09:39:49 [2022-02-01T14:39:49.794Z] 	at java.base/java.lang.Class.forName(Class.java:377)
09:39:49 [2022-02-01T14:39:49.794Z] 	at java.base/jdk.internal.reflect.NativeMethodAccessorImpl.invoke0(Native Method)
09:39:49 [2022-02-01T14:39:49.794Z] 	at java.base/jdk.internal.reflect.NativeMethodAccessorImpl.invoke(NativeMethodAccessorImpl.java:64)
09:39:49 [2022-02-01T14:39:49.794Z] 	at java.base/jdk.internal.reflect.DelegatingMethodAccessorImpl.invoke(DelegatingMethodAccessorImpl.java:43)
09:39:49 [2022-02-01T14:39:49.794Z] 	at java.base/java.lang.reflect.Method.invoke(Method.java:564)
09:39:49 [2022-02-01T14:39:49.794Z] 	at org.mozilla.javascript.MemberBox.invoke(MemberBox.java:126)
09:39:49 [2022-02-01T14:39:49.794Z] 	at org.mozilla.javascript.NativeJavaMethod.call(NativeJavaMethod.java:225)
09:39:49 [2022-02-01T14:39:49.794Z] 	at org.mozilla.javascript.Interpreter.interpretLoop(Interpreter.java:1573)
09:39:49 [2022-02-01T14:39:49.794Z] 	at org.mozilla.javascript.Interpreter.interpret(Interpreter.java:911)
09:39:49 [2022-02-01T14:39:49.794Z] 	at org.mozilla.javascript.InterpretedFunction.call(InterpretedFunction.java:109)
09:39:49 [2022-02-01T14:39:49.794Z] 	at org.mozilla.javascript.ContextFactory.doTopCall(ContextFactory.java:405)
09:39:49 [2022-02-01T14:39:49.794Z] 	at org.mozilla.javascript.ScriptRuntime.doTopCall(ScriptRuntime.java:3508)
09:39:49 [2022-02-01T14:39:49.794Z] 	at org.mozilla.javascript.InterpretedFunction.exec(InterpretedFunction.java:120)
09:39:49 [2022-02-01T14:39:49.794Z] 	at org.mozilla.javascript.Context.evaluateReader(Context.java:1293)
09:39:49 [2022-02-01T14:39:49.794Z] 	at org.eclipse.ease.lang.javascript.rhino.RhinoScriptEngine.internalExecute(RhinoScriptEngine.java:226)
09:39:49 [2022-02-01T14:39:49.794Z] 	at org.eclipse.ease.lang.javascript.rhino.RhinoScriptEngine.execute(RhinoScriptEngine.java:205)
09:39:49 [2022-02-01T14:39:49.794Z] 	at org.eclipse.ease.AbstractScriptEngine.inject(AbstractScriptEngine.java:190)
09:39:49 [2022-02-01T14:39:49.794Z] 	at org.eclipse.ease.AbstractScriptEngine.run(AbstractScriptEngine.java:243)
09:39:49 [2022-02-01T14:39:49.794Z] 	at org.eclipse.core.internal.jobs.Worker.run(Worker.java:63)
09:39:49 [2022-02-01T14:39:49.794Z] org.eclipse.ease.ScriptExecutionException: TypeError: Cannot call method "substr" of null
09:39:49 [2022-02-01T14:39:49.794Z] 	at mainFile.js,throwOnNull():4
09:39:49 [2022-02-01T14:39:49.794Z] 	at includeFile.js,subCall():2
09:39:49 [2022-02-01T14:39:49.794Z] 	at mainFile.js:7
09:39:49 [2022-02-01T14:39:49.794Z] Tests run: 12, Failures: 0, Errors: 0, Skipped: 0, Time elapsed: 0.526 s - in org.eclipse.ease.lang.javascript.rhino.RhinoDebuggerEngineTest
09:39:49 [2022-02-01T14:39:49.794Z] execute_java_class_instantiation  Time elapsed: 0.148 s
09:39:49 [2022-02-01T14:39:49.794Z] execute_environment_module_code_with_optional_parameters  Time elapsed: 0.042 s
09:39:49 [2022-02-01T14:39:49.794Z] execute_throws_java_exception  Time elapsed: 0.023 s
09:39:49 [2022-02-01T14:39:49.794Z] execute_throws_java_class  Time elapsed: 0.068 s
09:39:49 [2022-02-01T14:39:49.794Z] execute_javascript_assignment  Time elapsed: 0.016 s
09:39:49 [2022-02-01T14:39:49.794Z] execute_eclipse_class_instantiation  Time elapsed: 0.018 s
09:39:49 [2022-02-01T14:39:49.794Z] execute_throws_javascript_object  Time elapsed: 0.023 s
09:39:49 [2022-02-01T14:39:49.794Z] execute_throws_syntax_error  Time elapsed: 0.05 s
09:39:49 [2022-02-01T14:39:49.794Z] execute_throws_javascript_runtime_error  Time elapsed: 0.02 s
09:39:49 [2022-02-01T14:39:49.794Z] execute_environment_module_code  Time elapsed: 0.021 s
09:39:49 [2022-02-01T14:39:49.794Z] execute_throws_wrapped_java_exception  Time elapsed: 0.06 s
09:39:49 [2022-02-01T14:39:49.794Z] getExceptionStackTrace_returns_script_trace_over_multiple_files  Time elapsed: 0.033 s
09:39:49 [2022-02-01T14:39:49.794Z] Running org.eclipse.ease.lang.javascript.rhino.RhinoDebugTest
09:39:50 [2022-02-01T14:39:50.052Z] Start of script
09:39:50 [2022-02-01T14:39:50.052Z] include file start
09:39:50 [2022-02-01T14:39:50.052Z] Include file processed
09:39:50 [2022-02-01T14:39:50.052Z] line after include file
09:39:50 [2022-02-01T14:39:50.052Z] Result of testMethod = 5
09:39:50 [2022-02-01T14:39:50.052Z] End of script
09:39:50 [2022-02-01T14:39:50.052Z] Start of script
09:39:50 [2022-02-01T14:39:50.052Z] include file start
09:39:50 [2022-02-01T14:39:50.052Z] Include file processed
09:39:50 [2022-02-01T14:39:50.052Z] line after include file
09:39:50 [2022-02-01T14:39:50.052Z] Result of testMethod = 5
09:39:50 [2022-02-01T14:39:50.052Z] End of script
09:39:50 [2022-02-01T14:39:50.310Z] Start of script
09:39:50 [2022-02-01T14:39:50.310Z] include file start
09:39:50 [2022-02-01T14:39:50.310Z] Include file processed
09:39:50 [2022-02-01T14:39:50.310Z] line after include file
09:39:50 [2022-02-01T14:39:50.310Z] Result of testMethod = 5
09:39:50 [2022-02-01T14:39:50.568Z] org.eclipse.ease.ScriptEngineCancellationException: Terminated on user request
09:39:50 [2022-02-01T14:39:50.568Z] 	at org.eclipse.ease.debugging.AbstractEaseDebugger.handleEventsInSuspendedState(AbstractEaseDebugger.java:331)
09:39:50 [2022-02-01T14:39:50.568Z] 	at org.eclipse.ease.debugging.AbstractEaseDebugger.suspend(AbstractEaseDebugger.java:257)
09:39:50 [2022-02-01T14:39:50.568Z] 	at org.eclipse.ease.debugging.AbstractEaseDebugger.processLine(AbstractEaseDebugger.java:492)
09:39:50 [2022-02-01T14:39:50.568Z] 	at org.eclipse.ease.lang.javascript.rhino.debugger.RhinoDebugger.access$4(RhinoDebugger.java:1)
09:39:50 [2022-02-01T14:39:50.568Z] 	at org.eclipse.ease.lang.javascript.rhino.debugger.RhinoDebugger$RhinoDebugFrame.onLineChange(RhinoDebugger.java:124)
09:39:50 [2022-02-01T14:39:50.568Z] 	at org.mozilla.javascript.Interpreter.interpretLoop(Interpreter.java:1931)
09:39:50 [2022-02-01T14:39:50.568Z] 	at org.mozilla.javascript.Interpreter.interpret(Interpreter.java:911)
09:39:50 [2022-02-01T14:39:50.568Z] 	at org.mozilla.javascript.InterpretedFunction.call(InterpretedFunction.java:109)
09:39:50 [2022-02-01T14:39:50.568Z] 	at org.mozilla.javascript.ContextFactory.doTopCall(ContextFactory.java:405)
09:39:50 [2022-02-01T14:39:50.568Z] 	at org.mozilla.javascript.ScriptRuntime.doTopCall(ScriptRuntime.java:3508)
09:39:50 [2022-02-01T14:39:50.568Z] 	at org.mozilla.javascript.InterpretedFunction.exec(InterpretedFunction.java:120)
09:39:50 [2022-02-01T14:39:50.568Z] 	at org.mozilla.javascript.Context.evaluateReader(Context.java:1293)
09:39:50 [2022-02-01T14:39:50.568Z] 	at org.eclipse.ease.lang.javascript.rhino.RhinoScriptEngine.internalExecute(RhinoScriptEngine.java:226)
09:39:50 [2022-02-01T14:39:50.568Z] 	at org.eclipse.ease.lang.javascript.rhino.RhinoScriptEngine.execute(RhinoScriptEngine.java:205)
09:39:50 [2022-02-01T14:39:50.568Z] 	at org.eclipse.ease.AbstractScriptEngine.inject(AbstractScriptEngine.java:190)
09:39:50 [2022-02-01T14:39:50.568Z] 	at org.eclipse.ease.AbstractScriptEngine.run(AbstractScriptEngine.java:243)
09:39:50 [2022-02-01T14:39:50.568Z] 	at org.eclipse.core.internal.jobs.Worker.run(Worker.java:63)
09:39:50 [2022-02-01T14:39:50.568Z] Start of script
09:39:50 [2022-02-01T14:39:50.568Z] include file start
09:39:50 [2022-02-01T14:39:50.568Z] Include file processed
09:39:50 [2022-02-01T14:39:50.568Z] line after include file
09:39:50 [2022-02-01T14:39:50.826Z] Result of testMethod = 5
09:39:50 [2022-02-01T14:39:50.826Z] End of script
09:39:51 [2022-02-01T14:39:51.084Z] Start of script
09:39:51 [2022-02-01T14:39:51.084Z] include file start
09:39:51 [2022-02-01T14:39:51.084Z] Include file processed
09:39:51 [2022-02-01T14:39:51.084Z] line after include file
09:39:51 [2022-02-01T14:39:51.084Z] Result of testMethod = 5
09:39:51 [2022-02-01T14:39:51.084Z] End of script
09:39:51 [2022-02-01T14:39:51.084Z] Start of script
09:39:51 [2022-02-01T14:39:51.084Z] include file start
09:39:51 [2022-02-01T14:39:51.084Z] Include file processed
09:39:51 [2022-02-01T14:39:51.084Z] line after include file
09:39:51 [2022-02-01T14:39:51.342Z] Result of testMethod = 5
09:39:51 [2022-02-01T14:39:51.342Z] End of script
09:39:51 [2022-02-01T14:39:51.342Z] Start of script
09:39:51 [2022-02-01T14:39:51.342Z] include file start
09:39:51 [2022-02-01T14:39:51.342Z] Include file processed
09:39:51 [2022-02-01T14:39:51.342Z] line after include file
09:39:51 [2022-02-01T14:39:51.342Z] Result of testMethod = 5
09:39:51 [2022-02-01T14:39:51.600Z] org.eclipse.ease.ScriptEngineCancellationException: Terminated on user request
09:39:51 [2022-02-01T14:39:51.600Z] 	at org.eclipse.ease.debugging.AbstractEaseDebugger.handleEventsInSuspendedState(AbstractEaseDebugger.java:331)
09:39:51 [2022-02-01T14:39:51.600Z] 	at org.eclipse.ease.debugging.AbstractEaseDebugger.suspend(AbstractEaseDebugger.java:257)
09:39:51 [2022-02-01T14:39:51.600Z] 	at org.eclipse.ease.debugging.AbstractEaseDebugger.processLine(AbstractEaseDebugger.java:492)
09:39:51 [2022-02-01T14:39:51.600Z] 	at org.eclipse.ease.lang.javascript.rhino.debugger.RhinoDebugger.access$4(RhinoDebugger.java:1)
09:39:51 [2022-02-01T14:39:51.600Z] 	at org.eclipse.ease.lang.javascript.rhino.debugger.RhinoDebugger$RhinoDebugFrame.onLineChange(RhinoDebugger.java:124)
09:39:51 [2022-02-01T14:39:51.600Z] 	at org.mozilla.javascript.Interpreter.interpretLoop(Interpreter.java:1931)
09:39:51 [2022-02-01T14:39:51.600Z] 	at org.mozilla.javascript.Interpreter.interpret(Interpreter.java:911)
09:39:51 [2022-02-01T14:39:51.600Z] 	at org.mozilla.javascript.InterpretedFunction.call(InterpretedFunction.java:109)
09:39:51 [2022-02-01T14:39:51.600Z] 	at org.mozilla.javascript.ContextFactory.doTopCall(ContextFactory.java:405)
09:39:51 [2022-02-01T14:39:51.601Z] 	at org.mozilla.javascript.ScriptRuntime.doTopCall(ScriptRuntime.java:3508)
09:39:51 [2022-02-01T14:39:51.601Z] 	at org.mozilla.javascript.InterpretedFunction.exec(InterpretedFunction.java:120)
09:39:51 [2022-02-01T14:39:51.601Z] 	at org.mozilla.javascript.Context.evaluateReader(Context.java:1293)
09:39:51 [2022-02-01T14:39:51.601Z] 	at org.eclipse.ease.lang.javascript.rhino.RhinoScriptEngine.internalExecute(RhinoScriptEngine.java:226)
09:39:51 [2022-02-01T14:39:51.601Z] 	at org.eclipse.ease.lang.javascript.rhino.RhinoScriptEngine.execute(RhinoScriptEngine.java:205)
09:39:51 [2022-02-01T14:39:51.601Z] 	at org.eclipse.ease.AbstractScriptEngine.inject(AbstractScriptEngine.java:190)
09:39:51 [2022-02-01T14:39:51.601Z] 	at org.eclipse.ease.AbstractScriptEngine.run(AbstractScriptEngine.java:243)
09:39:51 [2022-02-01T14:39:51.601Z] 	at org.eclipse.core.internal.jobs.Worker.run(Worker.java:63)
09:39:51 [2022-02-01T14:39:51.601Z] Start of script
09:39:51 [2022-02-01T14:39:51.601Z] include file start
09:39:51 [2022-02-01T14:39:51.601Z] Include file processed
09:39:51 [2022-02-01T14:39:51.601Z] line after include file
09:39:51 [2022-02-01T14:39:51.858Z] Result of testMethod = 5
09:39:51 [2022-02-01T14:39:51.858Z] End of script
09:39:52 [2022-02-01T14:39:52.116Z] Start of script
09:39:52 [2022-02-01T14:39:52.116Z] include file start
09:39:52 [2022-02-01T14:39:52.116Z] Include file processed
09:39:52 [2022-02-01T14:39:52.116Z] line after include file
09:39:52 [2022-02-01T14:39:52.116Z] Result of testMethod = 5
09:39:52 [2022-02-01T14:39:52.116Z] End of script
09:39:52 [2022-02-01T14:39:52.116Z] Start of script
09:39:52 [2022-02-01T14:39:52.116Z] include file start
09:39:52 [2022-02-01T14:39:52.116Z] Include file processed
09:39:52 [2022-02-01T14:39:52.116Z] line after include file
09:39:52 [2022-02-01T14:39:52.681Z] org.eclipse.ease.ScriptEngineCancellationException: Terminated on user request
09:39:52 [2022-02-01T14:39:52.681Z] 	at org.eclipse.ease.debugging.AbstractEaseDebugger.handleEventsInSuspendedState(AbstractEaseDebugger.java:331)
09:39:52 [2022-02-01T14:39:52.681Z] 	at org.eclipse.ease.debugging.AbstractEaseDebugger.suspend(AbstractEaseDebugger.java:257)
09:39:52 [2022-02-01T14:39:52.682Z] 	at org.eclipse.ease.debugging.AbstractEaseDebugger.processLine(AbstractEaseDebugger.java:512)
09:39:52 [2022-02-01T14:39:52.682Z] 	at org.eclipse.ease.lang.javascript.rhino.debugger.RhinoDebugger.access$4(RhinoDebugger.java:1)
09:39:52 [2022-02-01T14:39:52.682Z] 	at org.eclipse.ease.lang.javascript.rhino.debugger.RhinoDebugger$RhinoDebugFrame.onLineChange(RhinoDebugger.java:124)
09:39:52 [2022-02-01T14:39:52.682Z] 	at org.mozilla.javascript.Interpreter.interpretLoop(Interpreter.java:1931)
09:39:52 [2022-02-01T14:39:52.682Z] 	at org.mozilla.javascript.Interpreter.interpret(Interpreter.java:911)
09:39:52 [2022-02-01T14:39:52.682Z] 	at org.mozilla.javascript.InterpretedFunction.call(InterpretedFunction.java:109)
09:39:52 [2022-02-01T14:39:52.682Z] 	at org.mozilla.javascript.ContextFactory.doTopCall(ContextFactory.java:405)
09:39:52 [2022-02-01T14:39:52.682Z] 	at org.mozilla.javascript.ScriptRuntime.doTopCall(ScriptRuntime.java:3508)
09:39:52 [2022-02-01T14:39:52.682Z] 	at org.mozilla.javascript.InterpretedFunction.exec(InterpretedFunction.java:120)
09:39:52 [2022-02-01T14:39:52.682Z] 	at org.mozilla.javascript.Context.evaluateReader(Context.java:1293)
09:39:52 [2022-02-01T14:39:52.682Z] 	at org.eclipse.ease.lang.javascript.rhino.RhinoScriptEngine.internalExecute(RhinoScriptEngine.java:226)
09:39:52 [2022-02-01T14:39:52.682Z] 	at org.eclipse.ease.lang.javascript.rhino.RhinoScriptEngine.execute(RhinoScriptEngine.java:205)
09:39:52 [2022-02-01T14:39:52.682Z] 	at org.eclipse.ease.AbstractScriptEngine.inject(AbstractScriptEngine.java:190)
09:39:52 [2022-02-01T14:39:52.682Z] 	at org.eclipse.ease.AbstractScriptEngine.run(AbstractScriptEngine.java:243)
09:39:52 [2022-02-01T14:39:52.682Z] 	at org.eclipse.core.internal.jobs.Worker.run(Worker.java:63)
09:39:52 [2022-02-01T14:39:52.682Z] Start of script
09:39:52 [2022-02-01T14:39:52.682Z] include file start
09:39:52 [2022-02-01T14:39:52.682Z] Include file processed
09:39:52 [2022-02-01T14:39:52.682Z] line after include file
09:39:52 [2022-02-01T14:39:52.682Z] Result of testMethod = 5
09:39:52 [2022-02-01T14:39:52.682Z] End of script
09:39:52 [2022-02-01T14:39:52.939Z] Start of script
09:39:52 [2022-02-01T14:39:52.939Z] include file start
09:39:52 [2022-02-01T14:39:52.939Z] Include file processed
09:39:52 [2022-02-01T14:39:52.939Z] line after include file
09:39:52 [2022-02-01T14:39:52.939Z] Result of testMethod = 5
09:39:52 [2022-02-01T14:39:52.939Z] End of script
09:39:53 [2022-02-01T14:39:53.197Z] org.eclipse.ease.ScriptEngineCancellationException: Terminated on user request
09:39:53 [2022-02-01T14:39:53.197Z] 	at org.eclipse.ease.debugging.AbstractEaseDebugger.handleEventsInSuspendedState(AbstractEaseDebugger.java:331)
09:39:53 [2022-02-01T14:39:53.197Z] 	at org.eclipse.ease.debugging.AbstractEaseDebugger.suspend(AbstractEaseDebugger.java:257)
09:39:53 [2022-02-01T14:39:53.197Z] 	at org.eclipse.ease.debugging.AbstractEaseDebugger.processLine(AbstractEaseDebugger.java:492)
09:39:53 [2022-02-01T14:39:53.198Z] 	at org.eclipse.ease.lang.javascript.rhino.debugger.RhinoDebugger.access$4(RhinoDebugger.java:1)
09:39:53 [2022-02-01T14:39:53.198Z] 	at org.eclipse.ease.lang.javascript.rhino.debugger.RhinoDebugger$RhinoDebugFrame.onLineChange(RhinoDebugger.java:124)
09:39:53 [2022-02-01T14:39:53.198Z] 	at org.mozilla.javascript.Interpreter.interpretLoop(Interpreter.java:1931)
09:39:53 [2022-02-01T14:39:53.198Z] 	at org.mozilla.javascript.Interpreter.interpret(Interpreter.java:911)
09:39:53 [2022-02-01T14:39:53.198Z] 	at org.mozilla.javascript.InterpretedFunction.call(InterpretedFunction.java:109)
09:39:53 [2022-02-01T14:39:53.198Z] 	at org.mozilla.javascript.ContextFactory.doTopCall(ContextFactory.java:405)
09:39:53 [2022-02-01T14:39:53.198Z] 	at org.mozilla.javascript.ScriptRuntime.doTopCall(ScriptRuntime.java:3508)
09:39:53 [2022-02-01T14:39:53.198Z] 	at org.mozilla.javascript.InterpretedFunction.exec(InterpretedFunction.java:120)
09:39:53 [2022-02-01T14:39:53.198Z] 	at org.mozilla.javascript.Context.evaluateReader(Context.java:1293)
09:39:53 [2022-02-01T14:39:53.198Z] 	at org.eclipse.ease.lang.javascript.rhino.RhinoScriptEngine.internalExecute(RhinoScriptEngine.java:226)
09:39:53 [2022-02-01T14:39:53.198Z] 	at org.eclipse.ease.lang.javascript.rhino.RhinoScriptEngine.execute(RhinoScriptEngine.java:205)
09:39:53 [2022-02-01T14:39:53.198Z] 	at org.eclipse.ease.AbstractScriptEngine.inject(AbstractScriptEngine.java:190)
09:39:53 [2022-02-01T14:39:53.198Z] 	at org.eclipse.ease.AbstractScriptEngine.run(AbstractScriptEngine.java:243)
09:39:53 [2022-02-01T14:39:53.198Z] 	at org.eclipse.core.internal.jobs.Worker.run(Worker.java:63)
09:39:53 [2022-02-01T14:39:53.460Z] Start of script
09:39:53 [2022-02-01T14:39:53.460Z] include file start
09:39:53 [2022-02-01T14:39:53.460Z] Include file processed
09:39:53 [2022-02-01T14:39:53.460Z] line after include file
09:39:53 [2022-02-01T14:39:53.460Z] Result of testMethod = 5
09:39:53 [2022-02-01T14:39:53.460Z] End of script
09:39:53 [2022-02-01T14:39:53.460Z] Start of script
09:39:53 [2022-02-01T14:39:53.460Z] include file start
09:39:53 [2022-02-01T14:39:53.460Z] Include file processed
09:39:53 [2022-02-01T14:39:53.460Z] line after include file
09:39:53 [2022-02-01T14:39:53.718Z] Result of testMethod = 5
09:39:53 [2022-02-01T14:39:53.718Z] End of script
09:39:53 [2022-02-01T14:39:53.975Z] Start of script
09:39:53 [2022-02-01T14:39:53.975Z] include file start
09:39:53 [2022-02-01T14:39:53.975Z] Include file processed
09:39:53 [2022-02-01T14:39:53.975Z] line after include file
09:39:53 [2022-02-01T14:39:53.975Z] Result of testMethod = 5
09:39:53 [2022-02-01T14:39:53.975Z] org.eclipse.ease.ScriptEngineCancellationException: Terminated on user request
09:39:53 [2022-02-01T14:39:53.975Z] 	at org.eclipse.ease.debugging.AbstractEaseDebugger.handleEventsInSuspendedState(AbstractEaseDebugger.java:331)
09:39:53 [2022-02-01T14:39:53.975Z] 	at org.eclipse.ease.debugging.AbstractEaseDebugger.suspend(AbstractEaseDebugger.java:257)
09:39:53 [2022-02-01T14:39:53.975Z] 	at org.eclipse.ease.debugging.AbstractEaseDebugger.processLine(AbstractEaseDebugger.java:492)
09:39:53 [2022-02-01T14:39:53.975Z] 	at org.eclipse.ease.lang.javascript.rhino.debugger.RhinoDebugger.access$4(RhinoDebugger.java:1)
09:39:53 [2022-02-01T14:39:53.975Z] 	at org.eclipse.ease.lang.javascript.rhino.debugger.RhinoDebugger$RhinoDebugFrame.onLineChange(RhinoDebugger.java:124)
09:39:53 [2022-02-01T14:39:53.975Z] 	at org.mozilla.javascript.Interpreter.interpretLoop(Interpreter.java:1931)
09:39:53 [2022-02-01T14:39:53.975Z] 	at org.mozilla.javascript.Interpreter.interpret(Interpreter.java:911)
09:39:53 [2022-02-01T14:39:53.975Z] 	at org.mozilla.javascript.InterpretedFunction.call(InterpretedFunction.java:109)
09:39:53 [2022-02-01T14:39:53.975Z] 	at org.mozilla.javascript.ContextFactory.doTopCall(ContextFactory.java:405)
09:39:53 [2022-02-01T14:39:53.975Z] 	at org.mozilla.javascript.ScriptRuntime.doTopCall(ScriptRuntime.java:3508)
09:39:53 [2022-02-01T14:39:53.975Z] 	at org.mozilla.javascript.InterpretedFunction.exec(InterpretedFunction.java:120)
09:39:53 [2022-02-01T14:39:53.975Z] 	at org.mozilla.javascript.Context.evaluateReader(Context.java:1293)
09:39:53 [2022-02-01T14:39:53.975Z] 	at org.eclipse.ease.lang.javascript.rhino.RhinoScriptEngine.internalExecute(RhinoScriptEngine.java:226)
09:39:53 [2022-02-01T14:39:53.975Z] 	at org.eclipse.ease.lang.javascript.rhino.RhinoScriptEngine.execute(RhinoScriptEngine.java:205)
09:39:53 [2022-02-01T14:39:53.976Z] 	at org.eclipse.ease.AbstractScriptEngine.inject(AbstractScriptEngine.java:190)
09:39:53 [2022-02-01T14:39:53.976Z] 	at org.eclipse.ease.AbstractScriptEngine.run(AbstractScriptEngine.java:243)
09:39:53 [2022-02-01T14:39:53.976Z] 	at org.eclipse.core.internal.jobs.Worker.run(Worker.java:63)
09:39:54 [2022-02-01T14:39:54.233Z] Start of script
09:39:54 [2022-02-01T14:39:54.233Z] include file start
09:39:54 [2022-02-01T14:39:54.233Z] Include file processed
09:39:54 [2022-02-01T14:39:54.233Z] line after include file
09:39:54 [2022-02-01T14:39:54.490Z] Result of testMethod = 5
09:39:54 [2022-02-01T14:39:54.490Z] End of script
09:39:54 [2022-02-01T14:39:54.490Z] org.eclipse.ease.ScriptEngineCancellationException: Terminated on user request
09:39:54 [2022-02-01T14:39:54.490Z] 	at org.eclipse.ease.debugging.AbstractEaseDebugger.handleEventsInSuspendedState(AbstractEaseDebugger.java:331)
09:39:54 [2022-02-01T14:39:54.490Z] 	at org.eclipse.ease.debugging.AbstractEaseDebugger.suspend(AbstractEaseDebugger.java:257)
09:39:54 [2022-02-01T14:39:54.490Z] 	at org.eclipse.ease.debugging.AbstractEaseDebugger.processLine(AbstractEaseDebugger.java:492)
09:39:54 [2022-02-01T14:39:54.490Z] 	at org.eclipse.ease.lang.javascript.rhino.debugger.RhinoDebugger.access$4(RhinoDebugger.java:1)
09:39:54 [2022-02-01T14:39:54.490Z] 	at org.eclipse.ease.lang.javascript.rhino.debugger.RhinoDebugger$RhinoDebugFrame.onLineChange(RhinoDebugger.java:124)
09:39:54 [2022-02-01T14:39:54.490Z] 	at org.mozilla.javascript.Interpreter.interpretLoop(Interpreter.java:1931)
09:39:54 [2022-02-01T14:39:54.490Z] 	at org.mozilla.javascript.Interpreter.interpret(Interpreter.java:911)
09:39:54 [2022-02-01T14:39:54.490Z] 	at org.mozilla.javascript.InterpretedFunction.call(InterpretedFunction.java:109)
09:39:54 [2022-02-01T14:39:54.490Z] 	at org.mozilla.javascript.ContextFactory.doTopCall(ContextFactory.java:405)
09:39:54 [2022-02-01T14:39:54.490Z] 	at org.mozilla.javascript.ScriptRuntime.doTopCall(ScriptRuntime.java:3508)
09:39:54 [2022-02-01T14:39:54.490Z] 	at org.mozilla.javascript.InterpretedFunction.exec(InterpretedFunction.java:120)
09:39:54 [2022-02-01T14:39:54.490Z] 	at org.mozilla.javascript.Context.evaluateReader(Context.java:1293)
09:39:54 [2022-02-01T14:39:54.490Z] 	at org.eclipse.ease.lang.javascript.rhino.RhinoScriptEngine.internalExecute(RhinoScriptEngine.java:226)
09:39:54 [2022-02-01T14:39:54.490Z] 	at org.eclipse.ease.lang.javascript.rhino.RhinoScriptEngine.execute(RhinoScriptEngine.java:205)
09:39:54 [2022-02-01T14:39:54.490Z] 	at org.eclipse.ease.AbstractScriptEngine.inject(AbstractScriptEngine.java:190)
09:39:54 [2022-02-01T14:39:54.490Z] 	at org.eclipse.ease.AbstractScriptEngine.run(AbstractScriptEngine.java:243)
09:39:54 [2022-02-01T14:39:54.491Z] 	at org.eclipse.core.internal.jobs.Worker.run(Worker.java:63)
09:39:54 [2022-02-01T14:39:54.749Z] Start of script
09:39:54 [2022-02-01T14:39:54.749Z] include file start
09:39:54 [2022-02-01T14:39:54.749Z] Include file processed
09:39:54 [2022-02-01T14:39:54.749Z] line after include file
09:39:54 [2022-02-01T14:39:54.749Z] Result of testMethod = 5
09:39:54 [2022-02-01T14:39:54.749Z] End of script
09:39:55 [2022-02-01T14:39:55.006Z] Start of script
09:39:55 [2022-02-01T14:39:55.006Z] include file start
09:39:55 [2022-02-01T14:39:55.006Z] Include file processed
09:39:55 [2022-02-01T14:39:55.006Z] line after include file
09:39:55 [2022-02-01T14:39:55.006Z] Result of testMethod = 5
09:39:55 [2022-02-01T14:39:55.006Z] End of script
09:39:55 [2022-02-01T14:39:55.264Z] org.eclipse.ease.ScriptEngineCancellationException: Terminated on user request
09:39:55 [2022-02-01T14:39:55.264Z] 	at org.eclipse.ease.debugging.AbstractEaseDebugger.handleEventsInSuspendedState(AbstractEaseDebugger.java:331)
09:39:55 [2022-02-01T14:39:55.264Z] 	at org.eclipse.ease.debugging.AbstractEaseDebugger.suspend(AbstractEaseDebugger.java:257)
09:39:55 [2022-02-01T14:39:55.264Z] 	at org.eclipse.ease.debugging.AbstractEaseDebugger.processLine(AbstractEaseDebugger.java:492)
09:39:55 [2022-02-01T14:39:55.264Z] 	at org.eclipse.ease.lang.javascript.rhino.debugger.RhinoDebugger.access$4(RhinoDebugger.java:1)
09:39:55 [2022-02-01T14:39:55.264Z] 	at org.eclipse.ease.lang.javascript.rhino.debugger.RhinoDebugger$RhinoDebugFrame.onLineChange(RhinoDebugger.java:124)
09:39:55 [2022-02-01T14:39:55.264Z] 	at org.mozilla.javascript.Interpreter.interpretLoop(Interpreter.java:1931)
09:39:55 [2022-02-01T14:39:55.264Z] 	at org.mozilla.javascript.Interpreter.interpret(Interpreter.java:911)
09:39:55 [2022-02-01T14:39:55.264Z] 	at org.mozilla.javascript.InterpretedFunction.call(InterpretedFunction.java:109)
09:39:55 [2022-02-01T14:39:55.264Z] 	at org.mozilla.javascript.ContextFactory.doTopCall(ContextFactory.java:405)
09:39:55 [2022-02-01T14:39:55.264Z] 	at org.mozilla.javascript.ScriptRuntime.doTopCall(ScriptRuntime.java:3508)
09:39:55 [2022-02-01T14:39:55.264Z] 	at org.mozilla.javascript.InterpretedFunction.exec(InterpretedFunction.java:120)
09:39:55 [2022-02-01T14:39:55.265Z] 	at org.mozilla.javascript.Context.evaluateReader(Context.java:1293)
09:39:55 [2022-02-01T14:39:55.265Z] 	at org.eclipse.ease.lang.javascript.rhino.RhinoScriptEngine.internalExecute(RhinoScriptEngine.java:226)
09:39:55 [2022-02-01T14:39:55.265Z] 	at org.eclipse.ease.lang.javascript.rhino.RhinoScriptEngine.execute(RhinoScriptEngine.java:205)
09:39:55 [2022-02-01T14:39:55.265Z] 	at org.eclipse.ease.AbstractScriptEngine.inject(AbstractScriptEngine.java:190)
09:39:55 [2022-02-01T14:39:55.265Z] 	at org.eclipse.ease.AbstractScriptEngine.run(AbstractScriptEngine.java:243)
09:39:55 [2022-02-01T14:39:55.265Z] 	at org.eclipse.core.internal.jobs.Worker.run(Worker.java:63)
09:39:55 [2022-02-01T14:39:55.522Z] Start of script
09:39:55 [2022-02-01T14:39:55.522Z] include file start
09:39:55 [2022-02-01T14:39:55.523Z] Include file processed
09:39:55 [2022-02-01T14:39:55.523Z] line after include file
09:39:55 [2022-02-01T14:39:55.523Z] Result of testMethod = 5
09:39:55 [2022-02-01T14:39:55.523Z] End of script
09:39:55 [2022-02-01T14:39:55.780Z] Start of script
09:39:55 [2022-02-01T14:39:55.780Z] include file start
09:39:55 [2022-02-01T14:39:55.780Z] Include file processed
09:39:55 [2022-02-01T14:39:55.780Z] line after include file
09:39:55 [2022-02-01T14:39:55.780Z] Result of testMethod = 5
09:39:56 [2022-02-01T14:39:56.038Z] WARNING: An illegal reflective access operation has occurred
09:39:56 [2022-02-01T14:39:56.038Z] WARNING: Illegal reflective access by org.eclipse.ease.debugging.model.EaseDebugValue (file:/home/jenkins/.m2/repository/org/eclipse/ease/org.eclipse.ease/0.9.0-SNAPSHOT/org.eclipse.ease-0.9.0-SNAPSHOT.jar) to field java.lang.String.hash
09:39:56 [2022-02-01T14:39:56.038Z] WARNING: Please consider reporting this to the maintainers of org.eclipse.ease.debugging.model.EaseDebugValue
09:39:56 [2022-02-01T14:39:56.038Z] WARNING: Use --illegal-access=warn to enable warnings of further illegal reflective access operations
09:39:56 [2022-02-01T14:39:56.038Z] WARNING: All illegal access operations will be denied in a future release
09:39:56 [2022-02-01T14:39:56.038Z] org.eclipse.ease.ScriptEngineCancellationException: Terminated on user request
09:39:56 [2022-02-01T14:39:56.038Z] 	at org.eclipse.ease.debugging.AbstractEaseDebugger.handleEventsInSuspendedState(AbstractEaseDebugger.java:331)
09:39:56 [2022-02-01T14:39:56.038Z] 	at org.eclipse.ease.debugging.AbstractEaseDebugger.suspend(AbstractEaseDebugger.java:257)
09:39:56 [2022-02-01T14:39:56.038Z] 	at org.eclipse.ease.debugging.AbstractEaseDebugger.processLine(AbstractEaseDebugger.java:492)
09:39:56 [2022-02-01T14:39:56.038Z] 	at org.eclipse.ease.lang.javascript.rhino.debugger.RhinoDebugger.access$4(RhinoDebugger.java:1)
09:39:56 [2022-02-01T14:39:56.038Z] 	at org.eclipse.ease.lang.javascript.rhino.debugger.RhinoDebugger$RhinoDebugFrame.onLineChange(RhinoDebugger.java:124)
09:39:56 [2022-02-01T14:39:56.038Z] 	at org.mozilla.javascript.Interpreter.interpretLoop(Interpreter.java:1931)
09:39:56 [2022-02-01T14:39:56.038Z] 	at org.mozilla.javascript.Interpreter.interpret(Interpreter.java:911)
09:39:56 [2022-02-01T14:39:56.038Z] 	at org.mozilla.javascript.InterpretedFunction.call(InterpretedFunction.java:109)
09:39:56 [2022-02-01T14:39:56.038Z] 	at org.mozilla.javascript.ContextFactory.doTopCall(ContextFactory.java:405)
09:39:56 [2022-02-01T14:39:56.038Z] 	at org.mozilla.javascript.ScriptRuntime.doTopCall(ScriptRuntime.java:3508)
09:39:56 [2022-02-01T14:39:56.038Z] 	at org.mozilla.javascript.InterpretedFunction.exec(InterpretedFunction.java:120)
09:39:56 [2022-02-01T14:39:56.038Z] 	at org.mozilla.javascript.Context.evaluateReader(Context.java:1293)
09:39:56 [2022-02-01T14:39:56.038Z] 	at org.eclipse.ease.lang.javascript.rhino.RhinoScriptEngine.internalExecute(RhinoScriptEngine.java:226)
09:39:56 [2022-02-01T14:39:56.038Z] 	at org.eclipse.ease.lang.javascript.rhino.RhinoScriptEngine.execute(RhinoScriptEngine.java:205)
09:39:56 [2022-02-01T14:39:56.038Z] 	at org.eclipse.ease.AbstractScriptEngine.inject(AbstractScriptEngine.java:190)
09:39:56 [2022-02-01T14:39:56.038Z] 	at org.eclipse.ease.AbstractScriptEngine.run(AbstractScriptEngine.java:243)
09:39:56 [2022-02-01T14:39:56.038Z] 	at org.eclipse.core.internal.jobs.Worker.run(Worker.java:63)
09:39:56 [2022-02-01T14:39:56.038Z] Start of script
09:39:56 [2022-02-01T14:39:56.038Z] include file start
09:39:56 [2022-02-01T14:39:56.038Z] Include file processed
09:39:56 [2022-02-01T14:39:56.038Z] line after include file
09:39:56 [2022-02-01T14:39:56.038Z] Result of testMethod = 5
09:39:56 [2022-02-01T14:39:56.038Z] End of script
09:39:56 [2022-02-01T14:39:56.296Z] Start of script
09:39:56 [2022-02-01T14:39:56.296Z] include file start
09:39:56 [2022-02-01T14:39:56.296Z] Include file processed
09:39:56 [2022-02-01T14:39:56.296Z] line after include file
09:39:56 [2022-02-01T14:39:56.553Z] Result of testMethod = 5
09:39:56 [2022-02-01T14:39:56.553Z] End of script
09:39:56 [2022-02-01T14:39:56.553Z] Start of script
09:39:56 [2022-02-01T14:39:56.553Z] include file start
09:39:56 [2022-02-01T14:39:56.553Z] Include file processed
09:39:56 [2022-02-01T14:39:56.553Z] line after include file
09:39:56 [2022-02-01T14:39:56.553Z] Result of testMethod = 5
09:39:56 [2022-02-01T14:39:56.553Z] End of script
09:39:56 [2022-02-01T14:39:56.553Z] Start of script
09:39:56 [2022-02-01T14:39:56.811Z] include file start
09:39:56 [2022-02-01T14:39:56.811Z] Include file processed
09:39:56 [2022-02-01T14:39:56.811Z] line after include file
09:39:56 [2022-02-01T14:39:56.811Z] Result of testMethod = 5
09:39:56 [2022-02-01T14:39:56.811Z] End of script
09:39:57 [2022-02-01T14:39:57.070Z] Start of script
09:39:57 [2022-02-01T14:39:57.070Z] include file start
09:39:57 [2022-02-01T14:39:57.070Z] Include file processed
09:39:57 [2022-02-01T14:39:57.070Z] line after include file
09:39:57 [2022-02-01T14:39:57.070Z] org.eclipse.ease.ScriptEngineCancellationException: Terminated on user request
09:39:57 [2022-02-01T14:39:57.070Z] 	at org.eclipse.ease.debugging.AbstractEaseDebugger.handleEventsInSuspendedState(AbstractEaseDebugger.java:331)
09:39:57 [2022-02-01T14:39:57.070Z] 	at org.eclipse.ease.debugging.AbstractEaseDebugger.suspend(AbstractEaseDebugger.java:257)
09:39:57 [2022-02-01T14:39:57.070Z] 	at org.eclipse.ease.debugging.AbstractEaseDebugger.processLine(AbstractEaseDebugger.java:492)
09:39:57 [2022-02-01T14:39:57.070Z] 	at org.eclipse.ease.lang.javascript.rhino.debugger.RhinoDebugger.access$4(RhinoDebugger.java:1)
09:39:57 [2022-02-01T14:39:57.070Z] 	at org.eclipse.ease.lang.javascript.rhino.debugger.RhinoDebugger$RhinoDebugFrame.onLineChange(RhinoDebugger.java:124)
09:39:57 [2022-02-01T14:39:57.070Z] 	at org.mozilla.javascript.Interpreter.interpretLoop(Interpreter.java:1931)
09:39:57 [2022-02-01T14:39:57.070Z] 	at org.mozilla.javascript.Interpreter.interpret(Interpreter.java:911)
09:39:57 [2022-02-01T14:39:57.070Z] 	at org.mozilla.javascript.InterpretedFunction.call(InterpretedFunction.java:109)
09:39:57 [2022-02-01T14:39:57.070Z] 	at org.mozilla.javascript.ContextFactory.doTopCall(ContextFactory.java:405)
09:39:57 [2022-02-01T14:39:57.070Z] 	at org.mozilla.javascript.ScriptRuntime.doTopCall(ScriptRuntime.java:3508)
09:39:57 [2022-02-01T14:39:57.070Z] 	at org.mozilla.javascript.InterpretedFunction.exec(InterpretedFunction.java:120)
09:39:57 [2022-02-01T14:39:57.070Z] 	at org.mozilla.javascript.Context.evaluateReader(Context.java:1293)
09:39:57 [2022-02-01T14:39:57.070Z] 	at org.eclipse.ease.lang.javascript.rhino.RhinoScriptEngine.internalExecute(RhinoScriptEngine.java:226)
09:39:57 [2022-02-01T14:39:57.070Z] 	at org.eclipse.ease.lang.javascript.rhino.RhinoScriptEngine.execute(RhinoScriptEngine.java:205)
09:39:57 [2022-02-01T14:39:57.070Z] 	at org.eclipse.ease.AbstractScriptEngine.inject(AbstractScriptEngine.java:190)
09:39:57 [2022-02-01T14:39:57.070Z] 	at org.eclipse.ease.AbstractScriptEngine.run(AbstractScriptEngine.java:243)
09:39:57 [2022-02-01T14:39:57.070Z] 	at org.eclipse.core.internal.jobs.Worker.run(Worker.java:63)
09:39:57 [2022-02-01T14:39:57.327Z] Start of script
09:39:57 [2022-02-01T14:39:57.585Z] include file start
09:39:57 [2022-02-01T14:39:57.585Z] Include file processed
09:39:57 [2022-02-01T14:39:57.585Z] line after include file
09:39:57 [2022-02-01T14:39:57.585Z] Result of testMethod = 5
09:39:57 [2022-02-01T14:39:57.585Z] End of script
09:39:57 [2022-02-01T14:39:57.585Z] Start of script
09:39:57 [2022-02-01T14:39:57.585Z] include file start
09:39:57 [2022-02-01T14:39:57.585Z] Include file processed
09:39:57 [2022-02-01T14:39:57.585Z] line after include file
09:39:57 [2022-02-01T14:39:57.585Z] Result of testMethod = 5
09:39:57 [2022-02-01T14:39:57.842Z] org.eclipse.ease.ScriptEngineCancellationException: Terminated on user request
09:39:57 [2022-02-01T14:39:57.842Z] 	at org.eclipse.ease.debugging.AbstractEaseDebugger.handleEventsInSuspendedState(AbstractEaseDebugger.java:331)
09:39:57 [2022-02-01T14:39:57.843Z] 	at org.eclipse.ease.debugging.AbstractEaseDebugger.suspend(AbstractEaseDebugger.java:257)
09:39:57 [2022-02-01T14:39:57.843Z] 	at org.eclipse.ease.debugging.AbstractEaseDebugger.processLine(AbstractEaseDebugger.java:492)
09:39:57 [2022-02-01T14:39:57.843Z] 	at org.eclipse.ease.lang.javascript.rhino.debugger.RhinoDebugger.access$4(RhinoDebugger.java:1)
09:39:57 [2022-02-01T14:39:57.843Z] 	at org.eclipse.ease.lang.javascript.rhino.debugger.RhinoDebugger$RhinoDebugFrame.onLineChange(RhinoDebugger.java:124)
09:39:57 [2022-02-01T14:39:57.843Z] 	at org.mozilla.javascript.Interpreter.interpretLoop(Interpreter.java:1931)
09:39:57 [2022-02-01T14:39:57.843Z] 	at org.mozilla.javascript.Interpreter.interpret(Interpreter.java:911)
09:39:57 [2022-02-01T14:39:57.843Z] 	at org.mozilla.javascript.InterpretedFunction.call(InterpretedFunction.java:109)
09:39:57 [2022-02-01T14:39:57.843Z] 	at org.mozilla.javascript.ContextFactory.doTopCall(ContextFactory.java:405)
09:39:57 [2022-02-01T14:39:57.843Z] 	at org.mozilla.javascript.ScriptRuntime.doTopCall(ScriptRuntime.java:3508)
09:39:57 [2022-02-01T14:39:57.843Z] 	at org.mozilla.javascript.InterpretedFunction.exec(InterpretedFunction.java:120)
09:39:57 [2022-02-01T14:39:57.843Z] 	at org.mozilla.javascript.Context.evaluateReader(Context.java:1293)
09:39:57 [2022-02-01T14:39:57.843Z] 	at org.eclipse.ease.lang.javascript.rhino.RhinoScriptEngine.internalExecute(RhinoScriptEngine.java:226)
09:39:57 [2022-02-01T14:39:57.843Z] 	at org.eclipse.ease.lang.javascript.rhino.RhinoScriptEngine.execute(RhinoScriptEngine.java:205)
09:39:57 [2022-02-01T14:39:57.843Z] 	at org.eclipse.ease.AbstractScriptEngine.inject(AbstractScriptEngine.java:190)
09:39:57 [2022-02-01T14:39:57.843Z] 	at org.eclipse.ease.AbstractScriptEngine.run(AbstractScriptEngine.java:243)
09:39:57 [2022-02-01T14:39:57.843Z] 	at org.eclipse.core.internal.jobs.Worker.run(Worker.java:63)
09:39:57 [2022-02-01T14:39:57.843Z] Start of script
09:39:57 [2022-02-01T14:39:57.843Z] include file start
09:39:57 [2022-02-01T14:39:57.843Z] Include file processed
09:39:57 [2022-02-01T14:39:57.843Z] line after include file
09:39:57 [2022-02-01T14:39:57.843Z] Result of testMethod = 5
09:39:58 [2022-02-01T14:39:58.100Z] End of script
09:39:58 [2022-02-01T14:39:58.100Z] Start of script
09:39:58 [2022-02-01T14:39:58.100Z] include file start
09:39:58 [2022-02-01T14:39:58.100Z] Include file processed
09:39:58 [2022-02-01T14:39:58.100Z] line after include file
09:39:58 [2022-02-01T14:39:58.357Z] Result of testMethod = 5
09:39:58 [2022-02-01T14:39:58.357Z] End of script
09:39:58 [2022-02-01T14:39:58.357Z] Start of script
09:39:58 [2022-02-01T14:39:58.357Z] include file start
09:39:58 [2022-02-01T14:39:58.357Z] Include file processed
09:39:58 [2022-02-01T14:39:58.357Z] line after include file
09:39:58 [2022-02-01T14:39:58.615Z] java.util.ConcurrentModificationException
09:39:58 [2022-02-01T14:39:58.615Z] 	at java.base/java.util.ArrayList$Itr.checkForComodification(ArrayList.java:1013)
09:39:58 [2022-02-01T14:39:58.615Z] 	at java.base/java.util.ArrayList$Itr.next(ArrayList.java:967)
09:39:58 [2022-02-01T14:39:58.615Z] 	at org.eclipse.ease.debugging.AbstractEaseDebugger.getBreakpoint(AbstractEaseDebugger.java:411)
09:39:58 [2022-02-01T14:39:58.615Z] 	at org.eclipse.ease.debugging.AbstractEaseDebugger.isActiveBreakpoint(AbstractEaseDebugger.java:529)
09:39:58 [2022-02-01T14:39:58.615Z] 	at org.eclipse.ease.debugging.AbstractEaseDebugger.processLine(AbstractEaseDebugger.java:491)
09:39:58 [2022-02-01T14:39:58.615Z] 	at org.eclipse.ease.lang.javascript.rhino.debugger.RhinoDebugger.access$4(RhinoDebugger.java:1)
09:39:58 [2022-02-01T14:39:58.616Z] 	at org.eclipse.ease.lang.javascript.rhino.debugger.RhinoDebugger$RhinoDebugFrame.onLineChange(RhinoDebugger.java:124)
09:39:58 [2022-02-01T14:39:58.616Z] 	at org.mozilla.javascript.Interpreter.interpretLoop(Interpreter.java:1931)
09:39:58 [2022-02-01T14:39:58.616Z] 	at org.mozilla.javascript.Interpreter.interpret(Interpreter.java:911)
09:39:58 [2022-02-01T14:39:58.616Z] 	at org.mozilla.javascript.InterpretedFunction.call(InterpretedFunction.java:109)
09:39:58 [2022-02-01T14:39:58.616Z] 	at org.mozilla.javascript.ContextFactory.doTopCall(ContextFactory.java:405)
09:39:58 [2022-02-01T14:39:58.616Z] 	at org.mozilla.javascript.ScriptRuntime.doTopCall(ScriptRuntime.java:3508)
09:39:58 [2022-02-01T14:39:58.616Z] 	at org.mozilla.javascript.InterpretedFunction.exec(InterpretedFunction.java:120)
09:39:58 [2022-02-01T14:39:58.616Z] 	at org.mozilla.javascript.Context.evaluateReader(Context.java:1293)
09:39:58 [2022-02-01T14:39:58.616Z] 	at org.eclipse.ease.lang.javascript.rhino.RhinoScriptEngine.internalExecute(RhinoScriptEngine.java:226)
09:39:58 [2022-02-01T14:39:58.616Z] 	at org.eclipse.ease.lang.javascript.rhino.RhinoScriptEngine.execute(RhinoScriptEngine.java:205)
09:39:58 [2022-02-01T14:39:58.616Z] 	at org.eclipse.ease.AbstractScriptEngine.inject(AbstractScriptEngine.java:190)
09:39:58 [2022-02-01T14:39:58.616Z] 	at org.eclipse.ease.AbstractScriptEngine.run(AbstractScriptEngine.java:243)
09:39:58 [2022-02-01T14:39:58.616Z] 	at org.eclipse.core.internal.jobs.Worker.run(Worker.java:63)
09:39:58 [2022-02-01T14:39:58.616Z] Start of script
09:39:58 [2022-02-01T14:39:58.616Z] include file start
09:39:58 [2022-02-01T14:39:58.616Z] Include file processed
09:39:58 [2022-02-01T14:39:58.616Z] line after include file
09:39:58 [2022-02-01T14:39:58.616Z] Result of testMethod = 5
09:39:58 [2022-02-01T14:39:58.616Z] End of script
09:39:58 [2022-02-01T14:39:58.873Z] Start of script
09:39:58 [2022-02-01T14:39:58.873Z] include file start
09:39:58 [2022-02-01T14:39:58.873Z] Include file processed
09:39:58 [2022-02-01T14:39:58.873Z] line after include file
09:39:58 [2022-02-01T14:39:58.873Z] Result of testMethod = 5
09:39:59 [2022-02-01T14:39:59.131Z] org.eclipse.ease.ScriptEngineCancellationException: Terminated on user request
09:39:59 [2022-02-01T14:39:59.131Z] 	at org.eclipse.ease.debugging.AbstractEaseDebugger.handleEventsInSuspendedState(AbstractEaseDebugger.java:331)
09:39:59 [2022-02-01T14:39:59.131Z] 	at org.eclipse.ease.debugging.AbstractEaseDebugger.suspend(AbstractEaseDebugger.java:257)
09:39:59 [2022-02-01T14:39:59.131Z] 	at org.eclipse.ease.debugging.AbstractEaseDebugger.processLine(AbstractEaseDebugger.java:492)
09:39:59 [2022-02-01T14:39:59.131Z] 	at org.eclipse.ease.lang.javascript.rhino.debugger.RhinoDebugger.access$4(RhinoDebugger.java:1)
09:39:59 [2022-02-01T14:39:59.131Z] 	at org.eclipse.ease.lang.javascript.rhino.debugger.RhinoDebugger$RhinoDebugFrame.onLineChange(RhinoDebugger.java:124)
09:39:59 [2022-02-01T14:39:59.131Z] 	at org.mozilla.javascript.Interpreter.interpretLoop(Interpreter.java:1931)
09:39:59 [2022-02-01T14:39:59.131Z] 	at org.mozilla.javascript.Interpreter.interpret(Interpreter.java:911)
09:39:59 [2022-02-01T14:39:59.131Z] 	at org.mozilla.javascript.InterpretedFunction.call(InterpretedFunction.java:109)
09:39:59 [2022-02-01T14:39:59.131Z] 	at org.mozilla.javascript.ContextFactory.doTopCall(ContextFactory.java:405)
09:39:59 [2022-02-01T14:39:59.131Z] 	at org.mozilla.javascript.ScriptRuntime.doTopCall(ScriptRuntime.java:3508)
09:39:59 [2022-02-01T14:39:59.131Z] 	at org.mozilla.javascript.InterpretedFunction.exec(InterpretedFunction.java:120)
09:39:59 [2022-02-01T14:39:59.131Z] 	at org.mozilla.javascript.Context.evaluateReader(Context.java:1293)
09:39:59 [2022-02-01T14:39:59.131Z] 	at org.eclipse.ease.lang.javascript.rhino.RhinoScriptEngine.internalExecute(RhinoScriptEngine.java:226)
09:39:59 [2022-02-01T14:39:59.131Z] 	at org.eclipse.ease.lang.javascript.rhino.RhinoScriptEngine.execute(RhinoScriptEngine.java:205)
09:39:59 [2022-02-01T14:39:59.131Z] 	at org.eclipse.ease.AbstractScriptEngine.inject(AbstractScriptEngine.java:190)
09:39:59 [2022-02-01T14:39:59.131Z] 	at org.eclipse.ease.AbstractScriptEngine.run(AbstractScriptEngine.java:243)
09:39:59 [2022-02-01T14:39:59.131Z] 	at org.eclipse.core.internal.jobs.Worker.run(Worker.java:63)
09:39:59 [2022-02-01T14:39:59.131Z] Start of script
09:39:59 [2022-02-01T14:39:59.131Z] include file start
09:39:59 [2022-02-01T14:39:59.132Z] Include file processed
09:39:59 [2022-02-01T14:39:59.132Z] line after include file
09:39:59 [2022-02-01T14:39:59.132Z] Result of testMethod = 5
09:39:59 [2022-02-01T14:39:59.132Z] End of script
09:39:59 [2022-02-01T14:39:59.390Z] Start of script
09:39:59 [2022-02-01T14:39:59.390Z] include file start
09:39:59 [2022-02-01T14:39:59.390Z] Include file processed
09:39:59 [2022-02-01T14:39:59.390Z] line after include file
09:39:59 [2022-02-01T14:39:59.390Z] Result of testMethod = 5
09:39:59 [2022-02-01T14:39:59.390Z] org.eclipse.ease.ScriptEngineCancellationException: Terminated on user request
09:39:59 [2022-02-01T14:39:59.390Z] 	at org.eclipse.ease.debugging.AbstractEaseDebugger.handleEventsInSuspendedState(AbstractEaseDebugger.java:331)
09:39:59 [2022-02-01T14:39:59.390Z] 	at org.eclipse.ease.debugging.AbstractEaseDebugger.suspend(AbstractEaseDebugger.java:257)
09:39:59 [2022-02-01T14:39:59.390Z] 	at org.eclipse.ease.debugging.AbstractEaseDebugger.processLine(AbstractEaseDebugger.java:492)
09:39:59 [2022-02-01T14:39:59.390Z] 	at org.eclipse.ease.lang.javascript.rhino.debugger.RhinoDebugger.access$4(RhinoDebugger.java:1)
09:39:59 [2022-02-01T14:39:59.390Z] 	at org.eclipse.ease.lang.javascript.rhino.debugger.RhinoDebugger$RhinoDebugFrame.onLineChange(RhinoDebugger.java:124)
09:39:59 [2022-02-01T14:39:59.390Z] 	at org.mozilla.javascript.Interpreter.interpretLoop(Interpreter.java:1931)
09:39:59 [2022-02-01T14:39:59.390Z] 	at org.mozilla.javascript.Interpreter.interpret(Interpreter.java:911)
09:39:59 [2022-02-01T14:39:59.390Z] 	at org.mozilla.javascript.InterpretedFunction.call(InterpretedFunction.java:109)
09:39:59 [2022-02-01T14:39:59.390Z] 	at org.mozilla.javascript.ContextFactory.doTopCall(ContextFactory.java:405)
09:39:59 [2022-02-01T14:39:59.390Z] 	at org.mozilla.javascript.ScriptRuntime.doTopCall(ScriptRuntime.java:3508)
09:39:59 [2022-02-01T14:39:59.390Z] 	at org.mozilla.javascript.InterpretedFunction.exec(InterpretedFunction.java:120)
09:39:59 [2022-02-01T14:39:59.390Z] 	at org.mozilla.javascript.Context.evaluateReader(Context.java:1293)
09:39:59 [2022-02-01T14:39:59.390Z] 	at org.eclipse.ease.lang.javascript.rhino.RhinoScriptEngine.internalExecute(RhinoScriptEngine.java:226)
09:39:59 [2022-02-01T14:39:59.390Z] 	at org.eclipse.ease.lang.javascript.rhino.RhinoScriptEngine.execute(RhinoScriptEngine.java:205)
09:39:59 [2022-02-01T14:39:59.390Z] 	at org.eclipse.ease.AbstractScriptEngine.inject(AbstractScriptEngine.java:190)
09:39:59 [2022-02-01T14:39:59.390Z] 	at org.eclipse.ease.AbstractScriptEngine.run(AbstractScriptEngine.java:243)
09:39:59 [2022-02-01T14:39:59.390Z] 	at org.eclipse.core.internal.jobs.Worker.run(Worker.java:63)
09:39:59 [2022-02-01T14:39:59.649Z] org.eclipse.ease.ScriptEngineCancellationException: Terminated on user request
09:39:59 [2022-02-01T14:39:59.649Z] 	at org.eclipse.ease.debugging.AbstractEaseDebugger.handleEventsInSuspendedState(AbstractEaseDebugger.java:331)
09:39:59 [2022-02-01T14:39:59.649Z] 	at org.eclipse.ease.debugging.AbstractEaseDebugger.suspend(AbstractEaseDebugger.java:257)
09:39:59 [2022-02-01T14:39:59.649Z] 	at org.eclipse.ease.debugging.AbstractEaseDebugger.processLine(AbstractEaseDebugger.java:492)
09:39:59 [2022-02-01T14:39:59.649Z] 	at org.eclipse.ease.lang.javascript.rhino.debugger.RhinoDebugger.access$4(RhinoDebugger.java:1)
09:39:59 [2022-02-01T14:39:59.649Z] 	at org.eclipse.ease.lang.javascript.rhino.debugger.RhinoDebugger$RhinoDebugFrame.onLineChange(RhinoDebugger.java:124)
09:39:59 [2022-02-01T14:39:59.649Z] 	at org.mozilla.javascript.Interpreter.interpretLoop(Interpreter.java:1931)
09:39:59 [2022-02-01T14:39:59.649Z] 	at org.mozilla.javascript.Interpreter.interpret(Interpreter.java:911)
09:39:59 [2022-02-01T14:39:59.649Z] 	at org.mozilla.javascript.InterpretedFunction.call(InterpretedFunction.java:109)
09:39:59 [2022-02-01T14:39:59.649Z] 	at org.mozilla.javascript.ContextFactory.doTopCall(ContextFactory.java:405)
09:39:59 [2022-02-01T14:39:59.649Z] 	at org.mozilla.javascript.ScriptRuntime.doTopCall(ScriptRuntime.java:3508)
09:39:59 [2022-02-01T14:39:59.649Z] 	at org.mozilla.javascript.InterpretedFunction.exec(InterpretedFunction.java:120)
09:39:59 [2022-02-01T14:39:59.649Z] 	at org.mozilla.javascript.Context.evaluateReader(Context.java:1293)
09:39:59 [2022-02-01T14:39:59.649Z] 	at org.eclipse.ease.lang.javascript.rhino.RhinoScriptEngine.internalExecute(RhinoScriptEngine.java:226)
09:39:59 [2022-02-01T14:39:59.649Z] 	at org.eclipse.ease.lang.javascript.rhino.RhinoScriptEngine.execute(RhinoScriptEngine.java:205)
09:39:59 [2022-02-01T14:39:59.649Z] 	at org.eclipse.ease.AbstractScriptEngine.inject(AbstractScriptEngine.java:190)
09:39:59 [2022-02-01T14:39:59.649Z] 	at org.eclipse.ease.AbstractScriptEngine.run(AbstractScriptEngine.java:243)
09:39:59 [2022-02-01T14:39:59.649Z] 	at org.eclipse.core.internal.jobs.Worker.run(Worker.java:63)
09:39:59 [2022-02-01T14:39:59.909Z] Start of script
09:39:59 [2022-02-01T14:39:59.909Z] include file start
09:39:59 [2022-02-01T14:39:59.909Z] Include file processed
09:39:59 [2022-02-01T14:39:59.909Z] line after include file
09:39:59 [2022-02-01T14:39:59.909Z] Result of testMethod = 5
09:39:59 [2022-02-01T14:39:59.909Z] End of script
09:39:59 [2022-02-01T14:39:59.909Z] Start of script
09:40:00 [2022-02-01T14:40:00.168Z] include file start
09:40:00 [2022-02-01T14:40:00.168Z] Include file processed
09:40:00 [2022-02-01T14:40:00.168Z] line after include file
09:40:00 [2022-02-01T14:40:00.168Z] Result of testMethod = 5
09:40:00 [2022-02-01T14:40:00.168Z] End of script
09:40:00 [2022-02-01T14:40:00.427Z] Start of script
09:40:00 [2022-02-01T14:40:00.427Z] include file start
09:40:00 [2022-02-01T14:40:00.427Z] Include file processed
09:40:00 [2022-02-01T14:40:00.427Z] line after include file
09:40:00 [2022-02-01T14:40:00.427Z] Result of testMethod = 5
09:40:00 [2022-02-01T14:40:00.427Z] End of script
09:40:00 [2022-02-01T14:40:00.686Z] Tests run: 41, Failures: 1, Errors: 0, Skipped: 0, Time elapsed: 10.847 s <<< FAILURE! - in org.eclipse.ease.lang.javascript.rhino.RhinoDebugTest
09:40:00 [2022-02-01T14:40:00.686Z] disconnectProcessInSuspendedState  Time elapsed: 0.321 s
09:40:00 [2022-02-01T14:40:00.686Z] stepReturnIncludeCommand  Time elapsed: 0.217 s
09:40:00 [2022-02-01T14:40:00.686Z] arrayVariableSorting  Time elapsed: 0.307 s
09:40:00 [2022-02-01T14:40:00.686Z] stepOverOnDebugTarget  Time elapsed: 0.312 s
09:40:00 [2022-02-01T14:40:00.686Z] disconnectThreadInSuspendedState  Time elapsed: 0.207 s
09:40:00 [2022-02-01T14:40:00.686Z] stepReturnOnDebugTarget  Time elapsed: 0.308 s
09:40:00 [2022-02-01T14:40:00.686Z] nullVariable  Time elapsed: 0.308 s
09:40:00 [2022-02-01T14:40:00.686Z] stepOverOnStackFrame  Time elapsed: 0.307 s
09:40:00 [2022-02-01T14:40:00.686Z] resumeOnDebugTarget  Time elapsed: 0.212 s
09:40:00 [2022-02-01T14:40:00.687Z] modifyVariableKeepingType  Time elapsed: 0.407 s
09:40:00 [2022-02-01T14:40:00.687Z] resumeOnLastIncludeLine  Time elapsed: 0.206 s
09:40:00 [2022-02-01T14:40:00.687Z] stepReturnOnStackFrame  Time elapsed: 0.307 s
09:40:00 [2022-02-01T14:40:00.687Z] terminateStackFrameInSuspendedState  Time elapsed: 0.208 s
09:40:00 [2022-02-01T14:40:00.687Z] breakpointLocation  Time elapsed: 0.208 s
09:40:00 [2022-02-01T14:40:00.687Z] stepReturnOnThread  Time elapsed: 0.309 s
09:40:00 [2022-02-01T14:40:00.687Z] javaClassVariable  Time elapsed: 0.311 s
09:40:00 [2022-02-01T14:40:00.687Z] stepIntoOnThread  Time elapsed: 0.308 s
09:40:00 [2022-02-01T14:40:00.687Z] terminateThreadInSuspendedState  Time elapsed: 0.207 s
09:40:00 [2022-02-01T14:40:00.687Z] resumeOnThread  Time elapsed: 0.208 s
09:40:00 [2022-02-01T14:40:00.687Z] stepIntoOnStackFrame  Time elapsed: 0.308 s
09:40:00 [2022-02-01T14:40:00.687Z] terminateProcessInSuspendedState  Time elapsed: 0.205 s
09:40:00 [2022-02-01T14:40:00.687Z] stepOverOnProcess  Time elapsed: 0.307 s
09:40:00 [2022-02-01T14:40:00.687Z] nativeArrayVariable  Time elapsed: 0.308 s
09:40:00 [2022-02-01T14:40:00.687Z] disconnectDebugTargetInSuspendedState  Time elapsed: 0.206 s
09:40:00 [2022-02-01T14:40:00.687Z] stepIntoOnProcess  Time elapsed: 0.309 s
09:40:00 [2022-02-01T14:40:00.687Z] terminatedState  Time elapsed: 0.104 s
09:40:00 [2022-02-01T14:40:00.687Z] stepOverIncludeCommand  Time elapsed: 0.306 s
09:40:00 [2022-02-01T14:40:00.687Z] innerScopeVariableBeforeOuterScopeVariable  Time elapsed: 0.306 s
09:40:00 [2022-02-01T14:40:00.687Z] stepIntoIncludeCommand  Time elapsed: 0.306 s
09:40:00 [2022-02-01T14:40:00.687Z] primitiveStringVariable  Time elapsed: 0.305 s
09:40:00 [2022-02-01T14:40:00.687Z] resumeOnProcess  Time elapsed: 0.205 s
09:40:00 [2022-02-01T14:40:00.687Z] stepIntoOnDebugTarget  Time elapsed: 0.306 s
09:40:00 [2022-02-01T14:40:00.687Z] stepOverOnThread  Time elapsed: 0.21 s  <<< FAILURE!
09:40:00 [2022-02-01T14:40:00.687Z] org.opentest4j.AssertionFailedError: expected: <2> but was: <1>
09:40:00 [2022-02-01T14:40:00.687Z] 
09:40:00 [2022-02-01T14:40:00.687Z] suspendedState  Time elapsed: 0.205 s
09:40:00 [2022-02-01T14:40:00.687Z] primitiveDoubleVariable  Time elapsed: 0.305 s
09:40:00 [2022-02-01T14:40:00.687Z] resumeOnStackFrame  Time elapsed: 0.205 s
09:40:00 [2022-02-01T14:40:00.687Z] nativeObjectVariable  Time elapsed: 0.305 s
09:40:00 [2022-02-01T14:40:00.687Z] terminateDebugTargetInSuspendedState  Time elapsed: 0.205 s
09:40:00 [2022-02-01T14:40:00.687Z] disconnectStackFrameInSuspendedState  Time elapsed: 0.206 s
09:40:00 [2022-02-01T14:40:00.687Z] stepReturnOnProcess  Time elapsed: 0.307 s
09:40:00 [2022-02-01T14:40:00.687Z] evaluateWatchExpression  Time elapsed: 0.226 s
09:40:00 [2022-02-01T14:40:00.687Z] 
09:40:00 [2022-02-01T14:40:00.687Z] Results:
09:40:00 [2022-02-01T14:40:00.687Z] 
09:40:00 [2022-02-01T14:40:00.687Z] Failures: 
09:40:00 [2022-02-01T14:40:00.687Z]   RhinoDebugTest>AbstractDebugTest.stepOverOnThread:204->AbstractDebugTest.stepOverTestTemplate:186 expected: <2> but was: <1>
09:40:00 [2022-02-01T14:40:00.687Z] 
09:40:00 [2022-02-01T14:40:00.687Z] Tests run: 69, Failures: 1, Errors: 0, Skipped: 0
09:40:00 [2022-02-01T14:40:00.687Z] 
09:40:00 [2022-02-01T14:40:00.945Z] [INFO] ------------------------------------------------------------------------
09:40:00 [2022-02-01T14:40:00.946Z] [INFO] Reactor Summary for org.eclipse.ease.releng 0.9.0-SNAPSHOT:
09:40:00 [2022-02-01T14:40:00.946Z] [INFO] 
09:40:00 [2022-02-01T14:40:00.946Z] [INFO] org.eclipse.ease.releng ............................ SUCCESS [  0.002 s]
09:40:00 [2022-02-01T14:40:00.946Z] [INFO] org.eclipse.ease.releng.target ..................... SUCCESS [  0.192 s]
09:40:00 [2022-02-01T14:40:00.946Z] [INFO] org.eclipse.ease.test .............................. SUCCESS [ 25.052 s]
09:40:00 [2022-02-01T14:40:00.946Z] [INFO] org.eclipse.ease.lang.javascript.rhino.test ........ FAILURE [ 17.894 s]
09:40:00 [2022-02-01T14:40:00.946Z] [INFO] org.eclipse.ease.lang.javascript.test .............. SKIPPED
09:40:00 [2022-02-01T14:40:00.946Z] [INFO] org.eclipse.ease.lang.python.test .................. SKIPPED
09:40:00 [2022-02-01T14:40:00.946Z] [INFO] org.eclipse.ease.lang.python.jython.test ........... SKIPPED
09:40:00 [2022-02-01T14:40:00.946Z] [INFO] org.eclipse.ease.lang.scriptarchive.test ........... SKIPPED
09:40:00 [2022-02-01T14:40:00.946Z] [INFO] org.eclipse.ease.ui.test ........................... SKIPPED
09:40:00 [2022-02-01T14:40:00.946Z] [INFO] ------------------------------------------------------------------------
09:40:00 [2022-02-01T14:40:00.946Z] [INFO] BUILD FAILURE
09:40:00 [2022-02-01T14:40:00.946Z] [INFO] ------------------------------------------------------------------------
09:40:00 [2022-02-01T14:40:00.946Z] [INFO] Total time:  01:22 min
09:40:00 [2022-02-01T14:40:00.946Z] [INFO] Finished at: 2022-02-01T14:40:00Z
09:40:00 [2022-02-01T14:40:00.946Z] [INFO] ------------------------------------------------------------------------
09:40:00 [2022-02-01T14:40:00.946Z] [WARNING] [jenkins-event-spy] Unexpected Maven project file name 'target-tests-pom.xml', problems may occur
09:40:00 [2022-02-01T14:40:00.946Z] [INFO] [jenkins-event-spy] Generated /home/jenkins/agent/workspace/ease.verify.core.target.2019-06@tmp/withMaven348621a9/maven-spy-20220201-143838-24813793997480812622132.log
09:40:00 [2022-02-01T14:40:00.946Z] [ERROR] Failed to execute goal org.eclipse.tycho:tycho-surefire-plugin:2.2.0:test (default-test) on project org.eclipse.ease.lang.javascript.rhino.test: There are test failures.
09:40:00 [2022-02-01T14:40:00.946Z] [ERROR] 
09:40:00 [2022-02-01T14:40:00.946Z] [ERROR] Please refer to /home/jenkins/agent/workspace/ease.verify.core.target.2019-06/tests/org.eclipse.ease.lang.javascript.rhino.test/target/surefire-reports for the individual test results.
09:40:00 [2022-02-01T14:40:00.946Z] [ERROR] -> [Help 1]
09:40:00 [2022-02-01T14:40:00.946Z] [ERROR] 
09:40:00 [2022-02-01T14:40:00.946Z] [ERROR] To see the full stack trace of the errors, re-run Maven with the -e switch.
09:40:00 [2022-02-01T14:40:00.946Z] [ERROR] Re-run Maven using the -X switch to enable full debug logging.
09:40:00 [2022-02-01T14:40:00.946Z] [ERROR] 
09:40:00 [2022-02-01T14:40:00.946Z] [ERROR] For more information about the errors and possible solutions, please read the following articles:
09:40:00 [2022-02-01T14:40:00.946Z] [ERROR] [Help 1] http://cwiki.apache.org/confluence/display/MAVEN/MojoFailureException
09:40:00 [2022-02-01T14:40:00.946Z] [ERROR] 
09:40:00 [2022-02-01T14:40:00.946Z] [ERROR] After correcting the problems, you can resume the build with the command
09:40:00 [2022-02-01T14:40:00.946Z] [ERROR]   mvn <args> -rf :org.eclipse.ease.lang.javascript.rhino.test
[Pipeline] }
09:40:00 [2022-02-01T14:40:00.976Z] [withMaven] junitPublisher - Archive test results for Maven artifact org.eclipse.ease:org.eclipse.ease.test:eclipse-test-plugin:0.9.0-SNAPSHOT generated by tycho-surefire-plugin:test (default-test): tests/org.eclipse.ease.test/target/surefire-reports/*.xml
09:40:00 [2022-02-01T14:40:00.977Z] [withMaven] junitPublisher - Archive test results for Maven artifact org.eclipse.ease:org.eclipse.ease.lang.javascript.rhino.test:eclipse-test-plugin:0.9.0-SNAPSHOT generated by tycho-surefire-plugin:test (default-test): tests/org.eclipse.ease.lang.javascript.rhino.test/target/surefire-reports/*.xml
09:40:00 [2022-02-01T14:40:00.978Z] [withMaven] junitPublisher - Jenkins JUnit Attachments Plugin not found, can't publish test attachments.Recording test results
09:40:01 [2022-02-01T14:40:01.275Z] [withMaven] Jenkins JaCoCo Plugin not found, don't display org.jacoco:jacoco-maven-plugin:prepare-agent[-integration] results in pipeline screen.
09:40:01 [2022-02-01T14:40:01.280Z] [withMaven] Publishers: Pipeline Graph Publisher: 2 ms, Junit Publisher: 287 ms, Jacoco Publisher: 1 ms
[Pipeline] // withMaven
[Pipeline] }
[Pipeline] // stage
[Pipeline] stage
[Pipeline] { (Declarative: Post Actions)
[Pipeline] archiveArtifacts
09:40:01 [2022-02-01T14:40:01.330Z] Archiving artifacts
[Pipeline] emailext
09:40:30 [2022-02-01T14:40:30.745Z] Sending email to: christian.pontesegger@web.de
[Pipeline] }
[Pipeline] // stage
[Pipeline] }
[Pipeline] // timeout
[Pipeline] }
[Pipeline] // timestamps
[Pipeline] }
[Pipeline] // node
[Pipeline] End of Pipeline
ERROR: script returned exit code 1
Finished: FAILURE