Console Output

Skipping 703 KB.. Full Log
001 s
09:34:33 [2022-01-18T14:34:33.727Z] getExecutedFile_returns_script_resource  Time elapsed: 0 s
09:34:33 [2022-01-18T14:34:33.727Z] isFinished_equals_true_for_finished_engine  Time elapsed: 0.001 s
09:34:33 [2022-01-18T14:34:33.728Z] terminate_stops_running_engine  Time elapsed: 1.201 s
09:34:33 [2022-01-18T14:34:33.728Z] isFinished_equals_false_for_not_started_engine  Time elapsed: 0 s
09:34:33 [2022-01-18T14:34:33.728Z] isJob  Time elapsed: 0 s
09:34:33 [2022-01-18T14:34:33.728Z] getVariables_returns_all_buffered_variables  Time elapsed: 0 s
09:34:33 [2022-01-18T14:34:33.728Z] getVariable_is_null_for_non_existing_variable  Time elapsed: 0 s
09:34:33 [2022-01-18T14:34:33.728Z] setInputStream_to_null_resets_input_stream  Time elapsed: 0 s
09:34:33 [2022-01-18T14:34:33.728Z] getInputStream_defaults_to_system_in  Time elapsed: 0 s
09:34:33 [2022-01-18T14:34:33.728Z] getOutputStream_defaults_to_system_in  Time elapsed: 0 s
09:34:33 [2022-01-18T14:34:33.728Z] getStackTrace_returns_stack_of_size_1_during_execution  Time elapsed: 0.001 s
09:34:33 [2022-01-18T14:34:33.728Z] setOutputStream_changes_output_stream  Time elapsed: 0 s
09:34:33 [2022-01-18T14:34:33.728Z] getLaunch_is_null_by_default  Time elapsed: 0 s
09:34:33 [2022-01-18T14:34:33.728Z] setErrorStream_changes_error_stream  Time elapsed: 0.001 s
09:34:33 [2022-01-18T14:34:33.728Z] getMonitor_equals_null_for_not_started_engine  Time elapsed: 0 s
09:34:33 [2022-01-18T14:34:33.728Z] terminate_does_nothing_for_non_launched_engine  Time elapsed: 0 s
09:34:33 [2022-01-18T14:34:33.728Z] removeExecutionListener_removes_an_engine_listener  Time elapsed: 0.001 s
09:34:33 [2022-01-18T14:34:33.728Z] getStackTrace_returns_empty_trace_for_terminated_engine  Time elapsed: 1.001 s
09:34:33 [2022-01-18T14:34:33.728Z] addExecutionListener_adds_an_engine_listener  Time elapsed: 0.001 s
09:34:33 [2022-01-18T14:34:33.728Z] getExecutedFile_returns_null_for_dynamic_code  Time elapsed: 0.001 s
09:34:33 [2022-01-18T14:34:33.728Z] execute_schedules_script  Time elapsed: 0 s
09:34:33 [2022-01-18T14:34:33.728Z] hasVariable_is_true_when_variable_is_set  Time elapsed: 0 s
09:34:33 [2022-01-18T14:34:33.728Z] addSecurityCheck_adds_passing_check  Time elapsed: 0.001 s
09:34:33 [2022-01-18T14:34:33.728Z] getStackTrace_returns_empty_trace_for_fresh_engine  Time elapsed: 0 s
09:34:33 [2022-01-18T14:34:33.728Z] joinEngine_waits_for_x_ms  Time elapsed: 1.051 s
09:34:33 [2022-01-18T14:34:33.728Z] hasVariable_is_false_when_no_variable_is_set  Time elapsed: 0 s
09:34:33 [2022-01-18T14:34:33.728Z] getErrorStream_defaults_to_system_err  Time elapsed: 0 s
09:34:33 [2022-01-18T14:34:33.728Z] execute_processes_script_when_engine_is_started  Time elapsed: 0.001 s
09:34:33 [2022-01-18T14:34:33.728Z] setCloseStreamsOnTerminate_keeps_streams_open  Time elapsed: 0 s
09:34:33 [2022-01-18T14:34:33.728Z] getExecutedFile_returns_execution_root_file  Time elapsed: 0 s
09:34:33 [2022-01-18T14:34:33.728Z] joinEngine_waits_for_engine_to_terminate  Time elapsed: 1.051 s
09:34:33 [2022-01-18T14:34:33.728Z] execute_errorous_code_and_terminate  Time elapsed: 0.001 s
09:34:33 [2022-01-18T14:34:33.728Z] 
09:34:33 [2022-01-18T14:34:33.728Z] Results:
09:34:33 [2022-01-18T14:34:33.728Z] 
09:34:33 [2022-01-18T14:34:33.728Z] Tests run: 294, Failures: 0, Errors: 0, Skipped: 0
09:34:33 [2022-01-18T14:34:33.728Z] 
09:34:34 [2022-01-18T14:34:34.292Z] Job found still running after platform shutdown.  Jobs should be canceled by the plugin that scheduled them during shutdown: org.eclipse.ease.AbstractReplScriptEngineTest$MockedScriptEngine
09:34:34 [2022-01-18T14:34:34.292Z] Job found still running after platform shutdown.  Jobs should be canceled by the plugin that scheduled them during shutdown: org.eclipse.ease.AbstractReplScriptEngineTest$MockedScriptEngine
09:34:34 [2022-01-18T14:34:34.292Z] Job found still running after platform shutdown.  Jobs should be canceled by the plugin that scheduled them during shutdown: org.eclipse.ease.AbstractReplScriptEngineTest$MockedScriptEngine
09:34:34 [2022-01-18T14:34:34.292Z] [INFO] All tests passed!
09:34:34 [2022-01-18T14:34:34.292Z] [INFO] 
09:34:34 [2022-01-18T14:34:34.292Z] [INFO] --- maven-pmd-plugin:3.14.0:pmd (pmd-integration) @ org.eclipse.ease.test ---
09:34:34 [2022-01-18T14:34:34.292Z] [WARNING] Unable to exclude rules [JUnit5TestShouldBePackagePrivate] from ruleset reference category/java/bestpractices.xml; perhaps the rule name is misspelled or the rule doesn't exist anymore?
09:34:34 [2022-01-18T14:34:34.292Z] [WARNING] Unable to exclude rules [JUnit5TestShouldBePackagePrivate] from ruleset reference category/java/bestpractices.xml; perhaps the rule name is misspelled or the rule doesn't exist anymore?
09:34:35 [2022-01-18T14:34:35.671Z] [INFO] 
09:34:35 [2022-01-18T14:34:35.671Z] [INFO] --- maven-pmd-plugin:3.14.0:cpd (pmd-integration) @ org.eclipse.ease.test ---
09:34:35 [2022-01-18T14:34:35.671Z] [INFO] 
09:34:35 [2022-01-18T14:34:35.671Z] [INFO] --- spotbugs-maven-plugin:4.1.4:spotbugs (spotbugs-integration) @ org.eclipse.ease.test ---
09:34:35 [2022-01-18T14:34:35.671Z] [INFO] Fork Value is false
09:34:35 [2022-01-18T14:34:35.671Z]      [java] JVM args ignored when same JVM is used.
09:34:39 [2022-01-18T14:34:39.956Z] [INFO] Done SpotBugs Analysis....
09:34:39 [2022-01-18T14:34:39.956Z] [INFO] 
09:34:39 [2022-01-18T14:34:39.956Z] [INFO] --- maven-checkstyle-plugin:3.1.1:check (checkstyle-integration) @ org.eclipse.ease.test ---
09:34:39 [2022-01-18T14:34:39.956Z] [INFO] You have 0 Checkstyle violations.
09:34:39 [2022-01-18T14:34:39.956Z] [INFO] 
09:34:39 [2022-01-18T14:34:39.956Z] [INFO] --- maven-install-plugin:2.3.1:install (default-install) @ org.eclipse.ease.test ---
09:34:39 [2022-01-18T14:34:39.956Z] [INFO] Installing /home/jenkins/agent/workspace/ease.verify.core.target.2019-06/tests/org.eclipse.ease.test/target/org.eclipse.ease.test-0.9.0-SNAPSHOT.jar to /home/jenkins/.m2/repository/org/eclipse/ease/org.eclipse.ease.test/0.9.0-SNAPSHOT/org.eclipse.ease.test-0.9.0-SNAPSHOT.jar
09:34:39 [2022-01-18T14:34:39.956Z] [INFO] Installing /home/jenkins/agent/workspace/ease.verify.core.target.2019-06/tests/org.eclipse.ease.test/pom.xml to /home/jenkins/.m2/repository/org/eclipse/ease/org.eclipse.ease.test/0.9.0-SNAPSHOT/org.eclipse.ease.test-0.9.0-SNAPSHOT.pom
09:34:39 [2022-01-18T14:34:39.956Z] [INFO] Installing /home/jenkins/agent/workspace/ease.verify.core.target.2019-06/tests/org.eclipse.ease.test/target/p2content.xml to /home/jenkins/.m2/repository/org/eclipse/ease/org.eclipse.ease.test/0.9.0-SNAPSHOT/org.eclipse.ease.test-0.9.0-SNAPSHOT-p2metadata.xml
09:34:39 [2022-01-18T14:34:39.956Z] [INFO] Installing /home/jenkins/agent/workspace/ease.verify.core.target.2019-06/tests/org.eclipse.ease.test/target/p2artifacts.xml to /home/jenkins/.m2/repository/org/eclipse/ease/org.eclipse.ease.test/0.9.0-SNAPSHOT/org.eclipse.ease.test-0.9.0-SNAPSHOT-p2artifacts.xml
09:34:39 [2022-01-18T14:34:39.956Z] [INFO] 
09:34:39 [2022-01-18T14:34:39.956Z] [INFO] --- tycho-p2-plugin:2.2.0:update-local-index (default-update-local-index) @ org.eclipse.ease.test ---
09:34:39 [2022-01-18T14:34:39.956Z] [INFO] 
09:34:39 [2022-01-18T14:34:39.956Z] [INFO] ----< org.eclipse.ease:org.eclipse.ease.lang.javascript.rhino.test >----
09:34:39 [2022-01-18T14:34:39.956Z] [INFO] Building org.eclipse.ease.lang.javascript.rhino.test 0.9.0-SNAPSHOT [39/49]
09:34:39 [2022-01-18T14:34:39.956Z] [INFO] ------------------------[ eclipse-test-plugin ]-------------------------
09:34:39 [2022-01-18T14:34:39.956Z] [INFO] 
09:34:39 [2022-01-18T14:34:39.956Z] [INFO] --- maven-clean-plugin:2.5:clean (default-clean) @ org.eclipse.ease.lang.javascript.rhino.test ---
09:34:39 [2022-01-18T14:34:39.956Z] [INFO] 
09:34:39 [2022-01-18T14:34:39.957Z] [INFO] --- tycho-packaging-plugin:2.2.0:build-qualifier (default-build-qualifier) @ org.eclipse.ease.lang.javascript.rhino.test ---
09:34:39 [2022-01-18T14:34:39.957Z] [INFO] The project's OSGi version is 0.9.0.I202106220815
09:34:39 [2022-01-18T14:34:39.957Z] [INFO] 
09:34:39 [2022-01-18T14:34:39.957Z] [INFO] --- tycho-packaging-plugin:2.2.0:validate-id (default-validate-id) @ org.eclipse.ease.lang.javascript.rhino.test ---
09:34:39 [2022-01-18T14:34:39.957Z] [INFO] 
09:34:39 [2022-01-18T14:34:39.957Z] [INFO] --- tycho-packaging-plugin:2.2.0:validate-version (default-validate-version) @ org.eclipse.ease.lang.javascript.rhino.test ---
09:34:39 [2022-01-18T14:34:39.957Z] [INFO] 
09:34:39 [2022-01-18T14:34:39.957Z] [INFO] --- maven-resources-plugin:2.4.3:resources (default-resources) @ org.eclipse.ease.lang.javascript.rhino.test ---
09:34:39 [2022-01-18T14:34:39.957Z] [INFO] Using 'UTF-8' encoding to copy filtered resources.
09:34:39 [2022-01-18T14:34:39.957Z] [INFO] skip non existing resourceDirectory /home/jenkins/agent/workspace/ease.verify.core.target.2019-06/tests/org.eclipse.ease.lang.javascript.rhino.test/src/main/resources
09:34:39 [2022-01-18T14:34:39.957Z] [INFO] 
09:34:39 [2022-01-18T14:34:39.957Z] [INFO] --- tycho-compiler-plugin:2.2.0:compile (default-compile) @ org.eclipse.ease.lang.javascript.rhino.test ---
09:34:40 [2022-01-18T14:34:40.225Z] [INFO] Compiling 5 source files to /home/jenkins/agent/workspace/ease.verify.core.target.2019-06/tests/org.eclipse.ease.lang.javascript.rhino.test/target/classes
09:34:40 [2022-01-18T14:34:40.225Z] [INFO] 
09:34:40 [2022-01-18T14:34:40.226Z] [INFO] --- maven-resources-plugin:2.4.3:testResources (default-testResources) @ org.eclipse.ease.lang.javascript.rhino.test ---
09:34:40 [2022-01-18T14:34:40.226Z] [INFO] Using 'UTF-8' encoding to copy filtered resources.
09:34:40 [2022-01-18T14:34:40.226Z] [INFO] skip non existing resourceDirectory /home/jenkins/agent/workspace/ease.verify.core.target.2019-06/tests/org.eclipse.ease.lang.javascript.rhino.test/src/test/resources
09:34:40 [2022-01-18T14:34:40.226Z] [INFO] 
09:34:40 [2022-01-18T14:34:40.226Z] [INFO] --- target-platform-configuration:2.2.0:target-platform (default-target-platform) @ org.eclipse.ease.lang.javascript.rhino.test ---
09:34:40 [2022-01-18T14:34:40.226Z] [INFO] 
09:34:40 [2022-01-18T14:34:40.226Z] [INFO] --- tycho-packaging-plugin:2.2.0:package-plugin (default-package-plugin) @ org.eclipse.ease.lang.javascript.rhino.test ---
09:34:40 [2022-01-18T14:34:40.226Z] [INFO] Building jar: /home/jenkins/agent/workspace/ease.verify.core.target.2019-06/tests/org.eclipse.ease.lang.javascript.rhino.test/target/org.eclipse.ease.lang.javascript.rhino.test-0.9.0-SNAPSHOT.jar
09:34:40 [2022-01-18T14:34:40.529Z] [INFO] 
09:34:40 [2022-01-18T14:34:40.529Z] [INFO] --- tycho-p2-plugin:2.2.0:p2-metadata-default (default-p2-metadata-default) @ org.eclipse.ease.lang.javascript.rhino.test ---
09:34:40 [2022-01-18T14:34:40.529Z] [INFO] 
09:34:40 [2022-01-18T14:34:40.529Z] [INFO] --- jacoco-maven-plugin:0.8.6:prepare-agent (jacoco-initialize) @ org.eclipse.ease.lang.javascript.rhino.test ---
09:34:40 [2022-01-18T14:34:40.529Z] [INFO] tycho.testArgLine set to -javaagent:/home/jenkins/.m2/repository/org/jacoco/org.jacoco.agent/0.8.6/org.jacoco.agent-0.8.6-runtime.jar=destfile=/home/jenkins/agent/workspace/ease.verify.core.target.2019-06/tests/org.eclipse.ease.lang.javascript.rhino.test/target/jacoco.exec,output=file
09:34:40 [2022-01-18T14:34:40.529Z] [INFO] 
09:34:40 [2022-01-18T14:34:40.529Z] [INFO] --- tycho-surefire-plugin:2.2.0:test (default-test) @ org.eclipse.ease.lang.javascript.rhino.test ---
09:34:40 [2022-01-18T14:34:40.529Z] [INFO] Executing Test Runtime with timeout 0, logs (if any) will be placed at: /home/jenkins/agent/workspace/ease.verify.core.target.2019-06/tests/org.eclipse.ease.lang.javascript.rhino.test/target/work/data/.metadata/.log
09:34:40 [2022-01-18T14:34:40.529Z] [INFO] Command line:
09:34:40 [2022-01-18T14:34:40.530Z] 	[/opt/tools/java/openjdk/jdk-15/15.0.2+7/bin/java, -Dosgi.noShutdown=false, -Dosgi.os=linux, -Dosgi.ws=gtk, -Dosgi.arch=x86_64, -javaagent:/home/jenkins/.m2/repository/org/jacoco/org.jacoco.agent/0.8.6/org.jacoco.agent-0.8.6-runtime.jar=destfile=/home/jenkins/agent/workspace/ease.verify.core.target.2019-06/tests/org.eclipse.ease.lang.javascript.rhino.test/target/jacoco.exec,output=file, -Dosgi.clean=true, -jar, /home/jenkins/.m2/repository/p2/osgi/bundle/org.eclipse.equinox.launcher/1.6.300.v20210813-1054/org.eclipse.equinox.launcher-1.6.300.v20210813-1054.jar, -data, /home/jenkins/agent/workspace/ease.verify.core.target.2019-06/tests/org.eclipse.ease.lang.javascript.rhino.test/target/work/data, -install, /home/jenkins/agent/workspace/ease.verify.core.target.2019-06/tests/org.eclipse.ease.lang.javascript.rhino.test/target/work, -configuration, /home/jenkins/agent/workspace/ease.verify.core.target.2019-06/tests/org.eclipse.ease.lang.javascript.rhino.test/target/work/configuration, -application, org.eclipse.tycho.surefire.osgibooter.headlesstest, -testproperties, /home/jenkins/agent/workspace/ease.verify.core.target.2019-06/tests/org.eclipse.ease.lang.javascript.rhino.test/target/surefire.properties]
09:34:40 [2022-01-18T14:34:40.530Z] Picked up JAVA_TOOL_OPTIONS: -Dmaven.ext.class.path="/home/jenkins/agent/workspace/ease.verify.core.target.2019-06@tmp/withMaven179a7c8c/pipeline-maven-spy.jar" -Dorg.jenkinsci.plugins.pipeline.maven.reportsFolder="/home/jenkins/agent/workspace/ease.verify.core.target.2019-06@tmp/withMaven179a7c8c" 
09:34:43 [2022-01-18T14:34:43.931Z] Running org.eclipse.ease.lang.javascript.rhino.RhinoScriptEngineTest
09:34:44 [2022-01-18T14:34:44.188Z] org.eclipse.ease.ScriptExecutionException: JavaError: java.lang.Exception
09:34:44 [2022-01-18T14:34:44.188Z] 	at <unknown source>
09:34:44 [2022-01-18T14:34:44.188Z] 
09:34:44 [2022-01-18T14:34:44.188Z] Java Stacktrace:
09:34:44 [2022-01-18T14:34:44.188Z] java.lang.Exception
09:34:44 [2022-01-18T14:34:44.188Z] 	at java.base/jdk.internal.reflect.NativeConstructorAccessorImpl.newInstance0(Native Method)
09:34:44 [2022-01-18T14:34:44.188Z] 	at java.base/jdk.internal.reflect.NativeConstructorAccessorImpl.newInstance(NativeConstructorAccessorImpl.java:64)
09:34:44 [2022-01-18T14:34:44.188Z] 	at java.base/jdk.internal.reflect.DelegatingConstructorAccessorImpl.newInstance(DelegatingConstructorAccessorImpl.java:45)
09:34:44 [2022-01-18T14:34:44.188Z] 	at java.base/java.lang.reflect.Constructor.newInstanceWithCaller(Constructor.java:500)
09:34:44 [2022-01-18T14:34:44.188Z] 	at java.base/java.lang.reflect.Constructor.newInstance(Constructor.java:481)
09:34:44 [2022-01-18T14:34:44.188Z] 	at org.mozilla.javascript.MemberBox.newInstance(MemberBox.java:159)
09:34:44 [2022-01-18T14:34:44.188Z] 	at org.mozilla.javascript.NativeJavaClass.constructInternal(NativeJavaClass.java:266)
09:34:44 [2022-01-18T14:34:44.188Z] 	at org.mozilla.javascript.NativeJavaClass.constructSpecific(NativeJavaClass.java:205)
09:34:44 [2022-01-18T14:34:44.189Z] 	at org.mozilla.javascript.NativeJavaClass.construct(NativeJavaClass.java:166)
09:34:44 [2022-01-18T14:34:44.189Z] 	at org.mozilla.javascript.ScriptRuntime.newObject(ScriptRuntime.java:2655)
09:34:44 [2022-01-18T14:34:44.189Z] 	at org.mozilla.javascript.gen.c_9._c_script_0(Unknown Source)
09:34:44 [2022-01-18T14:34:44.189Z] 	at org.mozilla.javascript.gen.c_9.call(Unknown Source)
09:34:44 [2022-01-18T14:34:44.189Z] 	at org.mozilla.javascript.ContextFactory.doTopCall(ContextFactory.java:405)
09:34:44 [2022-01-18T14:34:44.189Z] 	at org.mozilla.javascript.ScriptRuntime.doTopCall(ScriptRuntime.java:3508)
09:34:44 [2022-01-18T14:34:44.189Z] 	at org.mozilla.javascript.gen.c_9.call(Unknown Source)
09:34:44 [2022-01-18T14:34:44.189Z] 	at org.mozilla.javascript.gen.c_9.exec(Unknown Source)
09:34:44 [2022-01-18T14:34:44.189Z] 	at org.mozilla.javascript.Context.evaluateReader(Context.java:1293)
09:34:44 [2022-01-18T14:34:44.189Z] 	at org.eclipse.ease.lang.javascript.rhino.RhinoScriptEngine.internalExecute(RhinoScriptEngine.java:226)
09:34:44 [2022-01-18T14:34:44.189Z] 	at org.eclipse.ease.lang.javascript.rhino.RhinoScriptEngine.execute(RhinoScriptEngine.java:205)
09:34:44 [2022-01-18T14:34:44.189Z] 	at org.eclipse.ease.AbstractScriptEngine.inject(AbstractScriptEngine.java:190)
09:34:44 [2022-01-18T14:34:44.189Z] 	at org.eclipse.ease.AbstractScriptEngine.run(AbstractScriptEngine.java:243)
09:34:44 [2022-01-18T14:34:44.189Z] 	at org.eclipse.core.internal.jobs.Worker.run(Worker.java:63)
09:34:44 [2022-01-18T14:34:44.189Z] org.eclipse.ease.ScriptExecutionException: ScriptException: test
09:34:44 [2022-01-18T14:34:44.189Z] 	at <unknown source>
09:34:44 [2022-01-18T14:34:44.445Z] org.eclipse.ease.ScriptExecutionException: ScriptException: JavaScript
09:34:44 [2022-01-18T14:34:44.446Z] 	at <unknown source>
09:34:44 [2022-01-18T14:34:44.446Z] org.eclipse.ease.ScriptExecutionException: SyntaxError: unterminated string literal (#1)
09:34:44 [2022-01-18T14:34:44.446Z] 'asdf
09:34:44 [2022-01-18T14:34:44.446Z]     ^
09:34:44 [2022-01-18T14:34:44.446Z] 	at <unknown source>
09:34:44 [2022-01-18T14:34:44.446Z] org.eclipse.ease.ScriptExecutionException: TypeError: Cannot call method "foobar" of undefined
09:34:44 [2022-01-18T14:34:44.446Z] 	at <unknown source>
09:34:44 [2022-01-18T14:34:44.446Z] org.eclipse.ease.ScriptExecutionException: JavaError: NotThere cannot be found by org.mozilla.javascript_1.7.10.v20190430-1943
09:34:44 [2022-01-18T14:34:44.446Z] 	at <unknown source>
09:34:44 [2022-01-18T14:34:44.446Z] 
09:34:44 [2022-01-18T14:34:44.446Z] Java Stacktrace:
09:34:44 [2022-01-18T14:34:44.446Z] java.lang.ClassNotFoundException: NotThere cannot be found by org.mozilla.javascript_1.7.10.v20190430-1943
09:34:44 [2022-01-18T14:34:44.446Z] 	at org.eclipse.osgi.internal.loader.BundleLoader.findClass(BundleLoader.java:506)
09:34:44 [2022-01-18T14:34:44.446Z] 	at org.eclipse.osgi.internal.loader.ModuleClassLoader.loadClass(ModuleClassLoader.java:170)
09:34:44 [2022-01-18T14:34:44.446Z] 	at java.base/java.lang.ClassLoader.loadClass(ClassLoader.java:522)
09:34:44 [2022-01-18T14:34:44.446Z] 	at java.base/java.lang.Class.forName0(Native Method)
09:34:44 [2022-01-18T14:34:44.446Z] 	at java.base/java.lang.Class.forName(Class.java:377)
09:34:44 [2022-01-18T14:34:44.446Z] 	at java.base/jdk.internal.reflect.NativeMethodAccessorImpl.invoke0(Native Method)
09:34:44 [2022-01-18T14:34:44.446Z] 	at java.base/jdk.internal.reflect.NativeMethodAccessorImpl.invoke(NativeMethodAccessorImpl.java:64)
09:34:44 [2022-01-18T14:34:44.446Z] 	at java.base/jdk.internal.reflect.DelegatingMethodAccessorImpl.invoke(DelegatingMethodAccessorImpl.java:43)
09:34:44 [2022-01-18T14:34:44.446Z] 	at java.base/java.lang.reflect.Method.invoke(Method.java:564)
09:34:44 [2022-01-18T14:34:44.446Z] 	at org.mozilla.javascript.MemberBox.invoke(MemberBox.java:126)
09:34:44 [2022-01-18T14:34:44.446Z] 	at org.mozilla.javascript.NativeJavaMethod.call(NativeJavaMethod.java:225)
09:34:44 [2022-01-18T14:34:44.446Z] 	at org.mozilla.javascript.optimizer.OptRuntime.call1(OptRuntime.java:32)
09:34:44 [2022-01-18T14:34:44.446Z] 	at org.mozilla.javascript.gen.c_32._c_script_0(Unknown Source)
09:34:44 [2022-01-18T14:34:44.446Z] 	at org.mozilla.javascript.gen.c_32.call(Unknown Source)
09:34:44 [2022-01-18T14:34:44.446Z] 	at org.mozilla.javascript.ContextFactory.doTopCall(ContextFactory.java:405)
09:34:44 [2022-01-18T14:34:44.446Z] 	at org.mozilla.javascript.ScriptRuntime.doTopCall(ScriptRuntime.java:3508)
09:34:44 [2022-01-18T14:34:44.446Z] 	at org.mozilla.javascript.gen.c_32.call(Unknown Source)
09:34:44 [2022-01-18T14:34:44.446Z] 	at org.mozilla.javascript.gen.c_32.exec(Unknown Source)
09:34:44 [2022-01-18T14:34:44.446Z] 	at org.mozilla.javascript.Context.evaluateReader(Context.java:1293)
09:34:44 [2022-01-18T14:34:44.446Z] 	at org.eclipse.ease.lang.javascript.rhino.RhinoScriptEngine.internalExecute(RhinoScriptEngine.java:226)
09:34:44 [2022-01-18T14:34:44.446Z] 	at org.eclipse.ease.lang.javascript.rhino.RhinoScriptEngine.execute(RhinoScriptEngine.java:205)
09:34:44 [2022-01-18T14:34:44.446Z] 	at org.eclipse.ease.AbstractScriptEngine.inject(AbstractScriptEngine.java:190)
09:34:44 [2022-01-18T14:34:44.446Z] 	at org.eclipse.ease.AbstractScriptEngine.run(AbstractScriptEngine.java:243)
09:34:44 [2022-01-18T14:34:44.446Z] 	at org.eclipse.core.internal.jobs.Worker.run(Worker.java:63)
09:34:44 [2022-01-18T14:34:44.446Z] Tests run: 11, Failures: 0, Errors: 0, Skipped: 0, Time elapsed: 0.669 s - in org.eclipse.ease.lang.javascript.rhino.RhinoScriptEngineTest
09:34:44 [2022-01-18T14:34:44.446Z] execute_java_class_instantiation  Time elapsed: 0.311 s
09:34:44 [2022-01-18T14:34:44.446Z] execute_environment_module_code_with_optional_parameters  Time elapsed: 0.033 s
09:34:44 [2022-01-18T14:34:44.446Z] execute_throws_java_exception  Time elapsed: 0.059 s
09:34:44 [2022-01-18T14:34:44.446Z] execute_throws_java_class  Time elapsed: 0.028 s
09:34:44 [2022-01-18T14:34:44.446Z] execute_javascript_assignment  Time elapsed: 0.023 s
09:34:44 [2022-01-18T14:34:44.446Z] execute_eclipse_class_instantiation  Time elapsed: 0.054 s
09:34:44 [2022-01-18T14:34:44.446Z] execute_throws_javascript_object  Time elapsed: 0.021 s
09:34:44 [2022-01-18T14:34:44.446Z] execute_throws_syntax_error  Time elapsed: 0.022 s
09:34:44 [2022-01-18T14:34:44.446Z] execute_throws_javascript_runtime_error  Time elapsed: 0.043 s
09:34:44 [2022-01-18T14:34:44.446Z] execute_environment_module_code  Time elapsed: 0.017 s
09:34:44 [2022-01-18T14:34:44.446Z] execute_throws_wrapped_java_exception  Time elapsed: 0.021 s
09:34:44 [2022-01-18T14:34:44.446Z] Running org.eclipse.ease.lang.javascript.rhino.RhinoEnvironmentTest
09:34:45 [2022-01-18T14:34:45.031Z] Tests run: 5, Failures: 0, Errors: 0, Skipped: 0, Time elapsed: 0.49 s - in org.eclipse.ease.lang.javascript.rhino.RhinoEnvironmentTest
09:34:45 [2022-01-18T14:34:45.031Z] reloadEnvironment  Time elapsed: 0.05 s
09:34:45 [2022-01-18T14:34:45.031Z] bootstrappedEnvironment  Time elapsed: 0.016 s
09:34:45 [2022-01-18T14:34:45.031Z] postMethodCallback  Time elapsed: 0.365 s
09:34:45 [2022-01-18T14:34:45.031Z] preMethodCallback  Time elapsed: 0.026 s
09:34:45 [2022-01-18T14:34:45.031Z] reloadFunctionDefinitions  Time elapsed: 0.03 s
09:34:45 [2022-01-18T14:34:45.031Z] Running org.eclipse.ease.lang.javascript.rhino.RhinoDebuggerEngineTest
09:34:45 [2022-01-18T14:34:45.289Z] org.eclipse.ease.ScriptExecutionException: JavaError: java.lang.Exception
09:34:45 [2022-01-18T14:34:45.289Z] 
09:34:45 [2022-01-18T14:34:45.289Z] Java Stacktrace:
09:34:45 [2022-01-18T14:34:45.289Z] java.lang.Exception
09:34:45 [2022-01-18T14:34:45.289Z] 	at java.base/jdk.internal.reflect.NativeConstructorAccessorImpl.newInstance0(Native Method)
09:34:45 [2022-01-18T14:34:45.289Z] 	at java.base/jdk.internal.reflect.NativeConstructorAccessorImpl.newInstance(NativeConstructorAccessorImpl.java:64)
09:34:45 [2022-01-18T14:34:45.289Z] 	at java.base/jdk.internal.reflect.DelegatingConstructorAccessorImpl.newInstance(DelegatingConstructorAccessorImpl.java:45)
09:34:45 [2022-01-18T14:34:45.289Z] 	at java.base/java.lang.reflect.Constructor.newInstanceWithCaller(Constructor.java:500)
09:34:45 [2022-01-18T14:34:45.289Z] 	at java.base/java.lang.reflect.Constructor.newInstance(Constructor.java:481)
09:34:45 [2022-01-18T14:34:45.289Z] 	at org.mozilla.javascript.MemberBox.newInstance(MemberBox.java:159)
09:34:45 [2022-01-18T14:34:45.289Z] 	at org.mozilla.javascript.NativeJavaClass.constructInternal(NativeJavaClass.java:266)
09:34:45 [2022-01-18T14:34:45.289Z] 	at org.mozilla.javascript.NativeJavaClass.constructSpecific(NativeJavaClass.java:205)
09:34:45 [2022-01-18T14:34:45.289Z] 	at org.mozilla.javascript.NativeJavaClass.construct(NativeJavaClass.java:166)
09:34:45 [2022-01-18T14:34:45.289Z] 	at org.mozilla.javascript.Interpreter.interpretLoop(Interpreter.java:1617)
09:34:45 [2022-01-18T14:34:45.289Z] 	at org.mozilla.javascript.Interpreter.interpret(Interpreter.java:911)
09:34:45 [2022-01-18T14:34:45.289Z] 	at org.mozilla.javascript.InterpretedFunction.call(InterpretedFunction.java:109)
09:34:45 [2022-01-18T14:34:45.289Z] 	at org.mozilla.javascript.ContextFactory.doTopCall(ContextFactory.java:405)
09:34:45 [2022-01-18T14:34:45.289Z] 	at org.mozilla.javascript.ScriptRuntime.doTopCall(ScriptRuntime.java:3508)
09:34:45 [2022-01-18T14:34:45.289Z] 	at org.mozilla.javascript.InterpretedFunction.exec(InterpretedFunction.java:120)
09:34:45 [2022-01-18T14:34:45.289Z] 	at org.mozilla.javascript.Context.evaluateReader(Context.java:1293)
09:34:45 [2022-01-18T14:34:45.289Z] 	at org.eclipse.ease.lang.javascript.rhino.RhinoScriptEngine.internalExecute(RhinoScriptEngine.java:226)
09:34:45 [2022-01-18T14:34:45.289Z] 	at org.eclipse.ease.lang.javascript.rhino.RhinoScriptEngine.execute(RhinoScriptEngine.java:205)
09:34:45 [2022-01-18T14:34:45.289Z] 	at org.eclipse.ease.AbstractScriptEngine.inject(AbstractScriptEngine.java:190)
09:34:45 [2022-01-18T14:34:45.289Z] 	at org.eclipse.ease.AbstractScriptEngine.run(AbstractScriptEngine.java:243)
09:34:45 [2022-01-18T14:34:45.290Z] 	at org.eclipse.core.internal.jobs.Worker.run(Worker.java:63)
09:34:45 [2022-01-18T14:34:45.290Z] org.eclipse.ease.ScriptExecutionException: ScriptException: test
09:34:45 [2022-01-18T14:34:45.290Z] org.eclipse.ease.ScriptExecutionException: ScriptException: JavaScript
09:34:45 [2022-01-18T14:34:45.290Z] org.eclipse.ease.ScriptExecutionException: SyntaxError: unterminated string literal (#1)
09:34:45 [2022-01-18T14:34:45.290Z] 'asdf
09:34:45 [2022-01-18T14:34:45.290Z]     ^
09:34:45 [2022-01-18T14:34:45.290Z] 	at <unknown source>:1
09:34:45 [2022-01-18T14:34:45.290Z] org.eclipse.ease.ScriptExecutionException: TypeError: Cannot call method "foobar" of undefined
09:34:45 [2022-01-18T14:34:45.290Z] org.eclipse.ease.ScriptExecutionException: JavaError: NotThere cannot be found by org.mozilla.javascript_1.7.10.v20190430-1943
09:34:45 [2022-01-18T14:34:45.290Z] 
09:34:45 [2022-01-18T14:34:45.290Z] Java Stacktrace:
09:34:45 [2022-01-18T14:34:45.290Z] java.lang.ClassNotFoundException: NotThere cannot be found by org.mozilla.javascript_1.7.10.v20190430-1943
09:34:45 [2022-01-18T14:34:45.290Z] 	at org.eclipse.osgi.internal.loader.BundleLoader.findClass(BundleLoader.java:506)
09:34:45 [2022-01-18T14:34:45.290Z] 	at org.eclipse.osgi.internal.loader.ModuleClassLoader.loadClass(ModuleClassLoader.java:170)
09:34:45 [2022-01-18T14:34:45.290Z] 	at java.base/java.lang.ClassLoader.loadClass(ClassLoader.java:522)
09:34:45 [2022-01-18T14:34:45.290Z] 	at java.base/java.lang.Class.forName0(Native Method)
09:34:45 [2022-01-18T14:34:45.290Z] 	at java.base/java.lang.Class.forName(Class.java:377)
09:34:45 [2022-01-18T14:34:45.290Z] 	at java.base/jdk.internal.reflect.NativeMethodAccessorImpl.invoke0(Native Method)
09:34:45 [2022-01-18T14:34:45.290Z] 	at java.base/jdk.internal.reflect.NativeMethodAccessorImpl.invoke(NativeMethodAccessorImpl.java:64)
09:34:45 [2022-01-18T14:34:45.290Z] 	at java.base/jdk.internal.reflect.DelegatingMethodAccessorImpl.invoke(DelegatingMethodAccessorImpl.java:43)
09:34:45 [2022-01-18T14:34:45.290Z] 	at java.base/java.lang.reflect.Method.invoke(Method.java:564)
09:34:45 [2022-01-18T14:34:45.290Z] 	at org.mozilla.javascript.MemberBox.invoke(MemberBox.java:126)
09:34:45 [2022-01-18T14:34:45.290Z] 	at org.mozilla.javascript.NativeJavaMethod.call(NativeJavaMethod.java:225)
09:34:45 [2022-01-18T14:34:45.290Z] 	at org.mozilla.javascript.Interpreter.interpretLoop(Interpreter.java:1573)
09:34:45 [2022-01-18T14:34:45.290Z] 	at org.mozilla.javascript.Interpreter.interpret(Interpreter.java:911)
09:34:45 [2022-01-18T14:34:45.290Z] 	at org.mozilla.javascript.InterpretedFunction.call(InterpretedFunction.java:109)
09:34:45 [2022-01-18T14:34:45.290Z] 	at org.mozilla.javascript.ContextFactory.doTopCall(ContextFactory.java:405)
09:34:45 [2022-01-18T14:34:45.290Z] 	at org.mozilla.javascript.ScriptRuntime.doTopCall(ScriptRuntime.java:3508)
09:34:45 [2022-01-18T14:34:45.290Z] 	at org.mozilla.javascript.InterpretedFunction.exec(InterpretedFunction.java:120)
09:34:45 [2022-01-18T14:34:45.290Z] 	at org.mozilla.javascript.Context.evaluateReader(Context.java:1293)
09:34:45 [2022-01-18T14:34:45.290Z] 	at org.eclipse.ease.lang.javascript.rhino.RhinoScriptEngine.internalExecute(RhinoScriptEngine.java:226)
09:34:45 [2022-01-18T14:34:45.290Z] 	at org.eclipse.ease.lang.javascript.rhino.RhinoScriptEngine.execute(RhinoScriptEngine.java:205)
09:34:45 [2022-01-18T14:34:45.290Z] 	at org.eclipse.ease.AbstractScriptEngine.inject(AbstractScriptEngine.java:190)
09:34:45 [2022-01-18T14:34:45.290Z] 	at org.eclipse.ease.AbstractScriptEngine.run(AbstractScriptEngine.java:243)
09:34:45 [2022-01-18T14:34:45.290Z] 	at org.eclipse.core.internal.jobs.Worker.run(Worker.java:63)
09:34:45 [2022-01-18T14:34:45.290Z] org.eclipse.ease.ScriptExecutionException: TypeError: Cannot call method "substr" of null
09:34:45 [2022-01-18T14:34:45.290Z] 	at mainFile.js,throwOnNull():4
09:34:45 [2022-01-18T14:34:45.290Z] 	at includeFile.js,subCall():2
09:34:45 [2022-01-18T14:34:45.290Z] 	at mainFile.js:7
09:34:45 [2022-01-18T14:34:45.290Z] Tests run: 12, Failures: 0, Errors: 0, Skipped: 0, Time elapsed: 0.366 s - in org.eclipse.ease.lang.javascript.rhino.RhinoDebuggerEngineTest
09:34:45 [2022-01-18T14:34:45.290Z] execute_java_class_instantiation  Time elapsed: 0.115 s
09:34:45 [2022-01-18T14:34:45.290Z] execute_environment_module_code_with_optional_parameters  Time elapsed: 0.045 s
09:34:45 [2022-01-18T14:34:45.290Z] execute_throws_java_exception  Time elapsed: 0.019 s
09:34:45 [2022-01-18T14:34:45.290Z] execute_throws_java_class  Time elapsed: 0.017 s
09:34:45 [2022-01-18T14:34:45.290Z] execute_javascript_assignment  Time elapsed: 0.015 s
09:34:45 [2022-01-18T14:34:45.290Z] execute_eclipse_class_instantiation  Time elapsed: 0.044 s
09:34:45 [2022-01-18T14:34:45.290Z] execute_throws_javascript_object  Time elapsed: 0.013 s
09:34:45 [2022-01-18T14:34:45.290Z] execute_throws_syntax_error  Time elapsed: 0.013 s
09:34:45 [2022-01-18T14:34:45.290Z] execute_throws_javascript_runtime_error  Time elapsed: 0.014 s
09:34:45 [2022-01-18T14:34:45.290Z] execute_environment_module_code  Time elapsed: 0.015 s
09:34:45 [2022-01-18T14:34:45.290Z] execute_throws_wrapped_java_exception  Time elapsed: 0.012 s
09:34:45 [2022-01-18T14:34:45.291Z] getExceptionStackTrace_returns_script_trace_over_multiple_files  Time elapsed: 0.04 s
09:34:45 [2022-01-18T14:34:45.291Z] Running org.eclipse.ease.lang.javascript.rhino.RhinoDebugTest
09:34:45 [2022-01-18T14:34:45.548Z] Start of script
09:34:45 [2022-01-18T14:34:45.548Z] include file start
09:34:45 [2022-01-18T14:34:45.548Z] Include file processed
09:34:45 [2022-01-18T14:34:45.548Z] line after include file
09:34:45 [2022-01-18T14:34:45.548Z] Result of testMethod = 5
09:34:45 [2022-01-18T14:34:45.548Z] End of script
09:34:45 [2022-01-18T14:34:45.805Z] Start of script
09:34:45 [2022-01-18T14:34:45.805Z] include file start
09:34:45 [2022-01-18T14:34:45.805Z] Include file processed
09:34:45 [2022-01-18T14:34:45.805Z] line after include file
09:34:45 [2022-01-18T14:34:45.805Z] Result of testMethod = 5
09:34:45 [2022-01-18T14:34:45.805Z] End of script
09:34:45 [2022-01-18T14:34:45.805Z] Start of script
09:34:45 [2022-01-18T14:34:45.805Z] include file start
09:34:45 [2022-01-18T14:34:45.805Z] Include file processed
09:34:45 [2022-01-18T14:34:45.805Z] line after include file
09:34:45 [2022-01-18T14:34:45.805Z] Result of testMethod = 5
09:34:46 [2022-01-18T14:34:46.062Z] org.eclipse.ease.ScriptEngineCancellationException: Terminated on user request
09:34:46 [2022-01-18T14:34:46.062Z] 	at org.eclipse.ease.debugging.AbstractEaseDebugger.handleEventsInSuspendedState(AbstractEaseDebugger.java:331)
09:34:46 [2022-01-18T14:34:46.062Z] 	at org.eclipse.ease.debugging.AbstractEaseDebugger.suspend(AbstractEaseDebugger.java:257)
09:34:46 [2022-01-18T14:34:46.062Z] 	at org.eclipse.ease.debugging.AbstractEaseDebugger.processLine(AbstractEaseDebugger.java:492)
09:34:46 [2022-01-18T14:34:46.062Z] 	at org.eclipse.ease.lang.javascript.rhino.debugger.RhinoDebugger.access$4(RhinoDebugger.java:1)
09:34:46 [2022-01-18T14:34:46.062Z] 	at org.eclipse.ease.lang.javascript.rhino.debugger.RhinoDebugger$RhinoDebugFrame.onLineChange(RhinoDebugger.java:124)
09:34:46 [2022-01-18T14:34:46.062Z] 	at org.mozilla.javascript.Interpreter.interpretLoop(Interpreter.java:1931)
09:34:46 [2022-01-18T14:34:46.062Z] 	at org.mozilla.javascript.Interpreter.interpret(Interpreter.java:911)
09:34:46 [2022-01-18T14:34:46.062Z] 	at org.mozilla.javascript.InterpretedFunction.call(InterpretedFunction.java:109)
09:34:46 [2022-01-18T14:34:46.062Z] 	at org.mozilla.javascript.ContextFactory.doTopCall(ContextFactory.java:405)
09:34:46 [2022-01-18T14:34:46.062Z] 	at org.mozilla.javascript.ScriptRuntime.doTopCall(ScriptRuntime.java:3508)
09:34:46 [2022-01-18T14:34:46.062Z] 	at org.mozilla.javascript.InterpretedFunction.exec(InterpretedFunction.java:120)
09:34:46 [2022-01-18T14:34:46.062Z] 	at org.mozilla.javascript.Context.evaluateReader(Context.java:1293)
09:34:46 [2022-01-18T14:34:46.062Z] 	at org.eclipse.ease.lang.javascript.rhino.RhinoScriptEngine.internalExecute(RhinoScriptEngine.java:226)
09:34:46 [2022-01-18T14:34:46.062Z] 	at org.eclipse.ease.lang.javascript.rhino.RhinoScriptEngine.execute(RhinoScriptEngine.java:205)
09:34:46 [2022-01-18T14:34:46.062Z] 	at org.eclipse.ease.AbstractScriptEngine.inject(AbstractScriptEngine.java:190)
09:34:46 [2022-01-18T14:34:46.062Z] 	at org.eclipse.ease.AbstractScriptEngine.run(AbstractScriptEngine.java:243)
09:34:46 [2022-01-18T14:34:46.062Z] 	at org.eclipse.core.internal.jobs.Worker.run(Worker.java:63)
09:34:46 [2022-01-18T14:34:46.319Z] Start of script
09:34:46 [2022-01-18T14:34:46.319Z] include file start
09:34:46 [2022-01-18T14:34:46.319Z] Include file processed
09:34:46 [2022-01-18T14:34:46.319Z] line after include file
09:34:46 [2022-01-18T14:34:46.319Z] Result of testMethod = 5
09:34:46 [2022-01-18T14:34:46.319Z] End of script
09:34:46 [2022-01-18T14:34:46.575Z] Start of script
09:34:46 [2022-01-18T14:34:46.575Z] include file start
09:34:46 [2022-01-18T14:34:46.575Z] Include file processed
09:34:46 [2022-01-18T14:34:46.575Z] line after include file
09:34:46 [2022-01-18T14:34:46.575Z] Result of testMethod = 5
09:34:46 [2022-01-18T14:34:46.575Z] End of script
09:34:46 [2022-01-18T14:34:46.845Z] Start of script
09:34:46 [2022-01-18T14:34:46.845Z] include file start
09:34:46 [2022-01-18T14:34:46.845Z] Include file processed
09:34:46 [2022-01-18T14:34:46.845Z] line after include file
09:34:46 [2022-01-18T14:34:46.845Z] Result of testMethod = 5
09:34:46 [2022-01-18T14:34:46.845Z] End of script
09:34:47 [2022-01-18T14:34:47.102Z] Start of script
09:34:47 [2022-01-18T14:34:47.102Z] include file start
09:34:47 [2022-01-18T14:34:47.102Z] Include file processed
09:34:47 [2022-01-18T14:34:47.102Z] line after include file
09:34:47 [2022-01-18T14:34:47.102Z] Result of testMethod = 5
09:34:47 [2022-01-18T14:34:47.102Z] org.eclipse.ease.ScriptEngineCancellationException: Terminated on user request
09:34:47 [2022-01-18T14:34:47.102Z] 	at org.eclipse.ease.debugging.AbstractEaseDebugger.handleEventsInSuspendedState(AbstractEaseDebugger.java:331)
09:34:47 [2022-01-18T14:34:47.102Z] 	at org.eclipse.ease.debugging.AbstractEaseDebugger.suspend(AbstractEaseDebugger.java:257)
09:34:47 [2022-01-18T14:34:47.102Z] 	at org.eclipse.ease.debugging.AbstractEaseDebugger.processLine(AbstractEaseDebugger.java:492)
09:34:47 [2022-01-18T14:34:47.102Z] 	at org.eclipse.ease.lang.javascript.rhino.debugger.RhinoDebugger.access$4(RhinoDebugger.java:1)
09:34:47 [2022-01-18T14:34:47.102Z] 	at org.eclipse.ease.lang.javascript.rhino.debugger.RhinoDebugger$RhinoDebugFrame.onLineChange(RhinoDebugger.java:124)
09:34:47 [2022-01-18T14:34:47.102Z] 	at org.mozilla.javascript.Interpreter.interpretLoop(Interpreter.java:1931)
09:34:47 [2022-01-18T14:34:47.102Z] 	at org.mozilla.javascript.Interpreter.interpret(Interpreter.java:911)
09:34:47 [2022-01-18T14:34:47.102Z] 	at org.mozilla.javascript.InterpretedFunction.call(InterpretedFunction.java:109)
09:34:47 [2022-01-18T14:34:47.102Z] 	at org.mozilla.javascript.ContextFactory.doTopCall(ContextFactory.java:405)
09:34:47 [2022-01-18T14:34:47.102Z] 	at org.mozilla.javascript.ScriptRuntime.doTopCall(ScriptRuntime.java:3508)
09:34:47 [2022-01-18T14:34:47.102Z] 	at org.mozilla.javascript.InterpretedFunction.exec(InterpretedFunction.java:120)
09:34:47 [2022-01-18T14:34:47.102Z] 	at org.mozilla.javascript.Context.evaluateReader(Context.java:1293)
09:34:47 [2022-01-18T14:34:47.102Z] 	at org.eclipse.ease.lang.javascript.rhino.RhinoScriptEngine.internalExecute(RhinoScriptEngine.java:226)
09:34:47 [2022-01-18T14:34:47.102Z] 	at org.eclipse.ease.lang.javascript.rhino.RhinoScriptEngine.execute(RhinoScriptEngine.java:205)
09:34:47 [2022-01-18T14:34:47.102Z] 	at org.eclipse.ease.AbstractScriptEngine.inject(AbstractScriptEngine.java:190)
09:34:47 [2022-01-18T14:34:47.102Z] 	at org.eclipse.ease.AbstractScriptEngine.run(AbstractScriptEngine.java:243)
09:34:47 [2022-01-18T14:34:47.102Z] 	at org.eclipse.core.internal.jobs.Worker.run(Worker.java:63)
09:34:47 [2022-01-18T14:34:47.359Z] Start of script
09:34:47 [2022-01-18T14:34:47.359Z] include file start
09:34:47 [2022-01-18T14:34:47.359Z] Include file processed
09:34:47 [2022-01-18T14:34:47.359Z] line after include file
09:34:47 [2022-01-18T14:34:47.615Z] Result of testMethod = 5
09:34:47 [2022-01-18T14:34:47.615Z] End of script
09:34:47 [2022-01-18T14:34:47.615Z] Start of script
09:34:47 [2022-01-18T14:34:47.615Z] include file start
09:34:47 [2022-01-18T14:34:47.615Z] Include file processed
09:34:47 [2022-01-18T14:34:47.615Z] line after include file
09:34:47 [2022-01-18T14:34:47.615Z] Result of testMethod = 5
09:34:47 [2022-01-18T14:34:47.615Z] End of script
09:34:47 [2022-01-18T14:34:47.872Z] Start of script
09:34:47 [2022-01-18T14:34:47.872Z] include file start
09:34:47 [2022-01-18T14:34:47.872Z] Include file processed
09:34:47 [2022-01-18T14:34:47.872Z] line after include file
09:34:48 [2022-01-18T14:34:48.134Z] org.eclipse.ease.ScriptEngineCancellationException: Terminated on user request
09:34:48 [2022-01-18T14:34:48.134Z] 	at org.eclipse.ease.debugging.AbstractEaseDebugger.handleEventsInSuspendedState(AbstractEaseDebugger.java:331)
09:34:48 [2022-01-18T14:34:48.134Z] 	at org.eclipse.ease.debugging.AbstractEaseDebugger.suspend(AbstractEaseDebugger.java:257)
09:34:48 [2022-01-18T14:34:48.134Z] 	at org.eclipse.ease.debugging.AbstractEaseDebugger.processLine(AbstractEaseDebugger.java:512)
09:34:48 [2022-01-18T14:34:48.134Z] 	at org.eclipse.ease.lang.javascript.rhino.debugger.RhinoDebugger.access$4(RhinoDebugger.java:1)
09:34:48 [2022-01-18T14:34:48.134Z] 	at org.eclipse.ease.lang.javascript.rhino.debugger.RhinoDebugger$RhinoDebugFrame.onLineChange(RhinoDebugger.java:124)
09:34:48 [2022-01-18T14:34:48.134Z] 	at org.mozilla.javascript.Interpreter.interpretLoop(Interpreter.java:1931)
09:34:48 [2022-01-18T14:34:48.134Z] 	at org.mozilla.javascript.Interpreter.interpret(Interpreter.java:911)
09:34:48 [2022-01-18T14:34:48.134Z] 	at org.mozilla.javascript.InterpretedFunction.call(InterpretedFunction.java:109)
09:34:48 [2022-01-18T14:34:48.134Z] 	at org.mozilla.javascript.ContextFactory.doTopCall(ContextFactory.java:405)
09:34:48 [2022-01-18T14:34:48.134Z] 	at org.mozilla.javascript.ScriptRuntime.doTopCall(ScriptRuntime.java:3508)
09:34:48 [2022-01-18T14:34:48.134Z] 	at org.mozilla.javascript.InterpretedFunction.exec(InterpretedFunction.java:120)
09:34:48 [2022-01-18T14:34:48.134Z] 	at org.mozilla.javascript.Context.evaluateReader(Context.java:1293)
09:34:48 [2022-01-18T14:34:48.134Z] 	at org.eclipse.ease.lang.javascript.rhino.RhinoScriptEngine.internalExecute(RhinoScriptEngine.java:226)
09:34:48 [2022-01-18T14:34:48.134Z] 	at org.eclipse.ease.lang.javascript.rhino.RhinoScriptEngine.execute(RhinoScriptEngine.java:205)
09:34:48 [2022-01-18T14:34:48.134Z] 	at org.eclipse.ease.AbstractScriptEngine.inject(AbstractScriptEngine.java:190)
09:34:48 [2022-01-18T14:34:48.134Z] 	at org.eclipse.ease.AbstractScriptEngine.run(AbstractScriptEngine.java:243)
09:34:48 [2022-01-18T14:34:48.134Z] 	at org.eclipse.core.internal.jobs.Worker.run(Worker.java:63)
09:34:48 [2022-01-18T14:34:48.134Z] Start of script
09:34:48 [2022-01-18T14:34:48.134Z] include file start
09:34:48 [2022-01-18T14:34:48.391Z] Include file processed
09:34:48 [2022-01-18T14:34:48.391Z] line after include file
09:34:48 [2022-01-18T14:34:48.391Z] Result of testMethod = 5
09:34:48 [2022-01-18T14:34:48.391Z] End of script
09:34:48 [2022-01-18T14:34:48.391Z] Start of script
09:34:48 [2022-01-18T14:34:48.391Z] include file start
09:34:48 [2022-01-18T14:34:48.391Z] Include file processed
09:34:48 [2022-01-18T14:34:48.391Z] line after include file
09:34:48 [2022-01-18T14:34:48.648Z] Result of testMethod = 5
09:34:48 [2022-01-18T14:34:48.648Z] End of script
09:34:48 [2022-01-18T14:34:48.904Z] org.eclipse.ease.ScriptEngineCancellationException: Terminated on user request
09:34:48 [2022-01-18T14:34:48.904Z] 	at org.eclipse.ease.debugging.AbstractEaseDebugger.handleEventsInSuspendedState(AbstractEaseDebugger.java:331)
09:34:48 [2022-01-18T14:34:48.904Z] 	at org.eclipse.ease.debugging.AbstractEaseDebugger.suspend(AbstractEaseDebugger.java:257)
09:34:48 [2022-01-18T14:34:48.904Z] 	at org.eclipse.ease.debugging.AbstractEaseDebugger.processLine(AbstractEaseDebugger.java:492)
09:34:48 [2022-01-18T14:34:48.904Z] 	at org.eclipse.ease.lang.javascript.rhino.debugger.RhinoDebugger.access$4(RhinoDebugger.java:1)
09:34:48 [2022-01-18T14:34:48.904Z] 	at org.eclipse.ease.lang.javascript.rhino.debugger.RhinoDebugger$RhinoDebugFrame.onLineChange(RhinoDebugger.java:124)
09:34:48 [2022-01-18T14:34:48.904Z] 	at org.mozilla.javascript.Interpreter.interpretLoop(Interpreter.java:1931)
09:34:48 [2022-01-18T14:34:48.904Z] 	at org.mozilla.javascript.Interpreter.interpret(Interpreter.java:911)
09:34:48 [2022-01-18T14:34:48.904Z] 	at org.mozilla.javascript.InterpretedFunction.call(InterpretedFunction.java:109)
09:34:48 [2022-01-18T14:34:48.904Z] 	at org.mozilla.javascript.ContextFactory.doTopCall(ContextFactory.java:405)
09:34:48 [2022-01-18T14:34:48.904Z] 	at org.mozilla.javascript.ScriptRuntime.doTopCall(ScriptRuntime.java:3508)
09:34:48 [2022-01-18T14:34:48.904Z] 	at org.mozilla.javascript.InterpretedFunction.exec(InterpretedFunction.java:120)
09:34:48 [2022-01-18T14:34:48.904Z] 	at org.mozilla.javascript.Context.evaluateReader(Context.java:1293)
09:34:48 [2022-01-18T14:34:48.904Z] 	at org.eclipse.ease.lang.javascript.rhino.RhinoScriptEngine.internalExecute(RhinoScriptEngine.java:226)
09:34:48 [2022-01-18T14:34:48.904Z] 	at org.eclipse.ease.lang.javascript.rhino.RhinoScriptEngine.execute(RhinoScriptEngine.java:205)
09:34:48 [2022-01-18T14:34:48.905Z] 	at org.eclipse.ease.AbstractScriptEngine.inject(AbstractScriptEngine.java:190)
09:34:48 [2022-01-18T14:34:48.905Z] 	at org.eclipse.ease.AbstractScriptEngine.run(AbstractScriptEngine.java:243)
09:34:48 [2022-01-18T14:34:48.905Z] 	at org.eclipse.core.internal.jobs.Worker.run(Worker.java:63)
09:34:48 [2022-01-18T14:34:48.905Z] Start of script
09:34:49 [2022-01-18T14:34:49.161Z] include file start
09:34:49 [2022-01-18T14:34:49.161Z] Include file processed
09:34:49 [2022-01-18T14:34:49.161Z] line after include file
09:34:49 [2022-01-18T14:34:49.161Z] Result of testMethod = 5
09:34:49 [2022-01-18T14:34:49.161Z] End of script
09:34:49 [2022-01-18T14:34:49.161Z] Start of script
09:34:49 [2022-01-18T14:34:49.161Z] include file start
09:34:49 [2022-01-18T14:34:49.161Z] Include file processed
09:34:49 [2022-01-18T14:34:49.161Z] line after include file
09:34:49 [2022-01-18T14:34:49.418Z] Result of testMethod = 5
09:34:49 [2022-01-18T14:34:49.418Z] End of script
09:34:49 [2022-01-18T14:34:49.418Z] Start of script
09:34:49 [2022-01-18T14:34:49.418Z] include file start
09:34:49 [2022-01-18T14:34:49.418Z] Include file processed
09:34:49 [2022-01-18T14:34:49.418Z] line after include file
09:34:49 [2022-01-18T14:34:49.418Z] Result of testMethod = 5
09:34:49 [2022-01-18T14:34:49.675Z] org.eclipse.ease.ScriptEngineCancellationException: Terminated on user request
09:34:49 [2022-01-18T14:34:49.675Z] 	at org.eclipse.ease.debugging.AbstractEaseDebugger.handleEventsInSuspendedState(AbstractEaseDebugger.java:331)
09:34:49 [2022-01-18T14:34:49.675Z] 	at org.eclipse.ease.debugging.AbstractEaseDebugger.suspend(AbstractEaseDebugger.java:257)
09:34:49 [2022-01-18T14:34:49.675Z] 	at org.eclipse.ease.debugging.AbstractEaseDebugger.processLine(AbstractEaseDebugger.java:492)
09:34:49 [2022-01-18T14:34:49.675Z] 	at org.eclipse.ease.lang.javascript.rhino.debugger.RhinoDebugger.access$4(RhinoDebugger.java:1)
09:34:49 [2022-01-18T14:34:49.675Z] 	at org.eclipse.ease.lang.javascript.rhino.debugger.RhinoDebugger$RhinoDebugFrame.onLineChange(RhinoDebugger.java:124)
09:34:49 [2022-01-18T14:34:49.675Z] 	at org.mozilla.javascript.Interpreter.interpretLoop(Interpreter.java:1931)
09:34:49 [2022-01-18T14:34:49.675Z] 	at org.mozilla.javascript.Interpreter.interpret(Interpreter.java:911)
09:34:49 [2022-01-18T14:34:49.675Z] 	at org.mozilla.javascript.InterpretedFunction.call(InterpretedFunction.java:109)
09:34:49 [2022-01-18T14:34:49.675Z] 	at org.mozilla.javascript.ContextFactory.doTopCall(ContextFactory.java:405)
09:34:49 [2022-01-18T14:34:49.675Z] 	at org.mozilla.javascript.ScriptRuntime.doTopCall(ScriptRuntime.java:3508)
09:34:49 [2022-01-18T14:34:49.675Z] 	at org.mozilla.javascript.InterpretedFunction.exec(InterpretedFunction.java:120)
09:34:49 [2022-01-18T14:34:49.675Z] 	at org.mozilla.javascript.Context.evaluateReader(Context.java:1293)
09:34:49 [2022-01-18T14:34:49.675Z] 	at org.eclipse.ease.lang.javascript.rhino.RhinoScriptEngine.internalExecute(RhinoScriptEngine.java:226)
09:34:49 [2022-01-18T14:34:49.675Z] 	at org.eclipse.ease.lang.javascript.rhino.RhinoScriptEngine.execute(RhinoScriptEngine.java:205)
09:34:49 [2022-01-18T14:34:49.675Z] 	at org.eclipse.ease.AbstractScriptEngine.inject(AbstractScriptEngine.java:190)
09:34:49 [2022-01-18T14:34:49.675Z] 	at org.eclipse.ease.AbstractScriptEngine.run(AbstractScriptEngine.java:243)
09:34:49 [2022-01-18T14:34:49.675Z] 	at org.eclipse.core.internal.jobs.Worker.run(Worker.java:63)
09:34:49 [2022-01-18T14:34:49.675Z] Start of script
09:34:49 [2022-01-18T14:34:49.675Z] include file start
09:34:49 [2022-01-18T14:34:49.675Z] Include file processed
09:34:49 [2022-01-18T14:34:49.675Z] line after include file
09:34:49 [2022-01-18T14:34:49.933Z] Result of testMethod = 5
09:34:49 [2022-01-18T14:34:49.933Z] End of script
09:34:50 [2022-01-18T14:34:50.190Z] org.eclipse.ease.ScriptEngineCancellationException: Terminated on user request
09:34:50 [2022-01-18T14:34:50.190Z] 	at org.eclipse.ease.debugging.AbstractEaseDebugger.handleEventsInSuspendedState(AbstractEaseDebugger.java:331)
09:34:50 [2022-01-18T14:34:50.190Z] 	at org.eclipse.ease.debugging.AbstractEaseDebugger.suspend(AbstractEaseDebugger.java:257)
09:34:50 [2022-01-18T14:34:50.190Z] 	at org.eclipse.ease.debugging.AbstractEaseDebugger.processLine(AbstractEaseDebugger.java:492)
09:34:50 [2022-01-18T14:34:50.190Z] 	at org.eclipse.ease.lang.javascript.rhino.debugger.RhinoDebugger.access$4(RhinoDebugger.java:1)
09:34:50 [2022-01-18T14:34:50.190Z] 	at org.eclipse.ease.lang.javascript.rhino.debugger.RhinoDebugger$RhinoDebugFrame.onLineChange(RhinoDebugger.java:124)
09:34:50 [2022-01-18T14:34:50.190Z] 	at org.mozilla.javascript.Interpreter.interpretLoop(Interpreter.java:1931)
09:34:50 [2022-01-18T14:34:50.190Z] 	at org.mozilla.javascript.Interpreter.interpret(Interpreter.java:911)
09:34:50 [2022-01-18T14:34:50.190Z] 	at org.mozilla.javascript.InterpretedFunction.call(InterpretedFunction.java:109)
09:34:50 [2022-01-18T14:34:50.190Z] 	at org.mozilla.javascript.ContextFactory.doTopCall(ContextFactory.java:405)
09:34:50 [2022-01-18T14:34:50.190Z] 	at org.mozilla.javascript.ScriptRuntime.doTopCall(ScriptRuntime.java:3508)
09:34:50 [2022-01-18T14:34:50.190Z] 	at org.mozilla.javascript.InterpretedFunction.exec(InterpretedFunction.java:120)
09:34:50 [2022-01-18T14:34:50.190Z] 	at org.mozilla.javascript.Context.evaluateReader(Context.java:1293)
09:34:50 [2022-01-18T14:34:50.190Z] 	at org.eclipse.ease.lang.javascript.rhino.RhinoScriptEngine.internalExecute(RhinoScriptEngine.java:226)
09:34:50 [2022-01-18T14:34:50.191Z] 	at org.eclipse.ease.lang.javascript.rhino.RhinoScriptEngine.execute(RhinoScriptEngine.java:205)
09:34:50 [2022-01-18T14:34:50.191Z] 	at org.eclipse.ease.AbstractScriptEngine.inject(AbstractScriptEngine.java:190)
09:34:50 [2022-01-18T14:34:50.191Z] 	at org.eclipse.ease.AbstractScriptEngine.run(AbstractScriptEngine.java:243)
09:34:50 [2022-01-18T14:34:50.191Z] 	at org.eclipse.core.internal.jobs.Worker.run(Worker.java:63)
09:34:50 [2022-01-18T14:34:50.191Z] Start of script
09:34:50 [2022-01-18T14:34:50.191Z] include file start
09:34:50 [2022-01-18T14:34:50.191Z] Include file processed
09:34:50 [2022-01-18T14:34:50.191Z] line after include file
09:34:50 [2022-01-18T14:34:50.191Z] Result of testMethod = 5
09:34:50 [2022-01-18T14:34:50.447Z] End of script
09:34:50 [2022-01-18T14:34:50.447Z] Start of script
09:34:50 [2022-01-18T14:34:50.447Z] include file start
09:34:50 [2022-01-18T14:34:50.447Z] Include file processed
09:34:50 [2022-01-18T14:34:50.447Z] line after include file
09:34:50 [2022-01-18T14:34:50.704Z] Result of testMethod = 5
09:34:50 [2022-01-18T14:34:50.704Z] End of script
09:34:50 [2022-01-18T14:34:50.961Z] org.eclipse.ease.ScriptEngineCancellationException: Terminated on user request
09:34:50 [2022-01-18T14:34:50.961Z] 	at org.eclipse.ease.debugging.AbstractEaseDebugger.handleEventsInSuspendedState(AbstractEaseDebugger.java:331)
09:34:50 [2022-01-18T14:34:50.962Z] 	at org.eclipse.ease.debugging.AbstractEaseDebugger.suspend(AbstractEaseDebugger.java:257)
09:34:50 [2022-01-18T14:34:50.962Z] 	at org.eclipse.ease.debugging.AbstractEaseDebugger.processLine(AbstractEaseDebugger.java:492)
09:34:50 [2022-01-18T14:34:50.962Z] 	at org.eclipse.ease.lang.javascript.rhino.debugger.RhinoDebugger.access$4(RhinoDebugger.java:1)
09:34:50 [2022-01-18T14:34:50.962Z] 	at org.eclipse.ease.lang.javascript.rhino.debugger.RhinoDebugger$RhinoDebugFrame.onLineChange(RhinoDebugger.java:124)
09:34:50 [2022-01-18T14:34:50.962Z] 	at org.mozilla.javascript.Interpreter.interpretLoop(Interpreter.java:1931)
09:34:50 [2022-01-18T14:34:50.962Z] 	at org.mozilla.javascript.Interpreter.interpret(Interpreter.java:911)
09:34:50 [2022-01-18T14:34:50.962Z] 	at org.mozilla.javascript.InterpretedFunction.call(InterpretedFunction.java:109)
09:34:50 [2022-01-18T14:34:50.962Z] 	at org.mozilla.javascript.ContextFactory.doTopCall(ContextFactory.java:405)
09:34:50 [2022-01-18T14:34:50.962Z] 	at org.mozilla.javascript.ScriptRuntime.doTopCall(ScriptRuntime.java:3508)
09:34:50 [2022-01-18T14:34:50.962Z] 	at org.mozilla.javascript.InterpretedFunction.exec(InterpretedFunction.java:120)
09:34:50 [2022-01-18T14:34:50.962Z] 	at org.mozilla.javascript.Context.evaluateReader(Context.java:1293)
09:34:50 [2022-01-18T14:34:50.962Z] 	at org.eclipse.ease.lang.javascript.rhino.RhinoScriptEngine.internalExecute(RhinoScriptEngine.java:226)
09:34:50 [2022-01-18T14:34:50.962Z] 	at org.eclipse.ease.lang.javascript.rhino.RhinoScriptEngine.execute(RhinoScriptEngine.java:205)
09:34:50 [2022-01-18T14:34:50.962Z] 	at org.eclipse.ease.AbstractScriptEngine.inject(AbstractScriptEngine.java:190)
09:34:50 [2022-01-18T14:34:50.962Z] 	at org.eclipse.ease.AbstractScriptEngine.run(AbstractScriptEngine.java:243)
09:34:50 [2022-01-18T14:34:50.962Z] 	at org.eclipse.core.internal.jobs.Worker.run(Worker.java:63)
09:34:50 [2022-01-18T14:34:50.962Z] Start of script
09:34:50 [2022-01-18T14:34:50.962Z] include file start
09:34:50 [2022-01-18T14:34:50.962Z] Include file processed
09:34:50 [2022-01-18T14:34:50.962Z] line after include file
09:34:51 [2022-01-18T14:34:51.219Z] Result of testMethod = 5
09:34:51 [2022-01-18T14:34:51.219Z] End of script
09:34:51 [2022-01-18T14:34:51.219Z] Start of script
09:34:51 [2022-01-18T14:34:51.219Z] include file start
09:34:51 [2022-01-18T14:34:51.219Z] Include file processed
09:34:51 [2022-01-18T14:34:51.219Z] line after include file
09:34:51 [2022-01-18T14:34:51.219Z] Result of testMethod = 5
09:34:51 [2022-01-18T14:34:51.476Z] WARNING: An illegal reflective access operation has occurred
09:34:51 [2022-01-18T14:34:51.476Z] WARNING: Illegal reflective access by org.eclipse.ease.debugging.model.EaseDebugValue (file:/home/jenkins/agent/workspace/ease.verify.core.target.2019-06/plugins/org.eclipse.ease/target/org.eclipse.ease-0.9.0-SNAPSHOT.jar) to field java.lang.String.hash
09:34:51 [2022-01-18T14:34:51.476Z] WARNING: Please consider reporting this to the maintainers of org.eclipse.ease.debugging.model.EaseDebugValue
09:34:51 [2022-01-18T14:34:51.476Z] WARNING: Use --illegal-access=warn to enable warnings of further illegal reflective access operations
09:34:51 [2022-01-18T14:34:51.476Z] WARNING: All illegal access operations will be denied in a future release
09:34:51 [2022-01-18T14:34:51.476Z] org.eclipse.ease.ScriptEngineCancellationException: Terminated on user request
09:34:51 [2022-01-18T14:34:51.476Z] 	at org.eclipse.ease.debugging.AbstractEaseDebugger.handleEventsInSuspendedState(AbstractEaseDebugger.java:331)
09:34:51 [2022-01-18T14:34:51.477Z] 	at org.eclipse.ease.debugging.AbstractEaseDebugger.suspend(AbstractEaseDebugger.java:257)
09:34:51 [2022-01-18T14:34:51.477Z] 	at org.eclipse.ease.debugging.AbstractEaseDebugger.processLine(AbstractEaseDebugger.java:492)
09:34:51 [2022-01-18T14:34:51.477Z] 	at org.eclipse.ease.lang.javascript.rhino.debugger.RhinoDebugger.access$4(RhinoDebugger.java:1)
09:34:51 [2022-01-18T14:34:51.477Z] 	at org.eclipse.ease.lang.javascript.rhino.debugger.RhinoDebugger$RhinoDebugFrame.onLineChange(RhinoDebugger.java:124)
09:34:51 [2022-01-18T14:34:51.477Z] 	at org.mozilla.javascript.Interpreter.interpretLoop(Interpreter.java:1931)
09:34:51 [2022-01-18T14:34:51.477Z] 	at org.mozilla.javascript.Interpreter.interpret(Interpreter.java:911)
09:34:51 [2022-01-18T14:34:51.477Z] 	at org.mozilla.javascript.InterpretedFunction.call(InterpretedFunction.java:109)
09:34:51 [2022-01-18T14:34:51.477Z] 	at org.mozilla.javascript.ContextFactory.doTopCall(ContextFactory.java:405)
09:34:51 [2022-01-18T14:34:51.477Z] 	at org.mozilla.javascript.ScriptRuntime.doTopCall(ScriptRuntime.java:3508)
09:34:51 [2022-01-18T14:34:51.477Z] 	at org.mozilla.javascript.InterpretedFunction.exec(InterpretedFunction.java:120)
09:34:51 [2022-01-18T14:34:51.477Z] 	at org.mozilla.javascript.Context.evaluateReader(Context.java:1293)
09:34:51 [2022-01-18T14:34:51.477Z] 	at org.eclipse.ease.lang.javascript.rhino.RhinoScriptEngine.internalExecute(RhinoScriptEngine.java:226)
09:34:51 [2022-01-18T14:34:51.477Z] 	at org.eclipse.ease.lang.javascript.rhino.RhinoScriptEngine.execute(RhinoScriptEngine.java:205)
09:34:51 [2022-01-18T14:34:51.477Z] 	at org.eclipse.ease.AbstractScriptEngine.inject(AbstractScriptEngine.java:190)
09:34:51 [2022-01-18T14:34:51.477Z] 	at org.eclipse.ease.AbstractScriptEngine.run(AbstractScriptEngine.java:243)
09:34:51 [2022-01-18T14:34:51.477Z] 	at org.eclipse.core.internal.jobs.Worker.run(Worker.java:63)
09:34:51 [2022-01-18T14:34:51.733Z] Start of script
09:34:51 [2022-01-18T14:34:51.733Z] include file start
09:34:51 [2022-01-18T14:34:51.733Z] Include file processed
09:34:51 [2022-01-18T14:34:51.733Z] line after include file
09:34:51 [2022-01-18T14:34:51.733Z] Result of testMethod = 5
09:34:51 [2022-01-18T14:34:51.733Z] End of script
09:34:51 [2022-01-18T14:34:51.733Z] Start of script
09:34:51 [2022-01-18T14:34:51.733Z] include file start
09:34:51 [2022-01-18T14:34:51.733Z] Include file processed
09:34:51 [2022-01-18T14:34:51.733Z] line after include file
09:34:51 [2022-01-18T14:34:51.989Z] Result of testMethod = 5
09:34:51 [2022-01-18T14:34:51.989Z] End of script
09:34:52 [2022-01-18T14:34:52.249Z] Start of script
09:34:52 [2022-01-18T14:34:52.249Z] include file start
09:34:52 [2022-01-18T14:34:52.249Z] Include file processed
09:34:52 [2022-01-18T14:34:52.249Z] line after include file
09:34:52 [2022-01-18T14:34:52.249Z] Result of testMethod = 5
09:34:52 [2022-01-18T14:34:52.249Z] End of script
09:34:52 [2022-01-18T14:34:52.249Z] Start of script
09:34:52 [2022-01-18T14:34:52.249Z] include file start
09:34:52 [2022-01-18T14:34:52.249Z] Include file processed
09:34:52 [2022-01-18T14:34:52.507Z] line after include file
09:34:52 [2022-01-18T14:34:52.507Z] Result of testMethod = 5
09:34:52 [2022-01-18T14:34:52.507Z] End of script
09:34:52 [2022-01-18T14:34:52.507Z] Start of script
09:34:52 [2022-01-18T14:34:52.507Z] include file start
09:34:52 [2022-01-18T14:34:52.507Z] Include file processed
09:34:52 [2022-01-18T14:34:52.507Z] line after include file
09:34:52 [2022-01-18T14:34:52.764Z] org.eclipse.ease.ScriptEngineCancellationException: Terminated on user request
09:34:52 [2022-01-18T14:34:52.764Z] 	at org.eclipse.ease.debugging.AbstractEaseDebugger.handleEventsInSuspendedState(AbstractEaseDebugger.java:331)
09:34:52 [2022-01-18T14:34:52.764Z] 	at org.eclipse.ease.debugging.AbstractEaseDebugger.suspend(AbstractEaseDebugger.java:257)
09:34:52 [2022-01-18T14:34:52.764Z] 	at org.eclipse.ease.debugging.AbstractEaseDebugger.processLine(AbstractEaseDebugger.java:492)
09:34:52 [2022-01-18T14:34:52.764Z] 	at org.eclipse.ease.lang.javascript.rhino.debugger.RhinoDebugger.access$4(RhinoDebugger.java:1)
09:34:52 [2022-01-18T14:34:52.764Z] 	at org.eclipse.ease.lang.javascript.rhino.debugger.RhinoDebugger$RhinoDebugFrame.onLineChange(RhinoDebugger.java:124)
09:34:52 [2022-01-18T14:34:52.764Z] 	at org.mozilla.javascript.Interpreter.interpretLoop(Interpreter.java:1931)
09:34:52 [2022-01-18T14:34:52.764Z] 	at org.mozilla.javascript.Interpreter.interpret(Interpreter.java:911)
09:34:52 [2022-01-18T14:34:52.764Z] 	at org.mozilla.javascript.InterpretedFunction.call(InterpretedFunction.java:109)
09:34:52 [2022-01-18T14:34:52.765Z] 	at org.mozilla.javascript.ContextFactory.doTopCall(ContextFactory.java:405)
09:34:52 [2022-01-18T14:34:52.765Z] 	at org.mozilla.javascript.ScriptRuntime.doTopCall(ScriptRuntime.java:3508)
09:34:52 [2022-01-18T14:34:52.765Z] 	at org.mozilla.javascript.InterpretedFunction.exec(InterpretedFunction.java:120)
09:34:52 [2022-01-18T14:34:52.765Z] 	at org.mozilla.javascript.Context.evaluateReader(Context.java:1293)
09:34:52 [2022-01-18T14:34:52.765Z] 	at org.eclipse.ease.lang.javascript.rhino.RhinoScriptEngine.internalExecute(RhinoScriptEngine.java:226)
09:34:52 [2022-01-18T14:34:52.765Z] 	at org.eclipse.ease.lang.javascript.rhino.RhinoScriptEngine.execute(RhinoScriptEngine.java:205)
09:34:52 [2022-01-18T14:34:52.765Z] 	at org.eclipse.ease.AbstractScriptEngine.inject(AbstractScriptEngine.java:190)
09:34:52 [2022-01-18T14:34:52.765Z] 	at org.eclipse.ease.AbstractScriptEngine.run(AbstractScriptEngine.java:243)
09:34:52 [2022-01-18T14:34:52.765Z] 	at org.eclipse.core.internal.jobs.Worker.run(Worker.java:63)
09:34:52 [2022-01-18T14:34:52.765Z] Start of script
09:34:53 [2022-01-18T14:34:53.022Z] include file start
09:34:53 [2022-01-18T14:34:53.022Z] Include file processed
09:34:53 [2022-01-18T14:34:53.022Z] line after include file
09:34:53 [2022-01-18T14:34:53.022Z] Result of testMethod = 5
09:34:53 [2022-01-18T14:34:53.022Z] End of script
09:34:53 [2022-01-18T14:34:53.279Z] Start of script
09:34:53 [2022-01-18T14:34:53.279Z] include file start
09:34:53 [2022-01-18T14:34:53.279Z] Include file processed
09:34:53 [2022-01-18T14:34:53.279Z] line after include file
09:34:53 [2022-01-18T14:34:53.279Z] Result of testMethod = 5
09:34:53 [2022-01-18T14:34:53.279Z] org.eclipse.ease.ScriptEngineCancellationException: Terminated on user request
09:34:53 [2022-01-18T14:34:53.279Z] 	at org.eclipse.ease.debugging.AbstractEaseDebugger.handleEventsInSuspendedState(AbstractEaseDebugger.java:331)
09:34:53 [2022-01-18T14:34:53.279Z] 	at org.eclipse.ease.debugging.AbstractEaseDebugger.suspend(AbstractEaseDebugger.java:257)
09:34:53 [2022-01-18T14:34:53.279Z] 	at org.eclipse.ease.debugging.AbstractEaseDebugger.processLine(AbstractEaseDebugger.java:492)
09:34:53 [2022-01-18T14:34:53.279Z] 	at org.eclipse.ease.lang.javascript.rhino.debugger.RhinoDebugger.access$4(RhinoDebugger.java:1)
09:34:53 [2022-01-18T14:34:53.279Z] 	at org.eclipse.ease.lang.javascript.rhino.debugger.RhinoDebugger$RhinoDebugFrame.onLineChange(RhinoDebugger.java:124)
09:34:53 [2022-01-18T14:34:53.279Z] 	at org.mozilla.javascript.Interpreter.interpretLoop(Interpreter.java:1931)
09:34:53 [2022-01-18T14:34:53.280Z] 	at org.mozilla.javascript.Interpreter.interpret(Interpreter.java:911)
09:34:53 [2022-01-18T14:34:53.280Z] 	at org.mozilla.javascript.InterpretedFunction.call(InterpretedFunction.java:109)
09:34:53 [2022-01-18T14:34:53.280Z] 	at org.mozilla.javascript.ContextFactory.doTopCall(ContextFactory.java:405)
09:34:53 [2022-01-18T14:34:53.280Z] 	at org.mozilla.javascript.ScriptRuntime.doTopCall(ScriptRuntime.java:3508)
09:34:53 [2022-01-18T14:34:53.280Z] 	at org.mozilla.javascript.InterpretedFunction.exec(InterpretedFunction.java:120)
09:34:53 [2022-01-18T14:34:53.280Z] 	at org.mozilla.javascript.Context.evaluateReader(Context.java:1293)
09:34:53 [2022-01-18T14:34:53.280Z] 	at org.eclipse.ease.lang.javascript.rhino.RhinoScriptEngine.internalExecute(RhinoScriptEngine.java:226)
09:34:53 [2022-01-18T14:34:53.280Z] 	at org.eclipse.ease.lang.javascript.rhino.RhinoScriptEngine.execute(RhinoScriptEngine.java:205)
09:34:53 [2022-01-18T14:34:53.280Z] 	at org.eclipse.ease.AbstractScriptEngine.inject(AbstractScriptEngine.java:190)
09:34:53 [2022-01-18T14:34:53.280Z] 	at org.eclipse.ease.AbstractScriptEngine.run(AbstractScriptEngine.java:243)
09:34:53 [2022-01-18T14:34:53.280Z] 	at org.eclipse.core.internal.jobs.Worker.run(Worker.java:63)
09:34:53 [2022-01-18T14:34:53.536Z] Start of script
09:34:53 [2022-01-18T14:34:53.537Z] include file start
09:34:53 [2022-01-18T14:34:53.537Z] Include file processed
09:34:53 [2022-01-18T14:34:53.537Z] line after include file
09:34:53 [2022-01-18T14:34:53.537Z] Result of testMethod = 5
09:34:53 [2022-01-18T14:34:53.537Z] End of script
09:34:53 [2022-01-18T14:34:53.794Z] Start of script
09:34:53 [2022-01-18T14:34:53.794Z] include file start
09:34:53 [2022-01-18T14:34:53.794Z] Include file processed
09:34:53 [2022-01-18T14:34:53.794Z] line after include file
09:34:53 [2022-01-18T14:34:53.794Z] Result of testMethod = 5
09:34:53 [2022-01-18T14:34:53.794Z] End of script
09:34:54 [2022-01-18T14:34:54.051Z] Start of script
09:34:54 [2022-01-18T14:34:54.051Z] include file start
09:34:54 [2022-01-18T14:34:54.051Z] Include file processed
09:34:54 [2022-01-18T14:34:54.051Z] line after include file
09:34:54 [2022-01-18T14:34:54.051Z] Result of testMethod = 5
09:34:54 [2022-01-18T14:34:54.051Z] End of script
09:34:54 [2022-01-18T14:34:54.309Z] Start of script
09:34:54 [2022-01-18T14:34:54.309Z] include file start
09:34:54 [2022-01-18T14:34:54.309Z] Include file processed
09:34:54 [2022-01-18T14:34:54.309Z] line after include file
09:34:54 [2022-01-18T14:34:54.309Z] Result of testMethod = 5
09:34:54 [2022-01-18T14:34:54.309Z] End of script
09:34:54 [2022-01-18T14:34:54.566Z] Start of script
09:34:54 [2022-01-18T14:34:54.566Z] include file start
09:34:54 [2022-01-18T14:34:54.566Z] Include file processed
09:34:54 [2022-01-18T14:34:54.566Z] line after include file
09:34:54 [2022-01-18T14:34:54.566Z] Result of testMethod = 5
09:34:54 [2022-01-18T14:34:54.566Z] org.eclipse.ease.ScriptEngineCancellationException: Terminated on user request
09:34:54 [2022-01-18T14:34:54.566Z] 	at org.eclipse.ease.debugging.AbstractEaseDebugger.handleEventsInSuspendedState(AbstractEaseDebugger.java:331)
09:34:54 [2022-01-18T14:34:54.566Z] 	at org.eclipse.ease.debugging.AbstractEaseDebugger.suspend(AbstractEaseDebugger.java:257)
09:34:54 [2022-01-18T14:34:54.566Z] 	at org.eclipse.ease.debugging.AbstractEaseDebugger.processLine(AbstractEaseDebugger.java:492)
09:34:54 [2022-01-18T14:34:54.566Z] 	at org.eclipse.ease.lang.javascript.rhino.debugger.RhinoDebugger.access$4(RhinoDebugger.java:1)
09:34:54 [2022-01-18T14:34:54.566Z] 	at org.eclipse.ease.lang.javascript.rhino.debugger.RhinoDebugger$RhinoDebugFrame.onLineChange(RhinoDebugger.java:124)
09:34:54 [2022-01-18T14:34:54.566Z] 	at org.mozilla.javascript.Interpreter.interpretLoop(Interpreter.java:1931)
09:34:54 [2022-01-18T14:34:54.566Z] 	at org.mozilla.javascript.Interpreter.interpret(Interpreter.java:911)
09:34:54 [2022-01-18T14:34:54.566Z] 	at org.mozilla.javascript.InterpretedFunction.call(InterpretedFunction.java:109)
09:34:54 [2022-01-18T14:34:54.566Z] 	at org.mozilla.javascript.ContextFactory.doTopCall(ContextFactory.java:405)
09:34:54 [2022-01-18T14:34:54.566Z] 	at org.mozilla.javascript.ScriptRuntime.doTopCall(ScriptRuntime.java:3508)
09:34:54 [2022-01-18T14:34:54.566Z] 	at org.mozilla.javascript.InterpretedFunction.exec(InterpretedFunction.java:120)
09:34:54 [2022-01-18T14:34:54.566Z] 	at org.mozilla.javascript.Context.evaluateReader(Context.java:1293)
09:34:54 [2022-01-18T14:34:54.566Z] 	at org.eclipse.ease.lang.javascript.rhino.RhinoScriptEngine.internalExecute(RhinoScriptEngine.java:226)
09:34:54 [2022-01-18T14:34:54.566Z] 	at org.eclipse.ease.lang.javascript.rhino.RhinoScriptEngine.execute(RhinoScriptEngine.java:205)
09:34:54 [2022-01-18T14:34:54.566Z] 	at org.eclipse.ease.AbstractScriptEngine.inject(AbstractScriptEngine.java:190)
09:34:54 [2022-01-18T14:34:54.566Z] 	at org.eclipse.ease.AbstractScriptEngine.run(AbstractScriptEngine.java:243)
09:34:54 [2022-01-18T14:34:54.566Z] 	at org.eclipse.core.internal.jobs.Worker.run(Worker.java:63)
09:34:54 [2022-01-18T14:34:54.823Z] Start of script
09:34:54 [2022-01-18T14:34:54.823Z] include file start
09:34:54 [2022-01-18T14:34:54.823Z] Include file processed
09:34:54 [2022-01-18T14:34:54.823Z] line after include file
09:34:54 [2022-01-18T14:34:54.823Z] Result of testMethod = 5
09:34:54 [2022-01-18T14:34:54.823Z] End of script
09:34:55 [2022-01-18T14:34:55.080Z] Start of script
09:34:55 [2022-01-18T14:34:55.080Z] include file start
09:34:55 [2022-01-18T14:34:55.080Z] Include file processed
09:34:55 [2022-01-18T14:34:55.080Z] line after include file
09:34:55 [2022-01-18T14:34:55.080Z] Result of testMethod = 5
09:34:55 [2022-01-18T14:34:55.080Z] org.eclipse.ease.ScriptEngineCancellationException: Terminated on user request
09:34:55 [2022-01-18T14:34:55.080Z] 	at org.eclipse.ease.debugging.AbstractEaseDebugger.handleEventsInSuspendedState(AbstractEaseDebugger.java:331)
09:34:55 [2022-01-18T14:34:55.080Z] 	at org.eclipse.ease.debugging.AbstractEaseDebugger.suspend(AbstractEaseDebugger.java:257)
09:34:55 [2022-01-18T14:34:55.080Z] 	at org.eclipse.ease.debugging.AbstractEaseDebugger.processLine(AbstractEaseDebugger.java:492)
09:34:55 [2022-01-18T14:34:55.080Z] 	at org.eclipse.ease.lang.javascript.rhino.debugger.RhinoDebugger.access$4(RhinoDebugger.java:1)
09:34:55 [2022-01-18T14:34:55.080Z] 	at org.eclipse.ease.lang.javascript.rhino.debugger.RhinoDebugger$RhinoDebugFrame.onLineChange(RhinoDebugger.java:124)
09:34:55 [2022-01-18T14:34:55.080Z] 	at org.mozilla.javascript.Interpreter.interpretLoop(Interpreter.java:1931)
09:34:55 [2022-01-18T14:34:55.080Z] 	at org.mozilla.javascript.Interpreter.interpret(Interpreter.java:911)
09:34:55 [2022-01-18T14:34:55.080Z] 	at org.mozilla.javascript.InterpretedFunction.call(InterpretedFunction.java:109)
09:34:55 [2022-01-18T14:34:55.080Z] 	at org.mozilla.javascript.ContextFactory.doTopCall(ContextFactory.java:405)
09:34:55 [2022-01-18T14:34:55.080Z] 	at org.mozilla.javascript.ScriptRuntime.doTopCall(ScriptRuntime.java:3508)
09:34:55 [2022-01-18T14:34:55.080Z] 	at org.mozilla.javascript.InterpretedFunction.exec(InterpretedFunction.java:120)
09:34:55 [2022-01-18T14:34:55.080Z] 	at org.mozilla.javascript.Context.evaluateReader(Context.java:1293)
09:34:55 [2022-01-18T14:34:55.080Z] 	at org.eclipse.ease.lang.javascript.rhino.RhinoScriptEngine.internalExecute(RhinoScriptEngine.java:226)
09:34:55 [2022-01-18T14:34:55.081Z] 	at org.eclipse.ease.lang.javascript.rhino.RhinoScriptEngine.execute(RhinoScriptEngine.java:205)
09:34:55 [2022-01-18T14:34:55.081Z] 	at org.eclipse.ease.AbstractScriptEngine.inject(AbstractScriptEngine.java:190)
09:34:55 [2022-01-18T14:34:55.081Z] 	at org.eclipse.ease.AbstractScriptEngine.run(AbstractScriptEngine.java:243)
09:34:55 [2022-01-18T14:34:55.081Z] 	at org.eclipse.core.internal.jobs.Worker.run(Worker.java:63)
09:34:55 [2022-01-18T14:34:55.338Z] org.eclipse.ease.ScriptEngineCancellationException: Terminated on user request
09:34:55 [2022-01-18T14:34:55.338Z] 	at org.eclipse.ease.debugging.AbstractEaseDebugger.handleEventsInSuspendedState(AbstractEaseDebugger.java:331)
09:34:55 [2022-01-18T14:34:55.338Z] 	at org.eclipse.ease.debugging.AbstractEaseDebugger.suspend(AbstractEaseDebugger.java:257)
09:34:55 [2022-01-18T14:34:55.339Z] 	at org.eclipse.ease.debugging.AbstractEaseDebugger.processLine(AbstractEaseDebugger.java:492)
09:34:55 [2022-01-18T14:34:55.339Z] 	at org.eclipse.ease.lang.javascript.rhino.debugger.RhinoDebugger.access$4(RhinoDebugger.java:1)
09:34:55 [2022-01-18T14:34:55.339Z] 	at org.eclipse.ease.lang.javascript.rhino.debugger.RhinoDebugger$RhinoDebugFrame.onLineChange(RhinoDebugger.java:124)
09:34:55 [2022-01-18T14:34:55.339Z] 	at org.mozilla.javascript.Interpreter.interpretLoop(Interpreter.java:1931)
09:34:55 [2022-01-18T14:34:55.339Z] 	at org.mozilla.javascript.Interpreter.interpret(Interpreter.java:911)
09:34:55 [2022-01-18T14:34:55.339Z] 	at org.mozilla.javascript.InterpretedFunction.call(InterpretedFunction.java:109)
09:34:55 [2022-01-18T14:34:55.339Z] 	at org.mozilla.javascript.ContextFactory.doTopCall(ContextFactory.java:405)
09:34:55 [2022-01-18T14:34:55.339Z] 	at org.mozilla.javascript.ScriptRuntime.doTopCall(ScriptRuntime.java:3508)
09:34:55 [2022-01-18T14:34:55.339Z] 	at org.mozilla.javascript.InterpretedFunction.exec(InterpretedFunction.java:120)
09:34:55 [2022-01-18T14:34:55.339Z] 	at org.mozilla.javascript.Context.evaluateReader(Context.java:1293)
09:34:55 [2022-01-18T14:34:55.339Z] 	at org.eclipse.ease.lang.javascript.rhino.RhinoScriptEngine.internalExecute(RhinoScriptEngine.java:226)
09:34:55 [2022-01-18T14:34:55.339Z] 	at org.eclipse.ease.lang.javascript.rhino.RhinoScriptEngine.execute(RhinoScriptEngine.java:205)
09:34:55 [2022-01-18T14:34:55.339Z] 	at org.eclipse.ease.AbstractScriptEngine.inject(AbstractScriptEngine.java:190)
09:34:55 [2022-01-18T14:34:55.339Z] 	at org.eclipse.ease.AbstractScriptEngine.run(AbstractScriptEngine.java:243)
09:34:55 [2022-01-18T14:34:55.339Z] 	at org.eclipse.core.internal.jobs.Worker.run(Worker.java:63)
09:34:55 [2022-01-18T14:34:55.598Z] Start of script
09:34:55 [2022-01-18T14:34:55.598Z] include file start
09:34:55 [2022-01-18T14:34:55.598Z] Include file processed
09:34:55 [2022-01-18T14:34:55.598Z] line after include file
09:34:55 [2022-01-18T14:34:55.598Z] Result of testMethod = 5
09:34:55 [2022-01-18T14:34:55.598Z] End of script
09:34:55 [2022-01-18T14:34:55.598Z] Start of script
09:34:55 [2022-01-18T14:34:55.598Z] include file start
09:34:55 [2022-01-18T14:34:55.598Z] Include file processed
09:34:55 [2022-01-18T14:34:55.598Z] line after include file
09:34:55 [2022-01-18T14:34:55.855Z] Result of testMethod = 5
09:34:55 [2022-01-18T14:34:55.855Z] End of script
09:34:56 [2022-01-18T14:34:56.112Z] Start of script
09:34:56 [2022-01-18T14:34:56.112Z] include file start
09:34:56 [2022-01-18T14:34:56.112Z] Include file processed
09:34:56 [2022-01-18T14:34:56.112Z] line after include file
09:34:56 [2022-01-18T14:34:56.112Z] Result of testMethod = 5
09:34:56 [2022-01-18T14:34:56.112Z] End of script
09:34:56 [2022-01-18T14:34:56.112Z] Tests run: 41, Failures: 0, Errors: 0, Skipped: 0, Time elapsed: 10.844 s - in org.eclipse.ease.lang.javascript.rhino.RhinoDebugTest
09:34:56 [2022-01-18T14:34:56.112Z] disconnectProcessInSuspendedState  Time elapsed: 0.301 s
09:34:56 [2022-01-18T14:34:56.112Z] stepReturnIncludeCommand  Time elapsed: 0.212 s
09:34:56 [2022-01-18T14:34:56.112Z] arrayVariableSorting  Time elapsed: 0.304 s
09:34:56 [2022-01-18T14:34:56.112Z] stepOverOnDebugTarget  Time elapsed: 0.306 s
09:34:56 [2022-01-18T14:34:56.112Z] disconnectThreadInSuspendedState  Time elapsed: 0.204 s
09:34:56 [2022-01-18T14:34:56.112Z] stepReturnOnDebugTarget  Time elapsed: 0.308 s
09:34:56 [2022-01-18T14:34:56.112Z] nullVariable  Time elapsed: 0.305 s
09:34:56 [2022-01-18T14:34:56.112Z] stepOverOnStackFrame  Time elapsed: 0.306 s
09:34:56 [2022-01-18T14:34:56.112Z] resumeOnDebugTarget  Time elapsed: 0.205 s
09:34:56 [2022-01-18T14:34:56.112Z] modifyVariableKeepingType  Time elapsed: 0.406 s
09:34:56 [2022-01-18T14:34:56.112Z] resumeOnLastIncludeLine  Time elapsed: 0.206 s
09:34:56 [2022-01-18T14:34:56.112Z] stepReturnOnStackFrame  Time elapsed: 0.305 s
09:34:56 [2022-01-18T14:34:56.112Z] terminateStackFrameInSuspendedState  Time elapsed: 0.205 s
09:34:56 [2022-01-18T14:34:56.112Z] breakpointLocation  Time elapsed: 0.205 s
09:34:56 [2022-01-18T14:34:56.112Z] stepReturnOnThread  Time elapsed: 0.306 s
09:34:56 [2022-01-18T14:34:56.112Z] javaClassVariable  Time elapsed: 0.308 s
09:34:56 [2022-01-18T14:34:56.112Z] stepIntoOnThread  Time elapsed: 0.305 s
09:34:56 [2022-01-18T14:34:56.112Z] terminateThreadInSuspendedState  Time elapsed: 0.205 s
09:34:56 [2022-01-18T14:34:56.112Z] resumeOnThread  Time elapsed: 0.205 s
09:34:56 [2022-01-18T14:34:56.113Z] stepIntoOnStackFrame  Time elapsed: 0.306 s
09:34:56 [2022-01-18T14:34:56.113Z] terminateProcessInSuspendedState  Time elapsed: 0.206 s
09:34:56 [2022-01-18T14:34:56.113Z] stepOverOnProcess  Time elapsed: 0.306 s
09:34:56 [2022-01-18T14:34:56.113Z] nativeArrayVariable  Time elapsed: 0.305 s
09:34:56 [2022-01-18T14:34:56.113Z] disconnectDebugTargetInSuspendedState  Time elapsed: 0.204 s
09:34:56 [2022-01-18T14:34:56.113Z] stepIntoOnProcess  Time elapsed: 0.305 s
09:34:56 [2022-01-18T14:34:56.113Z] terminatedState  Time elapsed: 0.103 s
09:34:56 [2022-01-18T14:34:56.113Z] stepOverIncludeCommand  Time elapsed: 0.305 s
09:34:56 [2022-01-18T14:34:56.113Z] innerScopeVariableBeforeOuterScopeVariable  Time elapsed: 0.305 s
09:34:56 [2022-01-18T14:34:56.113Z] stepIntoIncludeCommand  Time elapsed: 0.305 s
09:34:56 [2022-01-18T14:34:56.113Z] primitiveStringVariable  Time elapsed: 0.306 s
09:34:56 [2022-01-18T14:34:56.113Z] resumeOnProcess  Time elapsed: 0.204 s
09:34:56 [2022-01-18T14:34:56.113Z] stepIntoOnDebugTarget  Time elapsed: 0.305 s
09:34:56 [2022-01-18T14:34:56.113Z] stepOverOnThread  Time elapsed: 0.305 s
09:34:56 [2022-01-18T14:34:56.113Z] suspendedState  Time elapsed: 0.204 s
09:34:56 [2022-01-18T14:34:56.113Z] primitiveDoubleVariable  Time elapsed: 0.305 s
09:34:56 [2022-01-18T14:34:56.113Z] resumeOnStackFrame  Time elapsed: 0.204 s
09:34:56 [2022-01-18T14:34:56.113Z] nativeObjectVariable  Time elapsed: 0.304 s
09:34:56 [2022-01-18T14:34:56.113Z] terminateDebugTargetInSuspendedState  Time elapsed: 0.205 s
09:34:56 [2022-01-18T14:34:56.113Z] disconnectStackFrameInSuspendedState  Time elapsed: 0.205 s
09:34:56 [2022-01-18T14:34:56.113Z] stepReturnOnProcess  Time elapsed: 0.306 s
09:34:56 [2022-01-18T14:34:56.113Z] evaluateWatchExpression  Time elapsed: 0.217 s
09:34:56 [2022-01-18T14:34:56.113Z] 
09:34:56 [2022-01-18T14:34:56.113Z] Results:
09:34:56 [2022-01-18T14:34:56.113Z] 
09:34:56 [2022-01-18T14:34:56.113Z] Tests run: 69, Failures: 0, Errors: 0, Skipped: 0
09:34:56 [2022-01-18T14:34:56.113Z] 
09:34:56 [2022-01-18T14:34:56.370Z] [INFO] All tests passed!
09:34:56 [2022-01-18T14:34:56.370Z] [INFO] 
09:34:56 [2022-01-18T14:34:56.370Z] [INFO] --- maven-pmd-plugin:3.14.0:pmd (pmd-integration) @ org.eclipse.ease.lang.javascript.rhino.test ---
09:34:56 [2022-01-18T14:34:56.370Z] [WARNING] Unable to exclude rules [JUnit5TestShouldBePackagePrivate] from ruleset reference category/java/bestpractices.xml; perhaps the rule name is misspelled or the rule doesn't exist anymore?
09:34:56 [2022-01-18T14:34:56.371Z] [WARNING] Unable to exclude rules [JUnit5TestShouldBePackagePrivate] from ruleset reference category/java/bestpractices.xml; perhaps the rule name is misspelled or the rule doesn't exist anymore?
09:34:56 [2022-01-18T14:34:56.934Z] [INFO] 
09:34:56 [2022-01-18T14:34:56.934Z] [INFO] --- maven-pmd-plugin:3.14.0:cpd (pmd-integration) @ org.eclipse.ease.lang.javascript.rhino.test ---
09:34:56 [2022-01-18T14:34:56.934Z] [INFO] 
09:34:56 [2022-01-18T14:34:56.934Z] [INFO] --- spotbugs-maven-plugin:4.1.4:spotbugs (spotbugs-integration) @ org.eclipse.ease.lang.javascript.rhino.test ---
09:34:56 [2022-01-18T14:34:56.934Z] [INFO] Fork Value is false
09:34:56 [2022-01-18T14:34:56.934Z]      [java] JVM args ignored when same JVM is used.
09:35:00 [2022-01-18T14:35:00.328Z] [INFO] Done SpotBugs Analysis....
09:35:00 [2022-01-18T14:35:00.328Z] [INFO] 
09:35:00 [2022-01-18T14:35:00.328Z] [INFO] --- maven-checkstyle-plugin:3.1.1:check (checkstyle-integration) @ org.eclipse.ease.lang.javascript.rhino.test ---
09:35:00 [2022-01-18T14:35:00.328Z] [INFO] You have 0 Checkstyle violations.
09:35:00 [2022-01-18T14:35:00.328Z] [INFO] 
09:35:00 [2022-01-18T14:35:00.328Z] [INFO] --- maven-install-plugin:2.3.1:install (default-install) @ org.eclipse.ease.lang.javascript.rhino.test ---
09:35:00 [2022-01-18T14:35:00.329Z] [INFO] Installing /home/jenkins/agent/workspace/ease.verify.core.target.2019-06/tests/org.eclipse.ease.lang.javascript.rhino.test/target/org.eclipse.ease.lang.javascript.rhino.test-0.9.0-SNAPSHOT.jar to /home/jenkins/.m2/repository/org/eclipse/ease/org.eclipse.ease.lang.javascript.rhino.test/0.9.0-SNAPSHOT/org.eclipse.ease.lang.javascript.rhino.test-0.9.0-SNAPSHOT.jar
09:35:00 [2022-01-18T14:35:00.329Z] [INFO] Installing /home/jenkins/agent/workspace/ease.verify.core.target.2019-06/tests/org.eclipse.ease.lang.javascript.rhino.test/pom.xml to /home/jenkins/.m2/repository/org/eclipse/ease/org.eclipse.ease.lang.javascript.rhino.test/0.9.0-SNAPSHOT/org.eclipse.ease.lang.javascript.rhino.test-0.9.0-SNAPSHOT.pom
09:35:00 [2022-01-18T14:35:00.329Z] [INFO] Installing /home/jenkins/agent/workspace/ease.verify.core.target.2019-06/tests/org.eclipse.ease.lang.javascript.rhino.test/target/p2content.xml to /home/jenkins/.m2/repository/org/eclipse/ease/org.eclipse.ease.lang.javascript.rhino.test/0.9.0-SNAPSHOT/org.eclipse.ease.lang.javascript.rhino.test-0.9.0-SNAPSHOT-p2metadata.xml
09:35:00 [2022-01-18T14:35:00.329Z] [INFO] Installing /home/jenkins/agent/workspace/ease.verify.core.target.2019-06/tests/org.eclipse.ease.lang.javascript.rhino.test/target/p2artifacts.xml to /home/jenkins/.m2/repository/org/eclipse/ease/org.eclipse.ease.lang.javascript.rhino.test/0.9.0-SNAPSHOT/org.eclipse.ease.lang.javascript.rhino.test-0.9.0-SNAPSHOT-p2artifacts.xml
09:35:00 [2022-01-18T14:35:00.329Z] [INFO] 
09:35:00 [2022-01-18T14:35:00.329Z] [INFO] --- tycho-p2-plugin:2.2.0:update-local-index (default-update-local-index) @ org.eclipse.ease.lang.javascript.rhino.test ---
09:35:00 [2022-01-18T14:35:00.329Z] [INFO] 
09:35:00 [2022-01-18T14:35:00.329Z] [INFO] -------< org.eclipse.ease:org.eclipse.ease.lang.javascript.test >-------
09:35:00 [2022-01-18T14:35:00.329Z] [INFO] Building org.eclipse.ease.lang.javascript.test 0.9.0-SNAPSHOT    [40/49]
09:35:00 [2022-01-18T14:35:00.329Z] [INFO] ------------------------[ eclipse-test-plugin ]-------------------------
09:35:00 [2022-01-18T14:35:00.329Z] [INFO] 
09:35:00 [2022-01-18T14:35:00.329Z] [INFO] --- maven-clean-plugin:2.5:clean (default-clean) @ org.eclipse.ease.lang.javascript.test ---
09:35:00 [2022-01-18T14:35:00.329Z] [INFO] 
09:35:00 [2022-01-18T14:35:00.329Z] [INFO] --- tycho-packaging-plugin:2.2.0:build-qualifier (default-build-qualifier) @ org.eclipse.ease.lang.javascript.test ---
09:35:00 [2022-01-18T14:35:00.329Z] [INFO] The project's OSGi version is 0.9.0.I202107211616
09:35:00 [2022-01-18T14:35:00.329Z] [INFO] 
09:35:00 [2022-01-18T14:35:00.329Z] [INFO] --- tycho-packaging-plugin:2.2.0:validate-id (default-validate-id) @ org.eclipse.ease.lang.javascript.test ---
09:35:00 [2022-01-18T14:35:00.329Z] [INFO] 
09:35:00 [2022-01-18T14:35:00.329Z] [INFO] --- tycho-packaging-plugin:2.2.0:validate-version (default-validate-version) @ org.eclipse.ease.lang.javascript.test ---
09:35:00 [2022-01-18T14:35:00.329Z] [INFO] 
09:35:00 [2022-01-18T14:35:00.329Z] [INFO] --- maven-resources-plugin:2.4.3:resources (default-resources) @ org.eclipse.ease.lang.javascript.test ---
09:35:00 [2022-01-18T14:35:00.329Z] [INFO] Using 'UTF-8' encoding to copy filtered resources.
09:35:00 [2022-01-18T14:35:00.329Z] [INFO] skip non existing resourceDirectory /home/jenkins/agent/workspace/ease.verify.core.target.2019-06/tests/org.eclipse.ease.lang.javascript.test/src/main/resources
09:35:00 [2022-01-18T14:35:00.329Z] [INFO] 
09:35:00 [2022-01-18T14:35:00.329Z] [INFO] --- tycho-compiler-plugin:2.2.0:compile (default-compile) @ org.eclipse.ease.lang.javascript.test ---
09:35:00 [2022-01-18T14:35:00.330Z] [INFO] Compiling 1 source file to /home/jenkins/agent/workspace/ease.verify.core.target.2019-06/tests/org.eclipse.ease.lang.javascript.test/target/classes
09:35:00 [2022-01-18T14:35:00.330Z] [INFO] 
09:35:00 [2022-01-18T14:35:00.330Z] [INFO] --- maven-resources-plugin:2.4.3:testResources (default-testResources) @ org.eclipse.ease.lang.javascript.test ---
09:35:00 [2022-01-18T14:35:00.330Z] [INFO] Using 'UTF-8' encoding to copy filtered resources.
09:35:00 [2022-01-18T14:35:00.330Z] [INFO] skip non existing resourceDirectory /home/jenkins/agent/workspace/ease.verify.core.target.2019-06/tests/org.eclipse.ease.lang.javascript.test/src/test/resources
09:35:00 [2022-01-18T14:35:00.330Z] [INFO] 
09:35:00 [2022-01-18T14:35:00.330Z] [INFO] --- target-platform-configuration:2.2.0:target-platform (default-target-platform) @ org.eclipse.ease.lang.javascript.test ---
09:35:00 [2022-01-18T14:35:00.330Z] [INFO] 
09:35:00 [2022-01-18T14:35:00.330Z] [INFO] --- tycho-packaging-plugin:2.2.0:package-plugin (default-package-plugin) @ org.eclipse.ease.lang.javascript.test ---
09:35:00 [2022-01-18T14:35:00.330Z] [INFO] Building jar: /home/jenkins/agent/workspace/ease.verify.core.target.2019-06/tests/org.eclipse.ease.lang.javascript.test/target/org.eclipse.ease.lang.javascript.test-0.9.0-SNAPSHOT.jar
09:35:00 [2022-01-18T14:35:00.330Z] [INFO] 
09:35:00 [2022-01-18T14:35:00.330Z] [INFO] --- tycho-p2-plugin:2.2.0:p2-metadata-default (default-p2-metadata-default) @ org.eclipse.ease.lang.javascript.test ---
09:35:00 [2022-01-18T14:35:00.330Z] [INFO] 
09:35:00 [2022-01-18T14:35:00.330Z] [INFO] --- jacoco-maven-plugin:0.8.6:prepare-agent (jacoco-initialize) @ org.eclipse.ease.lang.javascript.test ---
09:35:00 [2022-01-18T14:35:00.330Z] [INFO] tycho.testArgLine set to -javaagent:/home/jenkins/.m2/repository/org/jacoco/org.jacoco.agent/0.8.6/org.jacoco.agent-0.8.6-runtime.jar=destfile=/home/jenkins/agent/workspace/ease.verify.core.target.2019-06/tests/org.eclipse.ease.lang.javascript.test/target/jacoco.exec,output=file
09:35:00 [2022-01-18T14:35:00.330Z] [INFO] 
09:35:00 [2022-01-18T14:35:00.330Z] [INFO] --- tycho-surefire-plugin:2.2.0:test (default-test) @ org.eclipse.ease.lang.javascript.test ---
09:35:00 [2022-01-18T14:35:00.330Z] [INFO] Executing Test Runtime with timeout 0, logs (if any) will be placed at: /home/jenkins/agent/workspace/ease.verify.core.target.2019-06/tests/org.eclipse.ease.lang.javascript.test/target/work/data/.metadata/.log
09:35:00 [2022-01-18T14:35:00.330Z] [INFO] Command line:
09:35:00 [2022-01-18T14:35:00.330Z] 	[/opt/tools/java/openjdk/jdk-15/15.0.2+7/bin/java, -Dosgi.noShutdown=false, -Dosgi.os=linux, -Dosgi.ws=gtk, -Dosgi.arch=x86_64, -javaagent:/home/jenkins/.m2/repository/org/jacoco/org.jacoco.agent/0.8.6/org.jacoco.agent-0.8.6-runtime.jar=destfile=/home/jenkins/agent/workspace/ease.verify.core.target.2019-06/tests/org.eclipse.ease.lang.javascript.test/target/jacoco.exec,output=file, -Dosgi.clean=true, -jar, /home/jenkins/.m2/repository/p2/osgi/bundle/org.eclipse.equinox.launcher/1.6.300.v20210813-1054/org.eclipse.equinox.launcher-1.6.300.v20210813-1054.jar, -data, /home/jenkins/agent/workspace/ease.verify.core.target.2019-06/tests/org.eclipse.ease.lang.javascript.test/target/work/data, -install, /home/jenkins/agent/workspace/ease.verify.core.target.2019-06/tests/org.eclipse.ease.lang.javascript.test/target/work, -configuration, /home/jenkins/agent/workspace/ease.verify.core.target.2019-06/tests/org.eclipse.ease.lang.javascript.test/target/work/configuration, -application, org.eclipse.tycho.surefire.osgibooter.headlesstest, -testproperties, /home/jenkins/agent/workspace/ease.verify.core.target.2019-06/tests/org.eclipse.ease.lang.javascript.test/target/surefire.properties]
09:35:00 [2022-01-18T14:35:00.330Z] Picked up JAVA_TOOL_OPTIONS: -Dmaven.ext.class.path="/home/jenkins/agent/workspace/ease.verify.core.target.2019-06@tmp/withMaven179a7c8c/pipeline-maven-spy.jar" -Dorg.jenkinsci.plugins.pipeline.maven.reportsFolder="/home/jenkins/agent/workspace/ease.verify.core.target.2019-06@tmp/withMaven179a7c8c" 
09:35:03 [2022-01-18T14:35:03.631Z] Running org.eclipse.ease.lang.javascript.JavaScriptCodeFactoryTest
09:35:03 [2022-01-18T14:35:03.631Z] Tests run: 11, Failures: 0, Errors: 0, Skipped: 0, Time elapsed: 0.074 s - in org.eclipse.ease.lang.javascript.JavaScriptCodeFactoryTest
09:35:03 [2022-01-18T14:35:03.631Z] getSaveVariableName_creates_random_string_for_invalid_characters  Time elapsed: 0.051 s
09:35:03 [2022-01-18T14:35:03.631Z] getNullString_equals_null  Time elapsed: 0.002 s
09:35:03 [2022-01-18T14:35:03.631Z] getSaveVariableName_prefixes_keywords_with_underscore  Time elapsed: 0 s
09:35:03 [2022-01-18T14:35:03.631Z] getSaveVariableName_does_not_alter_save_name  Time elapsed: 0 s
09:35:03 [2022-01-18T14:35:03.631Z] classInstantiation_creates_instance_with_parameters  Time elapsed: 0.001 s
09:35:03 [2022-01-18T14:35:03.631Z] createCommentedString_creates_block_comment  Time elapsed: 0.002 s
09:35:03 [2022-01-18T14:35:03.631Z] createCommentedString_creates_single_line_comment  Time elapsed: 0.001 s
09:35:03 [2022-01-18T14:35:03.631Z] classInstantiation_creates_default_instance  Time elapsed: 0.001 s
09:35:03 [2022-01-18T14:35:03.631Z] createCommentedString_creates_multi_line_comment  Time elapsed: 0 s
09:35:03 [2022-01-18T14:35:03.631Z] getSaveVariableName_replaces_invalid_characters  Time elapsed: 0 s
09:35:03 [2022-01-18T14:35:03.631Z] getSaveVariableName_prefixes_numbers_with_underscore  Time elapsed: 0.001 s
09:35:03 [2022-01-18T14:35:03.631Z] 
09:35:03 [2022-01-18T14:35:03.631Z] Results:
09:35:03 [2022-01-18T14:35:03.631Z] 
09:35:03 [2022-01-18T14:35:03.631Z] Tests run: 11, Failures: 0, Errors: 0, Skipped: 0
09:35:03 [2022-01-18T14:35:03.631Z] 
09:35:03 [2022-01-18T14:35:03.631Z] [INFO] All tests passed!
09:35:03 [2022-01-18T14:35:03.631Z] [INFO] 
09:35:03 [2022-01-18T14:35:03.631Z] [INFO] --- maven-pmd-plugin:3.14.0:pmd (pmd-integration) @ org.eclipse.ease.lang.javascript.test ---
09:35:03 [2022-01-18T14:35:03.631Z] [WARNING] Unable to exclude rules [JUnit5TestShouldBePackagePrivate] from ruleset reference category/java/bestpractices.xml; perhaps the rule name is misspelled or the rule doesn't exist anymore?
09:35:03 [2022-01-18T14:35:03.631Z] [WARNING] Unable to exclude rules [JUnit5TestShouldBePackagePrivate] from ruleset reference category/java/bestpractices.xml; perhaps the rule name is misspelled or the rule doesn't exist anymore?
09:35:03 [2022-01-18T14:35:03.631Z] [INFO] 
09:35:03 [2022-01-18T14:35:03.631Z] [INFO] --- maven-pmd-plugin:3.14.0:cpd (pmd-integration) @ org.eclipse.ease.lang.javascript.test ---
09:35:03 [2022-01-18T14:35:03.631Z] [INFO] 
09:35:03 [2022-01-18T14:35:03.631Z] [INFO] --- spotbugs-maven-plugin:4.1.4:spotbugs (spotbugs-integration) @ org.eclipse.ease.lang.javascript.test ---
09:35:03 [2022-01-18T14:35:03.631Z] [INFO] Fork Value is false
09:35:03 [2022-01-18T14:35:03.631Z]      [java] JVM args ignored when same JVM is used.
09:35:05 [2022-01-18T14:35:05.594Z] [INFO] Done SpotBugs Analysis....
09:35:05 [2022-01-18T14:35:05.851Z] [INFO] 
09:35:05 [2022-01-18T14:35:05.851Z] [INFO] --- maven-checkstyle-plugin:3.1.1:check (checkstyle-integration) @ org.eclipse.ease.lang.javascript.test ---
09:35:05 [2022-01-18T14:35:05.851Z] [INFO] You have 0 Checkstyle violations.
09:35:05 [2022-01-18T14:35:05.851Z] [INFO] 
09:35:05 [2022-01-18T14:35:05.851Z] [INFO] --- maven-install-plugin:2.3.1:install (default-install) @ org.eclipse.ease.lang.javascript.test ---
09:35:05 [2022-01-18T14:35:05.851Z] [INFO] Installing /home/jenkins/agent/workspace/ease.verify.core.target.2019-06/tests/org.eclipse.ease.lang.javascript.test/target/org.eclipse.ease.lang.javascript.test-0.9.0-SNAPSHOT.jar to /home/jenkins/.m2/repository/org/eclipse/ease/org.eclipse.ease.lang.javascript.test/0.9.0-SNAPSHOT/org.eclipse.ease.lang.javascript.test-0.9.0-SNAPSHOT.jar
09:35:05 [2022-01-18T14:35:05.851Z] [INFO] Installing /home/jenkins/agent/workspace/ease.verify.core.target.2019-06/tests/org.eclipse.ease.lang.javascript.test/pom.xml to /home/jenkins/.m2/repository/org/eclipse/ease/org.eclipse.ease.lang.javascript.test/0.9.0-SNAPSHOT/org.eclipse.ease.lang.javascript.test-0.9.0-SNAPSHOT.pom
09:35:05 [2022-01-18T14:35:05.851Z] [INFO] Installing /home/jenkins/agent/workspace/ease.verify.core.target.2019-06/tests/org.eclipse.ease.lang.javascript.test/target/p2content.xml to /home/jenkins/.m2/repository/org/eclipse/ease/org.eclipse.ease.lang.javascript.test/0.9.0-SNAPSHOT/org.eclipse.ease.lang.javascript.test-0.9.0-SNAPSHOT-p2metadata.xml
09:35:05 [2022-01-18T14:35:05.851Z] [INFO] Installing /home/jenkins/agent/workspace/ease.verify.core.target.2019-06/tests/org.eclipse.ease.lang.javascript.test/target/p2artifacts.xml to /home/jenkins/.m2/repository/org/eclipse/ease/org.eclipse.ease.lang.javascript.test/0.9.0-SNAPSHOT/org.eclipse.ease.lang.javascript.test-0.9.0-SNAPSHOT-p2artifacts.xml
09:35:05 [2022-01-18T14:35:05.851Z] [INFO] 
09:35:05 [2022-01-18T14:35:05.851Z] [INFO] --- tycho-p2-plugin:2.2.0:update-local-index (default-update-local-index) @ org.eclipse.ease.lang.javascript.test ---
09:35:05 [2022-01-18T14:35:05.851Z] [INFO] 
09:35:05 [2022-01-18T14:35:05.851Z] [INFO] ---------< org.eclipse.ease:org.eclipse.ease.lang.python.test >---------
09:35:05 [2022-01-18T14:35:05.852Z] [INFO] Building org.eclipse.ease.lang.python.test 0.9.0-SNAPSHOT        [41/49]
09:35:05 [2022-01-18T14:35:05.852Z] [INFO] ------------------------[ eclipse-test-plugin ]-------------------------
09:35:05 [2022-01-18T14:35:05.852Z] [INFO] 
09:35:05 [2022-01-18T14:35:05.852Z] [INFO] --- maven-clean-plugin:2.5:clean (default-clean) @ org.eclipse.ease.lang.python.test ---
09:35:05 [2022-01-18T14:35:05.852Z] [INFO] 
09:35:05 [2022-01-18T14:35:05.852Z] [INFO] --- tycho-packaging-plugin:2.2.0:build-qualifier (default-build-qualifier) @ org.eclipse.ease.lang.python.test ---
09:35:05 [2022-01-18T14:35:05.852Z] [INFO] The project's OSGi version is 0.9.0.I202112011324
09:35:05 [2022-01-18T14:35:05.852Z] [INFO] 
09:35:05 [2022-01-18T14:35:05.852Z] [INFO] --- tycho-packaging-plugin:2.2.0:validate-id (default-validate-id) @ org.eclipse.ease.lang.python.test ---
09:35:05 [2022-01-18T14:35:05.852Z] [INFO] 
09:35:05 [2022-01-18T14:35:05.852Z] [INFO] --- tycho-packaging-plugin:2.2.0:validate-version (default-validate-version) @ org.eclipse.ease.lang.python.test ---
09:35:05 [2022-01-18T14:35:05.852Z] [INFO] 
09:35:05 [2022-01-18T14:35:05.852Z] [INFO] --- maven-resources-plugin:2.4.3:resources (default-resources) @ org.eclipse.ease.lang.python.test ---
09:35:05 [2022-01-18T14:35:05.852Z] [INFO] Using 'UTF-8' encoding to copy filtered resources.
09:35:05 [2022-01-18T14:35:05.852Z] [INFO] skip non existing resourceDirectory /home/jenkins/agent/workspace/ease.verify.core.target.2019-06/tests/org.eclipse.ease.lang.python.test/src/main/resources
09:35:05 [2022-01-18T14:35:05.852Z] [INFO] 
09:35:05 [2022-01-18T14:35:05.852Z] [INFO] --- tycho-compiler-plugin:2.2.0:compile (default-compile) @ org.eclipse.ease.lang.python.test ---
09:35:05 [2022-01-18T14:35:05.852Z] [INFO] Compiling 3 source files to /home/jenkins/agent/workspace/ease.verify.core.target.2019-06/tests/org.eclipse.ease.lang.python.test/target/classes
09:35:05 [2022-01-18T14:35:05.852Z] [INFO] 
09:35:05 [2022-01-18T14:35:05.852Z] [INFO] --- maven-resources-plugin:2.4.3:testResources (default-testResources) @ org.eclipse.ease.lang.python.test ---
09:35:05 [2022-01-18T14:35:05.852Z] [INFO] Using 'UTF-8' encoding to copy filtered resources.
09:35:05 [2022-01-18T14:35:05.852Z] [INFO] skip non existing resourceDirectory /home/jenkins/agent/workspace/ease.verify.core.target.2019-06/tests/org.eclipse.ease.lang.python.test/src/test/resources
09:35:05 [2022-01-18T14:35:05.852Z] [INFO] 
09:35:05 [2022-01-18T14:35:05.852Z] [INFO] --- target-platform-configuration:2.2.0:target-platform (default-target-platform) @ org.eclipse.ease.lang.python.test ---
09:35:06 [2022-01-18T14:35:06.109Z] [INFO] 
09:35:06 [2022-01-18T14:35:06.109Z] [INFO] --- tycho-packaging-plugin:2.2.0:package-plugin (default-package-plugin) @ org.eclipse.ease.lang.python.test ---
09:35:06 [2022-01-18T14:35:06.109Z] [INFO] Building jar: /home/jenkins/agent/workspace/ease.verify.core.target.2019-06/tests/org.eclipse.ease.lang.python.test/target/org.eclipse.ease.lang.python.test-0.9.0-SNAPSHOT.jar
09:35:06 [2022-01-18T14:35:06.109Z] [INFO] 
09:35:06 [2022-01-18T14:35:06.109Z] [INFO] --- tycho-p2-plugin:2.2.0:p2-metadata-default (default-p2-metadata-default) @ org.eclipse.ease.lang.python.test ---
09:35:06 [2022-01-18T14:35:06.109Z] [INFO] 
09:35:06 [2022-01-18T14:35:06.109Z] [INFO] --- jacoco-maven-plugin:0.8.6:prepare-agent (jacoco-initialize) @ org.eclipse.ease.lang.python.test ---
09:35:06 [2022-01-18T14:35:06.109Z] [INFO] tycho.testArgLine set to -javaagent:/home/jenkins/.m2/repository/org/jacoco/org.jacoco.agent/0.8.6/org.jacoco.agent-0.8.6-runtime.jar=destfile=/home/jenkins/agent/workspace/ease.verify.core.target.2019-06/tests/org.eclipse.ease.lang.python.test/target/jacoco.exec,output=file
09:35:06 [2022-01-18T14:35:06.109Z] [INFO] 
09:35:06 [2022-01-18T14:35:06.109Z] [INFO] --- tycho-surefire-plugin:2.2.0:test (default-test) @ org.eclipse.ease.lang.python.test ---
09:35:06 [2022-01-18T14:35:06.687Z] [INFO] Executing Test Runtime with timeout 0, logs (if any) will be placed at: /home/jenkins/agent/workspace/ease.verify.core.target.2019-06/tests/org.eclipse.ease.lang.python.test/target/work/data/.metadata/.log
09:35:06 [2022-01-18T14:35:06.687Z] [INFO] Command line:
09:35:06 [2022-01-18T14:35:06.687Z] 	[/opt/tools/java/openjdk/jdk-15/15.0.2+7/bin/java, -Dosgi.noShutdown=false, -Dosgi.os=linux, -Dosgi.ws=gtk, -Dosgi.arch=x86_64, -javaagent:/home/jenkins/.m2/repository/org/jacoco/org.jacoco.agent/0.8.6/org.jacoco.agent-0.8.6-runtime.jar=destfile=/home/jenkins/agent/workspace/ease.verify.core.target.2019-06/tests/org.eclipse.ease.lang.python.test/target/jacoco.exec,output=file, -Dosgi.clean=true, -jar, /home/jenkins/.m2/repository/p2/osgi/bundle/org.eclipse.equinox.launcher/1.6.300.v20210813-1054/org.eclipse.equinox.launcher-1.6.300.v20210813-1054.jar, -data, /home/jenkins/agent/workspace/ease.verify.core.target.2019-06/tests/org.eclipse.ease.lang.python.test/target/work/data, -install, /home/jenkins/agent/workspace/ease.verify.core.target.2019-06/tests/org.eclipse.ease.lang.python.test/target/work, -configuration, /home/jenkins/agent/workspace/ease.verify.core.target.2019-06/tests/org.eclipse.ease.lang.python.test/target/work/configuration, -application, org.eclipse.tycho.surefire.osgibooter.headlesstest, -testproperties, /home/jenkins/agent/workspace/ease.verify.core.target.2019-06/tests/org.eclipse.ease.lang.python.test/target/surefire.properties]
09:35:06 [2022-01-18T14:35:06.688Z] Picked up JAVA_TOOL_OPTIONS: -Dmaven.ext.class.path="/home/jenkins/agent/workspace/ease.verify.core.target.2019-06@tmp/withMaven179a7c8c/pipeline-maven-spy.jar" -Dorg.jenkinsci.plugins.pipeline.maven.reportsFolder="/home/jenkins/agent/workspace/ease.verify.core.target.2019-06@tmp/withMaven179a7c8c" 
09:35:09 [2022-01-18T14:35:09.978Z] Running org.eclipse.ease.lang.python.PyDevPathImporterTest
09:35:10 [2022-01-18T14:35:10.541Z] Tests run: 6, Failures: 0, Errors: 0, Skipped: 0, Time elapsed: 1.092 s - in org.eclipse.ease.lang.python.PyDevPathImporterTest
09:35:10 [2022-01-18T14:35:10.541Z] createEngine_registers_engine_execution_listener  Time elapsed: 0.573 s
09:35:10 [2022-01-18T14:35:10.541Z] notify_does_not_throwwhen_PyDev_plugins_are_not_available  Time elapsed: 0.307 s
09:35:10 [2022-01-18T14:35:10.541Z] notify_registers_project_paths_for_engine_executed_file  Time elapsed: 0.194 s
09:35:10 [2022-01-18T14:35:10.541Z] notify_does_not_throw_for_non_PyDev_project  Time elapsed: 0.002 s
09:35:10 [2022-01-18T14:35:10.541Z] notify_escapes_path_on_windows  Time elapsed: 0.002 s
09:35:10 [2022-01-18T14:35:10.541Z] notify_registers_project_paths  Time elapsed: 0.002 s
09:35:10 [2022-01-18T14:35:10.541Z] Running org.eclipse.ease.lang.python.ResourceProjectPathImporterTest
09:35:10 [2022-01-18T14:35:10.542Z] Tests run: 4, Failures: 0, Errors: 0, Skipped: 0, Time elapsed: 0.005 s - in org.eclipse.ease.lang.python.ResourceProjectPathImporterTest
09:35:10 [2022-01-18T14:35:10.542Z] createEngine_registers_engine_execution_listener  Time elapsed: 0 s
09:35:10 [2022-01-18T14:35:10.542Z] notify_registers_project_paths_for_engine_executed_file  Time elapsed: 0.001 s
09:35:10 [2022-01-18T14:35:10.542Z] notify_escapes_path_on_windows  Time elapsed: 0.001 s
09:35:10 [2022-01-18T14:35:10.542Z] notify_registers_project_paths  Time elapsed: 0.001 s
09:35:10 [2022-01-18T14:35:10.542Z] Running org.eclipse.ease.lang.python.PythonCodeFactoryTest
09:35:10 [2022-01-18T14:35:10.542Z] Tests run: 3, Failures: 0, Errors: 0, Skipped: 0, Time elapsed: 0.072 s - in org.eclipse.ease.lang.python.PythonCodeFactoryTest
09:35:10 [2022-01-18T14:35:10.542Z] createFunctionWrapper_creates_return_andParameters_for_Py4J  Time elapsed: 0.068 s
09:35:10 [2022-01-18T14:35:10.542Z] testCommentCreator  Time elapsed: 0.001 s
09:35:10 [2022-01-18T14:35:10.542Z] createFunctionWrapper_creates_void_return_types_for_Py4J  Time elapsed: 0.002 s
09:35:10 [2022-01-18T14:35:10.542Z] 
09:35:10 [2022-01-18T14:35:10.542Z] Results:
09:35:10 [2022-01-18T14:35:10.542Z] 
09:35:10 [2022-01-18T14:35:10.542Z] Tests run: 13, Failures: 0, Errors: 0, Skipped: 0
09:35:10 [2022-01-18T14:35:10.542Z] 
09:35:10 [2022-01-18T14:35:10.798Z] [INFO] All tests passed!
09:35:10 [2022-01-18T14:35:10.798Z] [INFO] 
09:35:10 [2022-01-18T14:35:10.798Z] [INFO] --- maven-pmd-plugin:3.14.0:pmd (pmd-integration) @ org.eclipse.ease.lang.python.test ---
09:35:10 [2022-01-18T14:35:10.798Z] [WARNING] Unable to exclude rules [JUnit5TestShouldBePackagePrivate] from ruleset reference category/java/bestpractices.xml; perhaps the rule name is misspelled or the rule doesn't exist anymore?
09:35:10 [2022-01-18T14:35:10.798Z] [WARNING] Unable to exclude rules [JUnit5TestShouldBePackagePrivate] from ruleset reference category/java/bestpractices.xml; perhaps the rule name is misspelled or the rule doesn't exist anymore?
09:35:11 [2022-01-18T14:35:11.054Z] [INFO] 
09:35:11 [2022-01-18T14:35:11.055Z] [INFO] --- maven-pmd-plugin:3.14.0:cpd (pmd-integration) @ org.eclipse.ease.lang.python.test ---
09:35:11 [2022-01-18T14:35:11.327Z] [INFO] 
09:35:11 [2022-01-18T14:35:11.327Z] [INFO] --- spotbugs-maven-plugin:4.1.4:spotbugs (spotbugs-integration) @ org.eclipse.ease.lang.python.test ---
09:35:11 [2022-01-18T14:35:11.327Z] [INFO] Fork Value is false
09:35:11 [2022-01-18T14:35:11.327Z]      [java] JVM args ignored when same JVM is used.
09:35:13 [2022-01-18T14:35:13.856Z] [INFO] Done SpotBugs Analysis....
09:35:13 [2022-01-18T14:35:13.856Z] [INFO] 
09:35:13 [2022-01-18T14:35:13.856Z] [INFO] --- maven-checkstyle-plugin:3.1.1:check (checkstyle-integration) @ org.eclipse.ease.lang.python.test ---
09:35:13 [2022-01-18T14:35:13.856Z] [INFO] You have 0 Checkstyle violations.
09:35:13 [2022-01-18T14:35:13.856Z] [INFO] 
09:35:13 [2022-01-18T14:35:13.856Z] [INFO] --- maven-install-plugin:2.3.1:install (default-install) @ org.eclipse.ease.lang.python.test ---
09:35:13 [2022-01-18T14:35:13.856Z] [INFO] Installing /home/jenkins/agent/workspace/ease.verify.core.target.2019-06/tests/org.eclipse.ease.lang.python.test/target/org.eclipse.ease.lang.python.test-0.9.0-SNAPSHOT.jar to /home/jenkins/.m2/repository/org/eclipse/ease/org.eclipse.ease.lang.python.test/0.9.0-SNAPSHOT/org.eclipse.ease.lang.python.test-0.9.0-SNAPSHOT.jar
09:35:13 [2022-01-18T14:35:13.856Z] [INFO] Installing /home/jenkins/agent/workspace/ease.verify.core.target.2019-06/tests/org.eclipse.ease.lang.python.test/pom.xml to /home/jenkins/.m2/repository/org/eclipse/ease/org.eclipse.ease.lang.python.test/0.9.0-SNAPSHOT/org.eclipse.ease.lang.python.test-0.9.0-SNAPSHOT.pom
09:35:13 [2022-01-18T14:35:13.856Z] [INFO] Installing /home/jenkins/agent/workspace/ease.verify.core.target.2019-06/tests/org.eclipse.ease.lang.python.test/target/p2content.xml to /home/jenkins/.m2/repository/org/eclipse/ease/org.eclipse.ease.lang.python.test/0.9.0-SNAPSHOT/org.eclipse.ease.lang.python.test-0.9.0-SNAPSHOT-p2metadata.xml
09:35:13 [2022-01-18T14:35:13.856Z] [INFO] Installing /home/jenkins/agent/workspace/ease.verify.core.target.2019-06/tests/org.eclipse.ease.lang.python.test/target/p2artifacts.xml to /home/jenkins/.m2/repository/org/eclipse/ease/org.eclipse.ease.lang.python.test/0.9.0-SNAPSHOT/org.eclipse.ease.lang.python.test-0.9.0-SNAPSHOT-p2artifacts.xml
09:35:13 [2022-01-18T14:35:13.856Z] [INFO] 
09:35:13 [2022-01-18T14:35:13.856Z] [INFO] --- tycho-p2-plugin:2.2.0:update-local-index (default-update-local-index) @ org.eclipse.ease.lang.python.test ---
09:35:13 [2022-01-18T14:35:13.856Z] [INFO] 
09:35:13 [2022-01-18T14:35:13.857Z] [INFO] -----< org.eclipse.ease:org.eclipse.ease.lang.python.jython.test >------
09:35:13 [2022-01-18T14:35:13.857Z] [INFO] Building org.eclipse.ease.lang.python.jython.test 0.9.0-SNAPSHOT [42/49]
09:35:13 [2022-01-18T14:35:13.857Z] [INFO] ------------------------[ eclipse-test-plugin ]-------------------------
09:35:13 [2022-01-18T14:35:13.857Z] [INFO] 
09:35:13 [2022-01-18T14:35:13.857Z] [INFO] --- maven-clean-plugin:2.5:clean (default-clean) @ org.eclipse.ease.lang.python.jython.test ---
09:35:13 [2022-01-18T14:35:13.857Z] [INFO] 
09:35:13 [2022-01-18T14:35:13.857Z] [INFO] --- tycho-packaging-plugin:2.2.0:build-qualifier (default-build-qualifier) @ org.eclipse.ease.lang.python.jython.test ---
09:35:13 [2022-01-18T14:35:13.857Z] [INFO] The project's OSGi version is 0.9.0.I202106220815
09:35:13 [2022-01-18T14:35:13.857Z] [INFO] 
09:35:13 [2022-01-18T14:35:13.857Z] [INFO] --- tycho-packaging-plugin:2.2.0:validate-id (default-validate-id) @ org.eclipse.ease.lang.python.jython.test ---
09:35:13 [2022-01-18T14:35:13.857Z] [INFO] 
09:35:13 [2022-01-18T14:35:13.857Z] [INFO] --- tycho-packaging-plugin:2.2.0:validate-version (default-validate-version) @ org.eclipse.ease.lang.python.jython.test ---
09:35:13 [2022-01-18T14:35:13.857Z] [INFO] 
09:35:13 [2022-01-18T14:35:13.857Z] [INFO] --- maven-resources-plugin:2.4.3:resources (default-resources) @ org.eclipse.ease.lang.python.jython.test ---
09:35:13 [2022-01-18T14:35:13.857Z] [INFO] Using 'UTF-8' encoding to copy filtered resources.
09:35:13 [2022-01-18T14:35:13.857Z] [INFO] skip non existing resourceDirectory /home/jenkins/agent/workspace/ease.verify.core.target.2019-06/tests/org.eclipse.ease.lang.python.jython.test/src/main/resources
09:35:13 [2022-01-18T14:35:13.857Z] [INFO] 
09:35:13 [2022-01-18T14:35:13.857Z] [INFO] --- tycho-compiler-plugin:2.2.0:compile (default-compile) @ org.eclipse.ease.lang.python.jython.test ---
09:35:13 [2022-01-18T14:35:13.857Z] [INFO] Compiling 1 source file to /home/jenkins/agent/workspace/ease.verify.core.target.2019-06/tests/org.eclipse.ease.lang.python.jython.test/target/classes
09:35:13 [2022-01-18T14:35:13.857Z] [INFO] 
09:35:13 [2022-01-18T14:35:13.857Z] [INFO] --- maven-resources-plugin:2.4.3:testResources (default-testResources) @ org.eclipse.ease.lang.python.jython.test ---
09:35:13 [2022-01-18T14:35:13.857Z] [INFO] Using 'UTF-8' encoding to copy filtered resources.
09:35:13 [2022-01-18T14:35:13.857Z] [INFO] skip non existing resourceDirectory /home/jenkins/agent/workspace/ease.verify.core.target.2019-06/tests/org.eclipse.ease.lang.python.jython.test/src/test/resources
09:35:13 [2022-01-18T14:35:13.857Z] [INFO] 
09:35:13 [2022-01-18T14:35:13.857Z] [INFO] --- target-platform-configuration:2.2.0:target-platform (default-target-platform) @ org.eclipse.ease.lang.python.jython.test ---
09:35:13 [2022-01-18T14:35:13.857Z] [INFO] 
09:35:13 [2022-01-18T14:35:13.857Z] [INFO] --- tycho-packaging-plugin:2.2.0:package-plugin (default-package-plugin) @ org.eclipse.ease.lang.python.jython.test ---
09:35:13 [2022-01-18T14:35:13.857Z] [INFO] Building jar: /home/jenkins/agent/workspace/ease.verify.core.target.2019-06/tests/org.eclipse.ease.lang.python.jython.test/target/org.eclipse.ease.lang.python.jython.test-0.9.0-SNAPSHOT.jar
09:35:13 [2022-01-18T14:35:13.857Z] [INFO] 
09:35:13 [2022-01-18T14:35:13.857Z] [INFO] --- tycho-p2-plugin:2.2.0:p2-metadata-default (default-p2-metadata-default) @ org.eclipse.ease.lang.python.jython.test ---
09:35:13 [2022-01-18T14:35:13.858Z] [INFO] 
09:35:13 [2022-01-18T14:35:13.858Z] [INFO] --- jacoco-maven-plugin:0.8.6:prepare-agent (jacoco-initialize) @ org.eclipse.ease.lang.python.jython.test ---
09:35:13 [2022-01-18T14:35:13.858Z] [INFO] tycho.testArgLine set to -javaagent:/home/jenkins/.m2/repository/org/jacoco/org.jacoco.agent/0.8.6/org.jacoco.agent-0.8.6-runtime.jar=destfile=/home/jenkins/agent/workspace/ease.verify.core.target.2019-06/tests/org.eclipse.ease.lang.python.jython.test/target/jacoco.exec,output=file
09:35:13 [2022-01-18T14:35:13.858Z] [INFO] 
09:35:13 [2022-01-18T14:35:13.858Z] [INFO] --- tycho-surefire-plugin:2.2.0:test (default-test) @ org.eclipse.ease.lang.python.jython.test ---
09:35:14 [2022-01-18T14:35:14.115Z] [INFO] Executing Test Runtime with timeout 0, logs (if any) will be placed at: /home/jenkins/agent/workspace/ease.verify.core.target.2019-06/tests/org.eclipse.ease.lang.python.jython.test/target/work/data/.metadata/.log
09:35:14 [2022-01-18T14:35:14.115Z] [INFO] Command line:
09:35:14 [2022-01-18T14:35:14.115Z] 	[/opt/tools/java/openjdk/jdk-15/15.0.2+7/bin/java, -Dosgi.noShutdown=false, -Dosgi.os=linux, -Dosgi.ws=gtk, -Dosgi.arch=x86_64, -javaagent:/home/jenkins/.m2/repository/org/jacoco/org.jacoco.agent/0.8.6/org.jacoco.agent-0.8.6-runtime.jar=destfile=/home/jenkins/agent/workspace/ease.verify.core.target.2019-06/tests/org.eclipse.ease.lang.python.jython.test/target/jacoco.exec,output=file, -Dosgi.clean=true, -jar, /home/jenkins/.m2/repository/p2/osgi/bundle/org.eclipse.equinox.launcher/1.6.300.v20210813-1054/org.eclipse.equinox.launcher-1.6.300.v20210813-1054.jar, -data, /home/jenkins/agent/workspace/ease.verify.core.target.2019-06/tests/org.eclipse.ease.lang.python.jython.test/target/work/data, -install, /home/jenkins/agent/workspace/ease.verify.core.target.2019-06/tests/org.eclipse.ease.lang.python.jython.test/target/work, -configuration, /home/jenkins/agent/workspace/ease.verify.core.target.2019-06/tests/org.eclipse.ease.lang.python.jython.test/target/work/configuration, -application, org.eclipse.tycho.surefire.osgibooter.headlesstest, -testproperties, /home/jenkins/agent/workspace/ease.verify.core.target.2019-06/tests/org.eclipse.ease.lang.python.jython.test/target/surefire.properties]
09:35:14 [2022-01-18T14:35:14.115Z] Picked up JAVA_TOOL_OPTIONS: -Dmaven.ext.class.path="/home/jenkins/agent/workspace/ease.verify.core.target.2019-06@tmp/withMaven179a7c8c/pipeline-maven-spy.jar" -Dorg.jenkinsci.plugins.pipeline.maven.reportsFolder="/home/jenkins/agent/workspace/ease.verify.core.target.2019-06@tmp/withMaven179a7c8c" 
09:35:17 [2022-01-18T14:35:17.465Z] WARNING: An illegal reflective access operation has occurred
09:35:17 [2022-01-18T14:35:17.465Z] WARNING: Illegal reflective access by org.python.core.PySystemState (file:/home/jenkins/agent/workspace/ease.verify.core.target.2019-06/tests/org.eclipse.ease.lang.python.jython.test/target/work/plugins/org.jython_2.7.0.I202104151016/jython.jar) to method java.io.Console.encoding()
09:35:17 [2022-01-18T14:35:17.465Z] WARNING: Please consider reporting this to the maintainers of org.python.core.PySystemState
09:35:17 [2022-01-18T14:35:17.465Z] WARNING: Use --illegal-access=warn to enable warnings of further illegal reflective access operations
09:35:17 [2022-01-18T14:35:17.465Z] WARNING: All illegal access operations will be denied in a future release
09:35:17 [2022-01-18T14:35:17.757Z] Running org.eclipse.ease.lang.python.jython.debugger.JythonDebugTest
09:35:21 [2022-01-18T14:35:21.079Z] Start of script
09:35:21 [2022-01-18T14:35:21.079Z] include file start
09:35:21 [2022-01-18T14:35:21.079Z] include file processed
09:35:21 [2022-01-18T14:35:21.079Z] Result of testMethod = 5
09:35:21 [2022-01-18T14:35:21.079Z] End of script
09:35:21 [2022-01-18T14:35:21.079Z] Start of script
09:35:21 [2022-01-18T14:35:21.079Z] include file start
09:35:21 [2022-01-18T14:35:21.079Z] include file processed
09:35:21 [2022-01-18T14:35:21.079Z] Result of testMethod = 5
09:35:21 [2022-01-18T14:35:21.079Z] End of script
09:35:21 [2022-01-18T14:35:21.336Z] Start of script
09:35:21 [2022-01-18T14:35:21.336Z] include file start
09:35:21 [2022-01-18T14:35:21.336Z] include file processed
09:35:21 [2022-01-18T14:35:21.336Z] Result of testMethod = 5
09:35:21 [2022-01-18T14:35:21.336Z] Traceback (most recent call last):
09:35:21 [2022-01-18T14:35:21.336Z]   File "(none)", line 184, in run
09:35:21 [2022-01-18T14:35:21.336Z]   File "__ref_L/Debug Test/Main.py_xqctkqpiub", line 23, in <module>
09:35:21 [2022-01-18T14:35:21.336Z]   File "(none)", line 161, in trace_dispatch
09:35:21 [2022-01-18T14:35:21.336Z] 	at org.eclipse.ease.debugging.AbstractEaseDebugger.handleEventsInSuspendedState(AbstractEaseDebugger.java:331)
09:35:21 [2022-01-18T14:35:21.336Z] 	at org.eclipse.ease.debugging.AbstractEaseDebugger.suspend(AbstractEaseDebugger.java:257)
09:35:21 [2022-01-18T14:35:21.336Z] 	at org.eclipse.ease.debugging.AbstractEaseDebugger.processLine(AbstractEaseDebugger.java:492)
09:35:21 [2022-01-18T14:35:21.336Z] 	at org.eclipse.ease.lang.python.debugger.PythonDebugger.traceDispatch(PythonDebugger.java:179)
09:35:21 [2022-01-18T14:35:21.336Z] 	at org.eclipse.ease.lang.python.jython.debugger.JythonDebugger.traceDispatch(JythonDebugger.java:46)
09:35:21 [2022-01-18T14:35:21.337Z] 	at jdk.internal.reflect.GeneratedMethodAccessor25.invoke(Unknown Source)
09:35:21 [2022-01-18T14:35:21.337Z] 	at java.base/jdk.internal.reflect.DelegatingMethodAccessorImpl.invoke(DelegatingMethodAccessorImpl.java:43)
09:35:21 [2022-01-18T14:35:21.337Z] 	at java.base/java.lang.reflect.Method.invoke(Method.java:564)
09:35:21 [2022-01-18T14:35:21.337Z] 
09:35:21 [2022-01-18T14:35:21.337Z] org.eclipse.ease.ScriptEngineCancellationException: org.eclipse.ease.ScriptEngineCancellationException: Terminated on user request
09:35:21 [2022-01-18T14:35:21.593Z] Start of script
09:35:21 [2022-01-18T14:35:21.593Z] include file start
09:35:21 [2022-01-18T14:35:21.593Z] include file processed
09:35:21 [2022-01-18T14:35:21.593Z] Result of testMethod = 5
09:35:21 [2022-01-18T14:35:21.593Z] End of script
09:35:22 [2022-01-18T14:35:22.157Z] Start of script
09:35:22 [2022-01-18T14:35:22.157Z] include file start
09:35:22 [2022-01-18T14:35:22.157Z] include file processed
09:35:22 [2022-01-18T14:35:22.157Z] Result of testMethod = 5
09:35:22 [2022-01-18T14:35:22.157Z] End of script
09:35:22 [2022-01-18T14:35:22.157Z] Start of script
09:35:22 [2022-01-18T14:35:22.157Z] include file start
09:35:22 [2022-01-18T14:35:22.157Z] include file processed
09:35:22 [2022-01-18T14:35:22.413Z] Result of testMethod = 5
09:35:22 [2022-01-18T14:35:22.413Z] End of script
09:35:22 [2022-01-18T14:35:22.413Z] Start of script
09:35:22 [2022-01-18T14:35:22.413Z] include file start
09:35:22 [2022-01-18T14:35:22.413Z] include file processed
09:35:22 [2022-01-18T14:35:22.413Z] Result of testMethod = 5
09:35:22 [2022-01-18T14:35:22.670Z] Traceback (most recent call last):
09:35:22 [2022-01-18T14:35:22.670Z]   File "(none)", line 184, in run
09:35:22 [2022-01-18T14:35:22.670Z]   File "__ref_L/Debug Test/Main.py_ycsfspucrx", line 23, in <module>
09:35:22 [2022-01-18T14:35:22.670Z]   File "(none)", line 161, in trace_dispatch
09:35:22 [2022-01-18T14:35:22.670Z] 	at org.eclipse.ease.debugging.AbstractEaseDebugger.handleEventsInSuspendedState(AbstractEaseDebugger.java:331)
09:35:22 [2022-01-18T14:35:22.670Z] 	at org.eclipse.ease.debugging.AbstractEaseDebugger.suspend(AbstractEaseDebugger.java:257)
09:35:22 [2022-01-18T14:35:22.670Z] 	at org.eclipse.ease.debugging.AbstractEaseDebugger.processLine(AbstractEaseDebugger.java:492)
09:35:22 [2022-01-18T14:35:22.670Z] 	at org.eclipse.ease.lang.python.debugger.PythonDebugger.traceDispatch(PythonDebugger.java:179)
09:35:22 [2022-01-18T14:35:22.670Z] 	at org.eclipse.ease.lang.python.jython.debugger.JythonDebugger.traceDispatch(JythonDebugger.java:46)
09:35:22 [2022-01-18T14:35:22.670Z] 	at jdk.internal.reflect.GeneratedMethodAccessor25.invoke(Unknown Source)
09:35:22 [2022-01-18T14:35:22.670Z] 	at java.base/jdk.internal.reflect.DelegatingMethodAccessorImpl.invoke(DelegatingMethodAccessorImpl.java:43)
09:35:22 [2022-01-18T14:35:22.670Z] 	at java.base/java.lang.reflect.Method.invoke(Method.java:564)
09:35:22 [2022-01-18T14:35:22.670Z] 
09:35:22 [2022-01-18T14:35:22.670Z] org.eclipse.ease.ScriptEngineCancellationException: org.eclipse.ease.ScriptEngineCancellationException: Terminated on user request
09:35:22 [2022-01-18T14:35:22.927Z] Start of script
09:35:22 [2022-01-18T14:35:22.927Z] include file start
09:35:22 [2022-01-18T14:35:22.927Z] include file processed
09:35:22 [2022-01-18T14:35:22.927Z] Result of testMethod = 5
09:35:22 [2022-01-18T14:35:22.927Z] End of script
09:35:23 [2022-01-18T14:35:23.184Z] Start of script
09:35:23 [2022-01-18T14:35:23.184Z] include file start
09:35:23 [2022-01-18T14:35:23.184Z] include file processed
09:35:23 [2022-01-18T14:35:23.184Z] Result of testMethod = 5
09:35:23 [2022-01-18T14:35:23.184Z] End of script
09:35:23 [2022-01-18T14:35:23.440Z] Start of script
09:35:23 [2022-01-18T14:35:23.440Z] include file start
09:35:23 [2022-01-18T14:35:23.440Z] include file processed
09:35:23 [2022-01-18T14:35:23.697Z] Traceback (most recent call last):
09:35:23 [2022-01-18T14:35:23.697Z]   File "(none)", line 184, in run
09:35:23 [2022-01-18T14:35:23.697Z]   File "__ref_L/Debug Test/Main.py_vilyeufwyf", line 22, in <module>
09:35:23 [2022-01-18T14:35:23.697Z]   File "(none)", line 161, in trace_dispatch
09:35:23 [2022-01-18T14:35:23.697Z] 	at org.eclipse.ease.debugging.AbstractEaseDebugger.handleEventsInSuspendedState(AbstractEaseDebugger.java:331)
09:35:23 [2022-01-18T14:35:23.697Z] 	at org.eclipse.ease.debugging.AbstractEaseDebugger.suspend(AbstractEaseDebugger.java:257)
09:35:23 [2022-01-18T14:35:23.697Z] 	at org.eclipse.ease.debugging.AbstractEaseDebugger.processLine(AbstractEaseDebugger.java:512)
09:35:23 [2022-01-18T14:35:23.697Z] 	at org.eclipse.ease.lang.python.debugger.PythonDebugger.traceDispatch(PythonDebugger.java:179)
09:35:23 [2022-01-18T14:35:23.698Z] 	at org.eclipse.ease.lang.python.jython.debugger.JythonDebugger.traceDispatch(JythonDebugger.java:46)
09:35:23 [2022-01-18T14:35:23.698Z] 	at jdk.internal.reflect.GeneratedMethodAccessor25.invoke(Unknown Source)
09:35:23 [2022-01-18T14:35:23.698Z] 	at java.base/jdk.internal.reflect.DelegatingMethodAccessorImpl.invoke(DelegatingMethodAccessorImpl.java:43)
09:35:23 [2022-01-18T14:35:23.698Z] 	at java.base/java.lang.reflect.Method.invoke(Method.java:564)
09:35:23 [2022-01-18T14:35:23.698Z] 
09:35:23 [2022-01-18T14:35:23.698Z] org.eclipse.ease.ScriptEngineCancellationException: org.eclipse.ease.ScriptEngineCancellationException: Terminated on user request
09:35:23 [2022-01-18T14:35:23.954Z] Start of script
09:35:23 [2022-01-18T14:35:23.954Z] include file start
09:35:23 [2022-01-18T14:35:23.954Z] include file processed
09:35:23 [2022-01-18T14:35:23.954Z] Result of testMethod = 5
09:35:23 [2022-01-18T14:35:23.954Z] End of script
09:35:23 [2022-01-18T14:35:23.954Z] Start of script
09:35:23 [2022-01-18T14:35:23.954Z] include file start
09:35:23 [2022-01-18T14:35:23.954Z] include file processed
09:35:24 [2022-01-18T14:35:24.211Z] Result of testMethod = 5
09:35:24 [2022-01-18T14:35:24.211Z] End of script
09:35:24 [2022-01-18T14:35:24.468Z] Traceback (most recent call last):
09:35:24 [2022-01-18T14:35:24.468Z]   File "(none)", line 184, in run
09:35:24 [2022-01-18T14:35:24.468Z]   File "__ref_L/Debug Test/Main.py_bczuoexzcy", line 1, in <module>
09:35:24 [2022-01-18T14:35:24.468Z]   File "(none)", line 161, in trace_dispatch
09:35:24 [2022-01-18T14:35:24.468Z] 	at org.eclipse.ease.debugging.AbstractEaseDebugger.handleEventsInSuspendedState(AbstractEaseDebugger.java:331)
09:35:24 [2022-01-18T14:35:24.468Z] 	at org.eclipse.ease.debugging.AbstractEaseDebugger.suspend(AbstractEaseDebugger.java:257)
09:35:24 [2022-01-18T14:35:24.468Z] 	at org.eclipse.ease.debugging.AbstractEaseDebugger.processLine(AbstractEaseDebugger.java:492)
09:35:24 [2022-01-18T14:35:24.468Z] 	at org.eclipse.ease.lang.python.debugger.PythonDebugger.traceDispatch(PythonDebugger.java:179)
09:35:24 [2022-01-18T14:35:24.468Z] 	at org.eclipse.ease.lang.python.jython.debugger.JythonDebugger.traceDispatch(JythonDebugger.java:46)
09:35:24 [2022-01-18T14:35:24.468Z] 	at jdk.internal.reflect.GeneratedMethodAccessor25.invoke(Unknown Source)
09:35:24 [2022-01-18T14:35:24.468Z] 	at java.base/jdk.internal.reflect.DelegatingMethodAccessorImpl.invoke(DelegatingMethodAccessorImpl.java:43)
09:35:24 [2022-01-18T14:35:24.468Z] 	at java.base/java.lang.reflect.Method.invoke(Method.java:564)
09:35:24 [2022-01-18T14:35:24.468Z] 
09:35:24 [2022-01-18T14:35:24.468Z] org.eclipse.ease.ScriptEngineCancellationException: org.eclipse.ease.ScriptEngineCancellationException: Terminated on user request
09:35:24 [2022-01-18T14:35:24.468Z] Start of script
09:35:24 [2022-01-18T14:35:24.725Z] include file start
09:35:24 [2022-01-18T14:35:24.725Z] include file processed
09:35:24 [2022-01-18T14:35:24.725Z] Result of testMethod = 5
09:35:24 [2022-01-18T14:35:24.725Z] End of script
09:35:24 [2022-01-18T14:35:24.725Z] Start of script
09:35:24 [2022-01-18T14:35:24.725Z] include file start
09:35:24 [2022-01-18T14:35:24.725Z] include file processed
09:35:24 [2022-01-18T14:35:24.983Z] Result of testMethod = 5
09:35:24 [2022-01-18T14:35:24.984Z] End of script
09:35:24 [2022-01-18T14:35:24.984Z] Start of script
09:35:24 [2022-01-18T14:35:24.984Z] include file start
09:35:24 [2022-01-18T14:35:24.984Z] include file processed
09:35:24 [2022-01-18T14:35:24.984Z] Result of testMethod = 5
09:35:25 [2022-01-18T14:35:25.240Z] Traceback (most recent call last):
09:35:25 [2022-01-18T14:35:25.240Z]   File "(none)", line 184, in run
09:35:25 [2022-01-18T14:35:25.240Z]   File "__ref_L/Debug Test/Main.py_zlmbuvyxra", line 23, in <module>
09:35:25 [2022-01-18T14:35:25.240Z]   File "(none)", line 161, in trace_dispatch
09:35:25 [2022-01-18T14:35:25.240Z] 	at org.eclipse.ease.debugging.AbstractEaseDebugger.handleEventsInSuspendedState(AbstractEaseDebugger.java:331)
09:35:25 [2022-01-18T14:35:25.240Z] 	at org.eclipse.ease.debugging.AbstractEaseDebugger.suspend(AbstractEaseDebugger.java:257)
09:35:25 [2022-01-18T14:35:25.240Z] 	at org.eclipse.ease.debugging.AbstractEaseDebugger.processLine(AbstractEaseDebugger.java:492)
09:35:25 [2022-01-18T14:35:25.240Z] 	at org.eclipse.ease.lang.python.debugger.PythonDebugger.traceDispatch(PythonDebugger.java:179)
09:35:25 [2022-01-18T14:35:25.240Z] 	at org.eclipse.ease.lang.python.jython.debugger.JythonDebugger.traceDispatch(JythonDebugger.java:46)
09:35:25 [2022-01-18T14:35:25.240Z] 	at jdk.internal.reflect.GeneratedMethodAccessor25.invoke(Unknown Source)
09:35:25 [2022-01-18T14:35:25.240Z] 	at java.base/jdk.internal.reflect.DelegatingMethodAccessorImpl.invoke(DelegatingMethodAccessorImpl.java:43)
09:35:25 [2022-01-18T14:35:25.240Z] 	at java.base/java.lang.reflect.Method.invoke(Method.java:564)
09:35:25 [2022-01-18T14:35:25.240Z] 
09:35:25 [2022-01-18T14:35:25.240Z] org.eclipse.ease.ScriptEngineCancellationException: org.eclipse.ease.ScriptEngineCancellationException: Terminated on user request
09:35:25 [2022-01-18T14:35:25.497Z] Start of script
09:35:25 [2022-01-18T14:35:25.497Z] include file start
09:35:25 [2022-01-18T14:35:25.497Z] include file processed
09:35:25 [2022-01-18T14:35:25.497Z] Result of testMethod = 5
09:35:25 [2022-01-18T14:35:25.497Z] End of script
09:35:25 [2022-01-18T14:35:25.754Z] Traceback (most recent call last):
09:35:25 [2022-01-18T14:35:25.754Z]   File "(none)", line 184, in run
09:35:25 [2022-01-18T14:35:25.754Z]   File "__ref_L/Debug Test/Main.py_ywjmtvnrmf", line 1, in <module>
09:35:25 [2022-01-18T14:35:25.754Z]   File "(none)", line 161, in trace_dispatch
09:35:25 [2022-01-18T14:35:25.754Z] 	at org.eclipse.ease.debugging.AbstractEaseDebugger.handleEventsInSuspendedState(AbstractEaseDebugger.java:331)
09:35:25 [2022-01-18T14:35:25.754Z] 	at org.eclipse.ease.debugging.AbstractEaseDebugger.suspend(AbstractEaseDebugger.java:257)
09:35:25 [2022-01-18T14:35:25.754Z] 	at org.eclipse.ease.debugging.AbstractEaseDebugger.processLine(AbstractEaseDebugger.java:492)
09:35:25 [2022-01-18T14:35:25.754Z] 	at org.eclipse.ease.lang.python.debugger.PythonDebugger.traceDispatch(PythonDebugger.java:179)
09:35:25 [2022-01-18T14:35:25.754Z] 	at org.eclipse.ease.lang.python.jython.debugger.JythonDebugger.traceDispatch(JythonDebugger.java:46)
09:35:25 [2022-01-18T14:35:25.754Z] 	at jdk.internal.reflect.GeneratedMethodAccessor25.invoke(Unknown Source)
09:35:25 [2022-01-18T14:35:25.754Z] 	at java.base/jdk.internal.reflect.DelegatingMethodAccessorImpl.invoke(DelegatingMethodAccessorImpl.java:43)
09:35:25 [2022-01-18T14:35:25.754Z] 	at java.base/java.lang.reflect.Method.invoke(Method.java:564)
09:35:25 [2022-01-18T14:35:25.754Z] 
09:35:25 [2022-01-18T14:35:25.754Z] org.eclipse.ease.ScriptEngineCancellationException: org.eclipse.ease.ScriptEngineCancellationException: Terminated on user request
09:35:26 [2022-01-18T14:35:26.011Z] Start of script
09:35:26 [2022-01-18T14:35:26.011Z] include file start
09:35:26 [2022-01-18T14:35:26.011Z] include file processed
09:35:26 [2022-01-18T14:35:26.011Z] Result of testMethod = 5
09:35:26 [2022-01-18T14:35:26.011Z] End of script
09:35:26 [2022-01-18T14:35:26.281Z] Start of script
09:35:26 [2022-01-18T14:35:26.281Z] include file start
09:35:26 [2022-01-18T14:35:26.281Z] include file processed
09:35:26 [2022-01-18T14:35:26.281Z] Result of testMethod = 5
09:35:26 [2022-01-18T14:35:26.281Z] End of script
09:35:26 [2022-01-18T14:35:26.538Z] Traceback (most recent call last):
09:35:26 [2022-01-18T14:35:26.538Z]   File "(none)", line 184, in run
09:35:26 [2022-01-18T14:35:26.538Z]   File "__ref_L/Debug Test/Main.py_uogexxouff", line 1, in <module>
09:35:26 [2022-01-18T14:35:26.538Z]   File "(none)", line 161, in trace_dispatch
09:35:26 [2022-01-18T14:35:26.538Z] 	at org.eclipse.ease.debugging.AbstractEaseDebugger.handleEventsInSuspendedState(AbstractEaseDebugger.java:331)
09:35:26 [2022-01-18T14:35:26.538Z] 	at org.eclipse.ease.debugging.AbstractEaseDebugger.suspend(AbstractEaseDebugger.java:257)
09:35:26 [2022-01-18T14:35:26.538Z] 	at org.eclipse.ease.debugging.AbstractEaseDebugger.processLine(AbstractEaseDebugger.java:492)
09:35:26 [2022-01-18T14:35:26.538Z] 	at org.eclipse.ease.lang.python.debugger.PythonDebugger.traceDispatch(PythonDebugger.java:179)
09:35:26 [2022-01-18T14:35:26.538Z] 	at org.eclipse.ease.lang.python.jython.debugger.JythonDebugger.traceDispatch(JythonDebugger.java:46)
09:35:26 [2022-01-18T14:35:26.538Z] 	at jdk.internal.reflect.GeneratedMethodAccessor25.invoke(Unknown Source)
09:35:26 [2022-01-18T14:35:26.538Z] 	at java.base/jdk.internal.reflect.DelegatingMethodAccessorImpl.invoke(DelegatingMethodAccessorImpl.java:43)
09:35:26 [2022-01-18T14:35:26.538Z] 	at java.base/java.lang.reflect.Method.invoke(Method.java:564)
09:35:26 [2022-01-18T14:35:26.538Z] 
09:35:26 [2022-01-18T14:35:26.538Z] org.eclipse.ease.ScriptEngineCancellationException: org.eclipse.ease.ScriptEngineCancellationException: Terminated on user request
09:35:26 [2022-01-18T14:35:26.795Z] Start of script
09:35:26 [2022-01-18T14:35:26.795Z] include file start
09:35:26 [2022-01-18T14:35:26.795Z] include file processed
09:35:26 [2022-01-18T14:35:26.795Z] Result of testMethod = 5
09:35:26 [2022-01-18T14:35:26.795Z] End of script
09:35:27 [2022-01-18T14:35:27.053Z] Start of script
09:35:27 [2022-01-18T14:35:27.053Z] include file start
09:35:27 [2022-01-18T14:35:27.053Z] include file processed
09:35:27 [2022-01-18T14:35:27.053Z] Result of testMethod = 5
09:35:27 [2022-01-18T14:35:27.310Z] Traceback (most recent call last):
09:35:27 [2022-01-18T14:35:27.310Z]   File "(none)", line 184, in run
09:35:27 [2022-01-18T14:35:27.310Z]   File "__ref_L/Debug Test/Main.py_uuliwvxxwh", line 23, in <module>
09:35:27 [2022-01-18T14:35:27.310Z]   File "(none)", line 161, in trace_dispatch
09:35:27 [2022-01-18T14:35:27.310Z] 	at org.eclipse.ease.debugging.AbstractEaseDebugger.handleEventsInSuspendedState(AbstractEaseDebugger.java:331)
09:35:27 [2022-01-18T14:35:27.310Z] 	at org.eclipse.ease.debugging.AbstractEaseDebugger.suspend(AbstractEaseDebugger.java:257)
09:35:27 [2022-01-18T14:35:27.310Z] 	at org.eclipse.ease.debugging.AbstractEaseDebugger.processLine(AbstractEaseDebugger.java:492)
09:35:27 [2022-01-18T14:35:27.310Z] 	at org.eclipse.ease.lang.python.debugger.PythonDebugger.traceDispatch(PythonDebugger.java:179)
09:35:27 [2022-01-18T14:35:27.310Z] 	at org.eclipse.ease.lang.python.jython.debugger.JythonDebugger.traceDispatch(JythonDebugger.java:46)
09:35:27 [2022-01-18T14:35:27.310Z] 	at jdk.internal.reflect.GeneratedMethodAccessor25.invoke(Unknown Source)
09:35:27 [2022-01-18T14:35:27.310Z] 	at java.base/jdk.internal.reflect.DelegatingMethodAccessorImpl.invoke(DelegatingMethodAccessorImpl.java:43)
09:35:27 [2022-01-18T14:35:27.310Z] 	at java.base/java.lang.reflect.Method.invoke(Method.java:564)
09:35:27 [2022-01-18T14:35:27.310Z] 
09:35:27 [2022-01-18T14:35:27.310Z] org.eclipse.ease.ScriptEngineCancellationException: org.eclipse.ease.ScriptEngineCancellationException: Terminated on user request
09:35:27 [2022-01-18T14:35:27.310Z] Start of script
09:35:27 [2022-01-18T14:35:27.310Z] include file start
09:35:27 [2022-01-18T14:35:27.310Z] include file processed
09:35:27 [2022-01-18T14:35:27.310Z] Result of testMethod = 5
09:35:27 [2022-01-18T14:35:27.310Z] End of script
09:35:27 [2022-01-18T14:35:27.568Z] Start of script
09:35:27 [2022-01-18T14:35:27.568Z] include file start
09:35:27 [2022-01-18T14:35:27.568Z] include file processed
09:35:27 [2022-01-18T14:35:27.826Z] Result of testMethod = 5
09:35:27 [2022-01-18T14:35:27.826Z] End of script
09:35:27 [2022-01-18T14:35:27.826Z] Start of script
09:35:27 [2022-01-18T14:35:27.826Z] include file start
09:35:27 [2022-01-18T14:35:27.826Z] include file processed
09:35:27 [2022-01-18T14:35:27.826Z] Result of testMethod = 5
09:35:27 [2022-01-18T14:35:27.826Z] End of script
09:35:28 [2022-01-18T14:35:28.083Z] Start of script
09:35:28 [2022-01-18T14:35:28.083Z] include file start
09:35:28 [2022-01-18T14:35:28.083Z] include file processed
09:35:28 [2022-01-18T14:35:28.083Z] Result of testMethod = 5
09:35:28 [2022-01-18T14:35:28.083Z] End of script
09:35:28 [2022-01-18T14:35:28.341Z] Start of script
09:35:28 [2022-01-18T14:35:28.341Z] include file start
09:35:28 [2022-01-18T14:35:28.341Z] include file processed
09:35:28 [2022-01-18T14:35:28.341Z] Traceback (most recent call last):
09:35:28 [2022-01-18T14:35:28.341Z]   File "(none)", line 184, in run
09:35:28 [2022-01-18T14:35:28.341Z]   File "__ref_L/Debug Test/Main.py_llmgeyxnch", line 21, in <module>
09:35:28 [2022-01-18T14:35:28.341Z]   File "__ref_L/Debug Test/Main.py_llmgeyxnch", line 18, in testMethod
09:35:28 [2022-01-18T14:35:28.341Z]   File "(none)", line 161, in trace_dispatch
09:35:28 [2022-01-18T14:35:28.341Z] 	at org.eclipse.ease.debugging.AbstractEaseDebugger.handleEventsInSuspendedState(AbstractEaseDebugger.java:331)
09:35:28 [2022-01-18T14:35:28.341Z] 	at org.eclipse.ease.debugging.AbstractEaseDebugger.suspend(AbstractEaseDebugger.java:257)
09:35:28 [2022-01-18T14:35:28.341Z] 	at org.eclipse.ease.debugging.AbstractEaseDebugger.processLine(AbstractEaseDebugger.java:492)
09:35:28 [2022-01-18T14:35:28.341Z] 	at org.eclipse.ease.lang.python.debugger.PythonDebugger.traceDispatch(PythonDebugger.java:179)
09:35:28 [2022-01-18T14:35:28.341Z] 	at org.eclipse.ease.lang.python.jython.debugger.JythonDebugger.traceDispatch(JythonDebugger.java:46)
09:35:28 [2022-01-18T14:35:28.341Z] 	at jdk.internal.reflect.GeneratedMethodAccessor25.invoke(Unknown Source)
09:35:28 [2022-01-18T14:35:28.341Z] 	at java.base/jdk.internal.reflect.DelegatingMethodAccessorImpl.invoke(DelegatingMethodAccessorImpl.java:43)
09:35:28 [2022-01-18T14:35:28.341Z] 	at java.base/java.lang.reflect.Method.invoke(Method.java:564)
09:35:28 [2022-01-18T14:35:28.341Z] 
09:35:28 [2022-01-18T14:35:28.341Z] org.eclipse.ease.ScriptEngineCancellationException: org.eclipse.ease.ScriptEngineCancellationException: Terminated on user request
09:35:28 [2022-01-18T14:35:28.598Z] Start of script
09:35:28 [2022-01-18T14:35:28.854Z] include file start
09:35:28 [2022-01-18T14:35:28.854Z] include file processed
09:35:28 [2022-01-18T14:35:28.855Z] Result of testMethod = 5
09:35:28 [2022-01-18T14:35:28.855Z] End of script
09:35:28 [2022-01-18T14:35:28.855Z] Start of script
09:35:28 [2022-01-18T14:35:28.855Z] include file start
09:35:28 [2022-01-18T14:35:28.855Z] include file processed
09:35:28 [2022-01-18T14:35:28.855Z] Result of testMethod = 5
09:35:28 [2022-01-18T14:35:28.855Z] End of script
09:35:28 [2022-01-18T14:35:28.855Z] Start of script
09:35:28 [2022-01-18T14:35:28.855Z] include file start
09:35:28 [2022-01-18T14:35:28.855Z] include file processed
09:35:29 [2022-01-18T14:35:29.111Z] Result of testMethod = 5
09:35:29 [2022-01-18T14:35:29.111Z] End of script
09:35:29 [2022-01-18T14:35:29.111Z] Start of script
09:35:29 [2022-01-18T14:35:29.111Z] include file start
09:35:29 [2022-01-18T14:35:29.111Z] include file processed
09:35:29 [2022-01-18T14:35:29.368Z] Result of testMethod = 5
09:35:29 [2022-01-18T14:35:29.368Z] End of script
09:35:29 [2022-01-18T14:35:29.368Z] Start of script
09:35:29 [2022-01-18T14:35:29.368Z] include file start
09:35:29 [2022-01-18T14:35:29.368Z] include file processed
09:35:29 [2022-01-18T14:35:29.624Z] Result of testMethod = 5
09:35:29 [2022-01-18T14:35:29.624Z] End of script
09:35:29 [2022-01-18T14:35:29.881Z] Start of script
09:35:29 [2022-01-18T14:35:29.881Z] include file start
09:35:29 [2022-01-18T14:35:29.881Z] include file processed
09:35:29 [2022-01-18T14:35:29.881Z] Result of testMethod = 5
09:35:29 [2022-01-18T14:35:29.881Z] End of script
09:35:29 [2022-01-18T14:35:29.881Z] Start of script
09:35:29 [2022-01-18T14:35:29.881Z] include file start
09:35:29 [2022-01-18T14:35:29.881Z] include file processed
09:35:29 [2022-01-18T14:35:29.881Z] Result of testMethod = 5
09:35:30 [2022-01-18T14:35:30.139Z] Traceback (most recent call last):
09:35:30 [2022-01-18T14:35:30.139Z]   File "(none)", line 184, in run
09:35:30 [2022-01-18T14:35:30.139Z]   File "__ref_L/Debug Test/Main.py_lqdswybyym", line 23, in <module>
09:35:30 [2022-01-18T14:35:30.139Z]   File "(none)", line 161, in trace_dispatch
09:35:30 [2022-01-18T14:35:30.139Z] 	at org.eclipse.ease.debugging.AbstractEaseDebugger.handleEventsInSuspendedState(AbstractEaseDebugger.java:331)
09:35:30 [2022-01-18T14:35:30.139Z] 	at org.eclipse.ease.debugging.AbstractEaseDebugger.suspend(AbstractEaseDebugger.java:257)
09:35:30 [2022-01-18T14:35:30.139Z] 	at org.eclipse.ease.debugging.AbstractEaseDebugger.processLine(AbstractEaseDebugger.java:492)
09:35:30 [2022-01-18T14:35:30.139Z] 	at org.eclipse.ease.lang.python.debugger.PythonDebugger.traceDispatch(PythonDebugger.java:179)
09:35:30 [2022-01-18T14:35:30.139Z] 	at org.eclipse.ease.lang.python.jython.debugger.JythonDebugger.traceDispatch(JythonDebugger.java:46)
09:35:30 [2022-01-18T14:35:30.139Z] 	at jdk.internal.reflect.GeneratedMethodAccessor25.invoke(Unknown Source)
09:35:30 [2022-01-18T14:35:30.139Z] 	at java.base/jdk.internal.reflect.DelegatingMethodAccessorImpl.invoke(DelegatingMethodAccessorImpl.java:43)
09:35:30 [2022-01-18T14:35:30.139Z] 	at java.base/java.lang.reflect.Method.invoke(Method.java:564)
09:35:30 [2022-01-18T14:35:30.139Z] 
09:35:30 [2022-01-18T14:35:30.139Z] org.eclipse.ease.ScriptEngineCancellationException: org.eclipse.ease.ScriptEngineCancellationException: Terminated on user request
09:35:30 [2022-01-18T14:35:30.400Z] Start of script
09:35:30 [2022-01-18T14:35:30.400Z] include file start
09:35:30 [2022-01-18T14:35:30.400Z] include file processed
09:35:30 [2022-01-18T14:35:30.400Z] Result of testMethod = 5
09:35:30 [2022-01-18T14:35:30.400Z] End of script
09:35:30 [2022-01-18T14:35:30.400Z] Start of script
09:35:30 [2022-01-18T14:35:30.400Z] include file start
09:35:30 [2022-01-18T14:35:30.400Z] include file processed
09:35:30 [2022-01-18T14:35:30.400Z] Result of testMethod = 5
09:35:30 [2022-01-18T14:35:30.657Z] Traceback (most recent call last):
09:35:30 [2022-01-18T14:35:30.657Z]   File "(none)", line 184, in run
09:35:30 [2022-01-18T14:35:30.657Z]   File "__ref_L/Debug Test/Main.py_lmcgapqlbf", line 23, in <module>
09:35:30 [2022-01-18T14:35:30.657Z]   File "(none)", line 161, in trace_dispatch
09:35:30 [2022-01-18T14:35:30.657Z] 	at org.eclipse.ease.debugging.AbstractEaseDebugger.handleEventsInSuspendedState(AbstractEaseDebugger.java:331)
09:35:30 [2022-01-18T14:35:30.657Z] 	at org.eclipse.ease.debugging.AbstractEaseDebugger.suspend(AbstractEaseDebugger.java:257)
09:35:30 [2022-01-18T14:35:30.657Z] 	at org.eclipse.ease.debugging.AbstractEaseDebugger.processLine(AbstractEaseDebugger.java:492)
09:35:30 [2022-01-18T14:35:30.657Z] 	at org.eclipse.ease.lang.python.debugger.PythonDebugger.traceDispatch(PythonDebugger.java:179)
09:35:30 [2022-01-18T14:35:30.657Z] 	at org.eclipse.ease.lang.python.jython.debugger.JythonDebugger.traceDispatch(JythonDebugger.java:46)
09:35:30 [2022-01-18T14:35:30.657Z] 	at jdk.internal.reflect.GeneratedMethodAccessor25.invoke(Unknown Source)
09:35:30 [2022-01-18T14:35:30.657Z] 	at java.base/jdk.internal.reflect.DelegatingMethodAccessorImpl.invoke(DelegatingMethodAccessorImpl.java:43)
09:35:30 [2022-01-18T14:35:30.657Z] 	at java.base/java.lang.reflect.Method.invoke(Method.java:564)
09:35:30 [2022-01-18T14:35:30.657Z] 
09:35:30 [2022-01-18T14:35:30.657Z] org.eclipse.ease.ScriptEngineCancellationException: org.eclipse.ease.ScriptEngineCancellationException: Terminated on user request
09:35:30 [2022-01-18T14:35:30.913Z] Traceback (most recent call last):
09:35:30 [2022-01-18T14:35:30.913Z]   File "(none)", line 184, in run
09:35:30 [2022-01-18T14:35:30.913Z]   File "__ref_L/Debug Test/Main.py_ushhgpvdrj", line 1, in <module>
09:35:30 [2022-01-18T14:35:30.913Z]   File "(none)", line 161, in trace_dispatch
09:35:30 [2022-01-18T14:35:30.913Z] 	at org.eclipse.ease.debugging.AbstractEaseDebugger.handleEventsInSuspendedState(AbstractEaseDebugger.java:331)
09:35:30 [2022-01-18T14:35:30.913Z] 	at org.eclipse.ease.debugging.AbstractEaseDebugger.suspend(AbstractEaseDebugger.java:257)
09:35:30 [2022-01-18T14:35:30.913Z] 	at org.eclipse.ease.debugging.AbstractEaseDebugger.processLine(AbstractEaseDebugger.java:492)
09:35:30 [2022-01-18T14:35:30.913Z] 	at org.eclipse.ease.lang.python.debugger.PythonDebugger.traceDispatch(PythonDebugger.java:179)
09:35:30 [2022-01-18T14:35:30.913Z] 	at org.eclipse.ease.lang.python.jython.debugger.JythonDebugger.traceDispatch(JythonDebugger.java:46)
09:35:30 [2022-01-18T14:35:30.913Z] 	at jdk.internal.reflect.GeneratedMethodAccessor25.invoke(Unknown Source)
09:35:30 [2022-01-18T14:35:30.913Z] 	at java.base/jdk.internal.reflect.DelegatingMethodAccessorImpl.invoke(DelegatingMethodAccessorImpl.java:43)
09:35:30 [2022-01-18T14:35:30.913Z] 	at java.base/java.lang.reflect.Method.invoke(Method.java:564)
09:35:30 [2022-01-18T14:35:30.914Z] 
09:35:30 [2022-01-18T14:35:30.914Z] org.eclipse.ease.ScriptEngineCancellationException: org.eclipse.ease.ScriptEngineCancellationException: Terminated on user request
09:35:31 [2022-01-18T14:35:31.171Z] Start of script
09:35:31 [2022-01-18T14:35:31.171Z] include file start
09:35:31 [2022-01-18T14:35:31.171Z] include file processed
09:35:31 [2022-01-18T14:35:31.171Z] Result of testMethod = 5
09:35:31 [2022-01-18T14:35:31.171Z] End of script
09:35:31 [2022-01-18T14:35:31.171Z] Start of script
09:35:31 [2022-01-18T14:35:31.171Z] include file start
09:35:31 [2022-01-18T14:35:31.171Z] include file processed
09:35:31 [2022-01-18T14:35:31.428Z] Result of testMethod = 5
09:35:31 [2022-01-18T14:35:31.428Z] End of script
09:35:31 [2022-01-18T14:35:31.428Z] Start of script
09:35:31 [2022-01-18T14:35:31.685Z] include file start
09:35:31 [2022-01-18T14:35:31.685Z] include file processed
09:35:31 [2022-01-18T14:35:31.685Z] Result of testMethod = 5
09:35:31 [2022-01-18T14:35:31.685Z] End of script
09:35:31 [2022-01-18T14:35:31.685Z] Tests run: 41, Failures: 1, Errors: 0, Skipped: 0, Time elapsed: 14.151 s <<< FAILURE! - in org.eclipse.ease.lang.python.jython.debugger.JythonDebugTest
09:35:31 [2022-01-18T14:35:31.685Z] disconnectProcessInSuspendedState  Time elapsed: 3.394 s
09:35:31 [2022-01-18T14:35:31.685Z] stepReturnIncludeCommand  Time elapsed: 0.214 s
09:35:31 [2022-01-18T14:35:31.685Z] arrayVariableSorting  Time elapsed: 0.309 s
09:35:31 [2022-01-18T14:35:31.685Z] stepOverOnDebugTarget  Time elapsed: 0.308 s
09:35:31 [2022-01-18T14:35:31.685Z] disconnectThreadInSuspendedState  Time elapsed: 0.339 s
09:35:31 [2022-01-18T14:35:31.685Z] stepReturnOnDebugTarget  Time elapsed: 0.309 s
09:35:31 [2022-01-18T14:35:31.685Z] nullVariable  Time elapsed: 0.305 s
09:35:31 [2022-01-18T14:35:31.685Z] stepOverOnStackFrame  Time elapsed: 0.306 s
09:35:31 [2022-01-18T14:35:31.685Z] resumeOnDebugTarget  Time elapsed: 0.206 s
09:35:31 [2022-01-18T14:35:31.685Z] modifyVariableKeepingType  Time elapsed: 0.506 s
09:35:31 [2022-01-18T14:35:31.685Z] resumeOnLastIncludeLine  Time elapsed: 0.205 s
09:35:31 [2022-01-18T14:35:31.685Z] stepReturnOnStackFrame  Time elapsed: 0.306 s
09:35:31 [2022-01-18T14:35:31.686Z] terminateStackFrameInSuspendedState  Time elapsed: 0.207 s
09:35:31 [2022-01-18T14:35:31.686Z] breakpointLocation  Time elapsed: 0.207 s
09:35:31 [2022-01-18T14:35:31.686Z] stepReturnOnThread  Time elapsed: 0.306 s
09:35:31 [2022-01-18T14:35:31.686Z] javaClassVariable  Time elapsed: 0.307 s
09:35:31 [2022-01-18T14:35:31.686Z] stepIntoOnThread  Time elapsed: 0.306 s
09:35:31 [2022-01-18T14:35:31.686Z] terminateThreadInSuspendedState  Time elapsed: 0.205 s
09:35:31 [2022-01-18T14:35:31.686Z] resumeOnThread  Time elapsed: 0.205 s
09:35:31 [2022-01-18T14:35:31.686Z] stepIntoOnStackFrame  Time elapsed: 0.423 s
09:35:31 [2022-01-18T14:35:31.686Z] terminateProcessInSuspendedState  Time elapsed: 0.205 s
09:35:31 [2022-01-18T14:35:31.686Z] stepOverOnProcess  Time elapsed: 0.307 s
09:35:31 [2022-01-18T14:35:31.686Z] nativeArrayVariable  Time elapsed: 0.306 s
09:35:31 [2022-01-18T14:35:31.686Z] disconnectDebugTargetInSuspendedState  Time elapsed: 0.205 s
09:35:31 [2022-01-18T14:35:31.686Z] stepIntoOnProcess  Time elapsed: 0.306 s
09:35:31 [2022-01-18T14:35:31.686Z] terminatedState  Time elapsed: 0.104 s
09:35:31 [2022-01-18T14:35:31.686Z] stepOverIncludeCommand  Time elapsed: 0.305 s
09:35:31 [2022-01-18T14:35:31.686Z] innerScopeVariableBeforeOuterScopeVariable  Time elapsed: 0.305 s
09:35:31 [2022-01-18T14:35:31.686Z] stepIntoIncludeCommand  Time elapsed: 0.305 s
09:35:31 [2022-01-18T14:35:31.686Z] primitiveStringVariable  Time elapsed: 0.108 s  <<< FAILURE!
09:35:31 [2022-01-18T14:35:31.686Z] org.opentest4j.AssertionFailedError: expected: <1> but was: <0>
09:35:31 [2022-01-18T14:35:31.686Z] 
09:35:31 [2022-01-18T14:35:31.686Z] resumeOnProcess  Time elapsed: 0.205 s
09:35:31 [2022-01-18T14:35:31.686Z] stepIntoOnDebugTarget  Time elapsed: 0.306 s
09:35:31 [2022-01-18T14:35:31.686Z] stepOverOnThread  Time elapsed: 0.306 s
09:35:31 [2022-01-18T14:35:31.686Z] suspendedState  Time elapsed: 0.204 s
09:35:31 [2022-01-18T14:35:31.686Z] primitiveDoubleVariable  Time elapsed: 0.305 s
09:35:31 [2022-01-18T14:35:31.686Z] resumeOnStackFrame  Time elapsed: 0.204 s
09:35:31 [2022-01-18T14:35:31.686Z] nativeObjectVariable  Time elapsed: 0.306 s
09:35:31 [2022-01-18T14:35:31.686Z] terminateDebugTargetInSuspendedState  Time elapsed: 0.214 s
09:35:31 [2022-01-18T14:35:31.686Z] disconnectStackFrameInSuspendedState  Time elapsed: 0.207 s
09:35:31 [2022-01-18T14:35:31.686Z] stepReturnOnProcess  Time elapsed: 0.306 s
09:35:31 [2022-01-18T14:35:31.686Z] evaluateWatchExpression  Time elapsed: 0.225 s
09:35:31 [2022-01-18T14:35:31.686Z] 
09:35:31 [2022-01-18T14:35:31.686Z] Results:
09:35:31 [2022-01-18T14:35:31.686Z] 
09:35:31 [2022-01-18T14:35:31.686Z] Failures: 
09:35:31 [2022-01-18T14:35:31.686Z]   JythonDebugTest>AbstractDebugTest.primitiveStringVariable:780 expected: <1> but was: <0>
09:35:31 [2022-01-18T14:35:31.686Z] 
09:35:31 [2022-01-18T14:35:31.686Z] Tests run: 41, Failures: 1, Errors: 0, Skipped: 0
09:35:31 [2022-01-18T14:35:31.686Z] 
09:35:31 [2022-01-18T14:35:31.944Z] [INFO] ------------------------------------------------------------------------
09:35:31 [2022-01-18T14:35:31.944Z] [INFO] Reactor Summary:
09:35:31 [2022-01-18T14:35:31.944Z] [INFO] 
09:35:31 [2022-01-18T14:35:31.945Z] [INFO] org.eclipse.ease.classloader 0.9.0-SNAPSHOT ........ SUCCESS [ 29.486 s]
09:35:31 [2022-01-18T14:35:31.945Z] [INFO] org.eclipse.ease 0.9.0-SNAPSHOT .................... SUCCESS [ 15.125 s]
09:35:31 [2022-01-18T14:35:31.945Z] [INFO] org.eclipse.ease.ui 0.9.0-SNAPSHOT ................. SUCCESS [ 18.584 s]
09:35:31 [2022-01-18T14:35:31.945Z] [INFO] org.eclipse.ease.ui.completions.java 0.9.0-SNAPSHOT  SUCCESS [  6.950 s]
09:35:31 [2022-01-18T14:35:31.945Z] [INFO] org.eclipse.ease.ui.scripts 0.9.0-SNAPSHOT ......... SUCCESS [ 14.448 s]
09:35:31 [2022-01-18T14:35:31.945Z] [INFO] org.eclipse.ease.releng 0.9.0-SNAPSHOT ............. SUCCESS [  0.137 s]
09:35:31 [2022-01-18T14:35:31.945Z] [INFO] org.eclipse.ease.lang.javascript 0.9.0-SNAPSHOT .... SUCCESS [  5.205 s]
09:35:31 [2022-01-18T14:35:31.945Z] [INFO] org.eclipse.ease.lang.scriptarchive 0.9.0-SNAPSHOT . SUCCESS [  4.512 s]
09:35:31 [2022-01-18T14:35:31.945Z] [INFO] org.eclipse.ease.lang.python 0.9.0-SNAPSHOT ........ SUCCESS [  6.247 s]
09:35:31 [2022-01-18T14:35:31.945Z] [INFO] org.eclipse.ease.lang.python.py4j 0.9.0-SNAPSHOT ... SUCCESS [  5.489 s]
09:35:31 [2022-01-18T14:35:31.945Z] [INFO] org.eclipse.ease.lang.groovy 0.9.0-SNAPSHOT ........ SUCCESS [  3.767 s]
09:35:31 [2022-01-18T14:35:31.945Z] [INFO] org.eclipse.ease.lang.groovy.interpreter 0.9.0-SNAPSHOT SUCCESS [  4.015 s]
09:35:31 [2022-01-18T14:35:31.945Z] [INFO] org.eclipse.ease.lang.unittest 0.9.0-SNAPSHOT ...... SUCCESS [  8.853 s]
09:35:31 [2022-01-18T14:35:31.945Z] [INFO] org.eclipse.ease.lang.unittest.ui 0.9.0-SNAPSHOT ... SUCCESS [  9.648 s]
09:35:31 [2022-01-18T14:35:31.945Z] [INFO] org.eclipse.ease.lang.ruby 0.9.0-SNAPSHOT .......... SUCCESS [  4.077 s]
09:35:31 [2022-01-18T14:35:31.945Z] [INFO] org.eclipse.ease.lang.ruby.jruby 0.9.0-SNAPSHOT .... SUCCESS [  4.256 s]
09:35:31 [2022-01-18T14:35:31.945Z] [INFO] org.eclipse.ease.lang.javascript.nashorn 0.9.0-SNAPSHOT SUCCESS [  5.018 s]
09:35:31 [2022-01-18T14:35:31.945Z] [INFO] org.eclipse.ease.lang.javascript.rhino 0.9.0-SNAPSHOT SUCCESS [  6.557 s]
09:35:31 [2022-01-18T14:35:31.945Z] [INFO] org.eclipse.ease.lang.python.jython 0.9.0-SNAPSHOT . SUCCESS [  6.998 s]
09:35:31 [2022-01-18T14:35:31.945Z] [INFO] org.eclipse.ease.lang.javascript.ui 0.9.0-SNAPSHOT . SUCCESS [  4.780 s]
09:35:31 [2022-01-18T14:35:31.945Z] [INFO] org.eclipse.ease.lang.jvm.compiled 0.9.0-SNAPSHOT .. SUCCESS [  5.168 s]
09:35:31 [2022-01-18T14:35:31.945Z] [INFO] org.eclipse.ease.lang.scriptarchive.ui 0.9.0-SNAPSHOT SUCCESS [  5.510 s]
09:35:31 [2022-01-18T14:35:31.945Z] [INFO] org.eclipse.ease.help 0.9.0-SNAPSHOT ............... SUCCESS [  7.569 s]
09:35:31 [2022-01-18T14:35:31.945Z] [INFO] org.eclipse.ease.feature 0.9.0-SNAPSHOT ............ SUCCESS [  0.130 s]
09:35:31 [2022-01-18T14:35:31.945Z] [INFO] org.eclipse.ease.ui.feature 0.9.0-SNAPSHOT ......... SUCCESS [  0.176 s]
09:35:31 [2022-01-18T14:35:31.945Z] [INFO] org.eclipse.ease.lang.javascript.feature 0.9.0-SNAPSHOT SUCCESS [  0.083 s]
09:35:31 [2022-01-18T14:35:31.945Z] [INFO] org.eclipse.ease.lang.python.feature 0.9.0-SNAPSHOT  SUCCESS [  0.036 s]
09:35:31 [2022-01-18T14:35:31.945Z] [INFO] org.eclipse.ease.python.jython.feature 0.9.0-SNAPSHOT SUCCESS [  0.078 s]
09:35:31 [2022-01-18T14:35:31.945Z] [INFO] org.eclipse.ease.lang.python.py4j.feature 0.9.0-SNAPSHOT SUCCESS [  0.082 s]
09:35:31 [2022-01-18T14:35:31.945Z] [INFO] org.eclipse.ease.lang.jvm.feature 0.9.0-SNAPSHOT ... SUCCESS [  0.058 s]
09:35:31 [2022-01-18T14:35:31.945Z] [INFO] org.eclipse.ease.lang.groovy.feature 0.9.0-SNAPSHOT  SUCCESS [  0.068 s]
09:35:31 [2022-01-18T14:35:31.945Z] [INFO] org.eclipse.ease.lang.ruby.feature 0.9.0-SNAPSHOT .. SUCCESS [  0.087 s]
09:35:31 [2022-01-18T14:35:31.945Z] [INFO] org.eclipse.ease.lang.scriptarchive.feature 0.9.0-SNAPSHOT SUCCESS [  0.088 s]
09:35:31 [2022-01-18T14:35:31.945Z] [INFO] org.eclipse.ease.lang.unittest.feature 0.9.0-SNAPSHOT SUCCESS [  0.039 s]
09:35:31 [2022-01-18T14:35:31.945Z] [INFO] org.eclipse.ease.releng.target 0.9.0-SNAPSHOT ...... SUCCESS [  0.002 s]
09:35:31 [2022-01-18T14:35:31.945Z] [INFO] org.eclipse.ease.releng.p2 0.9.0-SNAPSHOT .......... SUCCESS [  4.498 s]
09:35:31 [2022-01-18T14:35:31.945Z] [INFO] org.eclipse.ease.testhelper 0.9.0-SNAPSHOT ......... SUCCESS [  6.217 s]
09:35:31 [2022-01-18T14:35:31.945Z] [INFO] org.eclipse.ease.test 0.9.0-SNAPSHOT ............... SUCCESS [ 37.990 s]
09:35:31 [2022-01-18T14:35:31.945Z] [INFO] org.eclipse.ease.lang.javascript.rhino.test 0.9.0-SNAPSHOT SUCCESS [ 19.812 s]
09:35:31 [2022-01-18T14:35:31.945Z] [INFO] org.eclipse.ease.lang.javascript.test 0.9.0-SNAPSHOT SUCCESS [  5.944 s]
09:35:31 [2022-01-18T14:35:31.945Z] [INFO] org.eclipse.ease.lang.python.test 0.9.0-SNAPSHOT ... SUCCESS [  7.788 s]
09:35:31 [2022-01-18T14:35:31.945Z] [INFO] org.eclipse.ease.lang.python.jython.test 0.9.0-SNAPSHOT FAILURE [ 18.448 s]
09:35:31 [2022-01-18T14:35:31.945Z] [INFO] org.eclipse.ease.lang.scriptarchive.test 0.9.0-SNAPSHOT SKIPPED
09:35:31 [2022-01-18T14:35:31.945Z] [INFO] org.eclipse.ease.lang.unittest.test 0.9.0-SNAPSHOT . SKIPPED
09:35:31 [2022-01-18T14:35:31.946Z] [INFO] org.eclipse.ease.ui.scripts.test 0.9.0-SNAPSHOT .... SKIPPED
09:35:31 [2022-01-18T14:35:31.946Z] [INFO] org.eclipse.ease.ui.test 0.9.0-SNAPSHOT ............ SKIPPED
09:35:31 [2022-01-18T14:35:31.946Z] [INFO] org.eclipse.ease.ui.completions.java.test 0.9.0-SNAPSHOT SKIPPED
09:35:31 [2022-01-18T14:35:31.946Z] [INFO] org.eclipse.ease.releng.coverage 0.9.0-SNAPSHOT .... SKIPPED
09:35:31 [2022-01-18T14:35:31.946Z] [INFO] EASE (Incubation) 0.4.0-SNAPSHOT ................... SKIPPED
09:35:31 [2022-01-18T14:35:31.946Z] [INFO] ------------------------------------------------------------------------
09:35:31 [2022-01-18T14:35:31.946Z] [INFO] BUILD FAILURE
09:35:31 [2022-01-18T14:35:31.946Z] [INFO] ------------------------------------------------------------------------
09:35:31 [2022-01-18T14:35:31.946Z] [INFO] Total time:  06:07 min
09:35:31 [2022-01-18T14:35:31.946Z] [INFO] Finished at: 2022-01-18T14:35:31Z
09:35:31 [2022-01-18T14:35:31.946Z] [INFO] ------------------------------------------------------------------------
09:35:31 [2022-01-18T14:35:31.946Z] [INFO] [jenkins-event-spy] Generated /home/jenkins/agent/workspace/ease.verify.core.target.2019-06@tmp/withMaven179a7c8c/maven-spy-20220118-142924-5013205830350092478044.log
09:35:31 [2022-01-18T14:35:31.946Z] [ERROR] Failed to execute goal org.eclipse.tycho:tycho-surefire-plugin:2.2.0:test (default-test) on project org.eclipse.ease.lang.python.jython.test: There are test failures.
09:35:31 [2022-01-18T14:35:31.946Z] [ERROR] 
09:35:31 [2022-01-18T14:35:31.946Z] [ERROR] Please refer to /home/jenkins/agent/workspace/ease.verify.core.target.2019-06/tests/org.eclipse.ease.lang.python.jython.test/target/surefire-reports for the individual test results.
09:35:31 [2022-01-18T14:35:31.946Z] [ERROR] -> [Help 1]
09:35:31 [2022-01-18T14:35:31.946Z] [ERROR] 
09:35:31 [2022-01-18T14:35:31.946Z] [ERROR] To see the full stack trace of the errors, re-run Maven with the -e switch.
09:35:31 [2022-01-18T14:35:31.946Z] [ERROR] Re-run Maven using the -X switch to enable full debug logging.
09:35:31 [2022-01-18T14:35:31.946Z] [ERROR] 
09:35:31 [2022-01-18T14:35:31.946Z] [ERROR] For more information about the errors and possible solutions, please read the following articles:
09:35:31 [2022-01-18T14:35:31.946Z] [ERROR] [Help 1] http://cwiki.apache.org/confluence/display/MAVEN/MojoFailureException
09:35:31 [2022-01-18T14:35:31.946Z] [ERROR] 
09:35:31 [2022-01-18T14:35:31.946Z] [ERROR] After correcting the problems, you can resume the build with the command
09:35:31 [2022-01-18T14:35:31.946Z] [ERROR]   mvn <args> -rf :org.eclipse.ease.lang.python.jython.test