Console Output

Skipping 85 KB.. Full Log
ipt_1.7.10.v20190430-1943
09:39:44 [2021-11-16T14:39:44.251Z] 	at <unknown source>
09:39:44 [2021-11-16T14:39:44.251Z] 
09:39:44 [2021-11-16T14:39:44.251Z] Java Stacktrace:
09:39:44 [2021-11-16T14:39:44.251Z] java.lang.ClassNotFoundException: NotThere cannot be found by org.mozilla.javascript_1.7.10.v20190430-1943
09:39:44 [2021-11-16T14:39:44.251Z] 	at org.eclipse.osgi.internal.loader.BundleLoader.findClassInternal(BundleLoader.java:512)
09:39:44 [2021-11-16T14:39:44.251Z] 	at org.eclipse.osgi.internal.loader.BundleLoader.findClass(BundleLoader.java:423)
09:39:44 [2021-11-16T14:39:44.251Z] 	at org.eclipse.osgi.internal.loader.BundleLoader.findClass(BundleLoader.java:415)
09:39:44 [2021-11-16T14:39:44.251Z] 	at org.eclipse.osgi.internal.loader.ModuleClassLoader.loadClass(ModuleClassLoader.java:155)
09:39:44 [2021-11-16T14:39:44.251Z] 	at java.base/java.lang.ClassLoader.loadClass(ClassLoader.java:522)
09:39:44 [2021-11-16T14:39:44.251Z] 	at java.base/java.lang.Class.forName0(Native Method)
09:39:44 [2021-11-16T14:39:44.251Z] 	at java.base/java.lang.Class.forName(Class.java:377)
09:39:44 [2021-11-16T14:39:44.251Z] 	at java.base/jdk.internal.reflect.NativeMethodAccessorImpl.invoke0(Native Method)
09:39:44 [2021-11-16T14:39:44.251Z] 	at java.base/jdk.internal.reflect.NativeMethodAccessorImpl.invoke(NativeMethodAccessorImpl.java:64)
09:39:44 [2021-11-16T14:39:44.251Z] 	at java.base/jdk.internal.reflect.DelegatingMethodAccessorImpl.invoke(DelegatingMethodAccessorImpl.java:43)
09:39:44 [2021-11-16T14:39:44.251Z] 	at java.base/java.lang.reflect.Method.invoke(Method.java:564)
09:39:44 [2021-11-16T14:39:44.251Z] 	at org.mozilla.javascript.MemberBox.invoke(MemberBox.java:126)
09:39:44 [2021-11-16T14:39:44.251Z] 	at org.mozilla.javascript.NativeJavaMethod.call(NativeJavaMethod.java:225)
09:39:44 [2021-11-16T14:39:44.251Z] 	at org.mozilla.javascript.optimizer.OptRuntime.call1(OptRuntime.java:32)
09:39:44 [2021-11-16T14:39:44.251Z] 	at org.mozilla.javascript.gen.c_32._c_script_0(Unknown Source)
09:39:44 [2021-11-16T14:39:44.251Z] 	at org.mozilla.javascript.gen.c_32.call(Unknown Source)
09:39:44 [2021-11-16T14:39:44.251Z] 	at org.mozilla.javascript.ContextFactory.doTopCall(ContextFactory.java:405)
09:39:44 [2021-11-16T14:39:44.251Z] 	at org.mozilla.javascript.ScriptRuntime.doTopCall(ScriptRuntime.java:3508)
09:39:44 [2021-11-16T14:39:44.251Z] 	at org.mozilla.javascript.gen.c_32.call(Unknown Source)
09:39:44 [2021-11-16T14:39:44.251Z] 	at org.mozilla.javascript.gen.c_32.exec(Unknown Source)
09:39:44 [2021-11-16T14:39:44.251Z] 	at org.mozilla.javascript.Context.evaluateReader(Context.java:1293)
09:39:44 [2021-11-16T14:39:44.251Z] 	at org.eclipse.ease.lang.javascript.rhino.RhinoScriptEngine.internalExecute(RhinoScriptEngine.java:226)
09:39:44 [2021-11-16T14:39:44.251Z] 	at org.eclipse.ease.lang.javascript.rhino.RhinoScriptEngine.execute(RhinoScriptEngine.java:205)
09:39:44 [2021-11-16T14:39:44.251Z] 	at org.eclipse.ease.AbstractScriptEngine.inject(AbstractScriptEngine.java:191)
09:39:44 [2021-11-16T14:39:44.251Z] 	at org.eclipse.ease.AbstractScriptEngine.run(AbstractScriptEngine.java:244)
09:39:44 [2021-11-16T14:39:44.251Z] 	at org.eclipse.core.internal.jobs.Worker.run(Worker.java:63)
09:39:44 [2021-11-16T14:39:44.251Z] Tests run: 11, Failures: 0, Errors: 0, Skipped: 0, Time elapsed: 0.794 s - in org.eclipse.ease.lang.javascript.rhino.RhinoScriptEngineTest
09:39:44 [2021-11-16T14:39:44.251Z] execute_java_class_instantiation  Time elapsed: 0.342 s
09:39:44 [2021-11-16T14:39:44.251Z] execute_environment_module_code_with_optional_parameters  Time elapsed: 0.061 s
09:39:44 [2021-11-16T14:39:44.251Z] execute_throws_java_exception  Time elapsed: 0.033 s
09:39:44 [2021-11-16T14:39:44.251Z] execute_throws_java_class  Time elapsed: 0.06 s
09:39:44 [2021-11-16T14:39:44.252Z] execute_javascript_assignment  Time elapsed: 0.034 s
09:39:44 [2021-11-16T14:39:44.252Z] execute_eclipse_class_instantiation  Time elapsed: 0.034 s
09:39:44 [2021-11-16T14:39:44.252Z] execute_throws_javascript_object  Time elapsed: 0.059 s
09:39:44 [2021-11-16T14:39:44.252Z] execute_throws_syntax_error  Time elapsed: 0.023 s
09:39:44 [2021-11-16T14:39:44.252Z] execute_throws_javascript_runtime_error  Time elapsed: 0.061 s
09:39:44 [2021-11-16T14:39:44.252Z] execute_environment_module_code  Time elapsed: 0.02 s
09:39:44 [2021-11-16T14:39:44.252Z] execute_throws_wrapped_java_exception  Time elapsed: 0.031 s
09:39:44 [2021-11-16T14:39:44.252Z] Running org.eclipse.ease.lang.javascript.rhino.RhinoEnvironmentTest
09:39:44 [2021-11-16T14:39:44.814Z] Tests run: 5, Failures: 0, Errors: 0, Skipped: 0, Time elapsed: 0.539 s - in org.eclipse.ease.lang.javascript.rhino.RhinoEnvironmentTest
09:39:44 [2021-11-16T14:39:44.814Z] reloadEnvironment  Time elapsed: 0.034 s
09:39:44 [2021-11-16T14:39:44.814Z] bootstrappedEnvironment  Time elapsed: 0.02 s
09:39:44 [2021-11-16T14:39:44.814Z] postMethodCallback  Time elapsed: 0.392 s
09:39:44 [2021-11-16T14:39:44.814Z] preMethodCallback  Time elapsed: 0.055 s
09:39:44 [2021-11-16T14:39:44.814Z] reloadFunctionDefinitions  Time elapsed: 0.037 s
09:39:44 [2021-11-16T14:39:44.814Z] Running org.eclipse.ease.lang.javascript.rhino.RhinoDebuggerEngineTest
09:39:45 [2021-11-16T14:39:45.070Z] org.eclipse.ease.ScriptExecutionException: JavaError: java.lang.Exception
09:39:45 [2021-11-16T14:39:45.070Z] 
09:39:45 [2021-11-16T14:39:45.070Z] Java Stacktrace:
09:39:45 [2021-11-16T14:39:45.070Z] java.lang.Exception
09:39:45 [2021-11-16T14:39:45.070Z] 	at java.base/jdk.internal.reflect.NativeConstructorAccessorImpl.newInstance0(Native Method)
09:39:45 [2021-11-16T14:39:45.070Z] 	at java.base/jdk.internal.reflect.NativeConstructorAccessorImpl.newInstance(NativeConstructorAccessorImpl.java:64)
09:39:45 [2021-11-16T14:39:45.070Z] 	at java.base/jdk.internal.reflect.DelegatingConstructorAccessorImpl.newInstance(DelegatingConstructorAccessorImpl.java:45)
09:39:45 [2021-11-16T14:39:45.070Z] 	at java.base/java.lang.reflect.Constructor.newInstanceWithCaller(Constructor.java:500)
09:39:45 [2021-11-16T14:39:45.070Z] 	at java.base/java.lang.reflect.Constructor.newInstance(Constructor.java:481)
09:39:45 [2021-11-16T14:39:45.070Z] 	at org.mozilla.javascript.MemberBox.newInstance(MemberBox.java:159)
09:39:45 [2021-11-16T14:39:45.070Z] 	at org.mozilla.javascript.NativeJavaClass.constructInternal(NativeJavaClass.java:266)
09:39:45 [2021-11-16T14:39:45.070Z] 	at org.mozilla.javascript.NativeJavaClass.constructSpecific(NativeJavaClass.java:205)
09:39:45 [2021-11-16T14:39:45.070Z] 	at org.mozilla.javascript.NativeJavaClass.construct(NativeJavaClass.java:166)
09:39:45 [2021-11-16T14:39:45.070Z] 	at org.mozilla.javascript.Interpreter.interpretLoop(Interpreter.java:1617)
09:39:45 [2021-11-16T14:39:45.070Z] 	at org.mozilla.javascript.Interpreter.interpret(Interpreter.java:911)
09:39:45 [2021-11-16T14:39:45.070Z] 	at org.mozilla.javascript.InterpretedFunction.call(InterpretedFunction.java:109)
09:39:45 [2021-11-16T14:39:45.070Z] 	at org.mozilla.javascript.ContextFactory.doTopCall(ContextFactory.java:405)
09:39:45 [2021-11-16T14:39:45.070Z] 	at org.mozilla.javascript.ScriptRuntime.doTopCall(ScriptRuntime.java:3508)
09:39:45 [2021-11-16T14:39:45.070Z] 	at org.mozilla.javascript.InterpretedFunction.exec(InterpretedFunction.java:120)
09:39:45 [2021-11-16T14:39:45.070Z] 	at org.mozilla.javascript.Context.evaluateReader(Context.java:1293)
09:39:45 [2021-11-16T14:39:45.070Z] 	at org.eclipse.ease.lang.javascript.rhino.RhinoScriptEngine.internalExecute(RhinoScriptEngine.java:226)
09:39:45 [2021-11-16T14:39:45.070Z] 	at org.eclipse.ease.lang.javascript.rhino.RhinoScriptEngine.execute(RhinoScriptEngine.java:205)
09:39:45 [2021-11-16T14:39:45.070Z] 	at org.eclipse.ease.AbstractScriptEngine.inject(AbstractScriptEngine.java:191)
09:39:45 [2021-11-16T14:39:45.070Z] 	at org.eclipse.ease.AbstractScriptEngine.run(AbstractScriptEngine.java:244)
09:39:45 [2021-11-16T14:39:45.070Z] 	at org.eclipse.core.internal.jobs.Worker.run(Worker.java:63)
09:39:45 [2021-11-16T14:39:45.070Z] org.eclipse.ease.ScriptExecutionException: ScriptException: test
09:39:45 [2021-11-16T14:39:45.070Z] org.eclipse.ease.ScriptExecutionException: ScriptException: JavaScript
09:39:45 [2021-11-16T14:39:45.070Z] org.eclipse.ease.ScriptExecutionException: SyntaxError: unterminated string literal (#1)
09:39:45 [2021-11-16T14:39:45.070Z] 'asdf
09:39:45 [2021-11-16T14:39:45.070Z]     ^
09:39:45 [2021-11-16T14:39:45.070Z] 	at <unknown source>:1
09:39:45 [2021-11-16T14:39:45.070Z] org.eclipse.ease.ScriptExecutionException: TypeError: Cannot call method "foobar" of undefined
09:39:45 [2021-11-16T14:39:45.070Z] org.eclipse.ease.ScriptExecutionException: JavaError: NotThere cannot be found by org.mozilla.javascript_1.7.10.v20190430-1943
09:39:45 [2021-11-16T14:39:45.070Z] 
09:39:45 [2021-11-16T14:39:45.070Z] Java Stacktrace:
09:39:45 [2021-11-16T14:39:45.070Z] java.lang.ClassNotFoundException: NotThere cannot be found by org.mozilla.javascript_1.7.10.v20190430-1943
09:39:45 [2021-11-16T14:39:45.070Z] 	at org.eclipse.osgi.internal.loader.BundleLoader.findClassInternal(BundleLoader.java:512)
09:39:45 [2021-11-16T14:39:45.070Z] 	at org.eclipse.osgi.internal.loader.BundleLoader.findClass(BundleLoader.java:423)
09:39:45 [2021-11-16T14:39:45.070Z] 	at org.eclipse.osgi.internal.loader.BundleLoader.findClass(BundleLoader.java:415)
09:39:45 [2021-11-16T14:39:45.070Z] 	at org.eclipse.osgi.internal.loader.ModuleClassLoader.loadClass(ModuleClassLoader.java:155)
09:39:45 [2021-11-16T14:39:45.070Z] 	at java.base/java.lang.ClassLoader.loadClass(ClassLoader.java:522)
09:39:45 [2021-11-16T14:39:45.070Z] 	at java.base/java.lang.Class.forName0(Native Method)
09:39:45 [2021-11-16T14:39:45.070Z] 	at java.base/java.lang.Class.forName(Class.java:377)
09:39:45 [2021-11-16T14:39:45.070Z] 	at java.base/jdk.internal.reflect.NativeMethodAccessorImpl.invoke0(Native Method)
09:39:45 [2021-11-16T14:39:45.070Z] 	at java.base/jdk.internal.reflect.NativeMethodAccessorImpl.invoke(NativeMethodAccessorImpl.java:64)
09:39:45 [2021-11-16T14:39:45.070Z] 	at java.base/jdk.internal.reflect.DelegatingMethodAccessorImpl.invoke(DelegatingMethodAccessorImpl.java:43)
09:39:45 [2021-11-16T14:39:45.070Z] 	at java.base/java.lang.reflect.Method.invoke(Method.java:564)
09:39:45 [2021-11-16T14:39:45.070Z] 	at org.mozilla.javascript.MemberBox.invoke(MemberBox.java:126)
09:39:45 [2021-11-16T14:39:45.070Z] 	at org.mozilla.javascript.NativeJavaMethod.call(NativeJavaMethod.java:225)
09:39:45 [2021-11-16T14:39:45.070Z] 	at org.mozilla.javascript.Interpreter.interpretLoop(Interpreter.java:1573)
09:39:45 [2021-11-16T14:39:45.070Z] 	at org.mozilla.javascript.Interpreter.interpret(Interpreter.java:911)
09:39:45 [2021-11-16T14:39:45.070Z] 	at org.mozilla.javascript.InterpretedFunction.call(InterpretedFunction.java:109)
09:39:45 [2021-11-16T14:39:45.070Z] 	at org.mozilla.javascript.ContextFactory.doTopCall(ContextFactory.java:405)
09:39:45 [2021-11-16T14:39:45.070Z] 	at org.mozilla.javascript.ScriptRuntime.doTopCall(ScriptRuntime.java:3508)
09:39:45 [2021-11-16T14:39:45.070Z] 	at org.mozilla.javascript.InterpretedFunction.exec(InterpretedFunction.java:120)
09:39:45 [2021-11-16T14:39:45.070Z] 	at org.mozilla.javascript.Context.evaluateReader(Context.java:1293)
09:39:45 [2021-11-16T14:39:45.070Z] 	at org.eclipse.ease.lang.javascript.rhino.RhinoScriptEngine.internalExecute(RhinoScriptEngine.java:226)
09:39:45 [2021-11-16T14:39:45.070Z] 	at org.eclipse.ease.lang.javascript.rhino.RhinoScriptEngine.execute(RhinoScriptEngine.java:205)
09:39:45 [2021-11-16T14:39:45.070Z] 	at org.eclipse.ease.AbstractScriptEngine.inject(AbstractScriptEngine.java:191)
09:39:45 [2021-11-16T14:39:45.070Z] 	at org.eclipse.ease.AbstractScriptEngine.run(AbstractScriptEngine.java:244)
09:39:45 [2021-11-16T14:39:45.070Z] 	at org.eclipse.core.internal.jobs.Worker.run(Worker.java:63)
09:39:45 [2021-11-16T14:39:45.070Z] org.eclipse.ease.ScriptExecutionException: TypeError: Cannot call method "substr" of null
09:39:45 [2021-11-16T14:39:45.070Z] 	at mainFile.js,throwOnNull():4
09:39:45 [2021-11-16T14:39:45.070Z] 	at includeFile.js,subCall():2
09:39:45 [2021-11-16T14:39:45.070Z] 	at mainFile.js:7
09:39:45 [2021-11-16T14:39:45.070Z] Tests run: 12, Failures: 0, Errors: 0, Skipped: 0, Time elapsed: 0.352 s - in org.eclipse.ease.lang.javascript.rhino.RhinoDebuggerEngineTest
09:39:45 [2021-11-16T14:39:45.070Z] execute_java_class_instantiation  Time elapsed: 0.122 s
09:39:45 [2021-11-16T14:39:45.070Z] execute_environment_module_code_with_optional_parameters  Time elapsed: 0.03 s
09:39:45 [2021-11-16T14:39:45.070Z] execute_throws_java_exception  Time elapsed: 0.014 s
09:39:45 [2021-11-16T14:39:45.070Z] execute_throws_java_class  Time elapsed: 0.013 s
09:39:45 [2021-11-16T14:39:45.070Z] execute_javascript_assignment  Time elapsed: 0.014 s
09:39:45 [2021-11-16T14:39:45.070Z] execute_eclipse_class_instantiation  Time elapsed: 0.012 s
09:39:45 [2021-11-16T14:39:45.071Z] execute_throws_javascript_object  Time elapsed: 0.046 s
09:39:45 [2021-11-16T14:39:45.071Z] execute_throws_syntax_error  Time elapsed: 0.012 s
09:39:45 [2021-11-16T14:39:45.071Z] execute_throws_javascript_runtime_error  Time elapsed: 0.011 s
09:39:45 [2021-11-16T14:39:45.071Z] execute_environment_module_code  Time elapsed: 0.012 s
09:39:45 [2021-11-16T14:39:45.071Z] execute_throws_wrapped_java_exception  Time elapsed: 0.012 s
09:39:45 [2021-11-16T14:39:45.071Z] getExceptionStackTrace_returns_script_trace_over_multiple_files  Time elapsed: 0.047 s
09:39:45 [2021-11-16T14:39:45.071Z] Running org.eclipse.ease.lang.javascript.rhino.RhinoDebugTest
09:39:45 [2021-11-16T14:39:45.329Z] Start of script
09:39:45 [2021-11-16T14:39:45.329Z] include file start
09:39:45 [2021-11-16T14:39:45.329Z] Include file processed
09:39:45 [2021-11-16T14:39:45.329Z] line after include file
09:39:45 [2021-11-16T14:39:45.329Z] Result of testMethod = 5
09:39:45 [2021-11-16T14:39:45.329Z] End of script
09:39:45 [2021-11-16T14:39:45.585Z] Start of script
09:39:45 [2021-11-16T14:39:45.585Z] include file start
09:39:45 [2021-11-16T14:39:45.585Z] Include file processed
09:39:45 [2021-11-16T14:39:45.585Z] line after include file
09:39:45 [2021-11-16T14:39:45.585Z] Result of testMethod = 5
09:39:45 [2021-11-16T14:39:45.585Z] End of script
09:39:45 [2021-11-16T14:39:45.585Z] Start of script
09:39:45 [2021-11-16T14:39:45.585Z] include file start
09:39:45 [2021-11-16T14:39:45.585Z] Include file processed
09:39:45 [2021-11-16T14:39:45.585Z] line after include file
09:39:45 [2021-11-16T14:39:45.585Z] Result of testMethod = 5
09:39:45 [2021-11-16T14:39:45.842Z] org.eclipse.ease.ScriptEngineCancellationException: Terminated on user request
09:39:45 [2021-11-16T14:39:45.842Z] 	at org.eclipse.ease.debugging.AbstractEaseDebugger.handleEventsInSuspendedState(AbstractEaseDebugger.java:331)
09:39:45 [2021-11-16T14:39:45.842Z] 	at org.eclipse.ease.debugging.AbstractEaseDebugger.suspend(AbstractEaseDebugger.java:257)
09:39:45 [2021-11-16T14:39:45.843Z] 	at org.eclipse.ease.debugging.AbstractEaseDebugger.processLine(AbstractEaseDebugger.java:492)
09:39:45 [2021-11-16T14:39:45.843Z] 	at org.eclipse.ease.lang.javascript.rhino.debugger.RhinoDebugger.access$4(RhinoDebugger.java:1)
09:39:45 [2021-11-16T14:39:45.843Z] 	at org.eclipse.ease.lang.javascript.rhino.debugger.RhinoDebugger$RhinoDebugFrame.onLineChange(RhinoDebugger.java:124)
09:39:45 [2021-11-16T14:39:45.843Z] 	at org.mozilla.javascript.Interpreter.interpretLoop(Interpreter.java:1931)
09:39:45 [2021-11-16T14:39:45.843Z] 	at org.mozilla.javascript.Interpreter.interpret(Interpreter.java:911)
09:39:45 [2021-11-16T14:39:45.843Z] 	at org.mozilla.javascript.InterpretedFunction.call(InterpretedFunction.java:109)
09:39:45 [2021-11-16T14:39:45.843Z] 	at org.mozilla.javascript.ContextFactory.doTopCall(ContextFactory.java:405)
09:39:45 [2021-11-16T14:39:45.843Z] 	at org.mozilla.javascript.ScriptRuntime.doTopCall(ScriptRuntime.java:3508)
09:39:45 [2021-11-16T14:39:45.843Z] 	at org.mozilla.javascript.InterpretedFunction.exec(InterpretedFunction.java:120)
09:39:45 [2021-11-16T14:39:45.843Z] 	at org.mozilla.javascript.Context.evaluateReader(Context.java:1293)
09:39:45 [2021-11-16T14:39:45.843Z] 	at org.eclipse.ease.lang.javascript.rhino.RhinoScriptEngine.internalExecute(RhinoScriptEngine.java:226)
09:39:45 [2021-11-16T14:39:45.843Z] 	at org.eclipse.ease.lang.javascript.rhino.RhinoScriptEngine.execute(RhinoScriptEngine.java:205)
09:39:45 [2021-11-16T14:39:45.843Z] 	at org.eclipse.ease.AbstractScriptEngine.inject(AbstractScriptEngine.java:191)
09:39:45 [2021-11-16T14:39:45.843Z] 	at org.eclipse.ease.AbstractScriptEngine.run(AbstractScriptEngine.java:244)
09:39:45 [2021-11-16T14:39:45.843Z] 	at org.eclipse.core.internal.jobs.Worker.run(Worker.java:63)
09:39:46 [2021-11-16T14:39:46.099Z] Start of script
09:39:46 [2021-11-16T14:39:46.099Z] include file start
09:39:46 [2021-11-16T14:39:46.099Z] Include file processed
09:39:46 [2021-11-16T14:39:46.099Z] line after include file
09:39:46 [2021-11-16T14:39:46.099Z] Result of testMethod = 5
09:39:46 [2021-11-16T14:39:46.099Z] End of script
09:39:46 [2021-11-16T14:39:46.367Z] Start of script
09:39:46 [2021-11-16T14:39:46.367Z] include file start
09:39:46 [2021-11-16T14:39:46.367Z] Include file processed
09:39:46 [2021-11-16T14:39:46.367Z] line after include file
09:39:46 [2021-11-16T14:39:46.367Z] Result of testMethod = 5
09:39:46 [2021-11-16T14:39:46.367Z] End of script
09:39:46 [2021-11-16T14:39:46.623Z] Start of script
09:39:46 [2021-11-16T14:39:46.623Z] include file start
09:39:46 [2021-11-16T14:39:46.623Z] Include file processed
09:39:46 [2021-11-16T14:39:46.623Z] line after include file
09:39:46 [2021-11-16T14:39:46.623Z] Result of testMethod = 5
09:39:46 [2021-11-16T14:39:46.623Z] End of script
09:39:46 [2021-11-16T14:39:46.879Z] Start of script
09:39:46 [2021-11-16T14:39:46.879Z] include file start
09:39:46 [2021-11-16T14:39:46.879Z] Include file processed
09:39:46 [2021-11-16T14:39:46.879Z] line after include file
09:39:46 [2021-11-16T14:39:46.879Z] Result of testMethod = 5
09:39:47 [2021-11-16T14:39:47.135Z] org.eclipse.ease.ScriptEngineCancellationException: Terminated on user request
09:39:47 [2021-11-16T14:39:47.135Z] 	at org.eclipse.ease.debugging.AbstractEaseDebugger.handleEventsInSuspendedState(AbstractEaseDebugger.java:331)
09:39:47 [2021-11-16T14:39:47.135Z] 	at org.eclipse.ease.debugging.AbstractEaseDebugger.suspend(AbstractEaseDebugger.java:257)
09:39:47 [2021-11-16T14:39:47.135Z] 	at org.eclipse.ease.debugging.AbstractEaseDebugger.processLine(AbstractEaseDebugger.java:492)
09:39:47 [2021-11-16T14:39:47.135Z] 	at org.eclipse.ease.lang.javascript.rhino.debugger.RhinoDebugger.access$4(RhinoDebugger.java:1)
09:39:47 [2021-11-16T14:39:47.135Z] 	at org.eclipse.ease.lang.javascript.rhino.debugger.RhinoDebugger$RhinoDebugFrame.onLineChange(RhinoDebugger.java:124)
09:39:47 [2021-11-16T14:39:47.135Z] 	at org.mozilla.javascript.Interpreter.interpretLoop(Interpreter.java:1931)
09:39:47 [2021-11-16T14:39:47.135Z] 	at org.mozilla.javascript.Interpreter.interpret(Interpreter.java:911)
09:39:47 [2021-11-16T14:39:47.135Z] 	at org.mozilla.javascript.InterpretedFunction.call(InterpretedFunction.java:109)
09:39:47 [2021-11-16T14:39:47.135Z] 	at org.mozilla.javascript.ContextFactory.doTopCall(ContextFactory.java:405)
09:39:47 [2021-11-16T14:39:47.135Z] 	at org.mozilla.javascript.ScriptRuntime.doTopCall(ScriptRuntime.java:3508)
09:39:47 [2021-11-16T14:39:47.135Z] 	at org.mozilla.javascript.InterpretedFunction.exec(InterpretedFunction.java:120)
09:39:47 [2021-11-16T14:39:47.135Z] 	at org.mozilla.javascript.Context.evaluateReader(Context.java:1293)
09:39:47 [2021-11-16T14:39:47.135Z] 	at org.eclipse.ease.lang.javascript.rhino.RhinoScriptEngine.internalExecute(RhinoScriptEngine.java:226)
09:39:47 [2021-11-16T14:39:47.135Z] 	at org.eclipse.ease.lang.javascript.rhino.RhinoScriptEngine.execute(RhinoScriptEngine.java:205)
09:39:47 [2021-11-16T14:39:47.135Z] 	at org.eclipse.ease.AbstractScriptEngine.inject(AbstractScriptEngine.java:191)
09:39:47 [2021-11-16T14:39:47.135Z] 	at org.eclipse.ease.AbstractScriptEngine.run(AbstractScriptEngine.java:244)
09:39:47 [2021-11-16T14:39:47.135Z] 	at org.eclipse.core.internal.jobs.Worker.run(Worker.java:63)
09:39:47 [2021-11-16T14:39:47.135Z] Start of script
09:39:47 [2021-11-16T14:39:47.135Z] include file start
09:39:47 [2021-11-16T14:39:47.135Z] Include file processed
09:39:47 [2021-11-16T14:39:47.135Z] line after include file
09:39:47 [2021-11-16T14:39:47.391Z] Result of testMethod = 5
09:39:47 [2021-11-16T14:39:47.391Z] End of script
09:39:47 [2021-11-16T14:39:47.391Z] Start of script
09:39:47 [2021-11-16T14:39:47.391Z] include file start
09:39:47 [2021-11-16T14:39:47.391Z] Include file processed
09:39:47 [2021-11-16T14:39:47.391Z] line after include file
09:39:47 [2021-11-16T14:39:47.391Z] Result of testMethod = 5
09:39:47 [2021-11-16T14:39:47.647Z] End of script
09:39:47 [2021-11-16T14:39:47.647Z] Start of script
09:39:47 [2021-11-16T14:39:47.647Z] include file start
09:39:47 [2021-11-16T14:39:47.647Z] Include file processed
09:39:47 [2021-11-16T14:39:47.647Z] line after include file
09:39:47 [2021-11-16T14:39:47.903Z] org.eclipse.ease.ScriptEngineCancellationException: Terminated on user request
09:39:47 [2021-11-16T14:39:47.903Z] 	at org.eclipse.ease.debugging.AbstractEaseDebugger.handleEventsInSuspendedState(AbstractEaseDebugger.java:331)
09:39:47 [2021-11-16T14:39:47.903Z] 	at org.eclipse.ease.debugging.AbstractEaseDebugger.suspend(AbstractEaseDebugger.java:257)
09:39:47 [2021-11-16T14:39:47.903Z] 	at org.eclipse.ease.debugging.AbstractEaseDebugger.processLine(AbstractEaseDebugger.java:512)
09:39:47 [2021-11-16T14:39:47.903Z] 	at org.eclipse.ease.lang.javascript.rhino.debugger.RhinoDebugger.access$4(RhinoDebugger.java:1)
09:39:47 [2021-11-16T14:39:47.903Z] 	at org.eclipse.ease.lang.javascript.rhino.debugger.RhinoDebugger$RhinoDebugFrame.onLineChange(RhinoDebugger.java:124)
09:39:47 [2021-11-16T14:39:47.903Z] 	at org.mozilla.javascript.Interpreter.interpretLoop(Interpreter.java:1931)
09:39:47 [2021-11-16T14:39:47.903Z] 	at org.mozilla.javascript.Interpreter.interpret(Interpreter.java:911)
09:39:47 [2021-11-16T14:39:47.903Z] 	at org.mozilla.javascript.InterpretedFunction.call(InterpretedFunction.java:109)
09:39:47 [2021-11-16T14:39:47.903Z] 	at org.mozilla.javascript.ContextFactory.doTopCall(ContextFactory.java:405)
09:39:47 [2021-11-16T14:39:47.903Z] 	at org.mozilla.javascript.ScriptRuntime.doTopCall(ScriptRuntime.java:3508)
09:39:47 [2021-11-16T14:39:47.903Z] 	at org.mozilla.javascript.InterpretedFunction.exec(InterpretedFunction.java:120)
09:39:47 [2021-11-16T14:39:47.903Z] 	at org.mozilla.javascript.Context.evaluateReader(Context.java:1293)
09:39:47 [2021-11-16T14:39:47.903Z] 	at org.eclipse.ease.lang.javascript.rhino.RhinoScriptEngine.internalExecute(RhinoScriptEngine.java:226)
09:39:47 [2021-11-16T14:39:47.903Z] 	at org.eclipse.ease.lang.javascript.rhino.RhinoScriptEngine.execute(RhinoScriptEngine.java:205)
09:39:47 [2021-11-16T14:39:47.903Z] 	at org.eclipse.ease.AbstractScriptEngine.inject(AbstractScriptEngine.java:191)
09:39:47 [2021-11-16T14:39:47.903Z] 	at org.eclipse.ease.AbstractScriptEngine.run(AbstractScriptEngine.java:244)
09:39:47 [2021-11-16T14:39:47.903Z] 	at org.eclipse.core.internal.jobs.Worker.run(Worker.java:63)
09:39:48 [2021-11-16T14:39:48.159Z] Start of script
09:39:48 [2021-11-16T14:39:48.159Z] include file start
09:39:48 [2021-11-16T14:39:48.159Z] Include file processed
09:39:48 [2021-11-16T14:39:48.159Z] line after include file
09:39:48 [2021-11-16T14:39:48.159Z] Result of testMethod = 5
09:39:48 [2021-11-16T14:39:48.159Z] End of script
09:39:48 [2021-11-16T14:39:48.159Z] Start of script
09:39:48 [2021-11-16T14:39:48.159Z] include file start
09:39:48 [2021-11-16T14:39:48.159Z] Include file processed
09:39:48 [2021-11-16T14:39:48.159Z] line after include file
09:39:48 [2021-11-16T14:39:48.414Z] Result of testMethod = 5
09:39:48 [2021-11-16T14:39:48.415Z] End of script
09:39:48 [2021-11-16T14:39:48.671Z] org.eclipse.ease.ScriptEngineCancellationException: Terminated on user request
09:39:48 [2021-11-16T14:39:48.671Z] 	at org.eclipse.ease.debugging.AbstractEaseDebugger.handleEventsInSuspendedState(AbstractEaseDebugger.java:331)
09:39:48 [2021-11-16T14:39:48.671Z] 	at org.eclipse.ease.debugging.AbstractEaseDebugger.suspend(AbstractEaseDebugger.java:257)
09:39:48 [2021-11-16T14:39:48.671Z] 	at org.eclipse.ease.debugging.AbstractEaseDebugger.processLine(AbstractEaseDebugger.java:492)
09:39:48 [2021-11-16T14:39:48.671Z] 	at org.eclipse.ease.lang.javascript.rhino.debugger.RhinoDebugger.access$4(RhinoDebugger.java:1)
09:39:48 [2021-11-16T14:39:48.671Z] 	at org.eclipse.ease.lang.javascript.rhino.debugger.RhinoDebugger$RhinoDebugFrame.onLineChange(RhinoDebugger.java:124)
09:39:48 [2021-11-16T14:39:48.671Z] 	at org.mozilla.javascript.Interpreter.interpretLoop(Interpreter.java:1931)
09:39:48 [2021-11-16T14:39:48.671Z] 	at org.mozilla.javascript.Interpreter.interpret(Interpreter.java:911)
09:39:48 [2021-11-16T14:39:48.672Z] 	at org.mozilla.javascript.InterpretedFunction.call(InterpretedFunction.java:109)
09:39:48 [2021-11-16T14:39:48.672Z] 	at org.mozilla.javascript.ContextFactory.doTopCall(ContextFactory.java:405)
09:39:48 [2021-11-16T14:39:48.672Z] 	at org.mozilla.javascript.ScriptRuntime.doTopCall(ScriptRuntime.java:3508)
09:39:48 [2021-11-16T14:39:48.672Z] 	at org.mozilla.javascript.InterpretedFunction.exec(InterpretedFunction.java:120)
09:39:48 [2021-11-16T14:39:48.672Z] 	at org.mozilla.javascript.Context.evaluateReader(Context.java:1293)
09:39:48 [2021-11-16T14:39:48.672Z] 	at org.eclipse.ease.lang.javascript.rhino.RhinoScriptEngine.internalExecute(RhinoScriptEngine.java:226)
09:39:48 [2021-11-16T14:39:48.672Z] 	at org.eclipse.ease.lang.javascript.rhino.RhinoScriptEngine.execute(RhinoScriptEngine.java:205)
09:39:48 [2021-11-16T14:39:48.672Z] 	at org.eclipse.ease.AbstractScriptEngine.inject(AbstractScriptEngine.java:191)
09:39:48 [2021-11-16T14:39:48.672Z] 	at org.eclipse.ease.AbstractScriptEngine.run(AbstractScriptEngine.java:244)
09:39:48 [2021-11-16T14:39:48.672Z] 	at org.eclipse.core.internal.jobs.Worker.run(Worker.java:63)
09:39:48 [2021-11-16T14:39:48.672Z] Start of script
09:39:48 [2021-11-16T14:39:48.928Z] include file start
09:39:48 [2021-11-16T14:39:48.928Z] Include file processed
09:39:48 [2021-11-16T14:39:48.928Z] line after include file
09:39:48 [2021-11-16T14:39:48.928Z] Result of testMethod = 5
09:39:48 [2021-11-16T14:39:48.928Z] End of script
09:39:48 [2021-11-16T14:39:48.928Z] Start of script
09:39:48 [2021-11-16T14:39:48.928Z] include file start
09:39:48 [2021-11-16T14:39:48.928Z] Include file processed
09:39:48 [2021-11-16T14:39:48.928Z] line after include file
09:39:49 [2021-11-16T14:39:49.184Z] Result of testMethod = 5
09:39:49 [2021-11-16T14:39:49.184Z] End of script
09:39:49 [2021-11-16T14:39:49.184Z] Start of script
09:39:49 [2021-11-16T14:39:49.184Z] include file start
09:39:49 [2021-11-16T14:39:49.184Z] Include file processed
09:39:49 [2021-11-16T14:39:49.184Z] line after include file
09:39:49 [2021-11-16T14:39:49.184Z] Result of testMethod = 5
09:39:49 [2021-11-16T14:39:49.443Z] org.eclipse.ease.ScriptEngineCancellationException: Terminated on user request
09:39:49 [2021-11-16T14:39:49.443Z] 	at org.eclipse.ease.debugging.AbstractEaseDebugger.handleEventsInSuspendedState(AbstractEaseDebugger.java:331)
09:39:49 [2021-11-16T14:39:49.443Z] 	at org.eclipse.ease.debugging.AbstractEaseDebugger.suspend(AbstractEaseDebugger.java:257)
09:39:49 [2021-11-16T14:39:49.443Z] 	at org.eclipse.ease.debugging.AbstractEaseDebugger.processLine(AbstractEaseDebugger.java:492)
09:39:49 [2021-11-16T14:39:49.443Z] 	at org.eclipse.ease.lang.javascript.rhino.debugger.RhinoDebugger.access$4(RhinoDebugger.java:1)
09:39:49 [2021-11-16T14:39:49.443Z] 	at org.eclipse.ease.lang.javascript.rhino.debugger.RhinoDebugger$RhinoDebugFrame.onLineChange(RhinoDebugger.java:124)
09:39:49 [2021-11-16T14:39:49.443Z] 	at org.mozilla.javascript.Interpreter.interpretLoop(Interpreter.java:1931)
09:39:49 [2021-11-16T14:39:49.443Z] 	at org.mozilla.javascript.Interpreter.interpret(Interpreter.java:911)
09:39:49 [2021-11-16T14:39:49.443Z] 	at org.mozilla.javascript.InterpretedFunction.call(InterpretedFunction.java:109)
09:39:49 [2021-11-16T14:39:49.443Z] 	at org.mozilla.javascript.ContextFactory.doTopCall(ContextFactory.java:405)
09:39:49 [2021-11-16T14:39:49.443Z] 	at org.mozilla.javascript.ScriptRuntime.doTopCall(ScriptRuntime.java:3508)
09:39:49 [2021-11-16T14:39:49.443Z] 	at org.mozilla.javascript.InterpretedFunction.exec(InterpretedFunction.java:120)
09:39:49 [2021-11-16T14:39:49.443Z] 	at org.mozilla.javascript.Context.evaluateReader(Context.java:1293)
09:39:49 [2021-11-16T14:39:49.443Z] 	at org.eclipse.ease.lang.javascript.rhino.RhinoScriptEngine.internalExecute(RhinoScriptEngine.java:226)
09:39:49 [2021-11-16T14:39:49.443Z] 	at org.eclipse.ease.lang.javascript.rhino.RhinoScriptEngine.execute(RhinoScriptEngine.java:205)
09:39:49 [2021-11-16T14:39:49.443Z] 	at org.eclipse.ease.AbstractScriptEngine.inject(AbstractScriptEngine.java:191)
09:39:49 [2021-11-16T14:39:49.443Z] 	at org.eclipse.ease.AbstractScriptEngine.run(AbstractScriptEngine.java:244)
09:39:49 [2021-11-16T14:39:49.443Z] 	at org.eclipse.core.internal.jobs.Worker.run(Worker.java:63)
09:39:49 [2021-11-16T14:39:49.698Z] Start of script
09:39:49 [2021-11-16T14:39:49.698Z] include file start
09:39:49 [2021-11-16T14:39:49.698Z] Include file processed
09:39:49 [2021-11-16T14:39:49.698Z] line after include file
09:39:49 [2021-11-16T14:39:49.698Z] Result of testMethod = 5
09:39:49 [2021-11-16T14:39:49.698Z] End of script
09:39:49 [2021-11-16T14:39:49.953Z] org.eclipse.ease.ScriptEngineCancellationException: Terminated on user request
09:39:49 [2021-11-16T14:39:49.953Z] 	at org.eclipse.ease.debugging.AbstractEaseDebugger.handleEventsInSuspendedState(AbstractEaseDebugger.java:331)
09:39:49 [2021-11-16T14:39:49.953Z] 	at org.eclipse.ease.debugging.AbstractEaseDebugger.suspend(AbstractEaseDebugger.java:257)
09:39:49 [2021-11-16T14:39:49.953Z] 	at org.eclipse.ease.debugging.AbstractEaseDebugger.processLine(AbstractEaseDebugger.java:492)
09:39:49 [2021-11-16T14:39:49.953Z] 	at org.eclipse.ease.lang.javascript.rhino.debugger.RhinoDebugger.access$4(RhinoDebugger.java:1)
09:39:49 [2021-11-16T14:39:49.953Z] 	at org.eclipse.ease.lang.javascript.rhino.debugger.RhinoDebugger$RhinoDebugFrame.onLineChange(RhinoDebugger.java:124)
09:39:49 [2021-11-16T14:39:49.953Z] 	at org.mozilla.javascript.Interpreter.interpretLoop(Interpreter.java:1931)
09:39:49 [2021-11-16T14:39:49.953Z] 	at org.mozilla.javascript.Interpreter.interpret(Interpreter.java:911)
09:39:49 [2021-11-16T14:39:49.953Z] 	at org.mozilla.javascript.InterpretedFunction.call(InterpretedFunction.java:109)
09:39:49 [2021-11-16T14:39:49.953Z] 	at org.mozilla.javascript.ContextFactory.doTopCall(ContextFactory.java:405)
09:39:49 [2021-11-16T14:39:49.953Z] 	at org.mozilla.javascript.ScriptRuntime.doTopCall(ScriptRuntime.java:3508)
09:39:49 [2021-11-16T14:39:49.953Z] 	at org.mozilla.javascript.InterpretedFunction.exec(InterpretedFunction.java:120)
09:39:49 [2021-11-16T14:39:49.953Z] 	at org.mozilla.javascript.Context.evaluateReader(Context.java:1293)
09:39:49 [2021-11-16T14:39:49.953Z] 	at org.eclipse.ease.lang.javascript.rhino.RhinoScriptEngine.internalExecute(RhinoScriptEngine.java:226)
09:39:49 [2021-11-16T14:39:49.953Z] 	at org.eclipse.ease.lang.javascript.rhino.RhinoScriptEngine.execute(RhinoScriptEngine.java:205)
09:39:49 [2021-11-16T14:39:49.953Z] 	at org.eclipse.ease.AbstractScriptEngine.inject(AbstractScriptEngine.java:191)
09:39:49 [2021-11-16T14:39:49.953Z] 	at org.eclipse.ease.AbstractScriptEngine.run(AbstractScriptEngine.java:244)
09:39:49 [2021-11-16T14:39:49.953Z] 	at org.eclipse.core.internal.jobs.Worker.run(Worker.java:63)
09:39:50 [2021-11-16T14:39:50.210Z] Start of script
09:39:50 [2021-11-16T14:39:50.210Z] include file start
09:39:50 [2021-11-16T14:39:50.210Z] Include file processed
09:39:50 [2021-11-16T14:39:50.210Z] line after include file
09:39:50 [2021-11-16T14:39:50.210Z] Result of testMethod = 5
09:39:50 [2021-11-16T14:39:50.210Z] End of script
09:39:50 [2021-11-16T14:39:50.210Z] Start of script
09:39:50 [2021-11-16T14:39:50.210Z] include file start
09:39:50 [2021-11-16T14:39:50.210Z] Include file processed
09:39:50 [2021-11-16T14:39:50.210Z] line after include file
09:39:50 [2021-11-16T14:39:50.466Z] Result of testMethod = 5
09:39:50 [2021-11-16T14:39:50.466Z] End of script
09:39:50 [2021-11-16T14:39:50.723Z] org.eclipse.ease.ScriptEngineCancellationException: Terminated on user request
09:39:50 [2021-11-16T14:39:50.723Z] 	at org.eclipse.ease.debugging.AbstractEaseDebugger.handleEventsInSuspendedState(AbstractEaseDebugger.java:331)
09:39:50 [2021-11-16T14:39:50.723Z] 	at org.eclipse.ease.debugging.AbstractEaseDebugger.suspend(AbstractEaseDebugger.java:257)
09:39:50 [2021-11-16T14:39:50.723Z] 	at org.eclipse.ease.debugging.AbstractEaseDebugger.processLine(AbstractEaseDebugger.java:492)
09:39:50 [2021-11-16T14:39:50.723Z] 	at org.eclipse.ease.lang.javascript.rhino.debugger.RhinoDebugger.access$4(RhinoDebugger.java:1)
09:39:50 [2021-11-16T14:39:50.723Z] 	at org.eclipse.ease.lang.javascript.rhino.debugger.RhinoDebugger$RhinoDebugFrame.onLineChange(RhinoDebugger.java:124)
09:39:50 [2021-11-16T14:39:50.723Z] 	at org.mozilla.javascript.Interpreter.interpretLoop(Interpreter.java:1931)
09:39:50 [2021-11-16T14:39:50.723Z] 	at org.mozilla.javascript.Interpreter.interpret(Interpreter.java:911)
09:39:50 [2021-11-16T14:39:50.723Z] 	at org.mozilla.javascript.InterpretedFunction.call(InterpretedFunction.java:109)
09:39:50 [2021-11-16T14:39:50.723Z] 	at org.mozilla.javascript.ContextFactory.doTopCall(ContextFactory.java:405)
09:39:50 [2021-11-16T14:39:50.723Z] 	at org.mozilla.javascript.ScriptRuntime.doTopCall(ScriptRuntime.java:3508)
09:39:50 [2021-11-16T14:39:50.723Z] 	at org.mozilla.javascript.InterpretedFunction.exec(InterpretedFunction.java:120)
09:39:50 [2021-11-16T14:39:50.724Z] 	at org.mozilla.javascript.Context.evaluateReader(Context.java:1293)
09:39:50 [2021-11-16T14:39:50.724Z] 	at org.eclipse.ease.lang.javascript.rhino.RhinoScriptEngine.internalExecute(RhinoScriptEngine.java:226)
09:39:50 [2021-11-16T14:39:50.724Z] 	at org.eclipse.ease.lang.javascript.rhino.RhinoScriptEngine.execute(RhinoScriptEngine.java:205)
09:39:50 [2021-11-16T14:39:50.724Z] 	at org.eclipse.ease.AbstractScriptEngine.inject(AbstractScriptEngine.java:191)
09:39:50 [2021-11-16T14:39:50.724Z] 	at org.eclipse.ease.AbstractScriptEngine.run(AbstractScriptEngine.java:244)
09:39:50 [2021-11-16T14:39:50.724Z] 	at org.eclipse.core.internal.jobs.Worker.run(Worker.java:63)
09:39:50 [2021-11-16T14:39:50.724Z] Start of script
09:39:50 [2021-11-16T14:39:50.724Z] include file start
09:39:50 [2021-11-16T14:39:50.724Z] Include file processed
09:39:50 [2021-11-16T14:39:50.724Z] line after include file
09:39:50 [2021-11-16T14:39:50.980Z] Result of testMethod = 5
09:39:50 [2021-11-16T14:39:50.980Z] End of script
09:39:51 [2021-11-16T14:39:51.236Z] Start of script
09:39:51 [2021-11-16T14:39:51.236Z] include file start
09:39:51 [2021-11-16T14:39:51.236Z] Include file processed
09:39:51 [2021-11-16T14:39:51.236Z] line after include file
09:39:51 [2021-11-16T14:39:51.236Z] Result of testMethod = 5
09:39:51 [2021-11-16T14:39:51.236Z] WARNING: An illegal reflective access operation has occurred
09:39:51 [2021-11-16T14:39:51.236Z] WARNING: Illegal reflective access by org.eclipse.ease.debugging.model.EaseDebugValue (file:/home/jenkins/.m2/repository/org/eclipse/ease/org.eclipse.ease/0.9.0-SNAPSHOT/org.eclipse.ease-0.9.0-SNAPSHOT.jar) to field java.lang.String.hash
09:39:51 [2021-11-16T14:39:51.236Z] WARNING: Please consider reporting this to the maintainers of org.eclipse.ease.debugging.model.EaseDebugValue
09:39:51 [2021-11-16T14:39:51.236Z] WARNING: Use --illegal-access=warn to enable warnings of further illegal reflective access operations
09:39:51 [2021-11-16T14:39:51.236Z] WARNING: All illegal access operations will be denied in a future release
09:39:51 [2021-11-16T14:39:51.236Z] org.eclipse.ease.ScriptEngineCancellationException: Terminated on user request
09:39:51 [2021-11-16T14:39:51.236Z] 	at org.eclipse.ease.debugging.AbstractEaseDebugger.handleEventsInSuspendedState(AbstractEaseDebugger.java:331)
09:39:51 [2021-11-16T14:39:51.236Z] 	at org.eclipse.ease.debugging.AbstractEaseDebugger.suspend(AbstractEaseDebugger.java:257)
09:39:51 [2021-11-16T14:39:51.236Z] 	at org.eclipse.ease.debugging.AbstractEaseDebugger.processLine(AbstractEaseDebugger.java:492)
09:39:51 [2021-11-16T14:39:51.236Z] 	at org.eclipse.ease.lang.javascript.rhino.debugger.RhinoDebugger.access$4(RhinoDebugger.java:1)
09:39:51 [2021-11-16T14:39:51.236Z] 	at org.eclipse.ease.lang.javascript.rhino.debugger.RhinoDebugger$RhinoDebugFrame.onLineChange(RhinoDebugger.java:124)
09:39:51 [2021-11-16T14:39:51.236Z] 	at org.mozilla.javascript.Interpreter.interpretLoop(Interpreter.java:1931)
09:39:51 [2021-11-16T14:39:51.236Z] 	at org.mozilla.javascript.Interpreter.interpret(Interpreter.java:911)
09:39:51 [2021-11-16T14:39:51.236Z] 	at org.mozilla.javascript.InterpretedFunction.call(InterpretedFunction.java:109)
09:39:51 [2021-11-16T14:39:51.236Z] 	at org.mozilla.javascript.ContextFactory.doTopCall(ContextFactory.java:405)
09:39:51 [2021-11-16T14:39:51.236Z] 	at org.mozilla.javascript.ScriptRuntime.doTopCall(ScriptRuntime.java:3508)
09:39:51 [2021-11-16T14:39:51.236Z] 	at org.mozilla.javascript.InterpretedFunction.exec(InterpretedFunction.java:120)
09:39:51 [2021-11-16T14:39:51.236Z] 	at org.mozilla.javascript.Context.evaluateReader(Context.java:1293)
09:39:51 [2021-11-16T14:39:51.236Z] 	at org.eclipse.ease.lang.javascript.rhino.RhinoScriptEngine.internalExecute(RhinoScriptEngine.java:226)
09:39:51 [2021-11-16T14:39:51.236Z] 	at org.eclipse.ease.lang.javascript.rhino.RhinoScriptEngine.execute(RhinoScriptEngine.java:205)
09:39:51 [2021-11-16T14:39:51.236Z] 	at org.eclipse.ease.AbstractScriptEngine.inject(AbstractScriptEngine.java:191)
09:39:51 [2021-11-16T14:39:51.236Z] 	at org.eclipse.ease.AbstractScriptEngine.run(AbstractScriptEngine.java:244)
09:39:51 [2021-11-16T14:39:51.236Z] 	at org.eclipse.core.internal.jobs.Worker.run(Worker.java:63)
09:39:51 [2021-11-16T14:39:51.493Z] Start of script
09:39:51 [2021-11-16T14:39:51.493Z] include file start
09:39:51 [2021-11-16T14:39:51.493Z] Include file processed
09:39:51 [2021-11-16T14:39:51.493Z] line after include file
09:39:51 [2021-11-16T14:39:51.493Z] Result of testMethod = 5
09:39:51 [2021-11-16T14:39:51.493Z] End of script
09:39:51 [2021-11-16T14:39:51.748Z] Start of script
09:39:51 [2021-11-16T14:39:51.748Z] include file start
09:39:51 [2021-11-16T14:39:51.748Z] Include file processed
09:39:51 [2021-11-16T14:39:51.748Z] line after include file
09:39:51 [2021-11-16T14:39:51.748Z] Result of testMethod = 5
09:39:51 [2021-11-16T14:39:51.748Z] End of script
09:39:52 [2021-11-16T14:39:52.004Z] Start of script
09:39:52 [2021-11-16T14:39:52.004Z] include file start
09:39:52 [2021-11-16T14:39:52.004Z] Include file processed
09:39:52 [2021-11-16T14:39:52.004Z] line after include file
09:39:52 [2021-11-16T14:39:52.004Z] Result of testMethod = 5
09:39:52 [2021-11-16T14:39:52.004Z] End of script
09:39:52 [2021-11-16T14:39:52.004Z] Start of script
09:39:52 [2021-11-16T14:39:52.260Z] include file start
09:39:52 [2021-11-16T14:39:52.260Z] Include file processed
09:39:52 [2021-11-16T14:39:52.260Z] line after include file
09:39:52 [2021-11-16T14:39:52.260Z] Result of testMethod = 5
09:39:52 [2021-11-16T14:39:52.260Z] End of script
09:39:52 [2021-11-16T14:39:52.260Z] Start of script
09:39:52 [2021-11-16T14:39:52.260Z] include file start
09:39:52 [2021-11-16T14:39:52.260Z] Include file processed
09:39:52 [2021-11-16T14:39:52.260Z] line after include file
09:39:52 [2021-11-16T14:39:52.517Z] org.eclipse.ease.ScriptEngineCancellationException: Terminated on user request
09:39:52 [2021-11-16T14:39:52.517Z] 	at org.eclipse.ease.debugging.AbstractEaseDebugger.handleEventsInSuspendedState(AbstractEaseDebugger.java:331)
09:39:52 [2021-11-16T14:39:52.517Z] 	at org.eclipse.ease.debugging.AbstractEaseDebugger.suspend(AbstractEaseDebugger.java:257)
09:39:52 [2021-11-16T14:39:52.517Z] 	at org.eclipse.ease.debugging.AbstractEaseDebugger.processLine(AbstractEaseDebugger.java:492)
09:39:52 [2021-11-16T14:39:52.517Z] 	at org.eclipse.ease.lang.javascript.rhino.debugger.RhinoDebugger.access$4(RhinoDebugger.java:1)
09:39:52 [2021-11-16T14:39:52.517Z] 	at org.eclipse.ease.lang.javascript.rhino.debugger.RhinoDebugger$RhinoDebugFrame.onLineChange(RhinoDebugger.java:124)
09:39:52 [2021-11-16T14:39:52.517Z] 	at org.mozilla.javascript.Interpreter.interpretLoop(Interpreter.java:1931)
09:39:52 [2021-11-16T14:39:52.517Z] 	at org.mozilla.javascript.Interpreter.interpret(Interpreter.java:911)
09:39:52 [2021-11-16T14:39:52.517Z] 	at org.mozilla.javascript.InterpretedFunction.call(InterpretedFunction.java:109)
09:39:52 [2021-11-16T14:39:52.517Z] 	at org.mozilla.javascript.ContextFactory.doTopCall(ContextFactory.java:405)
09:39:52 [2021-11-16T14:39:52.517Z] 	at org.mozilla.javascript.ScriptRuntime.doTopCall(ScriptRuntime.java:3508)
09:39:52 [2021-11-16T14:39:52.517Z] 	at org.mozilla.javascript.InterpretedFunction.exec(InterpretedFunction.java:120)
09:39:52 [2021-11-16T14:39:52.517Z] 	at org.mozilla.javascript.Context.evaluateReader(Context.java:1293)
09:39:52 [2021-11-16T14:39:52.517Z] 	at org.eclipse.ease.lang.javascript.rhino.RhinoScriptEngine.internalExecute(RhinoScriptEngine.java:226)
09:39:52 [2021-11-16T14:39:52.517Z] 	at org.eclipse.ease.lang.javascript.rhino.RhinoScriptEngine.execute(RhinoScriptEngine.java:205)
09:39:52 [2021-11-16T14:39:52.517Z] 	at org.eclipse.ease.AbstractScriptEngine.inject(AbstractScriptEngine.java:191)
09:39:52 [2021-11-16T14:39:52.517Z] 	at org.eclipse.ease.AbstractScriptEngine.run(AbstractScriptEngine.java:244)
09:39:52 [2021-11-16T14:39:52.517Z] 	at org.eclipse.core.internal.jobs.Worker.run(Worker.java:63)
09:39:52 [2021-11-16T14:39:52.773Z] Start of script
09:39:52 [2021-11-16T14:39:52.773Z] include file start
09:39:52 [2021-11-16T14:39:52.773Z] Include file processed
09:39:52 [2021-11-16T14:39:52.773Z] line after include file
09:39:52 [2021-11-16T14:39:52.773Z] Result of testMethod = 5
09:39:52 [2021-11-16T14:39:52.773Z] End of script
09:39:53 [2021-11-16T14:39:53.028Z] Start of script
09:39:53 [2021-11-16T14:39:53.028Z] include file start
09:39:53 [2021-11-16T14:39:53.028Z] Include file processed
09:39:53 [2021-11-16T14:39:53.028Z] line after include file
09:39:53 [2021-11-16T14:39:53.028Z] Result of testMethod = 5
09:39:53 [2021-11-16T14:39:53.029Z] org.eclipse.ease.ScriptEngineCancellationException: Terminated on user request
09:39:53 [2021-11-16T14:39:53.029Z] 	at org.eclipse.ease.debugging.AbstractEaseDebugger.handleEventsInSuspendedState(AbstractEaseDebugger.java:331)
09:39:53 [2021-11-16T14:39:53.029Z] 	at org.eclipse.ease.debugging.AbstractEaseDebugger.suspend(AbstractEaseDebugger.java:257)
09:39:53 [2021-11-16T14:39:53.029Z] 	at org.eclipse.ease.debugging.AbstractEaseDebugger.processLine(AbstractEaseDebugger.java:492)
09:39:53 [2021-11-16T14:39:53.029Z] 	at org.eclipse.ease.lang.javascript.rhino.debugger.RhinoDebugger.access$4(RhinoDebugger.java:1)
09:39:53 [2021-11-16T14:39:53.029Z] 	at org.eclipse.ease.lang.javascript.rhino.debugger.RhinoDebugger$RhinoDebugFrame.onLineChange(RhinoDebugger.java:124)
09:39:53 [2021-11-16T14:39:53.029Z] 	at org.mozilla.javascript.Interpreter.interpretLoop(Interpreter.java:1931)
09:39:53 [2021-11-16T14:39:53.029Z] 	at org.mozilla.javascript.Interpreter.interpret(Interpreter.java:911)
09:39:53 [2021-11-16T14:39:53.029Z] 	at org.mozilla.javascript.InterpretedFunction.call(InterpretedFunction.java:109)
09:39:53 [2021-11-16T14:39:53.029Z] 	at org.mozilla.javascript.ContextFactory.doTopCall(ContextFactory.java:405)
09:39:53 [2021-11-16T14:39:53.029Z] 	at org.mozilla.javascript.ScriptRuntime.doTopCall(ScriptRuntime.java:3508)
09:39:53 [2021-11-16T14:39:53.029Z] 	at org.mozilla.javascript.InterpretedFunction.exec(InterpretedFunction.java:120)
09:39:53 [2021-11-16T14:39:53.029Z] 	at org.mozilla.javascript.Context.evaluateReader(Context.java:1293)
09:39:53 [2021-11-16T14:39:53.029Z] 	at org.eclipse.ease.lang.javascript.rhino.RhinoScriptEngine.internalExecute(RhinoScriptEngine.java:226)
09:39:53 [2021-11-16T14:39:53.029Z] 	at org.eclipse.ease.lang.javascript.rhino.RhinoScriptEngine.execute(RhinoScriptEngine.java:205)
09:39:53 [2021-11-16T14:39:53.029Z] 	at org.eclipse.ease.AbstractScriptEngine.inject(AbstractScriptEngine.java:191)
09:39:53 [2021-11-16T14:39:53.029Z] 	at org.eclipse.ease.AbstractScriptEngine.run(AbstractScriptEngine.java:244)
09:39:53 [2021-11-16T14:39:53.029Z] 	at org.eclipse.core.internal.jobs.Worker.run(Worker.java:63)
09:39:53 [2021-11-16T14:39:53.285Z] Start of script
09:39:53 [2021-11-16T14:39:53.285Z] include file start
09:39:53 [2021-11-16T14:39:53.285Z] Include file processed
09:39:53 [2021-11-16T14:39:53.285Z] line after include file
09:39:53 [2021-11-16T14:39:53.285Z] Result of testMethod = 5
09:39:53 [2021-11-16T14:39:53.285Z] End of script
09:39:53 [2021-11-16T14:39:53.542Z] Start of script
09:39:53 [2021-11-16T14:39:53.542Z] include file start
09:39:53 [2021-11-16T14:39:53.542Z] Include file processed
09:39:53 [2021-11-16T14:39:53.542Z] line after include file
09:39:53 [2021-11-16T14:39:53.542Z] Result of testMethod = 5
09:39:53 [2021-11-16T14:39:53.542Z] End of script
09:39:53 [2021-11-16T14:39:53.798Z] Start of script
09:39:53 [2021-11-16T14:39:53.798Z] include file start
09:39:53 [2021-11-16T14:39:53.798Z] Include file processed
09:39:53 [2021-11-16T14:39:53.798Z] line after include file
09:39:54 [2021-11-16T14:39:54.055Z] Result of testMethod = 5
09:39:54 [2021-11-16T14:39:54.055Z] End of script
09:39:54 [2021-11-16T14:39:54.055Z] Start of script
09:39:54 [2021-11-16T14:39:54.055Z] include file start
09:39:54 [2021-11-16T14:39:54.055Z] Include file processed
09:39:54 [2021-11-16T14:39:54.055Z] line after include file
09:39:54 [2021-11-16T14:39:54.055Z] Result of testMethod = 5
09:39:54 [2021-11-16T14:39:54.055Z] End of script
09:39:54 [2021-11-16T14:39:54.311Z] Start of script
09:39:54 [2021-11-16T14:39:54.311Z] include file start
09:39:54 [2021-11-16T14:39:54.311Z] Include file processed
09:39:54 [2021-11-16T14:39:54.311Z] line after include file
09:39:54 [2021-11-16T14:39:54.311Z] Result of testMethod = 5
09:39:54 [2021-11-16T14:39:54.567Z] org.eclipse.ease.ScriptEngineCancellationException: Terminated on user request
09:39:54 [2021-11-16T14:39:54.567Z] 	at org.eclipse.ease.debugging.AbstractEaseDebugger.handleEventsInSuspendedState(AbstractEaseDebugger.java:331)
09:39:54 [2021-11-16T14:39:54.567Z] 	at org.eclipse.ease.debugging.AbstractEaseDebugger.suspend(AbstractEaseDebugger.java:257)
09:39:54 [2021-11-16T14:39:54.567Z] 	at org.eclipse.ease.debugging.AbstractEaseDebugger.processLine(AbstractEaseDebugger.java:492)
09:39:54 [2021-11-16T14:39:54.567Z] 	at org.eclipse.ease.lang.javascript.rhino.debugger.RhinoDebugger.access$4(RhinoDebugger.java:1)
09:39:54 [2021-11-16T14:39:54.567Z] 	at org.eclipse.ease.lang.javascript.rhino.debugger.RhinoDebugger$RhinoDebugFrame.onLineChange(RhinoDebugger.java:124)
09:39:54 [2021-11-16T14:39:54.567Z] 	at org.mozilla.javascript.Interpreter.interpretLoop(Interpreter.java:1931)
09:39:54 [2021-11-16T14:39:54.567Z] 	at org.mozilla.javascript.Interpreter.interpret(Interpreter.java:911)
09:39:54 [2021-11-16T14:39:54.567Z] 	at org.mozilla.javascript.InterpretedFunction.call(InterpretedFunction.java:109)
09:39:54 [2021-11-16T14:39:54.567Z] 	at org.mozilla.javascript.ContextFactory.doTopCall(ContextFactory.java:405)
09:39:54 [2021-11-16T14:39:54.567Z] 	at org.mozilla.javascript.ScriptRuntime.doTopCall(ScriptRuntime.java:3508)
09:39:54 [2021-11-16T14:39:54.567Z] 	at org.mozilla.javascript.InterpretedFunction.exec(InterpretedFunction.java:120)
09:39:54 [2021-11-16T14:39:54.567Z] 	at org.mozilla.javascript.Context.evaluateReader(Context.java:1293)
09:39:54 [2021-11-16T14:39:54.567Z] 	at org.eclipse.ease.lang.javascript.rhino.RhinoScriptEngine.internalExecute(RhinoScriptEngine.java:226)
09:39:54 [2021-11-16T14:39:54.567Z] 	at org.eclipse.ease.lang.javascript.rhino.RhinoScriptEngine.execute(RhinoScriptEngine.java:205)
09:39:54 [2021-11-16T14:39:54.567Z] 	at org.eclipse.ease.AbstractScriptEngine.inject(AbstractScriptEngine.java:191)
09:39:54 [2021-11-16T14:39:54.567Z] 	at org.eclipse.ease.AbstractScriptEngine.run(AbstractScriptEngine.java:244)
09:39:54 [2021-11-16T14:39:54.567Z] 	at org.eclipse.core.internal.jobs.Worker.run(Worker.java:63)
09:39:54 [2021-11-16T14:39:54.567Z] Start of script
09:39:54 [2021-11-16T14:39:54.567Z] include file start
09:39:54 [2021-11-16T14:39:54.567Z] Include file processed
09:39:54 [2021-11-16T14:39:54.567Z] line after include file
09:39:54 [2021-11-16T14:39:54.567Z] Result of testMethod = 5
09:39:54 [2021-11-16T14:39:54.567Z] End of script
09:39:54 [2021-11-16T14:39:54.823Z] Start of script
09:39:54 [2021-11-16T14:39:54.823Z] include file start
09:39:54 [2021-11-16T14:39:54.823Z] Include file processed
09:39:54 [2021-11-16T14:39:54.823Z] line after include file
09:39:54 [2021-11-16T14:39:54.823Z] Result of testMethod = 5
09:39:55 [2021-11-16T14:39:55.079Z] org.eclipse.ease.ScriptEngineCancellationException: Terminated on user request
09:39:55 [2021-11-16T14:39:55.079Z] 	at org.eclipse.ease.debugging.AbstractEaseDebugger.handleEventsInSuspendedState(AbstractEaseDebugger.java:331)
09:39:55 [2021-11-16T14:39:55.079Z] 	at org.eclipse.ease.debugging.AbstractEaseDebugger.suspend(AbstractEaseDebugger.java:257)
09:39:55 [2021-11-16T14:39:55.079Z] 	at org.eclipse.ease.debugging.AbstractEaseDebugger.processLine(AbstractEaseDebugger.java:492)
09:39:55 [2021-11-16T14:39:55.079Z] 	at org.eclipse.ease.lang.javascript.rhino.debugger.RhinoDebugger.access$4(RhinoDebugger.java:1)
09:39:55 [2021-11-16T14:39:55.079Z] 	at org.eclipse.ease.lang.javascript.rhino.debugger.RhinoDebugger$RhinoDebugFrame.onLineChange(RhinoDebugger.java:124)
09:39:55 [2021-11-16T14:39:55.079Z] 	at org.mozilla.javascript.Interpreter.interpretLoop(Interpreter.java:1931)
09:39:55 [2021-11-16T14:39:55.079Z] 	at org.mozilla.javascript.Interpreter.interpret(Interpreter.java:911)
09:39:55 [2021-11-16T14:39:55.079Z] 	at org.mozilla.javascript.InterpretedFunction.call(InterpretedFunction.java:109)
09:39:55 [2021-11-16T14:39:55.079Z] 	at org.mozilla.javascript.ContextFactory.doTopCall(ContextFactory.java:405)
09:39:55 [2021-11-16T14:39:55.079Z] 	at org.mozilla.javascript.ScriptRuntime.doTopCall(ScriptRuntime.java:3508)
09:39:55 [2021-11-16T14:39:55.079Z] 	at org.mozilla.javascript.InterpretedFunction.exec(InterpretedFunction.java:120)
09:39:55 [2021-11-16T14:39:55.079Z] 	at org.mozilla.javascript.Context.evaluateReader(Context.java:1293)
09:39:55 [2021-11-16T14:39:55.079Z] 	at org.eclipse.ease.lang.javascript.rhino.RhinoScriptEngine.internalExecute(RhinoScriptEngine.java:226)
09:39:55 [2021-11-16T14:39:55.079Z] 	at org.eclipse.ease.lang.javascript.rhino.RhinoScriptEngine.execute(RhinoScriptEngine.java:205)
09:39:55 [2021-11-16T14:39:55.079Z] 	at org.eclipse.ease.AbstractScriptEngine.inject(AbstractScriptEngine.java:191)
09:39:55 [2021-11-16T14:39:55.079Z] 	at org.eclipse.ease.AbstractScriptEngine.run(AbstractScriptEngine.java:244)
09:39:55 [2021-11-16T14:39:55.079Z] 	at org.eclipse.core.internal.jobs.Worker.run(Worker.java:63)
09:39:55 [2021-11-16T14:39:55.079Z] org.eclipse.ease.ScriptEngineCancellationException: Terminated on user request
09:39:55 [2021-11-16T14:39:55.079Z] 	at org.eclipse.ease.debugging.AbstractEaseDebugger.handleEventsInSuspendedState(AbstractEaseDebugger.java:331)
09:39:55 [2021-11-16T14:39:55.079Z] 	at org.eclipse.ease.debugging.AbstractEaseDebugger.suspend(AbstractEaseDebugger.java:257)
09:39:55 [2021-11-16T14:39:55.079Z] 	at org.eclipse.ease.debugging.AbstractEaseDebugger.processLine(AbstractEaseDebugger.java:492)
09:39:55 [2021-11-16T14:39:55.079Z] 	at org.eclipse.ease.lang.javascript.rhino.debugger.RhinoDebugger.access$4(RhinoDebugger.java:1)
09:39:55 [2021-11-16T14:39:55.079Z] 	at org.eclipse.ease.lang.javascript.rhino.debugger.RhinoDebugger$RhinoDebugFrame.onLineChange(RhinoDebugger.java:124)
09:39:55 [2021-11-16T14:39:55.079Z] 	at org.mozilla.javascript.Interpreter.interpretLoop(Interpreter.java:1931)
09:39:55 [2021-11-16T14:39:55.079Z] 	at org.mozilla.javascript.Interpreter.interpret(Interpreter.java:911)
09:39:55 [2021-11-16T14:39:55.080Z] 	at org.mozilla.javascript.InterpretedFunction.call(InterpretedFunction.java:109)
09:39:55 [2021-11-16T14:39:55.080Z] 	at org.mozilla.javascript.ContextFactory.doTopCall(ContextFactory.java:405)
09:39:55 [2021-11-16T14:39:55.080Z] 	at org.mozilla.javascript.ScriptRuntime.doTopCall(ScriptRuntime.java:3508)
09:39:55 [2021-11-16T14:39:55.080Z] 	at org.mozilla.javascript.InterpretedFunction.exec(InterpretedFunction.java:120)
09:39:55 [2021-11-16T14:39:55.080Z] 	at org.mozilla.javascript.Context.evaluateReader(Context.java:1293)
09:39:55 [2021-11-16T14:39:55.080Z] 	at org.eclipse.ease.lang.javascript.rhino.RhinoScriptEngine.internalExecute(RhinoScriptEngine.java:226)
09:39:55 [2021-11-16T14:39:55.080Z] 	at org.eclipse.ease.lang.javascript.rhino.RhinoScriptEngine.execute(RhinoScriptEngine.java:205)
09:39:55 [2021-11-16T14:39:55.080Z] 	at org.eclipse.ease.AbstractScriptEngine.inject(AbstractScriptEngine.java:191)
09:39:55 [2021-11-16T14:39:55.080Z] 	at org.eclipse.ease.AbstractScriptEngine.run(AbstractScriptEngine.java:244)
09:39:55 [2021-11-16T14:39:55.080Z] 	at org.eclipse.core.internal.jobs.Worker.run(Worker.java:63)
09:39:55 [2021-11-16T14:39:55.336Z] Start of script
09:39:55 [2021-11-16T14:39:55.336Z] include file start
09:39:55 [2021-11-16T14:39:55.336Z] Include file processed
09:39:55 [2021-11-16T14:39:55.336Z] line after include file
09:39:55 [2021-11-16T14:39:55.336Z] Result of testMethod = 5
09:39:55 [2021-11-16T14:39:55.336Z] End of script
09:39:55 [2021-11-16T14:39:55.592Z] Start of script
09:39:55 [2021-11-16T14:39:55.592Z] include file start
09:39:55 [2021-11-16T14:39:55.592Z] Include file processed
09:39:55 [2021-11-16T14:39:55.592Z] line after include file
09:39:55 [2021-11-16T14:39:55.592Z] Result of testMethod = 5
09:39:55 [2021-11-16T14:39:55.592Z] End of script
09:39:55 [2021-11-16T14:39:55.848Z] Start of script
09:39:55 [2021-11-16T14:39:55.848Z] include file start
09:39:55 [2021-11-16T14:39:55.848Z] Include file processed
09:39:55 [2021-11-16T14:39:55.848Z] line after include file
09:39:55 [2021-11-16T14:39:55.848Z] Result of testMethod = 5
09:39:55 [2021-11-16T14:39:55.848Z] End of script
09:39:56 [2021-11-16T14:39:56.104Z] Tests run: 41, Failures: 0, Errors: 0, Skipped: 0, Time elapsed: 10.843 s - in org.eclipse.ease.lang.javascript.rhino.RhinoDebugTest
09:39:56 [2021-11-16T14:39:56.104Z] disconnectProcessInSuspendedState  Time elapsed: 0.293 s
09:39:56 [2021-11-16T14:39:56.104Z] stepReturnIncludeCommand  Time elapsed: 0.213 s
09:39:56 [2021-11-16T14:39:56.104Z] arrayVariableSorting  Time elapsed: 0.305 s
09:39:56 [2021-11-16T14:39:56.104Z] stepOverOnDebugTarget  Time elapsed: 0.307 s
09:39:56 [2021-11-16T14:39:56.104Z] disconnectThreadInSuspendedState  Time elapsed: 0.207 s
09:39:56 [2021-11-16T14:39:56.105Z] stepReturnOnDebugTarget  Time elapsed: 0.306 s
09:39:56 [2021-11-16T14:39:56.105Z] nullVariable  Time elapsed: 0.306 s
09:39:56 [2021-11-16T14:39:56.105Z] stepOverOnStackFrame  Time elapsed: 0.306 s
09:39:56 [2021-11-16T14:39:56.105Z] resumeOnDebugTarget  Time elapsed: 0.205 s
09:39:56 [2021-11-16T14:39:56.105Z] modifyVariableKeepingType  Time elapsed: 0.406 s
09:39:56 [2021-11-16T14:39:56.105Z] resumeOnLastIncludeLine  Time elapsed: 0.206 s
09:39:56 [2021-11-16T14:39:56.105Z] stepReturnOnStackFrame  Time elapsed: 0.306 s
09:39:56 [2021-11-16T14:39:56.105Z] terminateStackFrameInSuspendedState  Time elapsed: 0.205 s
09:39:56 [2021-11-16T14:39:56.105Z] breakpointLocation  Time elapsed: 0.206 s
09:39:56 [2021-11-16T14:39:56.105Z] stepReturnOnThread  Time elapsed: 0.305 s
09:39:56 [2021-11-16T14:39:56.105Z] javaClassVariable  Time elapsed: 0.308 s
09:39:56 [2021-11-16T14:39:56.105Z] stepIntoOnThread  Time elapsed: 0.306 s
09:39:56 [2021-11-16T14:39:56.105Z] terminateThreadInSuspendedState  Time elapsed: 0.205 s
09:39:56 [2021-11-16T14:39:56.105Z] resumeOnThread  Time elapsed: 0.205 s
09:39:56 [2021-11-16T14:39:56.105Z] stepIntoOnStackFrame  Time elapsed: 0.306 s
09:39:56 [2021-11-16T14:39:56.105Z] terminateProcessInSuspendedState  Time elapsed: 0.206 s
09:39:56 [2021-11-16T14:39:56.105Z] stepOverOnProcess  Time elapsed: 0.306 s
09:39:56 [2021-11-16T14:39:56.105Z] nativeArrayVariable  Time elapsed: 0.307 s
09:39:56 [2021-11-16T14:39:56.105Z] disconnectDebugTargetInSuspendedState  Time elapsed: 0.205 s
09:39:56 [2021-11-16T14:39:56.105Z] stepIntoOnProcess  Time elapsed: 0.307 s
09:39:56 [2021-11-16T14:39:56.105Z] terminatedState  Time elapsed: 0.103 s
09:39:56 [2021-11-16T14:39:56.105Z] stepOverIncludeCommand  Time elapsed: 0.305 s
09:39:56 [2021-11-16T14:39:56.105Z] innerScopeVariableBeforeOuterScopeVariable  Time elapsed: 0.305 s
09:39:56 [2021-11-16T14:39:56.105Z] stepIntoIncludeCommand  Time elapsed: 0.305 s
09:39:56 [2021-11-16T14:39:56.105Z] primitiveStringVariable  Time elapsed: 0.305 s
09:39:56 [2021-11-16T14:39:56.105Z] resumeOnProcess  Time elapsed: 0.205 s
09:39:56 [2021-11-16T14:39:56.105Z] stepIntoOnDebugTarget  Time elapsed: 0.305 s
09:39:56 [2021-11-16T14:39:56.105Z] stepOverOnThread  Time elapsed: 0.305 s
09:39:56 [2021-11-16T14:39:56.105Z] suspendedState  Time elapsed: 0.204 s
09:39:56 [2021-11-16T14:39:56.105Z] primitiveDoubleVariable  Time elapsed: 0.304 s
09:39:56 [2021-11-16T14:39:56.105Z] resumeOnStackFrame  Time elapsed: 0.204 s
09:39:56 [2021-11-16T14:39:56.105Z] nativeObjectVariable  Time elapsed: 0.305 s
09:39:56 [2021-11-16T14:39:56.105Z] terminateDebugTargetInSuspendedState  Time elapsed: 0.204 s
09:39:56 [2021-11-16T14:39:56.105Z] disconnectStackFrameInSuspendedState  Time elapsed: 0.205 s
09:39:56 [2021-11-16T14:39:56.105Z] stepReturnOnProcess  Time elapsed: 0.306 s
09:39:56 [2021-11-16T14:39:56.105Z] evaluateWatchExpression  Time elapsed: 0.217 s
09:39:56 [2021-11-16T14:39:56.105Z] 
09:39:56 [2021-11-16T14:39:56.105Z] Results:
09:39:56 [2021-11-16T14:39:56.105Z] 
09:39:56 [2021-11-16T14:39:56.105Z] Tests run: 69, Failures: 0, Errors: 0, Skipped: 0
09:39:56 [2021-11-16T14:39:56.105Z] 
09:39:56 [2021-11-16T14:39:56.361Z] [INFO] All tests passed!
09:39:56 [2021-11-16T14:39:56.361Z] [INFO] 
09:39:56 [2021-11-16T14:39:56.361Z] [INFO] -------< org.eclipse.ease:org.eclipse.ease.lang.javascript.test >-------
09:39:56 [2021-11-16T14:39:56.361Z] [INFO] Building org.eclipse.ease.lang.javascript.test 0.9.0-SNAPSHOT      [5/9]
09:39:56 [2021-11-16T14:39:56.361Z] [INFO] ------------------------[ eclipse-test-plugin ]-------------------------
09:39:56 [2021-11-16T14:39:56.361Z] [INFO] 
09:39:56 [2021-11-16T14:39:56.361Z] [INFO] --- tycho-packaging-plugin:2.2.0:build-qualifier (default-build-qualifier) @ org.eclipse.ease.lang.javascript.test ---
09:39:56 [2021-11-16T14:39:56.361Z] [INFO] The project's OSGi version is 0.9.0.I202107211616
09:39:56 [2021-11-16T14:39:56.361Z] [INFO] 
09:39:56 [2021-11-16T14:39:56.361Z] [INFO] --- tycho-packaging-plugin:2.2.0:validate-id (default-validate-id) @ org.eclipse.ease.lang.javascript.test ---
09:39:56 [2021-11-16T14:39:56.361Z] [INFO] 
09:39:56 [2021-11-16T14:39:56.361Z] [INFO] --- tycho-packaging-plugin:2.2.0:validate-version (default-validate-version) @ org.eclipse.ease.lang.javascript.test ---
09:39:56 [2021-11-16T14:39:56.361Z] [INFO] 
09:39:56 [2021-11-16T14:39:56.361Z] [INFO] --- maven-resources-plugin:2.4.3:resources (default-resources) @ org.eclipse.ease.lang.javascript.test ---
09:39:56 [2021-11-16T14:39:56.361Z] [INFO] Using 'UTF-8' encoding to copy filtered resources.
09:39:56 [2021-11-16T14:39:56.361Z] [INFO] skip non existing resourceDirectory /home/jenkins/agent/workspace/ease.verify.core.target.2019-06/tests/org.eclipse.ease.lang.javascript.test/src/main/resources
09:39:56 [2021-11-16T14:39:56.361Z] [INFO] 
09:39:56 [2021-11-16T14:39:56.361Z] [INFO] --- tycho-compiler-plugin:2.2.0:compile (default-compile) @ org.eclipse.ease.lang.javascript.test ---
09:39:56 [2021-11-16T14:39:56.361Z] [INFO] Nothing to compile - all classes are up to date
09:39:56 [2021-11-16T14:39:56.361Z] [INFO] 
09:39:56 [2021-11-16T14:39:56.361Z] [INFO] --- maven-resources-plugin:2.4.3:testResources (default-testResources) @ org.eclipse.ease.lang.javascript.test ---
09:39:56 [2021-11-16T14:39:56.361Z] [INFO] Using 'UTF-8' encoding to copy filtered resources.
09:39:56 [2021-11-16T14:39:56.361Z] [INFO] skip non existing resourceDirectory /home/jenkins/agent/workspace/ease.verify.core.target.2019-06/tests/org.eclipse.ease.lang.javascript.test/src/test/resources
09:39:56 [2021-11-16T14:39:56.361Z] [INFO] 
09:39:56 [2021-11-16T14:39:56.361Z] [INFO] --- target-platform-configuration:2.2.0:target-platform (default-target-platform) @ org.eclipse.ease.lang.javascript.test ---
09:39:56 [2021-11-16T14:39:56.361Z] [INFO] 
09:39:56 [2021-11-16T14:39:56.362Z] [INFO] --- tycho-packaging-plugin:2.2.0:package-plugin (default-package-plugin) @ org.eclipse.ease.lang.javascript.test ---
09:39:56 [2021-11-16T14:39:56.362Z] [INFO] Building jar: /home/jenkins/agent/workspace/ease.verify.core.target.2019-06/tests/org.eclipse.ease.lang.javascript.test/target/org.eclipse.ease.lang.javascript.test-0.9.0-SNAPSHOT.jar
09:39:56 [2021-11-16T14:39:56.362Z] [INFO] 
09:39:56 [2021-11-16T14:39:56.362Z] [INFO] --- tycho-p2-plugin:2.2.0:p2-metadata-default (default-p2-metadata-default) @ org.eclipse.ease.lang.javascript.test ---
09:39:56 [2021-11-16T14:39:56.362Z] [INFO] 
09:39:56 [2021-11-16T14:39:56.362Z] [INFO] --- jacoco-maven-plugin:0.8.6:prepare-agent (jacoco-initialize) @ org.eclipse.ease.lang.javascript.test ---
09:39:56 [2021-11-16T14:39:56.362Z] [INFO] tycho.testArgLine set to -javaagent:/home/jenkins/.m2/repository/org/jacoco/org.jacoco.agent/0.8.6/org.jacoco.agent-0.8.6-runtime.jar=destfile=/home/jenkins/agent/workspace/ease.verify.core.target.2019-06/tests/org.eclipse.ease.lang.javascript.test/target/jacoco.exec,output=file
09:39:56 [2021-11-16T14:39:56.362Z] [INFO] 
09:39:56 [2021-11-16T14:39:56.362Z] [INFO] --- tycho-surefire-plugin:2.2.0:test (default-test) @ org.eclipse.ease.lang.javascript.test ---
09:39:56 [2021-11-16T14:39:56.362Z] [INFO] Executing Test Runtime with timeout 0, logs (if any) will be placed at: /home/jenkins/agent/workspace/ease.verify.core.target.2019-06/tests/org.eclipse.ease.lang.javascript.test/target/work/data/.metadata/.log
09:39:56 [2021-11-16T14:39:56.362Z] [INFO] Command line:
09:39:56 [2021-11-16T14:39:56.362Z] 	[/opt/tools/java/openjdk/jdk-15/15.0.2+7/bin/java, -Dosgi.noShutdown=false, -Dosgi.os=linux, -Dosgi.ws=gtk, -Dosgi.arch=x86_64, -javaagent:/home/jenkins/.m2/repository/org/jacoco/org.jacoco.agent/0.8.6/org.jacoco.agent-0.8.6-runtime.jar=destfile=/home/jenkins/agent/workspace/ease.verify.core.target.2019-06/tests/org.eclipse.ease.lang.javascript.test/target/jacoco.exec,output=file, -Dosgi.clean=true, -jar, /home/jenkins/.m2/repository/p2/osgi/bundle/org.eclipse.equinox.launcher/1.5.400.v20190515-0925/org.eclipse.equinox.launcher-1.5.400.v20190515-0925.jar, -data, /home/jenkins/agent/workspace/ease.verify.core.target.2019-06/tests/org.eclipse.ease.lang.javascript.test/target/work/data, -install, /home/jenkins/agent/workspace/ease.verify.core.target.2019-06/tests/org.eclipse.ease.lang.javascript.test/target/work, -configuration, /home/jenkins/agent/workspace/ease.verify.core.target.2019-06/tests/org.eclipse.ease.lang.javascript.test/target/work/configuration, -application, org.eclipse.tycho.surefire.osgibooter.headlesstest, -testproperties, /home/jenkins/agent/workspace/ease.verify.core.target.2019-06/tests/org.eclipse.ease.lang.javascript.test/target/surefire.properties]
09:39:56 [2021-11-16T14:39:56.362Z] Picked up JAVA_TOOL_OPTIONS: -Dmaven.ext.class.path="/home/jenkins/agent/workspace/ease.verify.core.target.2019-06@tmp/withMaven8b085881/pipeline-maven-spy.jar" -Dorg.jenkinsci.plugins.pipeline.maven.reportsFolder="/home/jenkins/agent/workspace/ease.verify.core.target.2019-06@tmp/withMaven8b085881" 
09:39:58 [2021-11-16T14:39:58.938Z] Running org.eclipse.ease.lang.javascript.JavaScriptCodeFactoryTest
09:39:59 [2021-11-16T14:39:59.193Z] Tests run: 11, Failures: 0, Errors: 0, Skipped: 0, Time elapsed: 0.109 s - in org.eclipse.ease.lang.javascript.JavaScriptCodeFactoryTest
09:39:59 [2021-11-16T14:39:59.193Z] getSaveVariableName_creates_random_string_for_invalid_characters  Time elapsed: 0.029 s
09:39:59 [2021-11-16T14:39:59.193Z] getNullString_equals_null  Time elapsed: 0.057 s
09:39:59 [2021-11-16T14:39:59.193Z] getSaveVariableName_prefixes_keywords_with_underscore  Time elapsed: 0 s
09:39:59 [2021-11-16T14:39:59.193Z] getSaveVariableName_does_not_alter_save_name  Time elapsed: 0 s
09:39:59 [2021-11-16T14:39:59.193Z] classInstantiation_creates_instance_with_parameters  Time elapsed: 0.001 s
09:39:59 [2021-11-16T14:39:59.193Z] createCommentedString_creates_block_comment  Time elapsed: 0.001 s
09:39:59 [2021-11-16T14:39:59.193Z] createCommentedString_creates_single_line_comment  Time elapsed: 0.001 s
09:39:59 [2021-11-16T14:39:59.193Z] classInstantiation_creates_default_instance  Time elapsed: 0 s
09:39:59 [2021-11-16T14:39:59.194Z] createCommentedString_creates_multi_line_comment  Time elapsed: 0.001 s
09:39:59 [2021-11-16T14:39:59.194Z] getSaveVariableName_replaces_invalid_characters  Time elapsed: 0.001 s
09:39:59 [2021-11-16T14:39:59.194Z] getSaveVariableName_prefixes_numbers_with_underscore  Time elapsed: 0 s
09:39:59 [2021-11-16T14:39:59.194Z] 
09:39:59 [2021-11-16T14:39:59.194Z] Results:
09:39:59 [2021-11-16T14:39:59.194Z] 
09:39:59 [2021-11-16T14:39:59.194Z] Tests run: 11, Failures: 0, Errors: 0, Skipped: 0
09:39:59 [2021-11-16T14:39:59.194Z] 
09:39:59 [2021-11-16T14:39:59.449Z] [INFO] All tests passed!
09:39:59 [2021-11-16T14:39:59.449Z] [INFO] 
09:39:59 [2021-11-16T14:39:59.449Z] [INFO] ---------< org.eclipse.ease:org.eclipse.ease.lang.python.test >---------
09:39:59 [2021-11-16T14:39:59.449Z] [INFO] Building org.eclipse.ease.lang.python.test 0.9.0-SNAPSHOT          [6/9]
09:39:59 [2021-11-16T14:39:59.449Z] [INFO] ------------------------[ eclipse-test-plugin ]-------------------------
09:39:59 [2021-11-16T14:39:59.449Z] [INFO] 
09:39:59 [2021-11-16T14:39:59.449Z] [INFO] --- tycho-packaging-plugin:2.2.0:build-qualifier (default-build-qualifier) @ org.eclipse.ease.lang.python.test ---
09:39:59 [2021-11-16T14:39:59.449Z] [INFO] The project's OSGi version is 0.9.0.I202111151120
09:39:59 [2021-11-16T14:39:59.449Z] [INFO] 
09:39:59 [2021-11-16T14:39:59.449Z] [INFO] --- tycho-packaging-plugin:2.2.0:validate-id (default-validate-id) @ org.eclipse.ease.lang.python.test ---
09:39:59 [2021-11-16T14:39:59.450Z] [INFO] 
09:39:59 [2021-11-16T14:39:59.450Z] [INFO] --- tycho-packaging-plugin:2.2.0:validate-version (default-validate-version) @ org.eclipse.ease.lang.python.test ---
09:39:59 [2021-11-16T14:39:59.450Z] [INFO] 
09:39:59 [2021-11-16T14:39:59.450Z] [INFO] --- maven-resources-plugin:2.4.3:resources (default-resources) @ org.eclipse.ease.lang.python.test ---
09:39:59 [2021-11-16T14:39:59.450Z] [INFO] Using 'UTF-8' encoding to copy filtered resources.
09:39:59 [2021-11-16T14:39:59.450Z] [INFO] skip non existing resourceDirectory /home/jenkins/agent/workspace/ease.verify.core.target.2019-06/tests/org.eclipse.ease.lang.python.test/src/main/resources
09:39:59 [2021-11-16T14:39:59.450Z] [INFO] 
09:39:59 [2021-11-16T14:39:59.450Z] [INFO] --- tycho-compiler-plugin:2.2.0:compile (default-compile) @ org.eclipse.ease.lang.python.test ---
09:39:59 [2021-11-16T14:39:59.450Z] [INFO] Nothing to compile - all classes are up to date
09:39:59 [2021-11-16T14:39:59.450Z] [INFO] 
09:39:59 [2021-11-16T14:39:59.450Z] [INFO] --- maven-resources-plugin:2.4.3:testResources (default-testResources) @ org.eclipse.ease.lang.python.test ---
09:39:59 [2021-11-16T14:39:59.450Z] [INFO] Using 'UTF-8' encoding to copy filtered resources.
09:39:59 [2021-11-16T14:39:59.450Z] [INFO] skip non existing resourceDirectory /home/jenkins/agent/workspace/ease.verify.core.target.2019-06/tests/org.eclipse.ease.lang.python.test/src/test/resources
09:39:59 [2021-11-16T14:39:59.450Z] [INFO] 
09:39:59 [2021-11-16T14:39:59.450Z] [INFO] --- target-platform-configuration:2.2.0:target-platform (default-target-platform) @ org.eclipse.ease.lang.python.test ---
09:39:59 [2021-11-16T14:39:59.450Z] [INFO] 
09:39:59 [2021-11-16T14:39:59.450Z] [INFO] --- tycho-packaging-plugin:2.2.0:package-plugin (default-package-plugin) @ org.eclipse.ease.lang.python.test ---
09:39:59 [2021-11-16T14:39:59.450Z] [INFO] Building jar: /home/jenkins/agent/workspace/ease.verify.core.target.2019-06/tests/org.eclipse.ease.lang.python.test/target/org.eclipse.ease.lang.python.test-0.9.0-SNAPSHOT.jar
09:39:59 [2021-11-16T14:39:59.450Z] [INFO] 
09:39:59 [2021-11-16T14:39:59.450Z] [INFO] --- tycho-p2-plugin:2.2.0:p2-metadata-default (default-p2-metadata-default) @ org.eclipse.ease.lang.python.test ---
09:39:59 [2021-11-16T14:39:59.450Z] [INFO] 
09:39:59 [2021-11-16T14:39:59.450Z] [INFO] --- jacoco-maven-plugin:0.8.6:prepare-agent (jacoco-initialize) @ org.eclipse.ease.lang.python.test ---
09:39:59 [2021-11-16T14:39:59.450Z] [INFO] tycho.testArgLine set to -javaagent:/home/jenkins/.m2/repository/org/jacoco/org.jacoco.agent/0.8.6/org.jacoco.agent-0.8.6-runtime.jar=destfile=/home/jenkins/agent/workspace/ease.verify.core.target.2019-06/tests/org.eclipse.ease.lang.python.test/target/jacoco.exec,output=file
09:39:59 [2021-11-16T14:39:59.450Z] [INFO] 
09:39:59 [2021-11-16T14:39:59.450Z] [INFO] --- tycho-surefire-plugin:2.2.0:test (default-test) @ org.eclipse.ease.lang.python.test ---
09:40:00 [2021-11-16T14:40:00.377Z] [INFO] Executing Test Runtime with timeout 0, logs (if any) will be placed at: /home/jenkins/agent/workspace/ease.verify.core.target.2019-06/tests/org.eclipse.ease.lang.python.test/target/work/data/.metadata/.log
09:40:00 [2021-11-16T14:40:00.377Z] [INFO] Command line:
09:40:00 [2021-11-16T14:40:00.377Z] 	[/opt/tools/java/openjdk/jdk-15/15.0.2+7/bin/java, -Dosgi.noShutdown=false, -Dosgi.os=linux, -Dosgi.ws=gtk, -Dosgi.arch=x86_64, -javaagent:/home/jenkins/.m2/repository/org/jacoco/org.jacoco.agent/0.8.6/org.jacoco.agent-0.8.6-runtime.jar=destfile=/home/jenkins/agent/workspace/ease.verify.core.target.2019-06/tests/org.eclipse.ease.lang.python.test/target/jacoco.exec,output=file, -Dosgi.clean=true, -jar, /home/jenkins/.m2/repository/p2/osgi/bundle/org.eclipse.equinox.launcher/1.5.400.v20190515-0925/org.eclipse.equinox.launcher-1.5.400.v20190515-0925.jar, -data, /home/jenkins/agent/workspace/ease.verify.core.target.2019-06/tests/org.eclipse.ease.lang.python.test/target/work/data, -install, /home/jenkins/agent/workspace/ease.verify.core.target.2019-06/tests/org.eclipse.ease.lang.python.test/target/work, -configuration, /home/jenkins/agent/workspace/ease.verify.core.target.2019-06/tests/org.eclipse.ease.lang.python.test/target/work/configuration, -application, org.eclipse.tycho.surefire.osgibooter.headlesstest, -testproperties, /home/jenkins/agent/workspace/ease.verify.core.target.2019-06/tests/org.eclipse.ease.lang.python.test/target/surefire.properties]
09:40:00 [2021-11-16T14:40:00.377Z] Picked up JAVA_TOOL_OPTIONS: -Dmaven.ext.class.path="/home/jenkins/agent/workspace/ease.verify.core.target.2019-06@tmp/withMaven8b085881/pipeline-maven-spy.jar" -Dorg.jenkinsci.plugins.pipeline.maven.reportsFolder="/home/jenkins/agent/workspace/ease.verify.core.target.2019-06@tmp/withMaven8b085881" 
09:40:02 [2021-11-16T14:40:02.935Z] Running org.eclipse.ease.lang.python.PyDevPathImporterTest
09:40:03 [2021-11-16T14:40:03.865Z] Tests run: 6, Failures: 0, Errors: 0, Skipped: 0, Time elapsed: 1.092 s - in org.eclipse.ease.lang.python.PyDevPathImporterTest
09:40:03 [2021-11-16T14:40:03.865Z] createEngine_registers_engine_execution_listener  Time elapsed: 0.615 s
09:40:03 [2021-11-16T14:40:03.865Z] notify_does_not_throwwhen_PyDev_plugins_are_not_available  Time elapsed: 0.303 s
09:40:03 [2021-11-16T14:40:03.865Z] notify_registers_project_paths_for_engine_executed_file  Time elapsed: 0.156 s
09:40:03 [2021-11-16T14:40:03.865Z] notify_does_not_throw_for_non_PyDev_project  Time elapsed: 0.001 s
09:40:03 [2021-11-16T14:40:03.865Z] notify_escapes_path_on_windows  Time elapsed: 0.001 s
09:40:03 [2021-11-16T14:40:03.865Z] notify_registers_project_paths  Time elapsed: 0.002 s
09:40:03 [2021-11-16T14:40:03.865Z] Running org.eclipse.ease.lang.python.PythonCodeFactoryTest
09:40:03 [2021-11-16T14:40:03.865Z] Tests run: 3, Failures: 0, Errors: 0, Skipped: 0, Time elapsed: 0.073 s - in org.eclipse.ease.lang.python.PythonCodeFactoryTest
09:40:03 [2021-11-16T14:40:03.865Z] createFunctionWrapper_creates_return_andParameters_for_Py4J  Time elapsed: 0.053 s
09:40:03 [2021-11-16T14:40:03.865Z] testCommentCreator  Time elapsed: 0.001 s
09:40:03 [2021-11-16T14:40:03.865Z] createFunctionWrapper_creates_void_return_types_for_Py4J  Time elapsed: 0.018 s
09:40:03 [2021-11-16T14:40:03.865Z] 
09:40:03 [2021-11-16T14:40:03.865Z] Results:
09:40:03 [2021-11-16T14:40:03.865Z] 
09:40:03 [2021-11-16T14:40:03.865Z] Tests run: 9, Failures: 0, Errors: 0, Skipped: 0
09:40:03 [2021-11-16T14:40:03.865Z] 
09:40:04 [2021-11-16T14:40:04.135Z] [INFO] All tests passed!
09:40:04 [2021-11-16T14:40:04.135Z] [INFO] 
09:40:04 [2021-11-16T14:40:04.135Z] [INFO] -----< org.eclipse.ease:org.eclipse.ease.lang.python.jython.test >------
09:40:04 [2021-11-16T14:40:04.135Z] [INFO] Building org.eclipse.ease.lang.python.jython.test 0.9.0-SNAPSHOT   [7/9]
09:40:04 [2021-11-16T14:40:04.135Z] [INFO] ------------------------[ eclipse-test-plugin ]-------------------------
09:40:04 [2021-11-16T14:40:04.135Z] [INFO] 
09:40:04 [2021-11-16T14:40:04.135Z] [INFO] --- tycho-packaging-plugin:2.2.0:build-qualifier (default-build-qualifier) @ org.eclipse.ease.lang.python.jython.test ---
09:40:04 [2021-11-16T14:40:04.135Z] [INFO] The project's OSGi version is 0.9.0.I202106220815
09:40:04 [2021-11-16T14:40:04.135Z] [INFO] 
09:40:04 [2021-11-16T14:40:04.135Z] [INFO] --- tycho-packaging-plugin:2.2.0:validate-id (default-validate-id) @ org.eclipse.ease.lang.python.jython.test ---
09:40:04 [2021-11-16T14:40:04.135Z] [INFO] 
09:40:04 [2021-11-16T14:40:04.135Z] [INFO] --- tycho-packaging-plugin:2.2.0:validate-version (default-validate-version) @ org.eclipse.ease.lang.python.jython.test ---
09:40:04 [2021-11-16T14:40:04.135Z] [INFO] 
09:40:04 [2021-11-16T14:40:04.135Z] [INFO] --- maven-resources-plugin:2.4.3:resources (default-resources) @ org.eclipse.ease.lang.python.jython.test ---
09:40:04 [2021-11-16T14:40:04.135Z] [INFO] Using 'UTF-8' encoding to copy filtered resources.
09:40:04 [2021-11-16T14:40:04.135Z] [INFO] skip non existing resourceDirectory /home/jenkins/agent/workspace/ease.verify.core.target.2019-06/tests/org.eclipse.ease.lang.python.jython.test/src/main/resources
09:40:04 [2021-11-16T14:40:04.135Z] [INFO] 
09:40:04 [2021-11-16T14:40:04.135Z] [INFO] --- tycho-compiler-plugin:2.2.0:compile (default-compile) @ org.eclipse.ease.lang.python.jython.test ---
09:40:04 [2021-11-16T14:40:04.135Z] [INFO] Nothing to compile - all classes are up to date
09:40:04 [2021-11-16T14:40:04.135Z] [INFO] 
09:40:04 [2021-11-16T14:40:04.135Z] [INFO] --- maven-resources-plugin:2.4.3:testResources (default-testResources) @ org.eclipse.ease.lang.python.jython.test ---
09:40:04 [2021-11-16T14:40:04.135Z] [INFO] Using 'UTF-8' encoding to copy filtered resources.
09:40:04 [2021-11-16T14:40:04.135Z] [INFO] skip non existing resourceDirectory /home/jenkins/agent/workspace/ease.verify.core.target.2019-06/tests/org.eclipse.ease.lang.python.jython.test/src/test/resources
09:40:04 [2021-11-16T14:40:04.135Z] [INFO] 
09:40:04 [2021-11-16T14:40:04.135Z] [INFO] --- target-platform-configuration:2.2.0:target-platform (default-target-platform) @ org.eclipse.ease.lang.python.jython.test ---
09:40:04 [2021-11-16T14:40:04.135Z] [INFO] 
09:40:04 [2021-11-16T14:40:04.135Z] [INFO] --- tycho-packaging-plugin:2.2.0:package-plugin (default-package-plugin) @ org.eclipse.ease.lang.python.jython.test ---
09:40:04 [2021-11-16T14:40:04.135Z] [INFO] Building jar: /home/jenkins/agent/workspace/ease.verify.core.target.2019-06/tests/org.eclipse.ease.lang.python.jython.test/target/org.eclipse.ease.lang.python.jython.test-0.9.0-SNAPSHOT.jar
09:40:04 [2021-11-16T14:40:04.136Z] [INFO] 
09:40:04 [2021-11-16T14:40:04.136Z] [INFO] --- tycho-p2-plugin:2.2.0:p2-metadata-default (default-p2-metadata-default) @ org.eclipse.ease.lang.python.jython.test ---
09:40:04 [2021-11-16T14:40:04.136Z] [INFO] 
09:40:04 [2021-11-16T14:40:04.136Z] [INFO] --- jacoco-maven-plugin:0.8.6:prepare-agent (jacoco-initialize) @ org.eclipse.ease.lang.python.jython.test ---
09:40:04 [2021-11-16T14:40:04.136Z] [INFO] tycho.testArgLine set to -javaagent:/home/jenkins/.m2/repository/org/jacoco/org.jacoco.agent/0.8.6/org.jacoco.agent-0.8.6-runtime.jar=destfile=/home/jenkins/agent/workspace/ease.verify.core.target.2019-06/tests/org.eclipse.ease.lang.python.jython.test/target/jacoco.exec,output=file
09:40:04 [2021-11-16T14:40:04.136Z] [INFO] 
09:40:04 [2021-11-16T14:40:04.136Z] [INFO] --- tycho-surefire-plugin:2.2.0:test (default-test) @ org.eclipse.ease.lang.python.jython.test ---
09:40:04 [2021-11-16T14:40:04.698Z] [INFO] Executing Test Runtime with timeout 0, logs (if any) will be placed at: /home/jenkins/agent/workspace/ease.verify.core.target.2019-06/tests/org.eclipse.ease.lang.python.jython.test/target/work/data/.metadata/.log
09:40:04 [2021-11-16T14:40:04.698Z] [INFO] Command line:
09:40:04 [2021-11-16T14:40:04.698Z] 	[/opt/tools/java/openjdk/jdk-15/15.0.2+7/bin/java, -Dosgi.noShutdown=false, -Dosgi.os=linux, -Dosgi.ws=gtk, -Dosgi.arch=x86_64, -javaagent:/home/jenkins/.m2/repository/org/jacoco/org.jacoco.agent/0.8.6/org.jacoco.agent-0.8.6-runtime.jar=destfile=/home/jenkins/agent/workspace/ease.verify.core.target.2019-06/tests/org.eclipse.ease.lang.python.jython.test/target/jacoco.exec,output=file, -Dosgi.clean=true, -jar, /home/jenkins/.m2/repository/p2/osgi/bundle/org.eclipse.equinox.launcher/1.5.400.v20190515-0925/org.eclipse.equinox.launcher-1.5.400.v20190515-0925.jar, -data, /home/jenkins/agent/workspace/ease.verify.core.target.2019-06/tests/org.eclipse.ease.lang.python.jython.test/target/work/data, -install, /home/jenkins/agent/workspace/ease.verify.core.target.2019-06/tests/org.eclipse.ease.lang.python.jython.test/target/work, -configuration, /home/jenkins/agent/workspace/ease.verify.core.target.2019-06/tests/org.eclipse.ease.lang.python.jython.test/target/work/configuration, -application, org.eclipse.tycho.surefire.osgibooter.headlesstest, -testproperties, /home/jenkins/agent/workspace/ease.verify.core.target.2019-06/tests/org.eclipse.ease.lang.python.jython.test/target/surefire.properties]
09:40:04 [2021-11-16T14:40:04.698Z] Picked up JAVA_TOOL_OPTIONS: -Dmaven.ext.class.path="/home/jenkins/agent/workspace/ease.verify.core.target.2019-06@tmp/withMaven8b085881/pipeline-maven-spy.jar" -Dorg.jenkinsci.plugins.pipeline.maven.reportsFolder="/home/jenkins/agent/workspace/ease.verify.core.target.2019-06@tmp/withMaven8b085881" 
09:40:07 [2021-11-16T14:40:07.234Z] WARNING: An illegal reflective access operation has occurred
09:40:07 [2021-11-16T14:40:07.235Z] WARNING: Illegal reflective access by org.python.core.PySystemState (file:/home/jenkins/agent/workspace/ease.verify.core.target.2019-06/tests/org.eclipse.ease.lang.python.jython.test/target/work/plugins/org.jython_2.7.0.I202104151016/jython.jar) to method java.io.Console.encoding()
09:40:07 [2021-11-16T14:40:07.235Z] WARNING: Please consider reporting this to the maintainers of org.python.core.PySystemState
09:40:07 [2021-11-16T14:40:07.235Z] WARNING: Use --illegal-access=warn to enable warnings of further illegal reflective access operations
09:40:07 [2021-11-16T14:40:07.235Z] WARNING: All illegal access operations will be denied in a future release
09:40:08 [2021-11-16T14:40:08.035Z] Running org.eclipse.ease.lang.python.jython.debugger.JythonDebugTest
09:40:09 [2021-11-16T14:40:09.932Z] Start of script
09:40:09 [2021-11-16T14:40:09.932Z] include file start
09:40:09 [2021-11-16T14:40:09.932Z] include file processed
09:40:09 [2021-11-16T14:40:09.932Z] Result of testMethod = 5
09:40:09 [2021-11-16T14:40:09.932Z] End of script
09:40:10 [2021-11-16T14:40:10.189Z] Start of script
09:40:10 [2021-11-16T14:40:10.189Z] include file start
09:40:10 [2021-11-16T14:40:10.189Z] include file processed
09:40:10 [2021-11-16T14:40:10.189Z] Result of testMethod = 5
09:40:10 [2021-11-16T14:40:10.189Z] End of script
09:40:10 [2021-11-16T14:40:10.448Z] Start of script
09:40:10 [2021-11-16T14:40:10.449Z] include file start
09:40:10 [2021-11-16T14:40:10.449Z] include file processed
09:40:10 [2021-11-16T14:40:10.449Z] Result of testMethod = 5
09:40:10 [2021-11-16T14:40:10.914Z] Traceback (most recent call last):
09:40:10 [2021-11-16T14:40:10.914Z]   File "(none)", line 184, in run
09:40:10 [2021-11-16T14:40:10.914Z]   File "__ref_L/Debug Test/Main.py_lioylgocoa", line 23, in <module>
09:40:10 [2021-11-16T14:40:10.914Z]   File "(none)", line 161, in trace_dispatch
09:40:10 [2021-11-16T14:40:10.914Z] 	at org.eclipse.ease.debugging.AbstractEaseDebugger.handleEventsInSuspendedState(AbstractEaseDebugger.java:331)
09:40:10 [2021-11-16T14:40:10.914Z] 	at org.eclipse.ease.debugging.AbstractEaseDebugger.suspend(AbstractEaseDebugger.java:257)
09:40:10 [2021-11-16T14:40:10.914Z] 	at org.eclipse.ease.debugging.AbstractEaseDebugger.processLine(AbstractEaseDebugger.java:492)
09:40:10 [2021-11-16T14:40:10.914Z] 	at org.eclipse.ease.lang.python.debugger.PythonDebugger.traceDispatch(PythonDebugger.java:179)
09:40:10 [2021-11-16T14:40:10.915Z] 	at org.eclipse.ease.lang.python.jython.debugger.JythonDebugger.traceDispatch(JythonDebugger.java:46)
09:40:10 [2021-11-16T14:40:10.915Z] 	at jdk.internal.reflect.GeneratedMethodAccessor25.invoke(Unknown Source)
09:40:10 [2021-11-16T14:40:10.915Z] 	at java.base/jdk.internal.reflect.DelegatingMethodAccessorImpl.invoke(DelegatingMethodAccessorImpl.java:43)
09:40:10 [2021-11-16T14:40:10.915Z] 	at java.base/java.lang.reflect.Method.invoke(Method.java:564)
09:40:10 [2021-11-16T14:40:10.915Z] 
09:40:10 [2021-11-16T14:40:10.915Z] org.eclipse.ease.ScriptEngineCancellationException: org.eclipse.ease.ScriptEngineCancellationException: Terminated on user request
09:40:10 [2021-11-16T14:40:10.915Z] Start of script
09:40:10 [2021-11-16T14:40:10.915Z] include file start
09:40:10 [2021-11-16T14:40:10.915Z] include file processed
09:40:11 [2021-11-16T14:40:11.578Z] Result of testMethod = 5
09:40:11 [2021-11-16T14:40:11.578Z] End of script
09:40:11 [2021-11-16T14:40:11.578Z] Start of script
09:40:11 [2021-11-16T14:40:11.578Z] include file start
09:40:11 [2021-11-16T14:40:11.578Z] include file processed
09:40:11 [2021-11-16T14:40:11.578Z] Result of testMethod = 5
09:40:11 [2021-11-16T14:40:11.578Z] End of script
09:40:11 [2021-11-16T14:40:11.578Z] Start of script
09:40:11 [2021-11-16T14:40:11.578Z] include file start
09:40:11 [2021-11-16T14:40:11.578Z] include file processed
09:40:11 [2021-11-16T14:40:11.578Z] Result of testMethod = 5
09:40:11 [2021-11-16T14:40:11.578Z] End of script
09:40:11 [2021-11-16T14:40:11.834Z] Start of script
09:40:11 [2021-11-16T14:40:11.834Z] include file start
09:40:11 [2021-11-16T14:40:11.834Z] include file processed
09:40:11 [2021-11-16T14:40:11.834Z] Result of testMethod = 5
09:40:12 [2021-11-16T14:40:12.090Z] Traceback (most recent call last):
09:40:12 [2021-11-16T14:40:12.090Z]   File "(none)", line 184, in run
09:40:12 [2021-11-16T14:40:12.090Z]   File "__ref_L/Debug Test/Main.py_asbqpmovij", line 23, in <module>
09:40:12 [2021-11-16T14:40:12.090Z]   File "(none)", line 161, in trace_dispatch
09:40:12 [2021-11-16T14:40:12.090Z] 	at org.eclipse.ease.debugging.AbstractEaseDebugger.handleEventsInSuspendedState(AbstractEaseDebugger.java:331)
09:40:12 [2021-11-16T14:40:12.090Z] 	at org.eclipse.ease.debugging.AbstractEaseDebugger.suspend(AbstractEaseDebugger.java:257)
09:40:12 [2021-11-16T14:40:12.090Z] 	at org.eclipse.ease.debugging.AbstractEaseDebugger.processLine(AbstractEaseDebugger.java:492)
09:40:12 [2021-11-16T14:40:12.090Z] 	at org.eclipse.ease.lang.python.debugger.PythonDebugger.traceDispatch(PythonDebugger.java:179)
09:40:12 [2021-11-16T14:40:12.090Z] 	at org.eclipse.ease.lang.python.jython.debugger.JythonDebugger.traceDispatch(JythonDebugger.java:46)
09:40:12 [2021-11-16T14:40:12.090Z] 	at jdk.internal.reflect.GeneratedMethodAccessor25.invoke(Unknown Source)
09:40:12 [2021-11-16T14:40:12.090Z] 	at java.base/jdk.internal.reflect.DelegatingMethodAccessorImpl.invoke(DelegatingMethodAccessorImpl.java:43)
09:40:12 [2021-11-16T14:40:12.090Z] 	at java.base/java.lang.reflect.Method.invoke(Method.java:564)
09:40:12 [2021-11-16T14:40:12.091Z] 
09:40:12 [2021-11-16T14:40:12.091Z] org.eclipse.ease.ScriptEngineCancellationException: org.eclipse.ease.ScriptEngineCancellationException: Terminated on user request
09:40:12 [2021-11-16T14:40:12.091Z] Start of script
09:40:12 [2021-11-16T14:40:12.091Z] include file start
09:40:12 [2021-11-16T14:40:12.091Z] include file processed
09:40:12 [2021-11-16T14:40:12.347Z] Result of testMethod = 5
09:40:12 [2021-11-16T14:40:12.347Z] End of script
09:40:12 [2021-11-16T14:40:12.604Z] Start of script
09:40:12 [2021-11-16T14:40:12.604Z] include file start
09:40:12 [2021-11-16T14:40:12.604Z] include file processed
09:40:12 [2021-11-16T14:40:12.604Z] Result of testMethod = 5
09:40:12 [2021-11-16T14:40:12.604Z] End of script
09:40:12 [2021-11-16T14:40:12.604Z] Start of script
09:40:12 [2021-11-16T14:40:12.604Z] include file start
09:40:12 [2021-11-16T14:40:12.604Z] include file processed
09:40:13 [2021-11-16T14:40:13.166Z] Traceback (most recent call last):
09:40:13 [2021-11-16T14:40:13.166Z]   File "(none)", line 184, in run
09:40:13 [2021-11-16T14:40:13.166Z]   File "__ref_L/Debug Test/Main.py_hzoiviwbwx", line 22, in <module>
09:40:13 [2021-11-16T14:40:13.166Z]   File "(none)", line 161, in trace_dispatch
09:40:13 [2021-11-16T14:40:13.166Z] 	at org.eclipse.ease.debugging.AbstractEaseDebugger.handleEventsInSuspendedState(AbstractEaseDebugger.java:331)
09:40:13 [2021-11-16T14:40:13.166Z] 	at org.eclipse.ease.debugging.AbstractEaseDebugger.suspend(AbstractEaseDebugger.java:257)
09:40:13 [2021-11-16T14:40:13.166Z] 	at org.eclipse.ease.debugging.AbstractEaseDebugger.processLine(AbstractEaseDebugger.java:512)
09:40:13 [2021-11-16T14:40:13.166Z] 	at org.eclipse.ease.lang.python.debugger.PythonDebugger.traceDispatch(PythonDebugger.java:179)
09:40:13 [2021-11-16T14:40:13.166Z] 	at org.eclipse.ease.lang.python.jython.debugger.JythonDebugger.traceDispatch(JythonDebugger.java:46)
09:40:13 [2021-11-16T14:40:13.166Z] 	at jdk.internal.reflect.GeneratedMethodAccessor25.invoke(Unknown Source)
09:40:13 [2021-11-16T14:40:13.166Z] 	at java.base/jdk.internal.reflect.DelegatingMethodAccessorImpl.invoke(DelegatingMethodAccessorImpl.java:43)
09:40:13 [2021-11-16T14:40:13.166Z] 	at java.base/java.lang.reflect.Method.invoke(Method.java:564)
09:40:13 [2021-11-16T14:40:13.166Z] 
09:40:13 [2021-11-16T14:40:13.166Z] org.eclipse.ease.ScriptEngineCancellationException: org.eclipse.ease.ScriptEngineCancellationException: Terminated on user request
09:40:13 [2021-11-16T14:40:13.166Z] Start of script
09:40:13 [2021-11-16T14:40:13.166Z] include file start
09:40:13 [2021-11-16T14:40:13.166Z] include file processed
09:40:13 [2021-11-16T14:40:13.167Z] Result of testMethod = 5
09:40:13 [2021-11-16T14:40:13.167Z] End of script
09:40:13 [2021-11-16T14:40:13.422Z] Start of script
09:40:13 [2021-11-16T14:40:13.422Z] include file start
09:40:13 [2021-11-16T14:40:13.422Z] include file processed
09:40:13 [2021-11-16T14:40:13.422Z] Result of testMethod = 5
09:40:13 [2021-11-16T14:40:13.422Z] End of script
09:40:13 [2021-11-16T14:40:13.678Z] Traceback (most recent call last):
09:40:13 [2021-11-16T14:40:13.678Z]   File "(none)", line 184, in run
09:40:13 [2021-11-16T14:40:13.678Z]   File "__ref_L/Debug Test/Main.py_etqcvttoaj", line 1, in <module>
09:40:13 [2021-11-16T14:40:13.678Z]   File "(none)", line 161, in trace_dispatch
09:40:13 [2021-11-16T14:40:13.678Z] 	at org.eclipse.ease.debugging.AbstractEaseDebugger.handleEventsInSuspendedState(AbstractEaseDebugger.java:331)
09:40:13 [2021-11-16T14:40:13.678Z] 	at org.eclipse.ease.debugging.AbstractEaseDebugger.suspend(AbstractEaseDebugger.java:257)
09:40:13 [2021-11-16T14:40:13.678Z] 	at org.eclipse.ease.debugging.AbstractEaseDebugger.processLine(AbstractEaseDebugger.java:492)
09:40:13 [2021-11-16T14:40:13.678Z] 	at org.eclipse.ease.lang.python.debugger.PythonDebugger.traceDispatch(PythonDebugger.java:179)
09:40:13 [2021-11-16T14:40:13.678Z] 	at org.eclipse.ease.lang.python.jython.debugger.JythonDebugger.traceDispatch(JythonDebugger.java:46)
09:40:13 [2021-11-16T14:40:13.678Z] 	at jdk.internal.reflect.GeneratedMethodAccessor25.invoke(Unknown Source)
09:40:13 [2021-11-16T14:40:13.678Z] 	at java.base/jdk.internal.reflect.DelegatingMethodAccessorImpl.invoke(DelegatingMethodAccessorImpl.java:43)
09:40:13 [2021-11-16T14:40:13.678Z] 	at java.base/java.lang.reflect.Method.invoke(Method.java:564)
09:40:13 [2021-11-16T14:40:13.678Z] 
09:40:13 [2021-11-16T14:40:13.678Z] org.eclipse.ease.ScriptEngineCancellationException: org.eclipse.ease.ScriptEngineCancellationException: Terminated on user request
09:40:13 [2021-11-16T14:40:13.935Z] Start of script
09:40:13 [2021-11-16T14:40:13.935Z] include file start
09:40:13 [2021-11-16T14:40:13.935Z] include file processed
09:40:13 [2021-11-16T14:40:13.935Z] Result of testMethod = 5
09:40:13 [2021-11-16T14:40:13.935Z] End of script
09:40:14 [2021-11-16T14:40:14.191Z] Start of script
09:40:14 [2021-11-16T14:40:14.191Z] include file start
09:40:14 [2021-11-16T14:40:14.191Z] include file processed
09:40:14 [2021-11-16T14:40:14.191Z] Result of testMethod = 5
09:40:14 [2021-11-16T14:40:14.191Z] End of script
09:40:14 [2021-11-16T14:40:14.447Z] Start of script
09:40:14 [2021-11-16T14:40:14.447Z] include file start
09:40:14 [2021-11-16T14:40:14.447Z] include file processed
09:40:14 [2021-11-16T14:40:14.447Z] Result of testMethod = 5
09:40:14 [2021-11-16T14:40:14.702Z] Traceback (most recent call last):
09:40:14 [2021-11-16T14:40:14.702Z]   File "(none)", line 184, in run
09:40:14 [2021-11-16T14:40:14.702Z]   File "__ref_L/Debug Test/Main.py_qjkjqatova", line 23, in <module>
09:40:14 [2021-11-16T14:40:14.702Z]   File "(none)", line 161, in trace_dispatch
09:40:14 [2021-11-16T14:40:14.702Z] 	at org.eclipse.ease.debugging.AbstractEaseDebugger.handleEventsInSuspendedState(AbstractEaseDebugger.java:331)
09:40:14 [2021-11-16T14:40:14.702Z] 	at org.eclipse.ease.debugging.AbstractEaseDebugger.suspend(AbstractEaseDebugger.java:257)
09:40:14 [2021-11-16T14:40:14.702Z] 	at org.eclipse.ease.debugging.AbstractEaseDebugger.processLine(AbstractEaseDebugger.java:492)
09:40:14 [2021-11-16T14:40:14.702Z] 	at org.eclipse.ease.lang.python.debugger.PythonDebugger.traceDispatch(PythonDebugger.java:179)
09:40:14 [2021-11-16T14:40:14.702Z] 	at org.eclipse.ease.lang.python.jython.debugger.JythonDebugger.traceDispatch(JythonDebugger.java:46)
09:40:14 [2021-11-16T14:40:14.702Z] 	at jdk.internal.reflect.GeneratedMethodAccessor25.invoke(Unknown Source)
09:40:14 [2021-11-16T14:40:14.702Z] 	at java.base/jdk.internal.reflect.DelegatingMethodAccessorImpl.invoke(DelegatingMethodAccessorImpl.java:43)
09:40:14 [2021-11-16T14:40:14.702Z] 	at java.base/java.lang.reflect.Method.invoke(Method.java:564)
09:40:14 [2021-11-16T14:40:14.702Z] 
09:40:14 [2021-11-16T14:40:14.702Z] org.eclipse.ease.ScriptEngineCancellationException: org.eclipse.ease.ScriptEngineCancellationException: Terminated on user request
09:40:14 [2021-11-16T14:40:14.702Z] Start of script
09:40:14 [2021-11-16T14:40:14.702Z] include file start
09:40:14 [2021-11-16T14:40:14.702Z] include file processed
09:40:14 [2021-11-16T14:40:14.958Z] Result of testMethod = 5
09:40:14 [2021-11-16T14:40:14.958Z] End of script
09:40:15 [2021-11-16T14:40:15.214Z] Traceback (most recent call last):
09:40:15 [2021-11-16T14:40:15.214Z]   File "(none)", line 184, in run
09:40:15 [2021-11-16T14:40:15.214Z]   File "__ref_L/Debug Test/Main.py_qomubirpuw", line 1, in <module>
09:40:15 [2021-11-16T14:40:15.214Z]   File "(none)", line 161, in trace_dispatch
09:40:15 [2021-11-16T14:40:15.214Z] 	at org.eclipse.ease.debugging.AbstractEaseDebugger.handleEventsInSuspendedState(AbstractEaseDebugger.java:331)
09:40:15 [2021-11-16T14:40:15.214Z] 	at org.eclipse.ease.debugging.AbstractEaseDebugger.suspend(AbstractEaseDebugger.java:257)
09:40:15 [2021-11-16T14:40:15.214Z] 	at org.eclipse.ease.debugging.AbstractEaseDebugger.processLine(AbstractEaseDebugger.java:492)
09:40:15 [2021-11-16T14:40:15.214Z] 	at org.eclipse.ease.lang.python.debugger.PythonDebugger.traceDispatch(PythonDebugger.java:179)
09:40:15 [2021-11-16T14:40:15.214Z] 	at org.eclipse.ease.lang.python.jython.debugger.JythonDebugger.traceDispatch(JythonDebugger.java:46)
09:40:15 [2021-11-16T14:40:15.214Z] 	at jdk.internal.reflect.GeneratedMethodAccessor25.invoke(Unknown Source)
09:40:15 [2021-11-16T14:40:15.214Z] 	at java.base/jdk.internal.reflect.DelegatingMethodAccessorImpl.invoke(DelegatingMethodAccessorImpl.java:43)
09:40:15 [2021-11-16T14:40:15.214Z] 	at java.base/java.lang.reflect.Method.invoke(Method.java:564)
09:40:15 [2021-11-16T14:40:15.214Z] 
09:40:15 [2021-11-16T14:40:15.214Z] org.eclipse.ease.ScriptEngineCancellationException: org.eclipse.ease.ScriptEngineCancellationException: Terminated on user request
09:40:15 [2021-11-16T14:40:15.214Z] Start of script
09:40:15 [2021-11-16T14:40:15.470Z] include file start
09:40:15 [2021-11-16T14:40:15.470Z] include file processed
09:40:15 [2021-11-16T14:40:15.470Z] Result of testMethod = 5
09:40:15 [2021-11-16T14:40:15.470Z] End of script
09:40:15 [2021-11-16T14:40:15.470Z] Start of script
09:40:15 [2021-11-16T14:40:15.470Z] include file start
09:40:15 [2021-11-16T14:40:15.470Z] include file processed
09:40:15 [2021-11-16T14:40:15.725Z] Result of testMethod = 5
09:40:15 [2021-11-16T14:40:15.725Z] End of script
09:40:15 [2021-11-16T14:40:15.981Z] Traceback (most recent call last):
09:40:15 [2021-11-16T14:40:15.981Z]   File "(none)", line 184, in run
09:40:15 [2021-11-16T14:40:15.981Z]   File "__ref_L/Debug Test/Main.py_svpnfzlzjr", line 1, in <module>
09:40:15 [2021-11-16T14:40:15.981Z]   File "(none)", line 161, in trace_dispatch
09:40:15 [2021-11-16T14:40:15.981Z] 	at org.eclipse.ease.debugging.AbstractEaseDebugger.handleEventsInSuspendedState(AbstractEaseDebugger.java:331)
09:40:15 [2021-11-16T14:40:15.981Z] 	at org.eclipse.ease.debugging.AbstractEaseDebugger.suspend(AbstractEaseDebugger.java:257)
09:40:15 [2021-11-16T14:40:15.981Z] 	at org.eclipse.ease.debugging.AbstractEaseDebugger.processLine(AbstractEaseDebugger.java:492)
09:40:15 [2021-11-16T14:40:15.981Z] 	at org.eclipse.ease.lang.python.debugger.PythonDebugger.traceDispatch(PythonDebugger.java:179)
09:40:15 [2021-11-16T14:40:15.981Z] 	at org.eclipse.ease.lang.python.jython.debugger.JythonDebugger.traceDispatch(JythonDebugger.java:46)
09:40:15 [2021-11-16T14:40:15.981Z] 	at jdk.internal.reflect.GeneratedMethodAccessor25.invoke(Unknown Source)
09:40:15 [2021-11-16T14:40:15.981Z] 	at java.base/jdk.internal.reflect.DelegatingMethodAccessorImpl.invoke(DelegatingMethodAccessorImpl.java:43)
09:40:15 [2021-11-16T14:40:15.981Z] 	at java.base/java.lang.reflect.Method.invoke(Method.java:564)
09:40:15 [2021-11-16T14:40:15.981Z] 
09:40:15 [2021-11-16T14:40:15.981Z] org.eclipse.ease.ScriptEngineCancellationException: org.eclipse.ease.ScriptEngineCancellationException: Terminated on user request
09:40:15 [2021-11-16T14:40:15.981Z] Start of script
09:40:15 [2021-11-16T14:40:15.981Z] include file start
09:40:15 [2021-11-16T14:40:15.982Z] include file processed
09:40:16 [2021-11-16T14:40:16.237Z] Result of testMethod = 5
09:40:16 [2021-11-16T14:40:16.237Z] End of script
09:40:16 [2021-11-16T14:40:16.237Z] Start of script
09:40:16 [2021-11-16T14:40:16.237Z] include file start
09:40:16 [2021-11-16T14:40:16.237Z] include file processed
09:40:16 [2021-11-16T14:40:16.237Z] Result of testMethod = 5
09:40:16 [2021-11-16T14:40:16.493Z] Traceback (most recent call last):
09:40:16 [2021-11-16T14:40:16.493Z]   File "(none)", line 184, in run
09:40:16 [2021-11-16T14:40:16.493Z]   File "__ref_L/Debug Test/Main.py_bptehlahdf", line 23, in <module>
09:40:16 [2021-11-16T14:40:16.493Z]   File "(none)", line 161, in trace_dispatch
09:40:16 [2021-11-16T14:40:16.493Z] 	at org.eclipse.ease.debugging.AbstractEaseDebugger.handleEventsInSuspendedState(AbstractEaseDebugger.java:331)
09:40:16 [2021-11-16T14:40:16.493Z] 	at org.eclipse.ease.debugging.AbstractEaseDebugger.suspend(AbstractEaseDebugger.java:257)
09:40:16 [2021-11-16T14:40:16.493Z] 	at org.eclipse.ease.debugging.AbstractEaseDebugger.processLine(AbstractEaseDebugger.java:492)
09:40:16 [2021-11-16T14:40:16.493Z] 	at org.eclipse.ease.lang.python.debugger.PythonDebugger.traceDispatch(PythonDebugger.java:179)
09:40:16 [2021-11-16T14:40:16.493Z] 	at org.eclipse.ease.lang.python.jython.debugger.JythonDebugger.traceDispatch(JythonDebugger.java:46)
09:40:16 [2021-11-16T14:40:16.493Z] 	at jdk.internal.reflect.GeneratedMethodAccessor25.invoke(Unknown Source)
09:40:16 [2021-11-16T14:40:16.493Z] 	at java.base/jdk.internal.reflect.DelegatingMethodAccessorImpl.invoke(DelegatingMethodAccessorImpl.java:43)
09:40:16 [2021-11-16T14:40:16.493Z] 	at java.base/java.lang.reflect.Method.invoke(Method.java:564)
09:40:16 [2021-11-16T14:40:16.493Z] 
09:40:16 [2021-11-16T14:40:16.493Z] org.eclipse.ease.ScriptEngineCancellationException: org.eclipse.ease.ScriptEngineCancellationException: Terminated on user request
09:40:16 [2021-11-16T14:40:16.749Z] Start of script
09:40:16 [2021-11-16T14:40:16.749Z] include file start
09:40:16 [2021-11-16T14:40:16.749Z] include file processed
09:40:16 [2021-11-16T14:40:16.749Z] Result of testMethod = 5
09:40:16 [2021-11-16T14:40:16.749Z] End of script
09:40:16 [2021-11-16T14:40:16.749Z] Start of script
09:40:16 [2021-11-16T14:40:16.749Z] include file start
09:40:16 [2021-11-16T14:40:16.749Z] include file processed
09:40:17 [2021-11-16T14:40:17.004Z] Result of testMethod = 5
09:40:17 [2021-11-16T14:40:17.004Z] End of script
09:40:17 [2021-11-16T14:40:17.260Z] Start of script
09:40:17 [2021-11-16T14:40:17.260Z] include file start
09:40:17 [2021-11-16T14:40:17.260Z] include file processed
09:40:17 [2021-11-16T14:40:17.260Z] Result of testMethod = 5
09:40:17 [2021-11-16T14:40:17.260Z] End of script
09:40:17 [2021-11-16T14:40:17.260Z] Start of script
09:40:17 [2021-11-16T14:40:17.260Z] include file start
09:40:17 [2021-11-16T14:40:17.260Z] include file processed
09:40:17 [2021-11-16T14:40:17.515Z] Result of testMethod = 5
09:40:17 [2021-11-16T14:40:17.515Z] End of script
09:40:17 [2021-11-16T14:40:17.515Z] Start of script
09:40:17 [2021-11-16T14:40:17.515Z] include file start
09:40:17 [2021-11-16T14:40:17.515Z] include file processed
09:40:17 [2021-11-16T14:40:17.770Z] Traceback (most recent call last):
09:40:17 [2021-11-16T14:40:17.770Z]   File "(none)", line 184, in run
09:40:17 [2021-11-16T14:40:17.770Z]   File "__ref_L/Debug Test/Main.py_ksccsacuma", line 21, in <module>
09:40:17 [2021-11-16T14:40:17.770Z]   File "__ref_L/Debug Test/Main.py_ksccsacuma", line 18, in testMethod
09:40:17 [2021-11-16T14:40:17.770Z]   File "(none)", line 161, in trace_dispatch
09:40:17 [2021-11-16T14:40:17.770Z] 	at org.eclipse.ease.debugging.AbstractEaseDebugger.handleEventsInSuspendedState(AbstractEaseDebugger.java:331)
09:40:17 [2021-11-16T14:40:17.770Z] 	at org.eclipse.ease.debugging.AbstractEaseDebugger.suspend(AbstractEaseDebugger.java:257)
09:40:17 [2021-11-16T14:40:17.770Z] 	at org.eclipse.ease.debugging.AbstractEaseDebugger.processLine(AbstractEaseDebugger.java:492)
09:40:17 [2021-11-16T14:40:17.770Z] 	at org.eclipse.ease.lang.python.debugger.PythonDebugger.traceDispatch(PythonDebugger.java:179)
09:40:17 [2021-11-16T14:40:17.771Z] 	at org.eclipse.ease.lang.python.jython.debugger.JythonDebugger.traceDispatch(JythonDebugger.java:46)
09:40:17 [2021-11-16T14:40:17.771Z] 	at jdk.internal.reflect.GeneratedMethodAccessor25.invoke(Unknown Source)
09:40:17 [2021-11-16T14:40:17.771Z] 	at java.base/jdk.internal.reflect.DelegatingMethodAccessorImpl.invoke(DelegatingMethodAccessorImpl.java:43)
09:40:17 [2021-11-16T14:40:17.771Z] 	at java.base/java.lang.reflect.Method.invoke(Method.java:564)
09:40:17 [2021-11-16T14:40:17.771Z] 
09:40:17 [2021-11-16T14:40:17.771Z] org.eclipse.ease.ScriptEngineCancellationException: org.eclipse.ease.ScriptEngineCancellationException: Terminated on user request
09:40:17 [2021-11-16T14:40:17.771Z] Start of script
09:40:18 [2021-11-16T14:40:18.027Z] include file start
09:40:18 [2021-11-16T14:40:18.027Z] include file processed
09:40:18 [2021-11-16T14:40:18.027Z] Result of testMethod = 5
09:40:18 [2021-11-16T14:40:18.027Z] End of script
09:40:18 [2021-11-16T14:40:18.283Z] Start of script
09:40:18 [2021-11-16T14:40:18.283Z] include file start
09:40:18 [2021-11-16T14:40:18.283Z] include file processed
09:40:18 [2021-11-16T14:40:18.283Z] Result of testMethod = 5
09:40:18 [2021-11-16T14:40:18.283Z] Traceback (most recent call last):
09:40:18 [2021-11-16T14:40:18.283Z]   File "(none)", line 184, in run
09:40:18 [2021-11-16T14:40:18.283Z]   File "__ref_L/Debug Test/Main.py_agtojavrop", line 23, in <module>
09:40:18 [2021-11-16T14:40:18.283Z]   File "(none)", line 161, in trace_dispatch
09:40:18 [2021-11-16T14:40:18.283Z] 	at org.eclipse.ease.debugging.AbstractEaseDebugger.handleEventsInSuspendedState(AbstractEaseDebugger.java:331)
09:40:18 [2021-11-16T14:40:18.283Z] 	at org.eclipse.ease.debugging.AbstractEaseDebugger.suspend(AbstractEaseDebugger.java:257)
09:40:18 [2021-11-16T14:40:18.283Z] 	at org.eclipse.ease.debugging.AbstractEaseDebugger.processLine(AbstractEaseDebugger.java:492)
09:40:18 [2021-11-16T14:40:18.284Z] 	at org.eclipse.ease.lang.python.debugger.PythonDebugger.traceDispatch(PythonDebugger.java:179)
09:40:18 [2021-11-16T14:40:18.284Z] 	at org.eclipse.ease.lang.python.jython.debugger.JythonDebugger.traceDispatch(JythonDebugger.java:46)
09:40:18 [2021-11-16T14:40:18.284Z] 	at jdk.internal.reflect.GeneratedMethodAccessor25.invoke(Unknown Source)
09:40:18 [2021-11-16T14:40:18.284Z] 	at java.base/jdk.internal.reflect.DelegatingMethodAccessorImpl.invoke(DelegatingMethodAccessorImpl.java:43)
09:40:18 [2021-11-16T14:40:18.284Z] 	at java.base/java.lang.reflect.Method.invoke(Method.java:564)
09:40:18 [2021-11-16T14:40:18.284Z] 
09:40:18 [2021-11-16T14:40:18.284Z] org.eclipse.ease.ScriptEngineCancellationException: org.eclipse.ease.ScriptEngineCancellationException: Terminated on user request
09:40:18 [2021-11-16T14:40:18.540Z] Start of script
09:40:18 [2021-11-16T14:40:18.540Z] include file start
09:40:18 [2021-11-16T14:40:18.540Z] include file processed
09:40:18 [2021-11-16T14:40:18.540Z] Result of testMethod = 5
09:40:18 [2021-11-16T14:40:18.540Z] End of script
09:40:18 [2021-11-16T14:40:18.797Z] Start of script
09:40:18 [2021-11-16T14:40:18.797Z] include file start
09:40:18 [2021-11-16T14:40:18.798Z] include file processed
09:40:18 [2021-11-16T14:40:18.798Z] Result of testMethod = 5
09:40:18 [2021-11-16T14:40:18.798Z] End of script
09:40:19 [2021-11-16T14:40:19.055Z] Start of script
09:40:19 [2021-11-16T14:40:19.055Z] include file start
09:40:19 [2021-11-16T14:40:19.055Z] include file processed
09:40:19 [2021-11-16T14:40:19.055Z] Result of testMethod = 5
09:40:19 [2021-11-16T14:40:19.055Z] End of script
09:40:19 [2021-11-16T14:40:19.312Z] Start of script
09:40:19 [2021-11-16T14:40:19.312Z] include file start
09:40:19 [2021-11-16T14:40:19.312Z] include file processed
09:40:19 [2021-11-16T14:40:19.312Z] Result of testMethod = 5
09:40:19 [2021-11-16T14:40:19.312Z] End of script
09:40:19 [2021-11-16T14:40:19.568Z] Start of script
09:40:19 [2021-11-16T14:40:19.568Z] include file start
09:40:19 [2021-11-16T14:40:19.568Z] include file processed
09:40:19 [2021-11-16T14:40:19.568Z] Result of testMethod = 5
09:40:19 [2021-11-16T14:40:19.568Z] Traceback (most recent call last):
09:40:19 [2021-11-16T14:40:19.568Z]   File "(none)", line 184, in run
09:40:19 [2021-11-16T14:40:19.568Z]   File "__ref_L/Debug Test/Main.py_lvmcvojndn", line 23, in <module>
09:40:19 [2021-11-16T14:40:19.568Z]   File "(none)", line 161, in trace_dispatch
09:40:19 [2021-11-16T14:40:19.568Z] 	at org.eclipse.ease.debugging.AbstractEaseDebugger.handleEventsInSuspendedState(AbstractEaseDebugger.java:331)
09:40:19 [2021-11-16T14:40:19.568Z] 	at org.eclipse.ease.debugging.AbstractEaseDebugger.suspend(AbstractEaseDebugger.java:257)
09:40:19 [2021-11-16T14:40:19.568Z] 	at org.eclipse.ease.debugging.AbstractEaseDebugger.processLine(AbstractEaseDebugger.java:492)
09:40:19 [2021-11-16T14:40:19.568Z] 	at org.eclipse.ease.lang.python.debugger.PythonDebugger.traceDispatch(PythonDebugger.java:179)
09:40:19 [2021-11-16T14:40:19.568Z] 	at org.eclipse.ease.lang.python.jython.debugger.JythonDebugger.traceDispatch(JythonDebugger.java:46)
09:40:19 [2021-11-16T14:40:19.568Z] 	at jdk.internal.reflect.GeneratedMethodAccessor25.invoke(Unknown Source)
09:40:19 [2021-11-16T14:40:19.568Z] 	at java.base/jdk.internal.reflect.DelegatingMethodAccessorImpl.invoke(DelegatingMethodAccessorImpl.java:43)
09:40:19 [2021-11-16T14:40:19.568Z] 	at java.base/java.lang.reflect.Method.invoke(Method.java:564)
09:40:19 [2021-11-16T14:40:19.568Z] 
09:40:19 [2021-11-16T14:40:19.568Z] org.eclipse.ease.ScriptEngineCancellationException: org.eclipse.ease.ScriptEngineCancellationException: Terminated on user request
09:40:19 [2021-11-16T14:40:19.825Z] Start of script
09:40:19 [2021-11-16T14:40:19.825Z] include file start
09:40:19 [2021-11-16T14:40:19.825Z] include file processed
09:40:19 [2021-11-16T14:40:19.825Z] Result of testMethod = 5
09:40:19 [2021-11-16T14:40:19.825Z] End of script
09:40:20 [2021-11-16T14:40:20.081Z] Start of script
09:40:20 [2021-11-16T14:40:20.081Z] include file start
09:40:20 [2021-11-16T14:40:20.081Z] include file processed
09:40:20 [2021-11-16T14:40:20.081Z] Result of testMethod = 5
09:40:20 [2021-11-16T14:40:20.081Z] Traceback (most recent call last):
09:40:20 [2021-11-16T14:40:20.081Z]   File "(none)", line 184, in run
09:40:20 [2021-11-16T14:40:20.081Z]   File "__ref_L/Debug Test/Main.py_ggobjrnvfk", line 23, in <module>
09:40:20 [2021-11-16T14:40:20.081Z]   File "(none)", line 161, in trace_dispatch
09:40:20 [2021-11-16T14:40:20.081Z] 	at org.eclipse.ease.debugging.AbstractEaseDebugger.handleEventsInSuspendedState(AbstractEaseDebugger.java:331)
09:40:20 [2021-11-16T14:40:20.081Z] 	at org.eclipse.ease.debugging.AbstractEaseDebugger.suspend(AbstractEaseDebugger.java:257)
09:40:20 [2021-11-16T14:40:20.081Z] 	at org.eclipse.ease.debugging.AbstractEaseDebugger.processLine(AbstractEaseDebugger.java:492)
09:40:20 [2021-11-16T14:40:20.081Z] 	at org.eclipse.ease.lang.python.debugger.PythonDebugger.traceDispatch(PythonDebugger.java:179)
09:40:20 [2021-11-16T14:40:20.082Z] 	at org.eclipse.ease.lang.python.jython.debugger.JythonDebugger.traceDispatch(JythonDebugger.java:46)
09:40:20 [2021-11-16T14:40:20.082Z] 	at jdk.internal.reflect.GeneratedMethodAccessor25.invoke(Unknown Source)
09:40:20 [2021-11-16T14:40:20.082Z] 	at java.base/jdk.internal.reflect.DelegatingMethodAccessorImpl.invoke(DelegatingMethodAccessorImpl.java:43)
09:40:20 [2021-11-16T14:40:20.082Z] 	at java.base/java.lang.reflect.Method.invoke(Method.java:564)
09:40:20 [2021-11-16T14:40:20.082Z] 
09:40:20 [2021-11-16T14:40:20.082Z] org.eclipse.ease.ScriptEngineCancellationException: org.eclipse.ease.ScriptEngineCancellationException: Terminated on user request
09:40:20 [2021-11-16T14:40:20.339Z] Traceback (most recent call last):
09:40:20 [2021-11-16T14:40:20.339Z]   File "(none)", line 184, in run
09:40:20 [2021-11-16T14:40:20.339Z]   File "__ref_L/Debug Test/Main.py_bsuobzkqxe", line 1, in <module>
09:40:20 [2021-11-16T14:40:20.339Z]   File "(none)", line 161, in trace_dispatch
09:40:20 [2021-11-16T14:40:20.339Z] 	at org.eclipse.ease.debugging.AbstractEaseDebugger.handleEventsInSuspendedState(AbstractEaseDebugger.java:331)
09:40:20 [2021-11-16T14:40:20.339Z] 	at org.eclipse.ease.debugging.AbstractEaseDebugger.suspend(AbstractEaseDebugger.java:257)
09:40:20 [2021-11-16T14:40:20.339Z] 	at org.eclipse.ease.debugging.AbstractEaseDebugger.processLine(AbstractEaseDebugger.java:492)
09:40:20 [2021-11-16T14:40:20.339Z] 	at org.eclipse.ease.lang.python.debugger.PythonDebugger.traceDispatch(PythonDebugger.java:179)
09:40:20 [2021-11-16T14:40:20.339Z] 	at org.eclipse.ease.lang.python.jython.debugger.JythonDebugger.traceDispatch(JythonDebugger.java:46)
09:40:20 [2021-11-16T14:40:20.339Z] 	at jdk.internal.reflect.GeneratedMethodAccessor25.invoke(Unknown Source)
09:40:20 [2021-11-16T14:40:20.339Z] 	at java.base/jdk.internal.reflect.DelegatingMethodAccessorImpl.invoke(DelegatingMethodAccessorImpl.java:43)
09:40:20 [2021-11-16T14:40:20.339Z] 	at java.base/java.lang.reflect.Method.invoke(Method.java:564)
09:40:20 [2021-11-16T14:40:20.339Z] 
09:40:20 [2021-11-16T14:40:20.339Z] org.eclipse.ease.ScriptEngineCancellationException: org.eclipse.ease.ScriptEngineCancellationException: Terminated on user request
09:40:20 [2021-11-16T14:40:20.595Z] Start of script
09:40:20 [2021-11-16T14:40:20.595Z] include file start
09:40:20 [2021-11-16T14:40:20.595Z] include file processed
09:40:20 [2021-11-16T14:40:20.595Z] Result of testMethod = 5
09:40:20 [2021-11-16T14:40:20.595Z] End of script
09:40:20 [2021-11-16T14:40:20.853Z] Start of script
09:40:20 [2021-11-16T14:40:20.853Z] include file start
09:40:20 [2021-11-16T14:40:20.853Z] include file processed
09:40:20 [2021-11-16T14:40:20.853Z] Result of testMethod = 5
09:40:20 [2021-11-16T14:40:20.853Z] End of script
09:40:21 [2021-11-16T14:40:21.111Z] Start of script
09:40:21 [2021-11-16T14:40:21.111Z] include file start
09:40:21 [2021-11-16T14:40:21.111Z] include file processed
09:40:21 [2021-11-16T14:40:21.111Z] Result of testMethod = 5
09:40:21 [2021-11-16T14:40:21.111Z] End of script
09:40:21 [2021-11-16T14:40:21.367Z] Tests run: 41, Failures: 0, Errors: 0, Skipped: 0, Time elapsed: 13.357 s - in org.eclipse.ease.lang.python.jython.debugger.JythonDebugTest
09:40:21 [2021-11-16T14:40:21.367Z] disconnectProcessInSuspendedState  Time elapsed: 2.161 s
09:40:21 [2021-11-16T14:40:21.367Z] stepReturnIncludeCommand  Time elapsed: 0.319 s
09:40:21 [2021-11-16T14:40:21.367Z] arrayVariableSorting  Time elapsed: 0.409 s
09:40:21 [2021-11-16T14:40:21.367Z] stepOverOnDebugTarget  Time elapsed: 0.41 s
09:40:21 [2021-11-16T14:40:21.367Z] disconnectThreadInSuspendedState  Time elapsed: 0.209 s
09:40:21 [2021-11-16T14:40:21.367Z] stepReturnOnDebugTarget  Time elapsed: 0.308 s
09:40:21 [2021-11-16T14:40:21.367Z] nullVariable  Time elapsed: 0.407 s
09:40:21 [2021-11-16T14:40:21.367Z] stepOverOnStackFrame  Time elapsed: 0.306 s
09:40:21 [2021-11-16T14:40:21.367Z] resumeOnDebugTarget  Time elapsed: 0.206 s
09:40:21 [2021-11-16T14:40:21.367Z] modifyVariableKeepingType  Time elapsed: 0.507 s
09:40:21 [2021-11-16T14:40:21.367Z] resumeOnLastIncludeLine  Time elapsed: 0.209 s
09:40:21 [2021-11-16T14:40:21.367Z] stepReturnOnStackFrame  Time elapsed: 0.307 s
09:40:21 [2021-11-16T14:40:21.367Z] terminateStackFrameInSuspendedState  Time elapsed: 0.206 s
09:40:21 [2021-11-16T14:40:21.367Z] breakpointLocation  Time elapsed: 0.207 s
09:40:21 [2021-11-16T14:40:21.367Z] stepReturnOnThread  Time elapsed: 0.307 s
09:40:21 [2021-11-16T14:40:21.367Z] javaClassVariable  Time elapsed: 0.408 s
09:40:21 [2021-11-16T14:40:21.367Z] stepIntoOnThread  Time elapsed: 0.308 s
09:40:21 [2021-11-16T14:40:21.367Z] terminateThreadInSuspendedState  Time elapsed: 0.206 s
09:40:21 [2021-11-16T14:40:21.367Z] resumeOnThread  Time elapsed: 0.206 s
09:40:21 [2021-11-16T14:40:21.367Z] stepIntoOnStackFrame  Time elapsed: 0.306 s
09:40:21 [2021-11-16T14:40:21.367Z] terminateProcessInSuspendedState  Time elapsed: 0.205 s
09:40:21 [2021-11-16T14:40:21.367Z] stepOverOnProcess  Time elapsed: 0.305 s
09:40:21 [2021-11-16T14:40:21.367Z] nativeArrayVariable  Time elapsed: 0.305 s
09:40:21 [2021-11-16T14:40:21.367Z] disconnectDebugTargetInSuspendedState  Time elapsed: 0.205 s
09:40:21 [2021-11-16T14:40:21.367Z] stepIntoOnProcess  Time elapsed: 0.306 s
09:40:21 [2021-11-16T14:40:21.367Z] terminatedState  Time elapsed: 0.104 s
09:40:21 [2021-11-16T14:40:21.367Z] stepOverIncludeCommand  Time elapsed: 0.305 s
09:40:21 [2021-11-16T14:40:21.368Z] innerScopeVariableBeforeOuterScopeVariable  Time elapsed: 0.306 s
09:40:21 [2021-11-16T14:40:21.368Z] stepIntoIncludeCommand  Time elapsed: 0.306 s
09:40:21 [2021-11-16T14:40:21.368Z] primitiveStringVariable  Time elapsed: 0.306 s
09:40:21 [2021-11-16T14:40:21.368Z] resumeOnProcess  Time elapsed: 0.206 s
09:40:21 [2021-11-16T14:40:21.368Z] stepIntoOnDebugTarget  Time elapsed: 0.306 s
09:40:21 [2021-11-16T14:40:21.368Z] stepOverOnThread  Time elapsed: 0.305 s
09:40:21 [2021-11-16T14:40:21.368Z] suspendedState  Time elapsed: 0.204 s
09:40:21 [2021-11-16T14:40:21.368Z] primitiveDoubleVariable  Time elapsed: 0.304 s
09:40:21 [2021-11-16T14:40:21.368Z] resumeOnStackFrame  Time elapsed: 0.204 s
09:40:21 [2021-11-16T14:40:21.368Z] nativeObjectVariable  Time elapsed: 0.305 s
09:40:21 [2021-11-16T14:40:21.368Z] terminateDebugTargetInSuspendedState  Time elapsed: 0.205 s
09:40:21 [2021-11-16T14:40:21.368Z] disconnectStackFrameInSuspendedState  Time elapsed: 0.205 s
09:40:21 [2021-11-16T14:40:21.368Z] stepReturnOnProcess  Time elapsed: 0.307 s
09:40:21 [2021-11-16T14:40:21.368Z] evaluateWatchExpression  Time elapsed: 0.218 s
09:40:21 [2021-11-16T14:40:21.368Z] 
09:40:21 [2021-11-16T14:40:21.368Z] Results:
09:40:21 [2021-11-16T14:40:21.368Z] 
09:40:21 [2021-11-16T14:40:21.368Z] Tests run: 41, Failures: 0, Errors: 0, Skipped: 0
09:40:21 [2021-11-16T14:40:21.368Z] 
09:40:21 [2021-11-16T14:40:21.639Z] [INFO] All tests passed!
09:40:21 [2021-11-16T14:40:21.639Z] [INFO] 
09:40:21 [2021-11-16T14:40:21.639Z] [INFO] -----< org.eclipse.ease:org.eclipse.ease.lang.scriptarchive.test >------
09:40:21 [2021-11-16T14:40:21.639Z] [INFO] Building org.eclipse.ease.lang.scriptarchive.test 0.9.0-SNAPSHOT   [8/9]
09:40:21 [2021-11-16T14:40:21.639Z] [INFO] ------------------------[ eclipse-test-plugin ]-------------------------
09:40:21 [2021-11-16T14:40:21.639Z] [INFO] 
09:40:21 [2021-11-16T14:40:21.639Z] [INFO] --- tycho-packaging-plugin:2.2.0:build-qualifier (default-build-qualifier) @ org.eclipse.ease.lang.scriptarchive.test ---
09:40:21 [2021-11-16T14:40:21.639Z] [INFO] The project's OSGi version is 0.9.0.I202106220815
09:40:21 [2021-11-16T14:40:21.639Z] [INFO] 
09:40:21 [2021-11-16T14:40:21.639Z] [INFO] --- tycho-packaging-plugin:2.2.0:validate-id (default-validate-id) @ org.eclipse.ease.lang.scriptarchive.test ---
09:40:21 [2021-11-16T14:40:21.639Z] [INFO] 
09:40:21 [2021-11-16T14:40:21.639Z] [INFO] --- tycho-packaging-plugin:2.2.0:validate-version (default-validate-version) @ org.eclipse.ease.lang.scriptarchive.test ---
09:40:21 [2021-11-16T14:40:21.639Z] [INFO] 
09:40:21 [2021-11-16T14:40:21.639Z] [INFO] --- maven-resources-plugin:2.4.3:resources (default-resources) @ org.eclipse.ease.lang.scriptarchive.test ---
09:40:21 [2021-11-16T14:40:21.639Z] [INFO] Using 'UTF-8' encoding to copy filtered resources.
09:40:21 [2021-11-16T14:40:21.639Z] [INFO] skip non existing resourceDirectory /home/jenkins/agent/workspace/ease.verify.core.target.2019-06/tests/org.eclipse.ease.lang.scriptarchive.test/src/main/resources
09:40:21 [2021-11-16T14:40:21.639Z] [INFO] 
09:40:21 [2021-11-16T14:40:21.639Z] [INFO] --- tycho-compiler-plugin:2.2.0:compile (default-compile) @ org.eclipse.ease.lang.scriptarchive.test ---
09:40:21 [2021-11-16T14:40:21.639Z] [INFO] Nothing to compile - all classes are up to date
09:40:21 [2021-11-16T14:40:21.639Z] [INFO] 
09:40:21 [2021-11-16T14:40:21.639Z] [INFO] --- maven-resources-plugin:2.4.3:testResources (default-testResources) @ org.eclipse.ease.lang.scriptarchive.test ---
09:40:21 [2021-11-16T14:40:21.639Z] [INFO] Using 'UTF-8' encoding to copy filtered resources.
09:40:21 [2021-11-16T14:40:21.639Z] [INFO] skip non existing resourceDirectory /home/jenkins/agent/workspace/ease.verify.core.target.2019-06/tests/org.eclipse.ease.lang.scriptarchive.test/src/test/resources
09:40:21 [2021-11-16T14:40:21.640Z] [INFO] 
09:40:21 [2021-11-16T14:40:21.640Z] [INFO] --- target-platform-configuration:2.2.0:target-platform (default-target-platform) @ org.eclipse.ease.lang.scriptarchive.test ---
09:40:21 [2021-11-16T14:40:21.640Z] [INFO] 
09:40:21 [2021-11-16T14:40:21.640Z] [INFO] --- tycho-packaging-plugin:2.2.0:package-plugin (default-package-plugin) @ org.eclipse.ease.lang.scriptarchive.test ---
09:40:21 [2021-11-16T14:40:21.640Z] [INFO] Building jar: /home/jenkins/agent/workspace/ease.verify.core.target.2019-06/tests/org.eclipse.ease.lang.scriptarchive.test/target/org.eclipse.ease.lang.scriptarchive.test-0.9.0-SNAPSHOT.jar
09:40:21 [2021-11-16T14:40:21.640Z] [INFO] 
09:40:21 [2021-11-16T14:40:21.640Z] [INFO] --- tycho-p2-plugin:2.2.0:p2-metadata-default (default-p2-metadata-default) @ org.eclipse.ease.lang.scriptarchive.test ---
09:40:21 [2021-11-16T14:40:21.640Z] [INFO] 
09:40:21 [2021-11-16T14:40:21.640Z] [INFO] --- jacoco-maven-plugin:0.8.6:prepare-agent (jacoco-initialize) @ org.eclipse.ease.lang.scriptarchive.test ---
09:40:21 [2021-11-16T14:40:21.640Z] [INFO] tycho.testArgLine set to -javaagent:/home/jenkins/.m2/repository/org/jacoco/org.jacoco.agent/0.8.6/org.jacoco.agent-0.8.6-runtime.jar=destfile=/home/jenkins/agent/workspace/ease.verify.core.target.2019-06/tests/org.eclipse.ease.lang.scriptarchive.test/target/jacoco.exec,output=file
09:40:21 [2021-11-16T14:40:21.640Z] [INFO] 
09:40:21 [2021-11-16T14:40:21.640Z] [INFO] --- tycho-surefire-plugin:2.2.0:test (default-test) @ org.eclipse.ease.lang.scriptarchive.test ---
09:40:21 [2021-11-16T14:40:21.640Z] [INFO] Executing Test Runtime with timeout 0, logs (if any) will be placed at: /home/jenkins/agent/workspace/ease.verify.core.target.2019-06/tests/org.eclipse.ease.lang.scriptarchive.test/target/work/data/.metadata/.log
09:40:21 [2021-11-16T14:40:21.640Z] [INFO] Command line:
09:40:21 [2021-11-16T14:40:21.640Z] 	[/opt/tools/java/openjdk/jdk-15/15.0.2+7/bin/java, -Dosgi.noShutdown=false, -Dosgi.os=linux, -Dosgi.ws=gtk, -Dosgi.arch=x86_64, -javaagent:/home/jenkins/.m2/repository/org/jacoco/org.jacoco.agent/0.8.6/org.jacoco.agent-0.8.6-runtime.jar=destfile=/home/jenkins/agent/workspace/ease.verify.core.target.2019-06/tests/org.eclipse.ease.lang.scriptarchive.test/target/jacoco.exec,output=file, -Dosgi.clean=true, -jar, /home/jenkins/.m2/repository/p2/osgi/bundle/org.eclipse.equinox.launcher/1.5.400.v20190515-0925/org.eclipse.equinox.launcher-1.5.400.v20190515-0925.jar, -data, /home/jenkins/agent/workspace/ease.verify.core.target.2019-06/tests/org.eclipse.ease.lang.scriptarchive.test/target/work/data, -install, /home/jenkins/agent/workspace/ease.verify.core.target.2019-06/tests/org.eclipse.ease.lang.scriptarchive.test/target/work, -configuration, /home/jenkins/agent/workspace/ease.verify.core.target.2019-06/tests/org.eclipse.ease.lang.scriptarchive.test/target/work/configuration, -application, org.eclipse.tycho.surefire.osgibooter.headlesstest, -testproperties, /home/jenkins/agent/workspace/ease.verify.core.target.2019-06/tests/org.eclipse.ease.lang.scriptarchive.test/target/surefire.properties]
09:40:21 [2021-11-16T14:40:21.640Z] Picked up JAVA_TOOL_OPTIONS: -Dmaven.ext.class.path="/home/jenkins/agent/workspace/ease.verify.core.target.2019-06@tmp/withMaven8b085881/pipeline-maven-spy.jar" -Dorg.jenkinsci.plugins.pipeline.maven.reportsFolder="/home/jenkins/agent/workspace/ease.verify.core.target.2019-06@tmp/withMaven8b085881" 
09:40:24 [2021-11-16T14:40:24.942Z] Running org.eclipse.ease.lang.scriptarchive.ArchiveEngineTest
09:40:24 [2021-11-16T14:40:24.942Z] We are running from a zip file!
09:40:24 [2021-11-16T14:40:24.942Z] org.eclipse.ease.ScriptExecutionException: SyntaxError: missing ; before statement (workspace://__EASE_ScriptArchive_1/scripts/Master.js#3)
09:40:24 [2021-11-16T14:40:24.942Z] this is an error
09:40:24 [2021-11-16T14:40:24.942Z]        ^
09:40:24 [2021-11-16T14:40:24.942Z] 	at Master.js,workspace://__EASE_ScriptArchive_1/scripts/Master.js
09:40:24 [2021-11-16T14:40:24.942Z] org.eclipse.ease.ScriptExecutionException: SyntaxError: missing ; before statement (workspace://__EASE_ScriptArchive_1/scripts/Master.js#3)
09:40:24 [2021-11-16T14:40:24.942Z] this is an error
09:40:24 [2021-11-16T14:40:24.942Z]        ^
09:40:24 [2021-11-16T14:40:24.942Z] 	at Master.js,workspace://__EASE_ScriptArchive_1/scripts/Master.js
09:40:25 [2021-11-16T14:40:25.201Z] Tests run: 7, Failures: 0, Errors: 0, Skipped: 0, Time elapsed: 0.747 s - in org.eclipse.ease.lang.scriptarchive.ArchiveEngineTest
09:40:25 [2021-11-16T14:40:25.201Z] executeWithManifest  Time elapsed: 0.574 s
09:40:25 [2021-11-16T14:40:25.201Z] zipFileRegistration  Time elapsed: 0.01 s
09:40:25 [2021-11-16T14:40:25.201Z] engineIdRegistration  Time elapsed: 0.001 s
09:40:25 [2021-11-16T14:40:25.201Z] jarFileRegistration  Time elapsed: 0.001 s
09:40:25 [2021-11-16T14:40:25.201Z] sarFileRegistration  Time elapsed: 0.001 s
09:40:25 [2021-11-16T14:40:25.201Z] executeWithErrors  Time elapsed: 0.073 s
09:40:25 [2021-11-16T14:40:25.201Z] executeWithIncludes  Time elapsed: 0.073 s
09:40:25 [2021-11-16T14:40:25.201Z] 
09:40:25 [2021-11-16T14:40:25.201Z] Results:
09:40:25 [2021-11-16T14:40:25.201Z] 
09:40:25 [2021-11-16T14:40:25.201Z] Tests run: 7, Failures: 0, Errors: 0, Skipped: 0
09:40:25 [2021-11-16T14:40:25.201Z] 
09:40:25 [2021-11-16T14:40:25.201Z] [INFO] All tests passed!
09:40:25 [2021-11-16T14:40:25.201Z] [INFO] 
09:40:25 [2021-11-16T14:40:25.201Z] [INFO] -------------< org.eclipse.ease:org.eclipse.ease.ui.test >--------------
09:40:25 [2021-11-16T14:40:25.201Z] [INFO] Building org.eclipse.ease.ui.test 0.9.0-SNAPSHOT                   [9/9]
09:40:25 [2021-11-16T14:40:25.201Z] [INFO] ------------------------[ eclipse-test-plugin ]-------------------------
09:40:25 [2021-11-16T14:40:25.201Z] [INFO] 
09:40:25 [2021-11-16T14:40:25.201Z] [INFO] --- tycho-packaging-plugin:2.2.0:build-qualifier (default-build-qualifier) @ org.eclipse.ease.ui.test ---
09:40:25 [2021-11-16T14:40:25.201Z] [INFO] The project's OSGi version is 0.9.0.I202110141644
09:40:25 [2021-11-16T14:40:25.201Z] [INFO] 
09:40:25 [2021-11-16T14:40:25.201Z] [INFO] --- tycho-packaging-plugin:2.2.0:validate-id (default-validate-id) @ org.eclipse.ease.ui.test ---
09:40:25 [2021-11-16T14:40:25.201Z] [INFO] 
09:40:25 [2021-11-16T14:40:25.201Z] [INFO] --- tycho-packaging-plugin:2.2.0:validate-version (default-validate-version) @ org.eclipse.ease.ui.test ---
09:40:25 [2021-11-16T14:40:25.201Z] [INFO] 
09:40:25 [2021-11-16T14:40:25.201Z] [INFO] --- maven-resources-plugin:2.4.3:resources (default-resources) @ org.eclipse.ease.ui.test ---
09:40:25 [2021-11-16T14:40:25.201Z] [INFO] Using 'UTF-8' encoding to copy filtered resources.
09:40:25 [2021-11-16T14:40:25.201Z] [INFO] skip non existing resourceDirectory /home/jenkins/agent/workspace/ease.verify.core.target.2019-06/tests/org.eclipse.ease.ui.test/src/main/resources
09:40:25 [2021-11-16T14:40:25.201Z] [INFO] 
09:40:25 [2021-11-16T14:40:25.202Z] [INFO] --- tycho-compiler-plugin:2.2.0:compile (default-compile) @ org.eclipse.ease.ui.test ---
09:40:25 [2021-11-16T14:40:25.202Z] [INFO] Nothing to compile - all classes are up to date
09:40:25 [2021-11-16T14:40:25.202Z] [INFO] 
09:40:25 [2021-11-16T14:40:25.202Z] [INFO] --- maven-resources-plugin:2.4.3:testResources (default-testResources) @ org.eclipse.ease.ui.test ---
09:40:25 [2021-11-16T14:40:25.202Z] [INFO] Using 'UTF-8' encoding to copy filtered resources.
09:40:25 [2021-11-16T14:40:25.202Z] [INFO] skip non existing resourceDirectory /home/jenkins/agent/workspace/ease.verify.core.target.2019-06/tests/org.eclipse.ease.ui.test/src/test/resources
09:40:25 [2021-11-16T14:40:25.202Z] [INFO] 
09:40:25 [2021-11-16T14:40:25.202Z] [INFO] --- target-platform-configuration:2.2.0:target-platform (default-target-platform) @ org.eclipse.ease.ui.test ---
09:40:25 [2021-11-16T14:40:25.202Z] [INFO] 
09:40:25 [2021-11-16T14:40:25.202Z] [INFO] --- tycho-packaging-plugin:2.2.0:package-plugin (default-package-plugin) @ org.eclipse.ease.ui.test ---
09:40:25 [2021-11-16T14:40:25.465Z] [INFO] Building jar: /home/jenkins/agent/workspace/ease.verify.core.target.2019-06/tests/org.eclipse.ease.ui.test/target/org.eclipse.ease.ui.test-0.9.0-SNAPSHOT.jar
09:40:25 [2021-11-16T14:40:25.465Z] [INFO] 
09:40:25 [2021-11-16T14:40:25.465Z] [INFO] --- tycho-p2-plugin:2.2.0:p2-metadata-default (default-p2-metadata-default) @ org.eclipse.ease.ui.test ---
09:40:25 [2021-11-16T14:40:25.465Z] [INFO] 
09:40:25 [2021-11-16T14:40:25.465Z] [INFO] --- jacoco-maven-plugin:0.8.6:prepare-agent (jacoco-initialize) @ org.eclipse.ease.ui.test ---
09:40:25 [2021-11-16T14:40:25.465Z] [INFO] tycho.testArgLine set to -javaagent:/home/jenkins/.m2/repository/org/jacoco/org.jacoco.agent/0.8.6/org.jacoco.agent-0.8.6-runtime.jar=destfile=/home/jenkins/agent/workspace/ease.verify.core.target.2019-06/tests/org.eclipse.ease.ui.test/target/jacoco.exec,output=file
09:40:25 [2021-11-16T14:40:25.466Z] [INFO] 
09:40:25 [2021-11-16T14:40:25.466Z] [INFO] --- tycho-surefire-plugin:2.2.0:test (default-test) @ org.eclipse.ease.ui.test ---
09:40:25 [2021-11-16T14:40:25.466Z] [INFO] Executing Test Runtime with timeout 0, logs (if any) will be placed at: /home/jenkins/agent/workspace/ease.verify.core.target.2019-06/tests/org.eclipse.ease.ui.test/target/work/data/.metadata/.log
09:40:25 [2021-11-16T14:40:25.466Z] [INFO] Command line:
09:40:25 [2021-11-16T14:40:25.466Z] 	[/opt/tools/java/openjdk/jdk-15/15.0.2+7/bin/java, -Dosgi.noShutdown=false, -Dosgi.os=linux, -Dosgi.ws=gtk, -Dosgi.arch=x86_64, -javaagent:/home/jenkins/.m2/repository/org/jacoco/org.jacoco.agent/0.8.6/org.jacoco.agent-0.8.6-runtime.jar=destfile=/home/jenkins/agent/workspace/ease.verify.core.target.2019-06/tests/org.eclipse.ease.ui.test/target/jacoco.exec,output=file, -Dosgi.clean=true, -jar, /home/jenkins/.m2/repository/p2/osgi/bundle/org.eclipse.equinox.launcher/1.5.400.v20190515-0925/org.eclipse.equinox.launcher-1.5.400.v20190515-0925.jar, -data, /home/jenkins/agent/workspace/ease.verify.core.target.2019-06/tests/org.eclipse.ease.ui.test/target/work/data, -install, /home/jenkins/agent/workspace/ease.verify.core.target.2019-06/tests/org.eclipse.ease.ui.test/target/work, -configuration, /home/jenkins/agent/workspace/ease.verify.core.target.2019-06/tests/org.eclipse.ease.ui.test/target/work/configuration, -application, org.eclipse.tycho.surefire.osgibooter.headlesstest, -testproperties, /home/jenkins/agent/workspace/ease.verify.core.target.2019-06/tests/org.eclipse.ease.ui.test/target/surefire.properties]
09:40:25 [2021-11-16T14:40:25.466Z] Picked up JAVA_TOOL_OPTIONS: -Dmaven.ext.class.path="/home/jenkins/agent/workspace/ease.verify.core.target.2019-06@tmp/withMaven8b085881/pipeline-maven-spy.jar" -Dorg.jenkinsci.plugins.pipeline.maven.reportsFolder="/home/jenkins/agent/workspace/ease.verify.core.target.2019-06@tmp/withMaven8b085881" 
09:40:28 [2021-11-16T14:40:28.786Z] Running org.eclipse.ease.ui.completion.BasicContextTest
09:40:29 [2021-11-16T14:40:29.349Z] Tests run: 12, Failures: 0, Errors: 0, Skipped: 0, Time elapsed: 0.697 s - in org.eclipse.ease.ui.completion.BasicContextTest
09:40:29 [2021-11-16T14:40:29.349Z] isValid_equals_true  Time elapsed: 0.033 s
09:40:29 [2021-11-16T14:40:29.349Z] getScriptEngine_returns_engine  Time elapsed: 0.641 s
09:40:29 [2021-11-16T14:40:29.349Z] getFilter_removes_string_literal_start  Time elapsed: 0.003 s
09:40:29 [2021-11-16T14:40:29.349Z] getLoadedModules_detects_modules_from_ScriptEngine  Time elapsed: 0.002 s
09:40:29 [2021-11-16T14:40:29.349Z] getFilter_contains_parameter_prefix  Time elapsed: 0 s
09:40:29 [2021-11-16T14:40:29.349Z] getLoadedModules_contains_environment_on_resource  Time elapsed: 0 s
09:40:29 [2021-11-16T14:40:29.349Z] getLoadedModules_does_not_contain_environment_twice_on_resource  Time elapsed: 0.001 s
09:40:29 [2021-11-16T14:40:29.349Z] getFilter_is_empty  Time elapsed: 0.001 s
09:40:29 [2021-11-16T14:40:29.349Z] getFilter_keeps_spaces_in_string_literal  Time elapsed: 0.001 s
09:40:29 [2021-11-16T14:40:29.349Z] getLoadedModules_detects_loadModule_commands  Time elapsed: 0.001 s
09:40:29 [2021-11-16T14:40:29.349Z] getFilter_is_empty_for_empty_input  Time elapsed: 0 s
09:40:29 [2021-11-16T14:40:29.349Z] isInvalid_equals_true  Time elapsed: 0.001 s
09:40:29 [2021-11-16T14:40:29.349Z] Running org.eclipse.ease.ui.completion.provider.AbstractCompletionProviderTest
09:40:29 [2021-11-16T14:40:29.349Z] Tests run: 16, Failures: 0, Errors: 0, Skipped: 0, Time elapsed: 0.094 s - in org.eclipse.ease.ui.completion.provider.AbstractCompletionProviderTest
09:40:29 [2021-11-16T14:40:29.349Z] isStringParameter_equals_true{String}[1]  Time elapsed: 0.014 s
09:40:29 [2021-11-16T14:40:29.349Z] isStringParameter_equals_true{String}[2]  Time elapsed: 0.001 s
09:40:29 [2021-11-16T14:40:29.349Z] isStringParameter_equals_true{String}[3]  Time elapsed: 0.001 s
09:40:29 [2021-11-16T14:40:29.349Z] isStringParameter_equals_true{String}[4]  Time elapsed: 0.018 s
09:40:29 [2021-11-16T14:40:29.349Z] isMethodParameter_equals_true  Time elapsed: 0.001 s
09:40:29 [2021-11-16T14:40:29.349Z] isMethodParameter_equals_true_for_2nd_parameter  Time elapsed: 0.001 s
09:40:29 [2021-11-16T14:40:29.349Z] isValid_equals_false_for_invalid_context  Time elapsed: 0.018 s
09:40:29 [2021-11-16T14:40:29.349Z] isStringParameter_equals_false{String}[1]  Time elapsed: 0.001 s
09:40:29 [2021-11-16T14:40:29.349Z] isStringParameter_equals_false{String}[2]  Time elapsed: 0 s
09:40:29 [2021-11-16T14:40:29.349Z] isStringParameter_equals_false{String}[3]  Time elapsed: 0.001 s
09:40:29 [2021-11-16T14:40:29.349Z] isStringParameter_equals_false{String}[4]  Time elapsed: 0 s
09:40:29 [2021-11-16T14:40:29.349Z] isStringParameter_equals_false{String}[5]  Time elapsed: 0.001 s
09:40:29 [2021-11-16T14:40:29.349Z] isMethodParameter_equals_false_when_no_method_is_detected  Time elapsed: 0.001 s
09:40:29 [2021-11-16T14:40:29.349Z] isValid_equals_true_for_valid_context  Time elapsed: 0 s
09:40:29 [2021-11-16T14:40:29.349Z] isMethodParameter_equals_false_for_wrong_method_name  Time elapsed: 0.001 s
09:40:29 [2021-11-16T14:40:29.349Z] isMethodParameter_equals_false_for_wrong_parameter_index  Time elapsed: 0.001 s
09:40:29 [2021-11-16T14:40:29.349Z] Running org.eclipse.ease.ui.completion.provider.VariablesCompletionProviderTest
09:40:29 [2021-11-16T14:40:29.349Z] Tests run: 18, Failures: 0, Errors: 0, Skipped: 0, Time elapsed: 0.077 s - in org.eclipse.ease.ui.completion.provider.VariablesCompletionProviderTest
09:40:29 [2021-11-16T14:40:29.349Z] prepareProposals_instance_contains_integer_variable  Time elapsed: 0.029 s
09:40:29 [2021-11-16T14:40:29.349Z] prepareProposals_instance_contains_string_variable  Time elapsed: 0.001 s
09:40:29 [2021-11-16T14:40:29.349Z] prepareProposals_instance_contains_string_variable_for_filter_input_case_insensitive  Time elapsed: 0.001 s
09:40:29 [2021-11-16T14:40:29.349Z] prepareProposals_instance_contains_string_variable_for_filter_input  Time elapsed: 0.001 s
09:40:29 [2021-11-16T14:40:29.349Z] prepareProposals_does_not_contain_internal_variable  Time elapsed: 0.002 s
09:40:29 [2021-11-16T14:40:29.349Z] isActive_equals_false{String}[1]  Time elapsed: 0.001 s
09:40:29 [2021-11-16T14:40:29.349Z] isActive_equals_false{String}[2]  Time elapsed: 0.001 s
09:40:29 [2021-11-16T14:40:29.349Z] isActive_equals_false{String}[3]  Time elapsed: 0 s
09:40:29 [2021-11-16T14:40:29.349Z] isActive_equals_false{String}[4]  Time elapsed: 0.001 s
09:40:29 [2021-11-16T14:40:29.349Z] isActive_equals_false{String}[5]  Time elapsed: 0.001 s
09:40:29 [2021-11-16T14:40:29.349Z] isActive_equals_true{String}[1]  Time elapsed: 0 s
09:40:29 [2021-11-16T14:40:29.349Z] isActive_equals_true{String}[2]  Time elapsed: 0.001 s
09:40:29 [2021-11-16T14:40:29.349Z] isActive_equals_true{String}[3]  Time elapsed: 0.001 s
09:40:29 [2021-11-16T14:40:29.349Z] isActive_equals_true{String}[4]  Time elapsed: 0.001 s
09:40:29 [2021-11-16T14:40:29.349Z] isActive_equals_true{String}[5]  Time elapsed: 0.001 s
09:40:29 [2021-11-16T14:40:29.349Z] isActive_equals_true{String}[6]  Time elapsed: 0.001 s
09:40:29 [2021-11-16T14:40:29.349Z] isActive_equals_true{String}[7]  Time elapsed: 0.001 s
09:40:29 [2021-11-16T14:40:29.349Z] isActive_equals_true{String}[8]  Time elapsed: 0.001 s
09:40:29 [2021-11-16T14:40:29.349Z] Running org.eclipse.ease.ui.completion.provider.LoadModuleCompletionProviderTest
09:40:29 [2021-11-16T14:40:29.349Z] Tests run: 12, Failures: 0, Errors: 0, Skipped: 0, Time elapsed: 0.02 s - in org.eclipse.ease.ui.completion.provider.LoadModuleCompletionProviderTest
09:40:29 [2021-11-16T14:40:29.349Z] getProposals_contains_root_entry_with_absolute_filter  Time elapsed: 0.005 s
09:40:29 [2021-11-16T14:40:29.349Z] getProposals_contains_root_entry_with_relative_filter  Time elapsed: 0.001 s
09:40:29 [2021-11-16T14:40:29.349Z] getProposals_contains_category_with_relative_filter  Time elapsed: 0.001 s
09:40:29 [2021-11-16T14:40:29.349Z] getProposals_does_not_contain_root_entry_on_filter_mismatch  Time elapsed: 0.001 s
09:40:29 [2021-11-16T14:40:29.349Z] isActive_equals_false{String}[1]  Time elapsed: 0.001 s
09:40:29 [2021-11-16T14:40:29.349Z] isActive_equals_false{String}[2]  Time elapsed: 0.001 s
09:40:29 [2021-11-16T14:40:29.349Z] isActive_equals_false{String}[3]  Time elapsed: 0.001 s
09:40:29 [2021-11-16T14:40:29.349Z] getProposals_contains_root_entry  Time elapsed: 0.001 s
09:40:29 [2021-11-16T14:40:29.349Z] isActive_equals_true{String}[1]  Time elapsed: 0.001 s
09:40:29 [2021-11-16T14:40:29.349Z] isActive_equals_true{String}[2]  Time elapsed: 0.001 s
09:40:29 [2021-11-16T14:40:29.349Z] getProposals_contains_child_entry_with_absolute_filter  Time elapsed: 0.001 s
09:40:29 [2021-11-16T14:40:29.349Z] getProposals_does_not_contain_entry_on_completed_input  Time elapsed: 0 s
09:40:29 [2021-11-16T14:40:29.349Z] Running org.eclipse.ease.ui.completion.provider.AbstractPathCompletionProviderTest
09:40:29 [2021-11-16T14:40:29.350Z] Tests run: 11, Failures: 0, Errors: 0, Skipped: 0, Time elapsed: 0.005 s - in org.eclipse.ease.ui.completion.provider.AbstractPathCompletionProviderTest
09:40:29 [2021-11-16T14:40:29.350Z] filter_keeps_only_lower_level_on_matching_filter  Time elapsed: 0.001 s
09:40:29 [2021-11-16T14:40:29.350Z] filter_removes_nothing_if_context_is_empty  Time elapsed: 0 s
09:40:29 [2021-11-16T14:40:29.350Z] getPathsFromElements_is_empty_for_root_elements_only  Time elapsed: 0.001 s
09:40:29 [2021-11-16T14:40:29.350Z] filter_keeps_only_1st_level_on_empty_filter  Time elapsed: 0 s
09:40:29 [2021-11-16T14:40:29.350Z] filter_keeps_only_1st_level_on_matching_filter  Time elapsed: 0 s
09:40:29 [2021-11-16T14:40:29.350Z] getPathsFromElements_is_empty_for_empty_element  Time elapsed: 0 s
09:40:29 [2021-11-16T14:40:29.350Z] filter_removes_mismatches_on_same_level  Time elapsed: 0 s
09:40:29 [2021-11-16T14:40:29.350Z] filter_matches_next_level  Time elapsed: 0.001 s
09:40:29 [2021-11-16T14:40:29.350Z] filter_matches_relative_paths  Time elapsed: 0 s
09:40:29 [2021-11-16T14:40:29.350Z] getPathsFromElements_contains_parent_paths  Time elapsed: 0 s
09:40:29 [2021-11-16T14:40:29.350Z] getPathsFromElements_contains_all_hierarchies  Time elapsed: 0 s
09:40:29 [2021-11-16T14:40:29.350Z] Running org.eclipse.ease.ui.completion.provider.LoadedModuleCompletionProviderTest
09:40:29 [2021-11-16T14:40:29.350Z] Tests run: 15, Failures: 0, Errors: 0, Skipped: 0, Time elapsed: 0.054 s - in org.eclipse.ease.ui.completion.provider.LoadedModuleCompletionProviderTest
09:40:29 [2021-11-16T14:40:29.350Z] method_proposal_contains_opening_bracket_when_method_has_mandatory_parameters  Time elapsed: 0.008 s
09:40:29 [2021-11-16T14:40:29.350Z] method_proposal_contains_full_method_call_when_method_has_only_optional_parameters  Time elapsed: 0.002 s
09:40:29 [2021-11-16T14:40:29.350Z] getProposals_contains_constant_methods  Time elapsed: 0.002 s
09:40:29 [2021-11-16T14:40:29.350Z] getProposals_contains_module_methods  Time elapsed: 0.002 s
09:40:29 [2021-11-16T14:40:29.350Z] isActive_equals_false{String}[1]  Time elapsed: 0.001 s
09:40:29 [2021-11-16T14:40:29.350Z] isActive_equals_false{String}[2]  Time elapsed: 0 s
09:40:29 [2021-11-16T14:40:29.350Z] isActive_equals_false{String}[3]  Time elapsed: 0 s
09:40:29 [2021-11-16T14:40:29.350Z] isActive_equals_false{String}[4]  Time elapsed: 0 s
09:40:29 [2021-11-16T14:40:29.350Z] isActive_equals_true{String}[1]  Time elapsed: 0.001 s
09:40:29 [2021-11-16T14:40:29.350Z] isActive_equals_true{String}[2]  Time elapsed: 0 s
09:40:29 [2021-11-16T14:40:29.350Z] isActive_equals_true{String}[3]  Time elapsed: 0 s
09:40:29 [2021-11-16T14:40:29.350Z] isActive_equals_true{String}[4]  Time elapsed: 0 s
09:40:29 [2021-11-16T14:40:29.350Z] isActive_equals_true{String}[5]  Time elapsed: 0 s
09:40:29 [2021-11-16T14:40:29.350Z] isActive_equals_true{String}[6]  Time elapsed: 0 s
09:40:29 [2021-11-16T14:40:29.350Z] method_proposal_contains_full_method_call_when_method_has_no_parameters  Time elapsed: 0.028 s
09:40:29 [2021-11-16T14:40:29.350Z] Running org.eclipse.ease.ui.completion.provider.LocationResolverTest
09:40:29 [2021-11-16T14:40:29.350Z] Tests run: 1, Failures: 0, Errors: 0, Skipped: 0, Time elapsed: 0.003 s - in org.eclipse.ease.ui.completion.provider.LocationResolverTest
09:40:29 [2021-11-16T14:40:29.350Z] getParentString_has_no_trailing_slashes  Time elapsed: 0.003 s
09:40:29 [2021-11-16T14:40:29.350Z] Running org.eclipse.ease.ui.completion.provider.AbstractFileLocationCompletionProviderTest
09:40:29 [2021-11-16T14:40:29.607Z] Tests run: 22, Failures: 0, Errors: 0, Skipped: 0, Time elapsed: 0.121 s - in org.eclipse.ease.ui.completion.provider.AbstractFileLocationCompletionProviderTest
09:40:29 [2021-11-16T14:40:29.607Z] getProposals_does_not_contain_back_proposal_for_project  Time elapsed: 0.093 s
09:40:29 [2021-11-16T14:40:29.607Z] getProposals_does_not_contain_project_root_with_file_resource  Time elapsed: 0 s
09:40:29 [2021-11-16T14:40:29.607Z] getProposals_contains_project_root_files_for_project_root  Time elapsed: 0.001 s
09:40:29 [2021-11-16T14:40:29.607Z] getProposals_contains_files_for_workspace_folder  Time elapsed: 0.001 s
09:40:29 [2021-11-16T14:40:29.607Z] getProposals_contains_back_for_workspace_folder  Time elapsed: 0 s
09:40:29 [2021-11-16T14:40:29.607Z] getProposals_contains_root_file_systems  Time elapsed: 0.001 s
09:40:29 [2021-11-16T14:40:29.607Z] getProposals_contains_files_for_project  Time elapsed: 0.001 s
09:40:29 [2021-11-16T14:40:29.607Z] back_proposal_contains_correct_replacement_string_for_absolute_workspace_folder_link  Time elapsed: 0 s
09:40:29 [2021-11-16T14:40:29.607Z] getProposals_does_not_contain_project_root_without_resource  Time elapsed: 0.001 s
09:40:29 [2021-11-16T14:40:29.607Z] getProposals_contains_project_root_with_workspace_resource  Time elapsed: 0 s
09:40:29 [2021-11-16T14:40:29.607Z] getProposals_contains_back_for_project_folder  Time elapsed: 0.001 s
09:40:29 [2021-11-16T14:40:29.607Z] getProposals_contains_project_root_folders_for_workspace_project_with_back_path  Time elapsed: 0 s
09:40:29 [2021-11-16T14:40:29.607Z] getProposals_contains_projects_for_workspace_root  Time elapsed: 0 s
09:40:29 [2021-11-16T14:40:29.607Z] getProposals_contains_project_root_folders_for_workspace_project  Time elapsed: 0 s
09:40:29 [2021-11-16T14:40:29.607Z] getProposals_contains_filesystem_root  Time elapsed: 0 s
09:40:29 [2021-11-16T14:40:29.607Z] getProposals_contains_files_for_project_folder  Time elapsed: 0 s
09:40:29 [2021-11-16T14:40:29.607Z] getProposals_contains_workspace_root  Time elapsed: 0.001 s
09:40:29 [2021-11-16T14:40:29.607Z] getProposals_does_not_contain_back_proposal  Time elapsed: 0 s
09:40:29 [2021-11-16T14:40:29.607Z] getProposals_contains_files_for_filesystem  Time elapsed: 0.001 s
09:40:29 [2021-11-16T14:40:29.607Z] getProposals_contains_project_root_files_for_workspace_project  Time elapsed: 0 s
09:40:29 [2021-11-16T14:40:29.607Z] getProposals_contains_back_for_filesystem  Time elapsed: 0.001 s
09:40:29 [2021-11-16T14:40:29.607Z] back_proposal_contains_correct_replacement_string_for_relative_workspace_folder_link  Time elapsed: 0 s
09:40:29 [2021-11-16T14:40:29.607Z] Running org.eclipse.ease.ui.completion.CodeCompletionAggregatorTest
09:40:29 [2021-11-16T14:40:29.607Z] Tests run: 4, Failures: 0, Errors: 0, Skipped: 0, Time elapsed: 0.096 s - in org.eclipse.ease.ui.completion.CodeCompletionAggregatorTest
09:40:29 [2021-11-16T14:40:29.607Z] context_for_empty_input  Time elapsed: 0.089 s
09:40:29 [2021-11-16T14:40:29.607Z] context_for_root_package_with_suffix  Time elapsed: 0.003 s
09:40:29 [2021-11-16T14:40:29.607Z] getProposals_contains_proposal_from_local_provider  Time elapsed: 0.003 s
09:40:29 [2021-11-16T14:40:29.607Z] context_for_root_package  Time elapsed: 0.001 s
09:40:29 [2021-11-16T14:40:29.607Z] Running org.eclipse.ease.ui.completion.ScriptCompletionProposalTest
09:40:29 [2021-11-16T14:40:29.607Z] Tests run: 8, Failures: 0, Errors: 0, Skipped: 0, Time elapsed: 0.002 s - in org.eclipse.ease.ui.completion.ScriptCompletionProposalTest
09:40:29 [2021-11-16T14:40:29.607Z] getCursorPosition_equals_end_of_inserted_text  Time elapsed: 0 s
09:40:29 [2021-11-16T14:40:29.607Z] getCursorPosition_equals_end_of_appended_text  Time elapsed: 0 s
09:40:29 [2021-11-16T14:40:29.607Z] compareTo_lists_higher_priority_first  Time elapsed: 0 s
09:40:29 [2021-11-16T14:40:29.607Z] getContent_inserts_replacement_text  Time elapsed: 0 s
09:40:29 [2021-11-16T14:40:29.607Z] getCursorPosition_equals_end_of_set_text  Time elapsed: 0 s
09:40:29 [2021-11-16T14:40:29.607Z] getContent_sets_replacement_text  Time elapsed: 0.001 s
09:40:29 [2021-11-16T14:40:29.607Z] compareTo_lists_same_prio_in_alphabetic_order  Time elapsed: 0 s
09:40:29 [2021-11-16T14:40:29.607Z] getContent_appends_replacement_text  Time elapsed: 0 s
09:40:29 [2021-11-16T14:40:29.607Z] Running org.eclipse.ease.ui.completion.tokenizer.BracketMatcherTest
09:40:29 [2021-11-16T14:40:29.607Z] Tests run: 9, Failures: 0, Errors: 0, Skipped: 0, Time elapsed: 0.002 s - in org.eclipse.ease.ui.completion.tokenizer.BracketMatcherTest
09:40:29 [2021-11-16T14:40:29.607Z] getOpenBrackets_returns_open_brackets_only  Time elapsed: 0 s
09:40:29 [2021-11-16T14:40:29.607Z] getBrackets_detects_1  Time elapsed: 0.001 s
09:40:29 [2021-11-16T14:40:29.607Z] getBrackets_detects_2  Time elapsed: 0 s
09:40:29 [2021-11-16T14:40:29.607Z] getBrackets_detects_3  Time elapsed: 0 s
09:40:29 [2021-11-16T14:40:29.607Z] hasOpenBrackets_equals_true  Time elapsed: 0 s
09:40:29 [2021-11-16T14:40:29.607Z] getBrackets_is_empty  Time elapsed: 0.001 s
09:40:29 [2021-11-16T14:40:29.607Z] hasOpenBrackets_equals_false  Time elapsed: 0 s
09:40:29 [2021-11-16T14:40:29.607Z] getBrackets_detects_open_brackets  Time elapsed: 0 s
09:40:29 [2021-11-16T14:40:29.607Z] getBrackets_detects_nested  Time elapsed: 0 s
09:40:29 [2021-11-16T14:40:29.607Z] Running org.eclipse.ease.ui.completion.tokenizer.TokenListTest
09:40:29 [2021-11-16T14:40:29.607Z] Tests run: 1, Failures: 0, Errors: 0, Skipped: 0, Time elapsed: 0 s - in org.eclipse.ease.ui.completion.tokenizer.TokenListTest
09:40:29 [2021-11-16T14:40:29.607Z] new_TokenList_is_empty  Time elapsed: 0 s
09:40:29 [2021-11-16T14:40:29.607Z] Running org.eclipse.ease.ui.completion.tokenizer.InputTokenizerTest
09:40:29 [2021-11-16T14:40:29.864Z] Tests run: 68, Failures: 0, Errors: 0, Skipped: 0, Time elapsed: 0.032 s - in org.eclipse.ease.ui.completion.tokenizer.InputTokenizerTest
09:40:29 [2021-11-16T14:40:29.864Z] getTokens_detects_method_chaining  Time elapsed: 0.001 s
09:40:29 [2021-11-16T14:40:29.864Z] isDelimiter_equals_true{String}[1]  Time elapsed: 0.001 s
09:40:29 [2021-11-16T14:40:29.864Z] isDelimiter_equals_true{String}[2]  Time elapsed: 0 s
09:40:29 [2021-11-16T14:40:29.864Z] isDelimiter_equals_true{String}[3]  Time elapsed: 0.001 s
09:40:29 [2021-11-16T14:40:29.864Z] isDelimiter_equals_true{String}[4]  Time elapsed: 0 s
09:40:29 [2021-11-16T14:40:29.864Z] isDelimiter_equals_true{String}[5]  Time elapsed: 0.001 s
09:40:29 [2021-11-16T14:40:29.864Z] isDelimiter_equals_true{String}[6]  Time elapsed: 0 s
09:40:29 [2021-11-16T14:40:29.864Z] isDelimiter_equals_true{String}[7]  Time elapsed: 0 s
09:40:29 [2021-11-16T14:40:29.864Z] getTokens_detects_package_fragments  Time elapsed: 0 s
09:40:29 [2021-11-16T14:40:29.864Z] getTokens_detects_javascript_method_call  Time elapsed: 0 s
09:40:29 [2021-11-16T14:40:29.864Z] getTokens_detects_incomplete_package  Time elapsed: 0 s
09:40:29 [2021-11-16T14:40:29.864Z] getTokens_detects_module_methods_call_chain  Time elapsed: 0 s
09:40:29 [2021-11-16T14:40:29.864Z] getTokens_splits_string_literal  Time elapsed: 0 s
09:40:29 [2021-11-16T14:40:29.864Z] getTokens_detects_static_method_call  Time elapsed: 0 s
09:40:29 [2021-11-16T14:40:29.864Z] getTokens_detects_method_call_chain  Time elapsed: 0 s
09:40:29 [2021-11-16T14:40:29.864Z] getTokens_simplifies_multiply_operations  Time elapsed: 0 s
09:40:29 [2021-11-16T14:40:29.864Z] getTokens_detects_method_call_parameter_prefix  Time elapsed: 0 s
09:40:29 [2021-11-16T14:40:29.864Z] getTokens_detects_method_call_parameters_with_prefix  Time elapsed: 0.001 s
09:40:29 [2021-11-16T14:40:29.864Z] getTokens_detects_package  Time elapsed: 0 s
09:40:29 [2021-11-16T14:40:29.864Z] getTokens_detects_partial_package  Time elapsed: 0 s
09:40:29 [2021-11-16T14:40:29.864Z] getTokens_simplifies_plus_operations  Time elapsed: 0.001 s
09:40:29 [2021-11-16T14:40:29.864Z] getTokens_detects_class  Time elapsed: 0 s
09:40:29 [2021-11-16T14:40:29.864Z] getTokens_detects_opened_module_method  Time elapsed: 0 s
09:40:29 [2021-11-16T14:40:29.864Z] getTokens_simplifies_brackets_recursively  Time elapsed: 0 s
09:40:29 [2021-11-16T14:40:29.864Z] getTokens_detects_method_call_parameter  Time elapsed: 0 s
09:40:29 [2021-11-16T14:40:29.864Z] getTokens_simplifies_brackets  Time elapsed: 0 s
09:40:29 [2021-11-16T14:40:29.864Z] getTokens_removes_new_operator  Time elapsed: 0 s
09:40:29 [2021-11-16T14:40:29.864Z] isDelimiter_equals_false{String}[1]  Time elapsed: 0 s
09:40:29 [2021-11-16T14:40:29.864Z] isDelimiter_equals_false{String}[2]  Time elapsed: 0 s
09:40:29 [2021-11-16T14:40:29.864Z] isDelimiter_equals_false{String}[3]  Time elapsed: 0 s
09:40:29 [2021-11-16T14:40:29.864Z] getTokens_detects_method_call_parameters  Time elapsed: 0 s
09:40:29 [2021-11-16T14:40:29.864Z] getTokens_detects_class_instantiation  Time elapsed: 0.001 s
09:40:29 [2021-11-16T14:40:29.865Z] getTokens_detects_method_call  Time elapsed: 0 s
09:40:29 [2021-11-16T14:40:29.865Z] getTokens_simplifies_divide_operations  Time elapsed: 0 s
09:40:29 [2021-11-16T14:40:29.865Z] getTokens_removes_left_hand_side_of_assignment  Time elapsed: 0 s
09:40:29 [2021-11-16T14:40:29.865Z] getTokens_detects_javascript_class_instantiation  Time elapsed: 0 s
09:40:29 [2021-11-16T14:40:29.865Z] getTokens_simplifies_for_loop  Time elapsed: 0 s
09:40:29 [2021-11-16T14:40:29.865Z] getTokens_detects_resolved_javascript_variable_2  Time elapsed: 0.001 s
09:40:29 [2021-11-16T14:40:29.865Z] getTokens_simplifies_minus_operations  Time elapsed: 0 s
09:40:29 [2021-11-16T14:40:29.865Z] getTokens_detects_class_instantiation_2  Time elapsed: 0 s
09:40:29 [2021-11-16T14:40:29.865Z] getTokens_detects_class_instantiation_3  Time elapsed: 0.001 s
09:40:29 [2021-11-16T14:40:29.865Z] getTokens_simplifies_assignments  Time elapsed: 0 s
09:40:29 [2021-11-16T14:40:29.865Z] getTokens_detects_inner_class  Time elapsed: 0 s
09:40:29 [2021-11-16T14:40:29.865Z] getTokens_detects_static_method_call_with_dot_prefix  Time elapsed: 0 s
09:40:29 [2021-11-16T14:40:29.865Z] getTokens_detects_class_2  Time elapsed: 0 s
09:40:29 [2021-11-16T14:40:29.865Z] isTextFilter_equals_false{String}[1]  Time elapsed: 0 s
09:40:29 [2021-11-16T14:40:29.865Z] isTextFilter_equals_false{String}[2]  Time elapsed: 0 s
09:40:29 [2021-11-16T14:40:29.865Z] isTextFilter_equals_false{String}[3]  Time elapsed: 0 s
09:40:29 [2021-11-16T14:40:29.865Z] isTextFilter_equals_false{String}[4]  Time elapsed: 0 s
09:40:29 [2021-11-16T14:40:29.865Z] isTextFilter_equals_false{String}[5]  Time elapsed: 0 s
09:40:29 [2021-11-16T14:40:29.865Z] getTokens_does_not_split_within_string_literal  Time elapsed: 0 s
09:40:29 [2021-11-16T14:40:29.865Z] getTokens_1  Time elapsed: 0 s
09:40:29 [2021-11-16T14:40:29.865Z] isTextFilter_equals_true{String}[1]  Time elapsed: 0 s
09:40:29 [2021-11-16T14:40:29.865Z] isTextFilter_equals_true{String}[2]  Time elapsed: 0 s
09:40:29 [2021-11-16T14:40:29.865Z] getTokens_detects_opened_module_method_with_filter  Time elapsed: 0 s
09:40:29 [2021-11-16T14:40:29.865Z] getTokens_detects_method_call_request_with_filter  Time elapsed: 0.001 s
09:40:29 [2021-11-16T14:40:29.865Z] getTokens_for_empty_input  Time elapsed: 0 s
09:40:29 [2021-11-16T14:40:29.865Z] getTokens_detects_package_with_class_prefix  Time elapsed: 0 s
09:40:29 [2021-11-16T14:40:29.865Z] getTokens_detects_module_methods  Time elapsed: 0.001 s
09:40:29 [2021-11-16T14:40:29.865Z] getTokens_detects_completed_method  Time elapsed: 0 s
09:40:29 [2021-11-16T14:40:29.865Z] getTokens_detects_resolved_javascript_variable_with_method  Time elapsed: 0 s
09:40:29 [2021-11-16T14:40:29.865Z] getTokens_detects_resolved_javascript_variable  Time elapsed: 0 s
09:40:29 [2021-11-16T14:40:29.865Z] getTokens_simplifies_string_literal_1  Time elapsed: 0 s
09:40:29 [2021-11-16T14:40:29.865Z] getTokens_simplifies_string_literal_2  Time elapsed: 0 s
09:40:29 [2021-11-16T14:40:29.865Z] getTokens_is_empty_after_string_literal  Time elapsed: 0.001 s
09:40:29 [2021-11-16T14:40:29.865Z] getTokens_detects_static_method_call_chain  Time elapsed: 0 s
09:40:29 [2021-11-16T14:40:29.865Z] getTokens_detects_opened_module_method_with_parameter  Time elapsed: 0.001 s
09:40:29 [2021-11-16T14:40:29.865Z] getTokens_detects_javascript_object_call  Time elapsed: 0 s
09:40:29 [2021-11-16T14:40:29.865Z] Running org.eclipse.ease.ui.views.shell.dropins.variables.ContentLabelProviderTest
09:40:29 [2021-11-16T14:40:29.865Z] Tests run: 1, Failures: 0, Errors: 0, Skipped: 0, Time elapsed: 0.119 s - in org.eclipse.ease.ui.views.shell.dropins.variables.ContentLabelProviderTest
09:40:29 [2021-11-16T14:40:29.865Z] getText_returns_variable_content  Time elapsed: 0.119 s
09:40:29 [2021-11-16T14:40:29.865Z] Running org.eclipse.ease.ui.views.shell.dropins.variables.VariablesContentProviderTest
09:40:29 [2021-11-16T14:40:29.865Z] Tests run: 5, Failures: 0, Errors: 0, Skipped: 0, Time elapsed: 0.03 s - in org.eclipse.ease.ui.views.shell.dropins.variables.VariablesContentProviderTest
09:40:29 [2021-11-16T14:40:29.865Z] hasChildren_true_when_child_nodes_are_available  Time elapsed: 0.001 s
09:40:29 [2021-11-16T14:40:29.865Z] getChildren_is_empty_when_no_child_nodes_are_available  Time elapsed: 0 s
09:40:29 [2021-11-16T14:40:29.865Z] getElements_contains_variables_from_engine  Time elapsed: 0.025 s
09:40:29 [2021-11-16T14:40:29.865Z] hasChildren_false_when_no_child_nodes_are_available  Time elapsed: 0 s
09:40:29 [2021-11-16T14:40:29.865Z] getChildren_not_empty_when_child_nodes_are_available  Time elapsed: 0.001 s
09:40:29 [2021-11-16T14:40:29.865Z] Running org.eclipse.ease.ui.views.shell.dropins.variables.HiddenVariablesFilterTest
09:40:29 [2021-11-16T14:40:29.865Z] Tests run: 3, Failures: 0, Errors: 0, Skipped: 0, Time elapsed: 0.002 s - in org.eclipse.ease.ui.views.shell.dropins.variables.HiddenVariablesFilterTest
09:40:29 [2021-11-16T14:40:29.865Z] select_accepts_unknown_classes  Time elapsed: 0.001 s
09:40:29 [2021-11-16T14:40:29.865Z] select_accepts_script_variables  Time elapsed: 0 s
09:40:29 [2021-11-16T14:40:29.865Z] select_declines_hidden_script_variables  Time elapsed: 0 s
09:40:29 [2021-11-16T14:40:29.865Z] Running org.eclipse.ease.ui.views.shell.dropins.variables.VariablesComparatorTest
09:40:29 [2021-11-16T14:40:29.865Z] Tests run: 1, Failures: 0, Errors: 0, Skipped: 0, Time elapsed: 0.068 s - in org.eclipse.ease.ui.views.shell.dropins.variables.VariablesComparatorTest
09:40:29 [2021-11-16T14:40:29.865Z] lastExecutionResult_comes_before_debugVariable  Time elapsed: 0.068 s
09:40:29 [2021-11-16T14:40:29.865Z] Running org.eclipse.ease.ui.views.shell.dropins.variables.VariablesLabelProviderTest
09:40:30 [2021-11-16T14:40:30.122Z] Tests run: 1, Failures: 0, Errors: 0, Skipped: 0, Time elapsed: 0.002 s - in org.eclipse.ease.ui.views.shell.dropins.variables.VariablesLabelProviderTest
09:40:30 [2021-11-16T14:40:30.122Z] getText_returns_variable_name  Time elapsed: 0.002 s
09:40:30 [2021-11-16T14:40:30.122Z] Running org.eclipse.ease.ui.views.shell.dropins.modules.ModulesStackLabelProviderTest
09:40:30 [2021-11-16T14:40:30.122Z] Tests run: 3, Failures: 0, Errors: 0, Skipped: 0, Time elapsed: 0.078 s - in org.eclipse.ease.ui.views.shell.dropins.modules.ModulesStackLabelProviderTest
09:40:30 [2021-11-16T14:40:30.122Z] getText_null_returns_empty_string  Time elapsed: 0 s
09:40:30 [2021-11-16T14:40:30.122Z] getText_returns_definition_name  Time elapsed: 0.077 s
09:40:30 [2021-11-16T14:40:30.122Z] getText_returns_full_class_name_name  Time elapsed: 0 s
09:40:30 [2021-11-16T14:40:30.122Z] Running org.eclipse.ease.ui.views.shell.dropins.modules.ModulesStackContentProviderTest
09:40:30 [2021-11-16T14:40:30.122Z] Tests run: 2, Failures: 0, Errors: 0, Skipped: 0, Time elapsed: 0.016 s - in org.eclipse.ease.ui.views.shell.dropins.modules.ModulesStackContentProviderTest
09:40:30 [2021-11-16T14:40:30.122Z] getElements_returns_modules  Time elapsed: 0.016 s
09:40:30 [2021-11-16T14:40:30.122Z] getElements_returns_empty_list_without_environment  Time elapsed: 0 s
09:40:30 [2021-11-16T14:40:30.122Z] Running org.eclipse.ease.ui.help.hovers.ModuleHelpTest
09:40:30 [2021-11-16T14:40:30.122Z] Tests run: 4, Failures: 0, Errors: 0, Skipped: 4, Time elapsed: 0.002 s - in org.eclipse.ease.ui.help.hovers.ModuleHelpTest
09:40:30 [2021-11-16T14:40:30.122Z] getModuleHelpLocation skipped
09:40:30 [2021-11-16T14:40:30.122Z] getModuleHelp skipped
09:40:30 [2021-11-16T14:40:30.122Z] getMethodHelp skipped
09:40:30 [2021-11-16T14:40:30.122Z] getConstantHelp skipped
09:40:30 [2021-11-16T14:40:30.122Z] Running org.eclipse.ease.ui.dnd.ModulesDropHandlerTest
09:40:30 [2021-11-16T14:40:30.122Z] Tests run: 2, Failures: 0, Errors: 0, Skipped: 0, Time elapsed: 0.012 s - in org.eclipse.ease.ui.dnd.ModulesDropHandlerTest
09:40:30 [2021-11-16T14:40:30.122Z] accepts_true_for_ModuleEntry  Time elapsed: 0.012 s
09:40:30 [2021-11-16T14:40:30.122Z] accepts_true_for_ModuleDefinition  Time elapsed: 0 s
09:40:30 [2021-11-16T14:40:30.122Z] 
09:40:30 [2021-11-16T14:40:30.122Z] Results:
09:40:30 [2021-11-16T14:40:30.122Z] 
09:40:30 [2021-11-16T14:40:30.122Z] Tests run: 219, Failures: 0, Errors: 0, Skipped: 4
09:40:30 [2021-11-16T14:40:30.122Z] 
09:40:30 [2021-11-16T14:40:30.390Z] [INFO] All tests passed!
09:40:30 [2021-11-16T14:40:30.390Z] [INFO] ------------------------------------------------------------------------
09:40:30 [2021-11-16T14:40:30.390Z] [INFO] Reactor Summary for org.eclipse.ease.releng 0.9.0-SNAPSHOT:
09:40:30 [2021-11-16T14:40:30.390Z] [INFO] 
09:40:30 [2021-11-16T14:40:30.390Z] [INFO] org.eclipse.ease.releng ............................ SUCCESS [  0.001 s]
09:40:30 [2021-11-16T14:40:30.390Z] [INFO] org.eclipse.ease.releng.target ..................... SUCCESS [  0.119 s]
09:40:30 [2021-11-16T14:40:30.390Z] [INFO] org.eclipse.ease.test .............................. SUCCESS [ 18.874 s]
09:40:30 [2021-11-16T14:40:30.390Z] [INFO] org.eclipse.ease.lang.javascript.rhino.test ........ SUCCESS [ 15.920 s]
09:40:30 [2021-11-16T14:40:30.390Z] [INFO] org.eclipse.ease.lang.javascript.test .............. SUCCESS [  3.153 s]
09:40:30 [2021-11-16T14:40:30.390Z] [INFO] org.eclipse.ease.lang.python.test .................. SUCCESS [  4.661 s]
09:40:30 [2021-11-16T14:40:30.390Z] [INFO] org.eclipse.ease.lang.python.jython.test ........... SUCCESS [ 17.448 s]
09:40:30 [2021-11-16T14:40:30.390Z] [INFO] org.eclipse.ease.lang.scriptarchive.test ........... SUCCESS [  3.807 s]
09:40:30 [2021-11-16T14:40:30.390Z] [INFO] org.eclipse.ease.ui.test ........................... SUCCESS [  4.996 s]
09:40:30 [2021-11-16T14:40:30.391Z] [INFO] ------------------------------------------------------------------------
09:40:30 [2021-11-16T14:40:30.391Z] [INFO] BUILD SUCCESS
09:40:30 [2021-11-16T14:40:30.391Z] [INFO] ------------------------------------------------------------------------
09:40:30 [2021-11-16T14:40:30.391Z] [INFO] Total time:  01:57 min
09:40:30 [2021-11-16T14:40:30.391Z] [INFO] Finished at: 2021-11-16T14:40:30Z
09:40:30 [2021-11-16T14:40:30.391Z] [INFO] ------------------------------------------------------------------------
09:40:30 [2021-11-16T14:40:30.391Z] [WARNING] [jenkins-event-spy] Unexpected Maven project file name 'target-tests-pom.xml', problems may occur
09:40:30 [2021-11-16T14:40:30.391Z] [INFO] [jenkins-event-spy] Generated /home/jenkins/agent/workspace/ease.verify.core.target.2019-06@tmp/withMaven8b085881/maven-spy-20211116-143832-246842422739126596076.log