SuccessConsole Output

Skipping 168 KB.. Full Log
21-03-13T22:40:20.870Z] include file start
17:40:20 [2021-03-13T22:40:20.870Z] Include file processed
17:40:20 [2021-03-13T22:40:20.870Z] line after include file
17:40:20 [2021-03-13T22:40:20.870Z] Result of testMethod = 5
17:40:20 [2021-03-13T22:40:20.870Z] End of script
17:40:20 [2021-03-13T22:40:20.870Z] Start of script
17:40:20 [2021-03-13T22:40:20.870Z] include file start
17:40:20 [2021-03-13T22:40:20.870Z] Include file processed
17:40:20 [2021-03-13T22:40:20.870Z] line after include file
17:40:21 [2021-03-13T22:40:21.432Z] Start of script
17:40:21 [2021-03-13T22:40:21.432Z] include file start
17:40:21 [2021-03-13T22:40:21.432Z] Include file processed
17:40:21 [2021-03-13T22:40:21.432Z] line after include file
17:40:21 [2021-03-13T22:40:21.432Z] Result of testMethod = 5
17:40:21 [2021-03-13T22:40:21.432Z] End of script
17:40:21 [2021-03-13T22:40:21.688Z] Start of script
17:40:21 [2021-03-13T22:40:21.688Z] include file start
17:40:21 [2021-03-13T22:40:21.688Z] Include file processed
17:40:21 [2021-03-13T22:40:21.688Z] line after include file
17:40:21 [2021-03-13T22:40:21.688Z] Result of testMethod = 5
17:40:21 [2021-03-13T22:40:21.688Z] End of script
17:40:22 [2021-03-13T22:40:22.145Z] Start of script
17:40:22 [2021-03-13T22:40:22.145Z] include file start
17:40:22 [2021-03-13T22:40:22.145Z] Include file processed
17:40:22 [2021-03-13T22:40:22.145Z] line after include file
17:40:22 [2021-03-13T22:40:22.145Z] Result of testMethod = 5
17:40:22 [2021-03-13T22:40:22.145Z] End of script
17:40:22 [2021-03-13T22:40:22.401Z] Start of script
17:40:22 [2021-03-13T22:40:22.401Z] include file start
17:40:22 [2021-03-13T22:40:22.401Z] Include file processed
17:40:22 [2021-03-13T22:40:22.401Z] line after include file
17:40:22 [2021-03-13T22:40:22.401Z] Result of testMethod = 5
17:40:22 [2021-03-13T22:40:22.401Z] End of script
17:40:22 [2021-03-13T22:40:22.657Z] Start of script
17:40:22 [2021-03-13T22:40:22.657Z] include file start
17:40:22 [2021-03-13T22:40:22.657Z] Include file processed
17:40:22 [2021-03-13T22:40:22.657Z] line after include file
17:40:22 [2021-03-13T22:40:22.657Z] Result of testMethod = 5
17:40:22 [2021-03-13T22:40:22.913Z] Start of script
17:40:22 [2021-03-13T22:40:22.913Z] include file start
17:40:22 [2021-03-13T22:40:22.913Z] Include file processed
17:40:22 [2021-03-13T22:40:22.913Z] line after include file
17:40:23 [2021-03-13T22:40:23.168Z] Result of testMethod = 5
17:40:23 [2021-03-13T22:40:23.168Z] End of script
17:40:23 [2021-03-13T22:40:23.423Z] Start of script
17:40:23 [2021-03-13T22:40:23.423Z] include file start
17:40:23 [2021-03-13T22:40:23.423Z] Include file processed
17:40:23 [2021-03-13T22:40:23.423Z] line after include file
17:40:23 [2021-03-13T22:40:23.423Z] Result of testMethod = 5
17:40:23 [2021-03-13T22:40:23.423Z] End of script
17:40:23 [2021-03-13T22:40:23.679Z] Start of script
17:40:23 [2021-03-13T22:40:23.679Z] include file start
17:40:23 [2021-03-13T22:40:23.679Z] Include file processed
17:40:23 [2021-03-13T22:40:23.679Z] line after include file
17:40:23 [2021-03-13T22:40:23.939Z] Result of testMethod = 5
17:40:23 [2021-03-13T22:40:23.939Z] End of script
17:40:24 [2021-03-13T22:40:24.206Z] Start of script
17:40:24 [2021-03-13T22:40:24.206Z] include file start
17:40:24 [2021-03-13T22:40:24.206Z] Include file processed
17:40:24 [2021-03-13T22:40:24.206Z] line after include file
17:40:24 [2021-03-13T22:40:24.206Z] Result of testMethod = 5
17:40:24 [2021-03-13T22:40:24.206Z] End of script
17:40:24 [2021-03-13T22:40:24.472Z] Start of script
17:40:24 [2021-03-13T22:40:24.472Z] include file start
17:40:24 [2021-03-13T22:40:24.472Z] Include file processed
17:40:24 [2021-03-13T22:40:24.472Z] line after include file
17:40:24 [2021-03-13T22:40:24.472Z] Result of testMethod = 5
17:40:24 [2021-03-13T22:40:24.727Z] WARNING: An illegal reflective access operation has occurred
17:40:24 [2021-03-13T22:40:24.727Z] WARNING: Illegal reflective access by org.eclipse.ease.debugging.model.EaseDebugValue (file:/home/jenkins/.m2/repository/org/eclipse/ease/org.eclipse.ease/0.8.0-SNAPSHOT/org.eclipse.ease-0.8.0-SNAPSHOT.jar) to field java.lang.String.hash
17:40:24 [2021-03-13T22:40:24.727Z] WARNING: Please consider reporting this to the maintainers of org.eclipse.ease.debugging.model.EaseDebugValue
17:40:24 [2021-03-13T22:40:24.727Z] WARNING: Use --illegal-access=warn to enable warnings of further illegal reflective access operations
17:40:24 [2021-03-13T22:40:24.727Z] WARNING: All illegal access operations will be denied in a future release
17:40:24 [2021-03-13T22:40:24.727Z] Start of script
17:40:24 [2021-03-13T22:40:24.727Z] include file start
17:40:24 [2021-03-13T22:40:24.727Z] Include file processed
17:40:24 [2021-03-13T22:40:24.727Z] line after include file
17:40:24 [2021-03-13T22:40:24.727Z] Result of testMethod = 5
17:40:24 [2021-03-13T22:40:24.727Z] End of script
17:40:24 [2021-03-13T22:40:24.984Z] Start of script
17:40:24 [2021-03-13T22:40:24.984Z] include file start
17:40:24 [2021-03-13T22:40:24.984Z] Include file processed
17:40:24 [2021-03-13T22:40:24.984Z] line after include file
17:40:25 [2021-03-13T22:40:25.238Z] Result of testMethod = 5
17:40:25 [2021-03-13T22:40:25.238Z] End of script
17:40:25 [2021-03-13T22:40:25.238Z] Start of script
17:40:25 [2021-03-13T22:40:25.238Z] include file start
17:40:25 [2021-03-13T22:40:25.239Z] Include file processed
17:40:25 [2021-03-13T22:40:25.239Z] line after include file
17:40:25 [2021-03-13T22:40:25.239Z] Result of testMethod = 5
17:40:25 [2021-03-13T22:40:25.239Z] End of script
17:40:25 [2021-03-13T22:40:25.239Z] Start of script
17:40:25 [2021-03-13T22:40:25.493Z] include file start
17:40:25 [2021-03-13T22:40:25.493Z] Include file processed
17:40:25 [2021-03-13T22:40:25.493Z] line after include file
17:40:25 [2021-03-13T22:40:25.493Z] Result of testMethod = 5
17:40:25 [2021-03-13T22:40:25.493Z] End of script
17:40:25 [2021-03-13T22:40:25.748Z] Start of script
17:40:25 [2021-03-13T22:40:25.748Z] include file start
17:40:25 [2021-03-13T22:40:25.748Z] Include file processed
17:40:25 [2021-03-13T22:40:25.749Z] line after include file
17:40:26 [2021-03-13T22:40:26.004Z] Start of script
17:40:26 [2021-03-13T22:40:26.259Z] include file start
17:40:26 [2021-03-13T22:40:26.259Z] Include file processed
17:40:26 [2021-03-13T22:40:26.259Z] line after include file
17:40:26 [2021-03-13T22:40:26.259Z] Result of testMethod = 5
17:40:26 [2021-03-13T22:40:26.259Z] End of script
17:40:26 [2021-03-13T22:40:26.259Z] Start of script
17:40:26 [2021-03-13T22:40:26.259Z] include file start
17:40:26 [2021-03-13T22:40:26.259Z] Include file processed
17:40:26 [2021-03-13T22:40:26.259Z] line after include file
17:40:26 [2021-03-13T22:40:26.259Z] Result of testMethod = 5
17:40:26 [2021-03-13T22:40:26.516Z] Start of script
17:40:26 [2021-03-13T22:40:26.516Z] include file start
17:40:26 [2021-03-13T22:40:26.516Z] Include file processed
17:40:26 [2021-03-13T22:40:26.516Z] line after include file
17:40:26 [2021-03-13T22:40:26.516Z] Result of testMethod = 5
17:40:26 [2021-03-13T22:40:26.771Z] End of script
17:40:26 [2021-03-13T22:40:26.771Z] Start of script
17:40:26 [2021-03-13T22:40:26.771Z] include file start
17:40:26 [2021-03-13T22:40:26.771Z] Include file processed
17:40:26 [2021-03-13T22:40:26.771Z] line after include file
17:40:27 [2021-03-13T22:40:27.026Z] Result of testMethod = 5
17:40:27 [2021-03-13T22:40:27.026Z] End of script
17:40:27 [2021-03-13T22:40:27.026Z] Start of script
17:40:27 [2021-03-13T22:40:27.026Z] include file start
17:40:27 [2021-03-13T22:40:27.026Z] Include file processed
17:40:27 [2021-03-13T22:40:27.026Z] line after include file
17:40:27 [2021-03-13T22:40:27.282Z] Result of testMethod = 5
17:40:27 [2021-03-13T22:40:27.282Z] End of script
17:40:27 [2021-03-13T22:40:27.282Z] Start of script
17:40:27 [2021-03-13T22:40:27.282Z] include file start
17:40:27 [2021-03-13T22:40:27.282Z] Include file processed
17:40:27 [2021-03-13T22:40:27.282Z] line after include file
17:40:27 [2021-03-13T22:40:27.282Z] Result of testMethod = 5
17:40:27 [2021-03-13T22:40:27.538Z] End of script
17:40:27 [2021-03-13T22:40:27.538Z] Start of script
17:40:27 [2021-03-13T22:40:27.538Z] include file start
17:40:27 [2021-03-13T22:40:27.538Z] Include file processed
17:40:27 [2021-03-13T22:40:27.538Z] line after include file
17:40:27 [2021-03-13T22:40:27.538Z] Result of testMethod = 5
17:40:27 [2021-03-13T22:40:27.794Z] Start of script
17:40:27 [2021-03-13T22:40:27.794Z] include file start
17:40:27 [2021-03-13T22:40:27.794Z] Include file processed
17:40:27 [2021-03-13T22:40:27.794Z] line after include file
17:40:27 [2021-03-13T22:40:27.794Z] Result of testMethod = 5
17:40:28 [2021-03-13T22:40:28.049Z] End of script
17:40:28 [2021-03-13T22:40:28.049Z] Start of script
17:40:28 [2021-03-13T22:40:28.049Z] include file start
17:40:28 [2021-03-13T22:40:28.049Z] Include file processed
17:40:28 [2021-03-13T22:40:28.049Z] line after include file
17:40:28 [2021-03-13T22:40:28.049Z] Result of testMethod = 5
17:40:28 [2021-03-13T22:40:28.610Z] Start of script
17:40:28 [2021-03-13T22:40:28.610Z] include file start
17:40:28 [2021-03-13T22:40:28.610Z] Include file processed
17:40:28 [2021-03-13T22:40:28.610Z] line after include file
17:40:28 [2021-03-13T22:40:28.610Z] Result of testMethod = 5
17:40:28 [2021-03-13T22:40:28.610Z] End of script
17:40:28 [2021-03-13T22:40:28.866Z] Start of script
17:40:28 [2021-03-13T22:40:28.866Z] include file start
17:40:28 [2021-03-13T22:40:28.866Z] Include file processed
17:40:28 [2021-03-13T22:40:28.866Z] line after include file
17:40:29 [2021-03-13T22:40:29.122Z] Result of testMethod = 5
17:40:29 [2021-03-13T22:40:29.122Z] End of script
17:40:29 [2021-03-13T22:40:29.122Z] Start of script
17:40:29 [2021-03-13T22:40:29.122Z] include file start
17:40:29 [2021-03-13T22:40:29.122Z] Include file processed
17:40:29 [2021-03-13T22:40:29.122Z] line after include file
17:40:29 [2021-03-13T22:40:29.122Z] Result of testMethod = 5
17:40:29 [2021-03-13T22:40:29.122Z] End of script
17:40:29 [2021-03-13T22:40:29.377Z] Tests run: 42, Failures: 0, Errors: 0, Skipped: 0, Time elapsed: 11.283 s - in org.eclipse.ease.lang.javascript.rhino.RhinoDebugTest
17:40:29 [2021-03-13T22:40:29.377Z] disconnectProcessInSuspendedState  Time elapsed: 0.634 s
17:40:29 [2021-03-13T22:40:29.377Z] stepReturnIncludeCommand  Time elapsed: 0.211 s
17:40:29 [2021-03-13T22:40:29.377Z] arrayVariableSorting  Time elapsed: 0.306 s
17:40:29 [2021-03-13T22:40:29.377Z] stepOverOnDebugTarget  Time elapsed: 0.307 s
17:40:29 [2021-03-13T22:40:29.377Z] hasDebugTarget  Time elapsed: 0.104 s
17:40:29 [2021-03-13T22:40:29.377Z] disconnectThreadInSuspendedState  Time elapsed: 0.205 s
17:40:29 [2021-03-13T22:40:29.377Z] stepReturnOnDebugTarget  Time elapsed: 0.307 s
17:40:29 [2021-03-13T22:40:29.377Z] nullVariable  Time elapsed: 0.306 s
17:40:29 [2021-03-13T22:40:29.377Z] stepOverOnStackFrame  Time elapsed: 0.305 s
17:40:29 [2021-03-13T22:40:29.378Z] resumeOnDebugTarget  Time elapsed: 0.205 s
17:40:29 [2021-03-13T22:40:29.378Z] modifyVariableKeepingType  Time elapsed: 0.406 s
17:40:29 [2021-03-13T22:40:29.378Z] resumeOnLastIncludeLine  Time elapsed: 0.205 s
17:40:29 [2021-03-13T22:40:29.378Z] stepReturnOnStackFrame  Time elapsed: 0.306 s
17:40:29 [2021-03-13T22:40:29.378Z] terminateStackFrameInSuspendedState  Time elapsed: 0.206 s
17:40:29 [2021-03-13T22:40:29.378Z] breakpointLocation  Time elapsed: 0.206 s
17:40:29 [2021-03-13T22:40:29.378Z] stepReturnOnThread  Time elapsed: 0.308 s
17:40:29 [2021-03-13T22:40:29.378Z] javaClassVariable  Time elapsed: 0.307 s
17:40:29 [2021-03-13T22:40:29.378Z] stepIntoOnThread  Time elapsed: 0.306 s
17:40:29 [2021-03-13T22:40:29.378Z] terminateThreadInSuspendedState  Time elapsed: 0.204 s
17:40:29 [2021-03-13T22:40:29.378Z] resumeOnThread  Time elapsed: 0.204 s
17:40:29 [2021-03-13T22:40:29.378Z] stepIntoOnStackFrame  Time elapsed: 0.305 s
17:40:29 [2021-03-13T22:40:29.378Z] terminateProcessInSuspendedState  Time elapsed: 0.204 s
17:40:29 [2021-03-13T22:40:29.378Z] stepOverOnProcess  Time elapsed: 0.306 s
17:40:29 [2021-03-13T22:40:29.378Z] nativeArrayVariable  Time elapsed: 0.305 s
17:40:29 [2021-03-13T22:40:29.378Z] disconnectDebugTargetInSuspendedState  Time elapsed: 0.205 s
17:40:29 [2021-03-13T22:40:29.378Z] stepIntoOnProcess  Time elapsed: 0.305 s
17:40:29 [2021-03-13T22:40:29.378Z] terminatedState  Time elapsed: 0.102 s
17:40:29 [2021-03-13T22:40:29.378Z] stepOverIncludeCommand  Time elapsed: 0.304 s
17:40:29 [2021-03-13T22:40:29.378Z] innerScopeVariableBeforeOuterScopeVariable  Time elapsed: 0.304 s
17:40:29 [2021-03-13T22:40:29.378Z] stepIntoIncludeCommand  Time elapsed: 0.306 s
17:40:29 [2021-03-13T22:40:29.378Z] primitiveStringVariable  Time elapsed: 0.304 s
17:40:29 [2021-03-13T22:40:29.378Z] resumeOnProcess  Time elapsed: 0.205 s
17:40:29 [2021-03-13T22:40:29.378Z] stepIntoOnDebugTarget  Time elapsed: 0.306 s
17:40:29 [2021-03-13T22:40:29.378Z] stepOverOnThread  Time elapsed: 0.305 s
17:40:29 [2021-03-13T22:40:29.378Z] suspendedState  Time elapsed: 0.205 s
17:40:29 [2021-03-13T22:40:29.378Z] primitiveDoubleVariable  Time elapsed: 0.304 s
17:40:29 [2021-03-13T22:40:29.378Z] resumeOnStackFrame  Time elapsed: 0.205 s
17:40:29 [2021-03-13T22:40:29.378Z] nativeObjectVariable  Time elapsed: 0.304 s
17:40:29 [2021-03-13T22:40:29.378Z] terminateDebugTargetInSuspendedState  Time elapsed: 0.204 s
17:40:29 [2021-03-13T22:40:29.378Z] disconnectStackFrameInSuspendedState  Time elapsed: 0.205 s
17:40:29 [2021-03-13T22:40:29.378Z] stepReturnOnProcess  Time elapsed: 0.306 s
17:40:29 [2021-03-13T22:40:29.378Z] evaluateWatchExpression  Time elapsed: 0.224 s
17:40:29 [2021-03-13T22:40:29.378Z] Running org.eclipse.ease.lang.javascript.rhino.RhinoEnvironmentTest
17:40:29 [2021-03-13T22:40:29.634Z] Tests run: 5, Failures: 0, Errors: 0, Skipped: 0, Time elapsed: 0.201 s - in org.eclipse.ease.lang.javascript.rhino.RhinoEnvironmentTest
17:40:29 [2021-03-13T22:40:29.634Z] reloadEnvironment  Time elapsed: 0.09 s
17:40:29 [2021-03-13T22:40:29.634Z] bootstrappedEnvironment  Time elapsed: 0.014 s
17:40:29 [2021-03-13T22:40:29.634Z] postMethodCallback  Time elapsed: 0.029 s
17:40:29 [2021-03-13T22:40:29.634Z] preMethodCallback  Time elapsed: 0.013 s
17:40:29 [2021-03-13T22:40:29.634Z] reloadFunctionDefinitions  Time elapsed: 0.055 s
17:40:29 [2021-03-13T22:40:29.634Z] Running org.eclipse.ease.lang.javascript.rhino.RhinoScriptEngineTest
17:40:29 [2021-03-13T22:40:29.634Z] org.eclipse.ease.ScriptExecutionException: JavaError: NotThere cannot be found by org.mozilla.javascript_1.7.5.v201504281450
17:40:29 [2021-03-13T22:40:29.634Z] 	at <unknown source>
17:40:29 [2021-03-13T22:40:29.634Z] 
17:40:29 [2021-03-13T22:40:29.634Z] Java Stacktrace:
17:40:29 [2021-03-13T22:40:29.634Z] java.lang.ClassNotFoundException: NotThere cannot be found by org.mozilla.javascript_1.7.5.v201504281450
17:40:29 [2021-03-13T22:40:29.634Z] 	at org.eclipse.osgi.internal.loader.BundleLoader.findClassInternal(BundleLoader.java:511)
17:40:29 [2021-03-13T22:40:29.634Z] 	at org.eclipse.osgi.internal.loader.BundleLoader.findClass(BundleLoader.java:422)
17:40:29 [2021-03-13T22:40:29.634Z] 	at org.eclipse.osgi.internal.loader.BundleLoader.findClass(BundleLoader.java:414)
17:40:29 [2021-03-13T22:40:29.634Z] 	at org.eclipse.osgi.internal.loader.ModuleClassLoader.loadClass(ModuleClassLoader.java:153)
17:40:29 [2021-03-13T22:40:29.634Z] 	at java.base/java.lang.ClassLoader.loadClass(ClassLoader.java:522)
17:40:29 [2021-03-13T22:40:29.634Z] 	at java.base/java.lang.Class.forName0(Native Method)
17:40:29 [2021-03-13T22:40:29.634Z] 	at java.base/java.lang.Class.forName(Class.java:377)
17:40:29 [2021-03-13T22:40:29.634Z] 	at java.base/jdk.internal.reflect.NativeMethodAccessorImpl.invoke0(Native Method)
17:40:29 [2021-03-13T22:40:29.634Z] 	at java.base/jdk.internal.reflect.NativeMethodAccessorImpl.invoke(NativeMethodAccessorImpl.java:64)
17:40:29 [2021-03-13T22:40:29.634Z] 	at java.base/jdk.internal.reflect.DelegatingMethodAccessorImpl.invoke(DelegatingMethodAccessorImpl.java:43)
17:40:29 [2021-03-13T22:40:29.634Z] 	at java.base/java.lang.reflect.Method.invoke(Method.java:564)
17:40:29 [2021-03-13T22:40:29.634Z] 	at org.mozilla.javascript.MemberBox.invoke(MemberBox.java:126)
17:40:29 [2021-03-13T22:40:29.634Z] 	at org.mozilla.javascript.NativeJavaMethod.call(NativeJavaMethod.java:225)
17:40:29 [2021-03-13T22:40:29.634Z] 	at org.mozilla.javascript.optimizer.OptRuntime.call1(OptRuntime.java:32)
17:40:29 [2021-03-13T22:40:29.634Z] 	at org.mozilla.javascript.gen.c_27._c_script_0(Unknown Source)
17:40:29 [2021-03-13T22:40:29.634Z] 	at org.mozilla.javascript.gen.c_27.call(Unknown Source)
17:40:29 [2021-03-13T22:40:29.634Z] 	at org.mozilla.javascript.ContextFactory.doTopCall(ContextFactory.java:394)
17:40:29 [2021-03-13T22:40:29.634Z] 	at org.mozilla.javascript.ScriptRuntime.doTopCall(ScriptRuntime.java:3091)
17:40:29 [2021-03-13T22:40:29.634Z] 	at org.mozilla.javascript.gen.c_27.call(Unknown Source)
17:40:29 [2021-03-13T22:40:29.634Z] 	at org.mozilla.javascript.gen.c_27.exec(Unknown Source)
17:40:29 [2021-03-13T22:40:29.634Z] 	at org.mozilla.javascript.Context.evaluateReader(Context.java:1110)
17:40:29 [2021-03-13T22:40:29.634Z] 	at org.eclipse.ease.lang.javascript.rhino.RhinoScriptEngine.internalExecute(RhinoScriptEngine.java:222)
17:40:29 [2021-03-13T22:40:29.634Z] 	at org.eclipse.ease.lang.javascript.rhino.RhinoScriptEngine.execute(RhinoScriptEngine.java:201)
17:40:29 [2021-03-13T22:40:29.634Z] 	at org.eclipse.ease.AbstractScriptEngine.inject(AbstractScriptEngine.java:224)
17:40:29 [2021-03-13T22:40:29.634Z] 	at org.eclipse.ease.AbstractScriptEngine.run(AbstractScriptEngine.java:274)
17:40:29 [2021-03-13T22:40:29.634Z] 	at org.eclipse.core.internal.jobs.Worker.run(Worker.java:63)
17:40:29 [2021-03-13T22:40:29.634Z] org.eclipse.ease.ScriptExecutionException: TypeError: Cannot call method "foobar" of undefined
17:40:29 [2021-03-13T22:40:29.634Z] 	at <unknown source>
17:40:29 [2021-03-13T22:40:29.634Z] org.eclipse.ease.ScriptExecutionException: ScriptException: test
17:40:29 [2021-03-13T22:40:29.634Z] 	at <unknown source>
17:40:29 [2021-03-13T22:40:29.634Z] org.eclipse.ease.ScriptExecutionException: JavaError: java.lang.Exception
17:40:29 [2021-03-13T22:40:29.634Z] 	at <unknown source>
17:40:29 [2021-03-13T22:40:29.634Z] 
17:40:29 [2021-03-13T22:40:29.634Z] Java Stacktrace:
17:40:29 [2021-03-13T22:40:29.634Z] java.lang.Exception
17:40:29 [2021-03-13T22:40:29.634Z] 	at java.base/jdk.internal.reflect.NativeConstructorAccessorImpl.newInstance0(Native Method)
17:40:29 [2021-03-13T22:40:29.634Z] 	at java.base/jdk.internal.reflect.NativeConstructorAccessorImpl.newInstance(NativeConstructorAccessorImpl.java:64)
17:40:29 [2021-03-13T22:40:29.634Z] 	at java.base/jdk.internal.reflect.DelegatingConstructorAccessorImpl.newInstance(DelegatingConstructorAccessorImpl.java:45)
17:40:29 [2021-03-13T22:40:29.634Z] 	at java.base/java.lang.reflect.Constructor.newInstanceWithCaller(Constructor.java:500)
17:40:29 [2021-03-13T22:40:29.634Z] 	at java.base/java.lang.reflect.Constructor.newInstance(Constructor.java:481)
17:40:29 [2021-03-13T22:40:29.634Z] 	at org.mozilla.javascript.MemberBox.newInstance(MemberBox.java:159)
17:40:29 [2021-03-13T22:40:29.634Z] 	at org.mozilla.javascript.NativeJavaClass.constructInternal(NativeJavaClass.java:266)
17:40:29 [2021-03-13T22:40:29.634Z] 	at org.mozilla.javascript.NativeJavaClass.constructSpecific(NativeJavaClass.java:205)
17:40:29 [2021-03-13T22:40:29.634Z] 	at org.mozilla.javascript.NativeJavaClass.construct(NativeJavaClass.java:166)
17:40:29 [2021-03-13T22:40:29.634Z] 	at org.mozilla.javascript.ScriptRuntime.newObject(ScriptRuntime.java:2349)
17:40:29 [2021-03-13T22:40:29.634Z] 	at org.mozilla.javascript.gen.c_45._c_script_0(Unknown Source)
17:40:29 [2021-03-13T22:40:29.634Z] 	at org.mozilla.javascript.gen.c_45.call(Unknown Source)
17:40:29 [2021-03-13T22:40:29.634Z] 	at org.mozilla.javascript.ContextFactory.doTopCall(ContextFactory.java:394)
17:40:29 [2021-03-13T22:40:29.634Z] 	at org.mozilla.javascript.ScriptRuntime.doTopCall(ScriptRuntime.java:3091)
17:40:29 [2021-03-13T22:40:29.634Z] 	at org.mozilla.javascript.gen.c_45.call(Unknown Source)
17:40:29 [2021-03-13T22:40:29.634Z] 	at org.mozilla.javascript.gen.c_45.exec(Unknown Source)
17:40:29 [2021-03-13T22:40:29.634Z] 	at org.mozilla.javascript.Context.evaluateReader(Context.java:1110)
17:40:29 [2021-03-13T22:40:29.634Z] 	at org.eclipse.ease.lang.javascript.rhino.RhinoScriptEngine.internalExecute(RhinoScriptEngine.java:222)
17:40:29 [2021-03-13T22:40:29.634Z] 	at org.eclipse.ease.lang.javascript.rhino.RhinoScriptEngine.execute(RhinoScriptEngine.java:201)
17:40:29 [2021-03-13T22:40:29.634Z] 	at org.eclipse.ease.AbstractScriptEngine.inject(AbstractScriptEngine.java:224)
17:40:29 [2021-03-13T22:40:29.634Z] 	at org.eclipse.ease.AbstractScriptEngine.run(AbstractScriptEngine.java:274)
17:40:29 [2021-03-13T22:40:29.634Z] 	at org.eclipse.core.internal.jobs.Worker.run(Worker.java:63)
17:40:29 [2021-03-13T22:40:29.634Z] org.eclipse.ease.ScriptExecutionException: ScriptException: JavaScript
17:40:29 [2021-03-13T22:40:29.634Z] 	at <unknown source>
17:40:29 [2021-03-13T22:40:29.634Z] org.eclipse.ease.ScriptExecutionException: SyntaxError: unterminated string literal (#1)
17:40:29 [2021-03-13T22:40:29.634Z] 'asdf
17:40:29 [2021-03-13T22:40:29.634Z]     ^
17:40:29 [2021-03-13T22:40:29.634Z] 	at <unknown source>
17:40:29 [2021-03-13T22:40:29.634Z] Tests run: 11, Failures: 0, Errors: 0, Skipped: 0, Time elapsed: 0.134 s - in org.eclipse.ease.lang.javascript.rhino.RhinoScriptEngineTest
17:40:29 [2021-03-13T22:40:29.635Z] causeWrappedException  Time elapsed: 0.01 s
17:40:29 [2021-03-13T22:40:29.635Z] optionalModuleParameters  Time elapsed: 0.01 s
17:40:29 [2021-03-13T22:40:29.635Z] simpleScriptCode  Time elapsed: 0.009 s
17:40:29 [2021-03-13T22:40:29.635Z] causeRuntimeErrorException  Time elapsed: 0.01 s
17:40:29 [2021-03-13T22:40:29.635Z] callModuleCode  Time elapsed: 0.01 s
17:40:29 [2021-03-13T22:40:29.635Z] throwJavaClass  Time elapsed: 0.036 s
17:40:29 [2021-03-13T22:40:29.635Z] throwJavaException  Time elapsed: 0.01 s
17:40:29 [2021-03-13T22:40:29.635Z] accessJavaClasses  Time elapsed: 0.01 s
17:40:29 [2021-03-13T22:40:29.635Z] accessEclipseClasses  Time elapsed: 0.01 s
17:40:29 [2021-03-13T22:40:29.635Z] throwJavaScriptException  Time elapsed: 0.008 s
17:40:29 [2021-03-13T22:40:29.635Z] causeSyntaxErrorException  Time elapsed: 0.008 s
17:40:29 [2021-03-13T22:40:29.635Z] 
17:40:29 [2021-03-13T22:40:29.635Z] Results:
17:40:29 [2021-03-13T22:40:29.635Z] 
17:40:29 [2021-03-13T22:40:29.635Z] Tests run: 70, Failures: 0, Errors: 0, Skipped: 0
17:40:29 [2021-03-13T22:40:29.635Z] 
17:40:30 [2021-03-13T22:40:30.199Z] [INFO] All tests passed!
17:40:30 [2021-03-13T22:40:30.199Z] [INFO] 
17:40:30 [2021-03-13T22:40:30.199Z] [INFO] -------< org.eclipse.ease:org.eclipse.ease.lang.javascript.test >-------
17:40:30 [2021-03-13T22:40:30.199Z] [INFO] Building org.eclipse.ease.lang.javascript.test 0.8.0-SNAPSHOT      [5/9]
17:40:30 [2021-03-13T22:40:30.199Z] [INFO] ------------------------[ eclipse-test-plugin ]-------------------------
17:40:30 [2021-03-13T22:40:30.199Z] [INFO] 
17:40:30 [2021-03-13T22:40:30.199Z] [INFO] --- tycho-packaging-plugin:2.2.0:build-qualifier (default-build-qualifier) @ org.eclipse.ease.lang.javascript.test ---
17:40:30 [2021-03-13T22:40:30.199Z] [INFO] The project's OSGi version is 0.8.0.I202103030731
17:40:30 [2021-03-13T22:40:30.199Z] [INFO] 
17:40:30 [2021-03-13T22:40:30.199Z] [INFO] --- tycho-packaging-plugin:2.2.0:validate-id (default-validate-id) @ org.eclipse.ease.lang.javascript.test ---
17:40:30 [2021-03-13T22:40:30.199Z] [INFO] 
17:40:30 [2021-03-13T22:40:30.199Z] [INFO] --- tycho-packaging-plugin:2.2.0:validate-version (default-validate-version) @ org.eclipse.ease.lang.javascript.test ---
17:40:30 [2021-03-13T22:40:30.199Z] [INFO] 
17:40:30 [2021-03-13T22:40:30.199Z] [INFO] --- maven-resources-plugin:2.4.3:resources (default-resources) @ org.eclipse.ease.lang.javascript.test ---
17:40:30 [2021-03-13T22:40:30.199Z] [INFO] Using 'UTF-8' encoding to copy filtered resources.
17:40:30 [2021-03-13T22:40:30.199Z] [INFO] skip non existing resourceDirectory /home/jenkins/agent/workspace/ease.verify.core.target.2019-03/tests/org.eclipse.ease.lang.javascript.test/src/main/resources
17:40:30 [2021-03-13T22:40:30.199Z] [INFO] 
17:40:30 [2021-03-13T22:40:30.199Z] [INFO] --- tycho-compiler-plugin:2.2.0:compile (default-compile) @ org.eclipse.ease.lang.javascript.test ---
17:40:30 [2021-03-13T22:40:30.199Z] [INFO] Nothing to compile - all classes are up to date
17:40:30 [2021-03-13T22:40:30.199Z] [INFO] 
17:40:30 [2021-03-13T22:40:30.199Z] [INFO] --- maven-resources-plugin:2.4.3:testResources (default-testResources) @ org.eclipse.ease.lang.javascript.test ---
17:40:30 [2021-03-13T22:40:30.199Z] [INFO] Using 'UTF-8' encoding to copy filtered resources.
17:40:30 [2021-03-13T22:40:30.199Z] [INFO] skip non existing resourceDirectory /home/jenkins/agent/workspace/ease.verify.core.target.2019-03/tests/org.eclipse.ease.lang.javascript.test/src/test/resources
17:40:30 [2021-03-13T22:40:30.199Z] [INFO] 
17:40:30 [2021-03-13T22:40:30.199Z] [INFO] --- target-platform-configuration:2.2.0:target-platform (default-target-platform) @ org.eclipse.ease.lang.javascript.test ---
17:40:30 [2021-03-13T22:40:30.200Z] [INFO] 
17:40:30 [2021-03-13T22:40:30.200Z] [INFO] --- tycho-packaging-plugin:2.2.0:package-plugin (default-package-plugin) @ org.eclipse.ease.lang.javascript.test ---
17:40:30 [2021-03-13T22:40:30.200Z] [INFO] Building jar: /home/jenkins/agent/workspace/ease.verify.core.target.2019-03/tests/org.eclipse.ease.lang.javascript.test/target/org.eclipse.ease.lang.javascript.test-0.8.0-SNAPSHOT.jar
17:40:30 [2021-03-13T22:40:30.200Z] [INFO] 
17:40:30 [2021-03-13T22:40:30.200Z] [INFO] --- tycho-p2-plugin:2.2.0:p2-metadata-default (default-p2-metadata-default) @ org.eclipse.ease.lang.javascript.test ---
17:40:30 [2021-03-13T22:40:30.200Z] [INFO] 
17:40:30 [2021-03-13T22:40:30.200Z] [INFO] --- jacoco-maven-plugin:0.8.6:prepare-agent (jacoco-initialize) @ org.eclipse.ease.lang.javascript.test ---
17:40:30 [2021-03-13T22:40:30.200Z] [INFO] tycho.testArgLine set to -javaagent:/home/jenkins/.m2/repository/org/jacoco/org.jacoco.agent/0.8.6/org.jacoco.agent-0.8.6-runtime.jar=destfile=/home/jenkins/agent/workspace/ease.verify.core.target.2019-03/tests/org.eclipse.ease.lang.javascript.test/target/jacoco.exec,output=file
17:40:30 [2021-03-13T22:40:30.200Z] [INFO] 
17:40:30 [2021-03-13T22:40:30.200Z] [INFO] --- tycho-surefire-plugin:2.2.0:test (default-test) @ org.eclipse.ease.lang.javascript.test ---
17:40:30 [2021-03-13T22:40:30.200Z] [INFO] Executing Test Runtime with timeout 0, logs (if any) will be placed at: /home/jenkins/agent/workspace/ease.verify.core.target.2019-03/tests/org.eclipse.ease.lang.javascript.test/target/work/data/.metadata/.log
17:40:30 [2021-03-13T22:40:30.200Z] [INFO] Command line:
17:40:30 [2021-03-13T22:40:30.200Z] 	[/opt/tools/java/openjdk/jdk-15/15.0.2+7/bin/java, -Dosgi.noShutdown=false, -Dosgi.os=linux, -Dosgi.ws=gtk, -Dosgi.arch=x86_64, -javaagent:/home/jenkins/.m2/repository/org/jacoco/org.jacoco.agent/0.8.6/org.jacoco.agent-0.8.6-runtime.jar=destfile=/home/jenkins/agent/workspace/ease.verify.core.target.2019-03/tests/org.eclipse.ease.lang.javascript.test/target/jacoco.exec,output=file, -Dosgi.clean=true, -jar, /home/jenkins/.m2/repository/p2/osgi/bundle/org.eclipse.equinox.launcher/1.5.300.v20190213-1655/org.eclipse.equinox.launcher-1.5.300.v20190213-1655.jar, -data, /home/jenkins/agent/workspace/ease.verify.core.target.2019-03/tests/org.eclipse.ease.lang.javascript.test/target/work/data, -install, /home/jenkins/agent/workspace/ease.verify.core.target.2019-03/tests/org.eclipse.ease.lang.javascript.test/target/work, -configuration, /home/jenkins/agent/workspace/ease.verify.core.target.2019-03/tests/org.eclipse.ease.lang.javascript.test/target/work/configuration, -application, org.eclipse.tycho.surefire.osgibooter.headlesstest, -testproperties, /home/jenkins/agent/workspace/ease.verify.core.target.2019-03/tests/org.eclipse.ease.lang.javascript.test/target/surefire.properties]
17:40:30 [2021-03-13T22:40:30.455Z] Picked up JAVA_TOOL_OPTIONS: -Dmaven.ext.class.path="/home/jenkins/agent/workspace/ease.verify.core.target.2019-03@tmp/withMavenf02f74e7/pipeline-maven-spy.jar" -Dorg.jenkinsci.plugins.pipeline.maven.reportsFolder="/home/jenkins/agent/workspace/ease.verify.core.target.2019-03@tmp/withMavenf02f74e7" 
17:40:32 [2021-03-13T22:40:32.989Z] Mar 13, 2021 10:40:32 PM org.junit.platform.launcher.core.DefaultLauncher handleThrowable
17:40:32 [2021-03-13T22:40:32.989Z] WARNING: TestEngine with ID 'junit-vintage' failed to discover tests
17:40:32 [2021-03-13T22:40:32.989Z] java.lang.NoClassDefFoundError: org/junit/runners/model/RunnerBuilder
17:40:32 [2021-03-13T22:40:32.989Z] 	at org.junit.vintage.engine.discovery.VintageDiscoverer.<init>(VintageDiscoverer.java:48)
17:40:32 [2021-03-13T22:40:32.989Z] 	at org.junit.vintage.engine.VintageTestEngine.discover(VintageTestEngine.java:65)
17:40:32 [2021-03-13T22:40:32.989Z] 	at org.junit.platform.launcher.core.DefaultLauncher.discoverEngineRoot(DefaultLauncher.java:130)
17:40:32 [2021-03-13T22:40:32.989Z] 	at org.junit.platform.launcher.core.DefaultLauncher.discoverRoot(DefaultLauncher.java:117)
17:40:32 [2021-03-13T22:40:32.989Z] 	at org.junit.platform.launcher.core.DefaultLauncher.discover(DefaultLauncher.java:82)
17:40:32 [2021-03-13T22:40:32.989Z] 	at org.apache.maven.surefire.junitplatform.TestPlanScannerFilter.accept(TestPlanScannerFilter.java:56)
17:40:32 [2021-03-13T22:40:32.989Z] 	at org.apache.maven.surefire.util.DefaultScanResult.applyFilter(DefaultScanResult.java:102)
17:40:32 [2021-03-13T22:40:32.989Z] 	at org.apache.maven.surefire.junitplatform.JUnitPlatformProvider.scanClasspath(JUnitPlatformProvider.java:143)
17:40:32 [2021-03-13T22:40:32.989Z] 	at org.apache.maven.surefire.junitplatform.JUnitPlatformProvider.invoke(JUnitPlatformProvider.java:124)
17:40:32 [2021-03-13T22:40:32.989Z] 	at java.base/jdk.internal.reflect.NativeMethodAccessorImpl.invoke0(Native Method)
17:40:32 [2021-03-13T22:40:32.989Z] 	at java.base/jdk.internal.reflect.NativeMethodAccessorImpl.invoke(NativeMethodAccessorImpl.java:64)
17:40:32 [2021-03-13T22:40:32.989Z] 	at java.base/jdk.internal.reflect.DelegatingMethodAccessorImpl.invoke(DelegatingMethodAccessorImpl.java:43)
17:40:32 [2021-03-13T22:40:32.989Z] 	at java.base/java.lang.reflect.Method.invoke(Method.java:564)
17:40:32 [2021-03-13T22:40:32.989Z] 	at org.apache.maven.surefire.util.ReflectionUtils.invokeMethodWithArray2(ReflectionUtils.java:206)
17:40:32 [2021-03-13T22:40:32.989Z] 	at org.apache.maven.surefire.booter.ProviderFactory$ProviderProxy.invoke(ProviderFactory.java:161)
17:40:32 [2021-03-13T22:40:32.989Z] 	at org.apache.maven.surefire.booter.ProviderFactory.invokeProvider(ProviderFactory.java:84)
17:40:32 [2021-03-13T22:40:32.989Z] 	at org.eclipse.tycho.surefire.osgibooter.OsgiSurefireBooter.run(OsgiSurefireBooter.java:116)
17:40:32 [2021-03-13T22:40:32.989Z] 	at org.eclipse.tycho.surefire.osgibooter.HeadlessTestApplication.start(HeadlessTestApplication.java:23)
17:40:32 [2021-03-13T22:40:32.989Z] 	at org.eclipse.equinox.internal.app.EclipseAppHandle.run(EclipseAppHandle.java:203)
17:40:32 [2021-03-13T22:40:32.989Z] 	at org.eclipse.core.runtime.internal.adaptor.EclipseAppLauncher.runApplication(EclipseAppLauncher.java:137)
17:40:32 [2021-03-13T22:40:32.989Z] 	at org.eclipse.core.runtime.internal.adaptor.EclipseAppLauncher.start(EclipseAppLauncher.java:107)
17:40:32 [2021-03-13T22:40:32.989Z] 	at org.eclipse.core.runtime.adaptor.EclipseStarter.run(EclipseStarter.java:400)
17:40:32 [2021-03-13T22:40:32.989Z] 	at org.eclipse.core.runtime.adaptor.EclipseStarter.run(EclipseStarter.java:255)
17:40:32 [2021-03-13T22:40:32.989Z] 	at java.base/jdk.internal.reflect.NativeMethodAccessorImpl.invoke0(Native Method)
17:40:32 [2021-03-13T22:40:32.989Z] 	at java.base/jdk.internal.reflect.NativeMethodAccessorImpl.invoke(NativeMethodAccessorImpl.java:64)
17:40:32 [2021-03-13T22:40:32.990Z] 	at java.base/jdk.internal.reflect.DelegatingMethodAccessorImpl.invoke(DelegatingMethodAccessorImpl.java:43)
17:40:32 [2021-03-13T22:40:32.990Z] 	at java.base/java.lang.reflect.Method.invoke(Method.java:564)
17:40:32 [2021-03-13T22:40:32.990Z] 	at org.eclipse.equinox.launcher.Main.invokeFramework(Main.java:661)
17:40:32 [2021-03-13T22:40:32.990Z] 	at org.eclipse.equinox.launcher.Main.basicRun(Main.java:597)
17:40:32 [2021-03-13T22:40:32.990Z] 	at org.eclipse.equinox.launcher.Main.run(Main.java:1476)
17:40:32 [2021-03-13T22:40:32.990Z] 	at org.eclipse.equinox.launcher.Main.main(Main.java:1449)
17:40:32 [2021-03-13T22:40:32.990Z] Caused by: java.lang.ClassNotFoundException: org.junit.runners.model.RunnerBuilder cannot be found by org.eclipse.tycho.surefire.osgibooter_2.2.0
17:40:32 [2021-03-13T22:40:32.990Z] 	at org.eclipse.osgi.internal.loader.BundleLoader.findClassInternal(BundleLoader.java:511)
17:40:32 [2021-03-13T22:40:32.990Z] 	at org.eclipse.osgi.internal.loader.BundleLoader.findClass(BundleLoader.java:422)
17:40:32 [2021-03-13T22:40:32.990Z] 	at org.eclipse.osgi.internal.loader.BundleLoader.findClass(BundleLoader.java:414)
17:40:32 [2021-03-13T22:40:32.990Z] 	at org.eclipse.osgi.internal.loader.ModuleClassLoader.loadClass(ModuleClassLoader.java:153)
17:40:32 [2021-03-13T22:40:32.990Z] 	at java.base/java.lang.ClassLoader.loadClass(ClassLoader.java:522)
17:40:32 [2021-03-13T22:40:32.990Z] 	... 31 more
17:40:32 [2021-03-13T22:40:32.990Z] 
17:40:32 [2021-03-13T22:40:32.990Z] Mar 13, 2021 10:40:32 PM org.junit.platform.launcher.core.DefaultLauncher handleThrowable
17:40:32 [2021-03-13T22:40:32.990Z] WARNING: TestEngine with ID 'junit-vintage' failed to discover tests
17:40:32 [2021-03-13T22:40:32.990Z] java.lang.NoClassDefFoundError: org/junit/runners/model/RunnerBuilder
17:40:32 [2021-03-13T22:40:32.990Z] 	at org.junit.vintage.engine.discovery.VintageDiscoverer.<init>(VintageDiscoverer.java:48)
17:40:32 [2021-03-13T22:40:32.990Z] 	at org.junit.vintage.engine.VintageTestEngine.discover(VintageTestEngine.java:65)
17:40:32 [2021-03-13T22:40:32.990Z] 	at org.junit.platform.launcher.core.DefaultLauncher.discoverEngineRoot(DefaultLauncher.java:130)
17:40:32 [2021-03-13T22:40:32.990Z] 	at org.junit.platform.launcher.core.DefaultLauncher.discoverRoot(DefaultLauncher.java:117)
17:40:32 [2021-03-13T22:40:32.990Z] 	at org.junit.platform.launcher.core.DefaultLauncher.discover(DefaultLauncher.java:82)
17:40:32 [2021-03-13T22:40:32.990Z] 	at org.apache.maven.surefire.junitplatform.TestPlanScannerFilter.accept(TestPlanScannerFilter.java:56)
17:40:32 [2021-03-13T22:40:32.990Z] 	at org.apache.maven.surefire.util.DefaultScanResult.applyFilter(DefaultScanResult.java:102)
17:40:32 [2021-03-13T22:40:32.990Z] 	at org.apache.maven.surefire.junitplatform.JUnitPlatformProvider.scanClasspath(JUnitPlatformProvider.java:143)
17:40:32 [2021-03-13T22:40:32.990Z] 	at org.apache.maven.surefire.junitplatform.JUnitPlatformProvider.invoke(JUnitPlatformProvider.java:124)
17:40:32 [2021-03-13T22:40:32.990Z] 	at java.base/jdk.internal.reflect.NativeMethodAccessorImpl.invoke0(Native Method)
17:40:32 [2021-03-13T22:40:32.990Z] 	at java.base/jdk.internal.reflect.NativeMethodAccessorImpl.invoke(NativeMethodAccessorImpl.java:64)
17:40:32 [2021-03-13T22:40:32.990Z] 	at java.base/jdk.internal.reflect.DelegatingMethodAccessorImpl.invoke(DelegatingMethodAccessorImpl.java:43)
17:40:32 [2021-03-13T22:40:32.990Z] 	at java.base/java.lang.reflect.Method.invoke(Method.java:564)
17:40:32 [2021-03-13T22:40:32.990Z] 	at org.apache.maven.surefire.util.ReflectionUtils.invokeMethodWithArray2(ReflectionUtils.java:206)
17:40:32 [2021-03-13T22:40:32.990Z] 	at org.apache.maven.surefire.booter.ProviderFactory$ProviderProxy.invoke(ProviderFactory.java:161)
17:40:32 [2021-03-13T22:40:32.990Z] 	at org.apache.maven.surefire.booter.ProviderFactory.invokeProvider(ProviderFactory.java:84)
17:40:32 [2021-03-13T22:40:32.990Z] 	at org.eclipse.tycho.surefire.osgibooter.OsgiSurefireBooter.run(OsgiSurefireBooter.java:116)
17:40:32 [2021-03-13T22:40:32.990Z] 	at org.eclipse.tycho.surefire.osgibooter.HeadlessTestApplication.start(HeadlessTestApplication.java:23)
17:40:32 [2021-03-13T22:40:32.990Z] 	at org.eclipse.equinox.internal.app.EclipseAppHandle.run(EclipseAppHandle.java:203)
17:40:32 [2021-03-13T22:40:32.990Z] 	at org.eclipse.core.runtime.internal.adaptor.EclipseAppLauncher.runApplication(EclipseAppLauncher.java:137)
17:40:32 [2021-03-13T22:40:32.990Z] 	at org.eclipse.core.runtime.internal.adaptor.EclipseAppLauncher.start(EclipseAppLauncher.java:107)
17:40:32 [2021-03-13T22:40:32.990Z] 	at org.eclipse.core.runtime.adaptor.EclipseStarter.run(EclipseStarter.java:400)
17:40:32 [2021-03-13T22:40:32.990Z] 	at org.eclipse.core.runtime.adaptor.EclipseStarter.run(EclipseStarter.java:255)
17:40:32 [2021-03-13T22:40:32.990Z] 	at java.base/jdk.internal.reflect.NativeMethodAccessorImpl.invoke0(Native Method)
17:40:32 [2021-03-13T22:40:32.990Z] 	at java.base/jdk.internal.reflect.NativeMethodAccessorImpl.invoke(NativeMethodAccessorImpl.java:64)
17:40:32 [2021-03-13T22:40:32.990Z] 	at java.base/jdk.internal.reflect.DelegatingMethodAccessorImpl.invoke(DelegatingMethodAccessorImpl.java:43)
17:40:32 [2021-03-13T22:40:32.990Z] 	at java.base/java.lang.reflect.Method.invoke(Method.java:564)
17:40:32 [2021-03-13T22:40:32.990Z] 	at org.eclipse.equinox.launcher.Main.invokeFramework(Main.java:661)
17:40:32 [2021-03-13T22:40:32.990Z] 	at org.eclipse.equinox.launcher.Main.basicRun(Main.java:597)
17:40:32 [2021-03-13T22:40:32.990Z] 	at org.eclipse.equinox.launcher.Main.run(Main.java:1476)
17:40:32 [2021-03-13T22:40:32.990Z] 	at org.eclipse.equinox.launcher.Main.main(Main.java:1449)
17:40:32 [2021-03-13T22:40:32.990Z] Caused by: java.lang.ClassNotFoundException: org.junit.runners.model.RunnerBuilder cannot be found by org.eclipse.tycho.surefire.osgibooter_2.2.0
17:40:32 [2021-03-13T22:40:32.990Z] 	at org.eclipse.osgi.internal.loader.BundleLoader.findClassInternal(BundleLoader.java:511)
17:40:32 [2021-03-13T22:40:32.990Z] 	at org.eclipse.osgi.internal.loader.BundleLoader.findClass(BundleLoader.java:422)
17:40:32 [2021-03-13T22:40:32.990Z] 	at org.eclipse.osgi.internal.loader.BundleLoader.findClass(BundleLoader.java:414)
17:40:32 [2021-03-13T22:40:32.990Z] 	at org.eclipse.osgi.internal.loader.ModuleClassLoader.loadClass(ModuleClassLoader.java:153)
17:40:32 [2021-03-13T22:40:32.990Z] 	at java.base/java.lang.ClassLoader.loadClass(ClassLoader.java:522)
17:40:32 [2021-03-13T22:40:32.990Z] 	... 31 more
17:40:32 [2021-03-13T22:40:32.990Z] 
17:40:32 [2021-03-13T22:40:32.990Z] Mar 13, 2021 10:40:32 PM org.junit.platform.launcher.core.DefaultLauncher handleThrowable
17:40:32 [2021-03-13T22:40:32.990Z] WARNING: TestEngine with ID 'junit-vintage' failed to discover tests
17:40:32 [2021-03-13T22:40:32.990Z] java.lang.NoClassDefFoundError: org/junit/runners/model/RunnerBuilder
17:40:32 [2021-03-13T22:40:32.990Z] 	at org.junit.vintage.engine.discovery.VintageDiscoverer.<init>(VintageDiscoverer.java:48)
17:40:32 [2021-03-13T22:40:32.990Z] 	at org.junit.vintage.engine.VintageTestEngine.discover(VintageTestEngine.java:65)
17:40:32 [2021-03-13T22:40:32.990Z] 	at org.junit.platform.launcher.core.DefaultLauncher.discoverEngineRoot(DefaultLauncher.java:130)
17:40:32 [2021-03-13T22:40:32.990Z] 	at org.junit.platform.launcher.core.DefaultLauncher.discoverRoot(DefaultLauncher.java:117)
17:40:32 [2021-03-13T22:40:32.990Z] 	at org.junit.platform.launcher.core.DefaultLauncher.execute(DefaultLauncher.java:90)
17:40:32 [2021-03-13T22:40:32.990Z] 	at org.apache.maven.surefire.junitplatform.JUnitPlatformProvider.invokeAllTests(JUnitPlatformProvider.java:150)
17:40:32 [2021-03-13T22:40:32.990Z] 	at org.apache.maven.surefire.junitplatform.JUnitPlatformProvider.invoke(JUnitPlatformProvider.java:124)
17:40:32 [2021-03-13T22:40:32.990Z] 	at java.base/jdk.internal.reflect.NativeMethodAccessorImpl.invoke0(Native Method)
17:40:32 [2021-03-13T22:40:32.990Z] 	at java.base/jdk.internal.reflect.NativeMethodAccessorImpl.invoke(NativeMethodAccessorImpl.java:64)
17:40:32 [2021-03-13T22:40:32.990Z] 	at java.base/jdk.internal.reflect.DelegatingMethodAccessorImpl.invoke(DelegatingMethodAccessorImpl.java:43)
17:40:32 [2021-03-13T22:40:32.990Z] 	at java.base/java.lang.reflect.Method.invoke(Method.java:564)
17:40:32 [2021-03-13T22:40:32.990Z] 	at org.apache.maven.surefire.util.ReflectionUtils.invokeMethodWithArray2(ReflectionUtils.java:206)
17:40:32 [2021-03-13T22:40:32.990Z] 	at org.apache.maven.surefire.booter.ProviderFactory$ProviderProxy.invoke(ProviderFactory.java:161)
17:40:32 [2021-03-13T22:40:32.990Z] 	at org.apache.maven.surefire.booter.ProviderFactory.invokeProvider(ProviderFactory.java:84)
17:40:32 [2021-03-13T22:40:32.990Z] 	at org.eclipse.tycho.surefire.osgibooter.OsgiSurefireBooter.run(OsgiSurefireBooter.java:116)
17:40:32 [2021-03-13T22:40:32.990Z] 	at org.eclipse.tycho.surefire.osgibooter.HeadlessTestApplication.start(HeadlessTestApplication.java:23)
17:40:32 [2021-03-13T22:40:32.991Z] 	at org.eclipse.equinox.internal.app.EclipseAppHandle.run(EclipseAppHandle.java:203)
17:40:32 [2021-03-13T22:40:32.991Z] 	at org.eclipse.core.runtime.internal.adaptor.EclipseAppLauncher.runApplication(EclipseAppLauncher.java:137)
17:40:32 [2021-03-13T22:40:32.991Z] 	at org.eclipse.core.runtime.internal.adaptor.EclipseAppLauncher.start(EclipseAppLauncher.java:107)
17:40:32 [2021-03-13T22:40:32.991Z] 	at org.eclipse.core.runtime.adaptor.EclipseStarter.run(EclipseStarter.java:400)
17:40:32 [2021-03-13T22:40:32.991Z] 	at org.eclipse.core.runtime.adaptor.EclipseStarter.run(EclipseStarter.java:255)
17:40:32 [2021-03-13T22:40:32.991Z] 	at java.base/jdk.internal.reflect.NativeMethodAccessorImpl.invoke0(Native Method)
17:40:32 [2021-03-13T22:40:32.991Z] 	at java.base/jdk.internal.reflect.NativeMethodAccessorImpl.invoke(NativeMethodAccessorImpl.java:64)
17:40:32 [2021-03-13T22:40:32.991Z] 	at java.base/jdk.internal.reflect.DelegatingMethodAccessorImpl.invoke(DelegatingMethodAccessorImpl.java:43)
17:40:32 [2021-03-13T22:40:32.991Z] 	at java.base/java.lang.reflect.Method.invoke(Method.java:564)
17:40:32 [2021-03-13T22:40:32.991Z] 	at org.eclipse.equinox.launcher.Main.invokeFramework(Main.java:661)
17:40:32 [2021-03-13T22:40:32.991Z] 	at org.eclipse.equinox.launcher.Main.basicRun(Main.java:597)
17:40:32 [2021-03-13T22:40:32.991Z] 	at org.eclipse.equinox.launcher.Main.run(Main.java:1476)
17:40:32 [2021-03-13T22:40:32.991Z] 	at org.eclipse.equinox.launcher.Main.main(Main.java:1449)
17:40:32 [2021-03-13T22:40:32.991Z] Caused by: java.lang.ClassNotFoundException: org.junit.runners.model.RunnerBuilder cannot be found by org.eclipse.tycho.surefire.osgibooter_2.2.0
17:40:32 [2021-03-13T22:40:32.991Z] 	at org.eclipse.osgi.internal.loader.BundleLoader.findClassInternal(BundleLoader.java:511)
17:40:32 [2021-03-13T22:40:32.991Z] 	at org.eclipse.osgi.internal.loader.BundleLoader.findClass(BundleLoader.java:422)
17:40:32 [2021-03-13T22:40:32.991Z] 	at org.eclipse.osgi.internal.loader.BundleLoader.findClass(BundleLoader.java:414)
17:40:32 [2021-03-13T22:40:32.991Z] 	at org.eclipse.osgi.internal.loader.ModuleClassLoader.loadClass(ModuleClassLoader.java:153)
17:40:32 [2021-03-13T22:40:32.991Z] 	at java.base/java.lang.ClassLoader.loadClass(ClassLoader.java:522)
17:40:32 [2021-03-13T22:40:32.991Z] 	... 29 more
17:40:32 [2021-03-13T22:40:32.991Z] 
17:40:32 [2021-03-13T22:40:32.991Z] Running org.eclipse.ease.lang.javascript.JavaScriptCodeFactoryTest
17:40:32 [2021-03-13T22:40:32.991Z] Tests run: 1, Failures: 0, Errors: 0, Skipped: 0, Time elapsed: 0.156 s - in org.eclipse.ease.lang.javascript.JavaScriptCodeFactoryTest
17:40:32 [2021-03-13T22:40:32.991Z] testCommentCreator  Time elapsed: 0.149 s
17:40:32 [2021-03-13T22:40:32.991Z] Running org.eclipse.ease.lang.javascript.JavaScriptCompletionContextTest
17:40:33 [2021-03-13T22:40:33.254Z] Tests run: 8, Failures: 0, Errors: 0, Skipped: 0, Time elapsed: 0.329 s - in org.eclipse.ease.lang.javascript.JavaScriptCompletionContextTest
17:40:33 [2021-03-13T22:40:33.254Z] verifyStaticClassTypes  Time elapsed: 0.054 s
17:40:33 [2021-03-13T22:40:33.254Z] verifyClassInstanceTypes  Time elapsed: 0.011 s
17:40:33 [2021-03-13T22:40:33.254Z] verifyTypesForScriptEngine  Time elapsed: 0.258 s
17:40:33 [2021-03-13T22:40:33.254Z] verifyPackageTypes  Time elapsed: 0.001 s
17:40:33 [2021-03-13T22:40:33.254Z] definedVariableTypes  Time elapsed: 0.001 s
17:40:33 [2021-03-13T22:40:33.254Z] verifyStringLiteralTypes  Time elapsed: 0.001 s
17:40:33 [2021-03-13T22:40:33.254Z] verifyUnknownTypes  Time elapsed: 0 s
17:40:33 [2021-03-13T22:40:33.254Z] verifyNoneTypes  Time elapsed: 0.001 s
17:40:33 [2021-03-13T22:40:33.254Z] 
17:40:33 [2021-03-13T22:40:33.254Z] Results:
17:40:33 [2021-03-13T22:40:33.254Z] 
17:40:33 [2021-03-13T22:40:33.254Z] Tests run: 9, Failures: 0, Errors: 0, Skipped: 0
17:40:33 [2021-03-13T22:40:33.254Z] 
17:40:33 [2021-03-13T22:40:33.814Z] [INFO] All tests passed!
17:40:33 [2021-03-13T22:40:33.814Z] [INFO] 
17:40:33 [2021-03-13T22:40:33.814Z] [INFO] ---------< org.eclipse.ease:org.eclipse.ease.lang.python.test >---------
17:40:33 [2021-03-13T22:40:33.814Z] [INFO] Building org.eclipse.ease.lang.python.test 0.8.0-SNAPSHOT          [6/9]
17:40:33 [2021-03-13T22:40:33.814Z] [INFO] ------------------------[ eclipse-test-plugin ]-------------------------
17:40:33 [2021-03-13T22:40:33.814Z] [INFO] 
17:40:33 [2021-03-13T22:40:33.814Z] [INFO] --- tycho-packaging-plugin:2.2.0:build-qualifier (default-build-qualifier) @ org.eclipse.ease.lang.python.test ---
17:40:33 [2021-03-13T22:40:33.814Z] [INFO] The project's OSGi version is 0.8.0.I202103030731
17:40:33 [2021-03-13T22:40:33.814Z] [INFO] 
17:40:33 [2021-03-13T22:40:33.814Z] [INFO] --- tycho-packaging-plugin:2.2.0:validate-id (default-validate-id) @ org.eclipse.ease.lang.python.test ---
17:40:33 [2021-03-13T22:40:33.814Z] [INFO] 
17:40:33 [2021-03-13T22:40:33.814Z] [INFO] --- tycho-packaging-plugin:2.2.0:validate-version (default-validate-version) @ org.eclipse.ease.lang.python.test ---
17:40:33 [2021-03-13T22:40:33.814Z] [INFO] 
17:40:33 [2021-03-13T22:40:33.814Z] [INFO] --- maven-resources-plugin:2.4.3:resources (default-resources) @ org.eclipse.ease.lang.python.test ---
17:40:33 [2021-03-13T22:40:33.814Z] [INFO] Using 'UTF-8' encoding to copy filtered resources.
17:40:33 [2021-03-13T22:40:33.814Z] [INFO] skip non existing resourceDirectory /home/jenkins/agent/workspace/ease.verify.core.target.2019-03/tests/org.eclipse.ease.lang.python.test/src/main/resources
17:40:33 [2021-03-13T22:40:33.814Z] [INFO] 
17:40:33 [2021-03-13T22:40:33.814Z] [INFO] --- tycho-compiler-plugin:2.2.0:compile (default-compile) @ org.eclipse.ease.lang.python.test ---
17:40:33 [2021-03-13T22:40:33.814Z] [INFO] Nothing to compile - all classes are up to date
17:40:33 [2021-03-13T22:40:33.814Z] [INFO] 
17:40:33 [2021-03-13T22:40:33.814Z] [INFO] --- maven-resources-plugin:2.4.3:testResources (default-testResources) @ org.eclipse.ease.lang.python.test ---
17:40:33 [2021-03-13T22:40:33.814Z] [INFO] Using 'UTF-8' encoding to copy filtered resources.
17:40:33 [2021-03-13T22:40:33.814Z] [INFO] skip non existing resourceDirectory /home/jenkins/agent/workspace/ease.verify.core.target.2019-03/tests/org.eclipse.ease.lang.python.test/src/test/resources
17:40:33 [2021-03-13T22:40:33.814Z] [INFO] 
17:40:33 [2021-03-13T22:40:33.814Z] [INFO] --- target-platform-configuration:2.2.0:target-platform (default-target-platform) @ org.eclipse.ease.lang.python.test ---
17:40:33 [2021-03-13T22:40:33.814Z] [INFO] 
17:40:33 [2021-03-13T22:40:33.814Z] [INFO] --- tycho-packaging-plugin:2.2.0:package-plugin (default-package-plugin) @ org.eclipse.ease.lang.python.test ---
17:40:33 [2021-03-13T22:40:33.815Z] [INFO] Building jar: /home/jenkins/agent/workspace/ease.verify.core.target.2019-03/tests/org.eclipse.ease.lang.python.test/target/org.eclipse.ease.lang.python.test-0.8.0-SNAPSHOT.jar
17:40:33 [2021-03-13T22:40:33.815Z] [INFO] 
17:40:33 [2021-03-13T22:40:33.815Z] [INFO] --- tycho-p2-plugin:2.2.0:p2-metadata-default (default-p2-metadata-default) @ org.eclipse.ease.lang.python.test ---
17:40:33 [2021-03-13T22:40:33.815Z] [INFO] 
17:40:33 [2021-03-13T22:40:33.815Z] [INFO] --- jacoco-maven-plugin:0.8.6:prepare-agent (jacoco-initialize) @ org.eclipse.ease.lang.python.test ---
17:40:33 [2021-03-13T22:40:33.815Z] [INFO] tycho.testArgLine set to -javaagent:/home/jenkins/.m2/repository/org/jacoco/org.jacoco.agent/0.8.6/org.jacoco.agent-0.8.6-runtime.jar=destfile=/home/jenkins/agent/workspace/ease.verify.core.target.2019-03/tests/org.eclipse.ease.lang.python.test/target/jacoco.exec,output=file
17:40:33 [2021-03-13T22:40:33.815Z] [INFO] 
17:40:33 [2021-03-13T22:40:33.815Z] [INFO] --- tycho-surefire-plugin:2.2.0:test (default-test) @ org.eclipse.ease.lang.python.test ---
17:40:34 [2021-03-13T22:40:34.070Z] [INFO] Executing Test Runtime with timeout 0, logs (if any) will be placed at: /home/jenkins/agent/workspace/ease.verify.core.target.2019-03/tests/org.eclipse.ease.lang.python.test/target/work/data/.metadata/.log
17:40:34 [2021-03-13T22:40:34.070Z] [INFO] Command line:
17:40:34 [2021-03-13T22:40:34.070Z] 	[/opt/tools/java/openjdk/jdk-15/15.0.2+7/bin/java, -Dosgi.noShutdown=false, -Dosgi.os=linux, -Dosgi.ws=gtk, -Dosgi.arch=x86_64, -javaagent:/home/jenkins/.m2/repository/org/jacoco/org.jacoco.agent/0.8.6/org.jacoco.agent-0.8.6-runtime.jar=destfile=/home/jenkins/agent/workspace/ease.verify.core.target.2019-03/tests/org.eclipse.ease.lang.python.test/target/jacoco.exec,output=file, -Dosgi.clean=true, -jar, /home/jenkins/.m2/repository/p2/osgi/bundle/org.eclipse.equinox.launcher/1.5.300.v20190213-1655/org.eclipse.equinox.launcher-1.5.300.v20190213-1655.jar, -data, /home/jenkins/agent/workspace/ease.verify.core.target.2019-03/tests/org.eclipse.ease.lang.python.test/target/work/data, -install, /home/jenkins/agent/workspace/ease.verify.core.target.2019-03/tests/org.eclipse.ease.lang.python.test/target/work, -configuration, /home/jenkins/agent/workspace/ease.verify.core.target.2019-03/tests/org.eclipse.ease.lang.python.test/target/work/configuration, -application, org.eclipse.tycho.surefire.osgibooter.headlesstest, -testproperties, /home/jenkins/agent/workspace/ease.verify.core.target.2019-03/tests/org.eclipse.ease.lang.python.test/target/surefire.properties]
17:40:34 [2021-03-13T22:40:34.071Z] Picked up JAVA_TOOL_OPTIONS: -Dmaven.ext.class.path="/home/jenkins/agent/workspace/ease.verify.core.target.2019-03@tmp/withMavenf02f74e7/pipeline-maven-spy.jar" -Dorg.jenkinsci.plugins.pipeline.maven.reportsFolder="/home/jenkins/agent/workspace/ease.verify.core.target.2019-03@tmp/withMavenf02f74e7" 
17:40:36 [2021-03-13T22:40:36.584Z] Mar 13, 2021 10:40:36 PM org.junit.platform.launcher.core.DefaultLauncher handleThrowable
17:40:36 [2021-03-13T22:40:36.584Z] WARNING: TestEngine with ID 'junit-vintage' failed to discover tests
17:40:36 [2021-03-13T22:40:36.584Z] java.lang.NoClassDefFoundError: org/junit/runners/model/RunnerBuilder
17:40:36 [2021-03-13T22:40:36.584Z] 	at org.junit.vintage.engine.discovery.VintageDiscoverer.<init>(VintageDiscoverer.java:48)
17:40:36 [2021-03-13T22:40:36.585Z] 	at org.junit.vintage.engine.VintageTestEngine.discover(VintageTestEngine.java:65)
17:40:36 [2021-03-13T22:40:36.585Z] 	at org.junit.platform.launcher.core.DefaultLauncher.discoverEngineRoot(DefaultLauncher.java:130)
17:40:36 [2021-03-13T22:40:36.585Z] 	at org.junit.platform.launcher.core.DefaultLauncher.discoverRoot(DefaultLauncher.java:117)
17:40:36 [2021-03-13T22:40:36.585Z] 	at org.junit.platform.launcher.core.DefaultLauncher.discover(DefaultLauncher.java:82)
17:40:36 [2021-03-13T22:40:36.585Z] 	at org.apache.maven.surefire.junitplatform.TestPlanScannerFilter.accept(TestPlanScannerFilter.java:56)
17:40:36 [2021-03-13T22:40:36.585Z] 	at org.apache.maven.surefire.util.DefaultScanResult.applyFilter(DefaultScanResult.java:102)
17:40:36 [2021-03-13T22:40:36.585Z] 	at org.apache.maven.surefire.junitplatform.JUnitPlatformProvider.scanClasspath(JUnitPlatformProvider.java:143)
17:40:36 [2021-03-13T22:40:36.585Z] 	at org.apache.maven.surefire.junitplatform.JUnitPlatformProvider.invoke(JUnitPlatformProvider.java:124)
17:40:36 [2021-03-13T22:40:36.585Z] 	at java.base/jdk.internal.reflect.NativeMethodAccessorImpl.invoke0(Native Method)
17:40:36 [2021-03-13T22:40:36.585Z] 	at java.base/jdk.internal.reflect.NativeMethodAccessorImpl.invoke(NativeMethodAccessorImpl.java:64)
17:40:36 [2021-03-13T22:40:36.585Z] 	at java.base/jdk.internal.reflect.DelegatingMethodAccessorImpl.invoke(DelegatingMethodAccessorImpl.java:43)
17:40:36 [2021-03-13T22:40:36.585Z] 	at java.base/java.lang.reflect.Method.invoke(Method.java:564)
17:40:36 [2021-03-13T22:40:36.585Z] 	at org.apache.maven.surefire.util.ReflectionUtils.invokeMethodWithArray2(ReflectionUtils.java:206)
17:40:36 [2021-03-13T22:40:36.585Z] 	at org.apache.maven.surefire.booter.ProviderFactory$ProviderProxy.invoke(ProviderFactory.java:161)
17:40:36 [2021-03-13T22:40:36.585Z] 	at org.apache.maven.surefire.booter.ProviderFactory.invokeProvider(ProviderFactory.java:84)
17:40:36 [2021-03-13T22:40:36.585Z] 	at org.eclipse.tycho.surefire.osgibooter.OsgiSurefireBooter.run(OsgiSurefireBooter.java:116)
17:40:36 [2021-03-13T22:40:36.585Z] 	at org.eclipse.tycho.surefire.osgibooter.HeadlessTestApplication.start(HeadlessTestApplication.java:23)
17:40:36 [2021-03-13T22:40:36.585Z] 	at org.eclipse.equinox.internal.app.EclipseAppHandle.run(EclipseAppHandle.java:203)
17:40:36 [2021-03-13T22:40:36.585Z] 	at org.eclipse.core.runtime.internal.adaptor.EclipseAppLauncher.runApplication(EclipseAppLauncher.java:137)
17:40:36 [2021-03-13T22:40:36.585Z] 	at org.eclipse.core.runtime.internal.adaptor.EclipseAppLauncher.start(EclipseAppLauncher.java:107)
17:40:36 [2021-03-13T22:40:36.585Z] 	at org.eclipse.core.runtime.adaptor.EclipseStarter.run(EclipseStarter.java:400)
17:40:36 [2021-03-13T22:40:36.585Z] 	at org.eclipse.core.runtime.adaptor.EclipseStarter.run(EclipseStarter.java:255)
17:40:36 [2021-03-13T22:40:36.585Z] 	at java.base/jdk.internal.reflect.NativeMethodAccessorImpl.invoke0(Native Method)
17:40:36 [2021-03-13T22:40:36.585Z] 	at java.base/jdk.internal.reflect.NativeMethodAccessorImpl.invoke(NativeMethodAccessorImpl.java:64)
17:40:36 [2021-03-13T22:40:36.585Z] 	at java.base/jdk.internal.reflect.DelegatingMethodAccessorImpl.invoke(DelegatingMethodAccessorImpl.java:43)
17:40:36 [2021-03-13T22:40:36.585Z] 	at java.base/java.lang.reflect.Method.invoke(Method.java:564)
17:40:36 [2021-03-13T22:40:36.585Z] 	at org.eclipse.equinox.launcher.Main.invokeFramework(Main.java:661)
17:40:36 [2021-03-13T22:40:36.585Z] 	at org.eclipse.equinox.launcher.Main.basicRun(Main.java:597)
17:40:36 [2021-03-13T22:40:36.585Z] 	at org.eclipse.equinox.launcher.Main.run(Main.java:1476)
17:40:36 [2021-03-13T22:40:36.585Z] 	at org.eclipse.equinox.launcher.Main.main(Main.java:1449)
17:40:36 [2021-03-13T22:40:36.585Z] Caused by: java.lang.ClassNotFoundException: org.junit.runners.model.RunnerBuilder cannot be found by org.eclipse.tycho.surefire.osgibooter_2.2.0
17:40:36 [2021-03-13T22:40:36.585Z] 	at org.eclipse.osgi.internal.loader.BundleLoader.findClassInternal(BundleLoader.java:511)
17:40:36 [2021-03-13T22:40:36.585Z] 	at org.eclipse.osgi.internal.loader.BundleLoader.findClass(BundleLoader.java:422)
17:40:36 [2021-03-13T22:40:36.585Z] 	at org.eclipse.osgi.internal.loader.BundleLoader.findClass(BundleLoader.java:414)
17:40:36 [2021-03-13T22:40:36.585Z] 	at org.eclipse.osgi.internal.loader.ModuleClassLoader.loadClass(ModuleClassLoader.java:153)
17:40:36 [2021-03-13T22:40:36.585Z] 	at java.base/java.lang.ClassLoader.loadClass(ClassLoader.java:522)
17:40:36 [2021-03-13T22:40:36.585Z] 	... 31 more
17:40:36 [2021-03-13T22:40:36.585Z] 
17:40:36 [2021-03-13T22:40:36.585Z] Mar 13, 2021 10:40:36 PM org.junit.platform.launcher.core.DefaultLauncher handleThrowable
17:40:36 [2021-03-13T22:40:36.585Z] WARNING: TestEngine with ID 'junit-vintage' failed to discover tests
17:40:36 [2021-03-13T22:40:36.585Z] java.lang.NoClassDefFoundError: org/junit/runners/model/RunnerBuilder
17:40:36 [2021-03-13T22:40:36.585Z] 	at org.junit.vintage.engine.discovery.VintageDiscoverer.<init>(VintageDiscoverer.java:48)
17:40:36 [2021-03-13T22:40:36.585Z] 	at org.junit.vintage.engine.VintageTestEngine.discover(VintageTestEngine.java:65)
17:40:36 [2021-03-13T22:40:36.585Z] 	at org.junit.platform.launcher.core.DefaultLauncher.discoverEngineRoot(DefaultLauncher.java:130)
17:40:36 [2021-03-13T22:40:36.585Z] 	at org.junit.platform.launcher.core.DefaultLauncher.discoverRoot(DefaultLauncher.java:117)
17:40:36 [2021-03-13T22:40:36.585Z] 	at org.junit.platform.launcher.core.DefaultLauncher.execute(DefaultLauncher.java:90)
17:40:36 [2021-03-13T22:40:36.585Z] 	at org.apache.maven.surefire.junitplatform.JUnitPlatformProvider.invokeAllTests(JUnitPlatformProvider.java:150)
17:40:36 [2021-03-13T22:40:36.585Z] 	at org.apache.maven.surefire.junitplatform.JUnitPlatformProvider.invoke(JUnitPlatformProvider.java:124)
17:40:36 [2021-03-13T22:40:36.585Z] 	at java.base/jdk.internal.reflect.NativeMethodAccessorImpl.invoke0(Native Method)
17:40:36 [2021-03-13T22:40:36.585Z] 	at java.base/jdk.internal.reflect.NativeMethodAccessorImpl.invoke(NativeMethodAccessorImpl.java:64)
17:40:36 [2021-03-13T22:40:36.585Z] 	at java.base/jdk.internal.reflect.DelegatingMethodAccessorImpl.invoke(DelegatingMethodAccessorImpl.java:43)
17:40:36 [2021-03-13T22:40:36.585Z] 	at java.base/java.lang.reflect.Method.invoke(Method.java:564)
17:40:36 [2021-03-13T22:40:36.585Z] 	at org.apache.maven.surefire.util.ReflectionUtils.invokeMethodWithArray2(ReflectionUtils.java:206)
17:40:36 [2021-03-13T22:40:36.585Z] 	at org.apache.maven.surefire.booter.ProviderFactory$ProviderProxy.invoke(ProviderFactory.java:161)
17:40:36 [2021-03-13T22:40:36.585Z] 	at org.apache.maven.surefire.booter.ProviderFactory.invokeProvider(ProviderFactory.java:84)
17:40:36 [2021-03-13T22:40:36.585Z] 	at org.eclipse.tycho.surefire.osgibooter.OsgiSurefireBooter.run(OsgiSurefireBooter.java:116)
17:40:36 [2021-03-13T22:40:36.585Z] 	at org.eclipse.tycho.surefire.osgibooter.HeadlessTestApplication.start(HeadlessTestApplication.java:23)
17:40:36 [2021-03-13T22:40:36.585Z] 	at org.eclipse.equinox.internal.app.EclipseAppHandle.run(EclipseAppHandle.java:203)
17:40:36 [2021-03-13T22:40:36.585Z] 	at org.eclipse.core.runtime.internal.adaptor.EclipseAppLauncher.runApplication(EclipseAppLauncher.java:137)
17:40:36 [2021-03-13T22:40:36.585Z] 	at org.eclipse.core.runtime.internal.adaptor.EclipseAppLauncher.start(EclipseAppLauncher.java:107)
17:40:36 [2021-03-13T22:40:36.585Z] 	at org.eclipse.core.runtime.adaptor.EclipseStarter.run(EclipseStarter.java:400)
17:40:36 [2021-03-13T22:40:36.585Z] 	at org.eclipse.core.runtime.adaptor.EclipseStarter.run(EclipseStarter.java:255)
17:40:36 [2021-03-13T22:40:36.585Z] 	at java.base/jdk.internal.reflect.NativeMethodAccessorImpl.invoke0(Native Method)
17:40:36 [2021-03-13T22:40:36.585Z] 	at java.base/jdk.internal.reflect.NativeMethodAccessorImpl.invoke(NativeMethodAccessorImpl.java:64)
17:40:36 [2021-03-13T22:40:36.585Z] 	at java.base/jdk.internal.reflect.DelegatingMethodAccessorImpl.invoke(DelegatingMethodAccessorImpl.java:43)
17:40:36 [2021-03-13T22:40:36.585Z] 	at java.base/java.lang.reflect.Method.invoke(Method.java:564)
17:40:36 [2021-03-13T22:40:36.585Z] 	at org.eclipse.equinox.launcher.Main.invokeFramework(Main.java:661)
17:40:36 [2021-03-13T22:40:36.585Z] 	at org.eclipse.equinox.launcher.Main.basicRun(Main.java:597)
17:40:36 [2021-03-13T22:40:36.585Z] 	at org.eclipse.equinox.launcher.Main.run(Main.java:1476)
17:40:36 [2021-03-13T22:40:36.585Z] 	at org.eclipse.equinox.launcher.Main.main(Main.java:1449)
17:40:36 [2021-03-13T22:40:36.585Z] Caused by: java.lang.ClassNotFoundException: org.junit.runners.model.RunnerBuilder cannot be found by org.eclipse.tycho.surefire.osgibooter_2.2.0
17:40:36 [2021-03-13T22:40:36.585Z] 	at org.eclipse.osgi.internal.loader.BundleLoader.findClassInternal(BundleLoader.java:511)
17:40:36 [2021-03-13T22:40:36.585Z] 	at org.eclipse.osgi.internal.loader.BundleLoader.findClass(BundleLoader.java:422)
17:40:36 [2021-03-13T22:40:36.586Z] 	at org.eclipse.osgi.internal.loader.BundleLoader.findClass(BundleLoader.java:414)
17:40:36 [2021-03-13T22:40:36.586Z] 	at org.eclipse.osgi.internal.loader.ModuleClassLoader.loadClass(ModuleClassLoader.java:153)
17:40:36 [2021-03-13T22:40:36.586Z] 	at java.base/java.lang.ClassLoader.loadClass(ClassLoader.java:522)
17:40:36 [2021-03-13T22:40:36.586Z] 	... 29 more
17:40:36 [2021-03-13T22:40:36.586Z] 
17:40:36 [2021-03-13T22:40:36.586Z] Running org.eclipse.ease.lang.python.PythonCodeFactoryTest
17:40:36 [2021-03-13T22:40:36.586Z] Tests run: 1, Failures: 0, Errors: 0, Skipped: 0, Time elapsed: 0.062 s - in org.eclipse.ease.lang.python.PythonCodeFactoryTest
17:40:36 [2021-03-13T22:40:36.586Z] testCommentCreator  Time elapsed: 0.056 s
17:40:36 [2021-03-13T22:40:36.586Z] 
17:40:36 [2021-03-13T22:40:36.586Z] Results:
17:40:36 [2021-03-13T22:40:36.586Z] 
17:40:36 [2021-03-13T22:40:36.586Z] Tests run: 1, Failures: 0, Errors: 0, Skipped: 0
17:40:36 [2021-03-13T22:40:36.586Z] 
17:40:36 [2021-03-13T22:40:36.841Z] [INFO] All tests passed!
17:40:36 [2021-03-13T22:40:36.841Z] [INFO] 
17:40:36 [2021-03-13T22:40:36.841Z] [INFO] -----< org.eclipse.ease:org.eclipse.ease.lang.python.jython.test >------
17:40:36 [2021-03-13T22:40:36.841Z] [INFO] Building org.eclipse.ease.lang.python.jython.test 0.8.0-SNAPSHOT   [7/9]
17:40:36 [2021-03-13T22:40:36.841Z] [INFO] ------------------------[ eclipse-test-plugin ]-------------------------
17:40:36 [2021-03-13T22:40:36.841Z] [INFO] 
17:40:36 [2021-03-13T22:40:36.841Z] [INFO] --- tycho-packaging-plugin:2.2.0:build-qualifier (default-build-qualifier) @ org.eclipse.ease.lang.python.jython.test ---
17:40:36 [2021-03-13T22:40:36.841Z] [INFO] The project's OSGi version is 0.8.0.I202103030731
17:40:36 [2021-03-13T22:40:36.841Z] [INFO] 
17:40:36 [2021-03-13T22:40:36.841Z] [INFO] --- tycho-packaging-plugin:2.2.0:validate-id (default-validate-id) @ org.eclipse.ease.lang.python.jython.test ---
17:40:36 [2021-03-13T22:40:36.841Z] [INFO] 
17:40:36 [2021-03-13T22:40:36.841Z] [INFO] --- tycho-packaging-plugin:2.2.0:validate-version (default-validate-version) @ org.eclipse.ease.lang.python.jython.test ---
17:40:36 [2021-03-13T22:40:36.841Z] [INFO] 
17:40:36 [2021-03-13T22:40:36.841Z] [INFO] --- maven-resources-plugin:2.4.3:resources (default-resources) @ org.eclipse.ease.lang.python.jython.test ---
17:40:36 [2021-03-13T22:40:36.841Z] [INFO] Using 'UTF-8' encoding to copy filtered resources.
17:40:36 [2021-03-13T22:40:36.841Z] [INFO] skip non existing resourceDirectory /home/jenkins/agent/workspace/ease.verify.core.target.2019-03/tests/org.eclipse.ease.lang.python.jython.test/src/main/resources
17:40:36 [2021-03-13T22:40:36.841Z] [INFO] 
17:40:36 [2021-03-13T22:40:36.841Z] [INFO] --- tycho-compiler-plugin:2.2.0:compile (default-compile) @ org.eclipse.ease.lang.python.jython.test ---
17:40:36 [2021-03-13T22:40:36.841Z] [INFO] Nothing to compile - all classes are up to date
17:40:36 [2021-03-13T22:40:36.841Z] [INFO] 
17:40:36 [2021-03-13T22:40:36.841Z] [INFO] --- maven-resources-plugin:2.4.3:testResources (default-testResources) @ org.eclipse.ease.lang.python.jython.test ---
17:40:36 [2021-03-13T22:40:36.841Z] [INFO] Using 'UTF-8' encoding to copy filtered resources.
17:40:36 [2021-03-13T22:40:36.841Z] [INFO] skip non existing resourceDirectory /home/jenkins/agent/workspace/ease.verify.core.target.2019-03/tests/org.eclipse.ease.lang.python.jython.test/src/test/resources
17:40:36 [2021-03-13T22:40:36.841Z] [INFO] 
17:40:36 [2021-03-13T22:40:36.841Z] [INFO] --- target-platform-configuration:2.2.0:target-platform (default-target-platform) @ org.eclipse.ease.lang.python.jython.test ---
17:40:36 [2021-03-13T22:40:36.841Z] [INFO] 
17:40:36 [2021-03-13T22:40:36.841Z] [INFO] --- tycho-packaging-plugin:2.2.0:package-plugin (default-package-plugin) @ org.eclipse.ease.lang.python.jython.test ---
17:40:36 [2021-03-13T22:40:36.841Z] [INFO] Building jar: /home/jenkins/agent/workspace/ease.verify.core.target.2019-03/tests/org.eclipse.ease.lang.python.jython.test/target/org.eclipse.ease.lang.python.jython.test-0.8.0-SNAPSHOT.jar
17:40:36 [2021-03-13T22:40:36.841Z] [INFO] 
17:40:36 [2021-03-13T22:40:36.841Z] [INFO] --- tycho-p2-plugin:2.2.0:p2-metadata-default (default-p2-metadata-default) @ org.eclipse.ease.lang.python.jython.test ---
17:40:36 [2021-03-13T22:40:36.841Z] [INFO] 
17:40:36 [2021-03-13T22:40:36.841Z] [INFO] --- jacoco-maven-plugin:0.8.6:prepare-agent (jacoco-initialize) @ org.eclipse.ease.lang.python.jython.test ---
17:40:36 [2021-03-13T22:40:36.841Z] [INFO] tycho.testArgLine set to -javaagent:/home/jenkins/.m2/repository/org/jacoco/org.jacoco.agent/0.8.6/org.jacoco.agent-0.8.6-runtime.jar=destfile=/home/jenkins/agent/workspace/ease.verify.core.target.2019-03/tests/org.eclipse.ease.lang.python.jython.test/target/jacoco.exec,output=file
17:40:36 [2021-03-13T22:40:36.841Z] [INFO] 
17:40:36 [2021-03-13T22:40:36.841Z] [INFO] --- tycho-surefire-plugin:2.2.0:test (default-test) @ org.eclipse.ease.lang.python.jython.test ---
17:40:37 [2021-03-13T22:40:37.402Z] [INFO] Executing Test Runtime with timeout 0, logs (if any) will be placed at: /home/jenkins/agent/workspace/ease.verify.core.target.2019-03/tests/org.eclipse.ease.lang.python.jython.test/target/work/data/.metadata/.log
17:40:37 [2021-03-13T22:40:37.402Z] [INFO] Command line:
17:40:37 [2021-03-13T22:40:37.402Z] 	[/opt/tools/java/openjdk/jdk-15/15.0.2+7/bin/java, -Dosgi.noShutdown=false, -Dosgi.os=linux, -Dosgi.ws=gtk, -Dosgi.arch=x86_64, -javaagent:/home/jenkins/.m2/repository/org/jacoco/org.jacoco.agent/0.8.6/org.jacoco.agent-0.8.6-runtime.jar=destfile=/home/jenkins/agent/workspace/ease.verify.core.target.2019-03/tests/org.eclipse.ease.lang.python.jython.test/target/jacoco.exec,output=file, -Dosgi.clean=true, -jar, /home/jenkins/.m2/repository/p2/osgi/bundle/org.eclipse.equinox.launcher/1.5.300.v20190213-1655/org.eclipse.equinox.launcher-1.5.300.v20190213-1655.jar, -data, /home/jenkins/agent/workspace/ease.verify.core.target.2019-03/tests/org.eclipse.ease.lang.python.jython.test/target/work/data, -install, /home/jenkins/agent/workspace/ease.verify.core.target.2019-03/tests/org.eclipse.ease.lang.python.jython.test/target/work, -configuration, /home/jenkins/agent/workspace/ease.verify.core.target.2019-03/tests/org.eclipse.ease.lang.python.jython.test/target/work/configuration, -application, org.eclipse.tycho.surefire.osgibooter.headlesstest, -testproperties, /home/jenkins/agent/workspace/ease.verify.core.target.2019-03/tests/org.eclipse.ease.lang.python.jython.test/target/surefire.properties]
17:40:37 [2021-03-13T22:40:37.402Z] Picked up JAVA_TOOL_OPTIONS: -Dmaven.ext.class.path="/home/jenkins/agent/workspace/ease.verify.core.target.2019-03@tmp/withMavenf02f74e7/pipeline-maven-spy.jar" -Dorg.jenkinsci.plugins.pipeline.maven.reportsFolder="/home/jenkins/agent/workspace/ease.verify.core.target.2019-03@tmp/withMavenf02f74e7" 
17:40:40 [2021-03-13T22:40:40.702Z] WARNING: An illegal reflective access operation has occurred
17:40:40 [2021-03-13T22:40:40.702Z] WARNING: Illegal reflective access by org.python.core.PySystemState (file:/home/jenkins/agent/workspace/ease.verify.core.target.2019-03/tests/org.eclipse.ease.lang.python.jython.test/target/work/plugins/org.jython_2.7.0.I201609090924/jython.jar) to method java.io.Console.encoding()
17:40:40 [2021-03-13T22:40:40.702Z] WARNING: Please consider reporting this to the maintainers of org.python.core.PySystemState
17:40:40 [2021-03-13T22:40:40.702Z] WARNING: Use --illegal-access=warn to enable warnings of further illegal reflective access operations
17:40:40 [2021-03-13T22:40:40.702Z] WARNING: All illegal access operations will be denied in a future release
17:40:40 [2021-03-13T22:40:40.958Z] Mar 13, 2021 10:40:40 PM org.junit.platform.launcher.core.DefaultLauncher handleThrowable
17:40:40 [2021-03-13T22:40:40.958Z] WARNING: TestEngine with ID 'junit-vintage' failed to discover tests
17:40:40 [2021-03-13T22:40:40.958Z] java.lang.NoClassDefFoundError: org/junit/runners/model/RunnerBuilder
17:40:40 [2021-03-13T22:40:40.958Z] 	at org.junit.vintage.engine.discovery.VintageDiscoverer.<init>(VintageDiscoverer.java:48)
17:40:40 [2021-03-13T22:40:40.958Z] 	at org.junit.vintage.engine.VintageTestEngine.discover(VintageTestEngine.java:65)
17:40:40 [2021-03-13T22:40:40.959Z] 	at org.junit.platform.launcher.core.DefaultLauncher.discoverEngineRoot(DefaultLauncher.java:130)
17:40:40 [2021-03-13T22:40:40.959Z] 	at org.junit.platform.launcher.core.DefaultLauncher.discoverRoot(DefaultLauncher.java:117)
17:40:40 [2021-03-13T22:40:40.959Z] 	at org.junit.platform.launcher.core.DefaultLauncher.discover(DefaultLauncher.java:82)
17:40:40 [2021-03-13T22:40:40.959Z] 	at org.apache.maven.surefire.junitplatform.TestPlanScannerFilter.accept(TestPlanScannerFilter.java:56)
17:40:40 [2021-03-13T22:40:40.959Z] 	at org.apache.maven.surefire.util.DefaultScanResult.applyFilter(DefaultScanResult.java:102)
17:40:40 [2021-03-13T22:40:40.959Z] 	at org.apache.maven.surefire.junitplatform.JUnitPlatformProvider.scanClasspath(JUnitPlatformProvider.java:143)
17:40:40 [2021-03-13T22:40:40.959Z] 	at org.apache.maven.surefire.junitplatform.JUnitPlatformProvider.invoke(JUnitPlatformProvider.java:124)
17:40:40 [2021-03-13T22:40:40.959Z] 	at java.base/jdk.internal.reflect.NativeMethodAccessorImpl.invoke0(Native Method)
17:40:40 [2021-03-13T22:40:40.959Z] 	at java.base/jdk.internal.reflect.NativeMethodAccessorImpl.invoke(NativeMethodAccessorImpl.java:64)
17:40:40 [2021-03-13T22:40:40.959Z] 	at java.base/jdk.internal.reflect.DelegatingMethodAccessorImpl.invoke(DelegatingMethodAccessorImpl.java:43)
17:40:40 [2021-03-13T22:40:40.959Z] 	at java.base/java.lang.reflect.Method.invoke(Method.java:564)
17:40:40 [2021-03-13T22:40:40.959Z] 	at org.apache.maven.surefire.util.ReflectionUtils.invokeMethodWithArray2(ReflectionUtils.java:206)
17:40:40 [2021-03-13T22:40:40.959Z] 	at org.apache.maven.surefire.booter.ProviderFactory$ProviderProxy.invoke(ProviderFactory.java:161)
17:40:40 [2021-03-13T22:40:40.959Z] 	at org.apache.maven.surefire.booter.ProviderFactory.invokeProvider(ProviderFactory.java:84)
17:40:40 [2021-03-13T22:40:40.959Z] 	at org.eclipse.tycho.surefire.osgibooter.OsgiSurefireBooter.run(OsgiSurefireBooter.java:116)
17:40:40 [2021-03-13T22:40:40.959Z] 	at org.eclipse.tycho.surefire.osgibooter.HeadlessTestApplication.start(HeadlessTestApplication.java:23)
17:40:40 [2021-03-13T22:40:40.959Z] 	at org.eclipse.equinox.internal.app.EclipseAppHandle.run(EclipseAppHandle.java:203)
17:40:40 [2021-03-13T22:40:40.959Z] 	at org.eclipse.core.runtime.internal.adaptor.EclipseAppLauncher.runApplication(EclipseAppLauncher.java:137)
17:40:40 [2021-03-13T22:40:40.959Z] 	at org.eclipse.core.runtime.internal.adaptor.EclipseAppLauncher.start(EclipseAppLauncher.java:107)
17:40:40 [2021-03-13T22:40:40.959Z] 	at org.eclipse.core.runtime.adaptor.EclipseStarter.run(EclipseStarter.java:400)
17:40:40 [2021-03-13T22:40:40.959Z] 	at org.eclipse.core.runtime.adaptor.EclipseStarter.run(EclipseStarter.java:255)
17:40:40 [2021-03-13T22:40:40.959Z] 	at java.base/jdk.internal.reflect.NativeMethodAccessorImpl.invoke0(Native Method)
17:40:40 [2021-03-13T22:40:40.959Z] 	at java.base/jdk.internal.reflect.NativeMethodAccessorImpl.invoke(NativeMethodAccessorImpl.java:64)
17:40:40 [2021-03-13T22:40:40.959Z] 	at java.base/jdk.internal.reflect.DelegatingMethodAccessorImpl.invoke(DelegatingMethodAccessorImpl.java:43)
17:40:40 [2021-03-13T22:40:40.959Z] 	at java.base/java.lang.reflect.Method.invoke(Method.java:564)
17:40:40 [2021-03-13T22:40:40.959Z] 	at org.eclipse.equinox.launcher.Main.invokeFramework(Main.java:661)
17:40:40 [2021-03-13T22:40:40.959Z] 	at org.eclipse.equinox.launcher.Main.basicRun(Main.java:597)
17:40:40 [2021-03-13T22:40:40.959Z] 	at org.eclipse.equinox.launcher.Main.run(Main.java:1476)
17:40:40 [2021-03-13T22:40:40.959Z] 	at org.eclipse.equinox.launcher.Main.main(Main.java:1449)
17:40:40 [2021-03-13T22:40:40.959Z] Caused by: java.lang.ClassNotFoundException: org.junit.runners.model.RunnerBuilder cannot be found by org.eclipse.tycho.surefire.osgibooter_2.2.0
17:40:40 [2021-03-13T22:40:40.959Z] 	at org.eclipse.osgi.internal.loader.BundleLoader.findClassInternal(BundleLoader.java:511)
17:40:40 [2021-03-13T22:40:40.959Z] 	at org.eclipse.osgi.internal.loader.BundleLoader.findClass(BundleLoader.java:422)
17:40:40 [2021-03-13T22:40:40.959Z] 	at org.eclipse.osgi.internal.loader.BundleLoader.findClass(BundleLoader.java:414)
17:40:40 [2021-03-13T22:40:40.959Z] 	at org.eclipse.osgi.internal.loader.ModuleClassLoader.loadClass(ModuleClassLoader.java:153)
17:40:40 [2021-03-13T22:40:40.959Z] 	at java.base/java.lang.ClassLoader.loadClass(ClassLoader.java:522)
17:40:40 [2021-03-13T22:40:40.959Z] 	... 31 more
17:40:40 [2021-03-13T22:40:40.959Z] 
17:40:40 [2021-03-13T22:40:40.959Z] Mar 13, 2021 10:40:40 PM org.junit.platform.launcher.core.DefaultLauncher handleThrowable
17:40:40 [2021-03-13T22:40:40.959Z] WARNING: TestEngine with ID 'junit-vintage' failed to discover tests
17:40:40 [2021-03-13T22:40:40.959Z] java.lang.NoClassDefFoundError: org/junit/runners/model/RunnerBuilder
17:40:40 [2021-03-13T22:40:40.959Z] 	at org.junit.vintage.engine.discovery.VintageDiscoverer.<init>(VintageDiscoverer.java:48)
17:40:40 [2021-03-13T22:40:40.959Z] 	at org.junit.vintage.engine.VintageTestEngine.discover(VintageTestEngine.java:65)
17:40:40 [2021-03-13T22:40:40.959Z] 	at org.junit.platform.launcher.core.DefaultLauncher.discoverEngineRoot(DefaultLauncher.java:130)
17:40:40 [2021-03-13T22:40:40.959Z] 	at org.junit.platform.launcher.core.DefaultLauncher.discoverRoot(DefaultLauncher.java:117)
17:40:40 [2021-03-13T22:40:40.959Z] 	at org.junit.platform.launcher.core.DefaultLauncher.execute(DefaultLauncher.java:90)
17:40:40 [2021-03-13T22:40:40.959Z] 	at org.apache.maven.surefire.junitplatform.JUnitPlatformProvider.invokeAllTests(JUnitPlatformProvider.java:150)
17:40:40 [2021-03-13T22:40:40.959Z] 	at org.apache.maven.surefire.junitplatform.JUnitPlatformProvider.invoke(JUnitPlatformProvider.java:124)
17:40:40 [2021-03-13T22:40:40.959Z] 	at java.base/jdk.internal.reflect.NativeMethodAccessorImpl.invoke0(Native Method)
17:40:40 [2021-03-13T22:40:40.959Z] 	at java.base/jdk.internal.reflect.NativeMethodAccessorImpl.invoke(NativeMethodAccessorImpl.java:64)
17:40:40 [2021-03-13T22:40:40.959Z] 	at java.base/jdk.internal.reflect.DelegatingMethodAccessorImpl.invoke(DelegatingMethodAccessorImpl.java:43)
17:40:40 [2021-03-13T22:40:40.959Z] 	at java.base/java.lang.reflect.Method.invoke(Method.java:564)
17:40:40 [2021-03-13T22:40:40.959Z] 	at org.apache.maven.surefire.util.ReflectionUtils.invokeMethodWithArray2(ReflectionUtils.java:206)
17:40:40 [2021-03-13T22:40:40.959Z] 	at org.apache.maven.surefire.booter.ProviderFactory$ProviderProxy.invoke(ProviderFactory.java:161)
17:40:40 [2021-03-13T22:40:40.959Z] 	at org.apache.maven.surefire.booter.ProviderFactory.invokeProvider(ProviderFactory.java:84)
17:40:40 [2021-03-13T22:40:40.959Z] 	at org.eclipse.tycho.surefire.osgibooter.OsgiSurefireBooter.run(OsgiSurefireBooter.java:116)
17:40:40 [2021-03-13T22:40:40.959Z] 	at org.eclipse.tycho.surefire.osgibooter.HeadlessTestApplication.start(HeadlessTestApplication.java:23)
17:40:40 [2021-03-13T22:40:40.959Z] 	at org.eclipse.equinox.internal.app.EclipseAppHandle.run(EclipseAppHandle.java:203)
17:40:40 [2021-03-13T22:40:40.959Z] 	at org.eclipse.core.runtime.internal.adaptor.EclipseAppLauncher.runApplication(EclipseAppLauncher.java:137)
17:40:40 [2021-03-13T22:40:40.959Z] 	at org.eclipse.core.runtime.internal.adaptor.EclipseAppLauncher.start(EclipseAppLauncher.java:107)
17:40:40 [2021-03-13T22:40:40.959Z] 	at org.eclipse.core.runtime.adaptor.EclipseStarter.run(EclipseStarter.java:400)
17:40:40 [2021-03-13T22:40:40.959Z] 	at org.eclipse.core.runtime.adaptor.EclipseStarter.run(EclipseStarter.java:255)
17:40:40 [2021-03-13T22:40:40.959Z] 	at java.base/jdk.internal.reflect.NativeMethodAccessorImpl.invoke0(Native Method)
17:40:40 [2021-03-13T22:40:40.959Z] 	at java.base/jdk.internal.reflect.NativeMethodAccessorImpl.invoke(NativeMethodAccessorImpl.java:64)
17:40:40 [2021-03-13T22:40:40.959Z] 	at java.base/jdk.internal.reflect.DelegatingMethodAccessorImpl.invoke(DelegatingMethodAccessorImpl.java:43)
17:40:40 [2021-03-13T22:40:40.959Z] 	at java.base/java.lang.reflect.Method.invoke(Method.java:564)
17:40:40 [2021-03-13T22:40:40.959Z] 	at org.eclipse.equinox.launcher.Main.invokeFramework(Main.java:661)
17:40:40 [2021-03-13T22:40:40.959Z] 	at org.eclipse.equinox.launcher.Main.basicRun(Main.java:597)
17:40:40 [2021-03-13T22:40:40.959Z] 	at org.eclipse.equinox.launcher.Main.run(Main.java:1476)
17:40:40 [2021-03-13T22:40:40.959Z] 	at org.eclipse.equinox.launcher.Main.main(Main.java:1449)
17:40:40 [2021-03-13T22:40:40.959Z] Caused by: java.lang.ClassNotFoundException: org.junit.runners.model.RunnerBuilder cannot be found by org.eclipse.tycho.surefire.osgibooter_2.2.0
17:40:40 [2021-03-13T22:40:40.959Z] 	at org.eclipse.osgi.internal.loader.BundleLoader.findClassInternal(BundleLoader.java:511)
17:40:40 [2021-03-13T22:40:40.959Z] 	at org.eclipse.osgi.internal.loader.BundleLoader.findClass(BundleLoader.java:422)
17:40:40 [2021-03-13T22:40:40.959Z] 	at org.eclipse.osgi.internal.loader.BundleLoader.findClass(BundleLoader.java:414)
17:40:40 [2021-03-13T22:40:40.959Z] 	at org.eclipse.osgi.internal.loader.ModuleClassLoader.loadClass(ModuleClassLoader.java:153)
17:40:40 [2021-03-13T22:40:40.959Z] 	at java.base/java.lang.ClassLoader.loadClass(ClassLoader.java:522)
17:40:40 [2021-03-13T22:40:40.959Z] 	... 29 more
17:40:40 [2021-03-13T22:40:40.959Z] 
17:40:40 [2021-03-13T22:40:40.959Z] Running org.eclipse.ease.lang.python.jython.debugger.JythonDebugTest
17:40:45 [2021-03-13T22:40:45.161Z] Start of script
17:40:45 [2021-03-13T22:40:45.161Z] include file start
17:40:45 [2021-03-13T22:40:45.161Z] include file processed
17:40:45 [2021-03-13T22:40:45.161Z] Result of testMethod = 5
17:40:45 [2021-03-13T22:40:45.161Z] End of script
17:40:45 [2021-03-13T22:40:45.161Z] Start of script
17:40:45 [2021-03-13T22:40:45.161Z] include file start
17:40:45 [2021-03-13T22:40:45.161Z] include file processed
17:40:45 [2021-03-13T22:40:45.161Z] Result of testMethod = 5
17:40:45 [2021-03-13T22:40:45.161Z] End of script
17:40:45 [2021-03-13T22:40:45.161Z] Start of script
17:40:45 [2021-03-13T22:40:45.161Z] include file start
17:40:45 [2021-03-13T22:40:45.161Z] include file processed
17:40:45 [2021-03-13T22:40:45.161Z] Result of testMethod = 5
17:40:45 [2021-03-13T22:40:45.161Z] Traceback (most recent call last):
17:40:45 [2021-03-13T22:40:45.161Z]   File "(none)", line 184, in run
17:40:45 [2021-03-13T22:40:45.161Z]   File "__ref_L/Debug Test/Main.py_hgslvxsquw", line 23, in <module>
17:40:45 [2021-03-13T22:40:45.161Z]   File "(none)", line 161, in trace_dispatch
17:40:45 [2021-03-13T22:40:45.161Z] org.eclipse.ease.ExitException: 
17:40:45 [2021-03-13T22:40:45.161Z] 
17:40:45 [2021-03-13T22:40:45.161Z] org.eclipse.ease.ExitException: org.eclipse.ease.ExitException: 
17:40:45 [2021-03-13T22:40:45.417Z] Start of script
17:40:45 [2021-03-13T22:40:45.418Z] include file start
17:40:45 [2021-03-13T22:40:45.418Z] include file processed
17:40:45 [2021-03-13T22:40:45.673Z] Result of testMethod = 5
17:40:45 [2021-03-13T22:40:45.673Z] End of script
17:40:45 [2021-03-13T22:40:45.929Z] Start of script
17:40:45 [2021-03-13T22:40:45.929Z] include file start
17:40:45 [2021-03-13T22:40:45.929Z] include file processed
17:40:45 [2021-03-13T22:40:45.929Z] Result of testMethod = 5
17:40:45 [2021-03-13T22:40:45.929Z] End of script
17:40:45 [2021-03-13T22:40:45.929Z] Start of script
17:40:45 [2021-03-13T22:40:45.929Z] include file start
17:40:45 [2021-03-13T22:40:45.929Z] include file processed
17:40:46 [2021-03-13T22:40:46.185Z] Result of testMethod = 5
17:40:46 [2021-03-13T22:40:46.185Z] End of script
17:40:46 [2021-03-13T22:40:46.440Z] Start of script
17:40:46 [2021-03-13T22:40:46.441Z] include file start
17:40:46 [2021-03-13T22:40:46.441Z] include file processed
17:40:46 [2021-03-13T22:40:46.441Z] Result of testMethod = 5
17:40:46 [2021-03-13T22:40:46.441Z] Traceback (most recent call last):
17:40:46 [2021-03-13T22:40:46.441Z]   File "(none)", line 184, in run
17:40:46 [2021-03-13T22:40:46.441Z]   File "__ref_L/Debug Test/Main.py_iavvwulisz", line 23, in <module>
17:40:46 [2021-03-13T22:40:46.441Z]   File "(none)", line 161, in trace_dispatch
17:40:46 [2021-03-13T22:40:46.441Z] org.eclipse.ease.ExitException: 
17:40:46 [2021-03-13T22:40:46.441Z] 
17:40:46 [2021-03-13T22:40:46.441Z] org.eclipse.ease.ExitException: org.eclipse.ease.ExitException: 
17:40:46 [2021-03-13T22:40:46.696Z] Start of script
17:40:46 [2021-03-13T22:40:46.696Z] include file start
17:40:46 [2021-03-13T22:40:46.696Z] include file processed
17:40:46 [2021-03-13T22:40:46.696Z] Result of testMethod = 5
17:40:46 [2021-03-13T22:40:46.696Z] End of script
17:40:46 [2021-03-13T22:40:46.952Z] Start of script
17:40:46 [2021-03-13T22:40:46.952Z] include file start
17:40:46 [2021-03-13T22:40:46.952Z] include file processed
17:40:46 [2021-03-13T22:40:46.952Z] Result of testMethod = 5
17:40:46 [2021-03-13T22:40:46.952Z] End of script
17:40:47 [2021-03-13T22:40:47.207Z] Start of script
17:40:47 [2021-03-13T22:40:47.207Z] include file start
17:40:47 [2021-03-13T22:40:47.207Z] include file processed
17:40:47 [2021-03-13T22:40:47.462Z] Traceback (most recent call last):
17:40:47 [2021-03-13T22:40:47.462Z]   File "(none)", line 184, in run
17:40:47 [2021-03-13T22:40:47.462Z]   File "__ref_L/Debug Test/Main.py_dgsuaxxoib", line 22, in <module>
17:40:47 [2021-03-13T22:40:47.462Z]   File "(none)", line 161, in trace_dispatch
17:40:47 [2021-03-13T22:40:47.462Z] org.eclipse.ease.ExitException: 
17:40:47 [2021-03-13T22:40:47.462Z] 
17:40:47 [2021-03-13T22:40:47.462Z] org.eclipse.ease.ExitException: org.eclipse.ease.ExitException: 
17:40:47 [2021-03-13T22:40:47.718Z] Start of script
17:40:47 [2021-03-13T22:40:47.718Z] include file start
17:40:47 [2021-03-13T22:40:47.718Z] include file processed
17:40:47 [2021-03-13T22:40:47.718Z] Result of testMethod = 5
17:40:47 [2021-03-13T22:40:47.718Z] End of script
17:40:47 [2021-03-13T22:40:47.999Z] Start of script
17:40:47 [2021-03-13T22:40:47.999Z] include file start
17:40:47 [2021-03-13T22:40:47.999Z] include file processed
17:40:47 [2021-03-13T22:40:47.999Z] Result of testMethod = 5
17:40:47 [2021-03-13T22:40:47.999Z] End of script
17:40:48 [2021-03-13T22:40:48.254Z] Traceback (most recent call last):
17:40:48 [2021-03-13T22:40:48.254Z]   File "(none)", line 184, in run
17:40:48 [2021-03-13T22:40:48.254Z]   File "__ref_L/Debug Test/Main.py_ukjbwxhebv", line 1, in <module>
17:40:48 [2021-03-13T22:40:48.254Z]   File "(none)", line 161, in trace_dispatch
17:40:48 [2021-03-13T22:40:48.254Z] org.eclipse.ease.ExitException: 
17:40:48 [2021-03-13T22:40:48.254Z] 
17:40:48 [2021-03-13T22:40:48.254Z] org.eclipse.ease.ExitException: org.eclipse.ease.ExitException: 
17:40:48 [2021-03-13T22:40:48.510Z] Start of script
17:40:48 [2021-03-13T22:40:48.510Z] include file start
17:40:48 [2021-03-13T22:40:48.510Z] include file processed
17:40:48 [2021-03-13T22:40:48.510Z] Result of testMethod = 5
17:40:48 [2021-03-13T22:40:48.510Z] End of script
17:40:48 [2021-03-13T22:40:48.767Z] Start of script
17:40:48 [2021-03-13T22:40:48.767Z] include file start
17:40:48 [2021-03-13T22:40:48.767Z] include file processed
17:40:48 [2021-03-13T22:40:48.767Z] Result of testMethod = 5
17:40:48 [2021-03-13T22:40:48.767Z] End of script
17:40:49 [2021-03-13T22:40:49.023Z] Start of script
17:40:49 [2021-03-13T22:40:49.023Z] include file start
17:40:49 [2021-03-13T22:40:49.023Z] include file processed
17:40:49 [2021-03-13T22:40:49.023Z] Result of testMethod = 5
17:40:49 [2021-03-13T22:40:49.279Z] Traceback (most recent call last):
17:40:49 [2021-03-13T22:40:49.279Z]   File "(none)", line 184, in run
17:40:49 [2021-03-13T22:40:49.279Z]   File "__ref_L/Debug Test/Main.py_uxbjpyazsl", line 23, in <module>
17:40:49 [2021-03-13T22:40:49.279Z]   File "(none)", line 161, in trace_dispatch
17:40:49 [2021-03-13T22:40:49.279Z] org.eclipse.ease.ExitException: 
17:40:49 [2021-03-13T22:40:49.279Z] 
17:40:49 [2021-03-13T22:40:49.279Z] org.eclipse.ease.ExitException: org.eclipse.ease.ExitException: 
17:40:49 [2021-03-13T22:40:49.279Z] Start of script
17:40:49 [2021-03-13T22:40:49.279Z] include file start
17:40:49 [2021-03-13T22:40:49.279Z] include file processed
17:40:49 [2021-03-13T22:40:49.535Z] Result of testMethod = 5
17:40:49 [2021-03-13T22:40:49.535Z] End of script
17:40:49 [2021-03-13T22:40:49.790Z] Traceback (most recent call last):
17:40:49 [2021-03-13T22:40:49.790Z]   File "(none)", line 184, in run
17:40:49 [2021-03-13T22:40:49.790Z]   File "__ref_L/Debug Test/Main.py_ptalosojoh", line 1, in <module>
17:40:49 [2021-03-13T22:40:49.790Z]   File "(none)", line 161, in trace_dispatch
17:40:49 [2021-03-13T22:40:49.791Z] org.eclipse.ease.ExitException: 
17:40:49 [2021-03-13T22:40:49.791Z] 
17:40:49 [2021-03-13T22:40:49.791Z] org.eclipse.ease.ExitException: org.eclipse.ease.ExitException: 
17:40:49 [2021-03-13T22:40:49.791Z] Start of script
17:40:49 [2021-03-13T22:40:49.791Z] include file start
17:40:49 [2021-03-13T22:40:49.791Z] include file processed
17:40:49 [2021-03-13T22:40:49.791Z] Result of testMethod = 5
17:40:49 [2021-03-13T22:40:49.791Z] End of script
17:40:50 [2021-03-13T22:40:50.046Z] Start of script
17:40:50 [2021-03-13T22:40:50.046Z] include file start
17:40:50 [2021-03-13T22:40:50.046Z] include file processed
17:40:50 [2021-03-13T22:40:50.302Z] Result of testMethod = 5
17:40:50 [2021-03-13T22:40:50.302Z] End of script
17:40:50 [2021-03-13T22:40:50.302Z] Traceback (most recent call last):
17:40:50 [2021-03-13T22:40:50.302Z]   File "(none)", line 184, in run
17:40:50 [2021-03-13T22:40:50.302Z]   File "__ref_L/Debug Test/Main.py_xhswpoqpyn", line 1, in <module>
17:40:50 [2021-03-13T22:40:50.302Z]   File "(none)", line 161, in trace_dispatch
17:40:50 [2021-03-13T22:40:50.302Z] org.eclipse.ease.ExitException: 
17:40:50 [2021-03-13T22:40:50.302Z] 
17:40:50 [2021-03-13T22:40:50.302Z] org.eclipse.ease.ExitException: org.eclipse.ease.ExitException: 
17:40:50 [2021-03-13T22:40:50.557Z] Start of script
17:40:50 [2021-03-13T22:40:50.557Z] include file start
17:40:50 [2021-03-13T22:40:50.557Z] include file processed
17:40:50 [2021-03-13T22:40:50.813Z] Result of testMethod = 5
17:40:50 [2021-03-13T22:40:50.813Z] End of script
17:40:50 [2021-03-13T22:40:50.813Z] Start of script
17:40:50 [2021-03-13T22:40:50.813Z] include file start
17:40:50 [2021-03-13T22:40:50.813Z] include file processed
17:40:50 [2021-03-13T22:40:50.813Z] Result of testMethod = 5
17:40:51 [2021-03-13T22:40:51.068Z] Traceback (most recent call last):
17:40:51 [2021-03-13T22:40:51.068Z]   File "(none)", line 184, in run
17:40:51 [2021-03-13T22:40:51.068Z]   File "__ref_L/Debug Test/Main.py_pqlqewdpvw", line 23, in <module>
17:40:51 [2021-03-13T22:40:51.068Z]   File "(none)", line 161, in trace_dispatch
17:40:51 [2021-03-13T22:40:51.068Z] org.eclipse.ease.ExitException: 
17:40:51 [2021-03-13T22:40:51.068Z] 
17:40:51 [2021-03-13T22:40:51.068Z] org.eclipse.ease.ExitException: org.eclipse.ease.ExitException: 
17:40:51 [2021-03-13T22:40:51.324Z] Start of script
17:40:51 [2021-03-13T22:40:51.324Z] include file start
17:40:51 [2021-03-13T22:40:51.324Z] include file processed
17:40:51 [2021-03-13T22:40:51.324Z] Result of testMethod = 5
17:40:51 [2021-03-13T22:40:51.324Z] End of script
17:40:51 [2021-03-13T22:40:51.324Z] Start of script
17:40:51 [2021-03-13T22:40:51.324Z] include file start
17:40:51 [2021-03-13T22:40:51.324Z] include file processed
17:40:51 [2021-03-13T22:40:51.580Z] Result of testMethod = 5
17:40:51 [2021-03-13T22:40:51.580Z] End of script
17:40:51 [2021-03-13T22:40:51.580Z] Start of script
17:40:51 [2021-03-13T22:40:51.580Z] include file start
17:40:51 [2021-03-13T22:40:51.580Z] include file processed
17:40:51 [2021-03-13T22:40:51.580Z] Result of testMethod = 5
17:40:51 [2021-03-13T22:40:51.580Z] End of script
17:40:51 [2021-03-13T22:40:51.835Z] Start of script
17:40:51 [2021-03-13T22:40:51.835Z] include file start
17:40:51 [2021-03-13T22:40:51.835Z] include file processed
17:40:51 [2021-03-13T22:40:51.835Z] Result of testMethod = 5
17:40:51 [2021-03-13T22:40:51.835Z] End of script
17:40:52 [2021-03-13T22:40:52.091Z] Start of script
17:40:52 [2021-03-13T22:40:52.091Z] include file start
17:40:52 [2021-03-13T22:40:52.091Z] include file processed
17:40:52 [2021-03-13T22:40:52.346Z] Traceback (most recent call last):
17:40:52 [2021-03-13T22:40:52.346Z]   File "(none)", line 184, in run
17:40:52 [2021-03-13T22:40:52.346Z]   File "__ref_L/Debug Test/Main.py_oqorlwixqr", line 21, in <module>
17:40:52 [2021-03-13T22:40:52.346Z]   File "__ref_L/Debug Test/Main.py_oqorlwixqr", line 18, in testMethod
17:40:52 [2021-03-13T22:40:52.346Z]   File "(none)", line 161, in trace_dispatch
17:40:52 [2021-03-13T22:40:52.346Z] org.eclipse.ease.ExitException: 
17:40:52 [2021-03-13T22:40:52.346Z] 
17:40:52 [2021-03-13T22:40:52.346Z] org.eclipse.ease.ExitException: org.eclipse.ease.ExitException: 
17:40:52 [2021-03-13T22:40:52.346Z] Start of script
17:40:52 [2021-03-13T22:40:52.601Z] include file start
17:40:52 [2021-03-13T22:40:52.601Z] include file processed
17:40:52 [2021-03-13T22:40:52.601Z] Result of testMethod = 5
17:40:52 [2021-03-13T22:40:52.601Z] End of script
17:40:52 [2021-03-13T22:40:52.601Z] Start of script
17:40:52 [2021-03-13T22:40:52.601Z] include file start
17:40:52 [2021-03-13T22:40:52.601Z] include file processed
17:40:52 [2021-03-13T22:40:52.601Z] Result of testMethod = 5
17:40:52 [2021-03-13T22:40:52.856Z] Traceback (most recent call last):
17:40:52 [2021-03-13T22:40:52.856Z]   File "(none)", line 184, in run
17:40:52 [2021-03-13T22:40:52.856Z]   File "__ref_L/Debug Test/Main.py_kddsteeojb", line 23, in <module>
17:40:52 [2021-03-13T22:40:52.856Z]   File "(none)", line 161, in trace_dispatch
17:40:52 [2021-03-13T22:40:52.856Z] org.eclipse.ease.ExitException: 
17:40:52 [2021-03-13T22:40:52.856Z] 
17:40:52 [2021-03-13T22:40:52.856Z] org.eclipse.ease.ExitException: org.eclipse.ease.ExitException: 
17:40:53 [2021-03-13T22:40:53.111Z] Start of script
17:40:53 [2021-03-13T22:40:53.111Z] include file start
17:40:53 [2021-03-13T22:40:53.111Z] include file processed
17:40:53 [2021-03-13T22:40:53.111Z] Result of testMethod = 5
17:40:53 [2021-03-13T22:40:53.111Z] End of script
17:40:53 [2021-03-13T22:40:53.111Z] Start of script
17:40:53 [2021-03-13T22:40:53.111Z] include file start
17:40:53 [2021-03-13T22:40:53.111Z] include file processed
17:40:53 [2021-03-13T22:40:53.366Z] Result of testMethod = 5
17:40:53 [2021-03-13T22:40:53.366Z] End of script
17:40:53 [2021-03-13T22:40:53.621Z] Start of script
17:40:53 [2021-03-13T22:40:53.621Z] include file start
17:40:53 [2021-03-13T22:40:53.621Z] include file processed
17:40:53 [2021-03-13T22:40:53.621Z] Result of testMethod = 5
17:40:53 [2021-03-13T22:40:53.621Z] End of script
17:40:53 [2021-03-13T22:40:53.877Z] Start of script
17:40:53 [2021-03-13T22:40:53.877Z] include file start
17:40:53 [2021-03-13T22:40:53.877Z] include file processed
17:40:53 [2021-03-13T22:40:53.877Z] Result of testMethod = 5
17:40:53 [2021-03-13T22:40:53.877Z] End of script
17:40:54 [2021-03-13T22:40:54.133Z] Start of script
17:40:54 [2021-03-13T22:40:54.133Z] include file start
17:40:54 [2021-03-13T22:40:54.133Z] include file processed
17:40:54 [2021-03-13T22:40:54.133Z] Result of testMethod = 5
17:40:54 [2021-03-13T22:40:54.133Z] Traceback (most recent call last):
17:40:54 [2021-03-13T22:40:54.133Z]   File "(none)", line 184, in run
17:40:54 [2021-03-13T22:40:54.133Z]   File "__ref_L/Debug Test/Main.py_yjwylmbizx", line 23, in <module>
17:40:54 [2021-03-13T22:40:54.133Z]   File "(none)", line 161, in trace_dispatch
17:40:54 [2021-03-13T22:40:54.133Z] org.eclipse.ease.ExitException: 
17:40:54 [2021-03-13T22:40:54.133Z] 
17:40:54 [2021-03-13T22:40:54.133Z] org.eclipse.ease.ExitException: org.eclipse.ease.ExitException: 
17:40:54 [2021-03-13T22:40:54.388Z] Start of script
17:40:54 [2021-03-13T22:40:54.388Z] include file start
17:40:54 [2021-03-13T22:40:54.388Z] include file processed
17:40:54 [2021-03-13T22:40:54.388Z] Result of testMethod = 5
17:40:54 [2021-03-13T22:40:54.388Z] End of script
17:40:54 [2021-03-13T22:40:54.643Z] Start of script
17:40:54 [2021-03-13T22:40:54.643Z] include file start
17:40:54 [2021-03-13T22:40:54.643Z] include file processed
17:40:54 [2021-03-13T22:40:54.643Z] Result of testMethod = 5
17:40:54 [2021-03-13T22:40:54.643Z] Traceback (most recent call last):
17:40:54 [2021-03-13T22:40:54.643Z]   File "(none)", line 184, in run
17:40:54 [2021-03-13T22:40:54.643Z]   File "__ref_L/Debug Test/Main.py_gdcrjxexts", line 23, in <module>
17:40:54 [2021-03-13T22:40:54.643Z]   File "(none)", line 161, in trace_dispatch
17:40:54 [2021-03-13T22:40:54.643Z] org.eclipse.ease.ExitException: 
17:40:54 [2021-03-13T22:40:54.643Z] 
17:40:54 [2021-03-13T22:40:54.643Z] org.eclipse.ease.ExitException: org.eclipse.ease.ExitException: 
17:40:54 [2021-03-13T22:40:54.898Z] Traceback (most recent call last):
17:40:54 [2021-03-13T22:40:54.898Z]   File "(none)", line 184, in run
17:40:54 [2021-03-13T22:40:54.898Z]   File "__ref_L/Debug Test/Main.py_wrukyrtfjv", line 1, in <module>
17:40:54 [2021-03-13T22:40:54.898Z]   File "(none)", line 161, in trace_dispatch
17:40:54 [2021-03-13T22:40:54.898Z] org.eclipse.ease.ExitException: 
17:40:54 [2021-03-13T22:40:54.898Z] 
17:40:54 [2021-03-13T22:40:54.898Z] org.eclipse.ease.ExitException: org.eclipse.ease.ExitException: 
17:40:55 [2021-03-13T22:40:55.202Z] Start of script
17:40:55 [2021-03-13T22:40:55.202Z] include file start
17:40:55 [2021-03-13T22:40:55.202Z] include file processed
17:40:55 [2021-03-13T22:40:55.202Z] Result of testMethod = 5
17:40:55 [2021-03-13T22:40:55.202Z] End of script
17:40:55 [2021-03-13T22:40:55.457Z] Start of script
17:40:55 [2021-03-13T22:40:55.457Z] include file start
17:40:55 [2021-03-13T22:40:55.457Z] include file processed
17:40:55 [2021-03-13T22:40:55.457Z] Result of testMethod = 5
17:40:55 [2021-03-13T22:40:55.457Z] End of script
17:40:55 [2021-03-13T22:40:55.712Z] Start of script
17:40:55 [2021-03-13T22:40:55.712Z] include file start
17:40:55 [2021-03-13T22:40:55.712Z] include file processed
17:40:55 [2021-03-13T22:40:55.712Z] Result of testMethod = 5
17:40:55 [2021-03-13T22:40:55.712Z] End of script
17:40:55 [2021-03-13T22:40:55.967Z] Tests run: 42, Failures: 0, Errors: 0, Skipped: 0, Time elapsed: 14.834 s - in org.eclipse.ease.lang.python.jython.debugger.JythonDebugTest
17:40:55 [2021-03-13T22:40:55.967Z] disconnectProcessInSuspendedState  Time elapsed: 3.723 s
17:40:55 [2021-03-13T22:40:55.967Z] stepReturnIncludeCommand  Time elapsed: 0.213 s
17:40:55 [2021-03-13T22:40:55.967Z] arrayVariableSorting  Time elapsed: 0.311 s
17:40:55 [2021-03-13T22:40:55.967Z] stepOverOnDebugTarget  Time elapsed: 0.407 s
17:40:55 [2021-03-13T22:40:55.967Z] hasDebugTarget  Time elapsed: 0.104 s
17:40:55 [2021-03-13T22:40:55.967Z] disconnectThreadInSuspendedState  Time elapsed: 0.208 s
17:40:55 [2021-03-13T22:40:55.967Z] stepReturnOnDebugTarget  Time elapsed: 0.309 s
17:40:55 [2021-03-13T22:40:55.967Z] nullVariable  Time elapsed: 0.307 s
17:40:55 [2021-03-13T22:40:55.967Z] stepOverOnStackFrame  Time elapsed: 0.306 s
17:40:55 [2021-03-13T22:40:55.967Z] resumeOnDebugTarget  Time elapsed: 0.205 s
17:40:55 [2021-03-13T22:40:55.967Z] modifyVariableKeepingType  Time elapsed: 0.506 s
17:40:55 [2021-03-13T22:40:55.967Z] resumeOnLastIncludeLine  Time elapsed: 0.204 s
17:40:55 [2021-03-13T22:40:55.967Z] stepReturnOnStackFrame  Time elapsed: 0.307 s
17:40:55 [2021-03-13T22:40:55.967Z] terminateStackFrameInSuspendedState  Time elapsed: 0.308 s
17:40:55 [2021-03-13T22:40:55.967Z] breakpointLocation  Time elapsed: 0.207 s
17:40:55 [2021-03-13T22:40:55.967Z] stepReturnOnThread  Time elapsed: 0.308 s
17:40:55 [2021-03-13T22:40:55.967Z] javaClassVariable  Time elapsed: 0.309 s
17:40:55 [2021-03-13T22:40:55.967Z] stepIntoOnThread  Time elapsed: 0.308 s
17:40:55 [2021-03-13T22:40:55.967Z] terminateThreadInSuspendedState  Time elapsed: 0.206 s
17:40:55 [2021-03-13T22:40:55.967Z] resumeOnThread  Time elapsed: 0.206 s
17:40:55 [2021-03-13T22:40:55.967Z] stepIntoOnStackFrame  Time elapsed: 0.305 s
17:40:55 [2021-03-13T22:40:55.968Z] terminateProcessInSuspendedState  Time elapsed: 0.225 s
17:40:55 [2021-03-13T22:40:55.968Z] stepOverOnProcess  Time elapsed: 0.305 s
17:40:55 [2021-03-13T22:40:55.968Z] nativeArrayVariable  Time elapsed: 0.305 s
17:40:55 [2021-03-13T22:40:55.968Z] disconnectDebugTargetInSuspendedState  Time elapsed: 0.204 s
17:40:55 [2021-03-13T22:40:55.968Z] stepIntoOnProcess  Time elapsed: 0.306 s
17:40:55 [2021-03-13T22:40:55.968Z] terminatedState  Time elapsed: 0.103 s
17:40:55 [2021-03-13T22:40:55.968Z] stepOverIncludeCommand  Time elapsed: 0.304 s
17:40:55 [2021-03-13T22:40:55.968Z] innerScopeVariableBeforeOuterScopeVariable  Time elapsed: 0.303 s
17:40:55 [2021-03-13T22:40:55.968Z] stepIntoIncludeCommand  Time elapsed: 0.304 s
17:40:55 [2021-03-13T22:40:55.968Z] primitiveStringVariable  Time elapsed: 0.304 s
17:40:55 [2021-03-13T22:40:55.968Z] resumeOnProcess  Time elapsed: 0.204 s
17:40:55 [2021-03-13T22:40:55.968Z] stepIntoOnDebugTarget  Time elapsed: 0.305 s
17:40:55 [2021-03-13T22:40:55.968Z] stepOverOnThread  Time elapsed: 0.304 s
17:40:55 [2021-03-13T22:40:55.968Z] suspendedState  Time elapsed: 0.203 s
17:40:55 [2021-03-13T22:40:55.968Z] primitiveDoubleVariable  Time elapsed: 0.303 s
17:40:55 [2021-03-13T22:40:55.968Z] resumeOnStackFrame  Time elapsed: 0.203 s
17:40:55 [2021-03-13T22:40:55.968Z] nativeObjectVariable  Time elapsed: 0.304 s
17:40:55 [2021-03-13T22:40:55.968Z] terminateDebugTargetInSuspendedState  Time elapsed: 0.204 s
17:40:55 [2021-03-13T22:40:55.968Z] disconnectStackFrameInSuspendedState  Time elapsed: 0.204 s
17:40:55 [2021-03-13T22:40:55.968Z] stepReturnOnProcess  Time elapsed: 0.405 s
17:40:55 [2021-03-13T22:40:55.968Z] evaluateWatchExpression  Time elapsed: 0.216 s
17:40:55 [2021-03-13T22:40:55.968Z] 
17:40:55 [2021-03-13T22:40:55.968Z] Results:
17:40:55 [2021-03-13T22:40:55.968Z] 
17:40:55 [2021-03-13T22:40:55.968Z] Tests run: 42, Failures: 0, Errors: 0, Skipped: 0
17:40:55 [2021-03-13T22:40:55.968Z] 
17:40:56 [2021-03-13T22:40:56.529Z] [INFO] All tests passed!
17:40:56 [2021-03-13T22:40:56.529Z] [INFO] 
17:40:56 [2021-03-13T22:40:56.529Z] [INFO] -----< org.eclipse.ease:org.eclipse.ease.lang.scriptarchive.test >------
17:40:56 [2021-03-13T22:40:56.529Z] [INFO] Building org.eclipse.ease.lang.scriptarchive.test 0.8.0-SNAPSHOT   [8/9]
17:40:56 [2021-03-13T22:40:56.529Z] [INFO] ------------------------[ eclipse-test-plugin ]-------------------------
17:40:56 [2021-03-13T22:40:56.529Z] [INFO] 
17:40:56 [2021-03-13T22:40:56.530Z] [INFO] --- tycho-packaging-plugin:2.2.0:build-qualifier (default-build-qualifier) @ org.eclipse.ease.lang.scriptarchive.test ---
17:40:56 [2021-03-13T22:40:56.530Z] [INFO] The project's OSGi version is 0.8.0.I202103030731
17:40:56 [2021-03-13T22:40:56.530Z] [INFO] 
17:40:56 [2021-03-13T22:40:56.530Z] [INFO] --- tycho-packaging-plugin:2.2.0:validate-id (default-validate-id) @ org.eclipse.ease.lang.scriptarchive.test ---
17:40:56 [2021-03-13T22:40:56.530Z] [INFO] 
17:40:56 [2021-03-13T22:40:56.530Z] [INFO] --- tycho-packaging-plugin:2.2.0:validate-version (default-validate-version) @ org.eclipse.ease.lang.scriptarchive.test ---
17:40:56 [2021-03-13T22:40:56.530Z] [INFO] 
17:40:56 [2021-03-13T22:40:56.530Z] [INFO] --- maven-resources-plugin:2.4.3:resources (default-resources) @ org.eclipse.ease.lang.scriptarchive.test ---
17:40:56 [2021-03-13T22:40:56.530Z] [INFO] Using 'UTF-8' encoding to copy filtered resources.
17:40:56 [2021-03-13T22:40:56.530Z] [INFO] skip non existing resourceDirectory /home/jenkins/agent/workspace/ease.verify.core.target.2019-03/tests/org.eclipse.ease.lang.scriptarchive.test/src/main/resources
17:40:56 [2021-03-13T22:40:56.530Z] [INFO] 
17:40:56 [2021-03-13T22:40:56.530Z] [INFO] --- tycho-compiler-plugin:2.2.0:compile (default-compile) @ org.eclipse.ease.lang.scriptarchive.test ---
17:40:56 [2021-03-13T22:40:56.530Z] [INFO] Nothing to compile - all classes are up to date
17:40:56 [2021-03-13T22:40:56.530Z] [INFO] 
17:40:56 [2021-03-13T22:40:56.530Z] [INFO] --- maven-resources-plugin:2.4.3:testResources (default-testResources) @ org.eclipse.ease.lang.scriptarchive.test ---
17:40:56 [2021-03-13T22:40:56.530Z] [INFO] Using 'UTF-8' encoding to copy filtered resources.
17:40:56 [2021-03-13T22:40:56.530Z] [INFO] skip non existing resourceDirectory /home/jenkins/agent/workspace/ease.verify.core.target.2019-03/tests/org.eclipse.ease.lang.scriptarchive.test/src/test/resources
17:40:56 [2021-03-13T22:40:56.530Z] [INFO] 
17:40:56 [2021-03-13T22:40:56.530Z] [INFO] --- target-platform-configuration:2.2.0:target-platform (default-target-platform) @ org.eclipse.ease.lang.scriptarchive.test ---
17:40:56 [2021-03-13T22:40:56.530Z] [INFO] 
17:40:56 [2021-03-13T22:40:56.530Z] [INFO] --- tycho-packaging-plugin:2.2.0:package-plugin (default-package-plugin) @ org.eclipse.ease.lang.scriptarchive.test ---
17:40:56 [2021-03-13T22:40:56.530Z] [INFO] Building jar: /home/jenkins/agent/workspace/ease.verify.core.target.2019-03/tests/org.eclipse.ease.lang.scriptarchive.test/target/org.eclipse.ease.lang.scriptarchive.test-0.8.0-SNAPSHOT.jar
17:40:56 [2021-03-13T22:40:56.530Z] [INFO] 
17:40:56 [2021-03-13T22:40:56.530Z] [INFO] --- tycho-p2-plugin:2.2.0:p2-metadata-default (default-p2-metadata-default) @ org.eclipse.ease.lang.scriptarchive.test ---
17:40:56 [2021-03-13T22:40:56.530Z] [INFO] 
17:40:56 [2021-03-13T22:40:56.530Z] [INFO] --- jacoco-maven-plugin:0.8.6:prepare-agent (jacoco-initialize) @ org.eclipse.ease.lang.scriptarchive.test ---
17:40:56 [2021-03-13T22:40:56.530Z] [INFO] tycho.testArgLine set to -javaagent:/home/jenkins/.m2/repository/org/jacoco/org.jacoco.agent/0.8.6/org.jacoco.agent-0.8.6-runtime.jar=destfile=/home/jenkins/agent/workspace/ease.verify.core.target.2019-03/tests/org.eclipse.ease.lang.scriptarchive.test/target/jacoco.exec,output=file
17:40:56 [2021-03-13T22:40:56.530Z] [INFO] 
17:40:56 [2021-03-13T22:40:56.530Z] [INFO] --- tycho-surefire-plugin:2.2.0:test (default-test) @ org.eclipse.ease.lang.scriptarchive.test ---
17:40:56 [2021-03-13T22:40:56.530Z] [INFO] Executing Test Runtime with timeout 0, logs (if any) will be placed at: /home/jenkins/agent/workspace/ease.verify.core.target.2019-03/tests/org.eclipse.ease.lang.scriptarchive.test/target/work/data/.metadata/.log
17:40:56 [2021-03-13T22:40:56.530Z] [INFO] Command line:
17:40:56 [2021-03-13T22:40:56.530Z] 	[/opt/tools/java/openjdk/jdk-15/15.0.2+7/bin/java, -Dosgi.noShutdown=false, -Dosgi.os=linux, -Dosgi.ws=gtk, -Dosgi.arch=x86_64, -javaagent:/home/jenkins/.m2/repository/org/jacoco/org.jacoco.agent/0.8.6/org.jacoco.agent-0.8.6-runtime.jar=destfile=/home/jenkins/agent/workspace/ease.verify.core.target.2019-03/tests/org.eclipse.ease.lang.scriptarchive.test/target/jacoco.exec,output=file, -Dosgi.clean=true, -jar, /home/jenkins/.m2/repository/p2/osgi/bundle/org.eclipse.equinox.launcher/1.5.300.v20190213-1655/org.eclipse.equinox.launcher-1.5.300.v20190213-1655.jar, -data, /home/jenkins/agent/workspace/ease.verify.core.target.2019-03/tests/org.eclipse.ease.lang.scriptarchive.test/target/work/data, -install, /home/jenkins/agent/workspace/ease.verify.core.target.2019-03/tests/org.eclipse.ease.lang.scriptarchive.test/target/work, -configuration, /home/jenkins/agent/workspace/ease.verify.core.target.2019-03/tests/org.eclipse.ease.lang.scriptarchive.test/target/work/configuration, -application, org.eclipse.tycho.surefire.osgibooter.headlesstest, -testproperties, /home/jenkins/agent/workspace/ease.verify.core.target.2019-03/tests/org.eclipse.ease.lang.scriptarchive.test/target/surefire.properties]
17:40:56 [2021-03-13T22:40:56.530Z] Picked up JAVA_TOOL_OPTIONS: -Dmaven.ext.class.path="/home/jenkins/agent/workspace/ease.verify.core.target.2019-03@tmp/withMavenf02f74e7/pipeline-maven-spy.jar" -Dorg.jenkinsci.plugins.pipeline.maven.reportsFolder="/home/jenkins/agent/workspace/ease.verify.core.target.2019-03@tmp/withMavenf02f74e7" 
17:40:59 [2021-03-13T22:40:59.855Z] Mar 13, 2021 10:40:59 PM org.junit.platform.launcher.core.DefaultLauncher handleThrowable
17:40:59 [2021-03-13T22:40:59.855Z] WARNING: TestEngine with ID 'junit-vintage' failed to discover tests
17:40:59 [2021-03-13T22:40:59.855Z] java.lang.NoClassDefFoundError: org/junit/runners/model/RunnerBuilder
17:40:59 [2021-03-13T22:40:59.855Z] 	at org.junit.vintage.engine.discovery.VintageDiscoverer.<init>(VintageDiscoverer.java:48)
17:40:59 [2021-03-13T22:40:59.855Z] 	at org.junit.vintage.engine.VintageTestEngine.discover(VintageTestEngine.java:65)
17:40:59 [2021-03-13T22:40:59.855Z] 	at org.junit.platform.launcher.core.DefaultLauncher.discoverEngineRoot(DefaultLauncher.java:130)
17:40:59 [2021-03-13T22:40:59.855Z] 	at org.junit.platform.launcher.core.DefaultLauncher.discoverRoot(DefaultLauncher.java:117)
17:40:59 [2021-03-13T22:40:59.855Z] 	at org.junit.platform.launcher.core.DefaultLauncher.discover(DefaultLauncher.java:82)
17:40:59 [2021-03-13T22:40:59.855Z] 	at org.apache.maven.surefire.junitplatform.TestPlanScannerFilter.accept(TestPlanScannerFilter.java:56)
17:40:59 [2021-03-13T22:40:59.855Z] 	at org.apache.maven.surefire.util.DefaultScanResult.applyFilter(DefaultScanResult.java:102)
17:40:59 [2021-03-13T22:40:59.855Z] 	at org.apache.maven.surefire.junitplatform.JUnitPlatformProvider.scanClasspath(JUnitPlatformProvider.java:143)
17:40:59 [2021-03-13T22:40:59.855Z] 	at org.apache.maven.surefire.junitplatform.JUnitPlatformProvider.invoke(JUnitPlatformProvider.java:124)
17:40:59 [2021-03-13T22:40:59.855Z] 	at java.base/jdk.internal.reflect.NativeMethodAccessorImpl.invoke0(Native Method)
17:40:59 [2021-03-13T22:40:59.855Z] 	at java.base/jdk.internal.reflect.NativeMethodAccessorImpl.invoke(NativeMethodAccessorImpl.java:64)
17:40:59 [2021-03-13T22:40:59.855Z] 	at java.base/jdk.internal.reflect.DelegatingMethodAccessorImpl.invoke(DelegatingMethodAccessorImpl.java:43)
17:40:59 [2021-03-13T22:40:59.855Z] 	at java.base/java.lang.reflect.Method.invoke(Method.java:564)
17:40:59 [2021-03-13T22:40:59.855Z] 	at org.apache.maven.surefire.util.ReflectionUtils.invokeMethodWithArray2(ReflectionUtils.java:206)
17:40:59 [2021-03-13T22:40:59.855Z] 	at org.apache.maven.surefire.booter.ProviderFactory$ProviderProxy.invoke(ProviderFactory.java:161)
17:40:59 [2021-03-13T22:40:59.855Z] 	at org.apache.maven.surefire.booter.ProviderFactory.invokeProvider(ProviderFactory.java:84)
17:40:59 [2021-03-13T22:40:59.855Z] 	at org.eclipse.tycho.surefire.osgibooter.OsgiSurefireBooter.run(OsgiSurefireBooter.java:116)
17:40:59 [2021-03-13T22:40:59.855Z] 	at org.eclipse.tycho.surefire.osgibooter.HeadlessTestApplication.start(HeadlessTestApplication.java:23)
17:40:59 [2021-03-13T22:40:59.855Z] 	at org.eclipse.equinox.internal.app.EclipseAppHandle.run(EclipseAppHandle.java:203)
17:40:59 [2021-03-13T22:40:59.855Z] 	at org.eclipse.core.runtime.internal.adaptor.EclipseAppLauncher.runApplication(EclipseAppLauncher.java:137)
17:40:59 [2021-03-13T22:40:59.855Z] 	at org.eclipse.core.runtime.internal.adaptor.EclipseAppLauncher.start(EclipseAppLauncher.java:107)
17:40:59 [2021-03-13T22:40:59.855Z] 	at org.eclipse.core.runtime.adaptor.EclipseStarter.run(EclipseStarter.java:400)
17:40:59 [2021-03-13T22:40:59.855Z] 	at org.eclipse.core.runtime.adaptor.EclipseStarter.run(EclipseStarter.java:255)
17:40:59 [2021-03-13T22:40:59.855Z] 	at java.base/jdk.internal.reflect.NativeMethodAccessorImpl.invoke0(Native Method)
17:40:59 [2021-03-13T22:40:59.855Z] 	at java.base/jdk.internal.reflect.NativeMethodAccessorImpl.invoke(NativeMethodAccessorImpl.java:64)
17:40:59 [2021-03-13T22:40:59.855Z] 	at java.base/jdk.internal.reflect.DelegatingMethodAccessorImpl.invoke(DelegatingMethodAccessorImpl.java:43)
17:40:59 [2021-03-13T22:40:59.855Z] 	at java.base/java.lang.reflect.Method.invoke(Method.java:564)
17:40:59 [2021-03-13T22:40:59.855Z] 	at org.eclipse.equinox.launcher.Main.invokeFramework(Main.java:661)
17:40:59 [2021-03-13T22:40:59.855Z] 	at org.eclipse.equinox.launcher.Main.basicRun(Main.java:597)
17:40:59 [2021-03-13T22:40:59.855Z] 	at org.eclipse.equinox.launcher.Main.run(Main.java:1476)
17:40:59 [2021-03-13T22:40:59.855Z] 	at org.eclipse.equinox.launcher.Main.main(Main.java:1449)
17:40:59 [2021-03-13T22:40:59.855Z] Caused by: java.lang.ClassNotFoundException: org.junit.runners.model.RunnerBuilder cannot be found by org.eclipse.tycho.surefire.osgibooter_2.2.0
17:40:59 [2021-03-13T22:40:59.855Z] 	at org.eclipse.osgi.internal.loader.BundleLoader.findClassInternal(BundleLoader.java:511)
17:40:59 [2021-03-13T22:40:59.855Z] 	at org.eclipse.osgi.internal.loader.BundleLoader.findClass(BundleLoader.java:422)
17:40:59 [2021-03-13T22:40:59.855Z] 	at org.eclipse.osgi.internal.loader.BundleLoader.findClass(BundleLoader.java:414)
17:40:59 [2021-03-13T22:40:59.855Z] 	at org.eclipse.osgi.internal.loader.ModuleClassLoader.loadClass(ModuleClassLoader.java:153)
17:40:59 [2021-03-13T22:40:59.855Z] 	at java.base/java.lang.ClassLoader.loadClass(ClassLoader.java:522)
17:40:59 [2021-03-13T22:40:59.855Z] 	... 31 more
17:40:59 [2021-03-13T22:40:59.855Z] 
17:40:59 [2021-03-13T22:40:59.855Z] Mar 13, 2021 10:40:59 PM org.junit.platform.launcher.core.DefaultLauncher handleThrowable
17:40:59 [2021-03-13T22:40:59.855Z] WARNING: TestEngine with ID 'junit-vintage' failed to discover tests
17:40:59 [2021-03-13T22:40:59.855Z] java.lang.NoClassDefFoundError: org/junit/runners/model/RunnerBuilder
17:40:59 [2021-03-13T22:40:59.855Z] 	at org.junit.vintage.engine.discovery.VintageDiscoverer.<init>(VintageDiscoverer.java:48)
17:40:59 [2021-03-13T22:40:59.855Z] 	at org.junit.vintage.engine.VintageTestEngine.discover(VintageTestEngine.java:65)
17:40:59 [2021-03-13T22:40:59.855Z] 	at org.junit.platform.launcher.core.DefaultLauncher.discoverEngineRoot(DefaultLauncher.java:130)
17:40:59 [2021-03-13T22:40:59.855Z] 	at org.junit.platform.launcher.core.DefaultLauncher.discoverRoot(DefaultLauncher.java:117)
17:40:59 [2021-03-13T22:40:59.855Z] 	at org.junit.platform.launcher.core.DefaultLauncher.execute(DefaultLauncher.java:90)
17:40:59 [2021-03-13T22:40:59.855Z] 	at org.apache.maven.surefire.junitplatform.JUnitPlatformProvider.invokeAllTests(JUnitPlatformProvider.java:150)
17:40:59 [2021-03-13T22:40:59.855Z] 	at org.apache.maven.surefire.junitplatform.JUnitPlatformProvider.invoke(JUnitPlatformProvider.java:124)
17:40:59 [2021-03-13T22:40:59.855Z] 	at java.base/jdk.internal.reflect.NativeMethodAccessorImpl.invoke0(Native Method)
17:40:59 [2021-03-13T22:40:59.855Z] 	at java.base/jdk.internal.reflect.NativeMethodAccessorImpl.invoke(NativeMethodAccessorImpl.java:64)
17:40:59 [2021-03-13T22:40:59.855Z] 	at java.base/jdk.internal.reflect.DelegatingMethodAccessorImpl.invoke(DelegatingMethodAccessorImpl.java:43)
17:40:59 [2021-03-13T22:40:59.855Z] 	at java.base/java.lang.reflect.Method.invoke(Method.java:564)
17:40:59 [2021-03-13T22:40:59.855Z] 	at org.apache.maven.surefire.util.ReflectionUtils.invokeMethodWithArray2(ReflectionUtils.java:206)
17:40:59 [2021-03-13T22:40:59.855Z] 	at org.apache.maven.surefire.booter.ProviderFactory$ProviderProxy.invoke(ProviderFactory.java:161)
17:40:59 [2021-03-13T22:40:59.855Z] 	at org.apache.maven.surefire.booter.ProviderFactory.invokeProvider(ProviderFactory.java:84)
17:40:59 [2021-03-13T22:40:59.855Z] 	at org.eclipse.tycho.surefire.osgibooter.OsgiSurefireBooter.run(OsgiSurefireBooter.java:116)
17:40:59 [2021-03-13T22:40:59.855Z] 	at org.eclipse.tycho.surefire.osgibooter.HeadlessTestApplication.start(HeadlessTestApplication.java:23)
17:40:59 [2021-03-13T22:40:59.855Z] 	at org.eclipse.equinox.internal.app.EclipseAppHandle.run(EclipseAppHandle.java:203)
17:40:59 [2021-03-13T22:40:59.855Z] 	at org.eclipse.core.runtime.internal.adaptor.EclipseAppLauncher.runApplication(EclipseAppLauncher.java:137)
17:40:59 [2021-03-13T22:40:59.855Z] 	at org.eclipse.core.runtime.internal.adaptor.EclipseAppLauncher.start(EclipseAppLauncher.java:107)
17:40:59 [2021-03-13T22:40:59.855Z] 	at org.eclipse.core.runtime.adaptor.EclipseStarter.run(EclipseStarter.java:400)
17:40:59 [2021-03-13T22:40:59.856Z] 	at org.eclipse.core.runtime.adaptor.EclipseStarter.run(EclipseStarter.java:255)
17:40:59 [2021-03-13T22:40:59.856Z] 	at java.base/jdk.internal.reflect.NativeMethodAccessorImpl.invoke0(Native Method)
17:40:59 [2021-03-13T22:40:59.856Z] 	at java.base/jdk.internal.reflect.NativeMethodAccessorImpl.invoke(NativeMethodAccessorImpl.java:64)
17:40:59 [2021-03-13T22:40:59.856Z] 	at java.base/jdk.internal.reflect.DelegatingMethodAccessorImpl.invoke(DelegatingMethodAccessorImpl.java:43)
17:40:59 [2021-03-13T22:40:59.856Z] 	at java.base/java.lang.reflect.Method.invoke(Method.java:564)
17:40:59 [2021-03-13T22:40:59.856Z] 	at org.eclipse.equinox.launcher.Main.invokeFramework(Main.java:661)
17:40:59 [2021-03-13T22:40:59.856Z] 	at org.eclipse.equinox.launcher.Main.basicRun(Main.java:597)
17:40:59 [2021-03-13T22:40:59.856Z] 	at org.eclipse.equinox.launcher.Main.run(Main.java:1476)
17:40:59 [2021-03-13T22:40:59.856Z] 	at org.eclipse.equinox.launcher.Main.main(Main.java:1449)
17:40:59 [2021-03-13T22:40:59.856Z] Caused by: java.lang.ClassNotFoundException: org.junit.runners.model.RunnerBuilder cannot be found by org.eclipse.tycho.surefire.osgibooter_2.2.0
17:40:59 [2021-03-13T22:40:59.856Z] 	at org.eclipse.osgi.internal.loader.BundleLoader.findClassInternal(BundleLoader.java:511)
17:40:59 [2021-03-13T22:40:59.856Z] 	at org.eclipse.osgi.internal.loader.BundleLoader.findClass(BundleLoader.java:422)
17:40:59 [2021-03-13T22:40:59.856Z] 	at org.eclipse.osgi.internal.loader.BundleLoader.findClass(BundleLoader.java:414)
17:40:59 [2021-03-13T22:40:59.856Z] 	at org.eclipse.osgi.internal.loader.ModuleClassLoader.loadClass(ModuleClassLoader.java:153)
17:40:59 [2021-03-13T22:40:59.856Z] 	at java.base/java.lang.ClassLoader.loadClass(ClassLoader.java:522)
17:40:59 [2021-03-13T22:40:59.856Z] 	... 29 more
17:40:59 [2021-03-13T22:40:59.856Z] 
17:40:59 [2021-03-13T22:40:59.856Z] Running org.eclipse.ease.lang.scriptarchive.ArchiveEngineTest
17:40:59 [2021-03-13T22:40:59.856Z] We are running from a zip file!
17:41:00 [2021-03-13T22:41:00.112Z] org.eclipse.ease.ScriptExecutionException: SyntaxError: missing ; before statement (workspace://__EASE_ScriptArchive_1/scripts/Master.js#3)
17:41:00 [2021-03-13T22:41:00.112Z] this is an error
17:41:00 [2021-03-13T22:41:00.112Z]        ^
17:41:00 [2021-03-13T22:41:00.112Z] 	at Master.js,workspace://__EASE_ScriptArchive_1/scripts/Master.js
17:41:00 [2021-03-13T22:41:00.112Z] org.eclipse.ease.ScriptExecutionException: SyntaxError: missing ; before statement (workspace://__EASE_ScriptArchive_1/scripts/Master.js#3)
17:41:00 [2021-03-13T22:41:00.112Z] this is an error
17:41:00 [2021-03-13T22:41:00.112Z]        ^
17:41:00 [2021-03-13T22:41:00.112Z] 	at Master.js,workspace://__EASE_ScriptArchive_1/scripts/Master.js
17:41:00 [2021-03-13T22:41:00.112Z] Tests run: 7, Failures: 0, Errors: 0, Skipped: 0, Time elapsed: 0.763 s - in org.eclipse.ease.lang.scriptarchive.ArchiveEngineTest
17:41:00 [2021-03-13T22:41:00.112Z] executeWithManifest  Time elapsed: 0.63 s
17:41:00 [2021-03-13T22:41:00.112Z] zipFileRegistration  Time elapsed: 0.013 s
17:41:00 [2021-03-13T22:41:00.112Z] engineIdRegistration  Time elapsed: 0.001 s
17:41:00 [2021-03-13T22:41:00.112Z] jarFileRegistration  Time elapsed: 0.001 s
17:41:00 [2021-03-13T22:41:00.112Z] sarFileRegistration  Time elapsed: 0 s
17:41:00 [2021-03-13T22:41:00.112Z] executeWithErrors  Time elapsed: 0.075 s
17:41:00 [2021-03-13T22:41:00.112Z] executeWithIncludes  Time elapsed: 0.037 s
17:41:00 [2021-03-13T22:41:00.112Z] 
17:41:00 [2021-03-13T22:41:00.112Z] Results:
17:41:00 [2021-03-13T22:41:00.112Z] 
17:41:00 [2021-03-13T22:41:00.112Z] Tests run: 7, Failures: 0, Errors: 0, Skipped: 0
17:41:00 [2021-03-13T22:41:00.112Z] 
17:41:00 [2021-03-13T22:41:00.703Z] [INFO] All tests passed!
17:41:00 [2021-03-13T22:41:00.703Z] [INFO] 
17:41:00 [2021-03-13T22:41:00.703Z] [INFO] -------------< org.eclipse.ease:org.eclipse.ease.ui.test >--------------
17:41:00 [2021-03-13T22:41:00.703Z] [INFO] Building org.eclipse.ease.ui.test 0.8.0-SNAPSHOT                   [9/9]
17:41:00 [2021-03-13T22:41:00.703Z] [INFO] ------------------------[ eclipse-test-plugin ]-------------------------
17:41:00 [2021-03-13T22:41:00.703Z] [INFO] 
17:41:00 [2021-03-13T22:41:00.703Z] [INFO] --- tycho-packaging-plugin:2.2.0:build-qualifier (default-build-qualifier) @ org.eclipse.ease.ui.test ---
17:41:00 [2021-03-13T22:41:00.703Z] [INFO] The project's OSGi version is 0.8.0.I202103031149
17:41:00 [2021-03-13T22:41:00.703Z] [INFO] 
17:41:00 [2021-03-13T22:41:00.703Z] [INFO] --- tycho-packaging-plugin:2.2.0:validate-id (default-validate-id) @ org.eclipse.ease.ui.test ---
17:41:00 [2021-03-13T22:41:00.703Z] [INFO] 
17:41:00 [2021-03-13T22:41:00.703Z] [INFO] --- tycho-packaging-plugin:2.2.0:validate-version (default-validate-version) @ org.eclipse.ease.ui.test ---
17:41:00 [2021-03-13T22:41:00.703Z] [INFO] 
17:41:00 [2021-03-13T22:41:00.703Z] [INFO] --- maven-resources-plugin:2.4.3:resources (default-resources) @ org.eclipse.ease.ui.test ---
17:41:00 [2021-03-13T22:41:00.703Z] [INFO] Using 'UTF-8' encoding to copy filtered resources.
17:41:00 [2021-03-13T22:41:00.703Z] [INFO] skip non existing resourceDirectory /home/jenkins/agent/workspace/ease.verify.core.target.2019-03/tests/org.eclipse.ease.ui.test/src/main/resources
17:41:00 [2021-03-13T22:41:00.703Z] [INFO] 
17:41:00 [2021-03-13T22:41:00.703Z] [INFO] --- tycho-compiler-plugin:2.2.0:compile (default-compile) @ org.eclipse.ease.ui.test ---
17:41:00 [2021-03-13T22:41:00.703Z] [INFO] Nothing to compile - all classes are up to date
17:41:00 [2021-03-13T22:41:00.703Z] [INFO] 
17:41:00 [2021-03-13T22:41:00.703Z] [INFO] --- maven-resources-plugin:2.4.3:testResources (default-testResources) @ org.eclipse.ease.ui.test ---
17:41:00 [2021-03-13T22:41:00.703Z] [INFO] Using 'UTF-8' encoding to copy filtered resources.
17:41:00 [2021-03-13T22:41:00.703Z] [INFO] skip non existing resourceDirectory /home/jenkins/agent/workspace/ease.verify.core.target.2019-03/tests/org.eclipse.ease.ui.test/src/test/resources
17:41:00 [2021-03-13T22:41:00.703Z] [INFO] 
17:41:00 [2021-03-13T22:41:00.703Z] [INFO] --- target-platform-configuration:2.2.0:target-platform (default-target-platform) @ org.eclipse.ease.ui.test ---
17:41:00 [2021-03-13T22:41:00.703Z] [INFO] 
17:41:00 [2021-03-13T22:41:00.703Z] [INFO] --- tycho-packaging-plugin:2.2.0:package-plugin (default-package-plugin) @ org.eclipse.ease.ui.test ---
17:41:00 [2021-03-13T22:41:00.703Z] [INFO] Building jar: /home/jenkins/agent/workspace/ease.verify.core.target.2019-03/tests/org.eclipse.ease.ui.test/target/org.eclipse.ease.ui.test-0.8.0-SNAPSHOT.jar
17:41:00 [2021-03-13T22:41:00.703Z] [INFO] 
17:41:00 [2021-03-13T22:41:00.703Z] [INFO] --- tycho-p2-plugin:2.2.0:p2-metadata-default (default-p2-metadata-default) @ org.eclipse.ease.ui.test ---
17:41:00 [2021-03-13T22:41:00.703Z] [INFO] 
17:41:00 [2021-03-13T22:41:00.703Z] [INFO] --- jacoco-maven-plugin:0.8.6:prepare-agent (jacoco-initialize) @ org.eclipse.ease.ui.test ---
17:41:00 [2021-03-13T22:41:00.703Z] [INFO] tycho.testArgLine set to -javaagent:/home/jenkins/.m2/repository/org/jacoco/org.jacoco.agent/0.8.6/org.jacoco.agent-0.8.6-runtime.jar=destfile=/home/jenkins/agent/workspace/ease.verify.core.target.2019-03/tests/org.eclipse.ease.ui.test/target/jacoco.exec,output=file
17:41:00 [2021-03-13T22:41:00.703Z] [INFO] 
17:41:00 [2021-03-13T22:41:00.703Z] [INFO] --- tycho-surefire-plugin:2.2.0:test (default-test) @ org.eclipse.ease.ui.test ---
17:41:00 [2021-03-13T22:41:00.703Z] [INFO] Executing Test Runtime with timeout 0, logs (if any) will be placed at: /home/jenkins/agent/workspace/ease.verify.core.target.2019-03/tests/org.eclipse.ease.ui.test/target/work/data/.metadata/.log
17:41:00 [2021-03-13T22:41:00.703Z] [INFO] Command line:
17:41:00 [2021-03-13T22:41:00.703Z] 	[/opt/tools/java/openjdk/jdk-15/15.0.2+7/bin/java, -Dosgi.noShutdown=false, -Dosgi.os=linux, -Dosgi.ws=gtk, -Dosgi.arch=x86_64, -javaagent:/home/jenkins/.m2/repository/org/jacoco/org.jacoco.agent/0.8.6/org.jacoco.agent-0.8.6-runtime.jar=destfile=/home/jenkins/agent/workspace/ease.verify.core.target.2019-03/tests/org.eclipse.ease.ui.test/target/jacoco.exec,output=file, -Dosgi.clean=true, -jar, /home/jenkins/.m2/repository/p2/osgi/bundle/org.eclipse.equinox.launcher/1.5.300.v20190213-1655/org.eclipse.equinox.launcher-1.5.300.v20190213-1655.jar, -data, /home/jenkins/agent/workspace/ease.verify.core.target.2019-03/tests/org.eclipse.ease.ui.test/target/work/data, -install, /home/jenkins/agent/workspace/ease.verify.core.target.2019-03/tests/org.eclipse.ease.ui.test/target/work, -configuration, /home/jenkins/agent/workspace/ease.verify.core.target.2019-03/tests/org.eclipse.ease.ui.test/target/work/configuration, -application, org.eclipse.tycho.surefire.osgibooter.headlesstest, -testproperties, /home/jenkins/agent/workspace/ease.verify.core.target.2019-03/tests/org.eclipse.ease.ui.test/target/surefire.properties]
17:41:00 [2021-03-13T22:41:00.703Z] Picked up JAVA_TOOL_OPTIONS: -Dmaven.ext.class.path="/home/jenkins/agent/workspace/ease.verify.core.target.2019-03@tmp/withMavenf02f74e7/pipeline-maven-spy.jar" -Dorg.jenkinsci.plugins.pipeline.maven.reportsFolder="/home/jenkins/agent/workspace/ease.verify.core.target.2019-03@tmp/withMavenf02f74e7" 
17:41:04 [2021-03-13T22:41:04.014Z] Mar 13, 2021 10:41:03 PM org.junit.platform.launcher.core.DefaultLauncher handleThrowable
17:41:04 [2021-03-13T22:41:04.014Z] WARNING: TestEngine with ID 'junit-vintage' failed to discover tests
17:41:04 [2021-03-13T22:41:04.014Z] java.lang.NoClassDefFoundError: org/junit/runners/model/RunnerBuilder
17:41:04 [2021-03-13T22:41:04.014Z] 	at org.junit.vintage.engine.discovery.VintageDiscoverer.<init>(VintageDiscoverer.java:48)
17:41:04 [2021-03-13T22:41:04.014Z] 	at org.junit.vintage.engine.VintageTestEngine.discover(VintageTestEngine.java:65)
17:41:04 [2021-03-13T22:41:04.014Z] 	at org.junit.platform.launcher.core.DefaultLauncher.discoverEngineRoot(DefaultLauncher.java:130)
17:41:04 [2021-03-13T22:41:04.014Z] 	at org.junit.platform.launcher.core.DefaultLauncher.discoverRoot(DefaultLauncher.java:117)
17:41:04 [2021-03-13T22:41:04.014Z] 	at org.junit.platform.launcher.core.DefaultLauncher.discover(DefaultLauncher.java:82)
17:41:04 [2021-03-13T22:41:04.014Z] 	at org.apache.maven.surefire.junitplatform.TestPlanScannerFilter.accept(TestPlanScannerFilter.java:56)
17:41:04 [2021-03-13T22:41:04.014Z] 	at org.apache.maven.surefire.util.DefaultScanResult.applyFilter(DefaultScanResult.java:102)
17:41:04 [2021-03-13T22:41:04.014Z] 	at org.apache.maven.surefire.junitplatform.JUnitPlatformProvider.scanClasspath(JUnitPlatformProvider.java:143)
17:41:04 [2021-03-13T22:41:04.014Z] 	at org.apache.maven.surefire.junitplatform.JUnitPlatformProvider.invoke(JUnitPlatformProvider.java:124)
17:41:04 [2021-03-13T22:41:04.014Z] 	at java.base/jdk.internal.reflect.NativeMethodAccessorImpl.invoke0(Native Method)
17:41:04 [2021-03-13T22:41:04.014Z] 	at java.base/jdk.internal.reflect.NativeMethodAccessorImpl.invoke(NativeMethodAccessorImpl.java:64)
17:41:04 [2021-03-13T22:41:04.014Z] 	at java.base/jdk.internal.reflect.DelegatingMethodAccessorImpl.invoke(DelegatingMethodAccessorImpl.java:43)
17:41:04 [2021-03-13T22:41:04.014Z] 	at java.base/java.lang.reflect.Method.invoke(Method.java:564)
17:41:04 [2021-03-13T22:41:04.014Z] 	at org.apache.maven.surefire.util.ReflectionUtils.invokeMethodWithArray2(ReflectionUtils.java:206)
17:41:04 [2021-03-13T22:41:04.015Z] 	at org.apache.maven.surefire.booter.ProviderFactory$ProviderProxy.invoke(ProviderFactory.java:161)
17:41:04 [2021-03-13T22:41:04.015Z] 	at org.apache.maven.surefire.booter.ProviderFactory.invokeProvider(ProviderFactory.java:84)
17:41:04 [2021-03-13T22:41:04.015Z] 	at org.eclipse.tycho.surefire.osgibooter.OsgiSurefireBooter.run(OsgiSurefireBooter.java:116)
17:41:04 [2021-03-13T22:41:04.015Z] 	at org.eclipse.tycho.surefire.osgibooter.HeadlessTestApplication.start(HeadlessTestApplication.java:23)
17:41:04 [2021-03-13T22:41:04.015Z] 	at org.eclipse.equinox.internal.app.EclipseAppHandle.run(EclipseAppHandle.java:203)
17:41:04 [2021-03-13T22:41:04.015Z] 	at org.eclipse.core.runtime.internal.adaptor.EclipseAppLauncher.runApplication(EclipseAppLauncher.java:137)
17:41:04 [2021-03-13T22:41:04.015Z] 	at org.eclipse.core.runtime.internal.adaptor.EclipseAppLauncher.start(EclipseAppLauncher.java:107)
17:41:04 [2021-03-13T22:41:04.015Z] 	at org.eclipse.core.runtime.adaptor.EclipseStarter.run(EclipseStarter.java:400)
17:41:04 [2021-03-13T22:41:04.015Z] 	at org.eclipse.core.runtime.adaptor.EclipseStarter.run(EclipseStarter.java:255)
17:41:04 [2021-03-13T22:41:04.015Z] 	at java.base/jdk.internal.reflect.NativeMethodAccessorImpl.invoke0(Native Method)
17:41:04 [2021-03-13T22:41:04.015Z] 	at java.base/jdk.internal.reflect.NativeMethodAccessorImpl.invoke(NativeMethodAccessorImpl.java:64)
17:41:04 [2021-03-13T22:41:04.015Z] 	at java.base/jdk.internal.reflect.DelegatingMethodAccessorImpl.invoke(DelegatingMethodAccessorImpl.java:43)
17:41:04 [2021-03-13T22:41:04.015Z] 	at java.base/java.lang.reflect.Method.invoke(Method.java:564)
17:41:04 [2021-03-13T22:41:04.015Z] 	at org.eclipse.equinox.launcher.Main.invokeFramework(Main.java:661)
17:41:04 [2021-03-13T22:41:04.015Z] 	at org.eclipse.equinox.launcher.Main.basicRun(Main.java:597)
17:41:04 [2021-03-13T22:41:04.015Z] 	at org.eclipse.equinox.launcher.Main.run(Main.java:1476)
17:41:04 [2021-03-13T22:41:04.015Z] 	at org.eclipse.equinox.launcher.Main.main(Main.java:1449)
17:41:04 [2021-03-13T22:41:04.015Z] Caused by: java.lang.ClassNotFoundException: org.junit.runners.model.RunnerBuilder cannot be found by org.eclipse.tycho.surefire.osgibooter_2.2.0
17:41:04 [2021-03-13T22:41:04.015Z] 	at org.eclipse.osgi.internal.loader.BundleLoader.findClassInternal(BundleLoader.java:511)
17:41:04 [2021-03-13T22:41:04.015Z] 	at org.eclipse.osgi.internal.loader.BundleLoader.findClass(BundleLoader.java:422)
17:41:04 [2021-03-13T22:41:04.015Z] 	at org.eclipse.osgi.internal.loader.BundleLoader.findClass(BundleLoader.java:414)
17:41:04 [2021-03-13T22:41:04.015Z] 	at org.eclipse.osgi.internal.loader.ModuleClassLoader.loadClass(ModuleClassLoader.java:153)
17:41:04 [2021-03-13T22:41:04.015Z] 	at java.base/java.lang.ClassLoader.loadClass(ClassLoader.java:522)
17:41:04 [2021-03-13T22:41:04.015Z] 	... 31 more
17:41:04 [2021-03-13T22:41:04.015Z] 
17:41:04 [2021-03-13T22:41:04.015Z] Mar 13, 2021 10:41:03 PM org.junit.platform.launcher.core.DefaultLauncher handleThrowable
17:41:04 [2021-03-13T22:41:04.015Z] WARNING: TestEngine with ID 'junit-vintage' failed to discover tests
17:41:04 [2021-03-13T22:41:04.015Z] java.lang.NoClassDefFoundError: org/junit/runners/model/RunnerBuilder
17:41:04 [2021-03-13T22:41:04.015Z] 	at org.junit.vintage.engine.discovery.VintageDiscoverer.<init>(VintageDiscoverer.java:48)
17:41:04 [2021-03-13T22:41:04.015Z] 	at org.junit.vintage.engine.VintageTestEngine.discover(VintageTestEngine.java:65)
17:41:04 [2021-03-13T22:41:04.015Z] 	at org.junit.platform.launcher.core.DefaultLauncher.discoverEngineRoot(DefaultLauncher.java:130)
17:41:04 [2021-03-13T22:41:04.015Z] 	at org.junit.platform.launcher.core.DefaultLauncher.discoverRoot(DefaultLauncher.java:117)
17:41:04 [2021-03-13T22:41:04.015Z] 	at org.junit.platform.launcher.core.DefaultLauncher.discover(DefaultLauncher.java:82)
17:41:04 [2021-03-13T22:41:04.015Z] 	at org.apache.maven.surefire.junitplatform.TestPlanScannerFilter.accept(TestPlanScannerFilter.java:56)
17:41:04 [2021-03-13T22:41:04.015Z] 	at org.apache.maven.surefire.util.DefaultScanResult.applyFilter(DefaultScanResult.java:102)
17:41:04 [2021-03-13T22:41:04.015Z] 	at org.apache.maven.surefire.junitplatform.JUnitPlatformProvider.scanClasspath(JUnitPlatformProvider.java:143)
17:41:04 [2021-03-13T22:41:04.015Z] 	at org.apache.maven.surefire.junitplatform.JUnitPlatformProvider.invoke(JUnitPlatformProvider.java:124)
17:41:04 [2021-03-13T22:41:04.015Z] 	at java.base/jdk.internal.reflect.NativeMethodAccessorImpl.invoke0(Native Method)
17:41:04 [2021-03-13T22:41:04.015Z] 	at java.base/jdk.internal.reflect.NativeMethodAccessorImpl.invoke(NativeMethodAccessorImpl.java:64)
17:41:04 [2021-03-13T22:41:04.015Z] 	at java.base/jdk.internal.reflect.DelegatingMethodAccessorImpl.invoke(DelegatingMethodAccessorImpl.java:43)
17:41:04 [2021-03-13T22:41:04.015Z] 	at java.base/java.lang.reflect.Method.invoke(Method.java:564)
17:41:04 [2021-03-13T22:41:04.015Z] 	at org.apache.maven.surefire.util.ReflectionUtils.invokeMethodWithArray2(ReflectionUtils.java:206)
17:41:04 [2021-03-13T22:41:04.015Z] 	at org.apache.maven.surefire.booter.ProviderFactory$ProviderProxy.invoke(ProviderFactory.java:161)
17:41:04 [2021-03-13T22:41:04.015Z] 	at org.apache.maven.surefire.booter.ProviderFactory.invokeProvider(ProviderFactory.java:84)
17:41:04 [2021-03-13T22:41:04.015Z] 	at org.eclipse.tycho.surefire.osgibooter.OsgiSurefireBooter.run(OsgiSurefireBooter.java:116)
17:41:04 [2021-03-13T22:41:04.015Z] 	at org.eclipse.tycho.surefire.osgibooter.HeadlessTestApplication.start(HeadlessTestApplication.java:23)
17:41:04 [2021-03-13T22:41:04.015Z] 	at org.eclipse.equinox.internal.app.EclipseAppHandle.run(EclipseAppHandle.java:203)
17:41:04 [2021-03-13T22:41:04.015Z] 	at org.eclipse.core.runtime.internal.adaptor.EclipseAppLauncher.runApplication(EclipseAppLauncher.java:137)
17:41:04 [2021-03-13T22:41:04.015Z] 	at org.eclipse.core.runtime.internal.adaptor.EclipseAppLauncher.start(EclipseAppLauncher.java:107)
17:41:04 [2021-03-13T22:41:04.015Z] 	at org.eclipse.core.runtime.adaptor.EclipseStarter.run(EclipseStarter.java:400)
17:41:04 [2021-03-13T22:41:04.015Z] 	at org.eclipse.core.runtime.adaptor.EclipseStarter.run(EclipseStarter.java:255)
17:41:04 [2021-03-13T22:41:04.015Z] 	at java.base/jdk.internal.reflect.NativeMethodAccessorImpl.invoke0(Native Method)
17:41:04 [2021-03-13T22:41:04.015Z] 	at java.base/jdk.internal.reflect.NativeMethodAccessorImpl.invoke(NativeMethodAccessorImpl.java:64)
17:41:04 [2021-03-13T22:41:04.015Z] 	at java.base/jdk.internal.reflect.DelegatingMethodAccessorImpl.invoke(DelegatingMethodAccessorImpl.java:43)
17:41:04 [2021-03-13T22:41:04.015Z] 	at java.base/java.lang.reflect.Method.invoke(Method.java:564)
17:41:04 [2021-03-13T22:41:04.015Z] 	at org.eclipse.equinox.launcher.Main.invokeFramework(Main.java:661)
17:41:04 [2021-03-13T22:41:04.015Z] 	at org.eclipse.equinox.launcher.Main.basicRun(Main.java:597)
17:41:04 [2021-03-13T22:41:04.015Z] 	at org.eclipse.equinox.launcher.Main.run(Main.java:1476)
17:41:04 [2021-03-13T22:41:04.015Z] 	at org.eclipse.equinox.launcher.Main.main(Main.java:1449)
17:41:04 [2021-03-13T22:41:04.015Z] Caused by: java.lang.ClassNotFoundException: org.junit.runners.model.RunnerBuilder cannot be found by org.eclipse.tycho.surefire.osgibooter_2.2.0
17:41:04 [2021-03-13T22:41:04.015Z] 	at org.eclipse.osgi.internal.loader.BundleLoader.findClassInternal(BundleLoader.java:511)
17:41:04 [2021-03-13T22:41:04.015Z] 	at org.eclipse.osgi.internal.loader.BundleLoader.findClass(BundleLoader.java:422)
17:41:04 [2021-03-13T22:41:04.015Z] 	at org.eclipse.osgi.internal.loader.BundleLoader.findClass(BundleLoader.java:414)
17:41:04 [2021-03-13T22:41:04.015Z] 	at org.eclipse.osgi.internal.loader.ModuleClassLoader.loadClass(ModuleClassLoader.java:153)
17:41:04 [2021-03-13T22:41:04.015Z] 	at java.base/java.lang.ClassLoader.loadClass(ClassLoader.java:522)
17:41:04 [2021-03-13T22:41:04.015Z] 	... 31 more
17:41:04 [2021-03-13T22:41:04.015Z] 
17:41:04 [2021-03-13T22:41:04.015Z] Mar 13, 2021 10:41:03 PM org.junit.platform.launcher.core.DefaultLauncher handleThrowable
17:41:04 [2021-03-13T22:41:04.015Z] WARNING: TestEngine with ID 'junit-vintage' failed to discover tests
17:41:04 [2021-03-13T22:41:04.015Z] java.lang.NoClassDefFoundError: org/junit/runners/model/RunnerBuilder
17:41:04 [2021-03-13T22:41:04.015Z] 	at org.junit.vintage.engine.discovery.VintageDiscoverer.<init>(VintageDiscoverer.java:48)
17:41:04 [2021-03-13T22:41:04.015Z] 	at org.junit.vintage.engine.VintageTestEngine.discover(VintageTestEngine.java:65)
17:41:04 [2021-03-13T22:41:04.015Z] 	at org.junit.platform.launcher.core.DefaultLauncher.discoverEngineRoot(DefaultLauncher.java:130)
17:41:04 [2021-03-13T22:41:04.015Z] 	at org.junit.platform.launcher.core.DefaultLauncher.discoverRoot(DefaultLauncher.java:117)
17:41:04 [2021-03-13T22:41:04.015Z] 	at org.junit.platform.launcher.core.DefaultLauncher.discover(DefaultLauncher.java:82)
17:41:04 [2021-03-13T22:41:04.015Z] 	at org.apache.maven.surefire.junitplatform.TestPlanScannerFilter.accept(TestPlanScannerFilter.java:56)
17:41:04 [2021-03-13T22:41:04.015Z] 	at org.apache.maven.surefire.util.DefaultScanResult.applyFilter(DefaultScanResult.java:102)
17:41:04 [2021-03-13T22:41:04.015Z] 	at org.apache.maven.surefire.junitplatform.JUnitPlatformProvider.scanClasspath(JUnitPlatformProvider.java:143)
17:41:04 [2021-03-13T22:41:04.015Z] 	at org.apache.maven.surefire.junitplatform.JUnitPlatformProvider.invoke(JUnitPlatformProvider.java:124)
17:41:04 [2021-03-13T22:41:04.015Z] 	at java.base/jdk.internal.reflect.NativeMethodAccessorImpl.invoke0(Native Method)
17:41:04 [2021-03-13T22:41:04.015Z] 	at java.base/jdk.internal.reflect.NativeMethodAccessorImpl.invoke(NativeMethodAccessorImpl.java:64)
17:41:04 [2021-03-13T22:41:04.015Z] 	at java.base/jdk.internal.reflect.DelegatingMethodAccessorImpl.invoke(DelegatingMethodAccessorImpl.java:43)
17:41:04 [2021-03-13T22:41:04.015Z] 	at java.base/java.lang.reflect.Method.invoke(Method.java:564)
17:41:04 [2021-03-13T22:41:04.015Z] 	at org.apache.maven.surefire.util.ReflectionUtils.invokeMethodWithArray2(ReflectionUtils.java:206)
17:41:04 [2021-03-13T22:41:04.016Z] 	at org.apache.maven.surefire.booter.ProviderFactory$ProviderProxy.invoke(ProviderFactory.java:161)
17:41:04 [2021-03-13T22:41:04.016Z] 	at org.apache.maven.surefire.booter.ProviderFactory.invokeProvider(ProviderFactory.java:84)
17:41:04 [2021-03-13T22:41:04.016Z] 	at org.eclipse.tycho.surefire.osgibooter.OsgiSurefireBooter.run(OsgiSurefireBooter.java:116)
17:41:04 [2021-03-13T22:41:04.016Z] 	at org.eclipse.tycho.surefire.osgibooter.HeadlessTestApplication.start(HeadlessTestApplication.java:23)
17:41:04 [2021-03-13T22:41:04.016Z] 	at org.eclipse.equinox.internal.app.EclipseAppHandle.run(EclipseAppHandle.java:203)
17:41:04 [2021-03-13T22:41:04.016Z] 	at org.eclipse.core.runtime.internal.adaptor.EclipseAppLauncher.runApplication(EclipseAppLauncher.java:137)
17:41:04 [2021-03-13T22:41:04.016Z] 	at org.eclipse.core.runtime.internal.adaptor.EclipseAppLauncher.start(EclipseAppLauncher.java:107)
17:41:04 [2021-03-13T22:41:04.016Z] 	at org.eclipse.core.runtime.adaptor.EclipseStarter.run(EclipseStarter.java:400)
17:41:04 [2021-03-13T22:41:04.016Z] 	at org.eclipse.core.runtime.adaptor.EclipseStarter.run(EclipseStarter.java:255)
17:41:04 [2021-03-13T22:41:04.016Z] 	at java.base/jdk.internal.reflect.NativeMethodAccessorImpl.invoke0(Native Method)
17:41:04 [2021-03-13T22:41:04.016Z] 	at java.base/jdk.internal.reflect.NativeMethodAccessorImpl.invoke(NativeMethodAccessorImpl.java:64)
17:41:04 [2021-03-13T22:41:04.016Z] 	at java.base/jdk.internal.reflect.DelegatingMethodAccessorImpl.invoke(DelegatingMethodAccessorImpl.java:43)
17:41:04 [2021-03-13T22:41:04.016Z] 	at java.base/java.lang.reflect.Method.invoke(Method.java:564)
17:41:04 [2021-03-13T22:41:04.016Z] 	at org.eclipse.equinox.launcher.Main.invokeFramework(Main.java:661)
17:41:04 [2021-03-13T22:41:04.016Z] 	at org.eclipse.equinox.launcher.Main.basicRun(Main.java:597)
17:41:04 [2021-03-13T22:41:04.016Z] 	at org.eclipse.equinox.launcher.Main.run(Main.java:1476)
17:41:04 [2021-03-13T22:41:04.016Z] 	at org.eclipse.equinox.launcher.Main.main(Main.java:1449)
17:41:04 [2021-03-13T22:41:04.016Z] Caused by: java.lang.ClassNotFoundException: org.junit.runners.model.RunnerBuilder cannot be found by org.eclipse.tycho.surefire.osgibooter_2.2.0
17:41:04 [2021-03-13T22:41:04.016Z] 	at org.eclipse.osgi.internal.loader.BundleLoader.findClassInternal(BundleLoader.java:511)
17:41:04 [2021-03-13T22:41:04.016Z] 	at org.eclipse.osgi.internal.loader.BundleLoader.findClass(BundleLoader.java:422)
17:41:04 [2021-03-13T22:41:04.016Z] 	at org.eclipse.osgi.internal.loader.BundleLoader.findClass(BundleLoader.java:414)
17:41:04 [2021-03-13T22:41:04.016Z] 	at org.eclipse.osgi.internal.loader.ModuleClassLoader.loadClass(ModuleClassLoader.java:153)
17:41:04 [2021-03-13T22:41:04.016Z] 	at java.base/java.lang.ClassLoader.loadClass(ClassLoader.java:522)
17:41:04 [2021-03-13T22:41:04.016Z] 	... 31 more
17:41:04 [2021-03-13T22:41:04.016Z] 
17:41:04 [2021-03-13T22:41:04.016Z] Mar 13, 2021 10:41:03 PM org.junit.platform.launcher.core.DefaultLauncher handleThrowable
17:41:04 [2021-03-13T22:41:04.016Z] WARNING: TestEngine with ID 'junit-vintage' failed to discover tests
17:41:04 [2021-03-13T22:41:04.016Z] java.lang.NoClassDefFoundError: org/junit/runners/model/RunnerBuilder
17:41:04 [2021-03-13T22:41:04.016Z] 	at org.junit.vintage.engine.discovery.VintageDiscoverer.<init>(VintageDiscoverer.java:48)
17:41:04 [2021-03-13T22:41:04.016Z] 	at org.junit.vintage.engine.VintageTestEngine.discover(VintageTestEngine.java:65)
17:41:04 [2021-03-13T22:41:04.016Z] 	at org.junit.platform.launcher.core.DefaultLauncher.discoverEngineRoot(DefaultLauncher.java:130)
17:41:04 [2021-03-13T22:41:04.016Z] 	at org.junit.platform.launcher.core.DefaultLauncher.discoverRoot(DefaultLauncher.java:117)
17:41:04 [2021-03-13T22:41:04.016Z] 	at org.junit.platform.launcher.core.DefaultLauncher.discover(DefaultLauncher.java:82)
17:41:04 [2021-03-13T22:41:04.016Z] 	at org.apache.maven.surefire.junitplatform.TestPlanScannerFilter.accept(TestPlanScannerFilter.java:56)
17:41:04 [2021-03-13T22:41:04.016Z] 	at org.apache.maven.surefire.util.DefaultScanResult.applyFilter(DefaultScanResult.java:102)
17:41:04 [2021-03-13T22:41:04.016Z] 	at org.apache.maven.surefire.junitplatform.JUnitPlatformProvider.scanClasspath(JUnitPlatformProvider.java:143)
17:41:04 [2021-03-13T22:41:04.016Z] 	at org.apache.maven.surefire.junitplatform.JUnitPlatformProvider.invoke(JUnitPlatformProvider.java:124)
17:41:04 [2021-03-13T22:41:04.016Z] 	at java.base/jdk.internal.reflect.NativeMethodAccessorImpl.invoke0(Native Method)
17:41:04 [2021-03-13T22:41:04.016Z] 	at java.base/jdk.internal.reflect.NativeMethodAccessorImpl.invoke(NativeMethodAccessorImpl.java:64)
17:41:04 [2021-03-13T22:41:04.016Z] 	at java.base/jdk.internal.reflect.DelegatingMethodAccessorImpl.invoke(DelegatingMethodAccessorImpl.java:43)
17:41:04 [2021-03-13T22:41:04.016Z] 	at java.base/java.lang.reflect.Method.invoke(Method.java:564)
17:41:04 [2021-03-13T22:41:04.016Z] 	at org.apache.maven.surefire.util.ReflectionUtils.invokeMethodWithArray2(ReflectionUtils.java:206)
17:41:04 [2021-03-13T22:41:04.016Z] 	at org.apache.maven.surefire.booter.ProviderFactory$ProviderProxy.invoke(ProviderFactory.java:161)
17:41:04 [2021-03-13T22:41:04.016Z] 	at org.apache.maven.surefire.booter.ProviderFactory.invokeProvider(ProviderFactory.java:84)
17:41:04 [2021-03-13T22:41:04.016Z] 	at org.eclipse.tycho.surefire.osgibooter.OsgiSurefireBooter.run(OsgiSurefireBooter.java:116)
17:41:04 [2021-03-13T22:41:04.016Z] 	at org.eclipse.tycho.surefire.osgibooter.HeadlessTestApplication.start(HeadlessTestApplication.java:23)
17:41:04 [2021-03-13T22:41:04.016Z] 	at org.eclipse.equinox.internal.app.EclipseAppHandle.run(EclipseAppHandle.java:203)
17:41:04 [2021-03-13T22:41:04.016Z] 	at org.eclipse.core.runtime.internal.adaptor.EclipseAppLauncher.runApplication(EclipseAppLauncher.java:137)
17:41:04 [2021-03-13T22:41:04.016Z] 	at org.eclipse.core.runtime.internal.adaptor.EclipseAppLauncher.start(EclipseAppLauncher.java:107)
17:41:04 [2021-03-13T22:41:04.016Z] 	at org.eclipse.core.runtime.adaptor.EclipseStarter.run(EclipseStarter.java:400)
17:41:04 [2021-03-13T22:41:04.016Z] 	at org.eclipse.core.runtime.adaptor.EclipseStarter.run(EclipseStarter.java:255)
17:41:04 [2021-03-13T22:41:04.016Z] 	at java.base/jdk.internal.reflect.NativeMethodAccessorImpl.invoke0(Native Method)
17:41:04 [2021-03-13T22:41:04.016Z] 	at java.base/jdk.internal.reflect.NativeMethodAccessorImpl.invoke(NativeMethodAccessorImpl.java:64)
17:41:04 [2021-03-13T22:41:04.016Z] 	at java.base/jdk.internal.reflect.DelegatingMethodAccessorImpl.invoke(DelegatingMethodAccessorImpl.java:43)
17:41:04 [2021-03-13T22:41:04.016Z] 	at java.base/java.lang.reflect.Method.invoke(Method.java:564)
17:41:04 [2021-03-13T22:41:04.016Z] 	at org.eclipse.equinox.launcher.Main.invokeFramework(Main.java:661)
17:41:04 [2021-03-13T22:41:04.016Z] 	at org.eclipse.equinox.launcher.Main.basicRun(Main.java:597)
17:41:04 [2021-03-13T22:41:04.016Z] 	at org.eclipse.equinox.launcher.Main.run(Main.java:1476)
17:41:04 [2021-03-13T22:41:04.016Z] 	at org.eclipse.equinox.launcher.Main.main(Main.java:1449)
17:41:04 [2021-03-13T22:41:04.016Z] Caused by: java.lang.ClassNotFoundException: org.junit.runners.model.RunnerBuilder cannot be found by org.eclipse.tycho.surefire.osgibooter_2.2.0
17:41:04 [2021-03-13T22:41:04.016Z] 	at org.eclipse.osgi.internal.loader.BundleLoader.findClassInternal(BundleLoader.java:511)
17:41:04 [2021-03-13T22:41:04.016Z] 	at org.eclipse.osgi.internal.loader.BundleLoader.findClass(BundleLoader.java:422)
17:41:04 [2021-03-13T22:41:04.016Z] 	at org.eclipse.osgi.internal.loader.BundleLoader.findClass(BundleLoader.java:414)
17:41:04 [2021-03-13T22:41:04.016Z] 	at org.eclipse.osgi.internal.loader.ModuleClassLoader.loadClass(ModuleClassLoader.java:153)
17:41:04 [2021-03-13T22:41:04.016Z] 	at java.base/java.lang.ClassLoader.loadClass(ClassLoader.java:522)
17:41:04 [2021-03-13T22:41:04.016Z] 	... 31 more
17:41:04 [2021-03-13T22:41:04.016Z] 
17:41:04 [2021-03-13T22:41:04.016Z] Mar 13, 2021 10:41:03 PM org.junit.platform.launcher.core.DefaultLauncher handleThrowable
17:41:04 [2021-03-13T22:41:04.016Z] WARNING: TestEngine with ID 'junit-vintage' failed to discover tests
17:41:04 [2021-03-13T22:41:04.016Z] java.lang.NoClassDefFoundError: org/junit/runners/model/RunnerBuilder
17:41:04 [2021-03-13T22:41:04.016Z] 	at org.junit.vintage.engine.discovery.VintageDiscoverer.<init>(VintageDiscoverer.java:48)
17:41:04 [2021-03-13T22:41:04.016Z] 	at org.junit.vintage.engine.VintageTestEngine.discover(VintageTestEngine.java:65)
17:41:04 [2021-03-13T22:41:04.016Z] 	at org.junit.platform.launcher.core.DefaultLauncher.discoverEngineRoot(DefaultLauncher.java:130)
17:41:04 [2021-03-13T22:41:04.016Z] 	at org.junit.platform.launcher.core.DefaultLauncher.discoverRoot(DefaultLauncher.java:117)
17:41:04 [2021-03-13T22:41:04.016Z] 	at org.junit.platform.launcher.core.DefaultLauncher.discover(DefaultLauncher.java:82)
17:41:04 [2021-03-13T22:41:04.016Z] 	at org.apache.maven.surefire.junitplatform.TestPlanScannerFilter.accept(TestPlanScannerFilter.java:56)
17:41:04 [2021-03-13T22:41:04.016Z] 	at org.apache.maven.surefire.util.DefaultScanResult.applyFilter(DefaultScanResult.java:102)
17:41:04 [2021-03-13T22:41:04.016Z] 	at org.apache.maven.surefire.junitplatform.JUnitPlatformProvider.scanClasspath(JUnitPlatformProvider.java:143)
17:41:04 [2021-03-13T22:41:04.016Z] 	at org.apache.maven.surefire.junitplatform.JUnitPlatformProvider.invoke(JUnitPlatformProvider.java:124)
17:41:04 [2021-03-13T22:41:04.016Z] 	at java.base/jdk.internal.reflect.NativeMethodAccessorImpl.invoke0(Native Method)
17:41:04 [2021-03-13T22:41:04.016Z] 	at java.base/jdk.internal.reflect.NativeMethodAccessorImpl.invoke(NativeMethodAccessorImpl.java:64)
17:41:04 [2021-03-13T22:41:04.016Z] 	at java.base/jdk.internal.reflect.DelegatingMethodAccessorImpl.invoke(DelegatingMethodAccessorImpl.java:43)
17:41:04 [2021-03-13T22:41:04.016Z] 	at java.base/java.lang.reflect.Method.invoke(Method.java:564)
17:41:04 [2021-03-13T22:41:04.016Z] 	at org.apache.maven.surefire.util.ReflectionUtils.invokeMethodWithArray2(ReflectionUtils.java:206)
17:41:04 [2021-03-13T22:41:04.017Z] 	at org.apache.maven.surefire.booter.ProviderFactory$ProviderProxy.invoke(ProviderFactory.java:161)
17:41:04 [2021-03-13T22:41:04.017Z] 	at org.apache.maven.surefire.booter.ProviderFactory.invokeProvider(ProviderFactory.java:84)
17:41:04 [2021-03-13T22:41:04.017Z] 	at org.eclipse.tycho.surefire.osgibooter.OsgiSurefireBooter.run(OsgiSurefireBooter.java:116)
17:41:04 [2021-03-13T22:41:04.017Z] 	at org.eclipse.tycho.surefire.osgibooter.HeadlessTestApplication.start(HeadlessTestApplication.java:23)
17:41:04 [2021-03-13T22:41:04.017Z] 	at org.eclipse.equinox.internal.app.EclipseAppHandle.run(EclipseAppHandle.java:203)
17:41:04 [2021-03-13T22:41:04.017Z] 	at org.eclipse.core.runtime.internal.adaptor.EclipseAppLauncher.runApplication(EclipseAppLauncher.java:137)
17:41:04 [2021-03-13T22:41:04.017Z] 	at org.eclipse.core.runtime.internal.adaptor.EclipseAppLauncher.start(EclipseAppLauncher.java:107)
17:41:04 [2021-03-13T22:41:04.017Z] 	at org.eclipse.core.runtime.adaptor.EclipseStarter.run(EclipseStarter.java:400)
17:41:04 [2021-03-13T22:41:04.017Z] 	at org.eclipse.core.runtime.adaptor.EclipseStarter.run(EclipseStarter.java:255)
17:41:04 [2021-03-13T22:41:04.017Z] 	at java.base/jdk.internal.reflect.NativeMethodAccessorImpl.invoke0(Native Method)
17:41:04 [2021-03-13T22:41:04.017Z] 	at java.base/jdk.internal.reflect.NativeMethodAccessorImpl.invoke(NativeMethodAccessorImpl.java:64)
17:41:04 [2021-03-13T22:41:04.017Z] 	at java.base/jdk.internal.reflect.DelegatingMethodAccessorImpl.invoke(DelegatingMethodAccessorImpl.java:43)
17:41:04 [2021-03-13T22:41:04.017Z] 	at java.base/java.lang.reflect.Method.invoke(Method.java:564)
17:41:04 [2021-03-13T22:41:04.017Z] 	at org.eclipse.equinox.launcher.Main.invokeFramework(Main.java:661)
17:41:04 [2021-03-13T22:41:04.017Z] 	at org.eclipse.equinox.launcher.Main.basicRun(Main.java:597)
17:41:04 [2021-03-13T22:41:04.017Z] 	at org.eclipse.equinox.launcher.Main.run(Main.java:1476)
17:41:04 [2021-03-13T22:41:04.017Z] 	at org.eclipse.equinox.launcher.Main.main(Main.java:1449)
17:41:04 [2021-03-13T22:41:04.017Z] Caused by: java.lang.ClassNotFoundException: org.junit.runners.model.RunnerBuilder cannot be found by org.eclipse.tycho.surefire.osgibooter_2.2.0
17:41:04 [2021-03-13T22:41:04.017Z] 	at org.eclipse.osgi.internal.loader.BundleLoader.findClassInternal(BundleLoader.java:511)
17:41:04 [2021-03-13T22:41:04.017Z] 	at org.eclipse.osgi.internal.loader.BundleLoader.findClass(BundleLoader.java:422)
17:41:04 [2021-03-13T22:41:04.017Z] 	at org.eclipse.osgi.internal.loader.BundleLoader.findClass(BundleLoader.java:414)
17:41:04 [2021-03-13T22:41:04.017Z] 	at org.eclipse.osgi.internal.loader.ModuleClassLoader.loadClass(ModuleClassLoader.java:153)
17:41:04 [2021-03-13T22:41:04.017Z] 	at java.base/java.lang.ClassLoader.loadClass(ClassLoader.java:522)
17:41:04 [2021-03-13T22:41:04.017Z] 	... 31 more
17:41:04 [2021-03-13T22:41:04.017Z] 
17:41:04 [2021-03-13T22:41:04.017Z] Mar 13, 2021 10:41:03 PM org.junit.platform.launcher.core.DefaultLauncher handleThrowable
17:41:04 [2021-03-13T22:41:04.017Z] WARNING: TestEngine with ID 'junit-vintage' failed to discover tests
17:41:04 [2021-03-13T22:41:04.017Z] java.lang.NoClassDefFoundError: org/junit/runners/model/RunnerBuilder
17:41:04 [2021-03-13T22:41:04.017Z] 	at org.junit.vintage.engine.discovery.VintageDiscoverer.<init>(VintageDiscoverer.java:48)
17:41:04 [2021-03-13T22:41:04.017Z] 	at org.junit.vintage.engine.VintageTestEngine.discover(VintageTestEngine.java:65)
17:41:04 [2021-03-13T22:41:04.017Z] 	at org.junit.platform.launcher.core.DefaultLauncher.discoverEngineRoot(DefaultLauncher.java:130)
17:41:04 [2021-03-13T22:41:04.017Z] 	at org.junit.platform.launcher.core.DefaultLauncher.discoverRoot(DefaultLauncher.java:117)
17:41:04 [2021-03-13T22:41:04.017Z] 	at org.junit.platform.launcher.core.DefaultLauncher.execute(DefaultLauncher.java:90)
17:41:04 [2021-03-13T22:41:04.017Z] 	at org.apache.maven.surefire.junitplatform.JUnitPlatformProvider.invokeAllTests(JUnitPlatformProvider.java:150)
17:41:04 [2021-03-13T22:41:04.017Z] 	at org.apache.maven.surefire.junitplatform.JUnitPlatformProvider.invoke(JUnitPlatformProvider.java:124)
17:41:04 [2021-03-13T22:41:04.017Z] 	at java.base/jdk.internal.reflect.NativeMethodAccessorImpl.invoke0(Native Method)
17:41:04 [2021-03-13T22:41:04.017Z] 	at java.base/jdk.internal.reflect.NativeMethodAccessorImpl.invoke(NativeMethodAccessorImpl.java:64)
17:41:04 [2021-03-13T22:41:04.017Z] 	at java.base/jdk.internal.reflect.DelegatingMethodAccessorImpl.invoke(DelegatingMethodAccessorImpl.java:43)
17:41:04 [2021-03-13T22:41:04.017Z] 	at java.base/java.lang.reflect.Method.invoke(Method.java:564)
17:41:04 [2021-03-13T22:41:04.017Z] 	at org.apache.maven.surefire.util.ReflectionUtils.invokeMethodWithArray2(ReflectionUtils.java:206)
17:41:04 [2021-03-13T22:41:04.017Z] 	at org.apache.maven.surefire.booter.ProviderFactory$ProviderProxy.invoke(ProviderFactory.java:161)
17:41:04 [2021-03-13T22:41:04.017Z] 	at org.apache.maven.surefire.booter.ProviderFactory.invokeProvider(ProviderFactory.java:84)
17:41:04 [2021-03-13T22:41:04.017Z] 	at org.eclipse.tycho.surefire.osgibooter.OsgiSurefireBooter.run(OsgiSurefireBooter.java:116)
17:41:04 [2021-03-13T22:41:04.017Z] 	at org.eclipse.tycho.surefire.osgibooter.HeadlessTestApplication.start(HeadlessTestApplication.java:23)
17:41:04 [2021-03-13T22:41:04.017Z] 	at org.eclipse.equinox.internal.app.EclipseAppHandle.run(EclipseAppHandle.java:203)
17:41:04 [2021-03-13T22:41:04.017Z] 	at org.eclipse.core.runtime.internal.adaptor.EclipseAppLauncher.runApplication(EclipseAppLauncher.java:137)
17:41:04 [2021-03-13T22:41:04.017Z] 	at org.eclipse.core.runtime.internal.adaptor.EclipseAppLauncher.start(EclipseAppLauncher.java:107)
17:41:04 [2021-03-13T22:41:04.017Z] 	at org.eclipse.core.runtime.adaptor.EclipseStarter.run(EclipseStarter.java:400)
17:41:04 [2021-03-13T22:41:04.017Z] 	at org.eclipse.core.runtime.adaptor.EclipseStarter.run(EclipseStarter.java:255)
17:41:04 [2021-03-13T22:41:04.017Z] 	at java.base/jdk.internal.reflect.NativeMethodAccessorImpl.invoke0(Native Method)
17:41:04 [2021-03-13T22:41:04.017Z] 	at java.base/jdk.internal.reflect.NativeMethodAccessorImpl.invoke(NativeMethodAccessorImpl.java:64)
17:41:04 [2021-03-13T22:41:04.017Z] 	at java.base/jdk.internal.reflect.DelegatingMethodAccessorImpl.invoke(DelegatingMethodAccessorImpl.java:43)
17:41:04 [2021-03-13T22:41:04.017Z] 	at java.base/java.lang.reflect.Method.invoke(Method.java:564)
17:41:04 [2021-03-13T22:41:04.017Z] 	at org.eclipse.equinox.launcher.Main.invokeFramework(Main.java:661)
17:41:04 [2021-03-13T22:41:04.017Z] 	at org.eclipse.equinox.launcher.Main.basicRun(Main.java:597)
17:41:04 [2021-03-13T22:41:04.017Z] 	at org.eclipse.equinox.launcher.Main.run(Main.java:1476)
17:41:04 [2021-03-13T22:41:04.017Z] 	at org.eclipse.equinox.launcher.Main.main(Main.java:1449)
17:41:04 [2021-03-13T22:41:04.017Z] Caused by: java.lang.ClassNotFoundException: org.junit.runners.model.RunnerBuilder cannot be found by org.eclipse.tycho.surefire.osgibooter_2.2.0
17:41:04 [2021-03-13T22:41:04.017Z] 	at org.eclipse.osgi.internal.loader.BundleLoader.findClassInternal(BundleLoader.java:511)
17:41:04 [2021-03-13T22:41:04.017Z] 	at org.eclipse.osgi.internal.loader.BundleLoader.findClass(BundleLoader.java:422)
17:41:04 [2021-03-13T22:41:04.017Z] 	at org.eclipse.osgi.internal.loader.BundleLoader.findClass(BundleLoader.java:414)
17:41:04 [2021-03-13T22:41:04.017Z] 	at org.eclipse.osgi.internal.loader.ModuleClassLoader.loadClass(ModuleClassLoader.java:153)
17:41:04 [2021-03-13T22:41:04.017Z] 	at java.base/java.lang.ClassLoader.loadClass(ClassLoader.java:522)
17:41:04 [2021-03-13T22:41:04.017Z] 	... 29 more
17:41:04 [2021-03-13T22:41:04.017Z] 
17:41:04 [2021-03-13T22:41:04.017Z] Running org.eclipse.ease.ui.help.hovers.ModuleHelpTest
17:41:04 [2021-03-13T22:41:04.017Z] Tests run: 4, Failures: 0, Errors: 0, Skipped: 4, Time elapsed: 0.008 s - in org.eclipse.ease.ui.help.hovers.ModuleHelpTest
17:41:04 [2021-03-13T22:41:04.017Z] getModuleHelpLocation skipped
17:41:04 [2021-03-13T22:41:04.017Z] getModuleHelp skipped
17:41:04 [2021-03-13T22:41:04.017Z] getMethodHelp skipped
17:41:04 [2021-03-13T22:41:04.017Z] getConstantHelp skipped
17:41:04 [2021-03-13T22:41:04.017Z] Running org.eclipse.ease.ui.completion.provider.AbstractFileLocationCompletionProviderTest
17:41:04 [2021-03-13T22:41:04.017Z] Tests run: 8, Failures: 0, Errors: 0, Skipped: 8, Time elapsed: 0.203 s - in org.eclipse.ease.ui.completion.provider.AbstractFileLocationCompletionProviderTest
17:41:04 [2021-03-13T22:41:04.017Z] workspaceProjectProposals skipped
17:41:04 [2021-03-13T22:41:04.017Z] checkOperatingSystem skipped
17:41:04 [2021-03-13T22:41:04.017Z] absoluteRootWorkspaceProposals skipped
17:41:04 [2021-03-13T22:41:04.017Z] workspaceFolderProposals skipped
17:41:04 [2021-03-13T22:41:04.017Z] fileSystemFolderProposals skipped
17:41:04 [2021-03-13T22:41:04.017Z] workspaceProposals skipped
17:41:04 [2021-03-13T22:41:04.017Z] relativeRootWorkspaceProposals skipped
17:41:04 [2021-03-13T22:41:04.017Z] fileSystemRootProposals skipped
17:41:04 [2021-03-13T22:41:04.017Z] Running org.eclipse.ease.ui.completion.CompletionContextTest
17:41:04 [2021-03-13T22:41:04.017Z] Tests run: 9, Failures: 0, Errors: 0, Skipped: 0, Time elapsed: 0.016 s - in org.eclipse.ease.ui.completion.CompletionContextTest
17:41:04 [2021-03-13T22:41:04.017Z] resolveStaticClass  Time elapsed: 0.011 s
17:41:04 [2021-03-13T22:41:04.017Z] resolveClassWithFilter  Time elapsed: 0 s
17:41:04 [2021-03-13T22:41:04.017Z] simplifyCalls  Time elapsed: 0.001 s
17:41:04 [2021-03-13T22:41:04.017Z] resolveClass  Time elapsed: 0 s
17:41:04 [2021-03-13T22:41:04.017Z] replaceEscapedStringLiterals  Time elapsed: 0 s
17:41:04 [2021-03-13T22:41:04.017Z] replaceSimpleStringLiterals  Time elapsed: 0 s
17:41:04 [2021-03-13T22:41:04.017Z] resolveStaticClassWithFilter  Time elapsed: 0 s
17:41:04 [2021-03-13T22:41:04.018Z] resolveClassWithParameters  Time elapsed: 0 s
17:41:04 [2021-03-13T22:41:04.018Z] replaceMultipleStringLiterals  Time elapsed: 0 s
17:41:04 [2021-03-13T22:41:04.018Z] Running org.eclipse.ease.ui.dnd.ModulesDropHandlerTest
17:41:04 [2021-03-13T22:41:04.273Z] Tests run: 2, Failures: 0, Errors: 0, Skipped: 0, Time elapsed: 0.403 s - in org.eclipse.ease.ui.dnd.ModulesDropHandlerTest
17:41:04 [2021-03-13T22:41:04.273Z] accepts_true_for_ModuleEntry  Time elapsed: 0.327 s
17:41:04 [2021-03-13T22:41:04.273Z] accepts_true_for_ModuleDefinition  Time elapsed: 0.076 s
17:41:04 [2021-03-13T22:41:04.273Z] 
17:41:04 [2021-03-13T22:41:04.273Z] Results:
17:41:04 [2021-03-13T22:41:04.273Z] 
17:41:04 [2021-03-13T22:41:04.273Z] Tests run: 23, Failures: 0, Errors: 0, Skipped: 12
17:41:04 [2021-03-13T22:41:04.273Z] 
17:41:04 [2021-03-13T22:41:04.833Z] [INFO] All tests passed!
17:41:04 [2021-03-13T22:41:04.833Z] [INFO] ------------------------------------------------------------------------
17:41:04 [2021-03-13T22:41:04.833Z] [INFO] Reactor Summary for org.eclipse.ease.releng 0.8.0-SNAPSHOT:
17:41:04 [2021-03-13T22:41:04.833Z] [INFO] 
17:41:04 [2021-03-13T22:41:04.833Z] [INFO] org.eclipse.ease.releng ............................ SUCCESS [  0.002 s]
17:41:04 [2021-03-13T22:41:04.833Z] [INFO] org.eclipse.ease.releng.target ..................... SUCCESS [  0.138 s]
17:41:04 [2021-03-13T22:41:04.833Z] [INFO] org.eclipse.ease.test .............................. SUCCESS [ 23.163 s]
17:41:04 [2021-03-13T22:41:04.833Z] [INFO] org.eclipse.ease.lang.javascript.rhino.test ........ SUCCESS [ 16.226 s]
17:41:04 [2021-03-13T22:41:04.833Z] [INFO] org.eclipse.ease.lang.javascript.test .............. SUCCESS [  3.579 s]
17:41:04 [2021-03-13T22:41:04.833Z] [INFO] org.eclipse.ease.lang.python.test .................. SUCCESS [  3.062 s]
17:41:04 [2021-03-13T22:41:04.833Z] [INFO] org.eclipse.ease.lang.python.jython.test ........... SUCCESS [ 19.591 s]
17:41:04 [2021-03-13T22:41:04.833Z] [INFO] org.eclipse.ease.lang.scriptarchive.test ........... SUCCESS [  4.153 s]
17:41:04 [2021-03-13T22:41:04.833Z] [INFO] org.eclipse.ease.ui.test ........................... SUCCESS [  4.197 s]
17:41:04 [2021-03-13T22:41:04.834Z] [INFO] ------------------------------------------------------------------------
17:41:04 [2021-03-13T22:41:04.834Z] [INFO] BUILD SUCCESS
17:41:04 [2021-03-13T22:41:04.834Z] [INFO] ------------------------------------------------------------------------
17:41:04 [2021-03-13T22:41:04.834Z] [INFO] Total time:  01:48 min
17:41:04 [2021-03-13T22:41:04.834Z] [INFO] Finished at: 2021-03-13T22:41:04Z
17:41:04 [2021-03-13T22:41:04.834Z] [INFO] ------------------------------------------------------------------------
17:41:04 [2021-03-13T22:41:04.834Z] [WARNING] [jenkins-event-spy] Unexpected Maven project file name 'target-tests-pom.xml', problems may occur
17:41:04 [2021-03-13T22:41:04.834Z] [INFO] [jenkins-event-spy] Generated /home/jenkins/agent/workspace/ease.verify.core.target.2019-03@tmp/withMavenf02f74e7/maven-spy-20210313-223915-71311012169439920328807.log