SuccessConsole Output

Skipping 790 KB.. Full Log
s/agent/workspace/ease.verify.core.target.2019-03/tests/org.eclipse.ease.lang.python.jython.test/target/org.eclipse.ease.lang.python.jython.test-0.8.0-SNAPSHOT.jar
17:38:34 [2021-03-13T22:38:34.675Z] [INFO] 
17:38:34 [2021-03-13T22:38:34.675Z] [INFO] --- tycho-p2-plugin:2.2.0:p2-metadata-default (default-p2-metadata-default) @ org.eclipse.ease.lang.python.jython.test ---
17:38:34 [2021-03-13T22:38:34.675Z] [INFO] 
17:38:34 [2021-03-13T22:38:34.675Z] [INFO] --- jacoco-maven-plugin:0.8.6:prepare-agent (jacoco-initialize) @ org.eclipse.ease.lang.python.jython.test ---
17:38:34 [2021-03-13T22:38:34.675Z] [INFO] tycho.testArgLine set to -javaagent:/home/jenkins/.m2/repository/org/jacoco/org.jacoco.agent/0.8.6/org.jacoco.agent-0.8.6-runtime.jar=destfile=/home/jenkins/agent/workspace/ease.verify.core.target.2019-03/tests/org.eclipse.ease.lang.python.jython.test/target/jacoco.exec,output=file
17:38:34 [2021-03-13T22:38:34.675Z] [INFO] 
17:38:34 [2021-03-13T22:38:34.675Z] [INFO] --- tycho-surefire-plugin:2.2.0:test (default-test) @ org.eclipse.ease.lang.python.jython.test ---
17:38:35 [2021-03-13T22:38:35.236Z] [INFO] Executing Test Runtime with timeout 0, logs (if any) will be placed at: /home/jenkins/agent/workspace/ease.verify.core.target.2019-03/tests/org.eclipse.ease.lang.python.jython.test/target/work/data/.metadata/.log
17:38:35 [2021-03-13T22:38:35.236Z] [INFO] Command line:
17:38:35 [2021-03-13T22:38:35.236Z] 	[/opt/tools/java/openjdk/jdk-15/15.0.2+7/bin/java, -Dosgi.noShutdown=false, -Dosgi.os=linux, -Dosgi.ws=gtk, -Dosgi.arch=x86_64, -javaagent:/home/jenkins/.m2/repository/org/jacoco/org.jacoco.agent/0.8.6/org.jacoco.agent-0.8.6-runtime.jar=destfile=/home/jenkins/agent/workspace/ease.verify.core.target.2019-03/tests/org.eclipse.ease.lang.python.jython.test/target/jacoco.exec,output=file, -Dosgi.clean=true, -jar, /home/jenkins/.m2/repository/p2/osgi/bundle/org.eclipse.equinox.launcher/1.5.800.v20200727-1323/org.eclipse.equinox.launcher-1.5.800.v20200727-1323.jar, -data, /home/jenkins/agent/workspace/ease.verify.core.target.2019-03/tests/org.eclipse.ease.lang.python.jython.test/target/work/data, -install, /home/jenkins/agent/workspace/ease.verify.core.target.2019-03/tests/org.eclipse.ease.lang.python.jython.test/target/work, -configuration, /home/jenkins/agent/workspace/ease.verify.core.target.2019-03/tests/org.eclipse.ease.lang.python.jython.test/target/work/configuration, -application, org.eclipse.tycho.surefire.osgibooter.headlesstest, -testproperties, /home/jenkins/agent/workspace/ease.verify.core.target.2019-03/tests/org.eclipse.ease.lang.python.jython.test/target/surefire.properties]
17:38:35 [2021-03-13T22:38:35.236Z] Picked up JAVA_TOOL_OPTIONS: -Dmaven.ext.class.path="/home/jenkins/agent/workspace/ease.verify.core.target.2019-03@tmp/withMaven7a46d5a8/pipeline-maven-spy.jar" -Dorg.jenkinsci.plugins.pipeline.maven.reportsFolder="/home/jenkins/agent/workspace/ease.verify.core.target.2019-03@tmp/withMaven7a46d5a8" 
17:38:37 [2021-03-13T22:38:37.828Z] WARNING: An illegal reflective access operation has occurred
17:38:37 [2021-03-13T22:38:37.828Z] WARNING: Illegal reflective access by org.python.core.PySystemState (file:/home/jenkins/agent/workspace/ease.verify.core.target.2019-03/tests/org.eclipse.ease.lang.python.jython.test/target/work/plugins/org.jython_2.7.0.I201609090924/jython.jar) to method java.io.Console.encoding()
17:38:37 [2021-03-13T22:38:37.828Z] WARNING: Please consider reporting this to the maintainers of org.python.core.PySystemState
17:38:37 [2021-03-13T22:38:37.828Z] WARNING: Use --illegal-access=warn to enable warnings of further illegal reflective access operations
17:38:37 [2021-03-13T22:38:37.828Z] WARNING: All illegal access operations will be denied in a future release
17:38:38 [2021-03-13T22:38:38.400Z] Mar 13, 2021 10:38:38 PM org.junit.platform.launcher.core.DefaultLauncher handleThrowable
17:38:38 [2021-03-13T22:38:38.400Z] WARNING: TestEngine with ID 'junit-vintage' failed to discover tests
17:38:38 [2021-03-13T22:38:38.400Z] java.lang.NoClassDefFoundError: org/junit/runners/model/RunnerBuilder
17:38:38 [2021-03-13T22:38:38.400Z] 	at org.junit.vintage.engine.discovery.VintageDiscoverer.<init>(VintageDiscoverer.java:48)
17:38:38 [2021-03-13T22:38:38.400Z] 	at org.junit.vintage.engine.VintageTestEngine.discover(VintageTestEngine.java:65)
17:38:38 [2021-03-13T22:38:38.400Z] 	at org.junit.platform.launcher.core.DefaultLauncher.discoverEngineRoot(DefaultLauncher.java:130)
17:38:38 [2021-03-13T22:38:38.400Z] 	at org.junit.platform.launcher.core.DefaultLauncher.discoverRoot(DefaultLauncher.java:117)
17:38:38 [2021-03-13T22:38:38.400Z] 	at org.junit.platform.launcher.core.DefaultLauncher.discover(DefaultLauncher.java:82)
17:38:38 [2021-03-13T22:38:38.400Z] 	at org.apache.maven.surefire.junitplatform.TestPlanScannerFilter.accept(TestPlanScannerFilter.java:56)
17:38:38 [2021-03-13T22:38:38.400Z] 	at org.apache.maven.surefire.util.DefaultScanResult.applyFilter(DefaultScanResult.java:102)
17:38:38 [2021-03-13T22:38:38.400Z] 	at org.apache.maven.surefire.junitplatform.JUnitPlatformProvider.scanClasspath(JUnitPlatformProvider.java:143)
17:38:38 [2021-03-13T22:38:38.400Z] 	at org.apache.maven.surefire.junitplatform.JUnitPlatformProvider.invoke(JUnitPlatformProvider.java:124)
17:38:38 [2021-03-13T22:38:38.400Z] 	at java.base/jdk.internal.reflect.NativeMethodAccessorImpl.invoke0(Native Method)
17:38:38 [2021-03-13T22:38:38.400Z] 	at java.base/jdk.internal.reflect.NativeMethodAccessorImpl.invoke(NativeMethodAccessorImpl.java:64)
17:38:38 [2021-03-13T22:38:38.400Z] 	at java.base/jdk.internal.reflect.DelegatingMethodAccessorImpl.invoke(DelegatingMethodAccessorImpl.java:43)
17:38:38 [2021-03-13T22:38:38.400Z] 	at java.base/java.lang.reflect.Method.invoke(Method.java:564)
17:38:38 [2021-03-13T22:38:38.400Z] 	at org.apache.maven.surefire.util.ReflectionUtils.invokeMethodWithArray2(ReflectionUtils.java:206)
17:38:38 [2021-03-13T22:38:38.400Z] 	at org.apache.maven.surefire.booter.ProviderFactory$ProviderProxy.invoke(ProviderFactory.java:161)
17:38:38 [2021-03-13T22:38:38.400Z] 	at org.apache.maven.surefire.booter.ProviderFactory.invokeProvider(ProviderFactory.java:84)
17:38:38 [2021-03-13T22:38:38.400Z] 	at org.eclipse.tycho.surefire.osgibooter.OsgiSurefireBooter.run(OsgiSurefireBooter.java:116)
17:38:38 [2021-03-13T22:38:38.400Z] 	at org.eclipse.tycho.surefire.osgibooter.HeadlessTestApplication.start(HeadlessTestApplication.java:23)
17:38:38 [2021-03-13T22:38:38.400Z] 	at org.eclipse.equinox.internal.app.EclipseAppHandle.run(EclipseAppHandle.java:203)
17:38:38 [2021-03-13T22:38:38.400Z] 	at org.eclipse.core.runtime.internal.adaptor.EclipseAppLauncher.runApplication(EclipseAppLauncher.java:134)
17:38:38 [2021-03-13T22:38:38.400Z] 	at org.eclipse.core.runtime.internal.adaptor.EclipseAppLauncher.start(EclipseAppLauncher.java:104)
17:38:38 [2021-03-13T22:38:38.400Z] 	at org.eclipse.core.runtime.adaptor.EclipseStarter.run(EclipseStarter.java:401)
17:38:38 [2021-03-13T22:38:38.400Z] 	at org.eclipse.core.runtime.adaptor.EclipseStarter.run(EclipseStarter.java:255)
17:38:38 [2021-03-13T22:38:38.400Z] 	at java.base/jdk.internal.reflect.NativeMethodAccessorImpl.invoke0(Native Method)
17:38:38 [2021-03-13T22:38:38.400Z] 	at java.base/jdk.internal.reflect.NativeMethodAccessorImpl.invoke(NativeMethodAccessorImpl.java:64)
17:38:38 [2021-03-13T22:38:38.400Z] 	at java.base/jdk.internal.reflect.DelegatingMethodAccessorImpl.invoke(DelegatingMethodAccessorImpl.java:43)
17:38:38 [2021-03-13T22:38:38.400Z] 	at java.base/java.lang.reflect.Method.invoke(Method.java:564)
17:38:38 [2021-03-13T22:38:38.400Z] 	at org.eclipse.equinox.launcher.Main.invokeFramework(Main.java:657)
17:38:38 [2021-03-13T22:38:38.400Z] 	at org.eclipse.equinox.launcher.Main.basicRun(Main.java:594)
17:38:38 [2021-03-13T22:38:38.400Z] 	at org.eclipse.equinox.launcher.Main.run(Main.java:1465)
17:38:38 [2021-03-13T22:38:38.400Z] 	at org.eclipse.equinox.launcher.Main.main(Main.java:1438)
17:38:38 [2021-03-13T22:38:38.400Z] Caused by: java.lang.ClassNotFoundException: org.junit.runners.model.RunnerBuilder cannot be found by org.eclipse.tycho.surefire.osgibooter_2.2.0
17:38:38 [2021-03-13T22:38:38.400Z] 	at org.eclipse.osgi.internal.loader.BundleLoader.findClass(BundleLoader.java:516)
17:38:38 [2021-03-13T22:38:38.400Z] 	at org.eclipse.osgi.internal.loader.ModuleClassLoader.loadClass(ModuleClassLoader.java:171)
17:38:38 [2021-03-13T22:38:38.400Z] 	at java.base/java.lang.ClassLoader.loadClass(ClassLoader.java:522)
17:38:38 [2021-03-13T22:38:38.400Z] 	... 31 more
17:38:38 [2021-03-13T22:38:38.400Z] 
17:38:38 [2021-03-13T22:38:38.400Z] Mar 13, 2021 10:38:38 PM org.junit.platform.launcher.core.DefaultLauncher handleThrowable
17:38:38 [2021-03-13T22:38:38.400Z] WARNING: TestEngine with ID 'junit-vintage' failed to discover tests
17:38:38 [2021-03-13T22:38:38.400Z] java.lang.NoClassDefFoundError: org/junit/runners/model/RunnerBuilder
17:38:38 [2021-03-13T22:38:38.400Z] 	at org.junit.vintage.engine.discovery.VintageDiscoverer.<init>(VintageDiscoverer.java:48)
17:38:38 [2021-03-13T22:38:38.400Z] 	at org.junit.vintage.engine.VintageTestEngine.discover(VintageTestEngine.java:65)
17:38:38 [2021-03-13T22:38:38.400Z] 	at org.junit.platform.launcher.core.DefaultLauncher.discoverEngineRoot(DefaultLauncher.java:130)
17:38:38 [2021-03-13T22:38:38.401Z] 	at org.junit.platform.launcher.core.DefaultLauncher.discoverRoot(DefaultLauncher.java:117)
17:38:38 [2021-03-13T22:38:38.401Z] 	at org.junit.platform.launcher.core.DefaultLauncher.execute(DefaultLauncher.java:90)
17:38:38 [2021-03-13T22:38:38.401Z] 	at org.apache.maven.surefire.junitplatform.JUnitPlatformProvider.invokeAllTests(JUnitPlatformProvider.java:150)
17:38:38 [2021-03-13T22:38:38.401Z] 	at org.apache.maven.surefire.junitplatform.JUnitPlatformProvider.invoke(JUnitPlatformProvider.java:124)
17:38:38 [2021-03-13T22:38:38.401Z] 	at java.base/jdk.internal.reflect.NativeMethodAccessorImpl.invoke0(Native Method)
17:38:38 [2021-03-13T22:38:38.401Z] 	at java.base/jdk.internal.reflect.NativeMethodAccessorImpl.invoke(NativeMethodAccessorImpl.java:64)
17:38:38 [2021-03-13T22:38:38.401Z] 	at java.base/jdk.internal.reflect.DelegatingMethodAccessorImpl.invoke(DelegatingMethodAccessorImpl.java:43)
17:38:38 [2021-03-13T22:38:38.401Z] 	at java.base/java.lang.reflect.Method.invoke(Method.java:564)
17:38:38 [2021-03-13T22:38:38.401Z] 	at org.apache.maven.surefire.util.ReflectionUtils.invokeMethodWithArray2(ReflectionUtils.java:206)
17:38:38 [2021-03-13T22:38:38.401Z] 	at org.apache.maven.surefire.booter.ProviderFactory$ProviderProxy.invoke(ProviderFactory.java:161)
17:38:38 [2021-03-13T22:38:38.401Z] 	at org.apache.maven.surefire.booter.ProviderFactory.invokeProvider(ProviderFactory.java:84)
17:38:38 [2021-03-13T22:38:38.401Z] 	at org.eclipse.tycho.surefire.osgibooter.OsgiSurefireBooter.run(OsgiSurefireBooter.java:116)
17:38:38 [2021-03-13T22:38:38.401Z] 	at org.eclipse.tycho.surefire.osgibooter.HeadlessTestApplication.start(HeadlessTestApplication.java:23)
17:38:38 [2021-03-13T22:38:38.401Z] 	at org.eclipse.equinox.internal.app.EclipseAppHandle.run(EclipseAppHandle.java:203)
17:38:38 [2021-03-13T22:38:38.401Z] 	at org.eclipse.core.runtime.internal.adaptor.EclipseAppLauncher.runApplication(EclipseAppLauncher.java:134)
17:38:38 [2021-03-13T22:38:38.401Z] 	at org.eclipse.core.runtime.internal.adaptor.EclipseAppLauncher.start(EclipseAppLauncher.java:104)
17:38:38 [2021-03-13T22:38:38.401Z] 	at org.eclipse.core.runtime.adaptor.EclipseStarter.run(EclipseStarter.java:401)
17:38:38 [2021-03-13T22:38:38.401Z] 	at org.eclipse.core.runtime.adaptor.EclipseStarter.run(EclipseStarter.java:255)
17:38:38 [2021-03-13T22:38:38.401Z] 	at java.base/jdk.internal.reflect.NativeMethodAccessorImpl.invoke0(Native Method)
17:38:38 [2021-03-13T22:38:38.401Z] 	at java.base/jdk.internal.reflect.NativeMethodAccessorImpl.invoke(NativeMethodAccessorImpl.java:64)
17:38:38 [2021-03-13T22:38:38.401Z] 	at java.base/jdk.internal.reflect.DelegatingMethodAccessorImpl.invoke(DelegatingMethodAccessorImpl.java:43)
17:38:38 [2021-03-13T22:38:38.401Z] 	at java.base/java.lang.reflect.Method.invoke(Method.java:564)
17:38:38 [2021-03-13T22:38:38.401Z] 	at org.eclipse.equinox.launcher.Main.invokeFramework(Main.java:657)
17:38:38 [2021-03-13T22:38:38.401Z] 	at org.eclipse.equinox.launcher.Main.basicRun(Main.java:594)
17:38:38 [2021-03-13T22:38:38.401Z] 	at org.eclipse.equinox.launcher.Main.run(Main.java:1465)
17:38:38 [2021-03-13T22:38:38.401Z] 	at org.eclipse.equinox.launcher.Main.main(Main.java:1438)
17:38:38 [2021-03-13T22:38:38.401Z] Caused by: java.lang.ClassNotFoundException: org.junit.runners.model.RunnerBuilder cannot be found by org.eclipse.tycho.surefire.osgibooter_2.2.0
17:38:38 [2021-03-13T22:38:38.401Z] 	at org.eclipse.osgi.internal.loader.BundleLoader.findClass(BundleLoader.java:516)
17:38:38 [2021-03-13T22:38:38.401Z] 	at org.eclipse.osgi.internal.loader.ModuleClassLoader.loadClass(ModuleClassLoader.java:171)
17:38:38 [2021-03-13T22:38:38.401Z] 	at java.base/java.lang.ClassLoader.loadClass(ClassLoader.java:522)
17:38:38 [2021-03-13T22:38:38.401Z] 	... 29 more
17:38:38 [2021-03-13T22:38:38.401Z] 
17:38:38 [2021-03-13T22:38:38.401Z] Running org.eclipse.ease.lang.python.jython.debugger.JythonDebugTest
17:38:42 [2021-03-13T22:38:42.604Z] Start of script
17:38:42 [2021-03-13T22:38:42.604Z] include file start
17:38:42 [2021-03-13T22:38:42.604Z] include file processed
17:38:42 [2021-03-13T22:38:42.604Z] Result of testMethod = 5
17:38:42 [2021-03-13T22:38:42.604Z] End of script
17:38:42 [2021-03-13T22:38:42.604Z] Start of script
17:38:42 [2021-03-13T22:38:42.604Z] include file start
17:38:42 [2021-03-13T22:38:42.604Z] include file processed
17:38:42 [2021-03-13T22:38:42.604Z] Result of testMethod = 5
17:38:42 [2021-03-13T22:38:42.604Z] End of script
17:38:42 [2021-03-13T22:38:42.604Z] Start of script
17:38:42 [2021-03-13T22:38:42.604Z] include file start
17:38:42 [2021-03-13T22:38:42.604Z] include file processed
17:38:42 [2021-03-13T22:38:42.604Z] Result of testMethod = 5
17:38:42 [2021-03-13T22:38:42.604Z] Traceback (most recent call last):
17:38:42 [2021-03-13T22:38:42.604Z]   File "(none)", line 184, in run
17:38:42 [2021-03-13T22:38:42.604Z]   File "__ref_L/Debug Test/Main.py_haplewxsni", line 23, in <module>
17:38:42 [2021-03-13T22:38:42.604Z]   File "(none)", line 161, in trace_dispatch
17:38:42 [2021-03-13T22:38:42.604Z] org.eclipse.ease.ExitException: 
17:38:42 [2021-03-13T22:38:42.604Z] 
17:38:42 [2021-03-13T22:38:42.604Z] org.eclipse.ease.ExitException: org.eclipse.ease.ExitException: 
17:38:42 [2021-03-13T22:38:42.604Z] Start of script
17:38:42 [2021-03-13T22:38:42.604Z] include file start
17:38:42 [2021-03-13T22:38:42.604Z] include file processed
17:38:42 [2021-03-13T22:38:42.860Z] Result of testMethod = 5
17:38:42 [2021-03-13T22:38:42.860Z] End of script
17:38:43 [2021-03-13T22:38:43.116Z] Start of script
17:38:43 [2021-03-13T22:38:43.116Z] include file start
17:38:43 [2021-03-13T22:38:43.116Z] include file processed
17:38:43 [2021-03-13T22:38:43.116Z] Result of testMethod = 5
17:38:43 [2021-03-13T22:38:43.116Z] End of script
17:38:43 [2021-03-13T22:38:43.372Z] Start of script
17:38:43 [2021-03-13T22:38:43.372Z] include file start
17:38:43 [2021-03-13T22:38:43.372Z] include file processed
17:38:43 [2021-03-13T22:38:43.372Z] Result of testMethod = 5
17:38:43 [2021-03-13T22:38:43.372Z] End of script
17:38:43 [2021-03-13T22:38:43.628Z] Start of script
17:38:43 [2021-03-13T22:38:43.628Z] include file start
17:38:43 [2021-03-13T22:38:43.628Z] include file processed
17:38:43 [2021-03-13T22:38:43.628Z] Result of testMethod = 5
17:38:43 [2021-03-13T22:38:43.884Z] Traceback (most recent call last):
17:38:43 [2021-03-13T22:38:43.884Z]   File "(none)", line 184, in run
17:38:43 [2021-03-13T22:38:43.884Z]   File "__ref_L/Debug Test/Main.py_fhkkqcdync", line 23, in <module>
17:38:43 [2021-03-13T22:38:43.884Z]   File "(none)", line 161, in trace_dispatch
17:38:43 [2021-03-13T22:38:43.884Z] org.eclipse.ease.ExitException: 
17:38:43 [2021-03-13T22:38:43.884Z] 
17:38:43 [2021-03-13T22:38:43.884Z] org.eclipse.ease.ExitException: org.eclipse.ease.ExitException: 
17:38:43 [2021-03-13T22:38:43.884Z] Start of script
17:38:43 [2021-03-13T22:38:43.884Z] include file start
17:38:43 [2021-03-13T22:38:43.884Z] include file processed
17:38:44 [2021-03-13T22:38:44.139Z] Result of testMethod = 5
17:38:44 [2021-03-13T22:38:44.139Z] End of script
17:38:44 [2021-03-13T22:38:44.139Z] Start of script
17:38:44 [2021-03-13T22:38:44.139Z] include file start
17:38:44 [2021-03-13T22:38:44.139Z] include file processed
17:38:44 [2021-03-13T22:38:44.139Z] Result of testMethod = 5
17:38:44 [2021-03-13T22:38:44.394Z] End of script
17:38:44 [2021-03-13T22:38:44.394Z] Start of script
17:38:44 [2021-03-13T22:38:44.394Z] include file start
17:38:44 [2021-03-13T22:38:44.394Z] include file processed
17:38:44 [2021-03-13T22:38:44.958Z] Traceback (most recent call last):
17:38:44 [2021-03-13T22:38:44.958Z]   File "(none)", line 184, in run
17:38:44 [2021-03-13T22:38:44.958Z]   File "__ref_L/Debug Test/Main.py_ezapvardlh", line 22, in <module>
17:38:44 [2021-03-13T22:38:44.958Z]   File "(none)", line 161, in trace_dispatch
17:38:44 [2021-03-13T22:38:44.958Z] org.eclipse.ease.ExitException: 
17:38:44 [2021-03-13T22:38:44.958Z] 
17:38:44 [2021-03-13T22:38:44.958Z] org.eclipse.ease.ExitException: org.eclipse.ease.ExitException: 
17:38:44 [2021-03-13T22:38:44.958Z] Start of script
17:38:44 [2021-03-13T22:38:44.958Z] include file start
17:38:44 [2021-03-13T22:38:44.958Z] include file processed
17:38:44 [2021-03-13T22:38:44.958Z] Result of testMethod = 5
17:38:44 [2021-03-13T22:38:44.958Z] End of script
17:38:45 [2021-03-13T22:38:45.213Z] Start of script
17:38:45 [2021-03-13T22:38:45.214Z] include file start
17:38:45 [2021-03-13T22:38:45.214Z] include file processed
17:38:45 [2021-03-13T22:38:45.214Z] Result of testMethod = 5
17:38:45 [2021-03-13T22:38:45.214Z] End of script
17:38:45 [2021-03-13T22:38:45.470Z] Traceback (most recent call last):
17:38:45 [2021-03-13T22:38:45.470Z]   File "(none)", line 184, in run
17:38:45 [2021-03-13T22:38:45.470Z]   File "__ref_L/Debug Test/Main.py_qutznsghom", line 1, in <module>
17:38:45 [2021-03-13T22:38:45.470Z]   File "(none)", line 161, in trace_dispatch
17:38:45 [2021-03-13T22:38:45.470Z] org.eclipse.ease.ExitException: 
17:38:45 [2021-03-13T22:38:45.470Z] 
17:38:45 [2021-03-13T22:38:45.470Z] org.eclipse.ease.ExitException: org.eclipse.ease.ExitException: 
17:38:45 [2021-03-13T22:38:45.727Z] Start of script
17:38:45 [2021-03-13T22:38:45.727Z] include file start
17:38:45 [2021-03-13T22:38:45.727Z] include file processed
17:38:45 [2021-03-13T22:38:45.727Z] Result of testMethod = 5
17:38:45 [2021-03-13T22:38:45.727Z] End of script
17:38:45 [2021-03-13T22:38:45.982Z] Start of script
17:38:45 [2021-03-13T22:38:45.982Z] include file start
17:38:45 [2021-03-13T22:38:45.982Z] include file processed
17:38:45 [2021-03-13T22:38:45.982Z] Result of testMethod = 5
17:38:45 [2021-03-13T22:38:45.982Z] End of script
17:38:46 [2021-03-13T22:38:46.237Z] Start of script
17:38:46 [2021-03-13T22:38:46.238Z] include file start
17:38:46 [2021-03-13T22:38:46.238Z] include file processed
17:38:46 [2021-03-13T22:38:46.238Z] Result of testMethod = 5
17:38:46 [2021-03-13T22:38:46.494Z] Traceback (most recent call last):
17:38:46 [2021-03-13T22:38:46.494Z]   File "(none)", line 184, in run
17:38:46 [2021-03-13T22:38:46.494Z]   File "__ref_L/Debug Test/Main.py_hdkckdxviv", line 23, in <module>
17:38:46 [2021-03-13T22:38:46.494Z]   File "(none)", line 161, in trace_dispatch
17:38:46 [2021-03-13T22:38:46.494Z] org.eclipse.ease.ExitException: 
17:38:46 [2021-03-13T22:38:46.494Z] 
17:38:46 [2021-03-13T22:38:46.494Z] org.eclipse.ease.ExitException: org.eclipse.ease.ExitException: 
17:38:46 [2021-03-13T22:38:46.494Z] Start of script
17:38:46 [2021-03-13T22:38:46.494Z] include file start
17:38:46 [2021-03-13T22:38:46.494Z] include file processed
17:38:46 [2021-03-13T22:38:46.750Z] Result of testMethod = 5
17:38:46 [2021-03-13T22:38:46.751Z] End of script
17:38:47 [2021-03-13T22:38:47.007Z] Traceback (most recent call last):
17:38:47 [2021-03-13T22:38:47.007Z]   File "(none)", line 184, in run
17:38:47 [2021-03-13T22:38:47.007Z]   File "__ref_L/Debug Test/Main.py_gnoxyiphed", line 1, in <module>
17:38:47 [2021-03-13T22:38:47.007Z]   File "(none)", line 161, in trace_dispatch
17:38:47 [2021-03-13T22:38:47.007Z] org.eclipse.ease.ExitException: 
17:38:47 [2021-03-13T22:38:47.007Z] 
17:38:47 [2021-03-13T22:38:47.007Z] org.eclipse.ease.ExitException: org.eclipse.ease.ExitException: 
17:38:47 [2021-03-13T22:38:47.007Z] Start of script
17:38:47 [2021-03-13T22:38:47.007Z] include file start
17:38:47 [2021-03-13T22:38:47.007Z] include file processed
17:38:47 [2021-03-13T22:38:47.007Z] Result of testMethod = 5
17:38:47 [2021-03-13T22:38:47.262Z] End of script
17:38:47 [2021-03-13T22:38:47.262Z] Start of script
17:38:47 [2021-03-13T22:38:47.262Z] include file start
17:38:47 [2021-03-13T22:38:47.262Z] include file processed
17:38:47 [2021-03-13T22:38:47.518Z] Result of testMethod = 5
17:38:47 [2021-03-13T22:38:47.518Z] End of script
17:38:47 [2021-03-13T22:38:47.774Z] Traceback (most recent call last):
17:38:47 [2021-03-13T22:38:47.774Z]   File "(none)", line 184, in run
17:38:47 [2021-03-13T22:38:47.774Z]   File "__ref_L/Debug Test/Main.py_izcfjeccgz", line 1, in <module>
17:38:47 [2021-03-13T22:38:47.774Z]   File "(none)", line 161, in trace_dispatch
17:38:47 [2021-03-13T22:38:47.774Z] org.eclipse.ease.ExitException: 
17:38:47 [2021-03-13T22:38:47.774Z] 
17:38:47 [2021-03-13T22:38:47.774Z] org.eclipse.ease.ExitException: org.eclipse.ease.ExitException: 
17:38:47 [2021-03-13T22:38:47.774Z] Start of script
17:38:47 [2021-03-13T22:38:47.774Z] include file start
17:38:47 [2021-03-13T22:38:47.774Z] include file processed
17:38:48 [2021-03-13T22:38:48.030Z] Result of testMethod = 5
17:38:48 [2021-03-13T22:38:48.030Z] End of script
17:38:48 [2021-03-13T22:38:48.030Z] Start of script
17:38:48 [2021-03-13T22:38:48.030Z] include file start
17:38:48 [2021-03-13T22:38:48.030Z] include file processed
17:38:48 [2021-03-13T22:38:48.030Z] Result of testMethod = 5
17:38:48 [2021-03-13T22:38:48.285Z] Traceback (most recent call last):
17:38:48 [2021-03-13T22:38:48.285Z]   File "(none)", line 184, in run
17:38:48 [2021-03-13T22:38:48.285Z]   File "__ref_L/Debug Test/Main.py_nyjnkxqgee", line 23, in <module>
17:38:48 [2021-03-13T22:38:48.286Z]   File "(none)", line 161, in trace_dispatch
17:38:48 [2021-03-13T22:38:48.286Z] org.eclipse.ease.ExitException: 
17:38:48 [2021-03-13T22:38:48.286Z] 
17:38:48 [2021-03-13T22:38:48.286Z] org.eclipse.ease.ExitException: org.eclipse.ease.ExitException: 
17:38:48 [2021-03-13T22:38:48.541Z] Start of script
17:38:48 [2021-03-13T22:38:48.541Z] include file start
17:38:48 [2021-03-13T22:38:48.541Z] include file processed
17:38:48 [2021-03-13T22:38:48.541Z] Result of testMethod = 5
17:38:48 [2021-03-13T22:38:48.541Z] End of script
17:38:48 [2021-03-13T22:38:48.541Z] Start of script
17:38:48 [2021-03-13T22:38:48.541Z] include file start
17:38:48 [2021-03-13T22:38:48.541Z] include file processed
17:38:48 [2021-03-13T22:38:48.797Z] Result of testMethod = 5
17:38:48 [2021-03-13T22:38:48.797Z] End of script
17:38:49 [2021-03-13T22:38:49.053Z] Start of script
17:38:49 [2021-03-13T22:38:49.053Z] include file start
17:38:49 [2021-03-13T22:38:49.053Z] include file processed
17:38:49 [2021-03-13T22:38:49.053Z] Result of testMethod = 5
17:38:49 [2021-03-13T22:38:49.053Z] End of script
17:38:49 [2021-03-13T22:38:49.053Z] Start of script
17:38:49 [2021-03-13T22:38:49.308Z] include file start
17:38:49 [2021-03-13T22:38:49.309Z] include file processed
17:38:49 [2021-03-13T22:38:49.309Z] Result of testMethod = 5
17:38:49 [2021-03-13T22:38:49.309Z] End of script
17:38:49 [2021-03-13T22:38:49.565Z] Start of script
17:38:49 [2021-03-13T22:38:49.565Z] include file start
17:38:49 [2021-03-13T22:38:49.565Z] include file processed
17:38:49 [2021-03-13T22:38:49.565Z] Traceback (most recent call last):
17:38:49 [2021-03-13T22:38:49.565Z]   File "(none)", line 184, in run
17:38:49 [2021-03-13T22:38:49.565Z]   File "__ref_L/Debug Test/Main.py_dajcmynzbx", line 21, in <module>
17:38:49 [2021-03-13T22:38:49.565Z]   File "__ref_L/Debug Test/Main.py_dajcmynzbx", line 18, in testMethod
17:38:49 [2021-03-13T22:38:49.565Z]   File "(none)", line 161, in trace_dispatch
17:38:49 [2021-03-13T22:38:49.565Z] org.eclipse.ease.ExitException: 
17:38:49 [2021-03-13T22:38:49.565Z] 
17:38:49 [2021-03-13T22:38:49.565Z] org.eclipse.ease.ExitException: org.eclipse.ease.ExitException: 
17:38:49 [2021-03-13T22:38:49.829Z] Start of script
17:38:49 [2021-03-13T22:38:49.829Z] include file start
17:38:49 [2021-03-13T22:38:49.829Z] include file processed
17:38:49 [2021-03-13T22:38:49.829Z] Result of testMethod = 5
17:38:49 [2021-03-13T22:38:49.829Z] End of script
17:38:50 [2021-03-13T22:38:50.096Z] Start of script
17:38:50 [2021-03-13T22:38:50.096Z] include file start
17:38:50 [2021-03-13T22:38:50.096Z] include file processed
17:38:50 [2021-03-13T22:38:50.096Z] Result of testMethod = 5
17:38:50 [2021-03-13T22:38:50.351Z] Traceback (most recent call last):
17:38:50 [2021-03-13T22:38:50.351Z]   File "(none)", line 184, in run
17:38:50 [2021-03-13T22:38:50.351Z]   File "__ref_L/Debug Test/Main.py_obakrqkmct", line 23, in <module>
17:38:50 [2021-03-13T22:38:50.352Z]   File "(none)", line 161, in trace_dispatch
17:38:50 [2021-03-13T22:38:50.352Z] org.eclipse.ease.ExitException: 
17:38:50 [2021-03-13T22:38:50.352Z] 
17:38:50 [2021-03-13T22:38:50.352Z] org.eclipse.ease.ExitException: org.eclipse.ease.ExitException: 
17:38:50 [2021-03-13T22:38:50.352Z] Start of script
17:38:50 [2021-03-13T22:38:50.352Z] include file start
17:38:50 [2021-03-13T22:38:50.352Z] include file processed
17:38:50 [2021-03-13T22:38:50.352Z] Result of testMethod = 5
17:38:50 [2021-03-13T22:38:50.352Z] End of script
17:38:50 [2021-03-13T22:38:50.607Z] Start of script
17:38:50 [2021-03-13T22:38:50.607Z] include file start
17:38:50 [2021-03-13T22:38:50.607Z] include file processed
17:38:50 [2021-03-13T22:38:50.862Z] Result of testMethod = 5
17:38:50 [2021-03-13T22:38:50.862Z] End of script
17:38:50 [2021-03-13T22:38:50.862Z] Start of script
17:38:50 [2021-03-13T22:38:50.862Z] include file start
17:38:50 [2021-03-13T22:38:50.862Z] include file processed
17:38:51 [2021-03-13T22:38:51.118Z] Result of testMethod = 5
17:38:51 [2021-03-13T22:38:51.118Z] End of script
17:38:51 [2021-03-13T22:38:51.118Z] Start of script
17:38:51 [2021-03-13T22:38:51.118Z] include file start
17:38:51 [2021-03-13T22:38:51.118Z] include file processed
17:38:51 [2021-03-13T22:38:51.118Z] Result of testMethod = 5
17:38:51 [2021-03-13T22:38:51.374Z] End of script
17:38:51 [2021-03-13T22:38:51.374Z] Start of script
17:38:51 [2021-03-13T22:38:51.374Z] include file start
17:38:51 [2021-03-13T22:38:51.374Z] include file processed
17:38:51 [2021-03-13T22:38:51.374Z] Result of testMethod = 5
17:38:51 [2021-03-13T22:38:51.629Z] Traceback (most recent call last):
17:38:51 [2021-03-13T22:38:51.629Z]   File "(none)", line 184, in run
17:38:51 [2021-03-13T22:38:51.629Z]   File "__ref_L/Debug Test/Main.py_nbtmxzyfre", line 23, in <module>
17:38:51 [2021-03-13T22:38:51.629Z]   File "(none)", line 161, in trace_dispatch
17:38:51 [2021-03-13T22:38:51.629Z] org.eclipse.ease.ExitException: 
17:38:51 [2021-03-13T22:38:51.629Z] 
17:38:51 [2021-03-13T22:38:51.629Z] org.eclipse.ease.ExitException: org.eclipse.ease.ExitException: 
17:38:51 [2021-03-13T22:38:51.629Z] Start of script
17:38:51 [2021-03-13T22:38:51.629Z] include file start
17:38:51 [2021-03-13T22:38:51.629Z] include file processed
17:38:51 [2021-03-13T22:38:51.629Z] Result of testMethod = 5
17:38:51 [2021-03-13T22:38:51.902Z] End of script
17:38:51 [2021-03-13T22:38:51.902Z] Start of script
17:38:51 [2021-03-13T22:38:51.902Z] include file start
17:38:51 [2021-03-13T22:38:51.902Z] include file processed
17:38:51 [2021-03-13T22:38:51.902Z] Result of testMethod = 5
17:38:52 [2021-03-13T22:38:52.158Z] Traceback (most recent call last):
17:38:52 [2021-03-13T22:38:52.158Z]   File "(none)", line 184, in run
17:38:52 [2021-03-13T22:38:52.158Z]   File "__ref_L/Debug Test/Main.py_kadyareagj", line 23, in <module>
17:38:52 [2021-03-13T22:38:52.158Z]   File "(none)", line 161, in trace_dispatch
17:38:52 [2021-03-13T22:38:52.158Z] org.eclipse.ease.ExitException: 
17:38:52 [2021-03-13T22:38:52.158Z] 
17:38:52 [2021-03-13T22:38:52.158Z] org.eclipse.ease.ExitException: org.eclipse.ease.ExitException: 
17:38:52 [2021-03-13T22:38:52.413Z] Traceback (most recent call last):
17:38:52 [2021-03-13T22:38:52.413Z]   File "(none)", line 184, in run
17:38:52 [2021-03-13T22:38:52.413Z]   File "__ref_L/Debug Test/Main.py_jouosipzwh", line 1, in <module>
17:38:52 [2021-03-13T22:38:52.413Z]   File "(none)", line 161, in trace_dispatch
17:38:52 [2021-03-13T22:38:52.413Z] org.eclipse.ease.ExitException: 
17:38:52 [2021-03-13T22:38:52.413Z] 
17:38:52 [2021-03-13T22:38:52.413Z] org.eclipse.ease.ExitException: org.eclipse.ease.ExitException: 
17:38:52 [2021-03-13T22:38:52.413Z] Start of script
17:38:52 [2021-03-13T22:38:52.413Z] include file start
17:38:52 [2021-03-13T22:38:52.413Z] include file processed
17:38:52 [2021-03-13T22:38:52.413Z] Result of testMethod = 5
17:38:52 [2021-03-13T22:38:52.413Z] End of script
17:38:52 [2021-03-13T22:38:52.669Z] Start of script
17:38:52 [2021-03-13T22:38:52.669Z] include file start
17:38:52 [2021-03-13T22:38:52.669Z] include file processed
17:38:52 [2021-03-13T22:38:52.924Z] Result of testMethod = 5
17:38:52 [2021-03-13T22:38:52.924Z] End of script
17:38:52 [2021-03-13T22:38:52.924Z] Start of script
17:38:52 [2021-03-13T22:38:52.924Z] include file start
17:38:52 [2021-03-13T22:38:52.924Z] include file processed
17:38:52 [2021-03-13T22:38:52.924Z] Result of testMethod = 5
17:38:52 [2021-03-13T22:38:52.924Z] End of script
17:38:53 [2021-03-13T22:38:53.180Z] Tests run: 42, Failures: 0, Errors: 0, Skipped: 0, Time elapsed: 14.687 s - in org.eclipse.ease.lang.python.jython.debugger.JythonDebugTest
17:38:53 [2021-03-13T22:38:53.180Z] disconnectProcessInSuspendedState  Time elapsed: 3.58 s
17:38:53 [2021-03-13T22:38:53.180Z] stepReturnIncludeCommand  Time elapsed: 0.314 s
17:38:53 [2021-03-13T22:38:53.180Z] arrayVariableSorting  Time elapsed: 0.307 s
17:38:53 [2021-03-13T22:38:53.180Z] stepOverOnDebugTarget  Time elapsed: 0.307 s
17:38:53 [2021-03-13T22:38:53.180Z] hasDebugTarget  Time elapsed: 0.104 s
17:38:53 [2021-03-13T22:38:53.180Z] disconnectThreadInSuspendedState  Time elapsed: 0.205 s
17:38:53 [2021-03-13T22:38:53.180Z] stepReturnOnDebugTarget  Time elapsed: 0.306 s
17:38:53 [2021-03-13T22:38:53.180Z] nullVariable  Time elapsed: 0.305 s
17:38:53 [2021-03-13T22:38:53.180Z] stepOverOnStackFrame  Time elapsed: 0.307 s
17:38:53 [2021-03-13T22:38:53.180Z] resumeOnDebugTarget  Time elapsed: 0.205 s
17:38:53 [2021-03-13T22:38:53.180Z] modifyVariableKeepingType  Time elapsed: 0.505 s
17:38:53 [2021-03-13T22:38:53.180Z] resumeOnLastIncludeLine  Time elapsed: 0.205 s
17:38:53 [2021-03-13T22:38:53.180Z] stepReturnOnStackFrame  Time elapsed: 0.306 s
17:38:53 [2021-03-13T22:38:53.180Z] terminateStackFrameInSuspendedState  Time elapsed: 0.205 s
17:38:53 [2021-03-13T22:38:53.180Z] breakpointLocation  Time elapsed: 0.204 s
17:38:53 [2021-03-13T22:38:53.180Z] stepReturnOnThread  Time elapsed: 0.307 s
17:38:53 [2021-03-13T22:38:53.180Z] javaClassVariable  Time elapsed: 0.408 s
17:38:53 [2021-03-13T22:38:53.180Z] stepIntoOnThread  Time elapsed: 0.306 s
17:38:53 [2021-03-13T22:38:53.180Z] terminateThreadInSuspendedState  Time elapsed: 0.205 s
17:38:53 [2021-03-13T22:38:53.180Z] resumeOnThread  Time elapsed: 0.206 s
17:38:53 [2021-03-13T22:38:53.180Z] stepIntoOnStackFrame  Time elapsed: 0.306 s
17:38:53 [2021-03-13T22:38:53.180Z] terminateProcessInSuspendedState  Time elapsed: 0.205 s
17:38:53 [2021-03-13T22:38:53.180Z] stepOverOnProcess  Time elapsed: 0.34 s
17:38:53 [2021-03-13T22:38:53.180Z] nativeArrayVariable  Time elapsed: 0.305 s
17:38:53 [2021-03-13T22:38:53.180Z] disconnectDebugTargetInSuspendedState  Time elapsed: 0.205 s
17:38:53 [2021-03-13T22:38:53.180Z] stepIntoOnProcess  Time elapsed: 0.306 s
17:38:53 [2021-03-13T22:38:53.180Z] terminatedState  Time elapsed: 0.205 s
17:38:53 [2021-03-13T22:38:53.180Z] stepOverIncludeCommand  Time elapsed: 0.305 s
17:38:53 [2021-03-13T22:38:53.180Z] innerScopeVariableBeforeOuterScopeVariable  Time elapsed: 0.305 s
17:38:53 [2021-03-13T22:38:53.180Z] stepIntoIncludeCommand  Time elapsed: 0.304 s
17:38:53 [2021-03-13T22:38:53.180Z] primitiveStringVariable  Time elapsed: 0.304 s
17:38:53 [2021-03-13T22:38:53.180Z] resumeOnProcess  Time elapsed: 0.205 s
17:38:53 [2021-03-13T22:38:53.180Z] stepIntoOnDebugTarget  Time elapsed: 0.305 s
17:38:53 [2021-03-13T22:38:53.180Z] stepOverOnThread  Time elapsed: 0.305 s
17:38:53 [2021-03-13T22:38:53.180Z] suspendedState  Time elapsed: 0.204 s
17:38:53 [2021-03-13T22:38:53.180Z] primitiveDoubleVariable  Time elapsed: 0.304 s
17:38:53 [2021-03-13T22:38:53.180Z] resumeOnStackFrame  Time elapsed: 0.203 s
17:38:53 [2021-03-13T22:38:53.180Z] nativeObjectVariable  Time elapsed: 0.306 s
17:38:53 [2021-03-13T22:38:53.180Z] terminateDebugTargetInSuspendedState  Time elapsed: 0.206 s
17:38:53 [2021-03-13T22:38:53.180Z] disconnectStackFrameInSuspendedState  Time elapsed: 0.204 s
17:38:53 [2021-03-13T22:38:53.180Z] stepReturnOnProcess  Time elapsed: 0.305 s
17:38:53 [2021-03-13T22:38:53.180Z] evaluateWatchExpression  Time elapsed: 0.236 s
17:38:53 [2021-03-13T22:38:53.180Z] 
17:38:53 [2021-03-13T22:38:53.180Z] Results:
17:38:53 [2021-03-13T22:38:53.180Z] 
17:38:53 [2021-03-13T22:38:53.180Z] Tests run: 42, Failures: 0, Errors: 0, Skipped: 0
17:38:53 [2021-03-13T22:38:53.180Z] 
17:38:53 [2021-03-13T22:38:53.741Z] [INFO] All tests passed!
17:38:53 [2021-03-13T22:38:53.741Z] [INFO] 
17:38:53 [2021-03-13T22:38:53.741Z] [INFO] --- maven-install-plugin:2.3.1:install (default-install) @ org.eclipse.ease.lang.python.jython.test ---
17:38:53 [2021-03-13T22:38:53.741Z] [INFO] Installing /home/jenkins/agent/workspace/ease.verify.core.target.2019-03/tests/org.eclipse.ease.lang.python.jython.test/target/org.eclipse.ease.lang.python.jython.test-0.8.0-SNAPSHOT.jar to /home/jenkins/.m2/repository/org/eclipse/ease/org.eclipse.ease.lang.python.jython.test/0.8.0-SNAPSHOT/org.eclipse.ease.lang.python.jython.test-0.8.0-SNAPSHOT.jar
17:38:53 [2021-03-13T22:38:53.741Z] [INFO] Installing /home/jenkins/agent/workspace/ease.verify.core.target.2019-03/tests/org.eclipse.ease.lang.python.jython.test/pom.xml to /home/jenkins/.m2/repository/org/eclipse/ease/org.eclipse.ease.lang.python.jython.test/0.8.0-SNAPSHOT/org.eclipse.ease.lang.python.jython.test-0.8.0-SNAPSHOT.pom
17:38:53 [2021-03-13T22:38:53.741Z] [INFO] Installing /home/jenkins/agent/workspace/ease.verify.core.target.2019-03/tests/org.eclipse.ease.lang.python.jython.test/target/p2content.xml to /home/jenkins/.m2/repository/org/eclipse/ease/org.eclipse.ease.lang.python.jython.test/0.8.0-SNAPSHOT/org.eclipse.ease.lang.python.jython.test-0.8.0-SNAPSHOT-p2metadata.xml
17:38:53 [2021-03-13T22:38:53.741Z] [INFO] Installing /home/jenkins/agent/workspace/ease.verify.core.target.2019-03/tests/org.eclipse.ease.lang.python.jython.test/target/p2artifacts.xml to /home/jenkins/.m2/repository/org/eclipse/ease/org.eclipse.ease.lang.python.jython.test/0.8.0-SNAPSHOT/org.eclipse.ease.lang.python.jython.test-0.8.0-SNAPSHOT-p2artifacts.xml
17:38:53 [2021-03-13T22:38:53.741Z] [INFO] 
17:38:53 [2021-03-13T22:38:53.741Z] [INFO] --- tycho-p2-plugin:2.2.0:update-local-index (default-update-local-index) @ org.eclipse.ease.lang.python.jython.test ---
17:38:53 [2021-03-13T22:38:53.741Z] [INFO] 
17:38:53 [2021-03-13T22:38:53.741Z] [INFO] -----< org.eclipse.ease:org.eclipse.ease.lang.scriptarchive.test >------
17:38:53 [2021-03-13T22:38:53.741Z] [INFO] Building org.eclipse.ease.lang.scriptarchive.test 0.8.0-SNAPSHOT [43/48]
17:38:53 [2021-03-13T22:38:53.741Z] [INFO] ------------------------[ eclipse-test-plugin ]-------------------------
17:38:54 [2021-03-13T22:38:54.002Z] [INFO] 
17:38:54 [2021-03-13T22:38:54.002Z] [INFO] --- maven-clean-plugin:2.5:clean (default-clean) @ org.eclipse.ease.lang.scriptarchive.test ---
17:38:54 [2021-03-13T22:38:54.002Z] [INFO] 
17:38:54 [2021-03-13T22:38:54.002Z] [INFO] --- tycho-packaging-plugin:2.2.0:build-qualifier (default-build-qualifier) @ org.eclipse.ease.lang.scriptarchive.test ---
17:38:54 [2021-03-13T22:38:54.002Z] [INFO] The project's OSGi version is 0.8.0.I202103030731
17:38:54 [2021-03-13T22:38:54.002Z] [INFO] 
17:38:54 [2021-03-13T22:38:54.002Z] [INFO] --- tycho-packaging-plugin:2.2.0:validate-id (default-validate-id) @ org.eclipse.ease.lang.scriptarchive.test ---
17:38:54 [2021-03-13T22:38:54.002Z] [INFO] 
17:38:54 [2021-03-13T22:38:54.002Z] [INFO] --- tycho-packaging-plugin:2.2.0:validate-version (default-validate-version) @ org.eclipse.ease.lang.scriptarchive.test ---
17:38:54 [2021-03-13T22:38:54.002Z] [INFO] 
17:38:54 [2021-03-13T22:38:54.002Z] [INFO] --- maven-resources-plugin:2.4.3:resources (default-resources) @ org.eclipse.ease.lang.scriptarchive.test ---
17:38:54 [2021-03-13T22:38:54.002Z] [INFO] Using 'UTF-8' encoding to copy filtered resources.
17:38:54 [2021-03-13T22:38:54.002Z] [INFO] skip non existing resourceDirectory /home/jenkins/agent/workspace/ease.verify.core.target.2019-03/tests/org.eclipse.ease.lang.scriptarchive.test/src/main/resources
17:38:54 [2021-03-13T22:38:54.002Z] [INFO] 
17:38:54 [2021-03-13T22:38:54.002Z] [INFO] --- tycho-compiler-plugin:2.2.0:compile (default-compile) @ org.eclipse.ease.lang.scriptarchive.test ---
17:38:54 [2021-03-13T22:38:54.002Z] [INFO] Compiling 1 source file to /home/jenkins/agent/workspace/ease.verify.core.target.2019-03/tests/org.eclipse.ease.lang.scriptarchive.test/target/classes
17:38:54 [2021-03-13T22:38:54.002Z] [INFO] 
17:38:54 [2021-03-13T22:38:54.002Z] [INFO] --- maven-resources-plugin:2.4.3:testResources (default-testResources) @ org.eclipse.ease.lang.scriptarchive.test ---
17:38:54 [2021-03-13T22:38:54.002Z] [INFO] Using 'UTF-8' encoding to copy filtered resources.
17:38:54 [2021-03-13T22:38:54.002Z] [INFO] skip non existing resourceDirectory /home/jenkins/agent/workspace/ease.verify.core.target.2019-03/tests/org.eclipse.ease.lang.scriptarchive.test/src/test/resources
17:38:54 [2021-03-13T22:38:54.002Z] [INFO] 
17:38:54 [2021-03-13T22:38:54.002Z] [INFO] --- target-platform-configuration:2.2.0:target-platform (default-target-platform) @ org.eclipse.ease.lang.scriptarchive.test ---
17:38:54 [2021-03-13T22:38:54.002Z] [INFO] 
17:38:54 [2021-03-13T22:38:54.002Z] [INFO] --- tycho-packaging-plugin:2.2.0:package-plugin (default-package-plugin) @ org.eclipse.ease.lang.scriptarchive.test ---
17:38:54 [2021-03-13T22:38:54.002Z] [INFO] Building jar: /home/jenkins/agent/workspace/ease.verify.core.target.2019-03/tests/org.eclipse.ease.lang.scriptarchive.test/target/org.eclipse.ease.lang.scriptarchive.test-0.8.0-SNAPSHOT.jar
17:38:54 [2021-03-13T22:38:54.002Z] [INFO] 
17:38:54 [2021-03-13T22:38:54.002Z] [INFO] --- tycho-p2-plugin:2.2.0:p2-metadata-default (default-p2-metadata-default) @ org.eclipse.ease.lang.scriptarchive.test ---
17:38:54 [2021-03-13T22:38:54.002Z] [INFO] 
17:38:54 [2021-03-13T22:38:54.002Z] [INFO] --- jacoco-maven-plugin:0.8.6:prepare-agent (jacoco-initialize) @ org.eclipse.ease.lang.scriptarchive.test ---
17:38:54 [2021-03-13T22:38:54.002Z] [INFO] tycho.testArgLine set to -javaagent:/home/jenkins/.m2/repository/org/jacoco/org.jacoco.agent/0.8.6/org.jacoco.agent-0.8.6-runtime.jar=destfile=/home/jenkins/agent/workspace/ease.verify.core.target.2019-03/tests/org.eclipse.ease.lang.scriptarchive.test/target/jacoco.exec,output=file
17:38:54 [2021-03-13T22:38:54.003Z] [INFO] 
17:38:54 [2021-03-13T22:38:54.003Z] [INFO] --- tycho-surefire-plugin:2.2.0:test (default-test) @ org.eclipse.ease.lang.scriptarchive.test ---
17:38:54 [2021-03-13T22:38:54.003Z] [INFO] Executing Test Runtime with timeout 0, logs (if any) will be placed at: /home/jenkins/agent/workspace/ease.verify.core.target.2019-03/tests/org.eclipse.ease.lang.scriptarchive.test/target/work/data/.metadata/.log
17:38:54 [2021-03-13T22:38:54.003Z] [INFO] Command line:
17:38:54 [2021-03-13T22:38:54.003Z] 	[/opt/tools/java/openjdk/jdk-15/15.0.2+7/bin/java, -Dosgi.noShutdown=false, -Dosgi.os=linux, -Dosgi.ws=gtk, -Dosgi.arch=x86_64, -javaagent:/home/jenkins/.m2/repository/org/jacoco/org.jacoco.agent/0.8.6/org.jacoco.agent-0.8.6-runtime.jar=destfile=/home/jenkins/agent/workspace/ease.verify.core.target.2019-03/tests/org.eclipse.ease.lang.scriptarchive.test/target/jacoco.exec,output=file, -Dosgi.clean=true, -jar, /home/jenkins/.m2/repository/p2/osgi/bundle/org.eclipse.equinox.launcher/1.5.800.v20200727-1323/org.eclipse.equinox.launcher-1.5.800.v20200727-1323.jar, -data, /home/jenkins/agent/workspace/ease.verify.core.target.2019-03/tests/org.eclipse.ease.lang.scriptarchive.test/target/work/data, -install, /home/jenkins/agent/workspace/ease.verify.core.target.2019-03/tests/org.eclipse.ease.lang.scriptarchive.test/target/work, -configuration, /home/jenkins/agent/workspace/ease.verify.core.target.2019-03/tests/org.eclipse.ease.lang.scriptarchive.test/target/work/configuration, -application, org.eclipse.tycho.surefire.osgibooter.headlesstest, -testproperties, /home/jenkins/agent/workspace/ease.verify.core.target.2019-03/tests/org.eclipse.ease.lang.scriptarchive.test/target/surefire.properties]
17:38:54 [2021-03-13T22:38:54.003Z] Picked up JAVA_TOOL_OPTIONS: -Dmaven.ext.class.path="/home/jenkins/agent/workspace/ease.verify.core.target.2019-03@tmp/withMaven7a46d5a8/pipeline-maven-spy.jar" -Dorg.jenkinsci.plugins.pipeline.maven.reportsFolder="/home/jenkins/agent/workspace/ease.verify.core.target.2019-03@tmp/withMaven7a46d5a8" 
17:38:56 [2021-03-13T22:38:56.516Z] Mar 13, 2021 10:38:56 PM org.junit.platform.launcher.core.DefaultLauncher handleThrowable
17:38:56 [2021-03-13T22:38:56.516Z] WARNING: TestEngine with ID 'junit-vintage' failed to discover tests
17:38:56 [2021-03-13T22:38:56.516Z] java.lang.NoClassDefFoundError: org/junit/runners/model/RunnerBuilder
17:38:56 [2021-03-13T22:38:56.516Z] 	at org.junit.vintage.engine.discovery.VintageDiscoverer.<init>(VintageDiscoverer.java:48)
17:38:56 [2021-03-13T22:38:56.516Z] 	at org.junit.vintage.engine.VintageTestEngine.discover(VintageTestEngine.java:65)
17:38:56 [2021-03-13T22:38:56.516Z] 	at org.junit.platform.launcher.core.DefaultLauncher.discoverEngineRoot(DefaultLauncher.java:130)
17:38:56 [2021-03-13T22:38:56.516Z] 	at org.junit.platform.launcher.core.DefaultLauncher.discoverRoot(DefaultLauncher.java:117)
17:38:56 [2021-03-13T22:38:56.516Z] 	at org.junit.platform.launcher.core.DefaultLauncher.discover(DefaultLauncher.java:82)
17:38:56 [2021-03-13T22:38:56.516Z] 	at org.apache.maven.surefire.junitplatform.TestPlanScannerFilter.accept(TestPlanScannerFilter.java:56)
17:38:56 [2021-03-13T22:38:56.517Z] 	at org.apache.maven.surefire.util.DefaultScanResult.applyFilter(DefaultScanResult.java:102)
17:38:56 [2021-03-13T22:38:56.517Z] 	at org.apache.maven.surefire.junitplatform.JUnitPlatformProvider.scanClasspath(JUnitPlatformProvider.java:143)
17:38:56 [2021-03-13T22:38:56.517Z] 	at org.apache.maven.surefire.junitplatform.JUnitPlatformProvider.invoke(JUnitPlatformProvider.java:124)
17:38:56 [2021-03-13T22:38:56.517Z] 	at java.base/jdk.internal.reflect.NativeMethodAccessorImpl.invoke0(Native Method)
17:38:56 [2021-03-13T22:38:56.517Z] 	at java.base/jdk.internal.reflect.NativeMethodAccessorImpl.invoke(NativeMethodAccessorImpl.java:64)
17:38:56 [2021-03-13T22:38:56.517Z] 	at java.base/jdk.internal.reflect.DelegatingMethodAccessorImpl.invoke(DelegatingMethodAccessorImpl.java:43)
17:38:56 [2021-03-13T22:38:56.517Z] 	at java.base/java.lang.reflect.Method.invoke(Method.java:564)
17:38:56 [2021-03-13T22:38:56.517Z] 	at org.apache.maven.surefire.util.ReflectionUtils.invokeMethodWithArray2(ReflectionUtils.java:206)
17:38:56 [2021-03-13T22:38:56.517Z] 	at org.apache.maven.surefire.booter.ProviderFactory$ProviderProxy.invoke(ProviderFactory.java:161)
17:38:56 [2021-03-13T22:38:56.517Z] 	at org.apache.maven.surefire.booter.ProviderFactory.invokeProvider(ProviderFactory.java:84)
17:38:56 [2021-03-13T22:38:56.517Z] 	at org.eclipse.tycho.surefire.osgibooter.OsgiSurefireBooter.run(OsgiSurefireBooter.java:116)
17:38:56 [2021-03-13T22:38:56.517Z] 	at org.eclipse.tycho.surefire.osgibooter.HeadlessTestApplication.start(HeadlessTestApplication.java:23)
17:38:56 [2021-03-13T22:38:56.517Z] 	at org.eclipse.equinox.internal.app.EclipseAppHandle.run(EclipseAppHandle.java:203)
17:38:56 [2021-03-13T22:38:56.517Z] 	at org.eclipse.core.runtime.internal.adaptor.EclipseAppLauncher.runApplication(EclipseAppLauncher.java:134)
17:38:56 [2021-03-13T22:38:56.517Z] 	at org.eclipse.core.runtime.internal.adaptor.EclipseAppLauncher.start(EclipseAppLauncher.java:104)
17:38:56 [2021-03-13T22:38:56.517Z] 	at org.eclipse.core.runtime.adaptor.EclipseStarter.run(EclipseStarter.java:401)
17:38:56 [2021-03-13T22:38:56.517Z] 	at org.eclipse.core.runtime.adaptor.EclipseStarter.run(EclipseStarter.java:255)
17:38:56 [2021-03-13T22:38:56.517Z] 	at java.base/jdk.internal.reflect.NativeMethodAccessorImpl.invoke0(Native Method)
17:38:56 [2021-03-13T22:38:56.517Z] 	at java.base/jdk.internal.reflect.NativeMethodAccessorImpl.invoke(NativeMethodAccessorImpl.java:64)
17:38:56 [2021-03-13T22:38:56.517Z] 	at java.base/jdk.internal.reflect.DelegatingMethodAccessorImpl.invoke(DelegatingMethodAccessorImpl.java:43)
17:38:56 [2021-03-13T22:38:56.517Z] 	at java.base/java.lang.reflect.Method.invoke(Method.java:564)
17:38:56 [2021-03-13T22:38:56.517Z] 	at org.eclipse.equinox.launcher.Main.invokeFramework(Main.java:657)
17:38:56 [2021-03-13T22:38:56.517Z] 	at org.eclipse.equinox.launcher.Main.basicRun(Main.java:594)
17:38:56 [2021-03-13T22:38:56.517Z] 	at org.eclipse.equinox.launcher.Main.run(Main.java:1465)
17:38:56 [2021-03-13T22:38:56.517Z] 	at org.eclipse.equinox.launcher.Main.main(Main.java:1438)
17:38:56 [2021-03-13T22:38:56.517Z] Caused by: java.lang.ClassNotFoundException: org.junit.runners.model.RunnerBuilder cannot be found by org.eclipse.tycho.surefire.osgibooter_2.2.0
17:38:56 [2021-03-13T22:38:56.517Z] 	at org.eclipse.osgi.internal.loader.BundleLoader.findClass(BundleLoader.java:516)
17:38:56 [2021-03-13T22:38:56.517Z] 	at org.eclipse.osgi.internal.loader.ModuleClassLoader.loadClass(ModuleClassLoader.java:171)
17:38:56 [2021-03-13T22:38:56.517Z] 	at java.base/java.lang.ClassLoader.loadClass(ClassLoader.java:522)
17:38:56 [2021-03-13T22:38:56.517Z] 	... 31 more
17:38:56 [2021-03-13T22:38:56.517Z] 
17:38:56 [2021-03-13T22:38:56.517Z] Mar 13, 2021 10:38:56 PM org.junit.platform.launcher.core.DefaultLauncher handleThrowable
17:38:56 [2021-03-13T22:38:56.517Z] WARNING: TestEngine with ID 'junit-vintage' failed to discover tests
17:38:56 [2021-03-13T22:38:56.517Z] java.lang.NoClassDefFoundError: org/junit/runners/model/RunnerBuilder
17:38:56 [2021-03-13T22:38:56.517Z] 	at org.junit.vintage.engine.discovery.VintageDiscoverer.<init>(VintageDiscoverer.java:48)
17:38:56 [2021-03-13T22:38:56.517Z] 	at org.junit.vintage.engine.VintageTestEngine.discover(VintageTestEngine.java:65)
17:38:56 [2021-03-13T22:38:56.517Z] 	at org.junit.platform.launcher.core.DefaultLauncher.discoverEngineRoot(DefaultLauncher.java:130)
17:38:56 [2021-03-13T22:38:56.517Z] 	at org.junit.platform.launcher.core.DefaultLauncher.discoverRoot(DefaultLauncher.java:117)
17:38:56 [2021-03-13T22:38:56.517Z] 	at org.junit.platform.launcher.core.DefaultLauncher.execute(DefaultLauncher.java:90)
17:38:56 [2021-03-13T22:38:56.517Z] 	at org.apache.maven.surefire.junitplatform.JUnitPlatformProvider.invokeAllTests(JUnitPlatformProvider.java:150)
17:38:56 [2021-03-13T22:38:56.517Z] 	at org.apache.maven.surefire.junitplatform.JUnitPlatformProvider.invoke(JUnitPlatformProvider.java:124)
17:38:56 [2021-03-13T22:38:56.517Z] 	at java.base/jdk.internal.reflect.NativeMethodAccessorImpl.invoke0(Native Method)
17:38:56 [2021-03-13T22:38:56.517Z] 	at java.base/jdk.internal.reflect.NativeMethodAccessorImpl.invoke(NativeMethodAccessorImpl.java:64)
17:38:56 [2021-03-13T22:38:56.517Z] 	at java.base/jdk.internal.reflect.DelegatingMethodAccessorImpl.invoke(DelegatingMethodAccessorImpl.java:43)
17:38:56 [2021-03-13T22:38:56.517Z] 	at java.base/java.lang.reflect.Method.invoke(Method.java:564)
17:38:56 [2021-03-13T22:38:56.517Z] 	at org.apache.maven.surefire.util.ReflectionUtils.invokeMethodWithArray2(ReflectionUtils.java:206)
17:38:56 [2021-03-13T22:38:56.517Z] 	at org.apache.maven.surefire.booter.ProviderFactory$ProviderProxy.invoke(ProviderFactory.java:161)
17:38:56 [2021-03-13T22:38:56.517Z] 	at org.apache.maven.surefire.booter.ProviderFactory.invokeProvider(ProviderFactory.java:84)
17:38:56 [2021-03-13T22:38:56.517Z] 	at org.eclipse.tycho.surefire.osgibooter.OsgiSurefireBooter.run(OsgiSurefireBooter.java:116)
17:38:56 [2021-03-13T22:38:56.517Z] 	at org.eclipse.tycho.surefire.osgibooter.HeadlessTestApplication.start(HeadlessTestApplication.java:23)
17:38:56 [2021-03-13T22:38:56.517Z] 	at org.eclipse.equinox.internal.app.EclipseAppHandle.run(EclipseAppHandle.java:203)
17:38:56 [2021-03-13T22:38:56.517Z] 	at org.eclipse.core.runtime.internal.adaptor.EclipseAppLauncher.runApplication(EclipseAppLauncher.java:134)
17:38:56 [2021-03-13T22:38:56.517Z] 	at org.eclipse.core.runtime.internal.adaptor.EclipseAppLauncher.start(EclipseAppLauncher.java:104)
17:38:56 [2021-03-13T22:38:56.517Z] 	at org.eclipse.core.runtime.adaptor.EclipseStarter.run(EclipseStarter.java:401)
17:38:56 [2021-03-13T22:38:56.517Z] 	at org.eclipse.core.runtime.adaptor.EclipseStarter.run(EclipseStarter.java:255)
17:38:56 [2021-03-13T22:38:56.517Z] 	at java.base/jdk.internal.reflect.NativeMethodAccessorImpl.invoke0(Native Method)
17:38:56 [2021-03-13T22:38:56.517Z] 	at java.base/jdk.internal.reflect.NativeMethodAccessorImpl.invoke(NativeMethodAccessorImpl.java:64)
17:38:56 [2021-03-13T22:38:56.517Z] 	at java.base/jdk.internal.reflect.DelegatingMethodAccessorImpl.invoke(DelegatingMethodAccessorImpl.java:43)
17:38:56 [2021-03-13T22:38:56.517Z] 	at java.base/java.lang.reflect.Method.invoke(Method.java:564)
17:38:56 [2021-03-13T22:38:56.517Z] 	at org.eclipse.equinox.launcher.Main.invokeFramework(Main.java:657)
17:38:56 [2021-03-13T22:38:56.517Z] 	at org.eclipse.equinox.launcher.Main.basicRun(Main.java:594)
17:38:56 [2021-03-13T22:38:56.517Z] 	at org.eclipse.equinox.launcher.Main.run(Main.java:1465)
17:38:56 [2021-03-13T22:38:56.517Z] 	at org.eclipse.equinox.launcher.Main.main(Main.java:1438)
17:38:56 [2021-03-13T22:38:56.517Z] Caused by: java.lang.ClassNotFoundException: org.junit.runners.model.RunnerBuilder cannot be found by org.eclipse.tycho.surefire.osgibooter_2.2.0
17:38:56 [2021-03-13T22:38:56.517Z] 	at org.eclipse.osgi.internal.loader.BundleLoader.findClass(BundleLoader.java:516)
17:38:56 [2021-03-13T22:38:56.517Z] 	at org.eclipse.osgi.internal.loader.ModuleClassLoader.loadClass(ModuleClassLoader.java:171)
17:38:56 [2021-03-13T22:38:56.517Z] 	at java.base/java.lang.ClassLoader.loadClass(ClassLoader.java:522)
17:38:56 [2021-03-13T22:38:56.517Z] 	... 29 more
17:38:56 [2021-03-13T22:38:56.517Z] 
17:38:56 [2021-03-13T22:38:56.517Z] Running org.eclipse.ease.lang.scriptarchive.ArchiveEngineTest
17:38:57 [2021-03-13T22:38:57.079Z] We are running from a zip file!
17:38:57 [2021-03-13T22:38:57.079Z] org.eclipse.ease.ScriptExecutionException: SyntaxError: missing ; before statement (workspace://__EASE_ScriptArchive_1/scripts/Master.js#3)
17:38:57 [2021-03-13T22:38:57.080Z] this is an error
17:38:57 [2021-03-13T22:38:57.080Z]        ^
17:38:57 [2021-03-13T22:38:57.080Z] 	at Master.js,workspace://__EASE_ScriptArchive_1/scripts/Master.js
17:38:57 [2021-03-13T22:38:57.080Z] org.eclipse.ease.ScriptExecutionException: SyntaxError: missing ; before statement (workspace://__EASE_ScriptArchive_1/scripts/Master.js#3)
17:38:57 [2021-03-13T22:38:57.080Z] this is an error
17:38:57 [2021-03-13T22:38:57.080Z]        ^
17:38:57 [2021-03-13T22:38:57.080Z] 	at Master.js,workspace://__EASE_ScriptArchive_1/scripts/Master.js
17:38:57 [2021-03-13T22:38:57.335Z] Tests run: 7, Failures: 0, Errors: 0, Skipped: 0, Time elapsed: 0.868 s - in org.eclipse.ease.lang.scriptarchive.ArchiveEngineTest
17:38:57 [2021-03-13T22:38:57.335Z] executeWithManifest  Time elapsed: 0.7 s
17:38:57 [2021-03-13T22:38:57.335Z] zipFileRegistration  Time elapsed: 0.01 s
17:38:57 [2021-03-13T22:38:57.335Z] engineIdRegistration  Time elapsed: 0 s
17:38:57 [2021-03-13T22:38:57.335Z] jarFileRegistration  Time elapsed: 0.001 s
17:38:57 [2021-03-13T22:38:57.335Z] sarFileRegistration  Time elapsed: 0 s
17:38:57 [2021-03-13T22:38:57.335Z] executeWithErrors  Time elapsed: 0.074 s
17:38:57 [2021-03-13T22:38:57.336Z] executeWithIncludes  Time elapsed: 0.076 s
17:38:57 [2021-03-13T22:38:57.336Z] 
17:38:57 [2021-03-13T22:38:57.336Z] Results:
17:38:57 [2021-03-13T22:38:57.336Z] 
17:38:57 [2021-03-13T22:38:57.336Z] Tests run: 7, Failures: 0, Errors: 0, Skipped: 0
17:38:57 [2021-03-13T22:38:57.336Z] 
17:38:57 [2021-03-13T22:38:57.897Z] [INFO] All tests passed!
17:38:57 [2021-03-13T22:38:57.897Z] [INFO] 
17:38:57 [2021-03-13T22:38:57.897Z] [INFO] --- maven-install-plugin:2.3.1:install (default-install) @ org.eclipse.ease.lang.scriptarchive.test ---
17:38:57 [2021-03-13T22:38:57.897Z] [INFO] Installing /home/jenkins/agent/workspace/ease.verify.core.target.2019-03/tests/org.eclipse.ease.lang.scriptarchive.test/target/org.eclipse.ease.lang.scriptarchive.test-0.8.0-SNAPSHOT.jar to /home/jenkins/.m2/repository/org/eclipse/ease/org.eclipse.ease.lang.scriptarchive.test/0.8.0-SNAPSHOT/org.eclipse.ease.lang.scriptarchive.test-0.8.0-SNAPSHOT.jar
17:38:57 [2021-03-13T22:38:57.897Z] [INFO] Installing /home/jenkins/agent/workspace/ease.verify.core.target.2019-03/tests/org.eclipse.ease.lang.scriptarchive.test/pom.xml to /home/jenkins/.m2/repository/org/eclipse/ease/org.eclipse.ease.lang.scriptarchive.test/0.8.0-SNAPSHOT/org.eclipse.ease.lang.scriptarchive.test-0.8.0-SNAPSHOT.pom
17:38:57 [2021-03-13T22:38:57.897Z] [INFO] Installing /home/jenkins/agent/workspace/ease.verify.core.target.2019-03/tests/org.eclipse.ease.lang.scriptarchive.test/target/p2content.xml to /home/jenkins/.m2/repository/org/eclipse/ease/org.eclipse.ease.lang.scriptarchive.test/0.8.0-SNAPSHOT/org.eclipse.ease.lang.scriptarchive.test-0.8.0-SNAPSHOT-p2metadata.xml
17:38:57 [2021-03-13T22:38:57.897Z] [INFO] Installing /home/jenkins/agent/workspace/ease.verify.core.target.2019-03/tests/org.eclipse.ease.lang.scriptarchive.test/target/p2artifacts.xml to /home/jenkins/.m2/repository/org/eclipse/ease/org.eclipse.ease.lang.scriptarchive.test/0.8.0-SNAPSHOT/org.eclipse.ease.lang.scriptarchive.test-0.8.0-SNAPSHOT-p2artifacts.xml
17:38:57 [2021-03-13T22:38:57.897Z] [INFO] 
17:38:57 [2021-03-13T22:38:57.897Z] [INFO] --- tycho-p2-plugin:2.2.0:update-local-index (default-update-local-index) @ org.eclipse.ease.lang.scriptarchive.test ---
17:38:57 [2021-03-13T22:38:57.897Z] [INFO] 
17:38:57 [2021-03-13T22:38:57.897Z] [INFO] --------< org.eclipse.ease:org.eclipse.ease.lang.unittest.test >--------
17:38:57 [2021-03-13T22:38:57.897Z] [INFO] Building org.eclipse.ease.lang.unittest.test 0.8.0-SNAPSHOT      [44/48]
17:38:57 [2021-03-13T22:38:57.897Z] [INFO] ------------------------[ eclipse-test-plugin ]-------------------------
17:38:57 [2021-03-13T22:38:57.897Z] [INFO] 
17:38:57 [2021-03-13T22:38:57.897Z] [INFO] --- maven-clean-plugin:2.5:clean (default-clean) @ org.eclipse.ease.lang.unittest.test ---
17:38:57 [2021-03-13T22:38:57.897Z] [INFO] 
17:38:57 [2021-03-13T22:38:57.897Z] [INFO] --- tycho-packaging-plugin:2.2.0:build-qualifier (default-build-qualifier) @ org.eclipse.ease.lang.unittest.test ---
17:38:57 [2021-03-13T22:38:57.897Z] [INFO] The project's OSGi version is 0.8.0.I202103030731
17:38:57 [2021-03-13T22:38:57.897Z] [INFO] 
17:38:57 [2021-03-13T22:38:57.897Z] [INFO] --- tycho-packaging-plugin:2.2.0:validate-id (default-validate-id) @ org.eclipse.ease.lang.unittest.test ---
17:38:57 [2021-03-13T22:38:57.897Z] [INFO] 
17:38:57 [2021-03-13T22:38:57.897Z] [INFO] --- tycho-packaging-plugin:2.2.0:validate-version (default-validate-version) @ org.eclipse.ease.lang.unittest.test ---
17:38:57 [2021-03-13T22:38:57.897Z] [INFO] 
17:38:57 [2021-03-13T22:38:57.897Z] [INFO] --- maven-resources-plugin:2.4.3:resources (default-resources) @ org.eclipse.ease.lang.unittest.test ---
17:38:57 [2021-03-13T22:38:57.897Z] [INFO] Using 'UTF-8' encoding to copy filtered resources.
17:38:57 [2021-03-13T22:38:57.897Z] [INFO] skip non existing resourceDirectory /home/jenkins/agent/workspace/ease.verify.core.target.2019-03/tests/org.eclipse.ease.lang.unittest.test/src/main/resources
17:38:57 [2021-03-13T22:38:57.897Z] [INFO] 
17:38:57 [2021-03-13T22:38:57.897Z] [INFO] --- tycho-compiler-plugin:2.2.0:compile (default-compile) @ org.eclipse.ease.lang.unittest.test ---
17:38:57 [2021-03-13T22:38:57.897Z] [INFO] Compiling 3 source files to /home/jenkins/agent/workspace/ease.verify.core.target.2019-03/tests/org.eclipse.ease.lang.unittest.test/target/classes
17:38:58 [2021-03-13T22:38:58.153Z] [INFO] 
17:38:58 [2021-03-13T22:38:58.153Z] [INFO] --- maven-resources-plugin:2.4.3:testResources (default-testResources) @ org.eclipse.ease.lang.unittest.test ---
17:38:58 [2021-03-13T22:38:58.153Z] [INFO] Using 'UTF-8' encoding to copy filtered resources.
17:38:58 [2021-03-13T22:38:58.153Z] [INFO] skip non existing resourceDirectory /home/jenkins/agent/workspace/ease.verify.core.target.2019-03/tests/org.eclipse.ease.lang.unittest.test/src/test/resources
17:38:58 [2021-03-13T22:38:58.153Z] [INFO] 
17:38:58 [2021-03-13T22:38:58.153Z] [INFO] --- target-platform-configuration:2.2.0:target-platform (default-target-platform) @ org.eclipse.ease.lang.unittest.test ---
17:38:58 [2021-03-13T22:38:58.153Z] [INFO] 
17:38:58 [2021-03-13T22:38:58.153Z] [INFO] --- tycho-packaging-plugin:2.2.0:package-plugin (default-package-plugin) @ org.eclipse.ease.lang.unittest.test ---
17:38:58 [2021-03-13T22:38:58.153Z] [INFO] Building jar: /home/jenkins/agent/workspace/ease.verify.core.target.2019-03/tests/org.eclipse.ease.lang.unittest.test/target/org.eclipse.ease.lang.unittest.test-0.8.0-SNAPSHOT.jar
17:38:58 [2021-03-13T22:38:58.153Z] [INFO] 
17:38:58 [2021-03-13T22:38:58.153Z] [INFO] --- tycho-p2-plugin:2.2.0:p2-metadata-default (default-p2-metadata-default) @ org.eclipse.ease.lang.unittest.test ---
17:38:58 [2021-03-13T22:38:58.153Z] [INFO] 
17:38:58 [2021-03-13T22:38:58.153Z] [INFO] --- tycho-surefire-plugin:2.2.0:test (default-test) @ org.eclipse.ease.lang.unittest.test ---
17:38:58 [2021-03-13T22:38:58.153Z] [INFO] Executing Test Runtime with timeout 0, logs (if any) will be placed at: /home/jenkins/agent/workspace/ease.verify.core.target.2019-03/tests/org.eclipse.ease.lang.unittest.test/target/work/data/.metadata/.log
17:38:58 [2021-03-13T22:38:58.153Z] [INFO] Command line:
17:38:58 [2021-03-13T22:38:58.154Z] 	[/opt/tools/java/openjdk/jdk-15/15.0.2+7/bin/java, -Dosgi.noShutdown=false, -Dosgi.os=linux, -Dosgi.ws=gtk, -Dosgi.arch=x86_64, -Dosgi.clean=true, -jar, /home/jenkins/.m2/repository/p2/osgi/bundle/org.eclipse.equinox.launcher/1.5.800.v20200727-1323/org.eclipse.equinox.launcher-1.5.800.v20200727-1323.jar, -data, /home/jenkins/agent/workspace/ease.verify.core.target.2019-03/tests/org.eclipse.ease.lang.unittest.test/target/work/data, -install, /home/jenkins/agent/workspace/ease.verify.core.target.2019-03/tests/org.eclipse.ease.lang.unittest.test/target/work, -configuration, /home/jenkins/agent/workspace/ease.verify.core.target.2019-03/tests/org.eclipse.ease.lang.unittest.test/target/work/configuration, -application, org.eclipse.tycho.surefire.osgibooter.headlesstest, -testproperties, /home/jenkins/agent/workspace/ease.verify.core.target.2019-03/tests/org.eclipse.ease.lang.unittest.test/target/surefire.properties]
17:38:58 [2021-03-13T22:38:58.154Z] Picked up JAVA_TOOL_OPTIONS: -Dmaven.ext.class.path="/home/jenkins/agent/workspace/ease.verify.core.target.2019-03@tmp/withMaven7a46d5a8/pipeline-maven-spy.jar" -Dorg.jenkinsci.plugins.pipeline.maven.reportsFolder="/home/jenkins/agent/workspace/ease.verify.core.target.2019-03@tmp/withMaven7a46d5a8" 
17:39:00 [2021-03-13T22:39:00.067Z] Mar 13, 2021 10:38:59 PM org.junit.platform.launcher.core.DefaultLauncher handleThrowable
17:39:00 [2021-03-13T22:39:00.067Z] WARNING: TestEngine with ID 'junit-vintage' failed to discover tests
17:39:00 [2021-03-13T22:39:00.067Z] java.lang.NoClassDefFoundError: org/junit/runners/model/RunnerBuilder
17:39:00 [2021-03-13T22:39:00.067Z] 	at org.junit.vintage.engine.discovery.VintageDiscoverer.<init>(VintageDiscoverer.java:48)
17:39:00 [2021-03-13T22:39:00.067Z] 	at org.junit.vintage.engine.VintageTestEngine.discover(VintageTestEngine.java:65)
17:39:00 [2021-03-13T22:39:00.067Z] 	at org.junit.platform.launcher.core.DefaultLauncher.discoverEngineRoot(DefaultLauncher.java:130)
17:39:00 [2021-03-13T22:39:00.067Z] 	at org.junit.platform.launcher.core.DefaultLauncher.discoverRoot(DefaultLauncher.java:117)
17:39:00 [2021-03-13T22:39:00.067Z] 	at org.junit.platform.launcher.core.DefaultLauncher.discover(DefaultLauncher.java:82)
17:39:00 [2021-03-13T22:39:00.067Z] 	at org.apache.maven.surefire.junitplatform.TestPlanScannerFilter.accept(TestPlanScannerFilter.java:56)
17:39:00 [2021-03-13T22:39:00.067Z] 	at org.apache.maven.surefire.util.DefaultScanResult.applyFilter(DefaultScanResult.java:102)
17:39:00 [2021-03-13T22:39:00.067Z] 	at org.apache.maven.surefire.junitplatform.JUnitPlatformProvider.scanClasspath(JUnitPlatformProvider.java:143)
17:39:00 [2021-03-13T22:39:00.067Z] 	at org.apache.maven.surefire.junitplatform.JUnitPlatformProvider.invoke(JUnitPlatformProvider.java:124)
17:39:00 [2021-03-13T22:39:00.067Z] 	at java.base/jdk.internal.reflect.NativeMethodAccessorImpl.invoke0(Native Method)
17:39:00 [2021-03-13T22:39:00.067Z] 	at java.base/jdk.internal.reflect.NativeMethodAccessorImpl.invoke(NativeMethodAccessorImpl.java:64)
17:39:00 [2021-03-13T22:39:00.067Z] 	at java.base/jdk.internal.reflect.DelegatingMethodAccessorImpl.invoke(DelegatingMethodAccessorImpl.java:43)
17:39:00 [2021-03-13T22:39:00.067Z] 	at java.base/java.lang.reflect.Method.invoke(Method.java:564)
17:39:00 [2021-03-13T22:39:00.067Z] 	at org.apache.maven.surefire.util.ReflectionUtils.invokeMethodWithArray2(ReflectionUtils.java:206)
17:39:00 [2021-03-13T22:39:00.067Z] 	at org.apache.maven.surefire.booter.ProviderFactory$ProviderProxy.invoke(ProviderFactory.java:161)
17:39:00 [2021-03-13T22:39:00.067Z] 	at org.apache.maven.surefire.booter.ProviderFactory.invokeProvider(ProviderFactory.java:84)
17:39:00 [2021-03-13T22:39:00.067Z] 	at org.eclipse.tycho.surefire.osgibooter.OsgiSurefireBooter.run(OsgiSurefireBooter.java:116)
17:39:00 [2021-03-13T22:39:00.067Z] 	at org.eclipse.tycho.surefire.osgibooter.HeadlessTestApplication.start(HeadlessTestApplication.java:23)
17:39:00 [2021-03-13T22:39:00.067Z] 	at org.eclipse.equinox.internal.app.EclipseAppHandle.run(EclipseAppHandle.java:203)
17:39:00 [2021-03-13T22:39:00.067Z] 	at org.eclipse.core.runtime.internal.adaptor.EclipseAppLauncher.runApplication(EclipseAppLauncher.java:134)
17:39:00 [2021-03-13T22:39:00.067Z] 	at org.eclipse.core.runtime.internal.adaptor.EclipseAppLauncher.start(EclipseAppLauncher.java:104)
17:39:00 [2021-03-13T22:39:00.067Z] 	at org.eclipse.core.runtime.adaptor.EclipseStarter.run(EclipseStarter.java:401)
17:39:00 [2021-03-13T22:39:00.067Z] 	at org.eclipse.core.runtime.adaptor.EclipseStarter.run(EclipseStarter.java:255)
17:39:00 [2021-03-13T22:39:00.067Z] 	at java.base/jdk.internal.reflect.NativeMethodAccessorImpl.invoke0(Native Method)
17:39:00 [2021-03-13T22:39:00.067Z] 	at java.base/jdk.internal.reflect.NativeMethodAccessorImpl.invoke(NativeMethodAccessorImpl.java:64)
17:39:00 [2021-03-13T22:39:00.067Z] 	at java.base/jdk.internal.reflect.DelegatingMethodAccessorImpl.invoke(DelegatingMethodAccessorImpl.java:43)
17:39:00 [2021-03-13T22:39:00.067Z] 	at java.base/java.lang.reflect.Method.invoke(Method.java:564)
17:39:00 [2021-03-13T22:39:00.067Z] 	at org.eclipse.equinox.launcher.Main.invokeFramework(Main.java:657)
17:39:00 [2021-03-13T22:39:00.067Z] 	at org.eclipse.equinox.launcher.Main.basicRun(Main.java:594)
17:39:00 [2021-03-13T22:39:00.067Z] 	at org.eclipse.equinox.launcher.Main.run(Main.java:1465)
17:39:00 [2021-03-13T22:39:00.067Z] 	at org.eclipse.equinox.launcher.Main.main(Main.java:1438)
17:39:00 [2021-03-13T22:39:00.067Z] Caused by: java.lang.ClassNotFoundException: org.junit.runners.model.RunnerBuilder cannot be found by org.eclipse.tycho.surefire.osgibooter_2.2.0
17:39:00 [2021-03-13T22:39:00.067Z] 	at org.eclipse.osgi.internal.loader.BundleLoader.findClass(BundleLoader.java:516)
17:39:00 [2021-03-13T22:39:00.067Z] 	at org.eclipse.osgi.internal.loader.ModuleClassLoader.loadClass(ModuleClassLoader.java:171)
17:39:00 [2021-03-13T22:39:00.067Z] 	at java.base/java.lang.ClassLoader.loadClass(ClassLoader.java:522)
17:39:00 [2021-03-13T22:39:00.067Z] 	... 31 more
17:39:00 [2021-03-13T22:39:00.067Z] 
17:39:00 [2021-03-13T22:39:00.067Z] Mar 13, 2021 10:38:59 PM org.junit.platform.launcher.core.DefaultLauncher handleThrowable
17:39:00 [2021-03-13T22:39:00.067Z] WARNING: TestEngine with ID 'junit-vintage' failed to discover tests
17:39:00 [2021-03-13T22:39:00.067Z] java.lang.NoClassDefFoundError: org/junit/runners/model/RunnerBuilder
17:39:00 [2021-03-13T22:39:00.067Z] 	at org.junit.vintage.engine.discovery.VintageDiscoverer.<init>(VintageDiscoverer.java:48)
17:39:00 [2021-03-13T22:39:00.067Z] 	at org.junit.vintage.engine.VintageTestEngine.discover(VintageTestEngine.java:65)
17:39:00 [2021-03-13T22:39:00.067Z] 	at org.junit.platform.launcher.core.DefaultLauncher.discoverEngineRoot(DefaultLauncher.java:130)
17:39:00 [2021-03-13T22:39:00.067Z] 	at org.junit.platform.launcher.core.DefaultLauncher.discoverRoot(DefaultLauncher.java:117)
17:39:00 [2021-03-13T22:39:00.067Z] 	at org.junit.platform.launcher.core.DefaultLauncher.discover(DefaultLauncher.java:82)
17:39:00 [2021-03-13T22:39:00.067Z] 	at org.apache.maven.surefire.junitplatform.TestPlanScannerFilter.accept(TestPlanScannerFilter.java:56)
17:39:00 [2021-03-13T22:39:00.067Z] 	at org.apache.maven.surefire.util.DefaultScanResult.applyFilter(DefaultScanResult.java:102)
17:39:00 [2021-03-13T22:39:00.067Z] 	at org.apache.maven.surefire.junitplatform.JUnitPlatformProvider.scanClasspath(JUnitPlatformProvider.java:143)
17:39:00 [2021-03-13T22:39:00.067Z] 	at org.apache.maven.surefire.junitplatform.JUnitPlatformProvider.invoke(JUnitPlatformProvider.java:124)
17:39:00 [2021-03-13T22:39:00.067Z] 	at java.base/jdk.internal.reflect.NativeMethodAccessorImpl.invoke0(Native Method)
17:39:00 [2021-03-13T22:39:00.067Z] 	at java.base/jdk.internal.reflect.NativeMethodAccessorImpl.invoke(NativeMethodAccessorImpl.java:64)
17:39:00 [2021-03-13T22:39:00.067Z] 	at java.base/jdk.internal.reflect.DelegatingMethodAccessorImpl.invoke(DelegatingMethodAccessorImpl.java:43)
17:39:00 [2021-03-13T22:39:00.067Z] 	at java.base/java.lang.reflect.Method.invoke(Method.java:564)
17:39:00 [2021-03-13T22:39:00.067Z] 	at org.apache.maven.surefire.util.ReflectionUtils.invokeMethodWithArray2(ReflectionUtils.java:206)
17:39:00 [2021-03-13T22:39:00.067Z] 	at org.apache.maven.surefire.booter.ProviderFactory$ProviderProxy.invoke(ProviderFactory.java:161)
17:39:00 [2021-03-13T22:39:00.067Z] 	at org.apache.maven.surefire.booter.ProviderFactory.invokeProvider(ProviderFactory.java:84)
17:39:00 [2021-03-13T22:39:00.067Z] 	at org.eclipse.tycho.surefire.osgibooter.OsgiSurefireBooter.run(OsgiSurefireBooter.java:116)
17:39:00 [2021-03-13T22:39:00.067Z] 	at org.eclipse.tycho.surefire.osgibooter.HeadlessTestApplication.start(HeadlessTestApplication.java:23)
17:39:00 [2021-03-13T22:39:00.067Z] 	at org.eclipse.equinox.internal.app.EclipseAppHandle.run(EclipseAppHandle.java:203)
17:39:00 [2021-03-13T22:39:00.067Z] 	at org.eclipse.core.runtime.internal.adaptor.EclipseAppLauncher.runApplication(EclipseAppLauncher.java:134)
17:39:00 [2021-03-13T22:39:00.067Z] 	at org.eclipse.core.runtime.internal.adaptor.EclipseAppLauncher.start(EclipseAppLauncher.java:104)
17:39:00 [2021-03-13T22:39:00.068Z] 	at org.eclipse.core.runtime.adaptor.EclipseStarter.run(EclipseStarter.java:401)
17:39:00 [2021-03-13T22:39:00.068Z] 	at org.eclipse.core.runtime.adaptor.EclipseStarter.run(EclipseStarter.java:255)
17:39:00 [2021-03-13T22:39:00.068Z] 	at java.base/jdk.internal.reflect.NativeMethodAccessorImpl.invoke0(Native Method)
17:39:00 [2021-03-13T22:39:00.068Z] 	at java.base/jdk.internal.reflect.NativeMethodAccessorImpl.invoke(NativeMethodAccessorImpl.java:64)
17:39:00 [2021-03-13T22:39:00.068Z] 	at java.base/jdk.internal.reflect.DelegatingMethodAccessorImpl.invoke(DelegatingMethodAccessorImpl.java:43)
17:39:00 [2021-03-13T22:39:00.068Z] 	at java.base/java.lang.reflect.Method.invoke(Method.java:564)
17:39:00 [2021-03-13T22:39:00.068Z] 	at org.eclipse.equinox.launcher.Main.invokeFramework(Main.java:657)
17:39:00 [2021-03-13T22:39:00.068Z] 	at org.eclipse.equinox.launcher.Main.basicRun(Main.java:594)
17:39:00 [2021-03-13T22:39:00.068Z] 	at org.eclipse.equinox.launcher.Main.run(Main.java:1465)
17:39:00 [2021-03-13T22:39:00.068Z] 	at org.eclipse.equinox.launcher.Main.main(Main.java:1438)
17:39:00 [2021-03-13T22:39:00.068Z] Caused by: java.lang.ClassNotFoundException: org.junit.runners.model.RunnerBuilder cannot be found by org.eclipse.tycho.surefire.osgibooter_2.2.0
17:39:00 [2021-03-13T22:39:00.068Z] 	at org.eclipse.osgi.internal.loader.BundleLoader.findClass(BundleLoader.java:516)
17:39:00 [2021-03-13T22:39:00.068Z] 	at org.eclipse.osgi.internal.loader.ModuleClassLoader.loadClass(ModuleClassLoader.java:171)
17:39:00 [2021-03-13T22:39:00.068Z] 	at java.base/java.lang.ClassLoader.loadClass(ClassLoader.java:522)
17:39:00 [2021-03-13T22:39:00.068Z] 	... 31 more
17:39:00 [2021-03-13T22:39:00.068Z] 
17:39:00 [2021-03-13T22:39:00.068Z] Mar 13, 2021 10:38:59 PM org.junit.platform.launcher.core.DefaultLauncher handleThrowable
17:39:00 [2021-03-13T22:39:00.068Z] WARNING: TestEngine with ID 'junit-vintage' failed to discover tests
17:39:00 [2021-03-13T22:39:00.068Z] java.lang.NoClassDefFoundError: org/junit/runners/model/RunnerBuilder
17:39:00 [2021-03-13T22:39:00.068Z] 	at org.junit.vintage.engine.discovery.VintageDiscoverer.<init>(VintageDiscoverer.java:48)
17:39:00 [2021-03-13T22:39:00.068Z] 	at org.junit.vintage.engine.VintageTestEngine.discover(VintageTestEngine.java:65)
17:39:00 [2021-03-13T22:39:00.068Z] 	at org.junit.platform.launcher.core.DefaultLauncher.discoverEngineRoot(DefaultLauncher.java:130)
17:39:00 [2021-03-13T22:39:00.068Z] 	at org.junit.platform.launcher.core.DefaultLauncher.discoverRoot(DefaultLauncher.java:117)
17:39:00 [2021-03-13T22:39:00.068Z] 	at org.junit.platform.launcher.core.DefaultLauncher.discover(DefaultLauncher.java:82)
17:39:00 [2021-03-13T22:39:00.068Z] 	at org.apache.maven.surefire.junitplatform.TestPlanScannerFilter.accept(TestPlanScannerFilter.java:56)
17:39:00 [2021-03-13T22:39:00.068Z] 	at org.apache.maven.surefire.util.DefaultScanResult.applyFilter(DefaultScanResult.java:102)
17:39:00 [2021-03-13T22:39:00.068Z] 	at org.apache.maven.surefire.junitplatform.JUnitPlatformProvider.scanClasspath(JUnitPlatformProvider.java:143)
17:39:00 [2021-03-13T22:39:00.068Z] 	at org.apache.maven.surefire.junitplatform.JUnitPlatformProvider.invoke(JUnitPlatformProvider.java:124)
17:39:00 [2021-03-13T22:39:00.068Z] 	at java.base/jdk.internal.reflect.NativeMethodAccessorImpl.invoke0(Native Method)
17:39:00 [2021-03-13T22:39:00.068Z] 	at java.base/jdk.internal.reflect.NativeMethodAccessorImpl.invoke(NativeMethodAccessorImpl.java:64)
17:39:00 [2021-03-13T22:39:00.068Z] 	at java.base/jdk.internal.reflect.DelegatingMethodAccessorImpl.invoke(DelegatingMethodAccessorImpl.java:43)
17:39:00 [2021-03-13T22:39:00.068Z] 	at java.base/java.lang.reflect.Method.invoke(Method.java:564)
17:39:00 [2021-03-13T22:39:00.068Z] 	at org.apache.maven.surefire.util.ReflectionUtils.invokeMethodWithArray2(ReflectionUtils.java:206)
17:39:00 [2021-03-13T22:39:00.068Z] 	at org.apache.maven.surefire.booter.ProviderFactory$ProviderProxy.invoke(ProviderFactory.java:161)
17:39:00 [2021-03-13T22:39:00.068Z] 	at org.apache.maven.surefire.booter.ProviderFactory.invokeProvider(ProviderFactory.java:84)
17:39:00 [2021-03-13T22:39:00.068Z] 	at org.eclipse.tycho.surefire.osgibooter.OsgiSurefireBooter.run(OsgiSurefireBooter.java:116)
17:39:00 [2021-03-13T22:39:00.068Z] 	at org.eclipse.tycho.surefire.osgibooter.HeadlessTestApplication.start(HeadlessTestApplication.java:23)
17:39:00 [2021-03-13T22:39:00.068Z] 	at org.eclipse.equinox.internal.app.EclipseAppHandle.run(EclipseAppHandle.java:203)
17:39:00 [2021-03-13T22:39:00.068Z] 	at org.eclipse.core.runtime.internal.adaptor.EclipseAppLauncher.runApplication(EclipseAppLauncher.java:134)
17:39:00 [2021-03-13T22:39:00.068Z] 	at org.eclipse.core.runtime.internal.adaptor.EclipseAppLauncher.start(EclipseAppLauncher.java:104)
17:39:00 [2021-03-13T22:39:00.068Z] 	at org.eclipse.core.runtime.adaptor.EclipseStarter.run(EclipseStarter.java:401)
17:39:00 [2021-03-13T22:39:00.068Z] 	at org.eclipse.core.runtime.adaptor.EclipseStarter.run(EclipseStarter.java:255)
17:39:00 [2021-03-13T22:39:00.068Z] 	at java.base/jdk.internal.reflect.NativeMethodAccessorImpl.invoke0(Native Method)
17:39:00 [2021-03-13T22:39:00.068Z] 	at java.base/jdk.internal.reflect.NativeMethodAccessorImpl.invoke(NativeMethodAccessorImpl.java:64)
17:39:00 [2021-03-13T22:39:00.068Z] 	at java.base/jdk.internal.reflect.DelegatingMethodAccessorImpl.invoke(DelegatingMethodAccessorImpl.java:43)
17:39:00 [2021-03-13T22:39:00.068Z] 	at java.base/java.lang.reflect.Method.invoke(Method.java:564)
17:39:00 [2021-03-13T22:39:00.068Z] 	at org.eclipse.equinox.launcher.Main.invokeFramework(Main.java:657)
17:39:00 [2021-03-13T22:39:00.068Z] 	at org.eclipse.equinox.launcher.Main.basicRun(Main.java:594)
17:39:00 [2021-03-13T22:39:00.068Z] 	at org.eclipse.equinox.launcher.Main.run(Main.java:1465)
17:39:00 [2021-03-13T22:39:00.068Z] 	at org.eclipse.equinox.launcher.Main.main(Main.java:1438)
17:39:00 [2021-03-13T22:39:00.068Z] Caused by: java.lang.ClassNotFoundException: org.junit.runners.model.RunnerBuilder cannot be found by org.eclipse.tycho.surefire.osgibooter_2.2.0
17:39:00 [2021-03-13T22:39:00.068Z] 	at org.eclipse.osgi.internal.loader.BundleLoader.findClass(BundleLoader.java:516)
17:39:00 [2021-03-13T22:39:00.068Z] 	at org.eclipse.osgi.internal.loader.ModuleClassLoader.loadClass(ModuleClassLoader.java:171)
17:39:00 [2021-03-13T22:39:00.068Z] 	at java.base/java.lang.ClassLoader.loadClass(ClassLoader.java:522)
17:39:00 [2021-03-13T22:39:00.068Z] 	... 31 more
17:39:00 [2021-03-13T22:39:00.068Z] 
17:39:00 [2021-03-13T22:39:00.068Z] Mar 13, 2021 10:38:59 PM org.junit.platform.launcher.core.DefaultLauncher handleThrowable
17:39:00 [2021-03-13T22:39:00.068Z] WARNING: TestEngine with ID 'junit-vintage' failed to discover tests
17:39:00 [2021-03-13T22:39:00.068Z] java.lang.NoClassDefFoundError: org/junit/runners/model/RunnerBuilder
17:39:00 [2021-03-13T22:39:00.068Z] 	at org.junit.vintage.engine.discovery.VintageDiscoverer.<init>(VintageDiscoverer.java:48)
17:39:00 [2021-03-13T22:39:00.068Z] 	at org.junit.vintage.engine.VintageTestEngine.discover(VintageTestEngine.java:65)
17:39:00 [2021-03-13T22:39:00.068Z] 	at org.junit.platform.launcher.core.DefaultLauncher.discoverEngineRoot(DefaultLauncher.java:130)
17:39:00 [2021-03-13T22:39:00.068Z] 	at org.junit.platform.launcher.core.DefaultLauncher.discoverRoot(DefaultLauncher.java:117)
17:39:00 [2021-03-13T22:39:00.068Z] 	at org.junit.platform.launcher.core.DefaultLauncher.execute(DefaultLauncher.java:90)
17:39:00 [2021-03-13T22:39:00.068Z] 	at org.apache.maven.surefire.junitplatform.JUnitPlatformProvider.invokeAllTests(JUnitPlatformProvider.java:150)
17:39:00 [2021-03-13T22:39:00.068Z] 	at org.apache.maven.surefire.junitplatform.JUnitPlatformProvider.invoke(JUnitPlatformProvider.java:124)
17:39:00 [2021-03-13T22:39:00.068Z] 	at java.base/jdk.internal.reflect.NativeMethodAccessorImpl.invoke0(Native Method)
17:39:00 [2021-03-13T22:39:00.068Z] 	at java.base/jdk.internal.reflect.NativeMethodAccessorImpl.invoke(NativeMethodAccessorImpl.java:64)
17:39:00 [2021-03-13T22:39:00.068Z] 	at java.base/jdk.internal.reflect.DelegatingMethodAccessorImpl.invoke(DelegatingMethodAccessorImpl.java:43)
17:39:00 [2021-03-13T22:39:00.068Z] 	at java.base/java.lang.reflect.Method.invoke(Method.java:564)
17:39:00 [2021-03-13T22:39:00.068Z] 	at org.apache.maven.surefire.util.ReflectionUtils.invokeMethodWithArray2(ReflectionUtils.java:206)
17:39:00 [2021-03-13T22:39:00.068Z] 	at org.apache.maven.surefire.booter.ProviderFactory$ProviderProxy.invoke(ProviderFactory.java:161)
17:39:00 [2021-03-13T22:39:00.068Z] 	at org.apache.maven.surefire.booter.ProviderFactory.invokeProvider(ProviderFactory.java:84)
17:39:00 [2021-03-13T22:39:00.068Z] 	at org.eclipse.tycho.surefire.osgibooter.OsgiSurefireBooter.run(OsgiSurefireBooter.java:116)
17:39:00 [2021-03-13T22:39:00.068Z] 	at org.eclipse.tycho.surefire.osgibooter.HeadlessTestApplication.start(HeadlessTestApplication.java:23)
17:39:00 [2021-03-13T22:39:00.068Z] 	at org.eclipse.equinox.internal.app.EclipseAppHandle.run(EclipseAppHandle.java:203)
17:39:00 [2021-03-13T22:39:00.068Z] 	at org.eclipse.core.runtime.internal.adaptor.EclipseAppLauncher.runApplication(EclipseAppLauncher.java:134)
17:39:00 [2021-03-13T22:39:00.068Z] 	at org.eclipse.core.runtime.internal.adaptor.EclipseAppLauncher.start(EclipseAppLauncher.java:104)
17:39:00 [2021-03-13T22:39:00.068Z] 	at org.eclipse.core.runtime.adaptor.EclipseStarter.run(EclipseStarter.java:401)
17:39:00 [2021-03-13T22:39:00.068Z] 	at org.eclipse.core.runtime.adaptor.EclipseStarter.run(EclipseStarter.java:255)
17:39:00 [2021-03-13T22:39:00.068Z] 	at java.base/jdk.internal.reflect.NativeMethodAccessorImpl.invoke0(Native Method)
17:39:00 [2021-03-13T22:39:00.068Z] 	at java.base/jdk.internal.reflect.NativeMethodAccessorImpl.invoke(NativeMethodAccessorImpl.java:64)
17:39:00 [2021-03-13T22:39:00.069Z] 	at java.base/jdk.internal.reflect.DelegatingMethodAccessorImpl.invoke(DelegatingMethodAccessorImpl.java:43)
17:39:00 [2021-03-13T22:39:00.069Z] 	at java.base/java.lang.reflect.Method.invoke(Method.java:564)
17:39:00 [2021-03-13T22:39:00.069Z] 	at org.eclipse.equinox.launcher.Main.invokeFramework(Main.java:657)
17:39:00 [2021-03-13T22:39:00.069Z] 	at org.eclipse.equinox.launcher.Main.basicRun(Main.java:594)
17:39:00 [2021-03-13T22:39:00.069Z] 	at org.eclipse.equinox.launcher.Main.run(Main.java:1465)
17:39:00 [2021-03-13T22:39:00.069Z] 	at org.eclipse.equinox.launcher.Main.main(Main.java:1438)
17:39:00 [2021-03-13T22:39:00.069Z] Caused by: java.lang.ClassNotFoundException: org.junit.runners.model.RunnerBuilder cannot be found by org.eclipse.tycho.surefire.osgibooter_2.2.0
17:39:00 [2021-03-13T22:39:00.069Z] 	at org.eclipse.osgi.internal.loader.BundleLoader.findClass(BundleLoader.java:516)
17:39:00 [2021-03-13T22:39:00.069Z] 	at org.eclipse.osgi.internal.loader.ModuleClassLoader.loadClass(ModuleClassLoader.java:171)
17:39:00 [2021-03-13T22:39:00.069Z] 	at java.base/java.lang.ClassLoader.loadClass(ClassLoader.java:522)
17:39:00 [2021-03-13T22:39:00.069Z] 	... 29 more
17:39:00 [2021-03-13T22:39:00.069Z] 
17:39:00 [2021-03-13T22:39:00.069Z] Running org.eclipse.ease.lang.unittest.ClassicJavaScriptTest
17:39:01 [2021-03-13T22:39:01.440Z] Tests run: 7, Failures: 0, Errors: 0, Skipped: 0, Time elapsed: 1.505 s - in org.eclipse.ease.lang.unittest.ClassicJavaScriptTest
17:39:01 [2021-03-13T22:39:01.440Z] folderStatus  Time elapsed: 0.702 s
17:39:01 [2021-03-13T22:39:01.440Z] errorTestStatus  Time elapsed: 0.15 s
17:39:01 [2021-03-13T22:39:01.440Z] failureTestStatus  Time elapsed: 0.157 s
17:39:01 [2021-03-13T22:39:01.440Z] verifyOutput  Time elapsed: 0.121 s
17:39:01 [2021-03-13T22:39:01.440Z] suiteStatus  Time elapsed: 0.118 s
17:39:01 [2021-03-13T22:39:01.440Z] ignoreTestStatus  Time elapsed: 0.099 s
17:39:01 [2021-03-13T22:39:01.440Z] passTestStatus  Time elapsed: 0.095 s
17:39:01 [2021-03-13T22:39:01.440Z] Running org.eclipse.ease.lang.unittest.ModernJavaScriptTest
17:39:02 [2021-03-13T22:39:02.373Z] Tests run: 8, Failures: 0, Errors: 0, Skipped: 0, Time elapsed: 0.763 s - in org.eclipse.ease.lang.unittest.ModernJavaScriptTest
17:39:02 [2021-03-13T22:39:02.373Z] folderStatus  Time elapsed: 0.153 s
17:39:02 [2021-03-13T22:39:02.373Z] verifyOutput  Time elapsed: 0.099 s
17:39:02 [2021-03-13T22:39:02.373Z] suiteStatus  Time elapsed: 0.094 s
17:39:02 [2021-03-13T22:39:02.373Z] ignoreTestStatus  Time elapsed: 0.093 s
17:39:02 [2021-03-13T22:39:02.373Z] ignoreTestClassStatus  Time elapsed: 0.064 s
17:39:02 [2021-03-13T22:39:02.373Z] failureTestClassStatus  Time elapsed: 0.089 s
17:39:02 [2021-03-13T22:39:02.373Z] errorTestClassStatus  Time elapsed: 0.087 s
17:39:02 [2021-03-13T22:39:02.373Z] passTestClassStatus  Time elapsed: 0.08 s
17:39:02 [2021-03-13T22:39:02.373Z] 
17:39:02 [2021-03-13T22:39:02.373Z] Results:
17:39:02 [2021-03-13T22:39:02.373Z] 
17:39:02 [2021-03-13T22:39:02.374Z] Tests run: 15, Failures: 0, Errors: 0, Skipped: 0
17:39:02 [2021-03-13T22:39:02.374Z] 
17:39:02 [2021-03-13T22:39:02.934Z] [INFO] All tests passed!
17:39:02 [2021-03-13T22:39:02.934Z] [INFO] 
17:39:02 [2021-03-13T22:39:02.934Z] [INFO] --- maven-install-plugin:2.3.1:install (default-install) @ org.eclipse.ease.lang.unittest.test ---
17:39:02 [2021-03-13T22:39:02.934Z] [INFO] Installing /home/jenkins/agent/workspace/ease.verify.core.target.2019-03/tests/org.eclipse.ease.lang.unittest.test/target/org.eclipse.ease.lang.unittest.test-0.8.0-SNAPSHOT.jar to /home/jenkins/.m2/repository/org/eclipse/ease/org.eclipse.ease.lang.unittest.test/0.8.0-SNAPSHOT/org.eclipse.ease.lang.unittest.test-0.8.0-SNAPSHOT.jar
17:39:02 [2021-03-13T22:39:02.935Z] [INFO] Installing /home/jenkins/agent/workspace/ease.verify.core.target.2019-03/tests/org.eclipse.ease.lang.unittest.test/pom.xml to /home/jenkins/.m2/repository/org/eclipse/ease/org.eclipse.ease.lang.unittest.test/0.8.0-SNAPSHOT/org.eclipse.ease.lang.unittest.test-0.8.0-SNAPSHOT.pom
17:39:02 [2021-03-13T22:39:02.935Z] [INFO] Installing /home/jenkins/agent/workspace/ease.verify.core.target.2019-03/tests/org.eclipse.ease.lang.unittest.test/target/p2content.xml to /home/jenkins/.m2/repository/org/eclipse/ease/org.eclipse.ease.lang.unittest.test/0.8.0-SNAPSHOT/org.eclipse.ease.lang.unittest.test-0.8.0-SNAPSHOT-p2metadata.xml
17:39:02 [2021-03-13T22:39:02.935Z] [INFO] Installing /home/jenkins/agent/workspace/ease.verify.core.target.2019-03/tests/org.eclipse.ease.lang.unittest.test/target/p2artifacts.xml to /home/jenkins/.m2/repository/org/eclipse/ease/org.eclipse.ease.lang.unittest.test/0.8.0-SNAPSHOT/org.eclipse.ease.lang.unittest.test-0.8.0-SNAPSHOT-p2artifacts.xml
17:39:02 [2021-03-13T22:39:02.935Z] [INFO] 
17:39:02 [2021-03-13T22:39:02.935Z] [INFO] --- tycho-p2-plugin:2.2.0:update-local-index (default-update-local-index) @ org.eclipse.ease.lang.unittest.test ---
17:39:02 [2021-03-13T22:39:02.935Z] [INFO] 
17:39:02 [2021-03-13T22:39:02.935Z] [INFO] ---------< org.eclipse.ease:org.eclipse.ease.ui.scripts.test >----------
17:39:02 [2021-03-13T22:39:02.935Z] [INFO] Building org.eclipse.ease.ui.scripts.test 0.8.0-SNAPSHOT         [45/48]
17:39:02 [2021-03-13T22:39:02.935Z] [INFO] ------------------------[ eclipse-test-plugin ]-------------------------
17:39:02 [2021-03-13T22:39:02.935Z] [INFO] 
17:39:02 [2021-03-13T22:39:02.935Z] [INFO] --- maven-clean-plugin:2.5:clean (default-clean) @ org.eclipse.ease.ui.scripts.test ---
17:39:02 [2021-03-13T22:39:02.935Z] [INFO] 
17:39:02 [2021-03-13T22:39:02.935Z] [INFO] --- tycho-packaging-plugin:2.2.0:build-qualifier (default-build-qualifier) @ org.eclipse.ease.ui.scripts.test ---
17:39:02 [2021-03-13T22:39:02.935Z] [INFO] The project's OSGi version is 0.8.0.I202103030731
17:39:02 [2021-03-13T22:39:02.935Z] [INFO] 
17:39:02 [2021-03-13T22:39:02.935Z] [INFO] --- tycho-packaging-plugin:2.2.0:validate-id (default-validate-id) @ org.eclipse.ease.ui.scripts.test ---
17:39:02 [2021-03-13T22:39:02.935Z] [INFO] 
17:39:02 [2021-03-13T22:39:02.935Z] [INFO] --- tycho-packaging-plugin:2.2.0:validate-version (default-validate-version) @ org.eclipse.ease.ui.scripts.test ---
17:39:02 [2021-03-13T22:39:02.935Z] [INFO] 
17:39:02 [2021-03-13T22:39:02.935Z] [INFO] --- maven-resources-plugin:2.4.3:resources (default-resources) @ org.eclipse.ease.ui.scripts.test ---
17:39:02 [2021-03-13T22:39:02.935Z] [INFO] Using 'UTF-8' encoding to copy filtered resources.
17:39:02 [2021-03-13T22:39:02.935Z] [INFO] skip non existing resourceDirectory /home/jenkins/agent/workspace/ease.verify.core.target.2019-03/tests/org.eclipse.ease.ui.scripts.test/src/main/resources
17:39:02 [2021-03-13T22:39:02.935Z] [INFO] 
17:39:02 [2021-03-13T22:39:02.935Z] [INFO] --- tycho-compiler-plugin:2.2.0:compile (default-compile) @ org.eclipse.ease.ui.scripts.test ---
17:39:02 [2021-03-13T22:39:02.935Z] [INFO] Compiling 1 source file to /home/jenkins/agent/workspace/ease.verify.core.target.2019-03/tests/org.eclipse.ease.ui.scripts.test/target/classes
17:39:02 [2021-03-13T22:39:02.935Z] [INFO] 
17:39:02 [2021-03-13T22:39:02.935Z] [INFO] --- maven-resources-plugin:2.4.3:testResources (default-testResources) @ org.eclipse.ease.ui.scripts.test ---
17:39:02 [2021-03-13T22:39:02.935Z] [INFO] Using 'UTF-8' encoding to copy filtered resources.
17:39:02 [2021-03-13T22:39:02.935Z] [INFO] skip non existing resourceDirectory /home/jenkins/agent/workspace/ease.verify.core.target.2019-03/tests/org.eclipse.ease.ui.scripts.test/src/test/resources
17:39:02 [2021-03-13T22:39:02.935Z] [INFO] 
17:39:02 [2021-03-13T22:39:02.935Z] [INFO] --- target-platform-configuration:2.2.0:target-platform (default-target-platform) @ org.eclipse.ease.ui.scripts.test ---
17:39:02 [2021-03-13T22:39:02.935Z] [INFO] 
17:39:02 [2021-03-13T22:39:02.935Z] [INFO] --- tycho-packaging-plugin:2.2.0:package-plugin (default-package-plugin) @ org.eclipse.ease.ui.scripts.test ---
17:39:02 [2021-03-13T22:39:02.935Z] [INFO] Building jar: /home/jenkins/agent/workspace/ease.verify.core.target.2019-03/tests/org.eclipse.ease.ui.scripts.test/target/org.eclipse.ease.ui.scripts.test-0.8.0-SNAPSHOT.jar
17:39:02 [2021-03-13T22:39:02.935Z] [INFO] 
17:39:02 [2021-03-13T22:39:02.935Z] [INFO] --- tycho-p2-plugin:2.2.0:p2-metadata-default (default-p2-metadata-default) @ org.eclipse.ease.ui.scripts.test ---
17:39:02 [2021-03-13T22:39:02.935Z] [INFO] 
17:39:02 [2021-03-13T22:39:02.935Z] [INFO] --- jacoco-maven-plugin:0.8.6:prepare-agent (jacoco-initialize) @ org.eclipse.ease.ui.scripts.test ---
17:39:02 [2021-03-13T22:39:02.935Z] [INFO] tycho.testArgLine set to -javaagent:/home/jenkins/.m2/repository/org/jacoco/org.jacoco.agent/0.8.6/org.jacoco.agent-0.8.6-runtime.jar=destfile=/home/jenkins/agent/workspace/ease.verify.core.target.2019-03/tests/org.eclipse.ease.ui.scripts.test/target/jacoco.exec,output=file
17:39:02 [2021-03-13T22:39:02.935Z] [INFO] 
17:39:02 [2021-03-13T22:39:02.935Z] [INFO] --- tycho-surefire-plugin:2.2.0:test (default-test) @ org.eclipse.ease.ui.scripts.test ---
17:39:02 [2021-03-13T22:39:02.935Z] [INFO] Executing Test Runtime with timeout 0, logs (if any) will be placed at: /home/jenkins/agent/workspace/ease.verify.core.target.2019-03/tests/org.eclipse.ease.ui.scripts.test/target/work/data/.metadata/.log
17:39:02 [2021-03-13T22:39:02.935Z] [INFO] Command line:
17:39:02 [2021-03-13T22:39:02.935Z] 	[/opt/tools/java/openjdk/jdk-15/15.0.2+7/bin/java, -Dosgi.noShutdown=false, -Dosgi.os=linux, -Dosgi.ws=gtk, -Dosgi.arch=x86_64, -javaagent:/home/jenkins/.m2/repository/org/jacoco/org.jacoco.agent/0.8.6/org.jacoco.agent-0.8.6-runtime.jar=destfile=/home/jenkins/agent/workspace/ease.verify.core.target.2019-03/tests/org.eclipse.ease.ui.scripts.test/target/jacoco.exec,output=file, -Dosgi.clean=true, -jar, /home/jenkins/.m2/repository/p2/osgi/bundle/org.eclipse.equinox.launcher/1.5.800.v20200727-1323/org.eclipse.equinox.launcher-1.5.800.v20200727-1323.jar, -data, /home/jenkins/agent/workspace/ease.verify.core.target.2019-03/tests/org.eclipse.ease.ui.scripts.test/target/work/data, -install, /home/jenkins/agent/workspace/ease.verify.core.target.2019-03/tests/org.eclipse.ease.ui.scripts.test/target/work, -configuration, /home/jenkins/agent/workspace/ease.verify.core.target.2019-03/tests/org.eclipse.ease.ui.scripts.test/target/work/configuration, -application, org.eclipse.tycho.surefire.osgibooter.headlesstest, -testproperties, /home/jenkins/agent/workspace/ease.verify.core.target.2019-03/tests/org.eclipse.ease.ui.scripts.test/target/surefire.properties]
17:39:02 [2021-03-13T22:39:02.935Z] Picked up JAVA_TOOL_OPTIONS: -Dmaven.ext.class.path="/home/jenkins/agent/workspace/ease.verify.core.target.2019-03@tmp/withMaven7a46d5a8/pipeline-maven-spy.jar" -Dorg.jenkinsci.plugins.pipeline.maven.reportsFolder="/home/jenkins/agent/workspace/ease.verify.core.target.2019-03@tmp/withMaven7a46d5a8" 
17:39:05 [2021-03-13T22:39:05.459Z] Mar 13, 2021 10:39:05 PM org.junit.platform.launcher.core.DefaultLauncher handleThrowable
17:39:05 [2021-03-13T22:39:05.459Z] WARNING: TestEngine with ID 'junit-vintage' failed to discover tests
17:39:05 [2021-03-13T22:39:05.459Z] java.lang.NoClassDefFoundError: org/junit/runners/model/RunnerBuilder
17:39:05 [2021-03-13T22:39:05.459Z] 	at org.junit.vintage.engine.discovery.VintageDiscoverer.<init>(VintageDiscoverer.java:48)
17:39:05 [2021-03-13T22:39:05.459Z] 	at org.junit.vintage.engine.VintageTestEngine.discover(VintageTestEngine.java:65)
17:39:05 [2021-03-13T22:39:05.459Z] 	at org.junit.platform.launcher.core.DefaultLauncher.discoverEngineRoot(DefaultLauncher.java:130)
17:39:05 [2021-03-13T22:39:05.459Z] 	at org.junit.platform.launcher.core.DefaultLauncher.discoverRoot(DefaultLauncher.java:117)
17:39:05 [2021-03-13T22:39:05.459Z] 	at org.junit.platform.launcher.core.DefaultLauncher.discover(DefaultLauncher.java:82)
17:39:05 [2021-03-13T22:39:05.459Z] 	at org.apache.maven.surefire.junitplatform.TestPlanScannerFilter.accept(TestPlanScannerFilter.java:56)
17:39:05 [2021-03-13T22:39:05.459Z] 	at org.apache.maven.surefire.util.DefaultScanResult.applyFilter(DefaultScanResult.java:102)
17:39:05 [2021-03-13T22:39:05.459Z] 	at org.apache.maven.surefire.junitplatform.JUnitPlatformProvider.scanClasspath(JUnitPlatformProvider.java:143)
17:39:05 [2021-03-13T22:39:05.459Z] 	at org.apache.maven.surefire.junitplatform.JUnitPlatformProvider.invoke(JUnitPlatformProvider.java:124)
17:39:05 [2021-03-13T22:39:05.459Z] 	at java.base/jdk.internal.reflect.NativeMethodAccessorImpl.invoke0(Native Method)
17:39:05 [2021-03-13T22:39:05.460Z] 	at java.base/jdk.internal.reflect.NativeMethodAccessorImpl.invoke(NativeMethodAccessorImpl.java:64)
17:39:05 [2021-03-13T22:39:05.460Z] 	at java.base/jdk.internal.reflect.DelegatingMethodAccessorImpl.invoke(DelegatingMethodAccessorImpl.java:43)
17:39:05 [2021-03-13T22:39:05.460Z] 	at java.base/java.lang.reflect.Method.invoke(Method.java:564)
17:39:05 [2021-03-13T22:39:05.460Z] 	at org.apache.maven.surefire.util.ReflectionUtils.invokeMethodWithArray2(ReflectionUtils.java:206)
17:39:05 [2021-03-13T22:39:05.460Z] 	at org.apache.maven.surefire.booter.ProviderFactory$ProviderProxy.invoke(ProviderFactory.java:161)
17:39:05 [2021-03-13T22:39:05.460Z] 	at org.apache.maven.surefire.booter.ProviderFactory.invokeProvider(ProviderFactory.java:84)
17:39:05 [2021-03-13T22:39:05.460Z] 	at org.eclipse.tycho.surefire.osgibooter.OsgiSurefireBooter.run(OsgiSurefireBooter.java:116)
17:39:05 [2021-03-13T22:39:05.460Z] 	at org.eclipse.tycho.surefire.osgibooter.HeadlessTestApplication.start(HeadlessTestApplication.java:23)
17:39:05 [2021-03-13T22:39:05.460Z] 	at org.eclipse.equinox.internal.app.EclipseAppHandle.run(EclipseAppHandle.java:203)
17:39:05 [2021-03-13T22:39:05.460Z] 	at org.eclipse.core.runtime.internal.adaptor.EclipseAppLauncher.runApplication(EclipseAppLauncher.java:134)
17:39:05 [2021-03-13T22:39:05.460Z] 	at org.eclipse.core.runtime.internal.adaptor.EclipseAppLauncher.start(EclipseAppLauncher.java:104)
17:39:05 [2021-03-13T22:39:05.460Z] 	at org.eclipse.core.runtime.adaptor.EclipseStarter.run(EclipseStarter.java:401)
17:39:05 [2021-03-13T22:39:05.460Z] 	at org.eclipse.core.runtime.adaptor.EclipseStarter.run(EclipseStarter.java:255)
17:39:05 [2021-03-13T22:39:05.460Z] 	at java.base/jdk.internal.reflect.NativeMethodAccessorImpl.invoke0(Native Method)
17:39:05 [2021-03-13T22:39:05.460Z] 	at java.base/jdk.internal.reflect.NativeMethodAccessorImpl.invoke(NativeMethodAccessorImpl.java:64)
17:39:05 [2021-03-13T22:39:05.460Z] 	at java.base/jdk.internal.reflect.DelegatingMethodAccessorImpl.invoke(DelegatingMethodAccessorImpl.java:43)
17:39:05 [2021-03-13T22:39:05.460Z] 	at java.base/java.lang.reflect.Method.invoke(Method.java:564)
17:39:05 [2021-03-13T22:39:05.460Z] 	at org.eclipse.equinox.launcher.Main.invokeFramework(Main.java:657)
17:39:05 [2021-03-13T22:39:05.460Z] 	at org.eclipse.equinox.launcher.Main.basicRun(Main.java:594)
17:39:05 [2021-03-13T22:39:05.460Z] 	at org.eclipse.equinox.launcher.Main.run(Main.java:1465)
17:39:05 [2021-03-13T22:39:05.460Z] 	at org.eclipse.equinox.launcher.Main.main(Main.java:1438)
17:39:05 [2021-03-13T22:39:05.460Z] Caused by: java.lang.ClassNotFoundException: org.junit.runners.model.RunnerBuilder cannot be found by org.eclipse.tycho.surefire.osgibooter_2.2.0
17:39:05 [2021-03-13T22:39:05.460Z] 	at org.eclipse.osgi.internal.loader.BundleLoader.findClass(BundleLoader.java:516)
17:39:05 [2021-03-13T22:39:05.460Z] 	at org.eclipse.osgi.internal.loader.ModuleClassLoader.loadClass(ModuleClassLoader.java:171)
17:39:05 [2021-03-13T22:39:05.460Z] 	at java.base/java.lang.ClassLoader.loadClass(ClassLoader.java:522)
17:39:05 [2021-03-13T22:39:05.460Z] 	... 31 more
17:39:05 [2021-03-13T22:39:05.460Z] 
17:39:05 [2021-03-13T22:39:05.460Z] Mar 13, 2021 10:39:05 PM org.junit.platform.launcher.core.DefaultLauncher handleThrowable
17:39:05 [2021-03-13T22:39:05.460Z] WARNING: TestEngine with ID 'junit-vintage' failed to discover tests
17:39:05 [2021-03-13T22:39:05.460Z] java.lang.NoClassDefFoundError: org/junit/runners/model/RunnerBuilder
17:39:05 [2021-03-13T22:39:05.460Z] 	at org.junit.vintage.engine.discovery.VintageDiscoverer.<init>(VintageDiscoverer.java:48)
17:39:05 [2021-03-13T22:39:05.460Z] 	at org.junit.vintage.engine.VintageTestEngine.discover(VintageTestEngine.java:65)
17:39:05 [2021-03-13T22:39:05.460Z] 	at org.junit.platform.launcher.core.DefaultLauncher.discoverEngineRoot(DefaultLauncher.java:130)
17:39:05 [2021-03-13T22:39:05.460Z] 	at org.junit.platform.launcher.core.DefaultLauncher.discoverRoot(DefaultLauncher.java:117)
17:39:05 [2021-03-13T22:39:05.460Z] 	at org.junit.platform.launcher.core.DefaultLauncher.execute(DefaultLauncher.java:90)
17:39:05 [2021-03-13T22:39:05.460Z] 	at org.apache.maven.surefire.junitplatform.JUnitPlatformProvider.invokeAllTests(JUnitPlatformProvider.java:150)
17:39:05 [2021-03-13T22:39:05.460Z] 	at org.apache.maven.surefire.junitplatform.JUnitPlatformProvider.invoke(JUnitPlatformProvider.java:124)
17:39:05 [2021-03-13T22:39:05.460Z] 	at java.base/jdk.internal.reflect.NativeMethodAccessorImpl.invoke0(Native Method)
17:39:05 [2021-03-13T22:39:05.460Z] 	at java.base/jdk.internal.reflect.NativeMethodAccessorImpl.invoke(NativeMethodAccessorImpl.java:64)
17:39:05 [2021-03-13T22:39:05.460Z] 	at java.base/jdk.internal.reflect.DelegatingMethodAccessorImpl.invoke(DelegatingMethodAccessorImpl.java:43)
17:39:05 [2021-03-13T22:39:05.460Z] 	at java.base/java.lang.reflect.Method.invoke(Method.java:564)
17:39:05 [2021-03-13T22:39:05.460Z] 	at org.apache.maven.surefire.util.ReflectionUtils.invokeMethodWithArray2(ReflectionUtils.java:206)
17:39:05 [2021-03-13T22:39:05.460Z] 	at org.apache.maven.surefire.booter.ProviderFactory$ProviderProxy.invoke(ProviderFactory.java:161)
17:39:05 [2021-03-13T22:39:05.460Z] 	at org.apache.maven.surefire.booter.ProviderFactory.invokeProvider(ProviderFactory.java:84)
17:39:05 [2021-03-13T22:39:05.460Z] 	at org.eclipse.tycho.surefire.osgibooter.OsgiSurefireBooter.run(OsgiSurefireBooter.java:116)
17:39:05 [2021-03-13T22:39:05.460Z] 	at org.eclipse.tycho.surefire.osgibooter.HeadlessTestApplication.start(HeadlessTestApplication.java:23)
17:39:05 [2021-03-13T22:39:05.460Z] 	at org.eclipse.equinox.internal.app.EclipseAppHandle.run(EclipseAppHandle.java:203)
17:39:05 [2021-03-13T22:39:05.460Z] 	at org.eclipse.core.runtime.internal.adaptor.EclipseAppLauncher.runApplication(EclipseAppLauncher.java:134)
17:39:05 [2021-03-13T22:39:05.460Z] 	at org.eclipse.core.runtime.internal.adaptor.EclipseAppLauncher.start(EclipseAppLauncher.java:104)
17:39:05 [2021-03-13T22:39:05.460Z] 	at org.eclipse.core.runtime.adaptor.EclipseStarter.run(EclipseStarter.java:401)
17:39:05 [2021-03-13T22:39:05.460Z] 	at org.eclipse.core.runtime.adaptor.EclipseStarter.run(EclipseStarter.java:255)
17:39:05 [2021-03-13T22:39:05.460Z] 	at java.base/jdk.internal.reflect.NativeMethodAccessorImpl.invoke0(Native Method)
17:39:05 [2021-03-13T22:39:05.460Z] 	at java.base/jdk.internal.reflect.NativeMethodAccessorImpl.invoke(NativeMethodAccessorImpl.java:64)
17:39:05 [2021-03-13T22:39:05.460Z] 	at java.base/jdk.internal.reflect.DelegatingMethodAccessorImpl.invoke(DelegatingMethodAccessorImpl.java:43)
17:39:05 [2021-03-13T22:39:05.460Z] 	at java.base/java.lang.reflect.Method.invoke(Method.java:564)
17:39:05 [2021-03-13T22:39:05.460Z] 	at org.eclipse.equinox.launcher.Main.invokeFramework(Main.java:657)
17:39:05 [2021-03-13T22:39:05.460Z] 	at org.eclipse.equinox.launcher.Main.basicRun(Main.java:594)
17:39:05 [2021-03-13T22:39:05.460Z] 	at org.eclipse.equinox.launcher.Main.run(Main.java:1465)
17:39:05 [2021-03-13T22:39:05.460Z] 	at org.eclipse.equinox.launcher.Main.main(Main.java:1438)
17:39:05 [2021-03-13T22:39:05.461Z] Caused by: java.lang.ClassNotFoundException: org.junit.runners.model.RunnerBuilder cannot be found by org.eclipse.tycho.surefire.osgibooter_2.2.0
17:39:05 [2021-03-13T22:39:05.461Z] 	at org.eclipse.osgi.internal.loader.BundleLoader.findClass(BundleLoader.java:516)
17:39:05 [2021-03-13T22:39:05.461Z] 	at org.eclipse.osgi.internal.loader.ModuleClassLoader.loadClass(ModuleClassLoader.java:171)
17:39:05 [2021-03-13T22:39:05.461Z] 	at java.base/java.lang.ClassLoader.loadClass(ClassLoader.java:522)
17:39:05 [2021-03-13T22:39:05.461Z] 	... 29 more
17:39:05 [2021-03-13T22:39:05.461Z] 
17:39:05 [2021-03-13T22:39:05.461Z] Running org.eclipse.ease.ui.scripts.expressions.definitions.ExpressionFactoryTest
17:39:05 [2021-03-13T22:39:05.461Z] Tests run: 14, Failures: 0, Errors: 0, Skipped: 0, Time elapsed: 0.06 s - in org.eclipse.ease.ui.scripts.expressions.definitions.ExpressionFactoryTest
17:39:05 [2021-03-13T22:39:05.461Z] loadClassWithExpression  Time elapsed: 0.012 s
17:39:05 [2021-03-13T22:39:05.461Z] createWithExpression  Time elapsed: 0 s
17:39:05 [2021-03-13T22:39:05.461Z] createReferenceExpression  Time elapsed: 0.025 s
17:39:05 [2021-03-13T22:39:05.461Z] loadClassReferenceExpression  Time elapsed: 0 s
17:39:05 [2021-03-13T22:39:05.461Z] loadClassTestExpression  Time elapsed: 0.001 s
17:39:05 [2021-03-13T22:39:05.461Z] createEqualsExpression  Time elapsed: 0 s
17:39:05 [2021-03-13T22:39:05.461Z] loadClassCountExpression  Time elapsed: 0.001 s
17:39:05 [2021-03-13T22:39:05.461Z] loadClassOrExpression  Time elapsed: 0.001 s
17:39:05 [2021-03-13T22:39:05.461Z] createTestExpression  Time elapsed: 0.003 s
17:39:05 [2021-03-13T22:39:05.461Z] createOrExpression  Time elapsed: 0.002 s
17:39:05 [2021-03-13T22:39:05.461Z] loadClassAndExpression  Time elapsed: 0.001 s
17:39:05 [2021-03-13T22:39:05.461Z] createAndExpression  Time elapsed: 0.004 s
17:39:05 [2021-03-13T22:39:05.461Z] loadClassEqualsExpression  Time elapsed: 0 s
17:39:05 [2021-03-13T22:39:05.461Z] createCountExpression  Time elapsed: 0.001 s
17:39:05 [2021-03-13T22:39:05.461Z] 
17:39:05 [2021-03-13T22:39:05.461Z] Results:
17:39:05 [2021-03-13T22:39:05.461Z] 
17:39:05 [2021-03-13T22:39:05.461Z] Tests run: 14, Failures: 0, Errors: 0, Skipped: 0
17:39:05 [2021-03-13T22:39:05.461Z] 
17:39:06 [2021-03-13T22:39:06.022Z] [INFO] All tests passed!
17:39:06 [2021-03-13T22:39:06.022Z] [INFO] 
17:39:06 [2021-03-13T22:39:06.022Z] [INFO] --- maven-install-plugin:2.3.1:install (default-install) @ org.eclipse.ease.ui.scripts.test ---
17:39:06 [2021-03-13T22:39:06.022Z] [INFO] Installing /home/jenkins/agent/workspace/ease.verify.core.target.2019-03/tests/org.eclipse.ease.ui.scripts.test/target/org.eclipse.ease.ui.scripts.test-0.8.0-SNAPSHOT.jar to /home/jenkins/.m2/repository/org/eclipse/ease/org.eclipse.ease.ui.scripts.test/0.8.0-SNAPSHOT/org.eclipse.ease.ui.scripts.test-0.8.0-SNAPSHOT.jar
17:39:06 [2021-03-13T22:39:06.022Z] [INFO] Installing /home/jenkins/agent/workspace/ease.verify.core.target.2019-03/tests/org.eclipse.ease.ui.scripts.test/pom.xml to /home/jenkins/.m2/repository/org/eclipse/ease/org.eclipse.ease.ui.scripts.test/0.8.0-SNAPSHOT/org.eclipse.ease.ui.scripts.test-0.8.0-SNAPSHOT.pom
17:39:06 [2021-03-13T22:39:06.023Z] [INFO] Installing /home/jenkins/agent/workspace/ease.verify.core.target.2019-03/tests/org.eclipse.ease.ui.scripts.test/target/p2content.xml to /home/jenkins/.m2/repository/org/eclipse/ease/org.eclipse.ease.ui.scripts.test/0.8.0-SNAPSHOT/org.eclipse.ease.ui.scripts.test-0.8.0-SNAPSHOT-p2metadata.xml
17:39:06 [2021-03-13T22:39:06.023Z] [INFO] Installing /home/jenkins/agent/workspace/ease.verify.core.target.2019-03/tests/org.eclipse.ease.ui.scripts.test/target/p2artifacts.xml to /home/jenkins/.m2/repository/org/eclipse/ease/org.eclipse.ease.ui.scripts.test/0.8.0-SNAPSHOT/org.eclipse.ease.ui.scripts.test-0.8.0-SNAPSHOT-p2artifacts.xml
17:39:06 [2021-03-13T22:39:06.023Z] [INFO] 
17:39:06 [2021-03-13T22:39:06.023Z] [INFO] --- tycho-p2-plugin:2.2.0:update-local-index (default-update-local-index) @ org.eclipse.ease.ui.scripts.test ---
17:39:06 [2021-03-13T22:39:06.023Z] [INFO] 
17:39:06 [2021-03-13T22:39:06.023Z] [INFO] -------------< org.eclipse.ease:org.eclipse.ease.ui.test >--------------
17:39:06 [2021-03-13T22:39:06.023Z] [INFO] Building org.eclipse.ease.ui.test 0.8.0-SNAPSHOT                 [46/48]
17:39:06 [2021-03-13T22:39:06.023Z] [INFO] ------------------------[ eclipse-test-plugin ]-------------------------
17:39:06 [2021-03-13T22:39:06.023Z] [INFO] 
17:39:06 [2021-03-13T22:39:06.023Z] [INFO] --- maven-clean-plugin:2.5:clean (default-clean) @ org.eclipse.ease.ui.test ---
17:39:06 [2021-03-13T22:39:06.023Z] [INFO] 
17:39:06 [2021-03-13T22:39:06.023Z] [INFO] --- tycho-packaging-plugin:2.2.0:build-qualifier (default-build-qualifier) @ org.eclipse.ease.ui.test ---
17:39:06 [2021-03-13T22:39:06.023Z] [INFO] The project's OSGi version is 0.8.0.I202103031149
17:39:06 [2021-03-13T22:39:06.023Z] [INFO] 
17:39:06 [2021-03-13T22:39:06.023Z] [INFO] --- tycho-packaging-plugin:2.2.0:validate-id (default-validate-id) @ org.eclipse.ease.ui.test ---
17:39:06 [2021-03-13T22:39:06.023Z] [INFO] 
17:39:06 [2021-03-13T22:39:06.023Z] [INFO] --- tycho-packaging-plugin:2.2.0:validate-version (default-validate-version) @ org.eclipse.ease.ui.test ---
17:39:06 [2021-03-13T22:39:06.023Z] [INFO] 
17:39:06 [2021-03-13T22:39:06.023Z] [INFO] --- maven-resources-plugin:2.4.3:resources (default-resources) @ org.eclipse.ease.ui.test ---
17:39:06 [2021-03-13T22:39:06.023Z] [INFO] Using 'UTF-8' encoding to copy filtered resources.
17:39:06 [2021-03-13T22:39:06.023Z] [INFO] skip non existing resourceDirectory /home/jenkins/agent/workspace/ease.verify.core.target.2019-03/tests/org.eclipse.ease.ui.test/src/main/resources
17:39:06 [2021-03-13T22:39:06.023Z] [INFO] 
17:39:06 [2021-03-13T22:39:06.023Z] [INFO] --- tycho-compiler-plugin:2.2.0:compile (default-compile) @ org.eclipse.ease.ui.test ---
17:39:06 [2021-03-13T22:39:06.023Z] [INFO] Compiling 6 source files to /home/jenkins/agent/workspace/ease.verify.core.target.2019-03/tests/org.eclipse.ease.ui.test/target/classes
17:39:06 [2021-03-13T22:39:06.278Z] [INFO] 
17:39:06 [2021-03-13T22:39:06.278Z] [INFO] --- maven-resources-plugin:2.4.3:testResources (default-testResources) @ org.eclipse.ease.ui.test ---
17:39:06 [2021-03-13T22:39:06.278Z] [INFO] Using 'UTF-8' encoding to copy filtered resources.
17:39:06 [2021-03-13T22:39:06.278Z] [INFO] skip non existing resourceDirectory /home/jenkins/agent/workspace/ease.verify.core.target.2019-03/tests/org.eclipse.ease.ui.test/src/test/resources
17:39:06 [2021-03-13T22:39:06.278Z] [INFO] 
17:39:06 [2021-03-13T22:39:06.278Z] [INFO] --- target-platform-configuration:2.2.0:target-platform (default-target-platform) @ org.eclipse.ease.ui.test ---
17:39:06 [2021-03-13T22:39:06.278Z] [INFO] 
17:39:06 [2021-03-13T22:39:06.278Z] [INFO] --- tycho-packaging-plugin:2.2.0:package-plugin (default-package-plugin) @ org.eclipse.ease.ui.test ---
17:39:06 [2021-03-13T22:39:06.279Z] [INFO] Building jar: /home/jenkins/agent/workspace/ease.verify.core.target.2019-03/tests/org.eclipse.ease.ui.test/target/org.eclipse.ease.ui.test-0.8.0-SNAPSHOT.jar
17:39:06 [2021-03-13T22:39:06.279Z] [INFO] 
17:39:06 [2021-03-13T22:39:06.279Z] [INFO] --- tycho-p2-plugin:2.2.0:p2-metadata-default (default-p2-metadata-default) @ org.eclipse.ease.ui.test ---
17:39:06 [2021-03-13T22:39:06.279Z] [INFO] 
17:39:06 [2021-03-13T22:39:06.279Z] [INFO] --- jacoco-maven-plugin:0.8.6:prepare-agent (jacoco-initialize) @ org.eclipse.ease.ui.test ---
17:39:06 [2021-03-13T22:39:06.279Z] [INFO] tycho.testArgLine set to -javaagent:/home/jenkins/.m2/repository/org/jacoco/org.jacoco.agent/0.8.6/org.jacoco.agent-0.8.6-runtime.jar=destfile=/home/jenkins/agent/workspace/ease.verify.core.target.2019-03/tests/org.eclipse.ease.ui.test/target/jacoco.exec,output=file
17:39:06 [2021-03-13T22:39:06.279Z] [INFO] 
17:39:06 [2021-03-13T22:39:06.279Z] [INFO] --- tycho-surefire-plugin:2.2.0:test (default-test) @ org.eclipse.ease.ui.test ---
17:39:06 [2021-03-13T22:39:06.279Z] [INFO] Executing Test Runtime with timeout 0, logs (if any) will be placed at: /home/jenkins/agent/workspace/ease.verify.core.target.2019-03/tests/org.eclipse.ease.ui.test/target/work/data/.metadata/.log
17:39:06 [2021-03-13T22:39:06.279Z] [INFO] Command line:
17:39:06 [2021-03-13T22:39:06.279Z] 	[/opt/tools/java/openjdk/jdk-15/15.0.2+7/bin/java, -Dosgi.noShutdown=false, -Dosgi.os=linux, -Dosgi.ws=gtk, -Dosgi.arch=x86_64, -javaagent:/home/jenkins/.m2/repository/org/jacoco/org.jacoco.agent/0.8.6/org.jacoco.agent-0.8.6-runtime.jar=destfile=/home/jenkins/agent/workspace/ease.verify.core.target.2019-03/tests/org.eclipse.ease.ui.test/target/jacoco.exec,output=file, -Dosgi.clean=true, -jar, /home/jenkins/.m2/repository/p2/osgi/bundle/org.eclipse.equinox.launcher/1.5.800.v20200727-1323/org.eclipse.equinox.launcher-1.5.800.v20200727-1323.jar, -data, /home/jenkins/agent/workspace/ease.verify.core.target.2019-03/tests/org.eclipse.ease.ui.test/target/work/data, -install, /home/jenkins/agent/workspace/ease.verify.core.target.2019-03/tests/org.eclipse.ease.ui.test/target/work, -configuration, /home/jenkins/agent/workspace/ease.verify.core.target.2019-03/tests/org.eclipse.ease.ui.test/target/work/configuration, -application, org.eclipse.tycho.surefire.osgibooter.headlesstest, -testproperties, /home/jenkins/agent/workspace/ease.verify.core.target.2019-03/tests/org.eclipse.ease.ui.test/target/surefire.properties]
17:39:06 [2021-03-13T22:39:06.279Z] Picked up JAVA_TOOL_OPTIONS: -Dmaven.ext.class.path="/home/jenkins/agent/workspace/ease.verify.core.target.2019-03@tmp/withMaven7a46d5a8/pipeline-maven-spy.jar" -Dorg.jenkinsci.plugins.pipeline.maven.reportsFolder="/home/jenkins/agent/workspace/ease.verify.core.target.2019-03@tmp/withMaven7a46d5a8" 
17:39:09 [2021-03-13T22:39:09.603Z] Mar 13, 2021 10:39:08 PM org.junit.platform.launcher.core.DefaultLauncher handleThrowable
17:39:09 [2021-03-13T22:39:09.603Z] WARNING: TestEngine with ID 'junit-vintage' failed to discover tests
17:39:09 [2021-03-13T22:39:09.603Z] java.lang.NoClassDefFoundError: org/junit/runners/model/RunnerBuilder
17:39:09 [2021-03-13T22:39:09.603Z] 	at org.junit.vintage.engine.discovery.VintageDiscoverer.<init>(VintageDiscoverer.java:48)
17:39:09 [2021-03-13T22:39:09.603Z] 	at org.junit.vintage.engine.VintageTestEngine.discover(VintageTestEngine.java:65)
17:39:09 [2021-03-13T22:39:09.603Z] 	at org.junit.platform.launcher.core.DefaultLauncher.discoverEngineRoot(DefaultLauncher.java:130)
17:39:09 [2021-03-13T22:39:09.603Z] 	at org.junit.platform.launcher.core.DefaultLauncher.discoverRoot(DefaultLauncher.java:117)
17:39:09 [2021-03-13T22:39:09.603Z] 	at org.junit.platform.launcher.core.DefaultLauncher.discover(DefaultLauncher.java:82)
17:39:09 [2021-03-13T22:39:09.603Z] 	at org.apache.maven.surefire.junitplatform.TestPlanScannerFilter.accept(TestPlanScannerFilter.java:56)
17:39:09 [2021-03-13T22:39:09.603Z] 	at org.apache.maven.surefire.util.DefaultScanResult.applyFilter(DefaultScanResult.java:102)
17:39:09 [2021-03-13T22:39:09.603Z] 	at org.apache.maven.surefire.junitplatform.JUnitPlatformProvider.scanClasspath(JUnitPlatformProvider.java:143)
17:39:09 [2021-03-13T22:39:09.603Z] 	at org.apache.maven.surefire.junitplatform.JUnitPlatformProvider.invoke(JUnitPlatformProvider.java:124)
17:39:09 [2021-03-13T22:39:09.603Z] 	at java.base/jdk.internal.reflect.NativeMethodAccessorImpl.invoke0(Native Method)
17:39:09 [2021-03-13T22:39:09.603Z] 	at java.base/jdk.internal.reflect.NativeMethodAccessorImpl.invoke(NativeMethodAccessorImpl.java:64)
17:39:09 [2021-03-13T22:39:09.603Z] 	at java.base/jdk.internal.reflect.DelegatingMethodAccessorImpl.invoke(DelegatingMethodAccessorImpl.java:43)
17:39:09 [2021-03-13T22:39:09.603Z] 	at java.base/java.lang.reflect.Method.invoke(Method.java:564)
17:39:09 [2021-03-13T22:39:09.603Z] 	at org.apache.maven.surefire.util.ReflectionUtils.invokeMethodWithArray2(ReflectionUtils.java:206)
17:39:09 [2021-03-13T22:39:09.603Z] 	at org.apache.maven.surefire.booter.ProviderFactory$ProviderProxy.invoke(ProviderFactory.java:161)
17:39:09 [2021-03-13T22:39:09.603Z] 	at org.apache.maven.surefire.booter.ProviderFactory.invokeProvider(ProviderFactory.java:84)
17:39:09 [2021-03-13T22:39:09.603Z] 	at org.eclipse.tycho.surefire.osgibooter.OsgiSurefireBooter.run(OsgiSurefireBooter.java:116)
17:39:09 [2021-03-13T22:39:09.603Z] 	at org.eclipse.tycho.surefire.osgibooter.HeadlessTestApplication.start(HeadlessTestApplication.java:23)
17:39:09 [2021-03-13T22:39:09.603Z] 	at org.eclipse.equinox.internal.app.EclipseAppHandle.run(EclipseAppHandle.java:203)
17:39:09 [2021-03-13T22:39:09.603Z] 	at org.eclipse.core.runtime.internal.adaptor.EclipseAppLauncher.runApplication(EclipseAppLauncher.java:134)
17:39:09 [2021-03-13T22:39:09.603Z] 	at org.eclipse.core.runtime.internal.adaptor.EclipseAppLauncher.start(EclipseAppLauncher.java:104)
17:39:09 [2021-03-13T22:39:09.603Z] 	at org.eclipse.core.runtime.adaptor.EclipseStarter.run(EclipseStarter.java:401)
17:39:09 [2021-03-13T22:39:09.603Z] 	at org.eclipse.core.runtime.adaptor.EclipseStarter.run(EclipseStarter.java:255)
17:39:09 [2021-03-13T22:39:09.603Z] 	at java.base/jdk.internal.reflect.NativeMethodAccessorImpl.invoke0(Native Method)
17:39:09 [2021-03-13T22:39:09.603Z] 	at java.base/jdk.internal.reflect.NativeMethodAccessorImpl.invoke(NativeMethodAccessorImpl.java:64)
17:39:09 [2021-03-13T22:39:09.603Z] 	at java.base/jdk.internal.reflect.DelegatingMethodAccessorImpl.invoke(DelegatingMethodAccessorImpl.java:43)
17:39:09 [2021-03-13T22:39:09.603Z] 	at java.base/java.lang.reflect.Method.invoke(Method.java:564)
17:39:09 [2021-03-13T22:39:09.603Z] 	at org.eclipse.equinox.launcher.Main.invokeFramework(Main.java:657)
17:39:09 [2021-03-13T22:39:09.603Z] 	at org.eclipse.equinox.launcher.Main.basicRun(Main.java:594)
17:39:09 [2021-03-13T22:39:09.603Z] 	at org.eclipse.equinox.launcher.Main.run(Main.java:1465)
17:39:09 [2021-03-13T22:39:09.603Z] 	at org.eclipse.equinox.launcher.Main.main(Main.java:1438)
17:39:09 [2021-03-13T22:39:09.603Z] Caused by: java.lang.ClassNotFoundException: org.junit.runners.model.RunnerBuilder cannot be found by org.eclipse.tycho.surefire.osgibooter_2.2.0
17:39:09 [2021-03-13T22:39:09.603Z] 	at org.eclipse.osgi.internal.loader.BundleLoader.findClass(BundleLoader.java:516)
17:39:09 [2021-03-13T22:39:09.603Z] 	at org.eclipse.osgi.internal.loader.ModuleClassLoader.loadClass(ModuleClassLoader.java:171)
17:39:09 [2021-03-13T22:39:09.603Z] 	at java.base/java.lang.ClassLoader.loadClass(ClassLoader.java:522)
17:39:09 [2021-03-13T22:39:09.603Z] 	... 31 more
17:39:09 [2021-03-13T22:39:09.603Z] 
17:39:09 [2021-03-13T22:39:09.603Z] Mar 13, 2021 10:39:09 PM org.junit.platform.launcher.core.DefaultLauncher handleThrowable
17:39:09 [2021-03-13T22:39:09.603Z] WARNING: TestEngine with ID 'junit-vintage' failed to discover tests
17:39:09 [2021-03-13T22:39:09.603Z] java.lang.NoClassDefFoundError: org/junit/runners/model/RunnerBuilder
17:39:09 [2021-03-13T22:39:09.603Z] 	at org.junit.vintage.engine.discovery.VintageDiscoverer.<init>(VintageDiscoverer.java:48)
17:39:09 [2021-03-13T22:39:09.603Z] 	at org.junit.vintage.engine.VintageTestEngine.discover(VintageTestEngine.java:65)
17:39:09 [2021-03-13T22:39:09.603Z] 	at org.junit.platform.launcher.core.DefaultLauncher.discoverEngineRoot(DefaultLauncher.java:130)
17:39:09 [2021-03-13T22:39:09.603Z] 	at org.junit.platform.launcher.core.DefaultLauncher.discoverRoot(DefaultLauncher.java:117)
17:39:09 [2021-03-13T22:39:09.603Z] 	at org.junit.platform.launcher.core.DefaultLauncher.discover(DefaultLauncher.java:82)
17:39:09 [2021-03-13T22:39:09.603Z] 	at org.apache.maven.surefire.junitplatform.TestPlanScannerFilter.accept(TestPlanScannerFilter.java:56)
17:39:09 [2021-03-13T22:39:09.603Z] 	at org.apache.maven.surefire.util.DefaultScanResult.applyFilter(DefaultScanResult.java:102)
17:39:09 [2021-03-13T22:39:09.603Z] 	at org.apache.maven.surefire.junitplatform.JUnitPlatformProvider.scanClasspath(JUnitPlatformProvider.java:143)
17:39:09 [2021-03-13T22:39:09.603Z] 	at org.apache.maven.surefire.junitplatform.JUnitPlatformProvider.invoke(JUnitPlatformProvider.java:124)
17:39:09 [2021-03-13T22:39:09.604Z] 	at java.base/jdk.internal.reflect.NativeMethodAccessorImpl.invoke0(Native Method)
17:39:09 [2021-03-13T22:39:09.604Z] 	at java.base/jdk.internal.reflect.NativeMethodAccessorImpl.invoke(NativeMethodAccessorImpl.java:64)
17:39:09 [2021-03-13T22:39:09.604Z] 	at java.base/jdk.internal.reflect.DelegatingMethodAccessorImpl.invoke(DelegatingMethodAccessorImpl.java:43)
17:39:09 [2021-03-13T22:39:09.604Z] 	at java.base/java.lang.reflect.Method.invoke(Method.java:564)
17:39:09 [2021-03-13T22:39:09.604Z] 	at org.apache.maven.surefire.util.ReflectionUtils.invokeMethodWithArray2(ReflectionUtils.java:206)
17:39:09 [2021-03-13T22:39:09.604Z] 	at org.apache.maven.surefire.booter.ProviderFactory$ProviderProxy.invoke(ProviderFactory.java:161)
17:39:09 [2021-03-13T22:39:09.604Z] 	at org.apache.maven.surefire.booter.ProviderFactory.invokeProvider(ProviderFactory.java:84)
17:39:09 [2021-03-13T22:39:09.604Z] 	at org.eclipse.tycho.surefire.osgibooter.OsgiSurefireBooter.run(OsgiSurefireBooter.java:116)
17:39:09 [2021-03-13T22:39:09.604Z] 	at org.eclipse.tycho.surefire.osgibooter.HeadlessTestApplication.start(HeadlessTestApplication.java:23)
17:39:09 [2021-03-13T22:39:09.604Z] 	at org.eclipse.equinox.internal.app.EclipseAppHandle.run(EclipseAppHandle.java:203)
17:39:09 [2021-03-13T22:39:09.604Z] 	at org.eclipse.core.runtime.internal.adaptor.EclipseAppLauncher.runApplication(EclipseAppLauncher.java:134)
17:39:09 [2021-03-13T22:39:09.604Z] 	at org.eclipse.core.runtime.internal.adaptor.EclipseAppLauncher.start(EclipseAppLauncher.java:104)
17:39:09 [2021-03-13T22:39:09.604Z] 	at org.eclipse.core.runtime.adaptor.EclipseStarter.run(EclipseStarter.java:401)
17:39:09 [2021-03-13T22:39:09.604Z] 	at org.eclipse.core.runtime.adaptor.EclipseStarter.run(EclipseStarter.java:255)
17:39:09 [2021-03-13T22:39:09.604Z] 	at java.base/jdk.internal.reflect.NativeMethodAccessorImpl.invoke0(Native Method)
17:39:09 [2021-03-13T22:39:09.604Z] 	at java.base/jdk.internal.reflect.NativeMethodAccessorImpl.invoke(NativeMethodAccessorImpl.java:64)
17:39:09 [2021-03-13T22:39:09.604Z] 	at java.base/jdk.internal.reflect.DelegatingMethodAccessorImpl.invoke(DelegatingMethodAccessorImpl.java:43)
17:39:09 [2021-03-13T22:39:09.604Z] 	at java.base/java.lang.reflect.Method.invoke(Method.java:564)
17:39:09 [2021-03-13T22:39:09.604Z] 	at org.eclipse.equinox.launcher.Main.invokeFramework(Main.java:657)
17:39:09 [2021-03-13T22:39:09.604Z] 	at org.eclipse.equinox.launcher.Main.basicRun(Main.java:594)
17:39:09 [2021-03-13T22:39:09.604Z] 	at org.eclipse.equinox.launcher.Main.run(Main.java:1465)
17:39:09 [2021-03-13T22:39:09.604Z] 	at org.eclipse.equinox.launcher.Main.main(Main.java:1438)
17:39:09 [2021-03-13T22:39:09.604Z] Caused by: java.lang.ClassNotFoundException: org.junit.runners.model.RunnerBuilder cannot be found by org.eclipse.tycho.surefire.osgibooter_2.2.0
17:39:09 [2021-03-13T22:39:09.604Z] 	at org.eclipse.osgi.internal.loader.BundleLoader.findClass(BundleLoader.java:516)
17:39:09 [2021-03-13T22:39:09.604Z] 	at org.eclipse.osgi.internal.loader.ModuleClassLoader.loadClass(ModuleClassLoader.java:171)
17:39:09 [2021-03-13T22:39:09.604Z] 	at java.base/java.lang.ClassLoader.loadClass(ClassLoader.java:522)
17:39:09 [2021-03-13T22:39:09.604Z] 	... 31 more
17:39:09 [2021-03-13T22:39:09.604Z] 
17:39:09 [2021-03-13T22:39:09.604Z] Mar 13, 2021 10:39:09 PM org.junit.platform.launcher.core.DefaultLauncher handleThrowable
17:39:09 [2021-03-13T22:39:09.604Z] WARNING: TestEngine with ID 'junit-vintage' failed to discover tests
17:39:09 [2021-03-13T22:39:09.604Z] java.lang.NoClassDefFoundError: org/junit/runners/model/RunnerBuilder
17:39:09 [2021-03-13T22:39:09.604Z] 	at org.junit.vintage.engine.discovery.VintageDiscoverer.<init>(VintageDiscoverer.java:48)
17:39:09 [2021-03-13T22:39:09.604Z] 	at org.junit.vintage.engine.VintageTestEngine.discover(VintageTestEngine.java:65)
17:39:09 [2021-03-13T22:39:09.604Z] 	at org.junit.platform.launcher.core.DefaultLauncher.discoverEngineRoot(DefaultLauncher.java:130)
17:39:09 [2021-03-13T22:39:09.604Z] 	at org.junit.platform.launcher.core.DefaultLauncher.discoverRoot(DefaultLauncher.java:117)
17:39:09 [2021-03-13T22:39:09.604Z] 	at org.junit.platform.launcher.core.DefaultLauncher.discover(DefaultLauncher.java:82)
17:39:09 [2021-03-13T22:39:09.604Z] 	at org.apache.maven.surefire.junitplatform.TestPlanScannerFilter.accept(TestPlanScannerFilter.java:56)
17:39:09 [2021-03-13T22:39:09.604Z] 	at org.apache.maven.surefire.util.DefaultScanResult.applyFilter(DefaultScanResult.java:102)
17:39:09 [2021-03-13T22:39:09.604Z] 	at org.apache.maven.surefire.junitplatform.JUnitPlatformProvider.scanClasspath(JUnitPlatformProvider.java:143)
17:39:09 [2021-03-13T22:39:09.604Z] 	at org.apache.maven.surefire.junitplatform.JUnitPlatformProvider.invoke(JUnitPlatformProvider.java:124)
17:39:09 [2021-03-13T22:39:09.604Z] 	at java.base/jdk.internal.reflect.NativeMethodAccessorImpl.invoke0(Native Method)
17:39:09 [2021-03-13T22:39:09.604Z] 	at java.base/jdk.internal.reflect.NativeMethodAccessorImpl.invoke(NativeMethodAccessorImpl.java:64)
17:39:09 [2021-03-13T22:39:09.604Z] 	at java.base/jdk.internal.reflect.DelegatingMethodAccessorImpl.invoke(DelegatingMethodAccessorImpl.java:43)
17:39:09 [2021-03-13T22:39:09.604Z] 	at java.base/java.lang.reflect.Method.invoke(Method.java:564)
17:39:09 [2021-03-13T22:39:09.604Z] 	at org.apache.maven.surefire.util.ReflectionUtils.invokeMethodWithArray2(ReflectionUtils.java:206)
17:39:09 [2021-03-13T22:39:09.604Z] 	at org.apache.maven.surefire.booter.ProviderFactory$ProviderProxy.invoke(ProviderFactory.java:161)
17:39:09 [2021-03-13T22:39:09.604Z] 	at org.apache.maven.surefire.booter.ProviderFactory.invokeProvider(ProviderFactory.java:84)
17:39:09 [2021-03-13T22:39:09.604Z] 	at org.eclipse.tycho.surefire.osgibooter.OsgiSurefireBooter.run(OsgiSurefireBooter.java:116)
17:39:09 [2021-03-13T22:39:09.604Z] 	at org.eclipse.tycho.surefire.osgibooter.HeadlessTestApplication.start(HeadlessTestApplication.java:23)
17:39:09 [2021-03-13T22:39:09.604Z] 	at org.eclipse.equinox.internal.app.EclipseAppHandle.run(EclipseAppHandle.java:203)
17:39:09 [2021-03-13T22:39:09.604Z] 	at org.eclipse.core.runtime.internal.adaptor.EclipseAppLauncher.runApplication(EclipseAppLauncher.java:134)
17:39:09 [2021-03-13T22:39:09.604Z] 	at org.eclipse.core.runtime.internal.adaptor.EclipseAppLauncher.start(EclipseAppLauncher.java:104)
17:39:09 [2021-03-13T22:39:09.604Z] 	at org.eclipse.core.runtime.adaptor.EclipseStarter.run(EclipseStarter.java:401)
17:39:09 [2021-03-13T22:39:09.604Z] 	at org.eclipse.core.runtime.adaptor.EclipseStarter.run(EclipseStarter.java:255)
17:39:09 [2021-03-13T22:39:09.604Z] 	at java.base/jdk.internal.reflect.NativeMethodAccessorImpl.invoke0(Native Method)
17:39:09 [2021-03-13T22:39:09.604Z] 	at java.base/jdk.internal.reflect.NativeMethodAccessorImpl.invoke(NativeMethodAccessorImpl.java:64)
17:39:09 [2021-03-13T22:39:09.604Z] 	at java.base/jdk.internal.reflect.DelegatingMethodAccessorImpl.invoke(DelegatingMethodAccessorImpl.java:43)
17:39:09 [2021-03-13T22:39:09.604Z] 	at java.base/java.lang.reflect.Method.invoke(Method.java:564)
17:39:09 [2021-03-13T22:39:09.604Z] 	at org.eclipse.equinox.launcher.Main.invokeFramework(Main.java:657)
17:39:09 [2021-03-13T22:39:09.604Z] 	at org.eclipse.equinox.launcher.Main.basicRun(Main.java:594)
17:39:09 [2021-03-13T22:39:09.604Z] 	at org.eclipse.equinox.launcher.Main.run(Main.java:1465)
17:39:09 [2021-03-13T22:39:09.604Z] 	at org.eclipse.equinox.launcher.Main.main(Main.java:1438)
17:39:09 [2021-03-13T22:39:09.604Z] Caused by: java.lang.ClassNotFoundException: org.junit.runners.model.RunnerBuilder cannot be found by org.eclipse.tycho.surefire.osgibooter_2.2.0
17:39:09 [2021-03-13T22:39:09.604Z] 	at org.eclipse.osgi.internal.loader.BundleLoader.findClass(BundleLoader.java:516)
17:39:09 [2021-03-13T22:39:09.604Z] 	at org.eclipse.osgi.internal.loader.ModuleClassLoader.loadClass(ModuleClassLoader.java:171)
17:39:09 [2021-03-13T22:39:09.604Z] 	at java.base/java.lang.ClassLoader.loadClass(ClassLoader.java:522)
17:39:09 [2021-03-13T22:39:09.604Z] 	... 31 more
17:39:09 [2021-03-13T22:39:09.604Z] 
17:39:09 [2021-03-13T22:39:09.604Z] Mar 13, 2021 10:39:09 PM org.junit.platform.launcher.core.DefaultLauncher handleThrowable
17:39:09 [2021-03-13T22:39:09.604Z] WARNING: TestEngine with ID 'junit-vintage' failed to discover tests
17:39:09 [2021-03-13T22:39:09.604Z] java.lang.NoClassDefFoundError: org/junit/runners/model/RunnerBuilder
17:39:09 [2021-03-13T22:39:09.604Z] 	at org.junit.vintage.engine.discovery.VintageDiscoverer.<init>(VintageDiscoverer.java:48)
17:39:09 [2021-03-13T22:39:09.604Z] 	at org.junit.vintage.engine.VintageTestEngine.discover(VintageTestEngine.java:65)
17:39:09 [2021-03-13T22:39:09.604Z] 	at org.junit.platform.launcher.core.DefaultLauncher.discoverEngineRoot(DefaultLauncher.java:130)
17:39:09 [2021-03-13T22:39:09.604Z] 	at org.junit.platform.launcher.core.DefaultLauncher.discoverRoot(DefaultLauncher.java:117)
17:39:09 [2021-03-13T22:39:09.605Z] 	at org.junit.platform.launcher.core.DefaultLauncher.discover(DefaultLauncher.java:82)
17:39:09 [2021-03-13T22:39:09.605Z] 	at org.apache.maven.surefire.junitplatform.TestPlanScannerFilter.accept(TestPlanScannerFilter.java:56)
17:39:09 [2021-03-13T22:39:09.605Z] 	at org.apache.maven.surefire.util.DefaultScanResult.applyFilter(DefaultScanResult.java:102)
17:39:09 [2021-03-13T22:39:09.605Z] 	at org.apache.maven.surefire.junitplatform.JUnitPlatformProvider.scanClasspath(JUnitPlatformProvider.java:143)
17:39:09 [2021-03-13T22:39:09.605Z] 	at org.apache.maven.surefire.junitplatform.JUnitPlatformProvider.invoke(JUnitPlatformProvider.java:124)
17:39:09 [2021-03-13T22:39:09.605Z] 	at java.base/jdk.internal.reflect.NativeMethodAccessorImpl.invoke0(Native Method)
17:39:09 [2021-03-13T22:39:09.605Z] 	at java.base/jdk.internal.reflect.NativeMethodAccessorImpl.invoke(NativeMethodAccessorImpl.java:64)
17:39:09 [2021-03-13T22:39:09.605Z] 	at java.base/jdk.internal.reflect.DelegatingMethodAccessorImpl.invoke(DelegatingMethodAccessorImpl.java:43)
17:39:09 [2021-03-13T22:39:09.605Z] 	at java.base/java.lang.reflect.Method.invoke(Method.java:564)
17:39:09 [2021-03-13T22:39:09.605Z] 	at org.apache.maven.surefire.util.ReflectionUtils.invokeMethodWithArray2(ReflectionUtils.java:206)
17:39:09 [2021-03-13T22:39:09.605Z] 	at org.apache.maven.surefire.booter.ProviderFactory$ProviderProxy.invoke(ProviderFactory.java:161)
17:39:09 [2021-03-13T22:39:09.605Z] 	at org.apache.maven.surefire.booter.ProviderFactory.invokeProvider(ProviderFactory.java:84)
17:39:09 [2021-03-13T22:39:09.605Z] 	at org.eclipse.tycho.surefire.osgibooter.OsgiSurefireBooter.run(OsgiSurefireBooter.java:116)
17:39:09 [2021-03-13T22:39:09.605Z] 	at org.eclipse.tycho.surefire.osgibooter.HeadlessTestApplication.start(HeadlessTestApplication.java:23)
17:39:09 [2021-03-13T22:39:09.605Z] 	at org.eclipse.equinox.internal.app.EclipseAppHandle.run(EclipseAppHandle.java:203)
17:39:09 [2021-03-13T22:39:09.605Z] 	at org.eclipse.core.runtime.internal.adaptor.EclipseAppLauncher.runApplication(EclipseAppLauncher.java:134)
17:39:09 [2021-03-13T22:39:09.605Z] 	at org.eclipse.core.runtime.internal.adaptor.EclipseAppLauncher.start(EclipseAppLauncher.java:104)
17:39:09 [2021-03-13T22:39:09.605Z] 	at org.eclipse.core.runtime.adaptor.EclipseStarter.run(EclipseStarter.java:401)
17:39:09 [2021-03-13T22:39:09.605Z] 	at org.eclipse.core.runtime.adaptor.EclipseStarter.run(EclipseStarter.java:255)
17:39:09 [2021-03-13T22:39:09.605Z] 	at java.base/jdk.internal.reflect.NativeMethodAccessorImpl.invoke0(Native Method)
17:39:09 [2021-03-13T22:39:09.605Z] 	at java.base/jdk.internal.reflect.NativeMethodAccessorImpl.invoke(NativeMethodAccessorImpl.java:64)
17:39:09 [2021-03-13T22:39:09.605Z] 	at java.base/jdk.internal.reflect.DelegatingMethodAccessorImpl.invoke(DelegatingMethodAccessorImpl.java:43)
17:39:09 [2021-03-13T22:39:09.605Z] 	at java.base/java.lang.reflect.Method.invoke(Method.java:564)
17:39:09 [2021-03-13T22:39:09.605Z] 	at org.eclipse.equinox.launcher.Main.invokeFramework(Main.java:657)
17:39:09 [2021-03-13T22:39:09.605Z] 	at org.eclipse.equinox.launcher.Main.basicRun(Main.java:594)
17:39:09 [2021-03-13T22:39:09.605Z] 	at org.eclipse.equinox.launcher.Main.run(Main.java:1465)
17:39:09 [2021-03-13T22:39:09.605Z] 	at org.eclipse.equinox.launcher.Main.main(Main.java:1438)
17:39:09 [2021-03-13T22:39:09.605Z] Caused by: java.lang.ClassNotFoundException: org.junit.runners.model.RunnerBuilder cannot be found by org.eclipse.tycho.surefire.osgibooter_2.2.0
17:39:09 [2021-03-13T22:39:09.605Z] 	at org.eclipse.osgi.internal.loader.BundleLoader.findClass(BundleLoader.java:516)
17:39:09 [2021-03-13T22:39:09.605Z] 	at org.eclipse.osgi.internal.loader.ModuleClassLoader.loadClass(ModuleClassLoader.java:171)
17:39:09 [2021-03-13T22:39:09.605Z] 	at java.base/java.lang.ClassLoader.loadClass(ClassLoader.java:522)
17:39:09 [2021-03-13T22:39:09.605Z] 	... 31 more
17:39:09 [2021-03-13T22:39:09.605Z] 
17:39:09 [2021-03-13T22:39:09.605Z] Mar 13, 2021 10:39:09 PM org.junit.platform.launcher.core.DefaultLauncher handleThrowable
17:39:09 [2021-03-13T22:39:09.605Z] WARNING: TestEngine with ID 'junit-vintage' failed to discover tests
17:39:09 [2021-03-13T22:39:09.605Z] java.lang.NoClassDefFoundError: org/junit/runners/model/RunnerBuilder
17:39:09 [2021-03-13T22:39:09.605Z] 	at org.junit.vintage.engine.discovery.VintageDiscoverer.<init>(VintageDiscoverer.java:48)
17:39:09 [2021-03-13T22:39:09.605Z] 	at org.junit.vintage.engine.VintageTestEngine.discover(VintageTestEngine.java:65)
17:39:09 [2021-03-13T22:39:09.605Z] 	at org.junit.platform.launcher.core.DefaultLauncher.discoverEngineRoot(DefaultLauncher.java:130)
17:39:09 [2021-03-13T22:39:09.605Z] 	at org.junit.platform.launcher.core.DefaultLauncher.discoverRoot(DefaultLauncher.java:117)
17:39:09 [2021-03-13T22:39:09.605Z] 	at org.junit.platform.launcher.core.DefaultLauncher.discover(DefaultLauncher.java:82)
17:39:09 [2021-03-13T22:39:09.605Z] 	at org.apache.maven.surefire.junitplatform.TestPlanScannerFilter.accept(TestPlanScannerFilter.java:56)
17:39:09 [2021-03-13T22:39:09.605Z] 	at org.apache.maven.surefire.util.DefaultScanResult.applyFilter(DefaultScanResult.java:102)
17:39:09 [2021-03-13T22:39:09.605Z] 	at org.apache.maven.surefire.junitplatform.JUnitPlatformProvider.scanClasspath(JUnitPlatformProvider.java:143)
17:39:09 [2021-03-13T22:39:09.605Z] 	at org.apache.maven.surefire.junitplatform.JUnitPlatformProvider.invoke(JUnitPlatformProvider.java:124)
17:39:09 [2021-03-13T22:39:09.605Z] 	at java.base/jdk.internal.reflect.NativeMethodAccessorImpl.invoke0(Native Method)
17:39:09 [2021-03-13T22:39:09.605Z] 	at java.base/jdk.internal.reflect.NativeMethodAccessorImpl.invoke(NativeMethodAccessorImpl.java:64)
17:39:09 [2021-03-13T22:39:09.605Z] 	at java.base/jdk.internal.reflect.DelegatingMethodAccessorImpl.invoke(DelegatingMethodAccessorImpl.java:43)
17:39:09 [2021-03-13T22:39:09.605Z] 	at java.base/java.lang.reflect.Method.invoke(Method.java:564)
17:39:09 [2021-03-13T22:39:09.605Z] 	at org.apache.maven.surefire.util.ReflectionUtils.invokeMethodWithArray2(ReflectionUtils.java:206)
17:39:09 [2021-03-13T22:39:09.605Z] 	at org.apache.maven.surefire.booter.ProviderFactory$ProviderProxy.invoke(ProviderFactory.java:161)
17:39:09 [2021-03-13T22:39:09.605Z] 	at org.apache.maven.surefire.booter.ProviderFactory.invokeProvider(ProviderFactory.java:84)
17:39:09 [2021-03-13T22:39:09.605Z] 	at org.eclipse.tycho.surefire.osgibooter.OsgiSurefireBooter.run(OsgiSurefireBooter.java:116)
17:39:09 [2021-03-13T22:39:09.605Z] 	at org.eclipse.tycho.surefire.osgibooter.HeadlessTestApplication.start(HeadlessTestApplication.java:23)
17:39:09 [2021-03-13T22:39:09.605Z] 	at org.eclipse.equinox.internal.app.EclipseAppHandle.run(EclipseAppHandle.java:203)
17:39:09 [2021-03-13T22:39:09.605Z] 	at org.eclipse.core.runtime.internal.adaptor.EclipseAppLauncher.runApplication(EclipseAppLauncher.java:134)
17:39:09 [2021-03-13T22:39:09.605Z] 	at org.eclipse.core.runtime.internal.adaptor.EclipseAppLauncher.start(EclipseAppLauncher.java:104)
17:39:09 [2021-03-13T22:39:09.605Z] 	at org.eclipse.core.runtime.adaptor.EclipseStarter.run(EclipseStarter.java:401)
17:39:09 [2021-03-13T22:39:09.605Z] 	at org.eclipse.core.runtime.adaptor.EclipseStarter.run(EclipseStarter.java:255)
17:39:09 [2021-03-13T22:39:09.605Z] 	at java.base/jdk.internal.reflect.NativeMethodAccessorImpl.invoke0(Native Method)
17:39:09 [2021-03-13T22:39:09.605Z] 	at java.base/jdk.internal.reflect.NativeMethodAccessorImpl.invoke(NativeMethodAccessorImpl.java:64)
17:39:09 [2021-03-13T22:39:09.605Z] 	at java.base/jdk.internal.reflect.DelegatingMethodAccessorImpl.invoke(DelegatingMethodAccessorImpl.java:43)
17:39:09 [2021-03-13T22:39:09.605Z] 	at java.base/java.lang.reflect.Method.invoke(Method.java:564)
17:39:09 [2021-03-13T22:39:09.605Z] 	at org.eclipse.equinox.launcher.Main.invokeFramework(Main.java:657)
17:39:09 [2021-03-13T22:39:09.605Z] 	at org.eclipse.equinox.launcher.Main.basicRun(Main.java:594)
17:39:09 [2021-03-13T22:39:09.605Z] 	at org.eclipse.equinox.launcher.Main.run(Main.java:1465)
17:39:09 [2021-03-13T22:39:09.605Z] 	at org.eclipse.equinox.launcher.Main.main(Main.java:1438)
17:39:09 [2021-03-13T22:39:09.605Z] Caused by: java.lang.ClassNotFoundException: org.junit.runners.model.RunnerBuilder cannot be found by org.eclipse.tycho.surefire.osgibooter_2.2.0
17:39:09 [2021-03-13T22:39:09.605Z] 	at org.eclipse.osgi.internal.loader.BundleLoader.findClass(BundleLoader.java:516)
17:39:09 [2021-03-13T22:39:09.605Z] 	at org.eclipse.osgi.internal.loader.ModuleClassLoader.loadClass(ModuleClassLoader.java:171)
17:39:09 [2021-03-13T22:39:09.605Z] 	at java.base/java.lang.ClassLoader.loadClass(ClassLoader.java:522)
17:39:09 [2021-03-13T22:39:09.605Z] 	... 31 more
17:39:09 [2021-03-13T22:39:09.605Z] 
17:39:09 [2021-03-13T22:39:09.605Z] Mar 13, 2021 10:39:09 PM org.junit.platform.launcher.core.DefaultLauncher handleThrowable
17:39:09 [2021-03-13T22:39:09.605Z] WARNING: TestEngine with ID 'junit-vintage' failed to discover tests
17:39:09 [2021-03-13T22:39:09.605Z] java.lang.NoClassDefFoundError: org/junit/runners/model/RunnerBuilder
17:39:09 [2021-03-13T22:39:09.606Z] 	at org.junit.vintage.engine.discovery.VintageDiscoverer.<init>(VintageDiscoverer.java:48)
17:39:09 [2021-03-13T22:39:09.606Z] 	at org.junit.vintage.engine.VintageTestEngine.discover(VintageTestEngine.java:65)
17:39:09 [2021-03-13T22:39:09.606Z] 	at org.junit.platform.launcher.core.DefaultLauncher.discoverEngineRoot(DefaultLauncher.java:130)
17:39:09 [2021-03-13T22:39:09.606Z] 	at org.junit.platform.launcher.core.DefaultLauncher.discoverRoot(DefaultLauncher.java:117)
17:39:09 [2021-03-13T22:39:09.606Z] 	at org.junit.platform.launcher.core.DefaultLauncher.execute(DefaultLauncher.java:90)
17:39:09 [2021-03-13T22:39:09.606Z] 	at org.apache.maven.surefire.junitplatform.JUnitPlatformProvider.invokeAllTests(JUnitPlatformProvider.java:150)
17:39:09 [2021-03-13T22:39:09.606Z] 	at org.apache.maven.surefire.junitplatform.JUnitPlatformProvider.invoke(JUnitPlatformProvider.java:124)
17:39:09 [2021-03-13T22:39:09.606Z] 	at java.base/jdk.internal.reflect.NativeMethodAccessorImpl.invoke0(Native Method)
17:39:09 [2021-03-13T22:39:09.606Z] 	at java.base/jdk.internal.reflect.NativeMethodAccessorImpl.invoke(NativeMethodAccessorImpl.java:64)
17:39:09 [2021-03-13T22:39:09.606Z] 	at java.base/jdk.internal.reflect.DelegatingMethodAccessorImpl.invoke(DelegatingMethodAccessorImpl.java:43)
17:39:09 [2021-03-13T22:39:09.606Z] 	at java.base/java.lang.reflect.Method.invoke(Method.java:564)
17:39:09 [2021-03-13T22:39:09.606Z] 	at org.apache.maven.surefire.util.ReflectionUtils.invokeMethodWithArray2(ReflectionUtils.java:206)
17:39:09 [2021-03-13T22:39:09.606Z] 	at org.apache.maven.surefire.booter.ProviderFactory$ProviderProxy.invoke(ProviderFactory.java:161)
17:39:09 [2021-03-13T22:39:09.606Z] 	at org.apache.maven.surefire.booter.ProviderFactory.invokeProvider(ProviderFactory.java:84)
17:39:09 [2021-03-13T22:39:09.606Z] 	at org.eclipse.tycho.surefire.osgibooter.OsgiSurefireBooter.run(OsgiSurefireBooter.java:116)
17:39:09 [2021-03-13T22:39:09.606Z] 	at org.eclipse.tycho.surefire.osgibooter.HeadlessTestApplication.start(HeadlessTestApplication.java:23)
17:39:09 [2021-03-13T22:39:09.606Z] 	at org.eclipse.equinox.internal.app.EclipseAppHandle.run(EclipseAppHandle.java:203)
17:39:09 [2021-03-13T22:39:09.606Z] 	at org.eclipse.core.runtime.internal.adaptor.EclipseAppLauncher.runApplication(EclipseAppLauncher.java:134)
17:39:09 [2021-03-13T22:39:09.606Z] 	at org.eclipse.core.runtime.internal.adaptor.EclipseAppLauncher.start(EclipseAppLauncher.java:104)
17:39:09 [2021-03-13T22:39:09.606Z] 	at org.eclipse.core.runtime.adaptor.EclipseStarter.run(EclipseStarter.java:401)
17:39:09 [2021-03-13T22:39:09.606Z] 	at org.eclipse.core.runtime.adaptor.EclipseStarter.run(EclipseStarter.java:255)
17:39:09 [2021-03-13T22:39:09.606Z] 	at java.base/jdk.internal.reflect.NativeMethodAccessorImpl.invoke0(Native Method)
17:39:09 [2021-03-13T22:39:09.606Z] 	at java.base/jdk.internal.reflect.NativeMethodAccessorImpl.invoke(NativeMethodAccessorImpl.java:64)
17:39:09 [2021-03-13T22:39:09.606Z] 	at java.base/jdk.internal.reflect.DelegatingMethodAccessorImpl.invoke(DelegatingMethodAccessorImpl.java:43)
17:39:09 [2021-03-13T22:39:09.606Z] 	at java.base/java.lang.reflect.Method.invoke(Method.java:564)
17:39:09 [2021-03-13T22:39:09.606Z] 	at org.eclipse.equinox.launcher.Main.invokeFramework(Main.java:657)
17:39:09 [2021-03-13T22:39:09.606Z] 	at org.eclipse.equinox.launcher.Main.basicRun(Main.java:594)
17:39:09 [2021-03-13T22:39:09.606Z] 	at org.eclipse.equinox.launcher.Main.run(Main.java:1465)
17:39:09 [2021-03-13T22:39:09.606Z] 	at org.eclipse.equinox.launcher.Main.main(Main.java:1438)
17:39:09 [2021-03-13T22:39:09.606Z] Caused by: java.lang.ClassNotFoundException: org.junit.runners.model.RunnerBuilder cannot be found by org.eclipse.tycho.surefire.osgibooter_2.2.0
17:39:09 [2021-03-13T22:39:09.606Z] 	at org.eclipse.osgi.internal.loader.BundleLoader.findClass(BundleLoader.java:516)
17:39:09 [2021-03-13T22:39:09.606Z] 	at org.eclipse.osgi.internal.loader.ModuleClassLoader.loadClass(ModuleClassLoader.java:171)
17:39:09 [2021-03-13T22:39:09.606Z] 	at java.base/java.lang.ClassLoader.loadClass(ClassLoader.java:522)
17:39:09 [2021-03-13T22:39:09.606Z] 	... 29 more
17:39:09 [2021-03-13T22:39:09.606Z] 
17:39:09 [2021-03-13T22:39:09.606Z] Running org.eclipse.ease.ui.help.hovers.ModuleHelpTest
17:39:09 [2021-03-13T22:39:09.606Z] Tests run: 4, Failures: 0, Errors: 0, Skipped: 4, Time elapsed: 0.036 s - in org.eclipse.ease.ui.help.hovers.ModuleHelpTest
17:39:09 [2021-03-13T22:39:09.606Z] getModuleHelpLocation skipped
17:39:09 [2021-03-13T22:39:09.606Z] getModuleHelp skipped
17:39:09 [2021-03-13T22:39:09.606Z] getMethodHelp skipped
17:39:09 [2021-03-13T22:39:09.606Z] getConstantHelp skipped
17:39:09 [2021-03-13T22:39:09.606Z] Running org.eclipse.ease.ui.completion.provider.AbstractFileLocationCompletionProviderTest
17:39:09 [2021-03-13T22:39:09.606Z] Tests run: 8, Failures: 0, Errors: 0, Skipped: 8, Time elapsed: 0.23 s - in org.eclipse.ease.ui.completion.provider.AbstractFileLocationCompletionProviderTest
17:39:09 [2021-03-13T22:39:09.606Z] workspaceProjectProposals skipped
17:39:09 [2021-03-13T22:39:09.606Z] checkOperatingSystem skipped
17:39:09 [2021-03-13T22:39:09.606Z] absoluteRootWorkspaceProposals skipped
17:39:09 [2021-03-13T22:39:09.606Z] workspaceFolderProposals skipped
17:39:09 [2021-03-13T22:39:09.606Z] fileSystemFolderProposals skipped
17:39:09 [2021-03-13T22:39:09.606Z] workspaceProposals skipped
17:39:09 [2021-03-13T22:39:09.606Z] relativeRootWorkspaceProposals skipped
17:39:09 [2021-03-13T22:39:09.606Z] fileSystemRootProposals skipped
17:39:09 [2021-03-13T22:39:09.606Z] Running org.eclipse.ease.ui.completion.CompletionContextTest
17:39:09 [2021-03-13T22:39:09.606Z] Tests run: 9, Failures: 0, Errors: 0, Skipped: 0, Time elapsed: 0.016 s - in org.eclipse.ease.ui.completion.CompletionContextTest
17:39:09 [2021-03-13T22:39:09.606Z] resolveStaticClass  Time elapsed: 0.013 s
17:39:09 [2021-03-13T22:39:09.606Z] resolveClassWithFilter  Time elapsed: 0.001 s
17:39:09 [2021-03-13T22:39:09.606Z] simplifyCalls  Time elapsed: 0 s
17:39:09 [2021-03-13T22:39:09.606Z] resolveClass  Time elapsed: 0.001 s
17:39:09 [2021-03-13T22:39:09.606Z] replaceEscapedStringLiterals  Time elapsed: 0 s
17:39:09 [2021-03-13T22:39:09.606Z] replaceSimpleStringLiterals  Time elapsed: 0 s
17:39:09 [2021-03-13T22:39:09.606Z] resolveStaticClassWithFilter  Time elapsed: 0.001 s
17:39:09 [2021-03-13T22:39:09.606Z] resolveClassWithParameters  Time elapsed: 0 s
17:39:09 [2021-03-13T22:39:09.606Z] replaceMultipleStringLiterals  Time elapsed: 0 s
17:39:09 [2021-03-13T22:39:09.606Z] Running org.eclipse.ease.ui.dnd.ModulesDropHandlerTest
17:39:09 [2021-03-13T22:39:09.862Z] Tests run: 2, Failures: 0, Errors: 0, Skipped: 0, Time elapsed: 0.436 s - in org.eclipse.ease.ui.dnd.ModulesDropHandlerTest
17:39:09 [2021-03-13T22:39:09.862Z] accepts_true_for_ModuleEntry  Time elapsed: 0.356 s
17:39:09 [2021-03-13T22:39:09.862Z] accepts_true_for_ModuleDefinition  Time elapsed: 0.079 s
17:39:09 [2021-03-13T22:39:09.862Z] 
17:39:09 [2021-03-13T22:39:09.862Z] Results:
17:39:09 [2021-03-13T22:39:09.862Z] 
17:39:09 [2021-03-13T22:39:09.862Z] Tests run: 23, Failures: 0, Errors: 0, Skipped: 12
17:39:09 [2021-03-13T22:39:09.862Z] 
17:39:10 [2021-03-13T22:39:10.423Z] [INFO] All tests passed!
17:39:10 [2021-03-13T22:39:10.423Z] [INFO] 
17:39:10 [2021-03-13T22:39:10.423Z] [INFO] --- maven-install-plugin:2.3.1:install (default-install) @ org.eclipse.ease.ui.test ---
17:39:10 [2021-03-13T22:39:10.423Z] [INFO] Installing /home/jenkins/agent/workspace/ease.verify.core.target.2019-03/tests/org.eclipse.ease.ui.test/target/org.eclipse.ease.ui.test-0.8.0-SNAPSHOT.jar to /home/jenkins/.m2/repository/org/eclipse/ease/org.eclipse.ease.ui.test/0.8.0-SNAPSHOT/org.eclipse.ease.ui.test-0.8.0-SNAPSHOT.jar
17:39:10 [2021-03-13T22:39:10.423Z] [INFO] Installing /home/jenkins/agent/workspace/ease.verify.core.target.2019-03/tests/org.eclipse.ease.ui.test/pom.xml to /home/jenkins/.m2/repository/org/eclipse/ease/org.eclipse.ease.ui.test/0.8.0-SNAPSHOT/org.eclipse.ease.ui.test-0.8.0-SNAPSHOT.pom
17:39:10 [2021-03-13T22:39:10.423Z] [INFO] Installing /home/jenkins/agent/workspace/ease.verify.core.target.2019-03/tests/org.eclipse.ease.ui.test/target/p2content.xml to /home/jenkins/.m2/repository/org/eclipse/ease/org.eclipse.ease.ui.test/0.8.0-SNAPSHOT/org.eclipse.ease.ui.test-0.8.0-SNAPSHOT-p2metadata.xml
17:39:10 [2021-03-13T22:39:10.423Z] [INFO] Installing /home/jenkins/agent/workspace/ease.verify.core.target.2019-03/tests/org.eclipse.ease.ui.test/target/p2artifacts.xml to /home/jenkins/.m2/repository/org/eclipse/ease/org.eclipse.ease.ui.test/0.8.0-SNAPSHOT/org.eclipse.ease.ui.test-0.8.0-SNAPSHOT-p2artifacts.xml
17:39:10 [2021-03-13T22:39:10.423Z] [INFO] 
17:39:10 [2021-03-13T22:39:10.423Z] [INFO] --- tycho-p2-plugin:2.2.0:update-local-index (default-update-local-index) @ org.eclipse.ease.ui.test ---
17:39:10 [2021-03-13T22:39:10.423Z] [INFO] 
17:39:10 [2021-03-13T22:39:10.423Z] [INFO] ---------< org.eclipse.ease:org.eclipse.ease.releng.coverage >----------
17:39:10 [2021-03-13T22:39:10.423Z] [INFO] Building org.eclipse.ease.releng.coverage 0.8.0-SNAPSHOT         [47/48]
17:39:10 [2021-03-13T22:39:10.423Z] [INFO] --------------------------------[ pom ]---------------------------------
17:39:10 [2021-03-13T22:39:10.423Z] [INFO] 
17:39:10 [2021-03-13T22:39:10.423Z] [INFO] --- maven-clean-plugin:2.5:clean (default-clean) @ org.eclipse.ease.releng.coverage ---
17:39:10 [2021-03-13T22:39:10.423Z] [INFO] 
17:39:10 [2021-03-13T22:39:10.423Z] [INFO] --- jacoco-maven-plugin:0.8.6:report-aggregate (default) @ org.eclipse.ease.releng.coverage ---
17:39:10 [2021-03-13T22:39:10.703Z] [INFO] Loading execution data file /home/jenkins/agent/workspace/ease.verify.core.target.2019-03/tests/org.eclipse.ease.test/target/jacoco.exec
17:39:10 [2021-03-13T22:39:10.703Z] [INFO] Loading execution data file /home/jenkins/agent/workspace/ease.verify.core.target.2019-03/tests/org.eclipse.ease.lang.javascript.rhino.test/target/jacoco.exec
17:39:10 [2021-03-13T22:39:10.703Z] [INFO] Loading execution data file /home/jenkins/agent/workspace/ease.verify.core.target.2019-03/tests/org.eclipse.ease.lang.javascript.test/target/jacoco.exec
17:39:10 [2021-03-13T22:39:10.703Z] [INFO] Loading execution data file /home/jenkins/agent/workspace/ease.verify.core.target.2019-03/tests/org.eclipse.ease.lang.python.test/target/jacoco.exec
17:39:10 [2021-03-13T22:39:10.703Z] [INFO] Loading execution data file /home/jenkins/agent/workspace/ease.verify.core.target.2019-03/tests/org.eclipse.ease.lang.python.jython.test/target/jacoco.exec
17:39:10 [2021-03-13T22:39:10.703Z] [INFO] Loading execution data file /home/jenkins/agent/workspace/ease.verify.core.target.2019-03/tests/org.eclipse.ease.lang.scriptarchive.test/target/jacoco.exec
17:39:10 [2021-03-13T22:39:10.703Z] [INFO] Loading execution data file /home/jenkins/agent/workspace/ease.verify.core.target.2019-03/tests/org.eclipse.ease.ui.scripts.test/target/jacoco.exec
17:39:10 [2021-03-13T22:39:10.703Z] [INFO] Loading execution data file /home/jenkins/agent/workspace/ease.verify.core.target.2019-03/tests/org.eclipse.ease.ui.test/target/jacoco.exec
17:39:10 [2021-03-13T22:39:10.958Z] [INFO] Analyzed bundle 'org.eclipse.ease' with 104 classes
17:39:10 [2021-03-13T22:39:10.958Z] [INFO] Analyzed bundle 'org.eclipse.ease.classloader' with 1 classes
17:39:11 [2021-03-13T22:39:11.214Z] [INFO] Analyzed bundle 'org.eclipse.ease.ui' with 210 classes
17:39:11 [2021-03-13T22:39:11.214Z] [INFO] Analyzed bundle 'org.eclipse.ease.ui.completions.java' with 13 classes
17:39:11 [2021-03-13T22:39:11.470Z] [INFO] Analyzed bundle 'org.eclipse.ease.ui.scripts' with 159 classes
17:39:11 [2021-03-13T22:39:11.470Z] [INFO] Analyzed bundle 'org.eclipse.ease.help' with 0 classes
17:39:11 [2021-03-13T22:39:11.470Z] [INFO] Analyzed bundle 'org.eclipse.ease.lang.javascript' with 4 classes
17:39:11 [2021-03-13T22:39:11.470Z] [INFO] Analyzed bundle 'org.eclipse.ease.lang.javascript.ui' with 4 classes
17:39:11 [2021-03-13T22:39:11.470Z] [INFO] Analyzed bundle 'org.eclipse.ease.lang.javascript.rhino' with 21 classes
17:39:11 [2021-03-13T22:39:11.470Z] [INFO] Analyzed bundle 'org.eclipse.ease.lang.javascript.nashorn' with 2 classes
17:39:11 [2021-03-13T22:39:11.470Z] [INFO] Analyzed bundle 'org.eclipse.ease.lang.python' with 21 classes
17:39:11 [2021-03-13T22:39:11.470Z] [INFO] Analyzed bundle 'org.eclipse.ease.lang.python.jython' with 13 classes
17:39:11 [2021-03-13T22:39:11.470Z] [INFO] Analyzed bundle 'org.eclipse.ease.lang.python.py4j' with 11 classes
17:39:11 [2021-03-13T22:39:11.470Z] [INFO] Analyzed bundle 'org.eclipse.ease.lang.jvm.compiled' with 2 classes
17:39:11 [2021-03-13T22:39:11.470Z] [INFO] Analyzed bundle 'org.eclipse.ease.lang.groovy' with 3 classes
17:39:11 [2021-03-13T22:39:11.726Z] [INFO] Analyzed bundle 'org.eclipse.ease.lang.groovy.interpreter' with 3 classes
17:39:11 [2021-03-13T22:39:11.726Z] [INFO] Analyzed bundle 'org.eclipse.ease.lang.ruby' with 3 classes
17:39:11 [2021-03-13T22:39:11.726Z] [INFO] Analyzed bundle 'org.eclipse.ease.lang.ruby.jruby' with 2 classes
17:39:11 [2021-03-13T22:39:11.726Z] [INFO] Analyzed bundle 'org.eclipse.ease.lang.scriptarchive' with 3 classes
17:39:11 [2021-03-13T22:39:11.726Z] [INFO] Analyzed bundle 'org.eclipse.ease.lang.scriptarchive.ui' with 8 classes
17:39:11 [2021-03-13T22:39:11.726Z] [INFO] Analyzed bundle 'org.eclipse.ease.lang.unittest' with 50 classes
17:39:11 [2021-03-13T22:39:11.726Z] [INFO] Analyzed bundle 'org.eclipse.ease.lang.unittest.ui' with 79 classes
17:39:11 [2021-03-13T22:39:11.726Z] [INFO] 
17:39:11 [2021-03-13T22:39:11.726Z] [INFO] --- maven-install-plugin:2.4:install (default-install) @ org.eclipse.ease.releng.coverage ---
17:39:11 [2021-03-13T22:39:11.727Z] [INFO] Installing /home/jenkins/agent/workspace/ease.verify.core.target.2019-03/releng/org.eclipse.ease.releng.coverage/pom.xml to /home/jenkins/.m2/repository/org/eclipse/ease/org.eclipse.ease.releng.coverage/0.8.0-SNAPSHOT/org.eclipse.ease.releng.coverage-0.8.0-SNAPSHOT.pom
17:39:11 [2021-03-13T22:39:11.727Z] [INFO] 
17:39:11 [2021-03-13T22:39:11.727Z] [INFO] ---------------------< org.eclipse.ease:ease.core >---------------------
17:39:11 [2021-03-13T22:39:11.727Z] [INFO] Building EASE (Incubation) 0.4.0-SNAPSHOT                        [48/48]
17:39:11 [2021-03-13T22:39:11.727Z] [INFO] --------------------------------[ pom ]---------------------------------
17:39:11 [2021-03-13T22:39:11.988Z] [INFO] 
17:39:11 [2021-03-13T22:39:11.988Z] [INFO] --- maven-clean-plugin:2.5:clean (default-clean) @ ease.core ---
17:39:11 [2021-03-13T22:39:11.988Z] [INFO] 
17:39:11 [2021-03-13T22:39:11.988Z] [INFO] --- maven-install-plugin:2.4:install (default-install) @ ease.core ---
17:39:11 [2021-03-13T22:39:11.988Z] [INFO] Installing /home/jenkins/agent/workspace/ease.verify.core.target.2019-03/pom.xml to /home/jenkins/.m2/repository/org/eclipse/ease/ease.core/0.4.0-SNAPSHOT/ease.core-0.4.0-SNAPSHOT.pom
17:39:11 [2021-03-13T22:39:11.988Z] [INFO] ------------------------------------------------------------------------
17:39:11 [2021-03-13T22:39:11.988Z] [INFO] Reactor Summary:
17:39:11 [2021-03-13T22:39:11.988Z] [INFO] 
17:39:11 [2021-03-13T22:39:11.988Z] [INFO] org.eclipse.ease.classloader 0.8.0-SNAPSHOT ........ SUCCESS [ 23.701 s]
17:39:11 [2021-03-13T22:39:11.988Z] [INFO] org.eclipse.ease 0.8.0-SNAPSHOT .................... SUCCESS [  2.967 s]
17:39:11 [2021-03-13T22:39:11.988Z] [INFO] org.eclipse.ease.ui 0.8.0-SNAPSHOT ................. SUCCESS [  3.199 s]
17:39:11 [2021-03-13T22:39:11.988Z] [INFO] org.eclipse.ease.ui.completions.java 0.8.0-SNAPSHOT  SUCCESS [  2.090 s]
17:39:11 [2021-03-13T22:39:11.988Z] [INFO] org.eclipse.ease.ui.scripts 0.8.0-SNAPSHOT ......... SUCCESS [  3.098 s]
17:39:11 [2021-03-13T22:39:11.988Z] [INFO] org.eclipse.ease.releng 0.8.0-SNAPSHOT ............. SUCCESS [  0.483 s]
17:39:11 [2021-03-13T22:39:11.988Z] [INFO] org.eclipse.ease.lang.javascript 0.8.0-SNAPSHOT .... SUCCESS [  1.364 s]
17:39:11 [2021-03-13T22:39:11.988Z] [INFO] org.eclipse.ease.lang.scriptarchive 0.8.0-SNAPSHOT . SUCCESS [  1.750 s]
17:39:11 [2021-03-13T22:39:11.988Z] [INFO] org.eclipse.ease.lang.python 0.8.0-SNAPSHOT ........ SUCCESS [  1.911 s]
17:39:11 [2021-03-13T22:39:11.988Z] [INFO] org.eclipse.ease.lang.python.py4j 0.8.0-SNAPSHOT ... SUCCESS [  1.527 s]
17:39:11 [2021-03-13T22:39:11.988Z] [INFO] org.eclipse.ease.lang.groovy 0.8.0-SNAPSHOT ........ SUCCESS [  1.780 s]
17:39:11 [2021-03-13T22:39:11.988Z] [INFO] org.eclipse.ease.lang.groovy.interpreter 0.8.0-SNAPSHOT SUCCESS [  1.269 s]
17:39:11 [2021-03-13T22:39:11.988Z] [INFO] org.eclipse.ease.lang.unittest 0.8.0-SNAPSHOT ...... SUCCESS [  1.946 s]
17:39:11 [2021-03-13T22:39:11.988Z] [INFO] org.eclipse.ease.lang.unittest.ui 0.8.0-SNAPSHOT ... SUCCESS [  2.064 s]
17:39:11 [2021-03-13T22:39:11.988Z] [INFO] org.eclipse.ease.lang.ruby 0.8.0-SNAPSHOT .......... SUCCESS [  1.254 s]
17:39:11 [2021-03-13T22:39:11.988Z] [INFO] org.eclipse.ease.lang.ruby.jruby 0.8.0-SNAPSHOT .... SUCCESS [  1.647 s]
17:39:11 [2021-03-13T22:39:11.988Z] [INFO] org.eclipse.ease.lang.javascript.nashorn 0.8.0-SNAPSHOT SUCCESS [  2.192 s]
17:39:11 [2021-03-13T22:39:11.988Z] [INFO] org.eclipse.ease.lang.javascript.rhino 0.8.0-SNAPSHOT SUCCESS [  1.729 s]
17:39:11 [2021-03-13T22:39:11.988Z] [INFO] org.eclipse.ease.lang.python.jython 0.8.0-SNAPSHOT . SUCCESS [  1.664 s]
17:39:11 [2021-03-13T22:39:11.988Z] [INFO] org.eclipse.ease.lang.javascript.ui 0.8.0-SNAPSHOT . SUCCESS [  1.719 s]
17:39:11 [2021-03-13T22:39:11.988Z] [INFO] org.eclipse.ease.lang.jvm.compiled 0.8.0-SNAPSHOT .. SUCCESS [  1.405 s]
17:39:11 [2021-03-13T22:39:11.988Z] [INFO] org.eclipse.ease.lang.scriptarchive.ui 0.8.0-SNAPSHOT SUCCESS [  1.424 s]
17:39:11 [2021-03-13T22:39:11.988Z] [INFO] org.eclipse.ease.help 0.8.0-SNAPSHOT ............... SUCCESS [  8.045 s]
17:39:11 [2021-03-13T22:39:11.988Z] [INFO] org.eclipse.ease.feature 0.8.0-SNAPSHOT ............ SUCCESS [  0.163 s]
17:39:11 [2021-03-13T22:39:11.988Z] [INFO] org.eclipse.ease.ui.feature 0.8.0-SNAPSHOT ......... SUCCESS [  0.192 s]
17:39:11 [2021-03-13T22:39:11.988Z] [INFO] org.eclipse.ease.lang.javascript.feature 0.8.0-SNAPSHOT SUCCESS [  0.349 s]
17:39:11 [2021-03-13T22:39:11.988Z] [INFO] org.eclipse.ease.lang.python.feature 0.8.0-SNAPSHOT  SUCCESS [  0.257 s]
17:39:11 [2021-03-13T22:39:11.988Z] [INFO] org.eclipse.ease.python.jython.feature 0.8.0-SNAPSHOT SUCCESS [  0.070 s]
17:39:11 [2021-03-13T22:39:11.988Z] [INFO] org.eclipse.ease.lang.python.py4j.feature 0.8.0-SNAPSHOT SUCCESS [  0.092 s]
17:39:11 [2021-03-13T22:39:11.988Z] [INFO] org.eclipse.ease.lang.jvm.feature 0.8.0-SNAPSHOT ... SUCCESS [  0.091 s]
17:39:11 [2021-03-13T22:39:11.988Z] [INFO] org.eclipse.ease.lang.groovy.feature 0.8.0-SNAPSHOT  SUCCESS [  0.092 s]
17:39:11 [2021-03-13T22:39:11.988Z] [INFO] org.eclipse.ease.lang.ruby.feature 0.8.0-SNAPSHOT .. SUCCESS [  0.090 s]
17:39:11 [2021-03-13T22:39:11.988Z] [INFO] org.eclipse.ease.lang.scriptarchive.feature 0.8.0-SNAPSHOT SUCCESS [  0.115 s]
17:39:11 [2021-03-13T22:39:11.989Z] [INFO] org.eclipse.ease.lang.unittest.feature 0.8.0-SNAPSHOT SUCCESS [  0.100 s]
17:39:11 [2021-03-13T22:39:11.989Z] [INFO] org.eclipse.ease.releng.target 0.8.0-SNAPSHOT ...... SUCCESS [  0.005 s]
17:39:11 [2021-03-13T22:39:11.989Z] [INFO] org.eclipse.ease.releng.p2 0.8.0-SNAPSHOT .......... SUCCESS [  4.345 s]
17:39:11 [2021-03-13T22:39:11.989Z] [INFO] org.eclipse.ease.testhelper 0.8.0-SNAPSHOT ......... SUCCESS [  4.032 s]
17:39:11 [2021-03-13T22:39:11.989Z] [INFO] org.eclipse.ease.test 0.8.0-SNAPSHOT ............... SUCCESS [ 10.583 s]
17:39:11 [2021-03-13T22:39:11.989Z] [INFO] org.eclipse.ease.lang.javascript.rhino.test 0.8.0-SNAPSHOT SUCCESS [ 17.248 s]
17:39:11 [2021-03-13T22:39:11.989Z] [INFO] org.eclipse.ease.lang.javascript.test 0.8.0-SNAPSHOT SUCCESS [  3.810 s]
17:39:11 [2021-03-13T22:39:11.989Z] [INFO] org.eclipse.ease.lang.python.test 0.8.0-SNAPSHOT ... SUCCESS [  3.662 s]
17:39:11 [2021-03-13T22:39:11.989Z] [INFO] org.eclipse.ease.lang.python.jython.test 0.8.0-SNAPSHOT SUCCESS [ 19.327 s]
17:39:11 [2021-03-13T22:39:11.989Z] [INFO] org.eclipse.ease.lang.scriptarchive.test 0.8.0-SNAPSHOT SUCCESS [  4.134 s]
17:39:11 [2021-03-13T22:39:11.989Z] [INFO] org.eclipse.ease.lang.unittest.test 0.8.0-SNAPSHOT . SUCCESS [  4.887 s]
17:39:11 [2021-03-13T22:39:11.989Z] [INFO] org.eclipse.ease.ui.scripts.test 0.8.0-SNAPSHOT .... SUCCESS [  3.124 s]
17:39:11 [2021-03-13T22:39:11.989Z] [INFO] org.eclipse.ease.ui.test 0.8.0-SNAPSHOT ............ SUCCESS [  4.528 s]
17:39:11 [2021-03-13T22:39:11.989Z] [INFO] org.eclipse.ease.releng.coverage 0.8.0-SNAPSHOT .... SUCCESS [  1.305 s]
17:39:11 [2021-03-13T22:39:11.989Z] [INFO] EASE (Incubation) 0.4.0-SNAPSHOT ................... SUCCESS [  0.213 s]
17:39:11 [2021-03-13T22:39:11.989Z] [INFO] ------------------------------------------------------------------------
17:39:11 [2021-03-13T22:39:11.989Z] [INFO] BUILD SUCCESS
17:39:11 [2021-03-13T22:39:11.989Z] [INFO] ------------------------------------------------------------------------
17:39:11 [2021-03-13T22:39:11.989Z] [INFO] Total time:  03:39 min
17:39:11 [2021-03-13T22:39:11.989Z] [INFO] Finished at: 2021-03-13T22:39:11Z
17:39:11 [2021-03-13T22:39:11.989Z] [INFO] ------------------------------------------------------------------------
17:39:11 [2021-03-13T22:39:11.989Z] [INFO] [jenkins-event-spy] Generated /home/jenkins/agent/workspace/ease.verify.core.target.2019-03@tmp/withMaven7a46d5a8/maven-spy-20210313-223532-2781494600924802072218.log