SuccessConsole Output

Skipping 728 KB.. Full Log
ang.javascript.test/target/surefire.properties]
17:39:34 [2020-11-07T22:39:34.252Z] Picked up JAVA_TOOL_OPTIONS: -Dmaven.ext.class.path="/home/jenkins/agent/workspace/ease.verify.core.target.2019-03@tmp/withMavendae5f2e9/pipeline-maven-spy.jar" -Dorg.jenkinsci.plugins.pipeline.maven.reportsFolder="/home/jenkins/agent/workspace/ease.verify.core.target.2019-03@tmp/withMavendae5f2e9" 
17:39:35 [2020-11-07T22:39:35.616Z] Running org.eclipse.ease.lang.javascript.JavaScriptCodeFactoryTest
17:39:35 [2020-11-07T22:39:35.872Z] Tests run: 1, Failures: 0, Errors: 0, Skipped: 0, Time elapsed: 0.121 s - in org.eclipse.ease.lang.javascript.JavaScriptCodeFactoryTest
17:39:35 [2020-11-07T22:39:35.872Z] testCommentCreator(org.eclipse.ease.lang.javascript.JavaScriptCodeFactoryTest)  Time elapsed: 0.004 s
17:39:35 [2020-11-07T22:39:35.872Z] Running org.eclipse.ease.lang.javascript.JavaScriptCompletionContextTest
17:39:36 [2020-11-07T22:39:36.128Z] Tests run: 8, Failures: 0, Errors: 0, Skipped: 0, Time elapsed: 0.13 s - in org.eclipse.ease.lang.javascript.JavaScriptCompletionContextTest
17:39:36 [2020-11-07T22:39:36.128Z] verifyStaticClassTypes(org.eclipse.ease.lang.javascript.JavaScriptCompletionContextTest)  Time elapsed: 0.003 s
17:39:36 [2020-11-07T22:39:36.128Z] verifyClassInstanceTypes(org.eclipse.ease.lang.javascript.JavaScriptCompletionContextTest)  Time elapsed: 0.006 s
17:39:36 [2020-11-07T22:39:36.128Z] verifyTypesForScriptEngine(org.eclipse.ease.lang.javascript.JavaScriptCompletionContextTest)  Time elapsed: 0.116 s
17:39:36 [2020-11-07T22:39:36.128Z] verifyPackageTypes(org.eclipse.ease.lang.javascript.JavaScriptCompletionContextTest)  Time elapsed: 0 s
17:39:36 [2020-11-07T22:39:36.128Z] definedVariableTypes(org.eclipse.ease.lang.javascript.JavaScriptCompletionContextTest)  Time elapsed: 0.001 s
17:39:36 [2020-11-07T22:39:36.128Z] verifyStringLiteralTypes(org.eclipse.ease.lang.javascript.JavaScriptCompletionContextTest)  Time elapsed: 0 s
17:39:36 [2020-11-07T22:39:36.128Z] verifyUnknownTypes(org.eclipse.ease.lang.javascript.JavaScriptCompletionContextTest)  Time elapsed: 0 s
17:39:36 [2020-11-07T22:39:36.128Z] verifyNoneTypes(org.eclipse.ease.lang.javascript.JavaScriptCompletionContextTest)  Time elapsed: 0 s
17:39:36 [2020-11-07T22:39:36.128Z] 
17:39:36 [2020-11-07T22:39:36.128Z] Results:
17:39:36 [2020-11-07T22:39:36.128Z] 
17:39:36 [2020-11-07T22:39:36.128Z] Tests run: 9, Failures: 0, Errors: 0, Skipped: 0
17:39:36 [2020-11-07T22:39:36.128Z] 
17:39:36 [2020-11-07T22:39:36.690Z] [INFO] All tests passed!
17:39:36 [2020-11-07T22:39:36.690Z] [INFO] 
17:39:36 [2020-11-07T22:39:36.690Z] [INFO] --- maven-install-plugin:2.3.1:install (default-install) @ org.eclipse.ease.lang.javascript.test ---
17:39:36 [2020-11-07T22:39:36.690Z] [INFO] Installing /home/jenkins/agent/workspace/ease.verify.core.target.2019-03/tests/org.eclipse.ease.lang.javascript.test/target/org.eclipse.ease.lang.javascript.test-0.8.0-SNAPSHOT.jar to /home/jenkins/.m2/repository/org/eclipse/ease/org.eclipse.ease.lang.javascript.test/0.8.0-SNAPSHOT/org.eclipse.ease.lang.javascript.test-0.8.0-SNAPSHOT.jar
17:39:36 [2020-11-07T22:39:36.690Z] [INFO] Installing /home/jenkins/agent/workspace/ease.verify.core.target.2019-03/tests/org.eclipse.ease.lang.javascript.test/pom.xml to /home/jenkins/.m2/repository/org/eclipse/ease/org.eclipse.ease.lang.javascript.test/0.8.0-SNAPSHOT/org.eclipse.ease.lang.javascript.test-0.8.0-SNAPSHOT.pom
17:39:36 [2020-11-07T22:39:36.690Z] [INFO] Installing /home/jenkins/agent/workspace/ease.verify.core.target.2019-03/tests/org.eclipse.ease.lang.javascript.test/target/org.eclipse.ease.lang.javascript.test-0.8.0-SNAPSHOT-sources.jar to /home/jenkins/.m2/repository/org/eclipse/ease/org.eclipse.ease.lang.javascript.test/0.8.0-SNAPSHOT/org.eclipse.ease.lang.javascript.test-0.8.0-SNAPSHOT-sources.jar
17:39:36 [2020-11-07T22:39:36.690Z] [INFO] Installing /home/jenkins/agent/workspace/ease.verify.core.target.2019-03/tests/org.eclipse.ease.lang.javascript.test/target/p2content.xml to /home/jenkins/.m2/repository/org/eclipse/ease/org.eclipse.ease.lang.javascript.test/0.8.0-SNAPSHOT/org.eclipse.ease.lang.javascript.test-0.8.0-SNAPSHOT-p2metadata.xml
17:39:36 [2020-11-07T22:39:36.690Z] [INFO] Installing /home/jenkins/agent/workspace/ease.verify.core.target.2019-03/tests/org.eclipse.ease.lang.javascript.test/target/p2artifacts.xml to /home/jenkins/.m2/repository/org/eclipse/ease/org.eclipse.ease.lang.javascript.test/0.8.0-SNAPSHOT/org.eclipse.ease.lang.javascript.test-0.8.0-SNAPSHOT-p2artifacts.xml
17:39:36 [2020-11-07T22:39:36.690Z] [INFO] Installing /home/jenkins/agent/workspace/ease.verify.core.target.2019-03/tests/org.eclipse.ease.lang.javascript.test/target/p2content.xml to /home/jenkins/.m2/repository/org/eclipse/ease/org.eclipse.ease.lang.javascript.test/0.8.0-SNAPSHOT/org.eclipse.ease.lang.javascript.test-0.8.0-SNAPSHOT-p2metadata.xml
17:39:36 [2020-11-07T22:39:36.690Z] [INFO] Installing /home/jenkins/agent/workspace/ease.verify.core.target.2019-03/tests/org.eclipse.ease.lang.javascript.test/target/p2artifacts.xml to /home/jenkins/.m2/repository/org/eclipse/ease/org.eclipse.ease.lang.javascript.test/0.8.0-SNAPSHOT/org.eclipse.ease.lang.javascript.test-0.8.0-SNAPSHOT-p2artifacts.xml
17:39:36 [2020-11-07T22:39:36.690Z] [INFO] 
17:39:36 [2020-11-07T22:39:36.690Z] [INFO] --- tycho-p2-plugin:1.5.0:update-local-index (default-update-local-index) @ org.eclipse.ease.lang.javascript.test ---
17:39:36 [2020-11-07T22:39:36.690Z] [INFO] 
17:39:36 [2020-11-07T22:39:36.690Z] [INFO] ---------< org.eclipse.ease:org.eclipse.ease.lang.python.test >---------
17:39:36 [2020-11-07T22:39:36.690Z] [INFO] Building org.eclipse.ease.lang.python.test 0.8.0-SNAPSHOT        [42/48]
17:39:36 [2020-11-07T22:39:36.690Z] [INFO] ------------------------[ eclipse-test-plugin ]-------------------------
17:39:36 [2020-11-07T22:39:36.690Z] [INFO] 
17:39:36 [2020-11-07T22:39:36.690Z] [INFO] --- maven-clean-plugin:2.5:clean (default-clean) @ org.eclipse.ease.lang.python.test ---
17:39:36 [2020-11-07T22:39:36.690Z] [INFO] 
17:39:36 [2020-11-07T22:39:36.690Z] [INFO] --- tycho-packaging-plugin:1.5.0:build-qualifier (default-build-qualifier) @ org.eclipse.ease.lang.python.test ---
17:39:36 [2020-11-07T22:39:36.690Z] [INFO] The project's OSGi version is 0.8.0.I201910171213
17:39:36 [2020-11-07T22:39:36.690Z] [INFO] 
17:39:36 [2020-11-07T22:39:36.690Z] [INFO] --- tycho-packaging-plugin:1.5.0:validate-id (default-validate-id) @ org.eclipse.ease.lang.python.test ---
17:39:36 [2020-11-07T22:39:36.690Z] [INFO] 
17:39:36 [2020-11-07T22:39:36.690Z] [INFO] --- tycho-packaging-plugin:1.5.0:validate-version (default-validate-version) @ org.eclipse.ease.lang.python.test ---
17:39:36 [2020-11-07T22:39:36.690Z] [INFO] 
17:39:36 [2020-11-07T22:39:36.690Z] [INFO] >>> maven-javadoc-plugin:2.9.1:javadoc (build-docs) > generate-sources @ org.eclipse.ease.lang.python.test >>>
17:39:36 [2020-11-07T22:39:36.690Z] [INFO] 
17:39:36 [2020-11-07T22:39:36.690Z] [INFO] --- tycho-packaging-plugin:1.5.0:build-qualifier (default-build-qualifier) @ org.eclipse.ease.lang.python.test ---
17:39:36 [2020-11-07T22:39:36.690Z] [INFO] The project's OSGi version is 0.8.0.I201910171213
17:39:36 [2020-11-07T22:39:36.690Z] [INFO] 
17:39:36 [2020-11-07T22:39:36.690Z] [INFO] --- tycho-packaging-plugin:1.5.0:validate-id (default-validate-id) @ org.eclipse.ease.lang.python.test ---
17:39:36 [2020-11-07T22:39:36.690Z] [INFO] 
17:39:36 [2020-11-07T22:39:36.690Z] [INFO] --- tycho-packaging-plugin:1.5.0:validate-version (default-validate-version) @ org.eclipse.ease.lang.python.test ---
17:39:36 [2020-11-07T22:39:36.690Z] [INFO] 
17:39:36 [2020-11-07T22:39:36.690Z] [INFO] <<< maven-javadoc-plugin:2.9.1:javadoc (build-docs) < generate-sources @ org.eclipse.ease.lang.python.test <<<
17:39:36 [2020-11-07T22:39:36.690Z] [INFO] 
17:39:36 [2020-11-07T22:39:36.690Z] [INFO] 
17:39:36 [2020-11-07T22:39:36.690Z] [INFO] --- maven-javadoc-plugin:2.9.1:javadoc (build-docs) @ org.eclipse.ease.lang.python.test ---
17:39:36 [2020-11-07T22:39:36.690Z] [ERROR] Error fetching link: http://help.eclipse.org/oxygen/topic/org.eclipse.platform.doc.isv/reference/api/package-list. Ignored it.
17:39:36 [2020-11-07T22:39:36.946Z] [ERROR] Error fetching link: https://ci.eclipse.org/ease/job/ease.build.core/JavaDoc/package-list. Ignored it.
17:39:37 [2020-11-07T22:39:37.899Z] [INFO] 
17:39:37 [2020-11-07T22:39:37.899Z] Loading source files for package org.eclipse.ease.lang.python...
17:39:37 [2020-11-07T22:39:37.899Z] Constructing Javadoc information...
17:39:37 [2020-11-07T22:39:37.899Z] WARNING: Cannot open location "/home/jenkins/agent/workspace/ease.verify.core.target.2019-03/tests/org.eclipse.ease.lang.python.test/target/javadoc-bundle-options/package-list"
17:39:37 [2020-11-07T22:39:37.899Z] No plugin definition found, skipping
17:39:37 [2020-11-07T22:39:37.899Z] No plugin definition found, skipping
17:39:37 [2020-11-07T22:39:37.899Z] [WARNING] Javadoc Warnings
17:39:37 [2020-11-07T22:39:37.899Z] [WARNING] Picked up JAVA_TOOL_OPTIONS: -Dmaven.ext.class.path="/home/jenkins/agent/workspace/ease.verify.core.target.2019-03@tmp/withMavendae5f2e9/pipeline-maven-spy.jar" -Dorg.jenkinsci.plugins.pipeline.maven.reportsFolder="/home/jenkins/agent/workspace/ease.verify.core.target.2019-03@tmp/withMavendae5f2e9"
17:39:37 [2020-11-07T22:39:37.899Z] [WARNING] javadoc: warning - The old Doclet and Taglet APIs in the packages
17:39:37 [2020-11-07T22:39:37.899Z] [WARNING] com.sun.javadoc, com.sun.tools.doclets and their implementations
17:39:37 [2020-11-07T22:39:37.899Z] [WARNING] are planned to be removed in a future JDK release. These
17:39:37 [2020-11-07T22:39:37.900Z] [WARNING] components have been superseded by the new APIs in jdk.javadoc.doclet.
17:39:37 [2020-11-07T22:39:37.900Z] [WARNING] Users are strongly recommended to migrate to the new APIs.
17:39:37 [2020-11-07T22:39:37.900Z] [INFO] 
17:39:37 [2020-11-07T22:39:37.900Z] [INFO] --- build-helper-maven-plugin:1.9.1:add-resource (add_help) @ org.eclipse.ease.lang.python.test ---
17:39:37 [2020-11-07T22:39:37.900Z] [INFO] 
17:39:37 [2020-11-07T22:39:37.900Z] [INFO] --- maven-resources-plugin:2.4.3:resources (default-resources) @ org.eclipse.ease.lang.python.test ---
17:39:37 [2020-11-07T22:39:37.900Z] [INFO] Using 'UTF-8' encoding to copy filtered resources.
17:39:37 [2020-11-07T22:39:37.900Z] [INFO] skip non existing resourceDirectory /home/jenkins/agent/workspace/ease.verify.core.target.2019-03/tests/org.eclipse.ease.lang.python.test/src/main/resources
17:39:37 [2020-11-07T22:39:37.900Z] [INFO] skip non existing resourceDirectory /home/jenkins/agent/workspace/ease.verify.core.target.2019-03/tests/org.eclipse.ease.lang.python.test/help
17:39:37 [2020-11-07T22:39:37.900Z] [INFO] 
17:39:37 [2020-11-07T22:39:37.900Z] [INFO] --- tycho-compiler-plugin:1.5.0:compile (default-compile) @ org.eclipse.ease.lang.python.test ---
17:39:37 [2020-11-07T22:39:37.900Z] [INFO] Compiling 1 source file to /home/jenkins/agent/workspace/ease.verify.core.target.2019-03/tests/org.eclipse.ease.lang.python.test/target/classes
17:39:37 [2020-11-07T22:39:37.900Z] [INFO] 
17:39:37 [2020-11-07T22:39:37.900Z] [INFO] --- maven-resources-plugin:2.4.3:testResources (default-testResources) @ org.eclipse.ease.lang.python.test ---
17:39:37 [2020-11-07T22:39:37.900Z] [INFO] Using 'UTF-8' encoding to copy filtered resources.
17:39:37 [2020-11-07T22:39:37.900Z] [INFO] skip non existing resourceDirectory /home/jenkins/agent/workspace/ease.verify.core.target.2019-03/tests/org.eclipse.ease.lang.python.test/src/test/resources
17:39:37 [2020-11-07T22:39:37.900Z] [INFO] 
17:39:37 [2020-11-07T22:39:37.900Z] [INFO] --- tycho-source-plugin:1.5.0:plugin-source (plugin-source) @ org.eclipse.ease.lang.python.test ---
17:39:37 [2020-11-07T22:39:37.900Z] [WARNING] Bundle-Vendor header not found in /home/jenkins/agent/workspace/ease.verify.core.target.2019-03/tests/org.eclipse.ease.lang.python.test/META-INF/MANIFEST.MF, fallback to 'unknown' for source bundle
17:39:37 [2020-11-07T22:39:37.900Z] [INFO] Building jar: /home/jenkins/agent/workspace/ease.verify.core.target.2019-03/tests/org.eclipse.ease.lang.python.test/target/org.eclipse.ease.lang.python.test-0.8.0-SNAPSHOT-sources.jar
17:39:37 [2020-11-07T22:39:37.900Z] [INFO] 
17:39:37 [2020-11-07T22:39:37.900Z] [INFO] --- target-platform-configuration:1.5.0:target-platform (default-target-platform) @ org.eclipse.ease.lang.python.test ---
17:39:37 [2020-11-07T22:39:37.900Z] [INFO] 
17:39:37 [2020-11-07T22:39:37.900Z] [INFO] --- tycho-packaging-plugin:1.5.0:package-plugin (default-package-plugin) @ org.eclipse.ease.lang.python.test ---
17:39:37 [2020-11-07T22:39:37.900Z] [INFO] Building jar: /home/jenkins/agent/workspace/ease.verify.core.target.2019-03/tests/org.eclipse.ease.lang.python.test/target/org.eclipse.ease.lang.python.test-0.8.0-SNAPSHOT.jar
17:39:37 [2020-11-07T22:39:37.900Z] [INFO] 
17:39:37 [2020-11-07T22:39:37.900Z] [INFO] --- tycho-p2-plugin:1.5.0:p2-metadata-default (default-p2-metadata-default) @ org.eclipse.ease.lang.python.test ---
17:39:37 [2020-11-07T22:39:37.900Z] [INFO] 
17:39:37 [2020-11-07T22:39:37.900Z] [INFO] --- tycho-source-feature-plugin:1.5.0:source-feature (source-feature) @ org.eclipse.ease.lang.python.test ---
17:39:37 [2020-11-07T22:39:37.900Z] [INFO] 
17:39:37 [2020-11-07T22:39:37.900Z] [INFO] --- tycho-p2-plugin:1.5.0:p2-metadata (attached-p2-metadata) @ org.eclipse.ease.lang.python.test ---
17:39:37 [2020-11-07T22:39:37.900Z] [INFO] 
17:39:37 [2020-11-07T22:39:37.900Z] [INFO] --- tycho-surefire-plugin:1.5.0:test (default-test) @ org.eclipse.ease.lang.python.test ---
17:39:38 [2020-11-07T22:39:38.155Z] [INFO] Expected eclipse log file: /home/jenkins/agent/workspace/ease.verify.core.target.2019-03/tests/org.eclipse.ease.lang.python.test/target/work/data/.metadata/.log
17:39:38 [2020-11-07T22:39:38.155Z] [INFO] Command line:
17:39:38 [2020-11-07T22:39:38.156Z] 	[/opt/tools/java/openjdk/jdk-11/11.0.2+9/bin/java, -Dosgi.noShutdown=false, -Dosgi.os=linux, -Dosgi.ws=gtk, -Dosgi.arch=x86_64, -Dosgi.clean=true, -jar, /home/jenkins/.m2/repository/p2/osgi/bundle/org.eclipse.equinox.launcher/1.5.800.v20200727-1323/org.eclipse.equinox.launcher-1.5.800.v20200727-1323.jar, -data, /home/jenkins/agent/workspace/ease.verify.core.target.2019-03/tests/org.eclipse.ease.lang.python.test/target/work/data, -install, /home/jenkins/agent/workspace/ease.verify.core.target.2019-03/tests/org.eclipse.ease.lang.python.test/target/work, -configuration, /home/jenkins/agent/workspace/ease.verify.core.target.2019-03/tests/org.eclipse.ease.lang.python.test/target/work/configuration, -application, org.eclipse.tycho.surefire.osgibooter.headlesstest, -testproperties, /home/jenkins/agent/workspace/ease.verify.core.target.2019-03/tests/org.eclipse.ease.lang.python.test/target/surefire.properties]
17:39:38 [2020-11-07T22:39:38.156Z] Picked up JAVA_TOOL_OPTIONS: -Dmaven.ext.class.path="/home/jenkins/agent/workspace/ease.verify.core.target.2019-03@tmp/withMavendae5f2e9/pipeline-maven-spy.jar" -Dorg.jenkinsci.plugins.pipeline.maven.reportsFolder="/home/jenkins/agent/workspace/ease.verify.core.target.2019-03@tmp/withMavendae5f2e9" 
17:39:39 [2020-11-07T22:39:39.538Z] Running org.eclipse.ease.lang.python.PythonCodeFactoryTest
17:39:39 [2020-11-07T22:39:39.795Z] Tests run: 1, Failures: 0, Errors: 0, Skipped: 0, Time elapsed: 0.031 s - in org.eclipse.ease.lang.python.PythonCodeFactoryTest
17:39:39 [2020-11-07T22:39:39.795Z] testCommentCreator(org.eclipse.ease.lang.python.PythonCodeFactoryTest)  Time elapsed: 0.003 s
17:39:39 [2020-11-07T22:39:39.795Z] 
17:39:39 [2020-11-07T22:39:39.795Z] Results:
17:39:39 [2020-11-07T22:39:39.795Z] 
17:39:39 [2020-11-07T22:39:39.795Z] Tests run: 1, Failures: 0, Errors: 0, Skipped: 0
17:39:39 [2020-11-07T22:39:39.795Z] 
17:39:40 [2020-11-07T22:39:40.356Z] [INFO] All tests passed!
17:39:40 [2020-11-07T22:39:40.356Z] [INFO] 
17:39:40 [2020-11-07T22:39:40.356Z] [INFO] --- maven-install-plugin:2.3.1:install (default-install) @ org.eclipse.ease.lang.python.test ---
17:39:40 [2020-11-07T22:39:40.356Z] [INFO] Installing /home/jenkins/agent/workspace/ease.verify.core.target.2019-03/tests/org.eclipse.ease.lang.python.test/target/org.eclipse.ease.lang.python.test-0.8.0-SNAPSHOT.jar to /home/jenkins/.m2/repository/org/eclipse/ease/org.eclipse.ease.lang.python.test/0.8.0-SNAPSHOT/org.eclipse.ease.lang.python.test-0.8.0-SNAPSHOT.jar
17:39:40 [2020-11-07T22:39:40.356Z] [INFO] Installing /home/jenkins/agent/workspace/ease.verify.core.target.2019-03/tests/org.eclipse.ease.lang.python.test/pom.xml to /home/jenkins/.m2/repository/org/eclipse/ease/org.eclipse.ease.lang.python.test/0.8.0-SNAPSHOT/org.eclipse.ease.lang.python.test-0.8.0-SNAPSHOT.pom
17:39:40 [2020-11-07T22:39:40.356Z] [INFO] Installing /home/jenkins/agent/workspace/ease.verify.core.target.2019-03/tests/org.eclipse.ease.lang.python.test/target/org.eclipse.ease.lang.python.test-0.8.0-SNAPSHOT-sources.jar to /home/jenkins/.m2/repository/org/eclipse/ease/org.eclipse.ease.lang.python.test/0.8.0-SNAPSHOT/org.eclipse.ease.lang.python.test-0.8.0-SNAPSHOT-sources.jar
17:39:40 [2020-11-07T22:39:40.356Z] [INFO] Installing /home/jenkins/agent/workspace/ease.verify.core.target.2019-03/tests/org.eclipse.ease.lang.python.test/target/p2content.xml to /home/jenkins/.m2/repository/org/eclipse/ease/org.eclipse.ease.lang.python.test/0.8.0-SNAPSHOT/org.eclipse.ease.lang.python.test-0.8.0-SNAPSHOT-p2metadata.xml
17:39:40 [2020-11-07T22:39:40.356Z] [INFO] Installing /home/jenkins/agent/workspace/ease.verify.core.target.2019-03/tests/org.eclipse.ease.lang.python.test/target/p2artifacts.xml to /home/jenkins/.m2/repository/org/eclipse/ease/org.eclipse.ease.lang.python.test/0.8.0-SNAPSHOT/org.eclipse.ease.lang.python.test-0.8.0-SNAPSHOT-p2artifacts.xml
17:39:40 [2020-11-07T22:39:40.356Z] [INFO] Installing /home/jenkins/agent/workspace/ease.verify.core.target.2019-03/tests/org.eclipse.ease.lang.python.test/target/p2content.xml to /home/jenkins/.m2/repository/org/eclipse/ease/org.eclipse.ease.lang.python.test/0.8.0-SNAPSHOT/org.eclipse.ease.lang.python.test-0.8.0-SNAPSHOT-p2metadata.xml
17:39:40 [2020-11-07T22:39:40.356Z] [INFO] Installing /home/jenkins/agent/workspace/ease.verify.core.target.2019-03/tests/org.eclipse.ease.lang.python.test/target/p2artifacts.xml to /home/jenkins/.m2/repository/org/eclipse/ease/org.eclipse.ease.lang.python.test/0.8.0-SNAPSHOT/org.eclipse.ease.lang.python.test-0.8.0-SNAPSHOT-p2artifacts.xml
17:39:40 [2020-11-07T22:39:40.356Z] [INFO] 
17:39:40 [2020-11-07T22:39:40.356Z] [INFO] --- tycho-p2-plugin:1.5.0:update-local-index (default-update-local-index) @ org.eclipse.ease.lang.python.test ---
17:39:40 [2020-11-07T22:39:40.356Z] [INFO] 
17:39:40 [2020-11-07T22:39:40.356Z] [INFO] -----< org.eclipse.ease:org.eclipse.ease.lang.python.jython.test >------
17:39:40 [2020-11-07T22:39:40.356Z] [INFO] Building org.eclipse.ease.lang.python.jython.test 0.8.0-SNAPSHOT [43/48]
17:39:40 [2020-11-07T22:39:40.356Z] [INFO] ------------------------[ eclipse-test-plugin ]-------------------------
17:39:40 [2020-11-07T22:39:40.356Z] [INFO] 
17:39:40 [2020-11-07T22:39:40.356Z] [INFO] --- maven-clean-plugin:2.5:clean (default-clean) @ org.eclipse.ease.lang.python.jython.test ---
17:39:40 [2020-11-07T22:39:40.356Z] [INFO] 
17:39:40 [2020-11-07T22:39:40.356Z] [INFO] --- tycho-packaging-plugin:1.5.0:build-qualifier (default-build-qualifier) @ org.eclipse.ease.lang.python.jython.test ---
17:39:40 [2020-11-07T22:39:40.356Z] [INFO] The project's OSGi version is 0.8.0.I201911291239
17:39:40 [2020-11-07T22:39:40.356Z] [INFO] 
17:39:40 [2020-11-07T22:39:40.356Z] [INFO] --- tycho-packaging-plugin:1.5.0:validate-id (default-validate-id) @ org.eclipse.ease.lang.python.jython.test ---
17:39:40 [2020-11-07T22:39:40.356Z] [INFO] 
17:39:40 [2020-11-07T22:39:40.356Z] [INFO] --- tycho-packaging-plugin:1.5.0:validate-version (default-validate-version) @ org.eclipse.ease.lang.python.jython.test ---
17:39:40 [2020-11-07T22:39:40.356Z] [INFO] 
17:39:40 [2020-11-07T22:39:40.356Z] [INFO] >>> maven-javadoc-plugin:2.9.1:javadoc (build-docs) > generate-sources @ org.eclipse.ease.lang.python.jython.test >>>
17:39:40 [2020-11-07T22:39:40.356Z] [INFO] 
17:39:40 [2020-11-07T22:39:40.356Z] [INFO] --- tycho-packaging-plugin:1.5.0:build-qualifier (default-build-qualifier) @ org.eclipse.ease.lang.python.jython.test ---
17:39:40 [2020-11-07T22:39:40.357Z] [INFO] The project's OSGi version is 0.8.0.I201911291239
17:39:40 [2020-11-07T22:39:40.357Z] [INFO] 
17:39:40 [2020-11-07T22:39:40.357Z] [INFO] --- tycho-packaging-plugin:1.5.0:validate-id (default-validate-id) @ org.eclipse.ease.lang.python.jython.test ---
17:39:40 [2020-11-07T22:39:40.357Z] [INFO] 
17:39:40 [2020-11-07T22:39:40.357Z] [INFO] --- tycho-packaging-plugin:1.5.0:validate-version (default-validate-version) @ org.eclipse.ease.lang.python.jython.test ---
17:39:40 [2020-11-07T22:39:40.357Z] [INFO] 
17:39:40 [2020-11-07T22:39:40.357Z] [INFO] <<< maven-javadoc-plugin:2.9.1:javadoc (build-docs) < generate-sources @ org.eclipse.ease.lang.python.jython.test <<<
17:39:40 [2020-11-07T22:39:40.357Z] [INFO] 
17:39:40 [2020-11-07T22:39:40.357Z] [INFO] 
17:39:40 [2020-11-07T22:39:40.357Z] [INFO] --- maven-javadoc-plugin:2.9.1:javadoc (build-docs) @ org.eclipse.ease.lang.python.jython.test ---
17:39:40 [2020-11-07T22:39:40.357Z] [ERROR] Error fetching link: http://help.eclipse.org/oxygen/topic/org.eclipse.platform.doc.isv/reference/api/package-list. Ignored it.
17:39:40 [2020-11-07T22:39:40.612Z] [ERROR] Error fetching link: https://ci.eclipse.org/ease/job/ease.build.core/JavaDoc/package-list. Ignored it.
17:39:41 [2020-11-07T22:39:41.539Z] [INFO] 
17:39:41 [2020-11-07T22:39:41.539Z] Loading source files for package org.eclipse.ease.lang.python.jython.debugger...
17:39:41 [2020-11-07T22:39:41.539Z] Constructing Javadoc information...
17:39:41 [2020-11-07T22:39:41.539Z] WARNING: Cannot open location "/home/jenkins/agent/workspace/ease.verify.core.target.2019-03/tests/org.eclipse.ease.lang.python.jython.test/target/javadoc-bundle-options/package-list"
17:39:41 [2020-11-07T22:39:41.539Z] No plugin definition found, skipping
17:39:41 [2020-11-07T22:39:41.539Z] No plugin definition found, skipping
17:39:41 [2020-11-07T22:39:41.540Z] [WARNING] Javadoc Warnings
17:39:41 [2020-11-07T22:39:41.540Z] [WARNING] Picked up JAVA_TOOL_OPTIONS: -Dmaven.ext.class.path="/home/jenkins/agent/workspace/ease.verify.core.target.2019-03@tmp/withMavendae5f2e9/pipeline-maven-spy.jar" -Dorg.jenkinsci.plugins.pipeline.maven.reportsFolder="/home/jenkins/agent/workspace/ease.verify.core.target.2019-03@tmp/withMavendae5f2e9"
17:39:41 [2020-11-07T22:39:41.540Z] [WARNING] javadoc: warning - The old Doclet and Taglet APIs in the packages
17:39:41 [2020-11-07T22:39:41.540Z] [WARNING] com.sun.javadoc, com.sun.tools.doclets and their implementations
17:39:41 [2020-11-07T22:39:41.540Z] [WARNING] are planned to be removed in a future JDK release. These
17:39:41 [2020-11-07T22:39:41.540Z] [WARNING] components have been superseded by the new APIs in jdk.javadoc.doclet.
17:39:41 [2020-11-07T22:39:41.540Z] [WARNING] Users are strongly recommended to migrate to the new APIs.
17:39:41 [2020-11-07T22:39:41.540Z] [INFO] 
17:39:41 [2020-11-07T22:39:41.540Z] [INFO] --- build-helper-maven-plugin:1.9.1:add-resource (add_help) @ org.eclipse.ease.lang.python.jython.test ---
17:39:41 [2020-11-07T22:39:41.540Z] [INFO] 
17:39:41 [2020-11-07T22:39:41.540Z] [INFO] --- maven-resources-plugin:2.4.3:resources (default-resources) @ org.eclipse.ease.lang.python.jython.test ---
17:39:41 [2020-11-07T22:39:41.540Z] [INFO] Using 'UTF-8' encoding to copy filtered resources.
17:39:41 [2020-11-07T22:39:41.540Z] [INFO] skip non existing resourceDirectory /home/jenkins/agent/workspace/ease.verify.core.target.2019-03/tests/org.eclipse.ease.lang.python.jython.test/src/main/resources
17:39:41 [2020-11-07T22:39:41.540Z] [INFO] skip non existing resourceDirectory /home/jenkins/agent/workspace/ease.verify.core.target.2019-03/tests/org.eclipse.ease.lang.python.jython.test/help
17:39:41 [2020-11-07T22:39:41.540Z] [INFO] 
17:39:41 [2020-11-07T22:39:41.540Z] [INFO] --- tycho-compiler-plugin:1.5.0:compile (default-compile) @ org.eclipse.ease.lang.python.jython.test ---
17:39:41 [2020-11-07T22:39:41.540Z] [INFO] Compiling 1 source file to /home/jenkins/agent/workspace/ease.verify.core.target.2019-03/tests/org.eclipse.ease.lang.python.jython.test/target/classes
17:39:41 [2020-11-07T22:39:41.540Z] [INFO] 
17:39:41 [2020-11-07T22:39:41.540Z] [INFO] --- maven-resources-plugin:2.4.3:testResources (default-testResources) @ org.eclipse.ease.lang.python.jython.test ---
17:39:41 [2020-11-07T22:39:41.540Z] [INFO] Using 'UTF-8' encoding to copy filtered resources.
17:39:41 [2020-11-07T22:39:41.540Z] [INFO] skip non existing resourceDirectory /home/jenkins/agent/workspace/ease.verify.core.target.2019-03/tests/org.eclipse.ease.lang.python.jython.test/src/test/resources
17:39:41 [2020-11-07T22:39:41.540Z] [INFO] 
17:39:41 [2020-11-07T22:39:41.540Z] [INFO] --- tycho-source-plugin:1.5.0:plugin-source (plugin-source) @ org.eclipse.ease.lang.python.jython.test ---
17:39:41 [2020-11-07T22:39:41.540Z] [WARNING] Bundle-Vendor header not found in /home/jenkins/agent/workspace/ease.verify.core.target.2019-03/tests/org.eclipse.ease.lang.python.jython.test/META-INF/MANIFEST.MF, fallback to 'unknown' for source bundle
17:39:41 [2020-11-07T22:39:41.540Z] [INFO] Building jar: /home/jenkins/agent/workspace/ease.verify.core.target.2019-03/tests/org.eclipse.ease.lang.python.jython.test/target/org.eclipse.ease.lang.python.jython.test-0.8.0-SNAPSHOT-sources.jar
17:39:41 [2020-11-07T22:39:41.540Z] [INFO] 
17:39:41 [2020-11-07T22:39:41.540Z] [INFO] --- target-platform-configuration:1.5.0:target-platform (default-target-platform) @ org.eclipse.ease.lang.python.jython.test ---
17:39:41 [2020-11-07T22:39:41.540Z] [INFO] 
17:39:41 [2020-11-07T22:39:41.540Z] [INFO] --- tycho-packaging-plugin:1.5.0:package-plugin (default-package-plugin) @ org.eclipse.ease.lang.python.jython.test ---
17:39:41 [2020-11-07T22:39:41.540Z] [INFO] Building jar: /home/jenkins/agent/workspace/ease.verify.core.target.2019-03/tests/org.eclipse.ease.lang.python.jython.test/target/org.eclipse.ease.lang.python.jython.test-0.8.0-SNAPSHOT.jar
17:39:41 [2020-11-07T22:39:41.540Z] [INFO] 
17:39:41 [2020-11-07T22:39:41.540Z] [INFO] --- tycho-p2-plugin:1.5.0:p2-metadata-default (default-p2-metadata-default) @ org.eclipse.ease.lang.python.jython.test ---
17:39:41 [2020-11-07T22:39:41.540Z] [INFO] 
17:39:41 [2020-11-07T22:39:41.540Z] [INFO] --- tycho-source-feature-plugin:1.5.0:source-feature (source-feature) @ org.eclipse.ease.lang.python.jython.test ---
17:39:41 [2020-11-07T22:39:41.540Z] [INFO] 
17:39:41 [2020-11-07T22:39:41.540Z] [INFO] --- tycho-p2-plugin:1.5.0:p2-metadata (attached-p2-metadata) @ org.eclipse.ease.lang.python.jython.test ---
17:39:41 [2020-11-07T22:39:41.540Z] [INFO] 
17:39:41 [2020-11-07T22:39:41.540Z] [INFO] --- tycho-surefire-plugin:1.5.0:test (default-test) @ org.eclipse.ease.lang.python.jython.test ---
17:39:42 [2020-11-07T22:39:42.105Z] [INFO] Expected eclipse log file: /home/jenkins/agent/workspace/ease.verify.core.target.2019-03/tests/org.eclipse.ease.lang.python.jython.test/target/work/data/.metadata/.log
17:39:42 [2020-11-07T22:39:42.105Z] [INFO] Command line:
17:39:42 [2020-11-07T22:39:42.105Z] 	[/opt/tools/java/openjdk/jdk-11/11.0.2+9/bin/java, -Dosgi.noShutdown=false, -Dosgi.os=linux, -Dosgi.ws=gtk, -Dosgi.arch=x86_64, -Dosgi.clean=true, -jar, /home/jenkins/.m2/repository/p2/osgi/bundle/org.eclipse.equinox.launcher/1.5.800.v20200727-1323/org.eclipse.equinox.launcher-1.5.800.v20200727-1323.jar, -data, /home/jenkins/agent/workspace/ease.verify.core.target.2019-03/tests/org.eclipse.ease.lang.python.jython.test/target/work/data, -install, /home/jenkins/agent/workspace/ease.verify.core.target.2019-03/tests/org.eclipse.ease.lang.python.jython.test/target/work, -configuration, /home/jenkins/agent/workspace/ease.verify.core.target.2019-03/tests/org.eclipse.ease.lang.python.jython.test/target/work/configuration, -application, org.eclipse.tycho.surefire.osgibooter.headlesstest, -testproperties, /home/jenkins/agent/workspace/ease.verify.core.target.2019-03/tests/org.eclipse.ease.lang.python.jython.test/target/surefire.properties]
17:39:42 [2020-11-07T22:39:42.105Z] Picked up JAVA_TOOL_OPTIONS: -Dmaven.ext.class.path="/home/jenkins/agent/workspace/ease.verify.core.target.2019-03@tmp/withMavendae5f2e9/pipeline-maven-spy.jar" -Dorg.jenkinsci.plugins.pipeline.maven.reportsFolder="/home/jenkins/agent/workspace/ease.verify.core.target.2019-03@tmp/withMavendae5f2e9" 
17:39:43 [2020-11-07T22:39:43.992Z] WARNING: An illegal reflective access operation has occurred
17:39:43 [2020-11-07T22:39:43.992Z] WARNING: Illegal reflective access by org.python.core.PySystemState (file:/home/jenkins/agent/workspace/ease.verify.core.target.2019-03/tests/org.eclipse.ease.lang.python.jython.test/target/work/plugins/org.jython_2.7.0.I201609090924/jython.jar) to method java.io.Console.encoding()
17:39:43 [2020-11-07T22:39:43.992Z] WARNING: Please consider reporting this to the maintainers of org.python.core.PySystemState
17:39:43 [2020-11-07T22:39:43.992Z] WARNING: Use --illegal-access=warn to enable warnings of further illegal reflective access operations
17:39:43 [2020-11-07T22:39:43.992Z] WARNING: All illegal access operations will be denied in a future release
17:39:43 [2020-11-07T22:39:43.992Z] Running org.eclipse.ease.lang.python.jython.debugger.JythonDebugTest
17:39:45 [2020-11-07T22:39:45.360Z] Start of script
17:39:45 [2020-11-07T22:39:45.360Z] include file start
17:39:45 [2020-11-07T22:39:45.360Z] include file processed
17:39:45 [2020-11-07T22:39:45.360Z] Result of testMethod = 5
17:39:45 [2020-11-07T22:39:45.360Z] End of script
17:39:45 [2020-11-07T22:39:45.615Z] Start of script
17:39:45 [2020-11-07T22:39:45.616Z] include file start
17:39:45 [2020-11-07T22:39:45.616Z] include file processed
17:39:45 [2020-11-07T22:39:45.616Z] Result of testMethod = 5
17:39:45 [2020-11-07T22:39:45.616Z] End of script
17:39:45 [2020-11-07T22:39:45.871Z] Start of script
17:39:45 [2020-11-07T22:39:45.871Z] include file start
17:39:45 [2020-11-07T22:39:45.871Z] include file processed
17:39:45 [2020-11-07T22:39:45.871Z] Result of testMethod = 5
17:39:45 [2020-11-07T22:39:45.871Z] Traceback (most recent call last):
17:39:45 [2020-11-07T22:39:45.871Z]   File "(none)", line 184, in run
17:39:45 [2020-11-07T22:39:45.872Z]   File "__ref_L/Debug Test/Main.py_kmzpkzjtho", line 23, in <module>
17:39:45 [2020-11-07T22:39:45.872Z]   File "(none)", line 161, in trace_dispatch
17:39:45 [2020-11-07T22:39:45.872Z] org.eclipse.ease.ExitException: 
17:39:45 [2020-11-07T22:39:45.872Z] 
17:39:45 [2020-11-07T22:39:45.872Z] org.eclipse.ease.ExitException: org.eclipse.ease.ExitException: 
17:39:46 [2020-11-07T22:39:46.127Z] Start of script
17:39:46 [2020-11-07T22:39:46.127Z] include file start
17:39:46 [2020-11-07T22:39:46.127Z] include file processed
17:39:46 [2020-11-07T22:39:46.382Z] Result of testMethod = 5
17:39:46 [2020-11-07T22:39:46.382Z] End of script
17:39:46 [2020-11-07T22:39:46.638Z] Start of script
17:39:46 [2020-11-07T22:39:46.638Z] include file start
17:39:46 [2020-11-07T22:39:46.638Z] include file processed
17:39:46 [2020-11-07T22:39:46.638Z] Result of testMethod = 5
17:39:46 [2020-11-07T22:39:46.638Z] End of script
17:39:46 [2020-11-07T22:39:46.638Z] Start of script
17:39:46 [2020-11-07T22:39:46.638Z] include file start
17:39:46 [2020-11-07T22:39:46.638Z] include file processed
17:39:46 [2020-11-07T22:39:46.893Z] Result of testMethod = 5
17:39:46 [2020-11-07T22:39:46.893Z] End of script
17:39:46 [2020-11-07T22:39:46.893Z] Start of script
17:39:46 [2020-11-07T22:39:46.893Z] include file start
17:39:46 [2020-11-07T22:39:46.893Z] include file processed
17:39:46 [2020-11-07T22:39:46.893Z] Result of testMethod = 5
17:39:47 [2020-11-07T22:39:47.148Z] Traceback (most recent call last):
17:39:47 [2020-11-07T22:39:47.148Z]   File "(none)", line 184, in run
17:39:47 [2020-11-07T22:39:47.148Z]   File "__ref_L/Debug Test/Main.py_aeakyyuyxf", line 23, in <module>
17:39:47 [2020-11-07T22:39:47.148Z]   File "(none)", line 161, in trace_dispatch
17:39:47 [2020-11-07T22:39:47.148Z] org.eclipse.ease.ExitException: 
17:39:47 [2020-11-07T22:39:47.148Z] 
17:39:47 [2020-11-07T22:39:47.148Z] org.eclipse.ease.ExitException: org.eclipse.ease.ExitException: 
17:39:47 [2020-11-07T22:39:47.404Z] Start of script
17:39:47 [2020-11-07T22:39:47.404Z] include file start
17:39:47 [2020-11-07T22:39:47.404Z] include file processed
17:39:47 [2020-11-07T22:39:47.404Z] Result of testMethod = 5
17:39:47 [2020-11-07T22:39:47.404Z] End of script
17:39:47 [2020-11-07T22:39:47.660Z] Start of script
17:39:47 [2020-11-07T22:39:47.660Z] include file start
17:39:47 [2020-11-07T22:39:47.660Z] include file processed
17:39:47 [2020-11-07T22:39:47.660Z] Result of testMethod = 5
17:39:47 [2020-11-07T22:39:47.660Z] End of script
17:39:47 [2020-11-07T22:39:47.915Z] Start of script
17:39:47 [2020-11-07T22:39:47.915Z] include file start
17:39:47 [2020-11-07T22:39:47.915Z] include file processed
17:39:48 [2020-11-07T22:39:48.171Z] Traceback (most recent call last):
17:39:48 [2020-11-07T22:39:48.171Z]   File "(none)", line 184, in run
17:39:48 [2020-11-07T22:39:48.171Z]   File "__ref_L/Debug Test/Main.py_fcqczfrmde", line 22, in <module>
17:39:48 [2020-11-07T22:39:48.171Z]   File "(none)", line 161, in trace_dispatch
17:39:48 [2020-11-07T22:39:48.171Z] org.eclipse.ease.ExitException: 
17:39:48 [2020-11-07T22:39:48.171Z] 
17:39:48 [2020-11-07T22:39:48.171Z] org.eclipse.ease.ExitException: org.eclipse.ease.ExitException: 
17:39:48 [2020-11-07T22:39:48.427Z] Start of script
17:39:48 [2020-11-07T22:39:48.427Z] include file start
17:39:48 [2020-11-07T22:39:48.427Z] include file processed
17:39:48 [2020-11-07T22:39:48.427Z] Result of testMethod = 5
17:39:48 [2020-11-07T22:39:48.427Z] End of script
17:39:48 [2020-11-07T22:39:48.427Z] Start of script
17:39:48 [2020-11-07T22:39:48.427Z] include file start
17:39:48 [2020-11-07T22:39:48.427Z] include file processed
17:39:48 [2020-11-07T22:39:48.683Z] Result of testMethod = 5
17:39:48 [2020-11-07T22:39:48.683Z] End of script
17:39:48 [2020-11-07T22:39:48.939Z] Traceback (most recent call last):
17:39:48 [2020-11-07T22:39:48.939Z]   File "(none)", line 184, in run
17:39:48 [2020-11-07T22:39:48.939Z]   File "__ref_L/Debug Test/Main.py_cwgeypqrcz", line 1, in <module>
17:39:48 [2020-11-07T22:39:48.939Z]   File "(none)", line 161, in trace_dispatch
17:39:48 [2020-11-07T22:39:48.939Z] org.eclipse.ease.ExitException: 
17:39:48 [2020-11-07T22:39:48.939Z] 
17:39:48 [2020-11-07T22:39:48.939Z] org.eclipse.ease.ExitException: org.eclipse.ease.ExitException: 
17:39:48 [2020-11-07T22:39:48.939Z] Start of script
17:39:49 [2020-11-07T22:39:49.195Z] include file start
17:39:49 [2020-11-07T22:39:49.195Z] include file processed
17:39:49 [2020-11-07T22:39:49.195Z] Result of testMethod = 5
17:39:49 [2020-11-07T22:39:49.195Z] End of script
17:39:49 [2020-11-07T22:39:49.195Z] Start of script
17:39:49 [2020-11-07T22:39:49.195Z] include file start
17:39:49 [2020-11-07T22:39:49.195Z] include file processed
17:39:49 [2020-11-07T22:39:49.451Z] Result of testMethod = 5
17:39:49 [2020-11-07T22:39:49.451Z] End of script
17:39:49 [2020-11-07T22:39:49.706Z] Start of script
17:39:49 [2020-11-07T22:39:49.706Z] include file start
17:39:49 [2020-11-07T22:39:49.706Z] include file processed
17:39:49 [2020-11-07T22:39:49.706Z] Result of testMethod = 5
17:39:49 [2020-11-07T22:39:49.706Z] Traceback (most recent call last):
17:39:49 [2020-11-07T22:39:49.706Z]   File "(none)", line 184, in run
17:39:49 [2020-11-07T22:39:49.706Z]   File "__ref_L/Debug Test/Main.py_psjafmeckr", line 23, in <module>
17:39:49 [2020-11-07T22:39:49.706Z]   File "(none)", line 161, in trace_dispatch
17:39:49 [2020-11-07T22:39:49.706Z] org.eclipse.ease.ExitException: 
17:39:49 [2020-11-07T22:39:49.706Z] 
17:39:49 [2020-11-07T22:39:49.706Z] org.eclipse.ease.ExitException: org.eclipse.ease.ExitException: 
17:39:49 [2020-11-07T22:39:49.964Z] Start of script
17:39:49 [2020-11-07T22:39:49.964Z] include file start
17:39:49 [2020-11-07T22:39:49.964Z] include file processed
17:39:49 [2020-11-07T22:39:49.964Z] Result of testMethod = 5
17:39:49 [2020-11-07T22:39:49.964Z] End of script
17:39:50 [2020-11-07T22:39:50.224Z] Traceback (most recent call last):
17:39:50 [2020-11-07T22:39:50.224Z]   File "(none)", line 184, in run
17:39:50 [2020-11-07T22:39:50.224Z]   File "__ref_L/Debug Test/Main.py_mvxrxcvioc", line 1, in <module>
17:39:50 [2020-11-07T22:39:50.224Z]   File "(none)", line 161, in trace_dispatch
17:39:50 [2020-11-07T22:39:50.224Z] org.eclipse.ease.ExitException: 
17:39:50 [2020-11-07T22:39:50.224Z] 
17:39:50 [2020-11-07T22:39:50.224Z] org.eclipse.ease.ExitException: org.eclipse.ease.ExitException: 
17:39:50 [2020-11-07T22:39:50.479Z] Start of script
17:39:50 [2020-11-07T22:39:50.479Z] include file start
17:39:50 [2020-11-07T22:39:50.479Z] include file processed
17:39:50 [2020-11-07T22:39:50.479Z] Result of testMethod = 5
17:39:50 [2020-11-07T22:39:50.479Z] End of script
17:39:50 [2020-11-07T22:39:50.479Z] Start of script
17:39:50 [2020-11-07T22:39:50.479Z] include file start
17:39:50 [2020-11-07T22:39:50.480Z] include file processed
17:39:50 [2020-11-07T22:39:50.735Z] Result of testMethod = 5
17:39:50 [2020-11-07T22:39:50.735Z] End of script
17:39:51 [2020-11-07T22:39:51.004Z] Traceback (most recent call last):
17:39:51 [2020-11-07T22:39:51.004Z]   File "(none)", line 184, in run
17:39:51 [2020-11-07T22:39:51.004Z]   File "__ref_L/Debug Test/Main.py_harajztgin", line 1, in <module>
17:39:51 [2020-11-07T22:39:51.004Z]   File "(none)", line 161, in trace_dispatch
17:39:51 [2020-11-07T22:39:51.004Z] org.eclipse.ease.ExitException: 
17:39:51 [2020-11-07T22:39:51.004Z] 
17:39:51 [2020-11-07T22:39:51.004Z] org.eclipse.ease.ExitException: org.eclipse.ease.ExitException: 
17:39:51 [2020-11-07T22:39:51.004Z] Start of script
17:39:51 [2020-11-07T22:39:51.004Z] include file start
17:39:51 [2020-11-07T22:39:51.004Z] include file processed
17:39:51 [2020-11-07T22:39:51.260Z] Result of testMethod = 5
17:39:51 [2020-11-07T22:39:51.260Z] End of script
17:39:51 [2020-11-07T22:39:51.517Z] Start of script
17:39:51 [2020-11-07T22:39:51.517Z] include file start
17:39:51 [2020-11-07T22:39:51.517Z] include file processed
17:39:51 [2020-11-07T22:39:51.517Z] Result of testMethod = 5
17:39:51 [2020-11-07T22:39:51.517Z] Traceback (most recent call last):
17:39:51 [2020-11-07T22:39:51.517Z]   File "(none)", line 184, in run
17:39:51 [2020-11-07T22:39:51.517Z]   File "__ref_L/Debug Test/Main.py_zlxopvhjnk", line 23, in <module>
17:39:51 [2020-11-07T22:39:51.517Z]   File "(none)", line 161, in trace_dispatch
17:39:51 [2020-11-07T22:39:51.517Z] org.eclipse.ease.ExitException: 
17:39:51 [2020-11-07T22:39:51.517Z] 
17:39:51 [2020-11-07T22:39:51.517Z] org.eclipse.ease.ExitException: org.eclipse.ease.ExitException: 
17:39:51 [2020-11-07T22:39:51.773Z] Start of script
17:39:51 [2020-11-07T22:39:51.773Z] include file start
17:39:51 [2020-11-07T22:39:51.773Z] include file processed
17:39:51 [2020-11-07T22:39:51.773Z] Result of testMethod = 5
17:39:51 [2020-11-07T22:39:51.773Z] End of script
17:39:52 [2020-11-07T22:39:52.029Z] Start of script
17:39:52 [2020-11-07T22:39:52.029Z] include file start
17:39:52 [2020-11-07T22:39:52.029Z] include file processed
17:39:52 [2020-11-07T22:39:52.029Z] Result of testMethod = 5
17:39:52 [2020-11-07T22:39:52.029Z] End of script
17:39:52 [2020-11-07T22:39:52.285Z] Start of script
17:39:52 [2020-11-07T22:39:52.285Z] include file start
17:39:52 [2020-11-07T22:39:52.285Z] include file processed
17:39:52 [2020-11-07T22:39:52.285Z] Result of testMethod = 5
17:39:52 [2020-11-07T22:39:52.285Z] End of script
17:39:52 [2020-11-07T22:39:52.285Z] Start of script
17:39:52 [2020-11-07T22:39:52.541Z] include file start
17:39:52 [2020-11-07T22:39:52.541Z] include file processed
17:39:52 [2020-11-07T22:39:52.541Z] Result of testMethod = 5
17:39:52 [2020-11-07T22:39:52.541Z] End of script
17:39:52 [2020-11-07T22:39:52.541Z] Start of script
17:39:52 [2020-11-07T22:39:52.541Z] include file start
17:39:52 [2020-11-07T22:39:52.541Z] include file processed
17:39:52 [2020-11-07T22:39:52.797Z] Traceback (most recent call last):
17:39:52 [2020-11-07T22:39:52.797Z]   File "(none)", line 184, in run
17:39:52 [2020-11-07T22:39:52.797Z]   File "__ref_L/Debug Test/Main.py_mdcynxalwb", line 21, in <module>
17:39:52 [2020-11-07T22:39:52.797Z]   File "__ref_L/Debug Test/Main.py_mdcynxalwb", line 18, in testMethod
17:39:52 [2020-11-07T22:39:52.797Z]   File "(none)", line 161, in trace_dispatch
17:39:52 [2020-11-07T22:39:52.797Z] org.eclipse.ease.ExitException: 
17:39:52 [2020-11-07T22:39:52.797Z] 
17:39:52 [2020-11-07T22:39:52.797Z] org.eclipse.ease.ExitException: org.eclipse.ease.ExitException: 
17:39:53 [2020-11-07T22:39:53.054Z] Start of script
17:39:53 [2020-11-07T22:39:53.054Z] include file start
17:39:53 [2020-11-07T22:39:53.054Z] include file processed
17:39:53 [2020-11-07T22:39:53.054Z] Result of testMethod = 5
17:39:53 [2020-11-07T22:39:53.054Z] End of script
17:39:53 [2020-11-07T22:39:53.310Z] Start of script
17:39:53 [2020-11-07T22:39:53.310Z] include file start
17:39:53 [2020-11-07T22:39:53.310Z] include file processed
17:39:53 [2020-11-07T22:39:53.310Z] Result of testMethod = 5
17:39:53 [2020-11-07T22:39:53.566Z] Traceback (most recent call last):
17:39:53 [2020-11-07T22:39:53.566Z]   File "(none)", line 184, in run
17:39:53 [2020-11-07T22:39:53.566Z]   File "__ref_L/Debug Test/Main.py_mohlmgwgyy", line 23, in <module>
17:39:53 [2020-11-07T22:39:53.566Z]   File "(none)", line 161, in trace_dispatch
17:39:53 [2020-11-07T22:39:53.566Z] org.eclipse.ease.ExitException: 
17:39:53 [2020-11-07T22:39:53.566Z] 
17:39:53 [2020-11-07T22:39:53.566Z] org.eclipse.ease.ExitException: org.eclipse.ease.ExitException: 
17:39:53 [2020-11-07T22:39:53.566Z] Start of script
17:39:53 [2020-11-07T22:39:53.566Z] include file start
17:39:53 [2020-11-07T22:39:53.566Z] include file processed
17:39:53 [2020-11-07T22:39:53.566Z] Result of testMethod = 5
17:39:53 [2020-11-07T22:39:53.566Z] End of script
17:39:53 [2020-11-07T22:39:53.822Z] Start of script
17:39:53 [2020-11-07T22:39:53.822Z] include file start
17:39:53 [2020-11-07T22:39:53.822Z] include file processed
17:39:54 [2020-11-07T22:39:54.078Z] Result of testMethod = 5
17:39:54 [2020-11-07T22:39:54.078Z] End of script
17:39:54 [2020-11-07T22:39:54.078Z] Start of script
17:39:54 [2020-11-07T22:39:54.078Z] include file start
17:39:54 [2020-11-07T22:39:54.078Z] include file processed
17:39:54 [2020-11-07T22:39:54.333Z] Result of testMethod = 5
17:39:54 [2020-11-07T22:39:54.333Z] End of script
17:39:54 [2020-11-07T22:39:54.333Z] Start of script
17:39:54 [2020-11-07T22:39:54.333Z] include file start
17:39:54 [2020-11-07T22:39:54.333Z] include file processed
17:39:54 [2020-11-07T22:39:54.333Z] Result of testMethod = 5
17:39:54 [2020-11-07T22:39:54.588Z] End of script
17:39:54 [2020-11-07T22:39:54.588Z] Start of script
17:39:54 [2020-11-07T22:39:54.588Z] include file start
17:39:54 [2020-11-07T22:39:54.588Z] include file processed
17:39:54 [2020-11-07T22:39:54.588Z] Result of testMethod = 5
17:39:54 [2020-11-07T22:39:54.844Z] Traceback (most recent call last):
17:39:54 [2020-11-07T22:39:54.844Z]   File "(none)", line 184, in run
17:39:54 [2020-11-07T22:39:54.844Z]   File "__ref_L/Debug Test/Main.py_fktqnlcgcj", line 23, in <module>
17:39:54 [2020-11-07T22:39:54.844Z]   File "(none)", line 161, in trace_dispatch
17:39:54 [2020-11-07T22:39:54.844Z] org.eclipse.ease.ExitException: 
17:39:54 [2020-11-07T22:39:54.844Z] 
17:39:54 [2020-11-07T22:39:54.844Z] org.eclipse.ease.ExitException: org.eclipse.ease.ExitException: 
17:39:54 [2020-11-07T22:39:54.844Z] Start of script
17:39:54 [2020-11-07T22:39:54.844Z] include file start
17:39:54 [2020-11-07T22:39:54.844Z] include file processed
17:39:54 [2020-11-07T22:39:54.844Z] Result of testMethod = 5
17:39:55 [2020-11-07T22:39:55.100Z] End of script
17:39:55 [2020-11-07T22:39:55.100Z] Start of script
17:39:55 [2020-11-07T22:39:55.100Z] include file start
17:39:55 [2020-11-07T22:39:55.100Z] include file processed
17:39:55 [2020-11-07T22:39:55.100Z] Result of testMethod = 5
17:39:55 [2020-11-07T22:39:55.356Z] Traceback (most recent call last):
17:39:55 [2020-11-07T22:39:55.356Z]   File "(none)", line 184, in run
17:39:55 [2020-11-07T22:39:55.356Z]   File "__ref_L/Debug Test/Main.py_kytddskpxo", line 23, in <module>
17:39:55 [2020-11-07T22:39:55.356Z]   File "(none)", line 161, in trace_dispatch
17:39:55 [2020-11-07T22:39:55.356Z] org.eclipse.ease.ExitException: 
17:39:55 [2020-11-07T22:39:55.356Z] 
17:39:55 [2020-11-07T22:39:55.356Z] org.eclipse.ease.ExitException: org.eclipse.ease.ExitException: 
17:39:55 [2020-11-07T22:39:55.612Z] Traceback (most recent call last):
17:39:55 [2020-11-07T22:39:55.612Z]   File "(none)", line 184, in run
17:39:55 [2020-11-07T22:39:55.612Z]   File "__ref_L/Debug Test/Main.py_ktnjzxszli", line 1, in <module>
17:39:55 [2020-11-07T22:39:55.612Z]   File "(none)", line 161, in trace_dispatch
17:39:55 [2020-11-07T22:39:55.612Z] org.eclipse.ease.ExitException: 
17:39:55 [2020-11-07T22:39:55.612Z] 
17:39:55 [2020-11-07T22:39:55.612Z] org.eclipse.ease.ExitException: org.eclipse.ease.ExitException: 
17:39:55 [2020-11-07T22:39:55.612Z] Start of script
17:39:55 [2020-11-07T22:39:55.612Z] include file start
17:39:55 [2020-11-07T22:39:55.612Z] include file processed
17:39:55 [2020-11-07T22:39:55.612Z] Result of testMethod = 5
17:39:55 [2020-11-07T22:39:55.612Z] End of script
17:39:55 [2020-11-07T22:39:55.868Z] Start of script
17:39:55 [2020-11-07T22:39:55.868Z] include file start
17:39:55 [2020-11-07T22:39:55.868Z] include file processed
17:39:56 [2020-11-07T22:39:56.124Z] Result of testMethod = 5
17:39:56 [2020-11-07T22:39:56.124Z] End of script
17:39:56 [2020-11-07T22:39:56.124Z] Start of script
17:39:56 [2020-11-07T22:39:56.124Z] include file start
17:39:56 [2020-11-07T22:39:56.124Z] include file processed
17:39:56 [2020-11-07T22:39:56.124Z] Result of testMethod = 5
17:39:56 [2020-11-07T22:39:56.124Z] End of script
17:39:56 [2020-11-07T22:39:56.380Z] Tests run: 42, Failures: 0, Errors: 0, Skipped: 0, Time elapsed: 12.267 s - in org.eclipse.ease.lang.python.jython.debugger.JythonDebugTest
17:39:56 [2020-11-07T22:39:56.380Z] disconnectProcessInSuspendedState(org.eclipse.ease.lang.python.jython.debugger.JythonDebugTest)  Time elapsed: 1.463 s
17:39:56 [2020-11-07T22:39:56.380Z] stepReturnIncludeCommand(org.eclipse.ease.lang.python.jython.debugger.JythonDebugTest)  Time elapsed: 0.211 s
17:39:56 [2020-11-07T22:39:56.380Z] arrayVariableSorting(org.eclipse.ease.lang.python.jython.debugger.JythonDebugTest)  Time elapsed: 0.309 s
17:39:56 [2020-11-07T22:39:56.380Z] stepOverOnDebugTarget(org.eclipse.ease.lang.python.jython.debugger.JythonDebugTest)  Time elapsed: 0.309 s
17:39:56 [2020-11-07T22:39:56.380Z] hasDebugTarget(org.eclipse.ease.lang.python.jython.debugger.JythonDebugTest)  Time elapsed: 0.106 s
17:39:56 [2020-11-07T22:39:56.380Z] disconnectThreadInSuspendedState(org.eclipse.ease.lang.python.jython.debugger.JythonDebugTest)  Time elapsed: 0.211 s
17:39:56 [2020-11-07T22:39:56.380Z] stepReturnOnDebugTarget(org.eclipse.ease.lang.python.jython.debugger.JythonDebugTest)  Time elapsed: 0.309 s
17:39:56 [2020-11-07T22:39:56.380Z] nullVariable(org.eclipse.ease.lang.python.jython.debugger.JythonDebugTest)  Time elapsed: 0.308 s
17:39:56 [2020-11-07T22:39:56.380Z] stepOverOnStackFrame(org.eclipse.ease.lang.python.jython.debugger.JythonDebugTest)  Time elapsed: 0.309 s
17:39:56 [2020-11-07T22:39:56.380Z] resumeOnDebugTarget(org.eclipse.ease.lang.python.jython.debugger.JythonDebugTest)  Time elapsed: 0.206 s
17:39:56 [2020-11-07T22:39:56.380Z] modifyVariableKeepingType(org.eclipse.ease.lang.python.jython.debugger.JythonDebugTest)  Time elapsed: 0.507 s
17:39:56 [2020-11-07T22:39:56.380Z] resumeOnLastIncludeLine(org.eclipse.ease.lang.python.jython.debugger.JythonDebugTest)  Time elapsed: 0.206 s
17:39:56 [2020-11-07T22:39:56.380Z] stepReturnOnStackFrame(org.eclipse.ease.lang.python.jython.debugger.JythonDebugTest)  Time elapsed: 0.309 s
17:39:56 [2020-11-07T22:39:56.380Z] terminateStackFrameInSuspendedState(org.eclipse.ease.lang.python.jython.debugger.JythonDebugTest)  Time elapsed: 0.208 s
17:39:56 [2020-11-07T22:39:56.380Z] breakpointLocation(org.eclipse.ease.lang.python.jython.debugger.JythonDebugTest)  Time elapsed: 0.207 s
17:39:56 [2020-11-07T22:39:56.380Z] stepReturnOnThread(org.eclipse.ease.lang.python.jython.debugger.JythonDebugTest)  Time elapsed: 0.309 s
17:39:56 [2020-11-07T22:39:56.380Z] javaClassVariable(org.eclipse.ease.lang.python.jython.debugger.JythonDebugTest)  Time elapsed: 0.308 s
17:39:56 [2020-11-07T22:39:56.380Z] stepIntoOnThread(org.eclipse.ease.lang.python.jython.debugger.JythonDebugTest)  Time elapsed: 0.307 s
17:39:56 [2020-11-07T22:39:56.380Z] terminateThreadInSuspendedState(org.eclipse.ease.lang.python.jython.debugger.JythonDebugTest)  Time elapsed: 0.206 s
17:39:56 [2020-11-07T22:39:56.380Z] resumeOnThread(org.eclipse.ease.lang.python.jython.debugger.JythonDebugTest)  Time elapsed: 0.206 s
17:39:56 [2020-11-07T22:39:56.380Z] stepIntoOnStackFrame(org.eclipse.ease.lang.python.jython.debugger.JythonDebugTest)  Time elapsed: 0.306 s
17:39:56 [2020-11-07T22:39:56.380Z] terminateProcessInSuspendedState(org.eclipse.ease.lang.python.jython.debugger.JythonDebugTest)  Time elapsed: 0.206 s
17:39:56 [2020-11-07T22:39:56.380Z] stepOverOnProcess(org.eclipse.ease.lang.python.jython.debugger.JythonDebugTest)  Time elapsed: 0.307 s
17:39:56 [2020-11-07T22:39:56.380Z] nativeArrayVariable(org.eclipse.ease.lang.python.jython.debugger.JythonDebugTest)  Time elapsed: 0.306 s
17:39:56 [2020-11-07T22:39:56.380Z] disconnectDebugTargetInSuspendedState(org.eclipse.ease.lang.python.jython.debugger.JythonDebugTest)  Time elapsed: 0.206 s
17:39:56 [2020-11-07T22:39:56.380Z] stepIntoOnProcess(org.eclipse.ease.lang.python.jython.debugger.JythonDebugTest)  Time elapsed: 0.307 s
17:39:56 [2020-11-07T22:39:56.380Z] terminatedState(org.eclipse.ease.lang.python.jython.debugger.JythonDebugTest)  Time elapsed: 0.104 s
17:39:56 [2020-11-07T22:39:56.380Z] stepOverIncludeCommand(org.eclipse.ease.lang.python.jython.debugger.JythonDebugTest)  Time elapsed: 0.305 s
17:39:56 [2020-11-07T22:39:56.380Z] innerScopeVariableBeforeOuterScopeVariable(org.eclipse.ease.lang.python.jython.debugger.JythonDebugTest)  Time elapsed: 0.306 s
17:39:56 [2020-11-07T22:39:56.380Z] stepIntoIncludeCommand(org.eclipse.ease.lang.python.jython.debugger.JythonDebugTest)  Time elapsed: 0.305 s
17:39:56 [2020-11-07T22:39:56.380Z] primitiveStringVariable(org.eclipse.ease.lang.python.jython.debugger.JythonDebugTest)  Time elapsed: 0.306 s
17:39:56 [2020-11-07T22:39:56.380Z] resumeOnProcess(org.eclipse.ease.lang.python.jython.debugger.JythonDebugTest)  Time elapsed: 0.205 s
17:39:56 [2020-11-07T22:39:56.380Z] stepIntoOnDebugTarget(org.eclipse.ease.lang.python.jython.debugger.JythonDebugTest)  Time elapsed: 0.306 s
17:39:56 [2020-11-07T22:39:56.380Z] stepOverOnThread(org.eclipse.ease.lang.python.jython.debugger.JythonDebugTest)  Time elapsed: 0.306 s
17:39:56 [2020-11-07T22:39:56.380Z] suspendedState(org.eclipse.ease.lang.python.jython.debugger.JythonDebugTest)  Time elapsed: 0.206 s
17:39:56 [2020-11-07T22:39:56.380Z] primitiveDoubleVariable(org.eclipse.ease.lang.python.jython.debugger.JythonDebugTest)  Time elapsed: 0.305 s
17:39:56 [2020-11-07T22:39:56.380Z] resumeOnStackFrame(org.eclipse.ease.lang.python.jython.debugger.JythonDebugTest)  Time elapsed: 0.206 s
17:39:56 [2020-11-07T22:39:56.380Z] nativeObjectVariable(org.eclipse.ease.lang.python.jython.debugger.JythonDebugTest)  Time elapsed: 0.306 s
17:39:56 [2020-11-07T22:39:56.380Z] terminateDebugTargetInSuspendedState(org.eclipse.ease.lang.python.jython.debugger.JythonDebugTest)  Time elapsed: 0.205 s
17:39:56 [2020-11-07T22:39:56.380Z] disconnectStackFrameInSuspendedState(org.eclipse.ease.lang.python.jython.debugger.JythonDebugTest)  Time elapsed: 0.205 s
17:39:56 [2020-11-07T22:39:56.380Z] stepReturnOnProcess(org.eclipse.ease.lang.python.jython.debugger.JythonDebugTest)  Time elapsed: 0.306 s
17:39:56 [2020-11-07T22:39:56.380Z] evaluateWatchExpression(org.eclipse.ease.lang.python.jython.debugger.JythonDebugTest)  Time elapsed: 0.208 s
17:39:56 [2020-11-07T22:39:56.380Z] 
17:39:56 [2020-11-07T22:39:56.380Z] Results:
17:39:56 [2020-11-07T22:39:56.380Z] 
17:39:56 [2020-11-07T22:39:56.380Z] Tests run: 42, Failures: 0, Errors: 0, Skipped: 0
17:39:56 [2020-11-07T22:39:56.380Z] 
17:39:56 [2020-11-07T22:39:56.941Z] [INFO] All tests passed!
17:39:56 [2020-11-07T22:39:56.941Z] [INFO] 
17:39:56 [2020-11-07T22:39:56.941Z] [INFO] --- maven-install-plugin:2.3.1:install (default-install) @ org.eclipse.ease.lang.python.jython.test ---
17:39:56 [2020-11-07T22:39:56.941Z] [INFO] Installing /home/jenkins/agent/workspace/ease.verify.core.target.2019-03/tests/org.eclipse.ease.lang.python.jython.test/target/org.eclipse.ease.lang.python.jython.test-0.8.0-SNAPSHOT.jar to /home/jenkins/.m2/repository/org/eclipse/ease/org.eclipse.ease.lang.python.jython.test/0.8.0-SNAPSHOT/org.eclipse.ease.lang.python.jython.test-0.8.0-SNAPSHOT.jar
17:39:56 [2020-11-07T22:39:56.941Z] [INFO] Installing /home/jenkins/agent/workspace/ease.verify.core.target.2019-03/tests/org.eclipse.ease.lang.python.jython.test/pom.xml to /home/jenkins/.m2/repository/org/eclipse/ease/org.eclipse.ease.lang.python.jython.test/0.8.0-SNAPSHOT/org.eclipse.ease.lang.python.jython.test-0.8.0-SNAPSHOT.pom
17:39:56 [2020-11-07T22:39:56.941Z] [INFO] Installing /home/jenkins/agent/workspace/ease.verify.core.target.2019-03/tests/org.eclipse.ease.lang.python.jython.test/target/org.eclipse.ease.lang.python.jython.test-0.8.0-SNAPSHOT-sources.jar to /home/jenkins/.m2/repository/org/eclipse/ease/org.eclipse.ease.lang.python.jython.test/0.8.0-SNAPSHOT/org.eclipse.ease.lang.python.jython.test-0.8.0-SNAPSHOT-sources.jar
17:39:56 [2020-11-07T22:39:56.941Z] [INFO] Installing /home/jenkins/agent/workspace/ease.verify.core.target.2019-03/tests/org.eclipse.ease.lang.python.jython.test/target/p2content.xml to /home/jenkins/.m2/repository/org/eclipse/ease/org.eclipse.ease.lang.python.jython.test/0.8.0-SNAPSHOT/org.eclipse.ease.lang.python.jython.test-0.8.0-SNAPSHOT-p2metadata.xml
17:39:56 [2020-11-07T22:39:56.941Z] [INFO] Installing /home/jenkins/agent/workspace/ease.verify.core.target.2019-03/tests/org.eclipse.ease.lang.python.jython.test/target/p2artifacts.xml to /home/jenkins/.m2/repository/org/eclipse/ease/org.eclipse.ease.lang.python.jython.test/0.8.0-SNAPSHOT/org.eclipse.ease.lang.python.jython.test-0.8.0-SNAPSHOT-p2artifacts.xml
17:39:56 [2020-11-07T22:39:56.941Z] [INFO] Installing /home/jenkins/agent/workspace/ease.verify.core.target.2019-03/tests/org.eclipse.ease.lang.python.jython.test/target/p2content.xml to /home/jenkins/.m2/repository/org/eclipse/ease/org.eclipse.ease.lang.python.jython.test/0.8.0-SNAPSHOT/org.eclipse.ease.lang.python.jython.test-0.8.0-SNAPSHOT-p2metadata.xml
17:39:56 [2020-11-07T22:39:56.941Z] [INFO] Installing /home/jenkins/agent/workspace/ease.verify.core.target.2019-03/tests/org.eclipse.ease.lang.python.jython.test/target/p2artifacts.xml to /home/jenkins/.m2/repository/org/eclipse/ease/org.eclipse.ease.lang.python.jython.test/0.8.0-SNAPSHOT/org.eclipse.ease.lang.python.jython.test-0.8.0-SNAPSHOT-p2artifacts.xml
17:39:56 [2020-11-07T22:39:56.941Z] [INFO] 
17:39:56 [2020-11-07T22:39:56.941Z] [INFO] --- tycho-p2-plugin:1.5.0:update-local-index (default-update-local-index) @ org.eclipse.ease.lang.python.jython.test ---
17:39:56 [2020-11-07T22:39:56.941Z] [INFO] 
17:39:56 [2020-11-07T22:39:56.941Z] [INFO] -----< org.eclipse.ease:org.eclipse.ease.lang.scriptarchive.test >------
17:39:56 [2020-11-07T22:39:56.941Z] [INFO] Building org.eclipse.ease.lang.scriptarchive.test 0.8.0-SNAPSHOT [44/48]
17:39:56 [2020-11-07T22:39:56.941Z] [INFO] ------------------------[ eclipse-test-plugin ]-------------------------
17:39:56 [2020-11-07T22:39:56.941Z] [INFO] 
17:39:56 [2020-11-07T22:39:56.941Z] [INFO] --- maven-clean-plugin:2.5:clean (default-clean) @ org.eclipse.ease.lang.scriptarchive.test ---
17:39:56 [2020-11-07T22:39:56.941Z] [INFO] 
17:39:56 [2020-11-07T22:39:56.941Z] [INFO] --- tycho-packaging-plugin:1.5.0:build-qualifier (default-build-qualifier) @ org.eclipse.ease.lang.scriptarchive.test ---
17:39:56 [2020-11-07T22:39:56.941Z] [INFO] The project's OSGi version is 0.8.0.I201910171213
17:39:56 [2020-11-07T22:39:56.941Z] [INFO] 
17:39:56 [2020-11-07T22:39:56.941Z] [INFO] --- tycho-packaging-plugin:1.5.0:validate-id (default-validate-id) @ org.eclipse.ease.lang.scriptarchive.test ---
17:39:56 [2020-11-07T22:39:56.941Z] [INFO] 
17:39:56 [2020-11-07T22:39:56.941Z] [INFO] --- tycho-packaging-plugin:1.5.0:validate-version (default-validate-version) @ org.eclipse.ease.lang.scriptarchive.test ---
17:39:56 [2020-11-07T22:39:56.941Z] [INFO] 
17:39:56 [2020-11-07T22:39:56.941Z] [INFO] >>> maven-javadoc-plugin:2.9.1:javadoc (build-docs) > generate-sources @ org.eclipse.ease.lang.scriptarchive.test >>>
17:39:56 [2020-11-07T22:39:56.941Z] [INFO] 
17:39:56 [2020-11-07T22:39:56.941Z] [INFO] --- tycho-packaging-plugin:1.5.0:build-qualifier (default-build-qualifier) @ org.eclipse.ease.lang.scriptarchive.test ---
17:39:56 [2020-11-07T22:39:56.941Z] [INFO] The project's OSGi version is 0.8.0.I201910171213
17:39:56 [2020-11-07T22:39:56.941Z] [INFO] 
17:39:56 [2020-11-07T22:39:56.941Z] [INFO] --- tycho-packaging-plugin:1.5.0:validate-id (default-validate-id) @ org.eclipse.ease.lang.scriptarchive.test ---
17:39:56 [2020-11-07T22:39:56.941Z] [INFO] 
17:39:56 [2020-11-07T22:39:56.941Z] [INFO] --- tycho-packaging-plugin:1.5.0:validate-version (default-validate-version) @ org.eclipse.ease.lang.scriptarchive.test ---
17:39:56 [2020-11-07T22:39:56.941Z] [INFO] 
17:39:56 [2020-11-07T22:39:56.941Z] [INFO] <<< maven-javadoc-plugin:2.9.1:javadoc (build-docs) < generate-sources @ org.eclipse.ease.lang.scriptarchive.test <<<
17:39:56 [2020-11-07T22:39:56.941Z] [INFO] 
17:39:56 [2020-11-07T22:39:56.941Z] [INFO] 
17:39:56 [2020-11-07T22:39:56.941Z] [INFO] --- maven-javadoc-plugin:2.9.1:javadoc (build-docs) @ org.eclipse.ease.lang.scriptarchive.test ---
17:40:02 [2020-11-07T22:40:02.183Z] [ERROR] Error fetching link: http://help.eclipse.org/oxygen/topic/org.eclipse.platform.doc.isv/reference/api/package-list. Ignored it.
17:40:02 [2020-11-07T22:40:02.183Z] [ERROR] Error fetching link: https://ci.eclipse.org/ease/job/ease.build.core/JavaDoc/package-list. Ignored it.
17:40:03 [2020-11-07T22:40:03.109Z] [INFO] 
17:40:03 [2020-11-07T22:40:03.109Z] Loading source files for package org.eclipse.ease.lang.scriptarchive...
17:40:03 [2020-11-07T22:40:03.109Z] Constructing Javadoc information...
17:40:03 [2020-11-07T22:40:03.109Z] WARNING: Cannot open location "/home/jenkins/agent/workspace/ease.verify.core.target.2019-03/tests/org.eclipse.ease.lang.scriptarchive.test/target/javadoc-bundle-options/package-list"
17:40:03 [2020-11-07T22:40:03.109Z] No plugin definition found, skipping
17:40:03 [2020-11-07T22:40:03.109Z] No plugin definition found, skipping
17:40:03 [2020-11-07T22:40:03.109Z] [WARNING] Javadoc Warnings
17:40:03 [2020-11-07T22:40:03.109Z] [WARNING] Picked up JAVA_TOOL_OPTIONS: -Dmaven.ext.class.path="/home/jenkins/agent/workspace/ease.verify.core.target.2019-03@tmp/withMavendae5f2e9/pipeline-maven-spy.jar" -Dorg.jenkinsci.plugins.pipeline.maven.reportsFolder="/home/jenkins/agent/workspace/ease.verify.core.target.2019-03@tmp/withMavendae5f2e9"
17:40:03 [2020-11-07T22:40:03.109Z] [WARNING] javadoc: warning - The old Doclet and Taglet APIs in the packages
17:40:03 [2020-11-07T22:40:03.109Z] [WARNING] com.sun.javadoc, com.sun.tools.doclets and their implementations
17:40:03 [2020-11-07T22:40:03.109Z] [WARNING] are planned to be removed in a future JDK release. These
17:40:03 [2020-11-07T22:40:03.109Z] [WARNING] components have been superseded by the new APIs in jdk.javadoc.doclet.
17:40:03 [2020-11-07T22:40:03.109Z] [WARNING] Users are strongly recommended to migrate to the new APIs.
17:40:03 [2020-11-07T22:40:03.109Z] [INFO] 
17:40:03 [2020-11-07T22:40:03.109Z] [INFO] --- build-helper-maven-plugin:1.9.1:add-resource (add_help) @ org.eclipse.ease.lang.scriptarchive.test ---
17:40:03 [2020-11-07T22:40:03.109Z] [INFO] 
17:40:03 [2020-11-07T22:40:03.109Z] [INFO] --- maven-resources-plugin:2.4.3:resources (default-resources) @ org.eclipse.ease.lang.scriptarchive.test ---
17:40:03 [2020-11-07T22:40:03.109Z] [INFO] Using 'UTF-8' encoding to copy filtered resources.
17:40:03 [2020-11-07T22:40:03.109Z] [INFO] skip non existing resourceDirectory /home/jenkins/agent/workspace/ease.verify.core.target.2019-03/tests/org.eclipse.ease.lang.scriptarchive.test/src/main/resources
17:40:03 [2020-11-07T22:40:03.109Z] [INFO] skip non existing resourceDirectory /home/jenkins/agent/workspace/ease.verify.core.target.2019-03/tests/org.eclipse.ease.lang.scriptarchive.test/help
17:40:03 [2020-11-07T22:40:03.109Z] [INFO] 
17:40:03 [2020-11-07T22:40:03.109Z] [INFO] --- tycho-compiler-plugin:1.5.0:compile (default-compile) @ org.eclipse.ease.lang.scriptarchive.test ---
17:40:03 [2020-11-07T22:40:03.109Z] [INFO] Compiling 1 source file to /home/jenkins/agent/workspace/ease.verify.core.target.2019-03/tests/org.eclipse.ease.lang.scriptarchive.test/target/classes
17:40:03 [2020-11-07T22:40:03.109Z] [INFO] 
17:40:03 [2020-11-07T22:40:03.109Z] [INFO] --- maven-resources-plugin:2.4.3:testResources (default-testResources) @ org.eclipse.ease.lang.scriptarchive.test ---
17:40:03 [2020-11-07T22:40:03.109Z] [INFO] Using 'UTF-8' encoding to copy filtered resources.
17:40:03 [2020-11-07T22:40:03.109Z] [INFO] skip non existing resourceDirectory /home/jenkins/agent/workspace/ease.verify.core.target.2019-03/tests/org.eclipse.ease.lang.scriptarchive.test/src/test/resources
17:40:03 [2020-11-07T22:40:03.109Z] [INFO] 
17:40:03 [2020-11-07T22:40:03.109Z] [INFO] --- tycho-source-plugin:1.5.0:plugin-source (plugin-source) @ org.eclipse.ease.lang.scriptarchive.test ---
17:40:03 [2020-11-07T22:40:03.109Z] [INFO] Building jar: /home/jenkins/agent/workspace/ease.verify.core.target.2019-03/tests/org.eclipse.ease.lang.scriptarchive.test/target/org.eclipse.ease.lang.scriptarchive.test-0.8.0-SNAPSHOT-sources.jar
17:40:03 [2020-11-07T22:40:03.109Z] [INFO] 
17:40:03 [2020-11-07T22:40:03.109Z] [INFO] --- target-platform-configuration:1.5.0:target-platform (default-target-platform) @ org.eclipse.ease.lang.scriptarchive.test ---
17:40:03 [2020-11-07T22:40:03.109Z] [INFO] 
17:40:03 [2020-11-07T22:40:03.109Z] [INFO] --- tycho-packaging-plugin:1.5.0:package-plugin (default-package-plugin) @ org.eclipse.ease.lang.scriptarchive.test ---
17:40:03 [2020-11-07T22:40:03.400Z] [INFO] Building jar: /home/jenkins/agent/workspace/ease.verify.core.target.2019-03/tests/org.eclipse.ease.lang.scriptarchive.test/target/org.eclipse.ease.lang.scriptarchive.test-0.8.0-SNAPSHOT.jar
17:40:03 [2020-11-07T22:40:03.400Z] [INFO] 
17:40:03 [2020-11-07T22:40:03.400Z] [INFO] --- tycho-p2-plugin:1.5.0:p2-metadata-default (default-p2-metadata-default) @ org.eclipse.ease.lang.scriptarchive.test ---
17:40:03 [2020-11-07T22:40:03.400Z] [INFO] 
17:40:03 [2020-11-07T22:40:03.400Z] [INFO] --- tycho-source-feature-plugin:1.5.0:source-feature (source-feature) @ org.eclipse.ease.lang.scriptarchive.test ---
17:40:03 [2020-11-07T22:40:03.400Z] [INFO] 
17:40:03 [2020-11-07T22:40:03.400Z] [INFO] --- tycho-p2-plugin:1.5.0:p2-metadata (attached-p2-metadata) @ org.eclipse.ease.lang.scriptarchive.test ---
17:40:03 [2020-11-07T22:40:03.400Z] [INFO] 
17:40:03 [2020-11-07T22:40:03.400Z] [INFO] --- tycho-surefire-plugin:1.5.0:test (default-test) @ org.eclipse.ease.lang.scriptarchive.test ---
17:40:03 [2020-11-07T22:40:03.400Z] [INFO] Expected eclipse log file: /home/jenkins/agent/workspace/ease.verify.core.target.2019-03/tests/org.eclipse.ease.lang.scriptarchive.test/target/work/data/.metadata/.log
17:40:03 [2020-11-07T22:40:03.400Z] [INFO] Command line:
17:40:03 [2020-11-07T22:40:03.400Z] 	[/opt/tools/java/openjdk/jdk-11/11.0.2+9/bin/java, -Dosgi.noShutdown=false, -Dosgi.os=linux, -Dosgi.ws=gtk, -Dosgi.arch=x86_64, -Dosgi.clean=true, -jar, /home/jenkins/.m2/repository/p2/osgi/bundle/org.eclipse.equinox.launcher/1.5.800.v20200727-1323/org.eclipse.equinox.launcher-1.5.800.v20200727-1323.jar, -data, /home/jenkins/agent/workspace/ease.verify.core.target.2019-03/tests/org.eclipse.ease.lang.scriptarchive.test/target/work/data, -install, /home/jenkins/agent/workspace/ease.verify.core.target.2019-03/tests/org.eclipse.ease.lang.scriptarchive.test/target/work, -configuration, /home/jenkins/agent/workspace/ease.verify.core.target.2019-03/tests/org.eclipse.ease.lang.scriptarchive.test/target/work/configuration, -application, org.eclipse.tycho.surefire.osgibooter.headlesstest, -testproperties, /home/jenkins/agent/workspace/ease.verify.core.target.2019-03/tests/org.eclipse.ease.lang.scriptarchive.test/target/surefire.properties]
17:40:03 [2020-11-07T22:40:03.400Z] Picked up JAVA_TOOL_OPTIONS: -Dmaven.ext.class.path="/home/jenkins/agent/workspace/ease.verify.core.target.2019-03@tmp/withMavendae5f2e9/pipeline-maven-spy.jar" -Dorg.jenkinsci.plugins.pipeline.maven.reportsFolder="/home/jenkins/agent/workspace/ease.verify.core.target.2019-03@tmp/withMavendae5f2e9" 
17:40:05 [2020-11-07T22:40:05.360Z] Running org.eclipse.ease.lang.scriptarchive.ArchiveEngineTest
17:40:05 [2020-11-07T22:40:05.616Z] We are running from a zip file!
17:40:05 [2020-11-07T22:40:05.616Z] org.eclipse.ease.ScriptExecutionException: SyntaxError: missing ; before statement (workspace://__EASE_ScriptArchive_1/scripts/Master.js#3)
17:40:05 [2020-11-07T22:40:05.616Z] this is an error
17:40:05 [2020-11-07T22:40:05.616Z]        ^
17:40:05 [2020-11-07T22:40:05.616Z] 	at Master.js,workspace://__EASE_ScriptArchive_1/scripts/Master.js
17:40:05 [2020-11-07T22:40:05.616Z] org.eclipse.ease.ScriptExecutionException: SyntaxError: missing ; before statement (workspace://__EASE_ScriptArchive_1/scripts/Master.js#3)
17:40:05 [2020-11-07T22:40:05.616Z] this is an error
17:40:05 [2020-11-07T22:40:05.616Z]        ^
17:40:05 [2020-11-07T22:40:05.616Z] 	at Master.js,workspace://__EASE_ScriptArchive_1/scripts/Master.js
17:40:05 [2020-11-07T22:40:05.872Z] Tests run: 7, Failures: 0, Errors: 0, Skipped: 0, Time elapsed: 0.428 s - in org.eclipse.ease.lang.scriptarchive.ArchiveEngineTest
17:40:05 [2020-11-07T22:40:05.872Z] executeWithManifest(org.eclipse.ease.lang.scriptarchive.ArchiveEngineTest)  Time elapsed: 0.288 s
17:40:05 [2020-11-07T22:40:05.872Z] zipFileRegistration(org.eclipse.ease.lang.scriptarchive.ArchiveEngineTest)  Time elapsed: 0.006 s
17:40:05 [2020-11-07T22:40:05.872Z] engineIdRegistration(org.eclipse.ease.lang.scriptarchive.ArchiveEngineTest)  Time elapsed: 0 s
17:40:05 [2020-11-07T22:40:05.872Z] jarFileRegistration(org.eclipse.ease.lang.scriptarchive.ArchiveEngineTest)  Time elapsed: 0 s
17:40:05 [2020-11-07T22:40:05.872Z] sarFileRegistration(org.eclipse.ease.lang.scriptarchive.ArchiveEngineTest)  Time elapsed: 0 s
17:40:05 [2020-11-07T22:40:05.872Z] executeWithErrors(org.eclipse.ease.lang.scriptarchive.ArchiveEngineTest)  Time elapsed: 0.069 s
17:40:05 [2020-11-07T22:40:05.872Z] executeWithIncludes(org.eclipse.ease.lang.scriptarchive.ArchiveEngineTest)  Time elapsed: 0.045 s
17:40:05 [2020-11-07T22:40:05.872Z] 
17:40:05 [2020-11-07T22:40:05.872Z] Results:
17:40:05 [2020-11-07T22:40:05.872Z] 
17:40:05 [2020-11-07T22:40:05.872Z] Tests run: 7, Failures: 0, Errors: 0, Skipped: 0
17:40:05 [2020-11-07T22:40:05.872Z] 
17:40:06 [2020-11-07T22:40:06.434Z] [INFO] All tests passed!
17:40:06 [2020-11-07T22:40:06.434Z] [INFO] 
17:40:06 [2020-11-07T22:40:06.434Z] [INFO] --- maven-install-plugin:2.3.1:install (default-install) @ org.eclipse.ease.lang.scriptarchive.test ---
17:40:06 [2020-11-07T22:40:06.434Z] [INFO] Installing /home/jenkins/agent/workspace/ease.verify.core.target.2019-03/tests/org.eclipse.ease.lang.scriptarchive.test/target/org.eclipse.ease.lang.scriptarchive.test-0.8.0-SNAPSHOT.jar to /home/jenkins/.m2/repository/org/eclipse/ease/org.eclipse.ease.lang.scriptarchive.test/0.8.0-SNAPSHOT/org.eclipse.ease.lang.scriptarchive.test-0.8.0-SNAPSHOT.jar
17:40:06 [2020-11-07T22:40:06.434Z] [INFO] Installing /home/jenkins/agent/workspace/ease.verify.core.target.2019-03/tests/org.eclipse.ease.lang.scriptarchive.test/pom.xml to /home/jenkins/.m2/repository/org/eclipse/ease/org.eclipse.ease.lang.scriptarchive.test/0.8.0-SNAPSHOT/org.eclipse.ease.lang.scriptarchive.test-0.8.0-SNAPSHOT.pom
17:40:06 [2020-11-07T22:40:06.434Z] [INFO] Installing /home/jenkins/agent/workspace/ease.verify.core.target.2019-03/tests/org.eclipse.ease.lang.scriptarchive.test/target/org.eclipse.ease.lang.scriptarchive.test-0.8.0-SNAPSHOT-sources.jar to /home/jenkins/.m2/repository/org/eclipse/ease/org.eclipse.ease.lang.scriptarchive.test/0.8.0-SNAPSHOT/org.eclipse.ease.lang.scriptarchive.test-0.8.0-SNAPSHOT-sources.jar
17:40:06 [2020-11-07T22:40:06.434Z] [INFO] Installing /home/jenkins/agent/workspace/ease.verify.core.target.2019-03/tests/org.eclipse.ease.lang.scriptarchive.test/target/p2content.xml to /home/jenkins/.m2/repository/org/eclipse/ease/org.eclipse.ease.lang.scriptarchive.test/0.8.0-SNAPSHOT/org.eclipse.ease.lang.scriptarchive.test-0.8.0-SNAPSHOT-p2metadata.xml
17:40:06 [2020-11-07T22:40:06.434Z] [INFO] Installing /home/jenkins/agent/workspace/ease.verify.core.target.2019-03/tests/org.eclipse.ease.lang.scriptarchive.test/target/p2artifacts.xml to /home/jenkins/.m2/repository/org/eclipse/ease/org.eclipse.ease.lang.scriptarchive.test/0.8.0-SNAPSHOT/org.eclipse.ease.lang.scriptarchive.test-0.8.0-SNAPSHOT-p2artifacts.xml
17:40:06 [2020-11-07T22:40:06.434Z] [INFO] Installing /home/jenkins/agent/workspace/ease.verify.core.target.2019-03/tests/org.eclipse.ease.lang.scriptarchive.test/target/p2content.xml to /home/jenkins/.m2/repository/org/eclipse/ease/org.eclipse.ease.lang.scriptarchive.test/0.8.0-SNAPSHOT/org.eclipse.ease.lang.scriptarchive.test-0.8.0-SNAPSHOT-p2metadata.xml
17:40:06 [2020-11-07T22:40:06.434Z] [INFO] Installing /home/jenkins/agent/workspace/ease.verify.core.target.2019-03/tests/org.eclipse.ease.lang.scriptarchive.test/target/p2artifacts.xml to /home/jenkins/.m2/repository/org/eclipse/ease/org.eclipse.ease.lang.scriptarchive.test/0.8.0-SNAPSHOT/org.eclipse.ease.lang.scriptarchive.test-0.8.0-SNAPSHOT-p2artifacts.xml
17:40:06 [2020-11-07T22:40:06.434Z] [INFO] 
17:40:06 [2020-11-07T22:40:06.434Z] [INFO] --- tycho-p2-plugin:1.5.0:update-local-index (default-update-local-index) @ org.eclipse.ease.lang.scriptarchive.test ---
17:40:06 [2020-11-07T22:40:06.434Z] [INFO] 
17:40:06 [2020-11-07T22:40:06.434Z] [INFO] --------< org.eclipse.ease:org.eclipse.ease.lang.unittest.test >--------
17:40:06 [2020-11-07T22:40:06.434Z] [INFO] Building org.eclipse.ease.lang.unittest.test 0.8.0-SNAPSHOT      [45/48]
17:40:06 [2020-11-07T22:40:06.434Z] [INFO] ------------------------[ eclipse-test-plugin ]-------------------------
17:40:06 [2020-11-07T22:40:06.434Z] [INFO] 
17:40:06 [2020-11-07T22:40:06.434Z] [INFO] --- maven-clean-plugin:2.5:clean (default-clean) @ org.eclipse.ease.lang.unittest.test ---
17:40:06 [2020-11-07T22:40:06.434Z] [INFO] 
17:40:06 [2020-11-07T22:40:06.434Z] [INFO] --- tycho-packaging-plugin:1.5.0:build-qualifier (default-build-qualifier) @ org.eclipse.ease.lang.unittest.test ---
17:40:06 [2020-11-07T22:40:06.434Z] [INFO] The project's OSGi version is 0.8.0.I202009240747
17:40:06 [2020-11-07T22:40:06.434Z] [INFO] 
17:40:06 [2020-11-07T22:40:06.434Z] [INFO] --- tycho-packaging-plugin:1.5.0:validate-id (default-validate-id) @ org.eclipse.ease.lang.unittest.test ---
17:40:06 [2020-11-07T22:40:06.434Z] [INFO] 
17:40:06 [2020-11-07T22:40:06.434Z] [INFO] --- tycho-packaging-plugin:1.5.0:validate-version (default-validate-version) @ org.eclipse.ease.lang.unittest.test ---
17:40:06 [2020-11-07T22:40:06.434Z] [INFO] 
17:40:06 [2020-11-07T22:40:06.434Z] [INFO] >>> maven-javadoc-plugin:2.9.1:javadoc (build-docs) > generate-sources @ org.eclipse.ease.lang.unittest.test >>>
17:40:06 [2020-11-07T22:40:06.434Z] [INFO] 
17:40:06 [2020-11-07T22:40:06.434Z] [INFO] --- tycho-packaging-plugin:1.5.0:build-qualifier (default-build-qualifier) @ org.eclipse.ease.lang.unittest.test ---
17:40:06 [2020-11-07T22:40:06.434Z] [INFO] The project's OSGi version is 0.8.0.I202009240747
17:40:06 [2020-11-07T22:40:06.434Z] [INFO] 
17:40:06 [2020-11-07T22:40:06.434Z] [INFO] --- tycho-packaging-plugin:1.5.0:validate-id (default-validate-id) @ org.eclipse.ease.lang.unittest.test ---
17:40:06 [2020-11-07T22:40:06.434Z] [INFO] 
17:40:06 [2020-11-07T22:40:06.434Z] [INFO] --- tycho-packaging-plugin:1.5.0:validate-version (default-validate-version) @ org.eclipse.ease.lang.unittest.test ---
17:40:06 [2020-11-07T22:40:06.434Z] [INFO] 
17:40:06 [2020-11-07T22:40:06.434Z] [INFO] <<< maven-javadoc-plugin:2.9.1:javadoc (build-docs) < generate-sources @ org.eclipse.ease.lang.unittest.test <<<
17:40:06 [2020-11-07T22:40:06.434Z] [INFO] 
17:40:06 [2020-11-07T22:40:06.434Z] [INFO] 
17:40:06 [2020-11-07T22:40:06.434Z] [INFO] --- maven-javadoc-plugin:2.9.1:javadoc (build-docs) @ org.eclipse.ease.lang.unittest.test ---
17:40:06 [2020-11-07T22:40:06.690Z] [ERROR] Error fetching link: http://help.eclipse.org/oxygen/topic/org.eclipse.platform.doc.isv/reference/api/package-list. Ignored it.
17:40:06 [2020-11-07T22:40:06.690Z] [ERROR] Error fetching link: https://ci.eclipse.org/ease/job/ease.build.core/JavaDoc/package-list. Ignored it.
17:40:08 [2020-11-07T22:40:08.058Z] [INFO] 
17:40:08 [2020-11-07T22:40:08.058Z] Loading source files for package org.eclipse.ease.lang.unittest...
17:40:08 [2020-11-07T22:40:08.058Z] Constructing Javadoc information...
17:40:08 [2020-11-07T22:40:08.058Z] WARNING: Cannot open location "/home/jenkins/agent/workspace/ease.verify.core.target.2019-03/tests/org.eclipse.ease.lang.unittest.test/target/javadoc-bundle-options/package-list"
17:40:08 [2020-11-07T22:40:08.058Z] No plugin definition found, skipping
17:40:08 [2020-11-07T22:40:08.058Z] No plugin definition found, skipping
17:40:08 [2020-11-07T22:40:08.058Z] [WARNING] Javadoc Warnings
17:40:08 [2020-11-07T22:40:08.058Z] [WARNING] Picked up JAVA_TOOL_OPTIONS: -Dmaven.ext.class.path="/home/jenkins/agent/workspace/ease.verify.core.target.2019-03@tmp/withMavendae5f2e9/pipeline-maven-spy.jar" -Dorg.jenkinsci.plugins.pipeline.maven.reportsFolder="/home/jenkins/agent/workspace/ease.verify.core.target.2019-03@tmp/withMavendae5f2e9"
17:40:08 [2020-11-07T22:40:08.058Z] [WARNING] javadoc: warning - The old Doclet and Taglet APIs in the packages
17:40:08 [2020-11-07T22:40:08.058Z] [WARNING] com.sun.javadoc, com.sun.tools.doclets and their implementations
17:40:08 [2020-11-07T22:40:08.058Z] [WARNING] are planned to be removed in a future JDK release. These
17:40:08 [2020-11-07T22:40:08.059Z] [WARNING] components have been superseded by the new APIs in jdk.javadoc.doclet.
17:40:08 [2020-11-07T22:40:08.059Z] [WARNING] Users are strongly recommended to migrate to the new APIs.
17:40:08 [2020-11-07T22:40:08.059Z] [INFO] 
17:40:08 [2020-11-07T22:40:08.059Z] [INFO] --- build-helper-maven-plugin:1.9.1:add-resource (add_help) @ org.eclipse.ease.lang.unittest.test ---
17:40:08 [2020-11-07T22:40:08.059Z] [INFO] 
17:40:08 [2020-11-07T22:40:08.059Z] [INFO] --- maven-resources-plugin:2.4.3:resources (default-resources) @ org.eclipse.ease.lang.unittest.test ---
17:40:08 [2020-11-07T22:40:08.059Z] [INFO] Using 'UTF-8' encoding to copy filtered resources.
17:40:08 [2020-11-07T22:40:08.059Z] [INFO] skip non existing resourceDirectory /home/jenkins/agent/workspace/ease.verify.core.target.2019-03/tests/org.eclipse.ease.lang.unittest.test/src/main/resources
17:40:08 [2020-11-07T22:40:08.059Z] [INFO] skip non existing resourceDirectory /home/jenkins/agent/workspace/ease.verify.core.target.2019-03/tests/org.eclipse.ease.lang.unittest.test/help
17:40:08 [2020-11-07T22:40:08.059Z] [INFO] 
17:40:08 [2020-11-07T22:40:08.059Z] [INFO] --- tycho-compiler-plugin:1.5.0:compile (default-compile) @ org.eclipse.ease.lang.unittest.test ---
17:40:08 [2020-11-07T22:40:08.059Z] [INFO] Compiling 3 source files to /home/jenkins/agent/workspace/ease.verify.core.target.2019-03/tests/org.eclipse.ease.lang.unittest.test/target/classes
17:40:08 [2020-11-07T22:40:08.059Z] [INFO] 
17:40:08 [2020-11-07T22:40:08.059Z] [INFO] --- maven-resources-plugin:2.4.3:testResources (default-testResources) @ org.eclipse.ease.lang.unittest.test ---
17:40:08 [2020-11-07T22:40:08.059Z] [INFO] Using 'UTF-8' encoding to copy filtered resources.
17:40:08 [2020-11-07T22:40:08.059Z] [INFO] skip non existing resourceDirectory /home/jenkins/agent/workspace/ease.verify.core.target.2019-03/tests/org.eclipse.ease.lang.unittest.test/src/test/resources
17:40:08 [2020-11-07T22:40:08.059Z] [INFO] 
17:40:08 [2020-11-07T22:40:08.059Z] [INFO] --- tycho-source-plugin:1.5.0:plugin-source (plugin-source) @ org.eclipse.ease.lang.unittest.test ---
17:40:08 [2020-11-07T22:40:08.059Z] [WARNING] Bundle-Name header not found in /home/jenkins/agent/workspace/ease.verify.core.target.2019-03/tests/org.eclipse.ease.lang.unittest.test/META-INF/MANIFEST.MF, fallback to Bundle-SymbolicName for source bundle
17:40:08 [2020-11-07T22:40:08.059Z] [WARNING] Bundle-Vendor header not found in /home/jenkins/agent/workspace/ease.verify.core.target.2019-03/tests/org.eclipse.ease.lang.unittest.test/META-INF/MANIFEST.MF, fallback to 'unknown' for source bundle
17:40:08 [2020-11-07T22:40:08.059Z] [INFO] Building jar: /home/jenkins/agent/workspace/ease.verify.core.target.2019-03/tests/org.eclipse.ease.lang.unittest.test/target/org.eclipse.ease.lang.unittest.test-0.8.0-SNAPSHOT-sources.jar
17:40:08 [2020-11-07T22:40:08.059Z] [INFO] 
17:40:08 [2020-11-07T22:40:08.059Z] [INFO] --- target-platform-configuration:1.5.0:target-platform (default-target-platform) @ org.eclipse.ease.lang.unittest.test ---
17:40:08 [2020-11-07T22:40:08.059Z] [INFO] 
17:40:08 [2020-11-07T22:40:08.059Z] [INFO] --- tycho-packaging-plugin:1.5.0:package-plugin (default-package-plugin) @ org.eclipse.ease.lang.unittest.test ---
17:40:08 [2020-11-07T22:40:08.059Z] [INFO] Building jar: /home/jenkins/agent/workspace/ease.verify.core.target.2019-03/tests/org.eclipse.ease.lang.unittest.test/target/org.eclipse.ease.lang.unittest.test-0.8.0-SNAPSHOT.jar
17:40:08 [2020-11-07T22:40:08.059Z] [INFO] 
17:40:08 [2020-11-07T22:40:08.059Z] [INFO] --- tycho-p2-plugin:1.5.0:p2-metadata-default (default-p2-metadata-default) @ org.eclipse.ease.lang.unittest.test ---
17:40:08 [2020-11-07T22:40:08.059Z] [INFO] 
17:40:08 [2020-11-07T22:40:08.059Z] [INFO] --- tycho-source-feature-plugin:1.5.0:source-feature (source-feature) @ org.eclipse.ease.lang.unittest.test ---
17:40:08 [2020-11-07T22:40:08.059Z] [INFO] 
17:40:08 [2020-11-07T22:40:08.059Z] [INFO] --- tycho-p2-plugin:1.5.0:p2-metadata (attached-p2-metadata) @ org.eclipse.ease.lang.unittest.test ---
17:40:08 [2020-11-07T22:40:08.059Z] [INFO] 
17:40:08 [2020-11-07T22:40:08.059Z] [INFO] --- tycho-surefire-plugin:1.5.0:test (default-test) @ org.eclipse.ease.lang.unittest.test ---
17:40:08 [2020-11-07T22:40:08.059Z] [INFO] Expected eclipse log file: /home/jenkins/agent/workspace/ease.verify.core.target.2019-03/tests/org.eclipse.ease.lang.unittest.test/target/work/data/.metadata/.log
17:40:08 [2020-11-07T22:40:08.059Z] [INFO] Command line:
17:40:08 [2020-11-07T22:40:08.059Z] 	[/opt/tools/java/openjdk/jdk-11/11.0.2+9/bin/java, -Dosgi.noShutdown=false, -Dosgi.os=linux, -Dosgi.ws=gtk, -Dosgi.arch=x86_64, -Dosgi.clean=true, -jar, /home/jenkins/.m2/repository/p2/osgi/bundle/org.eclipse.equinox.launcher/1.5.800.v20200727-1323/org.eclipse.equinox.launcher-1.5.800.v20200727-1323.jar, -data, /home/jenkins/agent/workspace/ease.verify.core.target.2019-03/tests/org.eclipse.ease.lang.unittest.test/target/work/data, -install, /home/jenkins/agent/workspace/ease.verify.core.target.2019-03/tests/org.eclipse.ease.lang.unittest.test/target/work, -configuration, /home/jenkins/agent/workspace/ease.verify.core.target.2019-03/tests/org.eclipse.ease.lang.unittest.test/target/work/configuration, -application, org.eclipse.tycho.surefire.osgibooter.headlesstest, -testproperties, /home/jenkins/agent/workspace/ease.verify.core.target.2019-03/tests/org.eclipse.ease.lang.unittest.test/target/surefire.properties]
17:40:08 [2020-11-07T22:40:08.059Z] Picked up JAVA_TOOL_OPTIONS: -Dmaven.ext.class.path="/home/jenkins/agent/workspace/ease.verify.core.target.2019-03@tmp/withMavendae5f2e9/pipeline-maven-spy.jar" -Dorg.jenkinsci.plugins.pipeline.maven.reportsFolder="/home/jenkins/agent/workspace/ease.verify.core.target.2019-03@tmp/withMavendae5f2e9" 
17:40:09 [2020-11-07T22:40:09.946Z] Running org.eclipse.ease.lang.unittest.ClassicJavaScriptTest
17:40:11 [2020-11-07T22:40:11.337Z] Tests run: 7, Failures: 0, Errors: 0, Skipped: 0, Time elapsed: 1.443 s - in org.eclipse.ease.lang.unittest.ClassicJavaScriptTest
17:40:11 [2020-11-07T22:40:11.337Z] folderStatus(org.eclipse.ease.lang.unittest.ClassicJavaScriptTest)  Time elapsed: 0.611 s
17:40:11 [2020-11-07T22:40:11.337Z] errorTestStatus(org.eclipse.ease.lang.unittest.ClassicJavaScriptTest)  Time elapsed: 0.173 s
17:40:11 [2020-11-07T22:40:11.337Z] failureTestStatus(org.eclipse.ease.lang.unittest.ClassicJavaScriptTest)  Time elapsed: 0.126 s
17:40:11 [2020-11-07T22:40:11.337Z] verifyOutput(org.eclipse.ease.lang.unittest.ClassicJavaScriptTest)  Time elapsed: 0.124 s
17:40:11 [2020-11-07T22:40:11.337Z] suiteStatus(org.eclipse.ease.lang.unittest.ClassicJavaScriptTest)  Time elapsed: 0.148 s
17:40:11 [2020-11-07T22:40:11.337Z] ignoreTestStatus(org.eclipse.ease.lang.unittest.ClassicJavaScriptTest)  Time elapsed: 0.099 s
17:40:11 [2020-11-07T22:40:11.337Z] passTestStatus(org.eclipse.ease.lang.unittest.ClassicJavaScriptTest)  Time elapsed: 0.099 s
17:40:11 [2020-11-07T22:40:11.337Z] Running org.eclipse.ease.lang.unittest.ModernJavaScriptTest
17:40:12 [2020-11-07T22:40:12.270Z] Tests run: 8, Failures: 0, Errors: 0, Skipped: 0, Time elapsed: 0.788 s - in org.eclipse.ease.lang.unittest.ModernJavaScriptTest
17:40:12 [2020-11-07T22:40:12.270Z] folderStatus(org.eclipse.ease.lang.unittest.ModernJavaScriptTest)  Time elapsed: 0.124 s
17:40:12 [2020-11-07T22:40:12.270Z] verifyOutput(org.eclipse.ease.lang.unittest.ModernJavaScriptTest)  Time elapsed: 0.105 s
17:40:12 [2020-11-07T22:40:12.270Z] suiteStatus(org.eclipse.ease.lang.unittest.ModernJavaScriptTest)  Time elapsed: 0.101 s
17:40:12 [2020-11-07T22:40:12.270Z] ignoreTestStatus(org.eclipse.ease.lang.unittest.ModernJavaScriptTest)  Time elapsed: 0.09 s
17:40:12 [2020-11-07T22:40:12.270Z] ignoreTestClassStatus(org.eclipse.ease.lang.unittest.ModernJavaScriptTest)  Time elapsed: 0.101 s
17:40:12 [2020-11-07T22:40:12.270Z] failureTestClassStatus(org.eclipse.ease.lang.unittest.ModernJavaScriptTest)  Time elapsed: 0.089 s
17:40:12 [2020-11-07T22:40:12.270Z] errorTestClassStatus(org.eclipse.ease.lang.unittest.ModernJavaScriptTest)  Time elapsed: 0.097 s
17:40:12 [2020-11-07T22:40:12.270Z] passTestClassStatus(org.eclipse.ease.lang.unittest.ModernJavaScriptTest)  Time elapsed: 0.08 s
17:40:12 [2020-11-07T22:40:12.270Z] 
17:40:12 [2020-11-07T22:40:12.270Z] Results:
17:40:12 [2020-11-07T22:40:12.270Z] 
17:40:12 [2020-11-07T22:40:12.270Z] Tests run: 15, Failures: 0, Errors: 0, Skipped: 0
17:40:12 [2020-11-07T22:40:12.270Z] 
17:40:12 [2020-11-07T22:40:12.832Z] [INFO] All tests passed!
17:40:12 [2020-11-07T22:40:12.832Z] [INFO] 
17:40:12 [2020-11-07T22:40:12.832Z] [INFO] --- maven-install-plugin:2.3.1:install (default-install) @ org.eclipse.ease.lang.unittest.test ---
17:40:12 [2020-11-07T22:40:12.832Z] [INFO] Installing /home/jenkins/agent/workspace/ease.verify.core.target.2019-03/tests/org.eclipse.ease.lang.unittest.test/target/org.eclipse.ease.lang.unittest.test-0.8.0-SNAPSHOT.jar to /home/jenkins/.m2/repository/org/eclipse/ease/org.eclipse.ease.lang.unittest.test/0.8.0-SNAPSHOT/org.eclipse.ease.lang.unittest.test-0.8.0-SNAPSHOT.jar
17:40:12 [2020-11-07T22:40:12.832Z] [INFO] Installing /home/jenkins/agent/workspace/ease.verify.core.target.2019-03/tests/org.eclipse.ease.lang.unittest.test/pom.xml to /home/jenkins/.m2/repository/org/eclipse/ease/org.eclipse.ease.lang.unittest.test/0.8.0-SNAPSHOT/org.eclipse.ease.lang.unittest.test-0.8.0-SNAPSHOT.pom
17:40:12 [2020-11-07T22:40:12.832Z] [INFO] Installing /home/jenkins/agent/workspace/ease.verify.core.target.2019-03/tests/org.eclipse.ease.lang.unittest.test/target/org.eclipse.ease.lang.unittest.test-0.8.0-SNAPSHOT-sources.jar to /home/jenkins/.m2/repository/org/eclipse/ease/org.eclipse.ease.lang.unittest.test/0.8.0-SNAPSHOT/org.eclipse.ease.lang.unittest.test-0.8.0-SNAPSHOT-sources.jar
17:40:12 [2020-11-07T22:40:12.832Z] [INFO] Installing /home/jenkins/agent/workspace/ease.verify.core.target.2019-03/tests/org.eclipse.ease.lang.unittest.test/target/p2content.xml to /home/jenkins/.m2/repository/org/eclipse/ease/org.eclipse.ease.lang.unittest.test/0.8.0-SNAPSHOT/org.eclipse.ease.lang.unittest.test-0.8.0-SNAPSHOT-p2metadata.xml
17:40:12 [2020-11-07T22:40:12.832Z] [INFO] Installing /home/jenkins/agent/workspace/ease.verify.core.target.2019-03/tests/org.eclipse.ease.lang.unittest.test/target/p2artifacts.xml to /home/jenkins/.m2/repository/org/eclipse/ease/org.eclipse.ease.lang.unittest.test/0.8.0-SNAPSHOT/org.eclipse.ease.lang.unittest.test-0.8.0-SNAPSHOT-p2artifacts.xml
17:40:12 [2020-11-07T22:40:12.832Z] [INFO] Installing /home/jenkins/agent/workspace/ease.verify.core.target.2019-03/tests/org.eclipse.ease.lang.unittest.test/target/p2content.xml to /home/jenkins/.m2/repository/org/eclipse/ease/org.eclipse.ease.lang.unittest.test/0.8.0-SNAPSHOT/org.eclipse.ease.lang.unittest.test-0.8.0-SNAPSHOT-p2metadata.xml
17:40:12 [2020-11-07T22:40:12.832Z] [INFO] Installing /home/jenkins/agent/workspace/ease.verify.core.target.2019-03/tests/org.eclipse.ease.lang.unittest.test/target/p2artifacts.xml to /home/jenkins/.m2/repository/org/eclipse/ease/org.eclipse.ease.lang.unittest.test/0.8.0-SNAPSHOT/org.eclipse.ease.lang.unittest.test-0.8.0-SNAPSHOT-p2artifacts.xml
17:40:12 [2020-11-07T22:40:12.832Z] [INFO] 
17:40:12 [2020-11-07T22:40:12.832Z] [INFO] --- tycho-p2-plugin:1.5.0:update-local-index (default-update-local-index) @ org.eclipse.ease.lang.unittest.test ---
17:40:12 [2020-11-07T22:40:12.832Z] [INFO] 
17:40:12 [2020-11-07T22:40:12.832Z] [INFO] ---------< org.eclipse.ease:org.eclipse.ease.ui.scripts.test >----------
17:40:12 [2020-11-07T22:40:12.832Z] [INFO] Building org.eclipse.ease.ui.scripts.test 0.8.0-SNAPSHOT         [46/48]
17:40:12 [2020-11-07T22:40:12.832Z] [INFO] ------------------------[ eclipse-test-plugin ]-------------------------
17:40:12 [2020-11-07T22:40:12.832Z] [INFO] 
17:40:12 [2020-11-07T22:40:12.832Z] [INFO] --- maven-clean-plugin:2.5:clean (default-clean) @ org.eclipse.ease.ui.scripts.test ---
17:40:12 [2020-11-07T22:40:12.832Z] [INFO] 
17:40:12 [2020-11-07T22:40:12.832Z] [INFO] --- tycho-packaging-plugin:1.5.0:build-qualifier (default-build-qualifier) @ org.eclipse.ease.ui.scripts.test ---
17:40:12 [2020-11-07T22:40:12.832Z] [INFO] The project's OSGi version is 0.8.0.I202009240747
17:40:12 [2020-11-07T22:40:12.832Z] [INFO] 
17:40:12 [2020-11-07T22:40:12.832Z] [INFO] --- tycho-packaging-plugin:1.5.0:validate-id (default-validate-id) @ org.eclipse.ease.ui.scripts.test ---
17:40:12 [2020-11-07T22:40:12.832Z] [INFO] 
17:40:12 [2020-11-07T22:40:12.832Z] [INFO] --- tycho-packaging-plugin:1.5.0:validate-version (default-validate-version) @ org.eclipse.ease.ui.scripts.test ---
17:40:12 [2020-11-07T22:40:12.832Z] [INFO] 
17:40:12 [2020-11-07T22:40:12.832Z] [INFO] >>> maven-javadoc-plugin:2.9.1:javadoc (build-docs) > generate-sources @ org.eclipse.ease.ui.scripts.test >>>
17:40:12 [2020-11-07T22:40:12.832Z] [INFO] 
17:40:12 [2020-11-07T22:40:12.832Z] [INFO] --- tycho-packaging-plugin:1.5.0:build-qualifier (default-build-qualifier) @ org.eclipse.ease.ui.scripts.test ---
17:40:12 [2020-11-07T22:40:12.832Z] [INFO] The project's OSGi version is 0.8.0.I202009240747
17:40:12 [2020-11-07T22:40:12.832Z] [INFO] 
17:40:12 [2020-11-07T22:40:12.832Z] [INFO] --- tycho-packaging-plugin:1.5.0:validate-id (default-validate-id) @ org.eclipse.ease.ui.scripts.test ---
17:40:12 [2020-11-07T22:40:12.832Z] [INFO] 
17:40:12 [2020-11-07T22:40:12.833Z] [INFO] --- tycho-packaging-plugin:1.5.0:validate-version (default-validate-version) @ org.eclipse.ease.ui.scripts.test ---
17:40:12 [2020-11-07T22:40:12.833Z] [INFO] 
17:40:12 [2020-11-07T22:40:12.833Z] [INFO] <<< maven-javadoc-plugin:2.9.1:javadoc (build-docs) < generate-sources @ org.eclipse.ease.ui.scripts.test <<<
17:40:12 [2020-11-07T22:40:12.833Z] [INFO] 
17:40:12 [2020-11-07T22:40:12.833Z] [INFO] 
17:40:12 [2020-11-07T22:40:12.833Z] [INFO] --- maven-javadoc-plugin:2.9.1:javadoc (build-docs) @ org.eclipse.ease.ui.scripts.test ---
17:40:12 [2020-11-07T22:40:12.833Z] [ERROR] Error fetching link: http://help.eclipse.org/oxygen/topic/org.eclipse.platform.doc.isv/reference/api/package-list. Ignored it.
17:40:13 [2020-11-07T22:40:13.099Z] [ERROR] Error fetching link: https://ci.eclipse.org/ease/job/ease.build.core/JavaDoc/package-list. Ignored it.
17:40:14 [2020-11-07T22:40:14.100Z] [INFO] 
17:40:14 [2020-11-07T22:40:14.100Z] Loading source files for package org.eclipse.ease.ui.scripts.expressions.definitions...
17:40:14 [2020-11-07T22:40:14.100Z] Constructing Javadoc information...
17:40:14 [2020-11-07T22:40:14.100Z] WARNING: Cannot open location "/home/jenkins/agent/workspace/ease.verify.core.target.2019-03/tests/org.eclipse.ease.ui.scripts.test/target/javadoc-bundle-options/package-list"
17:40:14 [2020-11-07T22:40:14.100Z] No plugin definition found, skipping
17:40:14 [2020-11-07T22:40:14.100Z] No plugin definition found, skipping
17:40:14 [2020-11-07T22:40:14.100Z] [WARNING] Javadoc Warnings
17:40:14 [2020-11-07T22:40:14.100Z] [WARNING] Picked up JAVA_TOOL_OPTIONS: -Dmaven.ext.class.path="/home/jenkins/agent/workspace/ease.verify.core.target.2019-03@tmp/withMavendae5f2e9/pipeline-maven-spy.jar" -Dorg.jenkinsci.plugins.pipeline.maven.reportsFolder="/home/jenkins/agent/workspace/ease.verify.core.target.2019-03@tmp/withMavendae5f2e9"
17:40:14 [2020-11-07T22:40:14.100Z] [WARNING] javadoc: warning - The old Doclet and Taglet APIs in the packages
17:40:14 [2020-11-07T22:40:14.100Z] [WARNING] com.sun.javadoc, com.sun.tools.doclets and their implementations
17:40:14 [2020-11-07T22:40:14.100Z] [WARNING] are planned to be removed in a future JDK release. These
17:40:14 [2020-11-07T22:40:14.100Z] [WARNING] components have been superseded by the new APIs in jdk.javadoc.doclet.
17:40:14 [2020-11-07T22:40:14.100Z] [WARNING] Users are strongly recommended to migrate to the new APIs.
17:40:14 [2020-11-07T22:40:14.100Z] [INFO] 
17:40:14 [2020-11-07T22:40:14.100Z] [INFO] --- build-helper-maven-plugin:1.9.1:add-resource (add_help) @ org.eclipse.ease.ui.scripts.test ---
17:40:14 [2020-11-07T22:40:14.100Z] [INFO] 
17:40:14 [2020-11-07T22:40:14.100Z] [INFO] --- maven-resources-plugin:2.4.3:resources (default-resources) @ org.eclipse.ease.ui.scripts.test ---
17:40:14 [2020-11-07T22:40:14.100Z] [INFO] Using 'UTF-8' encoding to copy filtered resources.
17:40:14 [2020-11-07T22:40:14.100Z] [INFO] skip non existing resourceDirectory /home/jenkins/agent/workspace/ease.verify.core.target.2019-03/tests/org.eclipse.ease.ui.scripts.test/src/main/resources
17:40:14 [2020-11-07T22:40:14.100Z] [INFO] skip non existing resourceDirectory /home/jenkins/agent/workspace/ease.verify.core.target.2019-03/tests/org.eclipse.ease.ui.scripts.test/help
17:40:14 [2020-11-07T22:40:14.100Z] [INFO] 
17:40:14 [2020-11-07T22:40:14.100Z] [INFO] --- tycho-compiler-plugin:1.5.0:compile (default-compile) @ org.eclipse.ease.ui.scripts.test ---
17:40:14 [2020-11-07T22:40:14.100Z] [INFO] Compiling 1 source file to /home/jenkins/agent/workspace/ease.verify.core.target.2019-03/tests/org.eclipse.ease.ui.scripts.test/target/classes
17:40:14 [2020-11-07T22:40:14.100Z] [INFO] 
17:40:14 [2020-11-07T22:40:14.100Z] [INFO] --- maven-resources-plugin:2.4.3:testResources (default-testResources) @ org.eclipse.ease.ui.scripts.test ---
17:40:14 [2020-11-07T22:40:14.100Z] [INFO] Using 'UTF-8' encoding to copy filtered resources.
17:40:14 [2020-11-07T22:40:14.100Z] [INFO] skip non existing resourceDirectory /home/jenkins/agent/workspace/ease.verify.core.target.2019-03/tests/org.eclipse.ease.ui.scripts.test/src/test/resources
17:40:14 [2020-11-07T22:40:14.100Z] [INFO] 
17:40:14 [2020-11-07T22:40:14.100Z] [INFO] --- tycho-source-plugin:1.5.0:plugin-source (plugin-source) @ org.eclipse.ease.ui.scripts.test ---
17:40:14 [2020-11-07T22:40:14.100Z] [INFO] Building jar: /home/jenkins/agent/workspace/ease.verify.core.target.2019-03/tests/org.eclipse.ease.ui.scripts.test/target/org.eclipse.ease.ui.scripts.test-0.8.0-SNAPSHOT-sources.jar
17:40:14 [2020-11-07T22:40:14.100Z] [INFO] 
17:40:14 [2020-11-07T22:40:14.100Z] [INFO] --- target-platform-configuration:1.5.0:target-platform (default-target-platform) @ org.eclipse.ease.ui.scripts.test ---
17:40:14 [2020-11-07T22:40:14.100Z] [INFO] 
17:40:14 [2020-11-07T22:40:14.100Z] [INFO] --- tycho-packaging-plugin:1.5.0:package-plugin (default-package-plugin) @ org.eclipse.ease.ui.scripts.test ---
17:40:14 [2020-11-07T22:40:14.100Z] [INFO] Building jar: /home/jenkins/agent/workspace/ease.verify.core.target.2019-03/tests/org.eclipse.ease.ui.scripts.test/target/org.eclipse.ease.ui.scripts.test-0.8.0-SNAPSHOT.jar
17:40:14 [2020-11-07T22:40:14.100Z] [INFO] 
17:40:14 [2020-11-07T22:40:14.100Z] [INFO] --- tycho-p2-plugin:1.5.0:p2-metadata-default (default-p2-metadata-default) @ org.eclipse.ease.ui.scripts.test ---
17:40:14 [2020-11-07T22:40:14.100Z] [INFO] 
17:40:14 [2020-11-07T22:40:14.100Z] [INFO] --- tycho-source-feature-plugin:1.5.0:source-feature (source-feature) @ org.eclipse.ease.ui.scripts.test ---
17:40:14 [2020-11-07T22:40:14.100Z] [INFO] 
17:40:14 [2020-11-07T22:40:14.100Z] [INFO] --- tycho-p2-plugin:1.5.0:p2-metadata (attached-p2-metadata) @ org.eclipse.ease.ui.scripts.test ---
17:40:14 [2020-11-07T22:40:14.101Z] [INFO] 
17:40:14 [2020-11-07T22:40:14.101Z] [INFO] --- tycho-surefire-plugin:1.5.0:test (default-test) @ org.eclipse.ease.ui.scripts.test ---
17:40:14 [2020-11-07T22:40:14.101Z] [INFO] Expected eclipse log file: /home/jenkins/agent/workspace/ease.verify.core.target.2019-03/tests/org.eclipse.ease.ui.scripts.test/target/work/data/.metadata/.log
17:40:14 [2020-11-07T22:40:14.101Z] [INFO] Command line:
17:40:14 [2020-11-07T22:40:14.101Z] 	[/opt/tools/java/openjdk/jdk-11/11.0.2+9/bin/java, -Dosgi.noShutdown=false, -Dosgi.os=linux, -Dosgi.ws=gtk, -Dosgi.arch=x86_64, -Dosgi.clean=true, -jar, /home/jenkins/.m2/repository/p2/osgi/bundle/org.eclipse.equinox.launcher/1.5.800.v20200727-1323/org.eclipse.equinox.launcher-1.5.800.v20200727-1323.jar, -data, /home/jenkins/agent/workspace/ease.verify.core.target.2019-03/tests/org.eclipse.ease.ui.scripts.test/target/work/data, -install, /home/jenkins/agent/workspace/ease.verify.core.target.2019-03/tests/org.eclipse.ease.ui.scripts.test/target/work, -configuration, /home/jenkins/agent/workspace/ease.verify.core.target.2019-03/tests/org.eclipse.ease.ui.scripts.test/target/work/configuration, -application, org.eclipse.tycho.surefire.osgibooter.headlesstest, -testproperties, /home/jenkins/agent/workspace/ease.verify.core.target.2019-03/tests/org.eclipse.ease.ui.scripts.test/target/surefire.properties]
17:40:14 [2020-11-07T22:40:14.101Z] Picked up JAVA_TOOL_OPTIONS: -Dmaven.ext.class.path="/home/jenkins/agent/workspace/ease.verify.core.target.2019-03@tmp/withMavendae5f2e9/pipeline-maven-spy.jar" -Dorg.jenkinsci.plugins.pipeline.maven.reportsFolder="/home/jenkins/agent/workspace/ease.verify.core.target.2019-03@tmp/withMavendae5f2e9" 
17:40:16 [2020-11-07T22:40:16.023Z] Running org.eclipse.ease.ui.scripts.expressions.definitions.ExpressionFactoryTest
17:40:16 [2020-11-07T22:40:16.023Z] Tests run: 14, Failures: 0, Errors: 0, Skipped: 0, Time elapsed: 0.022 s - in org.eclipse.ease.ui.scripts.expressions.definitions.ExpressionFactoryTest
17:40:16 [2020-11-07T22:40:16.023Z] loadClassWithExpression  Time elapsed: 0.008 s
17:40:16 [2020-11-07T22:40:16.023Z] createWithExpression  Time elapsed: 0 s
17:40:16 [2020-11-07T22:40:16.023Z] createReferenceExpression  Time elapsed: 0.001 s
17:40:16 [2020-11-07T22:40:16.023Z] loadClassReferenceExpression  Time elapsed: 0.001 s
17:40:16 [2020-11-07T22:40:16.023Z] loadClassTestExpression  Time elapsed: 0 s
17:40:16 [2020-11-07T22:40:16.023Z] createEqualsExpression  Time elapsed: 0 s
17:40:16 [2020-11-07T22:40:16.023Z] loadClassCountExpression  Time elapsed: 0.001 s
17:40:16 [2020-11-07T22:40:16.023Z] loadClassOrExpression  Time elapsed: 0.001 s
17:40:16 [2020-11-07T22:40:16.023Z] createTestExpression  Time elapsed: 0.002 s
17:40:16 [2020-11-07T22:40:16.023Z] createOrExpression  Time elapsed: 0.001 s
17:40:16 [2020-11-07T22:40:16.023Z] loadClassAndExpression  Time elapsed: 0 s
17:40:16 [2020-11-07T22:40:16.023Z] createAndExpression  Time elapsed: 0 s
17:40:16 [2020-11-07T22:40:16.023Z] loadClassEqualsExpression  Time elapsed: 0 s
17:40:16 [2020-11-07T22:40:16.023Z] createCountExpression  Time elapsed: 0 s
17:40:16 [2020-11-07T22:40:16.023Z] 
17:40:16 [2020-11-07T22:40:16.023Z] Results:
17:40:16 [2020-11-07T22:40:16.023Z] 
17:40:16 [2020-11-07T22:40:16.023Z] Tests run: 14, Failures: 0, Errors: 0, Skipped: 0
17:40:16 [2020-11-07T22:40:16.023Z] 
17:40:16 [2020-11-07T22:40:16.958Z] [INFO] All tests passed!
17:40:16 [2020-11-07T22:40:16.958Z] [INFO] 
17:40:16 [2020-11-07T22:40:16.958Z] [INFO] --- maven-install-plugin:2.3.1:install (default-install) @ org.eclipse.ease.ui.scripts.test ---
17:40:16 [2020-11-07T22:40:16.959Z] [INFO] Installing /home/jenkins/agent/workspace/ease.verify.core.target.2019-03/tests/org.eclipse.ease.ui.scripts.test/target/org.eclipse.ease.ui.scripts.test-0.8.0-SNAPSHOT.jar to /home/jenkins/.m2/repository/org/eclipse/ease/org.eclipse.ease.ui.scripts.test/0.8.0-SNAPSHOT/org.eclipse.ease.ui.scripts.test-0.8.0-SNAPSHOT.jar
17:40:16 [2020-11-07T22:40:16.959Z] [INFO] Installing /home/jenkins/agent/workspace/ease.verify.core.target.2019-03/tests/org.eclipse.ease.ui.scripts.test/pom.xml to /home/jenkins/.m2/repository/org/eclipse/ease/org.eclipse.ease.ui.scripts.test/0.8.0-SNAPSHOT/org.eclipse.ease.ui.scripts.test-0.8.0-SNAPSHOT.pom
17:40:16 [2020-11-07T22:40:16.959Z] [INFO] Installing /home/jenkins/agent/workspace/ease.verify.core.target.2019-03/tests/org.eclipse.ease.ui.scripts.test/target/org.eclipse.ease.ui.scripts.test-0.8.0-SNAPSHOT-sources.jar to /home/jenkins/.m2/repository/org/eclipse/ease/org.eclipse.ease.ui.scripts.test/0.8.0-SNAPSHOT/org.eclipse.ease.ui.scripts.test-0.8.0-SNAPSHOT-sources.jar
17:40:16 [2020-11-07T22:40:16.959Z] [INFO] Installing /home/jenkins/agent/workspace/ease.verify.core.target.2019-03/tests/org.eclipse.ease.ui.scripts.test/target/p2content.xml to /home/jenkins/.m2/repository/org/eclipse/ease/org.eclipse.ease.ui.scripts.test/0.8.0-SNAPSHOT/org.eclipse.ease.ui.scripts.test-0.8.0-SNAPSHOT-p2metadata.xml
17:40:16 [2020-11-07T22:40:16.959Z] [INFO] Installing /home/jenkins/agent/workspace/ease.verify.core.target.2019-03/tests/org.eclipse.ease.ui.scripts.test/target/p2artifacts.xml to /home/jenkins/.m2/repository/org/eclipse/ease/org.eclipse.ease.ui.scripts.test/0.8.0-SNAPSHOT/org.eclipse.ease.ui.scripts.test-0.8.0-SNAPSHOT-p2artifacts.xml
17:40:16 [2020-11-07T22:40:16.959Z] [INFO] Installing /home/jenkins/agent/workspace/ease.verify.core.target.2019-03/tests/org.eclipse.ease.ui.scripts.test/target/p2content.xml to /home/jenkins/.m2/repository/org/eclipse/ease/org.eclipse.ease.ui.scripts.test/0.8.0-SNAPSHOT/org.eclipse.ease.ui.scripts.test-0.8.0-SNAPSHOT-p2metadata.xml
17:40:16 [2020-11-07T22:40:16.959Z] [INFO] Installing /home/jenkins/agent/workspace/ease.verify.core.target.2019-03/tests/org.eclipse.ease.ui.scripts.test/target/p2artifacts.xml to /home/jenkins/.m2/repository/org/eclipse/ease/org.eclipse.ease.ui.scripts.test/0.8.0-SNAPSHOT/org.eclipse.ease.ui.scripts.test-0.8.0-SNAPSHOT-p2artifacts.xml
17:40:16 [2020-11-07T22:40:16.959Z] [INFO] 
17:40:16 [2020-11-07T22:40:16.959Z] [INFO] --- tycho-p2-plugin:1.5.0:update-local-index (default-update-local-index) @ org.eclipse.ease.ui.scripts.test ---
17:40:16 [2020-11-07T22:40:16.959Z] [INFO] 
17:40:16 [2020-11-07T22:40:16.959Z] [INFO] -------------< org.eclipse.ease:org.eclipse.ease.ui.test >--------------
17:40:16 [2020-11-07T22:40:16.959Z] [INFO] Building org.eclipse.ease.ui.test 0.8.0-SNAPSHOT                 [47/48]
17:40:16 [2020-11-07T22:40:16.959Z] [INFO] ------------------------[ eclipse-test-plugin ]-------------------------
17:40:16 [2020-11-07T22:40:16.959Z] [INFO] 
17:40:16 [2020-11-07T22:40:16.959Z] [INFO] --- maven-clean-plugin:2.5:clean (default-clean) @ org.eclipse.ease.ui.test ---
17:40:16 [2020-11-07T22:40:16.959Z] [INFO] 
17:40:16 [2020-11-07T22:40:16.959Z] [INFO] --- tycho-packaging-plugin:1.5.0:build-qualifier (default-build-qualifier) @ org.eclipse.ease.ui.test ---
17:40:16 [2020-11-07T22:40:16.959Z] [INFO] The project's OSGi version is 0.8.0.I201910171213
17:40:16 [2020-11-07T22:40:16.959Z] [INFO] 
17:40:16 [2020-11-07T22:40:16.959Z] [INFO] --- tycho-packaging-plugin:1.5.0:validate-id (default-validate-id) @ org.eclipse.ease.ui.test ---
17:40:16 [2020-11-07T22:40:16.959Z] [INFO] 
17:40:16 [2020-11-07T22:40:16.959Z] [INFO] --- tycho-packaging-plugin:1.5.0:validate-version (default-validate-version) @ org.eclipse.ease.ui.test ---
17:40:16 [2020-11-07T22:40:16.959Z] [INFO] 
17:40:16 [2020-11-07T22:40:16.959Z] [INFO] >>> maven-javadoc-plugin:2.9.1:javadoc (build-docs) > generate-sources @ org.eclipse.ease.ui.test >>>
17:40:16 [2020-11-07T22:40:16.959Z] [INFO] 
17:40:16 [2020-11-07T22:40:16.959Z] [INFO] --- tycho-packaging-plugin:1.5.0:build-qualifier (default-build-qualifier) @ org.eclipse.ease.ui.test ---
17:40:16 [2020-11-07T22:40:16.959Z] [INFO] The project's OSGi version is 0.8.0.I201910171213
17:40:16 [2020-11-07T22:40:16.959Z] [INFO] 
17:40:16 [2020-11-07T22:40:16.959Z] [INFO] --- tycho-packaging-plugin:1.5.0:validate-id (default-validate-id) @ org.eclipse.ease.ui.test ---
17:40:16 [2020-11-07T22:40:16.959Z] [INFO] 
17:40:16 [2020-11-07T22:40:16.959Z] [INFO] --- tycho-packaging-plugin:1.5.0:validate-version (default-validate-version) @ org.eclipse.ease.ui.test ---
17:40:16 [2020-11-07T22:40:16.959Z] [INFO] 
17:40:16 [2020-11-07T22:40:16.959Z] [INFO] <<< maven-javadoc-plugin:2.9.1:javadoc (build-docs) < generate-sources @ org.eclipse.ease.ui.test <<<
17:40:16 [2020-11-07T22:40:16.959Z] [INFO] 
17:40:16 [2020-11-07T22:40:16.959Z] [INFO] 
17:40:16 [2020-11-07T22:40:16.959Z] [INFO] --- maven-javadoc-plugin:2.9.1:javadoc (build-docs) @ org.eclipse.ease.ui.test ---
17:40:16 [2020-11-07T22:40:16.959Z] [ERROR] Error fetching link: http://help.eclipse.org/oxygen/topic/org.eclipse.platform.doc.isv/reference/api/package-list. Ignored it.
17:40:16 [2020-11-07T22:40:16.959Z] [ERROR] Error fetching link: https://ci.eclipse.org/ease/job/ease.build.core/JavaDoc/package-list. Ignored it.
17:40:18 [2020-11-07T22:40:18.336Z] [INFO] 
17:40:18 [2020-11-07T22:40:18.336Z] Loading source files for package org.eclipse.ease.ui.completion...
17:40:18 [2020-11-07T22:40:18.336Z] Loading source files for package org.eclipse.ease.ui.completion.provider...
17:40:18 [2020-11-07T22:40:18.336Z] Loading source files for package org.eclipse.ease.ui.completions.java.provider...
17:40:18 [2020-11-07T22:40:18.336Z] Loading source files for package org.eclipse.ease.ui.help.hovers...
17:40:18 [2020-11-07T22:40:18.336Z] Constructing Javadoc information...
17:40:18 [2020-11-07T22:40:18.336Z] WARNING: Cannot open location "/home/jenkins/agent/workspace/ease.verify.core.target.2019-03/tests/org.eclipse.ease.ui.test/target/javadoc-bundle-options/package-list"
17:40:18 [2020-11-07T22:40:18.336Z] [WARNING] Javadoc Warnings
17:40:18 [2020-11-07T22:40:18.336Z] [WARNING] Picked up JAVA_TOOL_OPTIONS: -Dmaven.ext.class.path="/home/jenkins/agent/workspace/ease.verify.core.target.2019-03@tmp/withMavendae5f2e9/pipeline-maven-spy.jar" -Dorg.jenkinsci.plugins.pipeline.maven.reportsFolder="/home/jenkins/agent/workspace/ease.verify.core.target.2019-03@tmp/withMavendae5f2e9"
17:40:18 [2020-11-07T22:40:18.336Z] [WARNING] javadoc: warning - The old Doclet and Taglet APIs in the packages
17:40:18 [2020-11-07T22:40:18.336Z] [WARNING] com.sun.javadoc, com.sun.tools.doclets and their implementations
17:40:18 [2020-11-07T22:40:18.337Z] [WARNING] are planned to be removed in a future JDK release. These
17:40:18 [2020-11-07T22:40:18.337Z] [WARNING] components have been superseded by the new APIs in jdk.javadoc.doclet.
17:40:18 [2020-11-07T22:40:18.337Z] [WARNING] Users are strongly recommended to migrate to the new APIs.
17:40:18 [2020-11-07T22:40:18.337Z] [INFO] 
17:40:18 [2020-11-07T22:40:18.337Z] [INFO] --- build-helper-maven-plugin:1.9.1:add-resource (add_help) @ org.eclipse.ease.ui.test ---
17:40:18 [2020-11-07T22:40:18.337Z] [INFO] 
17:40:18 [2020-11-07T22:40:18.337Z] [INFO] --- maven-resources-plugin:2.4.3:resources (default-resources) @ org.eclipse.ease.ui.test ---
17:40:18 [2020-11-07T22:40:18.337Z] [INFO] Using 'UTF-8' encoding to copy filtered resources.
17:40:18 [2020-11-07T22:40:18.337Z] [INFO] skip non existing resourceDirectory /home/jenkins/agent/workspace/ease.verify.core.target.2019-03/tests/org.eclipse.ease.ui.test/src/main/resources
17:40:18 [2020-11-07T22:40:18.337Z] [INFO] Copying 2 resources to help
17:40:18 [2020-11-07T22:40:18.337Z] [INFO] 
17:40:18 [2020-11-07T22:40:18.337Z] [INFO] --- tycho-compiler-plugin:1.5.0:compile (default-compile) @ org.eclipse.ease.ui.test ---
17:40:18 [2020-11-07T22:40:18.337Z] [INFO] Compiling 6 source files to /home/jenkins/agent/workspace/ease.verify.core.target.2019-03/tests/org.eclipse.ease.ui.test/target/classes
17:40:18 [2020-11-07T22:40:18.337Z] [INFO] 
17:40:18 [2020-11-07T22:40:18.337Z] [INFO] --- maven-resources-plugin:2.4.3:testResources (default-testResources) @ org.eclipse.ease.ui.test ---
17:40:18 [2020-11-07T22:40:18.337Z] [INFO] Using 'UTF-8' encoding to copy filtered resources.
17:40:18 [2020-11-07T22:40:18.337Z] [INFO] skip non existing resourceDirectory /home/jenkins/agent/workspace/ease.verify.core.target.2019-03/tests/org.eclipse.ease.ui.test/src/test/resources
17:40:18 [2020-11-07T22:40:18.337Z] [INFO] 
17:40:18 [2020-11-07T22:40:18.337Z] [INFO] --- tycho-source-plugin:1.5.0:plugin-source (plugin-source) @ org.eclipse.ease.ui.test ---
17:40:18 [2020-11-07T22:40:18.337Z] [WARNING] Bundle-Vendor header not found in /home/jenkins/agent/workspace/ease.verify.core.target.2019-03/tests/org.eclipse.ease.ui.test/META-INF/MANIFEST.MF, fallback to 'unknown' for source bundle
17:40:18 [2020-11-07T22:40:18.337Z] [INFO] Building jar: /home/jenkins/agent/workspace/ease.verify.core.target.2019-03/tests/org.eclipse.ease.ui.test/target/org.eclipse.ease.ui.test-0.8.0-SNAPSHOT-sources.jar
17:40:18 [2020-11-07T22:40:18.337Z] [INFO] 
17:40:18 [2020-11-07T22:40:18.337Z] [INFO] --- target-platform-configuration:1.5.0:target-platform (default-target-platform) @ org.eclipse.ease.ui.test ---
17:40:18 [2020-11-07T22:40:18.337Z] [INFO] 
17:40:18 [2020-11-07T22:40:18.337Z] [INFO] --- tycho-packaging-plugin:1.5.0:package-plugin (default-package-plugin) @ org.eclipse.ease.ui.test ---
17:40:18 [2020-11-07T22:40:18.337Z] [INFO] Building jar: /home/jenkins/agent/workspace/ease.verify.core.target.2019-03/tests/org.eclipse.ease.ui.test/target/org.eclipse.ease.ui.test-0.8.0-SNAPSHOT.jar
17:40:18 [2020-11-07T22:40:18.337Z] [INFO] 
17:40:18 [2020-11-07T22:40:18.337Z] [INFO] --- tycho-p2-plugin:1.5.0:p2-metadata-default (default-p2-metadata-default) @ org.eclipse.ease.ui.test ---
17:40:18 [2020-11-07T22:40:18.337Z] [INFO] 
17:40:18 [2020-11-07T22:40:18.337Z] [INFO] --- tycho-source-feature-plugin:1.5.0:source-feature (source-feature) @ org.eclipse.ease.ui.test ---
17:40:18 [2020-11-07T22:40:18.337Z] [INFO] 
17:40:18 [2020-11-07T22:40:18.337Z] [INFO] --- tycho-p2-plugin:1.5.0:p2-metadata (attached-p2-metadata) @ org.eclipse.ease.ui.test ---
17:40:18 [2020-11-07T22:40:18.337Z] [INFO] 
17:40:18 [2020-11-07T22:40:18.337Z] [INFO] --- tycho-surefire-plugin:1.5.0:test (default-test) @ org.eclipse.ease.ui.test ---
17:40:18 [2020-11-07T22:40:18.337Z] [INFO] Expected eclipse log file: /home/jenkins/agent/workspace/ease.verify.core.target.2019-03/tests/org.eclipse.ease.ui.test/target/work/data/.metadata/.log
17:40:18 [2020-11-07T22:40:18.337Z] [INFO] Command line:
17:40:18 [2020-11-07T22:40:18.337Z] 	[/opt/tools/java/openjdk/jdk-11/11.0.2+9/bin/java, -Dosgi.noShutdown=false, -Dosgi.os=linux, -Dosgi.ws=gtk, -Dosgi.arch=x86_64, -Dosgi.clean=true, -jar, /home/jenkins/.m2/repository/p2/osgi/bundle/org.eclipse.equinox.launcher/1.5.800.v20200727-1323/org.eclipse.equinox.launcher-1.5.800.v20200727-1323.jar, -data, /home/jenkins/agent/workspace/ease.verify.core.target.2019-03/tests/org.eclipse.ease.ui.test/target/work/data, -install, /home/jenkins/agent/workspace/ease.verify.core.target.2019-03/tests/org.eclipse.ease.ui.test/target/work, -configuration, /home/jenkins/agent/workspace/ease.verify.core.target.2019-03/tests/org.eclipse.ease.ui.test/target/work/configuration, -application, org.eclipse.tycho.surefire.osgibooter.headlesstest, -testproperties, /home/jenkins/agent/workspace/ease.verify.core.target.2019-03/tests/org.eclipse.ease.ui.test/target/surefire.properties]
17:40:18 [2020-11-07T22:40:18.593Z] Picked up JAVA_TOOL_OPTIONS: -Dmaven.ext.class.path="/home/jenkins/agent/workspace/ease.verify.core.target.2019-03@tmp/withMavendae5f2e9/pipeline-maven-spy.jar" -Dorg.jenkinsci.plugins.pipeline.maven.reportsFolder="/home/jenkins/agent/workspace/ease.verify.core.target.2019-03@tmp/withMavendae5f2e9" 
17:40:19 [2020-11-07T22:40:19.999Z] Running org.eclipse.ease.ui.help.hovers.ModuleHelpTest
17:40:20 [2020-11-07T22:40:20.255Z] Tests run: 4, Failures: 0, Errors: 0, Skipped: 4, Time elapsed: 0.069 s - in org.eclipse.ease.ui.help.hovers.ModuleHelpTest
17:40:20 [2020-11-07T22:40:20.255Z] getModuleHelpLocation(org.eclipse.ease.ui.help.hovers.ModuleHelpTest) skipped
17:40:20 [2020-11-07T22:40:20.255Z] getModuleHelp(org.eclipse.ease.ui.help.hovers.ModuleHelpTest) skipped
17:40:20 [2020-11-07T22:40:20.255Z] getMethodHelp(org.eclipse.ease.ui.help.hovers.ModuleHelpTest) skipped
17:40:20 [2020-11-07T22:40:20.255Z] getConstantHelp(org.eclipse.ease.ui.help.hovers.ModuleHelpTest) skipped
17:40:20 [2020-11-07T22:40:20.255Z] Running org.eclipse.ease.ui.completion.provider.AbstractFileLocationCompletionProviderTest
17:40:20 [2020-11-07T22:40:20.255Z] Tests run: 8, Failures: 0, Errors: 0, Skipped: 8, Time elapsed: 0.081 s - in org.eclipse.ease.ui.completion.provider.AbstractFileLocationCompletionProviderTest
17:40:20 [2020-11-07T22:40:20.255Z] workspaceProjectProposals(org.eclipse.ease.ui.completion.provider.AbstractFileLocationCompletionProviderTest) skipped
17:40:20 [2020-11-07T22:40:20.255Z] checkOperatingSystem(org.eclipse.ease.ui.completion.provider.AbstractFileLocationCompletionProviderTest) skipped
17:40:20 [2020-11-07T22:40:20.255Z] absoluteRootWorkspaceProposals(org.eclipse.ease.ui.completion.provider.AbstractFileLocationCompletionProviderTest) skipped
17:40:20 [2020-11-07T22:40:20.255Z] workspaceFolderProposals(org.eclipse.ease.ui.completion.provider.AbstractFileLocationCompletionProviderTest) skipped
17:40:20 [2020-11-07T22:40:20.255Z] fileSystemFolderProposals(org.eclipse.ease.ui.completion.provider.AbstractFileLocationCompletionProviderTest) skipped
17:40:20 [2020-11-07T22:40:20.255Z] workspaceProposals(org.eclipse.ease.ui.completion.provider.AbstractFileLocationCompletionProviderTest) skipped
17:40:20 [2020-11-07T22:40:20.255Z] relativeRootWorkspaceProposals(org.eclipse.ease.ui.completion.provider.AbstractFileLocationCompletionProviderTest) skipped
17:40:20 [2020-11-07T22:40:20.255Z] fileSystemRootProposals(org.eclipse.ease.ui.completion.provider.AbstractFileLocationCompletionProviderTest) skipped
17:40:20 [2020-11-07T22:40:20.255Z] Running org.eclipse.ease.ui.completion.CompletionContextTest
17:40:20 [2020-11-07T22:40:20.255Z] Tests run: 9, Failures: 0, Errors: 0, Skipped: 0, Time elapsed: 0.006 s - in org.eclipse.ease.ui.completion.CompletionContextTest
17:40:20 [2020-11-07T22:40:20.255Z] resolveStaticClass(org.eclipse.ease.ui.completion.CompletionContextTest)  Time elapsed: 0.003 s
17:40:20 [2020-11-07T22:40:20.255Z] resolveClassWithFilter(org.eclipse.ease.ui.completion.CompletionContextTest)  Time elapsed: 0 s
17:40:20 [2020-11-07T22:40:20.255Z] simplifyCalls(org.eclipse.ease.ui.completion.CompletionContextTest)  Time elapsed: 0 s
17:40:20 [2020-11-07T22:40:20.255Z] resolveClass(org.eclipse.ease.ui.completion.CompletionContextTest)  Time elapsed: 0 s
17:40:20 [2020-11-07T22:40:20.255Z] replaceEscapedStringLiterals(org.eclipse.ease.ui.completion.CompletionContextTest)  Time elapsed: 0.001 s
17:40:20 [2020-11-07T22:40:20.255Z] replaceSimpleStringLiterals(org.eclipse.ease.ui.completion.CompletionContextTest)  Time elapsed: 0 s
17:40:20 [2020-11-07T22:40:20.255Z] resolveStaticClassWithFilter(org.eclipse.ease.ui.completion.CompletionContextTest)  Time elapsed: 0 s
17:40:20 [2020-11-07T22:40:20.255Z] resolveClassWithParameters(org.eclipse.ease.ui.completion.CompletionContextTest)  Time elapsed: 0 s
17:40:20 [2020-11-07T22:40:20.255Z] replaceMultipleStringLiterals(org.eclipse.ease.ui.completion.CompletionContextTest)  Time elapsed: 0 s
17:40:20 [2020-11-07T22:40:20.255Z] Running org.eclipse.ease.ui.completions.java.provider.JavaPackagesCompletionsProviderTest
17:40:20 [2020-11-07T22:40:20.255Z] WARNING: An illegal reflective access operation has occurred
17:40:20 [2020-11-07T22:40:20.255Z] WARNING: Illegal reflective access by org.mockito.cglib.core.ReflectUtils$2 (file:/home/jenkins/.m2/repository/p2/osgi/bundle/org.mockito/1.9.5.v201605172210/org.mockito-1.9.5.v201605172210.jar) to method java.lang.ClassLoader.defineClass(java.lang.String,byte[],int,int,java.security.ProtectionDomain)
17:40:20 [2020-11-07T22:40:20.255Z] WARNING: Please consider reporting this to the maintainers of org.mockito.cglib.core.ReflectUtils$2
17:40:20 [2020-11-07T22:40:20.255Z] WARNING: Use --illegal-access=warn to enable warnings of further illegal reflective access operations
17:40:20 [2020-11-07T22:40:20.255Z] WARNING: All illegal access operations will be denied in a future release
17:40:26 [2020-11-07T22:40:26.792Z] Tests run: 4, Failures: 0, Errors: 0, Skipped: 0, Time elapsed: 5.871 s - in org.eclipse.ease.ui.completions.java.provider.JavaPackagesCompletionsProviderTest
17:40:26 [2020-11-07T22:40:26.793Z] containsJavaLangPackageProposal(org.eclipse.ease.ui.completions.java.provider.JavaPackagesCompletionsProviderTest)  Time elapsed: 0.469 s
17:40:26 [2020-11-07T22:40:26.793Z] containsOrgRootPackageProposal(org.eclipse.ease.ui.completions.java.provider.JavaPackagesCompletionsProviderTest)  Time elapsed: 0.008 s
17:40:26 [2020-11-07T22:40:26.793Z] containsJavaRootPackageProposal(org.eclipse.ease.ui.completions.java.provider.JavaPackagesCompletionsProviderTest)  Time elapsed: 0.008 s
17:40:26 [2020-11-07T22:40:26.793Z] containsOrgEclipsePackageProposal(org.eclipse.ease.ui.completions.java.provider.JavaPackagesCompletionsProviderTest)  Time elapsed: 0.078 s
17:40:26 [2020-11-07T22:40:26.793Z] Running org.eclipse.ease.ui.completions.java.provider.JavaClassCompletionsProviderTest
17:40:32 [2020-11-07T22:40:32.043Z] Tests run: 6, Failures: 0, Errors: 0, Skipped: 0, Time elapsed: 5.193 s - in org.eclipse.ease.ui.completions.java.provider.JavaClassCompletionsProviderTest
17:40:32 [2020-11-07T22:40:32.043Z] containsPackageFileCompletion(org.eclipse.ease.ui.completions.java.provider.JavaClassCompletionsProviderTest)  Time elapsed: 0.008 s
17:40:32 [2020-11-07T22:40:32.043Z] containsGlobalFileCompletion(org.eclipse.ease.ui.completions.java.provider.JavaClassCompletionsProviderTest)  Time elapsed: 0.036 s
17:40:32 [2020-11-07T22:40:32.043Z] containsJavaLangPackageProposal(org.eclipse.ease.ui.completions.java.provider.JavaClassCompletionsProviderTest)  Time elapsed: 0.05 s
17:40:32 [2020-11-07T22:40:32.043Z] containsOrgRootPackageProposal(org.eclipse.ease.ui.completions.java.provider.JavaClassCompletionsProviderTest)  Time elapsed: 0.006 s
17:40:32 [2020-11-07T22:40:32.043Z] containsJavaRootPackageProposal(org.eclipse.ease.ui.completions.java.provider.JavaClassCompletionsProviderTest)  Time elapsed: 0.005 s
17:40:32 [2020-11-07T22:40:32.043Z] containsOrgEclipsePackageProposal(org.eclipse.ease.ui.completions.java.provider.JavaClassCompletionsProviderTest)  Time elapsed: 0.082 s
17:40:32 [2020-11-07T22:40:32.043Z] 
17:40:32 [2020-11-07T22:40:32.043Z] Results:
17:40:32 [2020-11-07T22:40:32.043Z] 
17:40:32 [2020-11-07T22:40:32.043Z] Tests run: 31, Failures: 0, Errors: 0, Skipped: 12
17:40:32 [2020-11-07T22:40:32.043Z] 
17:40:32 [2020-11-07T22:40:32.603Z] [INFO] All tests passed!
17:40:32 [2020-11-07T22:40:32.603Z] [INFO] 
17:40:32 [2020-11-07T22:40:32.603Z] [INFO] --- maven-install-plugin:2.3.1:install (default-install) @ org.eclipse.ease.ui.test ---
17:40:32 [2020-11-07T22:40:32.603Z] [INFO] Installing /home/jenkins/agent/workspace/ease.verify.core.target.2019-03/tests/org.eclipse.ease.ui.test/target/org.eclipse.ease.ui.test-0.8.0-SNAPSHOT.jar to /home/jenkins/.m2/repository/org/eclipse/ease/org.eclipse.ease.ui.test/0.8.0-SNAPSHOT/org.eclipse.ease.ui.test-0.8.0-SNAPSHOT.jar
17:40:32 [2020-11-07T22:40:32.603Z] [INFO] Installing /home/jenkins/agent/workspace/ease.verify.core.target.2019-03/tests/org.eclipse.ease.ui.test/pom.xml to /home/jenkins/.m2/repository/org/eclipse/ease/org.eclipse.ease.ui.test/0.8.0-SNAPSHOT/org.eclipse.ease.ui.test-0.8.0-SNAPSHOT.pom
17:40:32 [2020-11-07T22:40:32.603Z] [INFO] Installing /home/jenkins/agent/workspace/ease.verify.core.target.2019-03/tests/org.eclipse.ease.ui.test/target/org.eclipse.ease.ui.test-0.8.0-SNAPSHOT-sources.jar to /home/jenkins/.m2/repository/org/eclipse/ease/org.eclipse.ease.ui.test/0.8.0-SNAPSHOT/org.eclipse.ease.ui.test-0.8.0-SNAPSHOT-sources.jar
17:40:32 [2020-11-07T22:40:32.603Z] [INFO] Installing /home/jenkins/agent/workspace/ease.verify.core.target.2019-03/tests/org.eclipse.ease.ui.test/target/p2content.xml to /home/jenkins/.m2/repository/org/eclipse/ease/org.eclipse.ease.ui.test/0.8.0-SNAPSHOT/org.eclipse.ease.ui.test-0.8.0-SNAPSHOT-p2metadata.xml
17:40:32 [2020-11-07T22:40:32.603Z] [INFO] Installing /home/jenkins/agent/workspace/ease.verify.core.target.2019-03/tests/org.eclipse.ease.ui.test/target/p2artifacts.xml to /home/jenkins/.m2/repository/org/eclipse/ease/org.eclipse.ease.ui.test/0.8.0-SNAPSHOT/org.eclipse.ease.ui.test-0.8.0-SNAPSHOT-p2artifacts.xml
17:40:32 [2020-11-07T22:40:32.603Z] [INFO] Installing /home/jenkins/agent/workspace/ease.verify.core.target.2019-03/tests/org.eclipse.ease.ui.test/target/p2content.xml to /home/jenkins/.m2/repository/org/eclipse/ease/org.eclipse.ease.ui.test/0.8.0-SNAPSHOT/org.eclipse.ease.ui.test-0.8.0-SNAPSHOT-p2metadata.xml
17:40:32 [2020-11-07T22:40:32.603Z] [INFO] Installing /home/jenkins/agent/workspace/ease.verify.core.target.2019-03/tests/org.eclipse.ease.ui.test/target/p2artifacts.xml to /home/jenkins/.m2/repository/org/eclipse/ease/org.eclipse.ease.ui.test/0.8.0-SNAPSHOT/org.eclipse.ease.ui.test-0.8.0-SNAPSHOT-p2artifacts.xml
17:40:32 [2020-11-07T22:40:32.603Z] [INFO] 
17:40:32 [2020-11-07T22:40:32.603Z] [INFO] --- tycho-p2-plugin:1.5.0:update-local-index (default-update-local-index) @ org.eclipse.ease.ui.test ---
17:40:32 [2020-11-07T22:40:32.603Z] [INFO] 
17:40:32 [2020-11-07T22:40:32.603Z] [INFO] ---------------------< org.eclipse.ease:ease.core >---------------------
17:40:32 [2020-11-07T22:40:32.603Z] [INFO] Building EASE (Incubation) 0.4.0-SNAPSHOT                        [48/48]
17:40:32 [2020-11-07T22:40:32.603Z] [INFO] --------------------------------[ pom ]---------------------------------
17:40:32 [2020-11-07T22:40:32.603Z] [INFO] 
17:40:32 [2020-11-07T22:40:32.604Z] [INFO] --- maven-clean-plugin:2.5:clean (default-clean) @ ease.core ---
17:40:32 [2020-11-07T22:40:32.604Z] [INFO] 
17:40:32 [2020-11-07T22:40:32.604Z] [INFO] --- maven-install-plugin:2.4:install (default-install) @ ease.core ---
17:40:32 [2020-11-07T22:40:32.604Z] [INFO] Installing /home/jenkins/agent/workspace/ease.verify.core.target.2019-03/pom.xml to /home/jenkins/.m2/repository/org/eclipse/ease/ease.core/0.4.0-SNAPSHOT/ease.core-0.4.0-SNAPSHOT.pom
17:40:32 [2020-11-07T22:40:32.604Z] [INFO] ------------------------------------------------------------------------
17:40:32 [2020-11-07T22:40:32.604Z] [INFO] Reactor Summary:
17:40:32 [2020-11-07T22:40:32.604Z] [INFO] 
17:40:32 [2020-11-07T22:40:32.604Z] [INFO] org.eclipse.ease.releng 0.8.0-SNAPSHOT ............. SUCCESS [  6.387 s]
17:40:32 [2020-11-07T22:40:32.604Z] [INFO] org.eclipse.ease.classloader 0.8.0-SNAPSHOT ........ SUCCESS [  8.673 s]
17:40:32 [2020-11-07T22:40:32.604Z] [INFO] org.eclipse.ease 0.8.0-SNAPSHOT .................... SUCCESS [  2.843 s]
17:40:32 [2020-11-07T22:40:32.604Z] [INFO] org.eclipse.ease.ui 0.8.0-SNAPSHOT ................. SUCCESS [  2.881 s]
17:40:32 [2020-11-07T22:40:32.604Z] [INFO] org.eclipse.ease.ui.completions.java 0.8.0-SNAPSHOT  SUCCESS [  2.126 s]
17:40:32 [2020-11-07T22:40:32.604Z] [INFO] org.eclipse.ease.ui.scripts 0.8.0-SNAPSHOT ......... SUCCESS [  2.383 s]
17:40:32 [2020-11-07T22:40:32.604Z] [INFO] org.eclipse.ease.lang.javascript 0.8.0-SNAPSHOT .... SUCCESS [  1.358 s]
17:40:32 [2020-11-07T22:40:32.604Z] [INFO] org.eclipse.ease.lang.scriptarchive 0.8.0-SNAPSHOT . SUCCESS [  2.197 s]
17:40:32 [2020-11-07T22:40:32.604Z] [INFO] org.eclipse.ease.lang.python 0.8.0-SNAPSHOT ........ SUCCESS [  1.648 s]
17:40:32 [2020-11-07T22:40:32.604Z] [INFO] org.eclipse.ease.lang.python.py4j 0.8.0-SNAPSHOT ... SUCCESS [  1.602 s]
17:40:32 [2020-11-07T22:40:32.604Z] [INFO] org.eclipse.ease.lang.groovy 0.8.0-SNAPSHOT ........ SUCCESS [  1.410 s]
17:40:32 [2020-11-07T22:40:32.604Z] [INFO] org.eclipse.ease.lang.groovy.interpreter 0.8.0-SNAPSHOT SUCCESS [  1.382 s]
17:40:32 [2020-11-07T22:40:32.604Z] [INFO] org.eclipse.ease.lang.unittest 0.8.0-SNAPSHOT ...... SUCCESS [  2.039 s]
17:40:32 [2020-11-07T22:40:32.604Z] [INFO] org.eclipse.ease.lang.unittest.ui 0.8.0-SNAPSHOT ... SUCCESS [  2.061 s]
17:40:32 [2020-11-07T22:40:32.604Z] [INFO] org.eclipse.ease.lang.ruby 0.8.0-SNAPSHOT .......... SUCCESS [  1.522 s]
17:40:32 [2020-11-07T22:40:32.604Z] [INFO] org.eclipse.ease.lang.ruby.jruby 0.8.0-SNAPSHOT .... SUCCESS [  1.474 s]
17:40:32 [2020-11-07T22:40:32.604Z] [INFO] org.eclipse.ease.lang.javascript.nashorn 0.8.0-SNAPSHOT SUCCESS [  1.415 s]
17:40:32 [2020-11-07T22:40:32.604Z] [INFO] org.eclipse.ease.lang.javascript.rhino 0.8.0-SNAPSHOT SUCCESS [  1.904 s]
17:40:32 [2020-11-07T22:40:32.604Z] [INFO] org.eclipse.ease.lang.python.jython 0.8.0-SNAPSHOT . SUCCESS [  1.683 s]
17:40:32 [2020-11-07T22:40:32.604Z] [INFO] org.eclipse.ease.lang.javascript.ui 0.8.0-SNAPSHOT . SUCCESS [  1.442 s]
17:40:32 [2020-11-07T22:40:32.604Z] [INFO] org.eclipse.ease.lang.jvm.compiled 0.8.0-SNAPSHOT .. SUCCESS [  1.470 s]
17:40:32 [2020-11-07T22:40:32.604Z] [INFO] org.eclipse.ease.lang.scriptarchive.ui 0.8.0-SNAPSHOT SUCCESS [  1.498 s]
17:40:32 [2020-11-07T22:40:32.604Z] [INFO] org.eclipse.ease.help 0.8.0-SNAPSHOT ............... SUCCESS [  0.214 s]
17:40:32 [2020-11-07T22:40:32.604Z] [INFO] org.eclipse.ease.feature 0.8.0-SNAPSHOT ............ SUCCESS [  0.188 s]
17:40:32 [2020-11-07T22:40:32.604Z] [INFO] org.eclipse.ease.ui.feature 0.8.0-SNAPSHOT ......... SUCCESS [  0.251 s]
17:40:32 [2020-11-07T22:40:32.604Z] [INFO] org.eclipse.ease.lang.javascript.feature 0.8.0-SNAPSHOT SUCCESS [  0.140 s]
17:40:32 [2020-11-07T22:40:32.604Z] [INFO] org.eclipse.ease.lang.python.feature 0.8.0-SNAPSHOT  SUCCESS [  0.104 s]
17:40:32 [2020-11-07T22:40:32.604Z] [INFO] org.eclipse.ease.python.jython.feature 0.8.0-SNAPSHOT SUCCESS [  0.106 s]
17:40:32 [2020-11-07T22:40:32.604Z] [INFO] org.eclipse.ease.lang.python.py4j.feature 0.8.0-SNAPSHOT SUCCESS [  0.111 s]
17:40:32 [2020-11-07T22:40:32.604Z] [INFO] org.eclipse.ease.lang.jvm.feature 0.8.0-SNAPSHOT ... SUCCESS [  0.099 s]
17:40:32 [2020-11-07T22:40:32.604Z] [INFO] org.eclipse.ease.lang.groovy.feature 0.8.0-SNAPSHOT  SUCCESS [  0.099 s]
17:40:32 [2020-11-07T22:40:32.604Z] [INFO] org.eclipse.ease.lang.ruby.feature 0.8.0-SNAPSHOT .. SUCCESS [  0.106 s]
17:40:32 [2020-11-07T22:40:32.604Z] [INFO] org.eclipse.ease.lang.scriptarchive.feature 0.8.0-SNAPSHOT SUCCESS [  0.108 s]
17:40:32 [2020-11-07T22:40:32.604Z] [INFO] org.eclipse.ease.lang.unittest.feature 0.8.0-SNAPSHOT SUCCESS [  0.167 s]
17:40:32 [2020-11-07T22:40:32.604Z] [INFO] org.eclipse.ease.releng.target 0.8.0-SNAPSHOT ...... SUCCESS [  0.010 s]
17:40:32 [2020-11-07T22:40:32.604Z] [INFO] org.eclipse.ease.releng.p2 0.8.0-SNAPSHOT .......... SUCCESS [  3.201 s]
17:40:32 [2020-11-07T22:40:32.604Z] [INFO] org.eclipse.ease.testhelper 0.8.0-SNAPSHOT ......... SUCCESS [  1.718 s]
17:40:32 [2020-11-07T22:40:32.604Z] [INFO] org.eclipse.ease.test 0.8.0-SNAPSHOT ............... SUCCESS [ 14.388 s]
17:40:32 [2020-11-07T22:40:32.604Z] [INFO] org.eclipse.ease.lang.javascript.nashorn.test 0.8.0-SNAPSHOT SUCCESS [  4.676 s]
17:40:32 [2020-11-07T22:40:32.604Z] [INFO] org.eclipse.ease.lang.javascript.rhino.test 0.8.0-SNAPSHOT SUCCESS [ 15.548 s]
17:40:32 [2020-11-07T22:40:32.604Z] [INFO] org.eclipse.ease.lang.javascript.test 0.8.0-SNAPSHOT SUCCESS [  4.888 s]
17:40:32 [2020-11-07T22:40:32.604Z] [INFO] org.eclipse.ease.lang.python.test 0.8.0-SNAPSHOT ... SUCCESS [  3.739 s]
17:40:32 [2020-11-07T22:40:32.604Z] [INFO] org.eclipse.ease.lang.python.jython.test 0.8.0-SNAPSHOT SUCCESS [ 16.603 s]
17:40:32 [2020-11-07T22:40:32.604Z] [INFO] org.eclipse.ease.lang.scriptarchive.test 0.8.0-SNAPSHOT SUCCESS [  9.525 s]
17:40:32 [2020-11-07T22:40:32.604Z] [INFO] org.eclipse.ease.lang.unittest.test 0.8.0-SNAPSHOT . SUCCESS [  6.288 s]
17:40:32 [2020-11-07T22:40:32.604Z] [INFO] org.eclipse.ease.ui.scripts.test 0.8.0-SNAPSHOT .... SUCCESS [  4.018 s]
17:40:32 [2020-11-07T22:40:32.604Z] [INFO] org.eclipse.ease.ui.test 0.8.0-SNAPSHOT ............ SUCCESS [ 15.696 s]
17:40:32 [2020-11-07T22:40:32.604Z] [INFO] EASE (Incubation) 0.4.0-SNAPSHOT ................... SUCCESS [  0.231 s]
17:40:32 [2020-11-07T22:40:32.604Z] [INFO] ------------------------------------------------------------------------
17:40:32 [2020-11-07T22:40:32.604Z] [INFO] BUILD SUCCESS
17:40:32 [2020-11-07T22:40:32.604Z] [INFO] ------------------------------------------------------------------------
17:40:32 [2020-11-07T22:40:32.604Z] [INFO] Total time:  05:02 min
17:40:32 [2020-11-07T22:40:32.604Z] [INFO] Finished at: 2020-11-07T22:40:32Z
17:40:32 [2020-11-07T22:40:32.604Z] [INFO] ------------------------------------------------------------------------
17:40:32 [2020-11-07T22:40:32.604Z] [INFO] [jenkins-event-spy] Generated /home/jenkins/agent/workspace/ease.verify.core.target.2019-03@tmp/withMavendae5f2e9/maven-spy-20201107-223530-6112547358834762174365.log