FailedConsole Output

Skipping 66 KB.. Full Log
NEghAwQwghQWAACwxA+XYgAAAA==[WARNING]   org.eclipse.ease.testhelper/0.8.0.I202003020926
17:41:09 [2020-10-31T21:41:09.624Z] [WARNING]   org.eclipse.ease.lang.python.py4j/0.8.0.I202010061535
17:41:09 [2020-10-31T21:41:09.624Z] [INFO] Resolving class path of MavenProject: org.eclipse.ease:org.eclipse.ease.lang.python.py4j.test:0.8.0-SNAPSHOT @ /home/jenkins/agent/workspace/ease.verify.core.target.2019-03/tests/org.eclipse.ease.lang.python.py4j.test/pom.xml
17:41:09 [2020-10-31T21:41:09.624Z] [INFO] Computing target platform for MavenProject: org.eclipse.ease:org.eclipse.ease.lang.scriptarchive.test:0.8.0-SNAPSHOT @ /home/jenkins/agent/workspace/ease.verify.core.target.2019-03/tests/org.eclipse.ease.lang.scriptarchive.test/pom.xml
17:41:09 [2020-10-31T21:41:09.624Z] [INFO] Resolving dependencies of MavenProject: org.eclipse.ease:org.eclipse.ease.lang.scriptarchive.test:0.8.0-SNAPSHOT @ /home/jenkins/agent/workspace/ease.verify.core.target.2019-03/tests/org.eclipse.ease.lang.scriptarchive.test/pom.xml
17:41:09 [2020-10-31T21:41:09.624Z] [WARNING] The following locally built units have been used to resolve project dependencies:
17:41:09 [2020-10-31T21:41:09.624Z] [WARNING]   org.eclipse.ease/0.8.0.I202010051129
17:41:09 [2020-10-31T21:41:09.624Z] [WARNING]   org.eclipse.ease.ui/0.8.0.I202010061535
17:41:09 [2020-10-31T21:41:09.624Z] [WARNING]   org.eclipse.ease.lang.javascript/0.8.0.I202010061535
17:41:09 [2020-10-31T21:41:09.624Z] [WARNING]   org.eclipse.ease.classloader/0.8.0.I202010061535
17:41:09 [2020-10-31T21:41:09.624Z] [WARNING]   org.eclipse.ease.lang.javascript.rhino/0.8.0.I202008070902
17:41:09 [2020-10-31T21:41:09.624Z] [WARNING]   org.eclipse.ease.lang.scriptarchive/0.8.0.I202010061535
17:41:09 [2020-10-31T21:41:09.624Z] [INFO] Resolving class path of MavenProject: org.eclipse.ease:org.eclipse.ease.lang.scriptarchive.test:0.8.0-SNAPSHOT @ /home/jenkins/agent/workspace/ease.verify.core.target.2019-03/tests/org.eclipse.ease.lang.scriptarchive.test/pom.xml
17:41:09 [2020-10-31T21:41:09.624Z] [INFO] Computing target platform for MavenProject: org.eclipse.ease:org.eclipse.ease.ui.test:0.8.0-SNAPSHOT @ /home/jenkins/agent/workspace/ease.verify.core.target.2019-03/tests/org.eclipse.ease.ui.test/pom.xml
17:41:09 [2020-10-31T21:41:09.624Z] [INFO] Resolving dependencies of MavenProject: org.eclipse.ease:org.eclipse.ease.ui.test:0.8.0-SNAPSHOT @ /home/jenkins/agent/workspace/ease.verify.core.target.2019-03/tests/org.eclipse.ease.ui.test/pom.xml
17:41:09 [2020-10-31T21:41:09.624Z] Oct 31, 2020 9:41:09 PM org.apache.http.impl.execchain.RetryExec execute
17:41:09 [2020-10-31T21:41:09.624Z] INFO: I/O exception (org.apache.http.NoHttpResponseException) caught when processing request to {}->http://download.eclipse.org:80: The target server failed to respond
17:41:09 [2020-10-31T21:41:09.624Z] Oct 31, 2020 9:41:09 PM org.apache.http.impl.execchain.RetryExec execute
17:41:09 [2020-10-31T21:41:09.624Z] INFO: Retrying request to {}->http://download.eclipse.org:80
17:41:09 [2020-10-31T21:41:09.880Z] [INFO] Fetching org.apache.lucene.analyzers-common_7.5.0.v20181003-1532.jar.pack.gz from http://download.eclipse.org/releases/2019-03/201903201000/plugins/ (692.97kB)
17:41:09 [2020-10-31T21:41:09.880Z] [INFO] Fetching org.apache.lucene.analyzers-common_7.5.0.v20181003-1532.jar.pack.gz from http://download.eclipse.org/releases/2019-03/201903201000/plugins/ (692.97kB)
17:41:10 [2020-10-31T21:41:10.440Z] [INFO] Fetching org.apache.lucene.core_7.5.0.v20181003-1532.jar.pack.gz from http://download.eclipse.org/releases/2019-03/201903201000/plugins/ (899.59kB)
17:41:10 [2020-10-31T21:41:10.440Z] [INFO] Fetching org.apache.lucene.core_7.5.0.v20181003-1532.jar.pack.gz from http://download.eclipse.org/releases/2019-03/201903201000/plugins/ (899.59kB)
17:41:11 [2020-10-31T21:41:11.000Z] [INFO] Fetching org.apache.lucene.analyzers-smartcn_7.5.0.v20181003-1532.jar.pack.gz from http://download.eclipse.org/releases/2019-03/201903201000/plugins/ (3.42MB)
17:41:11 [2020-10-31T21:41:11.000Z] [INFO] Fetching org.apache.lucene.analyzers-smartcn_7.5.0.v20181003-1532.jar.pack.gz from http://download.eclipse.org/releases/2019-03/201903201000/plugins/ (3.42MB)
17:41:11 [2020-10-31T21:41:11.927Z] [INFO] Fetching org.eclipse.jdt.ui_3.17.0.v20190304-0658.jar.pack.gz from http://download.eclipse.org/releases/2019-03/201903201000/plugins/ (4MB)
17:41:11 [2020-10-31T21:41:11.927Z] [INFO] Fetching org.eclipse.jdt.ui_3.17.0.v20190304-0658.jar.pack.gz from http://download.eclipse.org/releases/2019-03/201903201000/plugins/ (4MB)
17:41:14 [2020-10-31T21:41:14.444Z] [INFO] Fetching org.eclipse.jdt.core_3.17.0.v20190306-2240.jar from http://download.eclipse.org/releases/2019-03/201903201000/plugins/ (6.6MB)
17:41:14 [2020-10-31T21:41:14.444Z] [INFO] Fetching org.eclipse.jdt.core_3.17.0.v20190306-2240.jar from http://download.eclipse.org/releases/2019-03/201903201000/plugins/ (6.6MB)
17:41:15 [2020-10-31T21:41:15.004Z] [INFO] Fetching org.objectweb.asm_7.0.0.v20181030-2244.jar.pack.gz from http://download.eclipse.org/releases/2019-03/201903201000/plugins/ (58.69kB)
17:41:15 [2020-10-31T21:41:15.004Z] [INFO] Fetching org.objectweb.asm_7.0.0.v20181030-2244.jar.pack.gz from http://download.eclipse.org/releases/2019-03/201903201000/plugins/ (58.69kB)
17:41:15 [2020-10-31T21:41:15.004Z] [INFO] Fetching org.eclipse.help.ui_4.1.400.v20190218-1039.jar.pack.gz from http://download.eclipse.org/releases/2019-03/201903201000/plugins/ (149.4kB)
17:41:15 [2020-10-31T21:41:15.004Z] [INFO] Fetching org.eclipse.help.ui_4.1.400.v20190218-1039.jar.pack.gz from http://download.eclipse.org/releases/2019-03/201903201000/plugins/ (149.4kB)
17:41:15 [2020-10-31T21:41:15.259Z] [INFO] Fetching org.eclipse.help.webapp_3.9.400.v20190212-1458.jar.pack.gz from http://download.eclipse.org/releases/2019-03/201903201000/plugins/ (242.1kB)
17:41:15 [2020-10-31T21:41:15.259Z] [INFO] Fetching org.eclipse.help.webapp_3.9.400.v20190212-1458.jar.pack.gz from http://download.eclipse.org/releases/2019-03/201903201000/plugins/ (242.1kB)
17:41:15 [2020-10-31T21:41:15.515Z] [INFO] Fetching org.eclipse.equinox.http.jetty_3.7.0.v20190305-2216.jar.pack.gz from http://download.eclipse.org/releases/2019-03/201903201000/plugins/ (16.63kB)
17:41:15 [2020-10-31T21:41:15.515Z] [INFO] Fetching org.eclipse.equinox.http.jetty_3.7.0.v20190305-2216.jar.pack.gz from http://download.eclipse.org/releases/2019-03/201903201000/plugins/ (16.63kB)
17:41:15 [2020-10-31T21:41:15.515Z] [INFO] Fetching org.eclipse.ui.browser_3.6.300.v20180828-0837.jar.pack.gz from http://download.eclipse.org/releases/2019-03/201903201000/plugins/ (97.35kB)
17:41:15 [2020-10-31T21:41:15.515Z] [INFO] Fetching org.eclipse.ui.browser_3.6.300.v20180828-0837.jar.pack.gz from http://download.eclipse.org/releases/2019-03/201903201000/plugins/ (97.35kB)
17:41:15 [2020-10-31T21:41:15.770Z] [INFO] Fetching org.eclipse.equinox.http.servlet_1.6.0.v20190305-2225.jar.pack.gz from http://download.eclipse.org/releases/2019-03/201903201000/plugins/ (76.28kB)
17:41:15 [2020-10-31T21:41:15.770Z] [INFO] Fetching org.eclipse.equinox.http.servlet_1.6.0.v20190305-2225.jar.pack.gz from http://download.eclipse.org/releases/2019-03/201903201000/plugins/ (76.28kB)
17:41:16 [2020-10-31T21:41:16.025Z] [INFO] Fetching org.eclipse.jetty.http_9.4.15.v20190215.jar from http://download.eclipse.org/releases/2019-03/201903201000/plugins/ (211.68kB)
17:41:16 [2020-10-31T21:41:16.025Z] [INFO] Fetching org.eclipse.jetty.http_9.4.15.v20190215.jar from http://download.eclipse.org/releases/2019-03/201903201000/plugins/ (211.68kB)
17:41:16 [2020-10-31T21:41:16.025Z] [INFO] Fetching org.eclipse.jetty.server_9.4.15.v20190215.jar from http://download.eclipse.org/releases/2019-03/201903201000/plugins/ (656.68kB)
17:41:16 [2020-10-31T21:41:16.025Z] [INFO] Fetching org.eclipse.jetty.server_9.4.15.v20190215.jar from http://download.eclipse.org/releases/2019-03/201903201000/plugins/ (656.68kB)
17:41:16 [2020-10-31T21:41:16.281Z] [INFO] Fetching org.eclipse.jetty.servlet_9.4.15.v20190215.jar from http://download.eclipse.org/releases/2019-03/201903201000/plugins/ (127.96kB)
17:41:16 [2020-10-31T21:41:16.281Z] [INFO] Fetching org.eclipse.jetty.servlet_9.4.15.v20190215.jar from http://download.eclipse.org/releases/2019-03/201903201000/plugins/ (127.96kB)
17:41:16 [2020-10-31T21:41:16.537Z] [INFO] Fetching org.eclipse.jetty.util_9.4.15.v20190215.jar from http://download.eclipse.org/releases/2019-03/201903201000/plugins/ (532.25kB)
17:41:16 [2020-10-31T21:41:16.537Z] [INFO] Fetching org.eclipse.jetty.util_9.4.15.v20190215.jar from http://download.eclipse.org/releases/2019-03/201903201000/plugins/ (532.25kB)
17:41:16 [2020-10-31T21:41:16.792Z] [INFO] Fetching org.eclipse.equinox.http.registry_1.1.700.v20190214-1948.jar.pack.gz from http://download.eclipse.org/releases/2019-03/201903201000/plugins/ (18.49kB)
17:41:16 [2020-10-31T21:41:16.792Z] [INFO] Fetching org.eclipse.equinox.http.registry_1.1.700.v20190214-1948.jar.pack.gz from http://download.eclipse.org/releases/2019-03/201903201000/plugins/ (18.49kB)
17:41:16 [2020-10-31T21:41:16.792Z] [INFO] Fetching org.eclipse.equinox.jsp.jasper_1.1.200.v20190214-1948.jar.pack.gz from http://download.eclipse.org/releases/2019-03/201903201000/plugins/ (14.66kB)
17:41:16 [2020-10-31T21:41:16.792Z] [INFO] Fetching org.eclipse.equinox.jsp.jasper_1.1.200.v20190214-1948.jar.pack.gz from http://download.eclipse.org/releases/2019-03/201903201000/plugins/ (14.66kB)
17:41:17 [2020-10-31T21:41:17.047Z] [INFO] Fetching org.eclipse.equinox.jsp.jasper.registry_1.1.200.v20190214-1948.jar.pack.gz from http://download.eclipse.org/releases/2019-03/201903201000/plugins/ (8.7kB)
17:41:17 [2020-10-31T21:41:17.048Z] [INFO] Fetching org.eclipse.equinox.jsp.jasper.registry_1.1.200.v20190214-1948.jar.pack.gz from http://download.eclipse.org/releases/2019-03/201903201000/plugins/ (8.7kB)
17:41:17 [2020-10-31T21:41:17.048Z] [INFO] Fetching org.eclipse.help.base_4.2.500.v20190307-0500.jar.pack.gz from http://download.eclipse.org/releases/2019-03/201903201000/plugins/ (162.49kB)
17:41:17 [2020-10-31T21:41:17.048Z] [INFO] Fetching org.eclipse.help.base_4.2.500.v20190307-0500.jar.pack.gz from http://download.eclipse.org/releases/2019-03/201903201000/plugins/ (162.49kB)
17:41:17 [2020-10-31T21:41:17.304Z] [INFO] Fetching org.eclipse.jdt.core.manipulation_1.11.100.v20190301-1946.jar.pack.gz from http://download.eclipse.org/releases/2019-03/201903201000/plugins/ (266.38kB)
17:41:17 [2020-10-31T21:41:17.304Z] [INFO] Fetching org.eclipse.jdt.core.manipulation_1.11.100.v20190301-1946.jar.pack.gz from http://download.eclipse.org/releases/2019-03/201903201000/plugins/ (266.38kB)
17:41:17 [2020-10-31T21:41:17.559Z] [INFO] Fetching org.eclipse.jdt.launching_3.13.0.v20190222-0937.jar.pack.gz from http://download.eclipse.org/releases/2019-03/201903201000/plugins/ (271.05kB)
17:41:17 [2020-10-31T21:41:17.815Z] [INFO] Fetching org.eclipse.jdt.launching_3.13.0.v20190222-0937.jar.pack.gz from http://download.eclipse.org/releases/2019-03/201903201000/plugins/ (271.05kB)
17:41:18 [2020-10-31T21:41:18.070Z] [INFO] Fetching org.eclipse.jdt.debug_3.12.200.v20190218-2230.jar.pack.gz from http://download.eclipse.org/releases/2019-03/201903201000/plugins/ (928.19kB)
17:41:18 [2020-10-31T21:41:18.070Z] [INFO] Fetching org.eclipse.jdt.debug_3.12.200.v20190218-2230.jar.pack.gz from http://download.eclipse.org/releases/2019-03/201903201000/plugins/ (928.19kB)
17:41:18 [2020-10-31T21:41:18.326Z] [INFO] Fetching org.eclipse.jetty.io_9.4.15.v20190215.jar from http://download.eclipse.org/releases/2019-03/201903201000/plugins/ (162.03kB)
17:41:18 [2020-10-31T21:41:18.326Z] [INFO] Fetching org.eclipse.jetty.io_9.4.15.v20190215.jar from http://download.eclipse.org/releases/2019-03/201903201000/plugins/ (162.03kB)
17:41:18 [2020-10-31T21:41:18.327Z] [INFO] Fetching org.eclipse.jetty.security_9.4.15.v20190215.jar from http://download.eclipse.org/releases/2019-03/201903201000/plugins/ (123.46kB)
17:41:18 [2020-10-31T21:41:18.327Z] [INFO] Fetching org.eclipse.jetty.security_9.4.15.v20190215.jar from http://download.eclipse.org/releases/2019-03/201903201000/plugins/ (123.46kB)
17:41:18 [2020-10-31T21:41:18.584Z] [WARNING] The following locally built units have been used to resolve project dependencies:
17:41:18 [2020-10-31T21:41:18.584Z] [WARNING]   org.eclipse.ease/0.8.0.I202010051129
17:41:18 [2020-10-31T21:41:18.584Z] [WARNING]   org.eclipse.ease.ui.completions.java/0.8.0.I202010061535
17:41:18 [2020-10-31T21:41:18.584Z] [WARNING]   org.eclipse.ease.ui/0.8.0.I202010061535
17:41:18 [2020-10-31T21:41:18.584Z] [WARNING]   org.eclipse.ease.classloader/0.8.0.I202010061535
17:41:18 [2020-10-31T21:41:18.584Z] [INFO] Resolving class path of MavenProject: org.eclipse.ease:org.eclipse.ease.ui.test:0.8.0-SNAPSHOT @ /home/jenkins/agent/workspace/ease.verify.core.target.2019-03/tests/org.eclipse.ease.ui.test/pom.xml
17:41:18 [2020-10-31T21:41:18.584Z] [WARNING] The project org.eclipse.ease:org.eclipse.ease.releng:pom:0.8.0-SNAPSHOT uses prerequisites which is only intended for maven-plugin projects but not for non maven-plugin projects. For such purposes you should use the maven-enforcer-plugin. See https://maven.apache.org/enforcer/enforcer-rules/requireMavenVersion.html
17:41:18 [2020-10-31T21:41:18.584Z] [WARNING] [jenkins-event-spy] Unexpected Maven project file name 'target-tests-pom.xml', problems may occur
17:41:18 [2020-10-31T21:41:18.584Z] [INFO] ------------------------------------------------------------------------
17:41:18 [2020-10-31T21:41:18.584Z] [INFO] Reactor Build Order:
17:41:18 [2020-10-31T21:41:18.584Z] [INFO] 
17:41:18 [2020-10-31T21:41:18.584Z] [INFO] org.eclipse.ease.releng                                            [pom]
17:41:18 [2020-10-31T21:41:18.584Z] [INFO] org.eclipse.ease.releng.target               [eclipse-target-definition]
17:41:18 [2020-10-31T21:41:18.584Z] [INFO] org.eclipse.ease.test                              [eclipse-test-plugin]
17:41:18 [2020-10-31T21:41:18.584Z] [INFO] org.eclipse.ease.lang.javascript.nashorn.test      [eclipse-test-plugin]
17:41:18 [2020-10-31T21:41:18.584Z] [INFO] org.eclipse.ease.lang.javascript.rhino.test        [eclipse-test-plugin]
17:41:18 [2020-10-31T21:41:18.584Z] [INFO] org.eclipse.ease.lang.javascript.test              [eclipse-test-plugin]
17:41:18 [2020-10-31T21:41:18.584Z] [INFO] org.eclipse.ease.lang.python.test                  [eclipse-test-plugin]
17:41:18 [2020-10-31T21:41:18.584Z] [INFO] org.eclipse.ease.lang.python.jython.test           [eclipse-test-plugin]
17:41:18 [2020-10-31T21:41:18.584Z] [INFO] org.eclipse.ease.lang.python.py4j.test             [eclipse-test-plugin]
17:41:18 [2020-10-31T21:41:18.584Z] [INFO] org.eclipse.ease.lang.scriptarchive.test           [eclipse-test-plugin]
17:41:18 [2020-10-31T21:41:18.584Z] [INFO] org.eclipse.ease.ui.test                           [eclipse-test-plugin]
17:41:18 [2020-10-31T21:41:18.584Z] [WARNING] [jenkins-event-spy] Unexpected Maven project file name 'target-tests-pom.xml', problems may occur
17:41:18 [2020-10-31T21:41:18.584Z] [INFO] 
17:41:18 [2020-10-31T21:41:18.584Z] [INFO] --------------< org.eclipse.ease:org.eclipse.ease.releng >--------------
17:41:18 [2020-10-31T21:41:18.584Z] [INFO] Building org.eclipse.ease.releng 0.8.0-SNAPSHOT                   [1/11]
17:41:18 [2020-10-31T21:41:18.584Z] [INFO] --------------------------------[ pom ]---------------------------------
17:41:18 [2020-10-31T21:41:18.584Z] [WARNING] [jenkins-event-spy] Unexpected Maven project file name 'target-tests-pom.xml', problems may occur
17:41:18 [2020-10-31T21:41:18.584Z] [INFO] 
17:41:18 [2020-10-31T21:41:18.584Z] [INFO] ----------< org.eclipse.ease:org.eclipse.ease.releng.target >-----------
17:41:18 [2020-10-31T21:41:18.585Z] [INFO] Building org.eclipse.ease.releng.target 0.8.0-SNAPSHOT            [2/11]
17:41:18 [2020-10-31T21:41:18.585Z] [INFO] ---------------------[ eclipse-target-definition ]----------------------
17:41:18 [2020-10-31T21:41:18.585Z] [INFO] 
17:41:18 [2020-10-31T21:41:18.585Z] [INFO] --- tycho-source-plugin:1.5.0:plugin-source (plugin-source) @ org.eclipse.ease.releng.target ---
17:41:18 [2020-10-31T21:41:18.585Z] [INFO] 
17:41:18 [2020-10-31T21:41:18.585Z] [INFO] --- tycho-packaging-plugin:1.5.0:package-target-definition (default-package-target-definition) @ org.eclipse.ease.releng.target ---
17:41:18 [2020-10-31T21:41:18.840Z] [INFO] 
17:41:18 [2020-10-31T21:41:18.840Z] [INFO] --- tycho-source-feature-plugin:1.5.0:source-feature (source-feature) @ org.eclipse.ease.releng.target ---
17:41:18 [2020-10-31T21:41:18.840Z] [INFO] 
17:41:18 [2020-10-31T21:41:18.840Z] [INFO] --- tycho-p2-plugin:1.5.0:p2-metadata (attached-p2-metadata) @ org.eclipse.ease.releng.target ---
17:41:18 [2020-10-31T21:41:18.840Z] [INFO] 
17:41:18 [2020-10-31T21:41:18.840Z] [INFO] ---------------< org.eclipse.ease:org.eclipse.ease.test >---------------
17:41:18 [2020-10-31T21:41:18.840Z] [INFO] Building org.eclipse.ease.test 0.8.0-SNAPSHOT                     [3/11]
17:41:18 [2020-10-31T21:41:18.840Z] [INFO] ------------------------[ eclipse-test-plugin ]-------------------------
17:41:18 [2020-10-31T21:41:18.840Z] [INFO] 
17:41:18 [2020-10-31T21:41:18.840Z] [INFO] --- tycho-packaging-plugin:1.5.0:build-qualifier (default-build-qualifier) @ org.eclipse.ease.test ---
17:41:19 [2020-10-31T21:41:19.096Z] [INFO] The project's OSGi version is 0.8.0.I201910171213
17:41:19 [2020-10-31T21:41:19.096Z] [INFO] 
17:41:19 [2020-10-31T21:41:19.096Z] [INFO] --- tycho-packaging-plugin:1.5.0:validate-id (default-validate-id) @ org.eclipse.ease.test ---
17:41:19 [2020-10-31T21:41:19.096Z] [INFO] 
17:41:19 [2020-10-31T21:41:19.096Z] [INFO] --- tycho-packaging-plugin:1.5.0:validate-version (default-validate-version) @ org.eclipse.ease.test ---
17:41:19 [2020-10-31T21:41:19.096Z] [INFO] 
17:41:19 [2020-10-31T21:41:19.096Z] [INFO] --- maven-resources-plugin:2.4.3:resources (default-resources) @ org.eclipse.ease.test ---
17:41:19 [2020-10-31T21:41:19.096Z] [INFO] Using 'UTF-8' encoding to copy filtered resources.
17:41:19 [2020-10-31T21:41:19.096Z] [INFO] skip non existing resourceDirectory /home/jenkins/agent/workspace/ease.verify.core.target.2019-03/tests/org.eclipse.ease.test/src/main/resources
17:41:19 [2020-10-31T21:41:19.096Z] [INFO] 
17:41:19 [2020-10-31T21:41:19.096Z] [INFO] --- tycho-compiler-plugin:1.5.0:compile (default-compile) @ org.eclipse.ease.test ---
17:41:19 [2020-10-31T21:41:19.096Z] [INFO] Nothing to compile - all classes are up to date
17:41:19 [2020-10-31T21:41:19.096Z] [INFO] 
17:41:19 [2020-10-31T21:41:19.096Z] [INFO] --- maven-resources-plugin:2.4.3:testResources (default-testResources) @ org.eclipse.ease.test ---
17:41:19 [2020-10-31T21:41:19.096Z] [INFO] Using 'UTF-8' encoding to copy filtered resources.
17:41:19 [2020-10-31T21:41:19.096Z] [INFO] skip non existing resourceDirectory /home/jenkins/agent/workspace/ease.verify.core.target.2019-03/tests/org.eclipse.ease.test/src/test/resources
17:41:19 [2020-10-31T21:41:19.096Z] [INFO] 
17:41:19 [2020-10-31T21:41:19.096Z] [INFO] --- tycho-source-plugin:1.5.0:plugin-source (plugin-source) @ org.eclipse.ease.test ---
17:41:19 [2020-10-31T21:41:19.096Z] [INFO] Building jar: /home/jenkins/agent/workspace/ease.verify.core.target.2019-03/tests/org.eclipse.ease.test/target/org.eclipse.ease.test-0.8.0-SNAPSHOT-sources.jar
17:41:19 [2020-10-31T21:41:19.096Z] [INFO] 
17:41:19 [2020-10-31T21:41:19.096Z] [INFO] --- target-platform-configuration:1.5.0:target-platform (default-target-platform) @ org.eclipse.ease.test ---
17:41:19 [2020-10-31T21:41:19.382Z] [INFO] 
17:41:19 [2020-10-31T21:41:19.382Z] [INFO] --- tycho-packaging-plugin:1.5.0:package-plugin (default-package-plugin) @ org.eclipse.ease.test ---
17:41:19 [2020-10-31T21:41:19.382Z] [INFO] Building jar: /home/jenkins/agent/workspace/ease.verify.core.target.2019-03/tests/org.eclipse.ease.test/target/org.eclipse.ease.test-0.8.0-SNAPSHOT.jar
17:41:19 [2020-10-31T21:41:19.382Z] [INFO] 
17:41:19 [2020-10-31T21:41:19.382Z] [INFO] --- tycho-p2-plugin:1.5.0:p2-metadata-default (default-p2-metadata-default) @ org.eclipse.ease.test ---
17:41:19 [2020-10-31T21:41:19.382Z] [INFO] 
17:41:19 [2020-10-31T21:41:19.382Z] [INFO] --- tycho-source-feature-plugin:1.5.0:source-feature (source-feature) @ org.eclipse.ease.test ---
17:41:19 [2020-10-31T21:41:19.382Z] [INFO] 
17:41:19 [2020-10-31T21:41:19.382Z] [INFO] --- tycho-p2-plugin:1.5.0:p2-metadata (attached-p2-metadata) @ org.eclipse.ease.test ---
17:41:19 [2020-10-31T21:41:19.382Z] [INFO] 
17:41:19 [2020-10-31T21:41:19.382Z] [INFO] --- tycho-surefire-plugin:1.5.0:test (default-test) @ org.eclipse.ease.test ---
17:41:19 [2020-10-31T21:41:19.637Z] [INFO] Expected eclipse log file: /home/jenkins/agent/workspace/ease.verify.core.target.2019-03/tests/org.eclipse.ease.test/target/work/data/.metadata/.log
17:41:19 [2020-10-31T21:41:19.637Z] [INFO] Command line:
17:41:19 [2020-10-31T21:41:19.637Z] 	[/opt/tools/java/openjdk/jdk-11/11.0.2+9/bin/java, -Dosgi.noShutdown=false, -Dosgi.os=linux, -Dosgi.ws=gtk, -Dosgi.arch=x86_64, -Dosgi.clean=true, -jar, /home/jenkins/.m2/repository/p2/osgi/bundle/org.eclipse.equinox.launcher/1.5.300.v20190213-1655/org.eclipse.equinox.launcher-1.5.300.v20190213-1655.jar, -data, /home/jenkins/agent/workspace/ease.verify.core.target.2019-03/tests/org.eclipse.ease.test/target/work/data, -install, /home/jenkins/agent/workspace/ease.verify.core.target.2019-03/tests/org.eclipse.ease.test/target/work, -configuration, /home/jenkins/agent/workspace/ease.verify.core.target.2019-03/tests/org.eclipse.ease.test/target/work/configuration, -application, org.eclipse.tycho.surefire.osgibooter.headlesstest, -testproperties, /home/jenkins/agent/workspace/ease.verify.core.target.2019-03/tests/org.eclipse.ease.test/target/surefire.properties]
17:41:19 [2020-10-31T21:41:19.637Z] Picked up JAVA_TOOL_OPTIONS: -Dmaven.ext.class.path="/home/jenkins/agent/workspace/ease.verify.core.target.2019-03@tmp/withMaven4b016809/pipeline-maven-spy.jar" -Dorg.jenkinsci.plugins.pipeline.maven.reportsFolder="/home/jenkins/agent/workspace/ease.verify.core.target.2019-03@tmp/withMaven4b016809" 
17:41:21 [2020-10-31T21:41:21.018Z] Running org.eclipse.ease.tools.StringToolsTest
17:41:21 [2020-10-31T21:41:21.275Z] Tests run: 8, Failures: 0, Errors: 0, Skipped: 0, Time elapsed: 0.021 s - in org.eclipse.ease.tools.StringToolsTest
17:41:21 [2020-10-31T21:41:21.275Z] parseArgumentsNull(org.eclipse.ease.tools.StringToolsTest)  Time elapsed: 0.001 s
17:41:21 [2020-10-31T21:41:21.275Z] parseArgumentsQuotedSingle(org.eclipse.ease.tools.StringToolsTest)  Time elapsed: 0 s
17:41:21 [2020-10-31T21:41:21.275Z] parseArgumentsEmpty(org.eclipse.ease.tools.StringToolsTest)  Time elapsed: 0 s
17:41:21 [2020-10-31T21:41:21.275Z] parseArgumentsMixedMultiple(org.eclipse.ease.tools.StringToolsTest)  Time elapsed: 0 s
17:41:21 [2020-10-31T21:41:21.275Z] parseArgumentsMixedMultipleLines(org.eclipse.ease.tools.StringToolsTest)  Time elapsed: 0 s
17:41:21 [2020-10-31T21:41:21.275Z] parseArgumentsNonQuotedMultiple(org.eclipse.ease.tools.StringToolsTest)  Time elapsed: 0 s
17:41:21 [2020-10-31T21:41:21.275Z] parseArgumentsNonQuotedSingle(org.eclipse.ease.tools.StringToolsTest)  Time elapsed: 0 s
17:41:21 [2020-10-31T21:41:21.275Z] parseArgumentsQuotedMultiple(org.eclipse.ease.tools.StringToolsTest)  Time elapsed: 0 s
17:41:21 [2020-10-31T21:41:21.275Z] Running org.eclipse.ease.tools.ResourceToolsTest
17:41:21 [2020-10-31T21:41:21.275Z] Tests run: 47, Failures: 0, Errors: 0, Skipped: 0, Time elapsed: 0.11 s - in org.eclipse.ease.tools.ResourceToolsTest
17:41:21 [2020-10-31T21:41:21.275Z] resolveScriptLocation(org.eclipse.ease.tools.ResourceToolsTest)  Time elapsed: 0.075 s
17:41:21 [2020-10-31T21:41:21.275Z] getWorkspaceInputStream(org.eclipse.ease.tools.ResourceToolsTest)  Time elapsed: 0 s
17:41:21 [2020-10-31T21:41:21.275Z] resolvePlatformURI(org.eclipse.ease.tools.ResourceToolsTest)  Time elapsed: 0 s
17:41:21 [2020-10-31T21:41:21.275Z] resolveScriptLocationWithSpacesInPath(org.eclipse.ease.tools.ResourceToolsTest)  Time elapsed: 0.002 s
17:41:21 [2020-10-31T21:41:21.275Z] resolveURL(org.eclipse.ease.tools.ResourceToolsTest)  Time elapsed: 0.001 s
17:41:21 [2020-10-31T21:41:21.275Z] invalidIsAbsolute(org.eclipse.ease.tools.ResourceToolsTest)  Time elapsed: 0 s
17:41:21 [2020-10-31T21:41:21.275Z] getFilesystemInputStream(org.eclipse.ease.tools.ResourceToolsTest)  Time elapsed: 0.001 s
17:41:21 [2020-10-31T21:41:21.275Z] toRelativeLocationInWorkspace(org.eclipse.ease.tools.ResourceToolsTest)  Time elapsed: 0 s
17:41:21 [2020-10-31T21:41:21.275Z] checkOperatingSystem(org.eclipse.ease.tools.ResourceToolsTest)  Time elapsed: 0 s
17:41:21 [2020-10-31T21:41:21.275Z] inputStreamToString(org.eclipse.ease.tools.ResourceToolsTest)  Time elapsed: 0 s
17:41:21 [2020-10-31T21:41:21.275Z] fileSystemToAbsoluteLocationOnLinux(org.eclipse.ease.tools.ResourceToolsTest)  Time elapsed: 0 s
17:41:21 [2020-10-31T21:41:21.275Z] exists(org.eclipse.ease.tools.ResourceToolsTest)  Time elapsed: 0 s
17:41:21 [2020-10-31T21:41:21.275Z] resolveRelativeInWorkspace(org.eclipse.ease.tools.ResourceToolsTest)  Time elapsed: 0.001 s
17:41:21 [2020-10-31T21:41:21.275Z] isFile(org.eclipse.ease.tools.ResourceToolsTest)  Time elapsed: 0.001 s
17:41:21 [2020-10-31T21:41:21.275Z] invalidToFile(org.eclipse.ease.tools.ResourceToolsTest)  Time elapsed: 0 s
17:41:21 [2020-10-31T21:41:21.275Z] resolveAbsoluteInFileSystem(org.eclipse.ease.tools.ResourceToolsTest)  Time elapsed: 0 s
17:41:21 [2020-10-31T21:41:21.275Z] resolveWindowsRoot(org.eclipse.ease.tools.ResourceToolsTest)  Time elapsed: 0.001 s
17:41:21 [2020-10-31T21:41:21.275Z] resolveRelativeInFileSystemOnWindows(org.eclipse.ease.tools.ResourceToolsTest)  Time elapsed: 0 s
17:41:21 [2020-10-31T21:41:21.275Z] isAbsoluteFileSystemPathOnWindows(org.eclipse.ease.tools.ResourceToolsTest)  Time elapsed: 0 s
17:41:21 [2020-10-31T21:41:21.275Z] readerToString(org.eclipse.ease.tools.ResourceToolsTest)  Time elapsed: 0 s
17:41:21 [2020-10-31T21:41:21.275Z] workspaceFileToString(org.eclipse.ease.tools.ResourceToolsTest)  Time elapsed: 0 s
17:41:21 [2020-10-31T21:41:21.275Z] toFile(org.eclipse.ease.tools.ResourceToolsTest)  Time elapsed: 0 s
17:41:21 [2020-10-31T21:41:21.275Z] toProjectRelativeLocation(org.eclipse.ease.tools.ResourceToolsTest)  Time elapsed: 0 s
17:41:21 [2020-10-31T21:41:21.275Z] getInvalidInputStream(org.eclipse.ease.tools.ResourceToolsTest)  Time elapsed: 0.003 s
17:41:21 [2020-10-31T21:41:21.275Z] resolveRelativeInFileSystemOnLinux(org.eclipse.ease.tools.ResourceToolsTest)  Time elapsed: 0.001 s
17:41:21 [2020-10-31T21:41:21.275Z] isFolder(org.eclipse.ease.tools.ResourceToolsTest)  Time elapsed: 0 s
17:41:21 [2020-10-31T21:41:21.275Z] fileSystemToAbsoluteLocationOnWindows(org.eclipse.ease.tools.ResourceToolsTest)  Time elapsed: 0 s
17:41:21 [2020-10-31T21:41:21.275Z] isAbsoluteWorkspacePath(org.eclipse.ease.tools.ResourceToolsTest)  Time elapsed: 0 s
17:41:21 [2020-10-31T21:41:21.275Z] isAbsoluteFileSystemPathOnLinux(org.eclipse.ease.tools.ResourceToolsTest)  Time elapsed: 0 s
17:41:21 [2020-10-31T21:41:21.275Z] resolveInvalid(org.eclipse.ease.tools.ResourceToolsTest)  Time elapsed: 0 s
17:41:21 [2020-10-31T21:41:21.275Z] resolveAbsoluteInFileSystemOnWindows(org.eclipse.ease.tools.ResourceToolsTest)  Time elapsed: 0 s
17:41:21 [2020-10-31T21:41:21.275Z] resolveScriptLocationWithSpacesInDomain(org.eclipse.ease.tools.ResourceToolsTest)  Time elapsed: 0.001 s
17:41:21 [2020-10-31T21:41:21.275Z] resolveRelativefromWorkspaceToFilesystem(org.eclipse.ease.tools.ResourceToolsTest)  Time elapsed: 0 s
17:41:21 [2020-10-31T21:41:21.275Z] resolveRelativeWithoutBaseFile(org.eclipse.ease.tools.ResourceToolsTest)  Time elapsed: 0 s
17:41:21 [2020-10-31T21:41:21.275Z] resolveInWorkspace(org.eclipse.ease.tools.ResourceToolsTest)  Time elapsed: 0 s
17:41:21 [2020-10-31T21:41:21.275Z] resolveScriptLocationWithSpecialCharactersInPath(org.eclipse.ease.tools.ResourceToolsTest)  Time elapsed: 0 s
17:41:21 [2020-10-31T21:41:21.275Z] filesystemFileToString(org.eclipse.ease.tools.ResourceToolsTest)  Time elapsed: 0 s
17:41:21 [2020-10-31T21:41:21.275Z] createURI(org.eclipse.ease.tools.ResourceToolsTest)  Time elapsed: 0.001 s
17:41:21 [2020-10-31T21:41:21.275Z] uriToAbsoluteLocation(org.eclipse.ease.tools.ResourceToolsTest)  Time elapsed: 0 s
17:41:21 [2020-10-31T21:41:21.275Z] createFolder(org.eclipse.ease.tools.ResourceToolsTest)  Time elapsed: 0.002 s
17:41:21 [2020-10-31T21:41:21.275Z] workspaceToAbsoluteLocation(org.eclipse.ease.tools.ResourceToolsTest)  Time elapsed: 0 s
17:41:21 [2020-10-31T21:41:21.275Z] resolveAbsoluteInFileSystemOnLinux(org.eclipse.ease.tools.ResourceToolsTest)  Time elapsed: 0 s
17:41:21 [2020-10-31T21:41:21.275Z] invalidToString(org.eclipse.ease.tools.ResourceToolsTest)  Time elapsed: 0 s
17:41:21 [2020-10-31T21:41:21.275Z] resolveRelativeURIs(org.eclipse.ease.tools.ResourceToolsTest)  Time elapsed: 0.001 s
17:41:21 [2020-10-31T21:41:21.275Z] resolveRelativeInFileSystem(org.eclipse.ease.tools.ResourceToolsTest)  Time elapsed: 0 s
17:41:21 [2020-10-31T21:41:21.275Z] resolveScriptLocationWithSpecialCharactersInDomain(org.eclipse.ease.tools.ResourceToolsTest)  Time elapsed: 0.003 s
17:41:21 [2020-10-31T21:41:21.275Z] isAbsoluteURL(org.eclipse.ease.tools.ResourceToolsTest)  Time elapsed: 0 s
17:41:21 [2020-10-31T21:41:21.275Z] Running org.eclipse.ease.tools.RunnableWithResultTest
17:41:21 [2020-10-31T21:41:21.275Z] Tests run: 2, Failures: 0, Errors: 0, Skipped: 0, Time elapsed: 0.001 s - in org.eclipse.ease.tools.RunnableWithResultTest
17:41:21 [2020-10-31T21:41:21.275Z] testException(org.eclipse.ease.tools.RunnableWithResultTest)  Time elapsed: 0 s
17:41:21 [2020-10-31T21:41:21.275Z] testResult(org.eclipse.ease.tools.RunnableWithResultTest)  Time elapsed: 0 s
17:41:21 [2020-10-31T21:41:21.275Z] Running org.eclipse.ease.ScriptTest
17:41:21 [2020-10-31T21:41:21.275Z] Tests run: 13, Failures: 0, Errors: 0, Skipped: 0, Time elapsed: 0.021 s - in org.eclipse.ease.ScriptTest
17:41:21 [2020-10-31T21:41:21.275Z] codeFromScriptable(org.eclipse.ease.ScriptTest)  Time elapsed: 0.006 s
17:41:21 [2020-10-31T21:41:21.275Z] codeFromFilesystemFile(org.eclipse.ease.ScriptTest)  Time elapsed: 0.001 s
17:41:21 [2020-10-31T21:41:21.275Z] getCodeStream(org.eclipse.ease.ScriptTest)  Time elapsed: 0 s
17:41:21 [2020-10-31T21:41:21.275Z] getFile(org.eclipse.ease.ScriptTest)  Time elapsed: 0 s
17:41:21 [2020-10-31T21:41:21.275Z] codeFromStringBuilder(org.eclipse.ease.ScriptTest)  Time elapsed: 0 s
17:41:21 [2020-10-31T21:41:21.275Z] getResult(org.eclipse.ease.ScriptTest)  Time elapsed: 0 s
17:41:21 [2020-10-31T21:41:21.275Z] getException(org.eclipse.ease.ScriptTest)  Time elapsed: 0 s
17:41:21 [2020-10-31T21:41:21.275Z] codeFromWorkspaceFile(org.eclipse.ease.ScriptTest)  Time elapsed: 0 s
17:41:21 [2020-10-31T21:41:21.275Z] codeFromInputStream(org.eclipse.ease.ScriptTest)  Time elapsed: 0 s
17:41:21 [2020-10-31T21:41:21.275Z] getTitle(org.eclipse.ease.ScriptTest)  Time elapsed: 0 s
17:41:21 [2020-10-31T21:41:21.275Z] getCommand(org.eclipse.ease.ScriptTest)  Time elapsed: 0 s
17:41:21 [2020-10-31T21:41:21.275Z] codeFromReader(org.eclipse.ease.ScriptTest)  Time elapsed: 0.001 s
17:41:21 [2020-10-31T21:41:21.275Z] codeFromString(org.eclipse.ease.ScriptTest)  Time elapsed: 0 s
17:41:21 [2020-10-31T21:41:21.276Z] Running org.eclipse.ease.AbstractScriptEngineTest
17:41:25 [2020-10-31T21:41:25.440Z] testorg.eclipse.ease.ScriptExecutionException: Engine got terminated
17:41:25 [2020-10-31T21:41:25.440Z] java.lang.RuntimeException: ERROR
17:41:25 [2020-10-31T21:41:25.440Z] 	at org.eclipse.ease.AbstractScriptEngineTest$MockedScriptEngine.execute(AbstractScriptEngineTest.java:73)
17:41:25 [2020-10-31T21:41:25.440Z] 	at org.eclipse.ease.AbstractScriptEngine.inject(AbstractScriptEngine.java:224)
17:41:25 [2020-10-31T21:41:25.440Z] 	at org.eclipse.ease.AbstractScriptEngine.run(AbstractScriptEngine.java:274)
17:41:25 [2020-10-31T21:41:25.440Z] 	at org.eclipse.core.internal.jobs.Worker.run(Worker.java:63)
17:41:26 [2020-10-31T21:41:26.367Z] 1Tests run: 17, Failures: 0, Errors: 0, Skipped: 0, Time elapsed: 4.923 s - in org.eclipse.ease.AbstractScriptEngineTest
17:41:26 [2020-10-31T21:41:26.367Z] extractEmptyArguments(org.eclipse.ease.AbstractScriptEngineTest)  Time elapsed: 0.002 s
17:41:26 [2020-10-31T21:41:26.367Z] setNotNullOutputStream(org.eclipse.ease.AbstractScriptEngineTest)  Time elapsed: 0 s
17:41:26 [2020-10-31T21:41:26.367Z] terminateViaMonitorCancellation(org.eclipse.ease.AbstractScriptEngineTest)  Time elapsed: 1.105 s
17:41:26 [2020-10-31T21:41:26.367Z] inject(org.eclipse.ease.AbstractScriptEngineTest)  Time elapsed: 0.001 s
17:41:26 [2020-10-31T21:41:26.367Z] extractArguments(org.eclipse.ease.AbstractScriptEngineTest)  Time elapsed: 0 s
17:41:26 [2020-10-31T21:41:26.367Z] executeSync(org.eclipse.ease.AbstractScriptEngineTest)  Time elapsed: 0.001 s
17:41:26 [2020-10-31T21:41:26.368Z] setNotNullErrorStream(org.eclipse.ease.AbstractScriptEngineTest)  Time elapsed: 0 s
17:41:26 [2020-10-31T21:41:26.368Z] setNullErrorStream(org.eclipse.ease.AbstractScriptEngineTest)  Time elapsed: 0 s
17:41:26 [2020-10-31T21:41:26.368Z] isJob(org.eclipse.ease.AbstractScriptEngineTest)  Time elapsed: 0 s
17:41:26 [2020-10-31T21:41:26.368Z] streamsAvailable(org.eclipse.ease.AbstractScriptEngineTest)  Time elapsed: 0 s
17:41:26 [2020-10-31T21:41:26.368Z] executeValidCodeAndTerminate(org.eclipse.ease.AbstractScriptEngineTest)  Time elapsed: 1.001 s
17:41:26 [2020-10-31T21:41:26.368Z] setNullOutputStream(org.eclipse.ease.AbstractScriptEngineTest)  Time elapsed: 0 s
17:41:26 [2020-10-31T21:41:26.368Z] terminateMultipleTimes(org.eclipse.ease.AbstractScriptEngineTest)  Time elapsed: 0.602 s
17:41:26 [2020-10-31T21:41:26.368Z] engineTerminatesWhenIdle(org.eclipse.ease.AbstractScriptEngineTest)  Time elapsed: 1.002 s
17:41:26 [2020-10-31T21:41:26.368Z] terminateViaTerminateMethod(org.eclipse.ease.AbstractScriptEngineTest)  Time elapsed: 0.202 s
17:41:26 [2020-10-31T21:41:26.368Z] terminateViaMethodCallback(org.eclipse.ease.AbstractScriptEngineTest)  Time elapsed: 0.002 s
17:41:26 [2020-10-31T21:41:26.368Z] executeErrorCodeAndTerminate(org.eclipse.ease.AbstractScriptEngineTest)  Time elapsed: 1.002 s
17:41:26 [2020-10-31T21:41:26.368Z] Running org.eclipse.ease.adapters.ScriptableAdapterTest
17:41:26 [2020-10-31T21:41:26.368Z] Tests run: 5, Failures: 0, Errors: 0, Skipped: 0, Time elapsed: 0.007 s - in org.eclipse.ease.adapters.ScriptableAdapterTest
17:41:26 [2020-10-31T21:41:26.368Z] adaptURI(org.eclipse.ease.adapters.ScriptableAdapterTest)  Time elapsed: 0.005 s
17:41:26 [2020-10-31T21:41:26.368Z] adaptURL(org.eclipse.ease.adapters.ScriptableAdapterTest)  Time elapsed: 0.001 s
17:41:26 [2020-10-31T21:41:26.368Z] adaptWorkspaceFile(org.eclipse.ease.adapters.ScriptableAdapterTest)  Time elapsed: 0 s
17:41:26 [2020-10-31T21:41:26.368Z] getAdapterList(org.eclipse.ease.adapters.ScriptableAdapterTest)  Time elapsed: 0 s
17:41:26 [2020-10-31T21:41:26.368Z] adaptFilesystemFile(org.eclipse.ease.adapters.ScriptableAdapterTest)  Time elapsed: 0 s
17:41:26 [2020-10-31T21:41:26.368Z] Running org.eclipse.ease.AbstractCodeFactoryTest
17:41:26 [2020-10-31T21:41:26.368Z] WARNING: An illegal reflective access operation has occurred
17:41:26 [2020-10-31T21:41:26.368Z] WARNING: Illegal reflective access by org.mockito.cglib.core.ReflectUtils$2 (file:/home/jenkins/.m2/repository/p2/osgi/bundle/org.mockito/1.9.5.v201605172210/org.mockito-1.9.5.v201605172210.jar) to method java.lang.ClassLoader.defineClass(java.lang.String,byte[],int,int,java.security.ProtectionDomain)
17:41:26 [2020-10-31T21:41:26.368Z] WARNING: Please consider reporting this to the maintainers of org.mockito.cglib.core.ReflectUtils$2
17:41:26 [2020-10-31T21:41:26.368Z] WARNING: Use --illegal-access=warn to enable warnings of further illegal reflective access operations
17:41:26 [2020-10-31T21:41:26.368Z] WARNING: All illegal access operations will be denied in a future release
17:41:26 [2020-10-31T21:41:26.368Z] Tests run: 1, Failures: 0, Errors: 0, Skipped: 0, Time elapsed: 0.061 s - in org.eclipse.ease.AbstractCodeFactoryTest
17:41:26 [2020-10-31T21:41:26.368Z] createNewKeywordHeader(org.eclipse.ease.AbstractCodeFactoryTest)  Time elapsed: 0.06 s
17:41:26 [2020-10-31T21:41:26.368Z] Running org.eclipse.ease.sign.VerifySignatureTest
17:41:26 [2020-10-31T21:41:26.368Z] Tests run: 1, Failures: 0, Errors: 0, Skipped: 0, Time elapsed: 0.005 s - in org.eclipse.ease.sign.VerifySignatureTest
17:41:26 [2020-10-31T21:41:26.368Z] testWithNonCodeParserScriptType(org.eclipse.ease.sign.VerifySignatureTest)  Time elapsed: 0.005 s
17:41:26 [2020-10-31T21:41:26.368Z] Running org.eclipse.ease.sign.SignatureHelperTest
17:41:26 [2020-10-31T21:41:26.368Z] Tests run: 1, Failures: 0, Errors: 0, Skipped: 0, Time elapsed: 0.007 s - in org.eclipse.ease.sign.SignatureHelperTest
17:41:26 [2020-10-31T21:41:26.368Z] certificateTest(org.eclipse.ease.sign.SignatureHelperTest)  Time elapsed: 0.007 s
17:41:26 [2020-10-31T21:41:26.368Z] Running org.eclipse.ease.ScriptResultTest
17:41:26 [2020-10-31T21:41:26.368Z] Tests run: 4, Failures: 0, Errors: 0, Skipped: 0, Time elapsed: 0 s - in org.eclipse.ease.ScriptResultTest
17:41:26 [2020-10-31T21:41:26.368Z] hasException(org.eclipse.ease.ScriptResultTest)  Time elapsed: 0 s
17:41:26 [2020-10-31T21:41:26.368Z] getResult(org.eclipse.ease.ScriptResultTest)  Time elapsed: 0 s
17:41:26 [2020-10-31T21:41:26.368Z] getException(org.eclipse.ease.ScriptResultTest)  Time elapsed: 0 s
17:41:26 [2020-10-31T21:41:26.368Z] isReady(org.eclipse.ease.ScriptResultTest)  Time elapsed: 0 s
17:41:26 [2020-10-31T21:41:26.368Z] Running org.eclipse.ease.AbstractCodeParserTest
17:41:26 [2020-10-31T21:41:26.368Z] Tests run: 5, Failures: 0, Errors: 0, Skipped: 0, Time elapsed: 0.002 s - in org.eclipse.ease.AbstractCodeParserTest
17:41:26 [2020-10-31T21:41:26.368Z] parseCode(org.eclipse.ease.AbstractCodeParserTest)  Time elapsed: 0 s
17:41:26 [2020-10-31T21:41:26.368Z] parseLineHeader(org.eclipse.ease.AbstractCodeParserTest)  Time elapsed: 0 s
17:41:26 [2020-10-31T21:41:26.368Z] parseBlockAfterWhitespace(org.eclipse.ease.AbstractCodeParserTest)  Time elapsed: 0 s
17:41:26 [2020-10-31T21:41:26.368Z] parseEmpty(org.eclipse.ease.AbstractCodeParserTest)  Time elapsed: 0 s
17:41:26 [2020-10-31T21:41:26.368Z] parseBlockHeader(org.eclipse.ease.AbstractCodeParserTest)  Time elapsed: 0 s
17:41:26 [2020-10-31T21:41:26.368Z] Running org.eclipse.ease.AbstractReplScriptEngineTest
17:41:32 [2020-10-31T21:41:32.905Z] testorg.eclipse.ease.ScriptExecutionException: Engine got terminated
17:41:33 [2020-10-31T21:41:33.161Z] java.lang.RuntimeException: ERROR
17:41:33 [2020-10-31T21:41:33.161Z] 	at org.eclipse.ease.AbstractReplScriptEngineTest$MockedScriptEngine.execute(AbstractReplScriptEngineTest.java:61)
17:41:33 [2020-10-31T21:41:33.161Z] 	at org.eclipse.ease.AbstractScriptEngine.inject(AbstractScriptEngine.java:224)
17:41:33 [2020-10-31T21:41:33.161Z] 	at org.eclipse.ease.AbstractScriptEngine.run(AbstractScriptEngine.java:274)
17:41:33 [2020-10-31T21:41:33.161Z] 	at org.eclipse.core.internal.jobs.Worker.run(Worker.java:63)
17:41:33 [2020-10-31T21:41:33.161Z] Hello worldHello world1Tests run: 20, Failures: 0, Errors: 0, Skipped: 0, Time elapsed: 6.745 s - in org.eclipse.ease.AbstractReplScriptEngineTest
17:41:33 [2020-10-31T21:41:33.161Z] terminateOnIdleAfterSchedule(org.eclipse.ease.AbstractReplScriptEngineTest)  Time elapsed: 0.021 s
17:41:33 [2020-10-31T21:41:33.161Z] terminateEngine(org.eclipse.ease.AbstractReplScriptEngineTest)  Time elapsed: 1.001 s
17:41:33 [2020-10-31T21:41:33.161Z] keepRunningOnIdle(org.eclipse.ease.AbstractReplScriptEngineTest)  Time elapsed: 1.002 s
17:41:33 [2020-10-31T21:41:33.161Z] extractEmptyArguments(org.eclipse.ease.AbstractReplScriptEngineTest)  Time elapsed: 0 s
17:41:33 [2020-10-31T21:41:33.161Z] setNotNullOutputStream(org.eclipse.ease.AbstractReplScriptEngineTest)  Time elapsed: 0 s
17:41:33 [2020-10-31T21:41:33.161Z] terminateViaMonitorCancellation(org.eclipse.ease.AbstractReplScriptEngineTest)  Time elapsed: 1.202 s
17:41:33 [2020-10-31T21:41:33.161Z] inject(org.eclipse.ease.AbstractReplScriptEngineTest)  Time elapsed: 0 s
17:41:33 [2020-10-31T21:41:33.161Z] extractArguments(org.eclipse.ease.AbstractReplScriptEngineTest)  Time elapsed: 0 s
17:41:33 [2020-10-31T21:41:33.161Z] executeSync(org.eclipse.ease.AbstractReplScriptEngineTest)  Time elapsed: 1.002 s
17:41:33 [2020-10-31T21:41:33.161Z] setNotNullErrorStream(org.eclipse.ease.AbstractReplScriptEngineTest)  Time elapsed: 0 s
17:41:33 [2020-10-31T21:41:33.161Z] setNullErrorStream(org.eclipse.ease.AbstractReplScriptEngineTest)  Time elapsed: 0 s
17:41:33 [2020-10-31T21:41:33.161Z] isJob(org.eclipse.ease.AbstractReplScriptEngineTest)  Time elapsed: 0 s
17:41:33 [2020-10-31T21:41:33.161Z] streamsAvailable(org.eclipse.ease.AbstractReplScriptEngineTest)  Time elapsed: 0 s
17:41:33 [2020-10-31T21:41:33.161Z] executeValidCodeAndTerminate(org.eclipse.ease.AbstractReplScriptEngineTest)  Time elapsed: 1.001 s
17:41:33 [2020-10-31T21:41:33.162Z] setNullOutputStream(org.eclipse.ease.AbstractReplScriptEngineTest)  Time elapsed: 0 s
17:41:33 [2020-10-31T21:41:33.162Z] terminateMultipleTimes(org.eclipse.ease.AbstractReplScriptEngineTest)  Time elapsed: 0.302 s
17:41:33 [2020-10-31T21:41:33.162Z] engineTerminatesWhenIdle(org.eclipse.ease.AbstractReplScriptEngineTest)  Time elapsed: 0 s
17:41:33 [2020-10-31T21:41:33.162Z] terminateViaTerminateMethod(org.eclipse.ease.AbstractReplScriptEngineTest)  Time elapsed: 0.201 s
17:41:33 [2020-10-31T21:41:33.162Z] terminateViaMethodCallback(org.eclipse.ease.AbstractReplScriptEngineTest)  Time elapsed: 1.001 s
17:41:33 [2020-10-31T21:41:33.162Z] executeErrorCodeAndTerminate(org.eclipse.ease.AbstractReplScriptEngineTest)  Time elapsed: 0.001 s
17:41:33 [2020-10-31T21:41:33.162Z] 
17:41:33 [2020-10-31T21:41:33.162Z] Results:
17:41:33 [2020-10-31T21:41:33.162Z] 
17:41:33 [2020-10-31T21:41:33.162Z] Tests run: 124, Failures: 0, Errors: 0, Skipped: 0
17:41:33 [2020-10-31T21:41:33.162Z] 
17:41:33 [2020-10-31T21:41:33.417Z] [INFO] All tests passed!
17:41:33 [2020-10-31T21:41:33.417Z] [INFO] 
17:41:33 [2020-10-31T21:41:33.417Z] [INFO] ---< org.eclipse.ease:org.eclipse.ease.lang.javascript.nashorn.test >---
17:41:33 [2020-10-31T21:41:33.417Z] [INFO] Building org.eclipse.ease.lang.javascript.nashorn.test 0.8.0-SNAPSHOT [4/11]
17:41:33 [2020-10-31T21:41:33.417Z] [INFO] ------------------------[ eclipse-test-plugin ]-------------------------
17:41:33 [2020-10-31T21:41:33.417Z] [INFO] 
17:41:33 [2020-10-31T21:41:33.417Z] [INFO] --- tycho-packaging-plugin:1.5.0:build-qualifier (default-build-qualifier) @ org.eclipse.ease.lang.javascript.nashorn.test ---
17:41:33 [2020-10-31T21:41:33.417Z] [INFO] The project's OSGi version is 0.8.0.I201910171213
17:41:33 [2020-10-31T21:41:33.417Z] [INFO] 
17:41:33 [2020-10-31T21:41:33.417Z] [INFO] --- tycho-packaging-plugin:1.5.0:validate-id (default-validate-id) @ org.eclipse.ease.lang.javascript.nashorn.test ---
17:41:33 [2020-10-31T21:41:33.417Z] [INFO] 
17:41:33 [2020-10-31T21:41:33.417Z] [INFO] --- tycho-packaging-plugin:1.5.0:validate-version (default-validate-version) @ org.eclipse.ease.lang.javascript.nashorn.test ---
17:41:33 [2020-10-31T21:41:33.417Z] [INFO] 
17:41:33 [2020-10-31T21:41:33.417Z] [INFO] --- maven-resources-plugin:2.4.3:resources (default-resources) @ org.eclipse.ease.lang.javascript.nashorn.test ---
17:41:33 [2020-10-31T21:41:33.417Z] [INFO] Using 'UTF-8' encoding to copy filtered resources.
17:41:33 [2020-10-31T21:41:33.417Z] [INFO] skip non existing resourceDirectory /home/jenkins/agent/workspace/ease.verify.core.target.2019-03/tests/org.eclipse.ease.lang.javascript.nashorn.test/src/main/resources
17:41:33 [2020-10-31T21:41:33.417Z] [INFO] 
17:41:33 [2020-10-31T21:41:33.417Z] [INFO] --- tycho-compiler-plugin:1.5.0:compile (default-compile) @ org.eclipse.ease.lang.javascript.nashorn.test ---
17:41:33 [2020-10-31T21:41:33.417Z] [INFO] Nothing to compile - all classes are up to date
17:41:33 [2020-10-31T21:41:33.417Z] [INFO] 
17:41:33 [2020-10-31T21:41:33.417Z] [INFO] --- maven-resources-plugin:2.4.3:testResources (default-testResources) @ org.eclipse.ease.lang.javascript.nashorn.test ---
17:41:33 [2020-10-31T21:41:33.417Z] [INFO] Using 'UTF-8' encoding to copy filtered resources.
17:41:33 [2020-10-31T21:41:33.417Z] [INFO] skip non existing resourceDirectory /home/jenkins/agent/workspace/ease.verify.core.target.2019-03/tests/org.eclipse.ease.lang.javascript.nashorn.test/src/test/resources
17:41:33 [2020-10-31T21:41:33.417Z] [INFO] 
17:41:33 [2020-10-31T21:41:33.418Z] [INFO] --- tycho-source-plugin:1.5.0:plugin-source (plugin-source) @ org.eclipse.ease.lang.javascript.nashorn.test ---
17:41:33 [2020-10-31T21:41:33.418Z] [WARNING] Bundle-Vendor header not found in /home/jenkins/agent/workspace/ease.verify.core.target.2019-03/tests/org.eclipse.ease.lang.javascript.nashorn.test/META-INF/MANIFEST.MF, fallback to 'unknown' for source bundle
17:41:33 [2020-10-31T21:41:33.418Z] [INFO] Building jar: /home/jenkins/agent/workspace/ease.verify.core.target.2019-03/tests/org.eclipse.ease.lang.javascript.nashorn.test/target/org.eclipse.ease.lang.javascript.nashorn.test-0.8.0-SNAPSHOT-sources.jar
17:41:33 [2020-10-31T21:41:33.681Z] [INFO] 
17:41:33 [2020-10-31T21:41:33.681Z] [INFO] --- target-platform-configuration:1.5.0:target-platform (default-target-platform) @ org.eclipse.ease.lang.javascript.nashorn.test ---
17:41:33 [2020-10-31T21:41:33.681Z] [INFO] 
17:41:33 [2020-10-31T21:41:33.681Z] [INFO] --- tycho-packaging-plugin:1.5.0:package-plugin (default-package-plugin) @ org.eclipse.ease.lang.javascript.nashorn.test ---
17:41:33 [2020-10-31T21:41:33.681Z] [INFO] Building jar: /home/jenkins/agent/workspace/ease.verify.core.target.2019-03/tests/org.eclipse.ease.lang.javascript.nashorn.test/target/org.eclipse.ease.lang.javascript.nashorn.test-0.8.0-SNAPSHOT.jar
17:41:33 [2020-10-31T21:41:33.681Z] [INFO] 
17:41:33 [2020-10-31T21:41:33.681Z] [INFO] --- tycho-p2-plugin:1.5.0:p2-metadata-default (default-p2-metadata-default) @ org.eclipse.ease.lang.javascript.nashorn.test ---
17:41:33 [2020-10-31T21:41:33.681Z] [INFO] 
17:41:33 [2020-10-31T21:41:33.681Z] [INFO] --- tycho-source-feature-plugin:1.5.0:source-feature (source-feature) @ org.eclipse.ease.lang.javascript.nashorn.test ---
17:41:33 [2020-10-31T21:41:33.681Z] [INFO] 
17:41:33 [2020-10-31T21:41:33.681Z] [INFO] --- tycho-p2-plugin:1.5.0:p2-metadata (attached-p2-metadata) @ org.eclipse.ease.lang.javascript.nashorn.test ---
17:41:33 [2020-10-31T21:41:33.681Z] [INFO] 
17:41:33 [2020-10-31T21:41:33.681Z] [INFO] --- tycho-surefire-plugin:1.5.0:test (default-test) @ org.eclipse.ease.lang.javascript.nashorn.test ---
17:41:33 [2020-10-31T21:41:33.682Z] [INFO] Expected eclipse log file: /home/jenkins/agent/workspace/ease.verify.core.target.2019-03/tests/org.eclipse.ease.lang.javascript.nashorn.test/target/work/data/.metadata/.log
17:41:33 [2020-10-31T21:41:33.682Z] [INFO] Command line:
17:41:33 [2020-10-31T21:41:33.682Z] 	[/opt/tools/java/openjdk/jdk-11/11.0.2+9/bin/java, -Dosgi.noShutdown=false, -Dosgi.os=linux, -Dosgi.ws=gtk, -Dosgi.arch=x86_64, -Dosgi.clean=true, -jar, /home/jenkins/.m2/repository/p2/osgi/bundle/org.eclipse.equinox.launcher/1.5.300.v20190213-1655/org.eclipse.equinox.launcher-1.5.300.v20190213-1655.jar, -data, /home/jenkins/agent/workspace/ease.verify.core.target.2019-03/tests/org.eclipse.ease.lang.javascript.nashorn.test/target/work/data, -install, /home/jenkins/agent/workspace/ease.verify.core.target.2019-03/tests/org.eclipse.ease.lang.javascript.nashorn.test/target/work, -configuration, /home/jenkins/agent/workspace/ease.verify.core.target.2019-03/tests/org.eclipse.ease.lang.javascript.nashorn.test/target/work/configuration, -application, org.eclipse.tycho.surefire.osgibooter.headlesstest, -testproperties, /home/jenkins/agent/workspace/ease.verify.core.target.2019-03/tests/org.eclipse.ease.lang.javascript.nashorn.test/target/surefire.properties]
17:41:33 [2020-10-31T21:41:33.682Z] Picked up JAVA_TOOL_OPTIONS: -Dmaven.ext.class.path="/home/jenkins/agent/workspace/ease.verify.core.target.2019-03@tmp/withMaven4b016809/pipeline-maven-spy.jar" -Dorg.jenkinsci.plugins.pipeline.maven.reportsFolder="/home/jenkins/agent/workspace/ease.verify.core.target.2019-03@tmp/withMaven4b016809" 
17:41:35 [2020-10-31T21:41:35.569Z] Running org.eclipse.ease.lang.javascript.nashorn.NashornEnvironmentTest
17:41:35 [2020-10-31T21:41:35.569Z] Warning: Nashorn engine is planned to be removed from a future JDK release
17:41:35 [2020-10-31T21:41:35.824Z] Warning: Nashorn engine is planned to be removed from a future JDK release
17:41:35 [2020-10-31T21:41:35.825Z] Warning: Nashorn engine is planned to be removed from a future JDK release
17:41:36 [2020-10-31T21:41:36.081Z] WARNING: An illegal reflective access operation has occurred
17:41:36 [2020-10-31T21:41:36.081Z] WARNING: Illegal reflective access by org.mockito.cglib.core.ReflectUtils$2 (file:/home/jenkins/.m2/repository/p2/osgi/bundle/org.mockito/1.9.5.v201605172210/org.mockito-1.9.5.v201605172210.jar) to method java.lang.ClassLoader.defineClass(java.lang.String,byte[],int,int,java.security.ProtectionDomain)
17:41:36 [2020-10-31T21:41:36.081Z] WARNING: Please consider reporting this to the maintainers of org.mockito.cglib.core.ReflectUtils$2
17:41:36 [2020-10-31T21:41:36.081Z] WARNING: Use --illegal-access=warn to enable warnings of further illegal reflective access operations
17:41:36 [2020-10-31T21:41:36.081Z] WARNING: All illegal access operations will be denied in a future release
17:41:36 [2020-10-31T21:41:36.081Z] Warning: Nashorn engine is planned to be removed from a future JDK release
17:41:36 [2020-10-31T21:41:36.081Z] Warning: Nashorn engine is planned to be removed from a future JDK release
17:41:36 [2020-10-31T21:41:36.081Z] Tests run: 5, Failures: 0, Errors: 0, Skipped: 0, Time elapsed: 0.872 s - in org.eclipse.ease.lang.javascript.nashorn.NashornEnvironmentTest
17:41:36 [2020-10-31T21:41:36.081Z] reloadEnvironment(org.eclipse.ease.lang.javascript.nashorn.NashornEnvironmentTest)  Time elapsed: 0.502 s
17:41:36 [2020-10-31T21:41:36.081Z] bootstrappedEnvironment(org.eclipse.ease.lang.javascript.nashorn.NashornEnvironmentTest)  Time elapsed: 0.032 s
17:41:36 [2020-10-31T21:41:36.081Z] postMethodCallback(org.eclipse.ease.lang.javascript.nashorn.NashornEnvironmentTest)  Time elapsed: 0.181 s
17:41:36 [2020-10-31T21:41:36.081Z] preMethodCallback(org.eclipse.ease.lang.javascript.nashorn.NashornEnvironmentTest)  Time elapsed: 0.036 s
17:41:36 [2020-10-31T21:41:36.081Z] reloadFunctionDefinitions(org.eclipse.ease.lang.javascript.nashorn.NashornEnvironmentTest)  Time elapsed: 0.071 s
17:41:36 [2020-10-31T21:41:36.081Z] 
17:41:36 [2020-10-31T21:41:36.081Z] Results:
17:41:36 [2020-10-31T21:41:36.081Z] 
17:41:36 [2020-10-31T21:41:36.081Z] Tests run: 5, Failures: 0, Errors: 0, Skipped: 0
17:41:36 [2020-10-31T21:41:36.081Z] 
17:41:36 [2020-10-31T21:41:36.643Z] [INFO] All tests passed!
17:41:36 [2020-10-31T21:41:36.643Z] [INFO] 
17:41:36 [2020-10-31T21:41:36.643Z] [INFO] ----< org.eclipse.ease:org.eclipse.ease.lang.javascript.rhino.test >----
17:41:36 [2020-10-31T21:41:36.643Z] [INFO] Building org.eclipse.ease.lang.javascript.rhino.test 0.8.0-SNAPSHOT [5/11]
17:41:36 [2020-10-31T21:41:36.643Z] [INFO] ------------------------[ eclipse-test-plugin ]-------------------------
17:41:36 [2020-10-31T21:41:36.643Z] [INFO] 
17:41:36 [2020-10-31T21:41:36.643Z] [INFO] --- tycho-packaging-plugin:1.5.0:build-qualifier (default-build-qualifier) @ org.eclipse.ease.lang.javascript.rhino.test ---
17:41:36 [2020-10-31T21:41:36.643Z] [INFO] The project's OSGi version is 0.8.0.I201911291239
17:41:36 [2020-10-31T21:41:36.643Z] [INFO] 
17:41:36 [2020-10-31T21:41:36.643Z] [INFO] --- tycho-packaging-plugin:1.5.0:validate-id (default-validate-id) @ org.eclipse.ease.lang.javascript.rhino.test ---
17:41:36 [2020-10-31T21:41:36.643Z] [INFO] 
17:41:36 [2020-10-31T21:41:36.643Z] [INFO] --- tycho-packaging-plugin:1.5.0:validate-version (default-validate-version) @ org.eclipse.ease.lang.javascript.rhino.test ---
17:41:36 [2020-10-31T21:41:36.643Z] [INFO] 
17:41:36 [2020-10-31T21:41:36.643Z] [INFO] --- maven-resources-plugin:2.4.3:resources (default-resources) @ org.eclipse.ease.lang.javascript.rhino.test ---
17:41:36 [2020-10-31T21:41:36.643Z] [INFO] Using 'UTF-8' encoding to copy filtered resources.
17:41:36 [2020-10-31T21:41:36.643Z] [INFO] skip non existing resourceDirectory /home/jenkins/agent/workspace/ease.verify.core.target.2019-03/tests/org.eclipse.ease.lang.javascript.rhino.test/src/main/resources
17:41:36 [2020-10-31T21:41:36.643Z] [INFO] 
17:41:36 [2020-10-31T21:41:36.643Z] [INFO] --- tycho-compiler-plugin:1.5.0:compile (default-compile) @ org.eclipse.ease.lang.javascript.rhino.test ---
17:41:36 [2020-10-31T21:41:36.643Z] [INFO] Nothing to compile - all classes are up to date
17:41:36 [2020-10-31T21:41:36.643Z] [INFO] 
17:41:36 [2020-10-31T21:41:36.643Z] [INFO] --- maven-resources-plugin:2.4.3:testResources (default-testResources) @ org.eclipse.ease.lang.javascript.rhino.test ---
17:41:36 [2020-10-31T21:41:36.643Z] [INFO] Using 'UTF-8' encoding to copy filtered resources.
17:41:36 [2020-10-31T21:41:36.643Z] [INFO] skip non existing resourceDirectory /home/jenkins/agent/workspace/ease.verify.core.target.2019-03/tests/org.eclipse.ease.lang.javascript.rhino.test/src/test/resources
17:41:36 [2020-10-31T21:41:36.643Z] [INFO] 
17:41:36 [2020-10-31T21:41:36.643Z] [INFO] --- tycho-source-plugin:1.5.0:plugin-source (plugin-source) @ org.eclipse.ease.lang.javascript.rhino.test ---
17:41:36 [2020-10-31T21:41:36.643Z] [WARNING] Bundle-Vendor header not found in /home/jenkins/agent/workspace/ease.verify.core.target.2019-03/tests/org.eclipse.ease.lang.javascript.rhino.test/META-INF/MANIFEST.MF, fallback to 'unknown' for source bundle
17:41:36 [2020-10-31T21:41:36.643Z] [INFO] Building jar: /home/jenkins/agent/workspace/ease.verify.core.target.2019-03/tests/org.eclipse.ease.lang.javascript.rhino.test/target/org.eclipse.ease.lang.javascript.rhino.test-0.8.0-SNAPSHOT-sources.jar
17:41:36 [2020-10-31T21:41:36.643Z] [INFO] 
17:41:36 [2020-10-31T21:41:36.643Z] [INFO] --- target-platform-configuration:1.5.0:target-platform (default-target-platform) @ org.eclipse.ease.lang.javascript.rhino.test ---
17:41:36 [2020-10-31T21:41:36.643Z] [INFO] 
17:41:36 [2020-10-31T21:41:36.643Z] [INFO] --- tycho-packaging-plugin:1.5.0:package-plugin (default-package-plugin) @ org.eclipse.ease.lang.javascript.rhino.test ---
17:41:36 [2020-10-31T21:41:36.643Z] [INFO] Building jar: /home/jenkins/agent/workspace/ease.verify.core.target.2019-03/tests/org.eclipse.ease.lang.javascript.rhino.test/target/org.eclipse.ease.lang.javascript.rhino.test-0.8.0-SNAPSHOT.jar
17:41:36 [2020-10-31T21:41:36.643Z] [INFO] 
17:41:36 [2020-10-31T21:41:36.643Z] [INFO] --- tycho-p2-plugin:1.5.0:p2-metadata-default (default-p2-metadata-default) @ org.eclipse.ease.lang.javascript.rhino.test ---
17:41:36 [2020-10-31T21:41:36.643Z] [INFO] 
17:41:36 [2020-10-31T21:41:36.643Z] [INFO] --- tycho-source-feature-plugin:1.5.0:source-feature (source-feature) @ org.eclipse.ease.lang.javascript.rhino.test ---
17:41:36 [2020-10-31T21:41:36.643Z] [INFO] 
17:41:36 [2020-10-31T21:41:36.643Z] [INFO] --- tycho-p2-plugin:1.5.0:p2-metadata (attached-p2-metadata) @ org.eclipse.ease.lang.javascript.rhino.test ---
17:41:36 [2020-10-31T21:41:36.643Z] [INFO] 
17:41:36 [2020-10-31T21:41:36.643Z] [INFO] --- tycho-surefire-plugin:1.5.0:test (default-test) @ org.eclipse.ease.lang.javascript.rhino.test ---
17:41:36 [2020-10-31T21:41:36.643Z] [INFO] Expected eclipse log file: /home/jenkins/agent/workspace/ease.verify.core.target.2019-03/tests/org.eclipse.ease.lang.javascript.rhino.test/target/work/data/.metadata/.log
17:41:36 [2020-10-31T21:41:36.643Z] [INFO] Command line:
17:41:36 [2020-10-31T21:41:36.643Z] 	[/opt/tools/java/openjdk/jdk-11/11.0.2+9/bin/java, -Dosgi.noShutdown=false, -Dosgi.os=linux, -Dosgi.ws=gtk, -Dosgi.arch=x86_64, -Dosgi.clean=true, -jar, /home/jenkins/.m2/repository/p2/osgi/bundle/org.eclipse.equinox.launcher/1.5.300.v20190213-1655/org.eclipse.equinox.launcher-1.5.300.v20190213-1655.jar, -data, /home/jenkins/agent/workspace/ease.verify.core.target.2019-03/tests/org.eclipse.ease.lang.javascript.rhino.test/target/work/data, -install, /home/jenkins/agent/workspace/ease.verify.core.target.2019-03/tests/org.eclipse.ease.lang.javascript.rhino.test/target/work, -configuration, /home/jenkins/agent/workspace/ease.verify.core.target.2019-03/tests/org.eclipse.ease.lang.javascript.rhino.test/target/work/configuration, -application, org.eclipse.tycho.surefire.osgibooter.headlesstest, -testproperties, /home/jenkins/agent/workspace/ease.verify.core.target.2019-03/tests/org.eclipse.ease.lang.javascript.rhino.test/target/surefire.properties]
17:41:36 [2020-10-31T21:41:36.643Z] Picked up JAVA_TOOL_OPTIONS: -Dmaven.ext.class.path="/home/jenkins/agent/workspace/ease.verify.core.target.2019-03@tmp/withMaven4b016809/pipeline-maven-spy.jar" -Dorg.jenkinsci.plugins.pipeline.maven.reportsFolder="/home/jenkins/agent/workspace/ease.verify.core.target.2019-03@tmp/withMaven4b016809" 
17:41:38 [2020-10-31T21:41:38.565Z] Running org.eclipse.ease.lang.javascript.rhino.RhinoDebuggerEngineTest
17:41:38 [2020-10-31T21:41:38.833Z] org.eclipse.ease.ScriptExecutionException: JavaError: NotThere cannot be found by org.mozilla.javascript_1.7.5.v201504281450
17:41:38 [2020-10-31T21:41:38.833Z] 
17:41:38 [2020-10-31T21:41:38.833Z] Java Stacktrace:
17:41:38 [2020-10-31T21:41:38.833Z] java.lang.ClassNotFoundException: NotThere cannot be found by org.mozilla.javascript_1.7.5.v201504281450
17:41:38 [2020-10-31T21:41:38.833Z] 	at org.eclipse.osgi.internal.loader.BundleLoader.findClassInternal(BundleLoader.java:511)
17:41:38 [2020-10-31T21:41:38.833Z] 	at org.eclipse.osgi.internal.loader.BundleLoader.findClass(BundleLoader.java:422)
17:41:38 [2020-10-31T21:41:38.833Z] 	at org.eclipse.osgi.internal.loader.BundleLoader.findClass(BundleLoader.java:414)
17:41:38 [2020-10-31T21:41:38.833Z] 	at org.eclipse.osgi.internal.loader.ModuleClassLoader.loadClass(ModuleClassLoader.java:153)
17:41:38 [2020-10-31T21:41:38.833Z] 	at java.base/java.lang.ClassLoader.loadClass(ClassLoader.java:521)
17:41:38 [2020-10-31T21:41:38.833Z] 	at java.base/java.lang.Class.forName0(Native Method)
17:41:38 [2020-10-31T21:41:38.833Z] 	at java.base/java.lang.Class.forName(Class.java:315)
17:41:38 [2020-10-31T21:41:38.833Z] 	at java.base/jdk.internal.reflect.NativeMethodAccessorImpl.invoke0(Native Method)
17:41:38 [2020-10-31T21:41:38.833Z] 	at java.base/jdk.internal.reflect.NativeMethodAccessorImpl.invoke(NativeMethodAccessorImpl.java:62)
17:41:38 [2020-10-31T21:41:38.833Z] 	at java.base/jdk.internal.reflect.DelegatingMethodAccessorImpl.invoke(DelegatingMethodAccessorImpl.java:43)
17:41:38 [2020-10-31T21:41:38.833Z] 	at java.base/java.lang.reflect.Method.invoke(Method.java:566)
17:41:38 [2020-10-31T21:41:38.833Z] 	at org.mozilla.javascript.MemberBox.invoke(MemberBox.java:126)
17:41:38 [2020-10-31T21:41:38.833Z] 	at org.mozilla.javascript.NativeJavaMethod.call(NativeJavaMethod.java:225)
17:41:38 [2020-10-31T21:41:38.833Z] 	at org.mozilla.javascript.Interpreter.interpretLoop(Interpreter.java:1473)
17:41:38 [2020-10-31T21:41:38.833Z] 	at org.mozilla.javascript.Interpreter.interpret(Interpreter.java:815)
17:41:38 [2020-10-31T21:41:38.833Z] 	at org.mozilla.javascript.InterpretedFunction.call(InterpretedFunction.java:109)
17:41:38 [2020-10-31T21:41:38.833Z] 	at org.mozilla.javascript.ContextFactory.doTopCall(ContextFactory.java:394)
17:41:38 [2020-10-31T21:41:38.833Z] 	at org.mozilla.javascript.ScriptRuntime.doTopCall(ScriptRuntime.java:3091)
17:41:38 [2020-10-31T21:41:38.833Z] 	at org.mozilla.javascript.InterpretedFunction.exec(InterpretedFunction.java:120)
17:41:38 [2020-10-31T21:41:38.833Z] 	at org.mozilla.javascript.Context.evaluateReader(Context.java:1110)
17:41:38 [2020-10-31T21:41:38.833Z] 	at org.eclipse.ease.lang.javascript.rhino.RhinoScriptEngine.internalExecute(RhinoScriptEngine.java:222)
17:41:38 [2020-10-31T21:41:38.833Z] 	at org.eclipse.ease.lang.javascript.rhino.RhinoScriptEngine.execute(RhinoScriptEngine.java:201)
17:41:38 [2020-10-31T21:41:38.833Z] 	at org.eclipse.ease.AbstractScriptEngine.inject(AbstractScriptEngine.java:224)
17:41:38 [2020-10-31T21:41:38.833Z] 	at org.eclipse.ease.AbstractScriptEngine.run(AbstractScriptEngine.java:274)
17:41:38 [2020-10-31T21:41:38.833Z] 	at org.eclipse.core.internal.jobs.Worker.run(Worker.java:63)
17:41:38 [2020-10-31T21:41:38.833Z] org.eclipse.ease.ScriptExecutionException: TypeError: Cannot call method "foobar" of undefined
17:41:38 [2020-10-31T21:41:38.833Z] org.eclipse.ease.ScriptExecutionException: ScriptException: test
17:41:38 [2020-10-31T21:41:38.834Z] org.eclipse.ease.ScriptExecutionException: JavaError: java.lang.Exception
17:41:38 [2020-10-31T21:41:38.834Z] 
17:41:38 [2020-10-31T21:41:38.834Z] Java Stacktrace:
17:41:38 [2020-10-31T21:41:38.834Z] java.lang.Exception
17:41:38 [2020-10-31T21:41:38.834Z] 	at java.base/jdk.internal.reflect.NativeConstructorAccessorImpl.newInstance0(Native Method)
17:41:38 [2020-10-31T21:41:38.834Z] 	at java.base/jdk.internal.reflect.NativeConstructorAccessorImpl.newInstance(NativeConstructorAccessorImpl.java:62)
17:41:38 [2020-10-31T21:41:38.834Z] 	at java.base/jdk.internal.reflect.DelegatingConstructorAccessorImpl.newInstance(DelegatingConstructorAccessorImpl.java:45)
17:41:38 [2020-10-31T21:41:38.834Z] 	at java.base/java.lang.reflect.Constructor.newInstance(Constructor.java:490)
17:41:38 [2020-10-31T21:41:38.834Z] 	at org.mozilla.javascript.MemberBox.newInstance(MemberBox.java:159)
17:41:38 [2020-10-31T21:41:38.834Z] 	at org.mozilla.javascript.NativeJavaClass.constructInternal(NativeJavaClass.java:266)
17:41:38 [2020-10-31T21:41:38.834Z] 	at org.mozilla.javascript.NativeJavaClass.constructSpecific(NativeJavaClass.java:205)
17:41:38 [2020-10-31T21:41:38.834Z] 	at org.mozilla.javascript.NativeJavaClass.construct(NativeJavaClass.java:166)
17:41:38 [2020-10-31T21:41:38.834Z] 	at org.mozilla.javascript.Interpreter.interpretLoop(Interpreter.java:1519)
17:41:38 [2020-10-31T21:41:38.834Z] 	at org.mozilla.javascript.Interpreter.interpret(Interpreter.java:815)
17:41:38 [2020-10-31T21:41:38.834Z] 	at org.mozilla.javascript.InterpretedFunction.call(InterpretedFunction.java:109)
17:41:38 [2020-10-31T21:41:38.834Z] 	at org.mozilla.javascript.ContextFactory.doTopCall(ContextFactory.java:394)
17:41:38 [2020-10-31T21:41:38.834Z] 	at org.mozilla.javascript.ScriptRuntime.doTopCall(ScriptRuntime.java:3091)
17:41:38 [2020-10-31T21:41:38.834Z] 	at org.mozilla.javascript.InterpretedFunction.exec(InterpretedFunction.java:120)
17:41:38 [2020-10-31T21:41:38.834Z] 	at org.mozilla.javascript.Context.evaluateReader(Context.java:1110)
17:41:38 [2020-10-31T21:41:38.834Z] 	at org.eclipse.ease.lang.javascript.rhino.RhinoScriptEngine.internalExecute(RhinoScriptEngine.java:222)
17:41:38 [2020-10-31T21:41:38.834Z] 	at org.eclipse.ease.lang.javascript.rhino.RhinoScriptEngine.execute(RhinoScriptEngine.java:201)
17:41:38 [2020-10-31T21:41:38.834Z] 	at org.eclipse.ease.AbstractScriptEngine.inject(AbstractScriptEngine.java:224)
17:41:38 [2020-10-31T21:41:38.834Z] 	at org.eclipse.ease.AbstractScriptEngine.run(AbstractScriptEngine.java:274)
17:41:38 [2020-10-31T21:41:38.834Z] 	at org.eclipse.core.internal.jobs.Worker.run(Worker.java:63)
17:41:38 [2020-10-31T21:41:38.834Z] org.eclipse.ease.ScriptExecutionException: ScriptException: JavaScript
17:41:39 [2020-10-31T21:41:39.089Z] org.eclipse.ease.ScriptExecutionException: SyntaxError: unterminated string literal (#1)
17:41:39 [2020-10-31T21:41:39.089Z] 'asdf
17:41:39 [2020-10-31T21:41:39.089Z]     ^
17:41:39 [2020-10-31T21:41:39.089Z] 	at <unknown source>:1
17:41:39 [2020-10-31T21:41:39.089Z] Tests run: 12, Failures: 0, Errors: 0, Skipped: 0, Time elapsed: 0.52 s - in org.eclipse.ease.lang.javascript.rhino.RhinoDebuggerEngineTest
17:41:39 [2020-10-31T21:41:39.089Z] getExceptionStackTrace(org.eclipse.ease.lang.javascript.rhino.RhinoDebuggerEngineTest)  Time elapsed: 0.19 s
17:41:39 [2020-10-31T21:41:39.089Z] causeWrappedException(org.eclipse.ease.lang.javascript.rhino.RhinoDebuggerEngineTest)  Time elapsed: 0.056 s
17:41:39 [2020-10-31T21:41:39.089Z] optionalModuleParameters(org.eclipse.ease.lang.javascript.rhino.RhinoDebuggerEngineTest)  Time elapsed: 0.018 s
17:41:39 [2020-10-31T21:41:39.089Z] simpleScriptCode(org.eclipse.ease.lang.javascript.rhino.RhinoDebuggerEngineTest)  Time elapsed: 0.023 s
17:41:39 [2020-10-31T21:41:39.089Z] causeRuntimeErrorException(org.eclipse.ease.lang.javascript.rhino.RhinoDebuggerEngineTest)  Time elapsed: 0.058 s
17:41:39 [2020-10-31T21:41:39.089Z] callModuleCode(org.eclipse.ease.lang.javascript.rhino.RhinoDebuggerEngineTest)  Time elapsed: 0.017 s
17:41:39 [2020-10-31T21:41:39.089Z] throwJavaClass(org.eclipse.ease.lang.javascript.rhino.RhinoDebuggerEngineTest)  Time elapsed: 0.016 s
17:41:39 [2020-10-31T21:41:39.089Z] throwJavaException(org.eclipse.ease.lang.javascript.rhino.RhinoDebuggerEngineTest)  Time elapsed: 0.03 s
17:41:39 [2020-10-31T21:41:39.089Z] accessJavaClasses(org.eclipse.ease.lang.javascript.rhino.RhinoDebuggerEngineTest)  Time elapsed: 0.044 s
17:41:39 [2020-10-31T21:41:39.089Z] accessEclipseClasses(org.eclipse.ease.lang.javascript.rhino.RhinoDebuggerEngineTest)  Time elapsed: 0.017 s
17:41:39 [2020-10-31T21:41:39.090Z] throwJavaScriptException(org.eclipse.ease.lang.javascript.rhino.RhinoDebuggerEngineTest)  Time elapsed: 0.016 s
17:41:39 [2020-10-31T21:41:39.090Z] causeSyntaxErrorException(org.eclipse.ease.lang.javascript.rhino.RhinoDebuggerEngineTest)  Time elapsed: 0.014 s
17:41:39 [2020-10-31T21:41:39.090Z] Running org.eclipse.ease.lang.javascript.rhino.RhinoDebugTest
17:41:39 [2020-10-31T21:41:39.090Z] WARNING: An illegal reflective access operation has occurred
17:41:39 [2020-10-31T21:41:39.090Z] WARNING: Illegal reflective access by org.mockito.cglib.core.ReflectUtils$2 (file:/home/jenkins/.m2/repository/p2/osgi/bundle/org.mockito/1.9.5.v201605172210/org.mockito-1.9.5.v201605172210.jar) to method java.lang.ClassLoader.defineClass(java.lang.String,byte[],int,int,java.security.ProtectionDomain)
17:41:39 [2020-10-31T21:41:39.090Z] WARNING: Please consider reporting this to the maintainers of org.mockito.cglib.core.ReflectUtils$2
17:41:39 [2020-10-31T21:41:39.090Z] WARNING: Use --illegal-access=warn to enable warnings of further illegal reflective access operations
17:41:39 [2020-10-31T21:41:39.090Z] WARNING: All illegal access operations will be denied in a future release
17:41:39 [2020-10-31T21:41:39.090Z] Start of script
17:41:39 [2020-10-31T21:41:39.090Z] include file start
17:41:39 [2020-10-31T21:41:39.090Z] Include file processed
17:41:39 [2020-10-31T21:41:39.090Z] line after include file
17:41:39 [2020-10-31T21:41:39.345Z] Result of testMethod = 5
17:41:39 [2020-10-31T21:41:39.345Z] End of script
17:41:39 [2020-10-31T21:41:39.345Z] Start of script
17:41:39 [2020-10-31T21:41:39.345Z] include file start
17:41:39 [2020-10-31T21:41:39.345Z] Include file processed
17:41:39 [2020-10-31T21:41:39.345Z] line after include file
17:41:39 [2020-10-31T21:41:39.345Z] Result of testMethod = 5
17:41:39 [2020-10-31T21:41:39.345Z] End of script
17:41:39 [2020-10-31T21:41:39.600Z] Start of script
17:41:39 [2020-10-31T21:41:39.600Z] include file start
17:41:39 [2020-10-31T21:41:39.600Z] Include file processed
17:41:39 [2020-10-31T21:41:39.600Z] line after include file
17:41:39 [2020-10-31T21:41:39.600Z] Result of testMethod = 5
17:41:39 [2020-10-31T21:41:39.856Z] Start of script
17:41:39 [2020-10-31T21:41:39.856Z] include file start
17:41:39 [2020-10-31T21:41:39.856Z] Include file processed
17:41:39 [2020-10-31T21:41:39.856Z] line after include file
17:41:40 [2020-10-31T21:41:40.111Z] Result of testMethod = 5
17:41:40 [2020-10-31T21:41:40.111Z] End of script
17:41:40 [2020-10-31T21:41:40.368Z] Start of script
17:41:40 [2020-10-31T21:41:40.368Z] include file start
17:41:40 [2020-10-31T21:41:40.368Z] Include file processed
17:41:40 [2020-10-31T21:41:40.368Z] line after include file
17:41:40 [2020-10-31T21:41:40.368Z] Result of testMethod = 5
17:41:40 [2020-10-31T21:41:40.368Z] End of script
17:41:40 [2020-10-31T21:41:40.368Z] Start of script
17:41:40 [2020-10-31T21:41:40.368Z] include file start
17:41:40 [2020-10-31T21:41:40.368Z] Include file processed
17:41:40 [2020-10-31T21:41:40.368Z] line after include file
17:41:40 [2020-10-31T21:41:40.623Z] Result of testMethod = 5
17:41:40 [2020-10-31T21:41:40.623Z] End of script
17:41:40 [2020-10-31T21:41:40.879Z] Start of script
17:41:40 [2020-10-31T21:41:40.879Z] include file start
17:41:40 [2020-10-31T21:41:40.879Z] Include file processed
17:41:40 [2020-10-31T21:41:40.879Z] line after include file
17:41:40 [2020-10-31T21:41:40.879Z] Result of testMethod = 5
17:41:41 [2020-10-31T21:41:41.134Z] Start of script
17:41:41 [2020-10-31T21:41:41.134Z] include file start
17:41:41 [2020-10-31T21:41:41.134Z] Include file processed
17:41:41 [2020-10-31T21:41:41.134Z] line after include file
17:41:41 [2020-10-31T21:41:41.390Z] Result of testMethod = 5
17:41:41 [2020-10-31T21:41:41.390Z] End of script
17:41:41 [2020-10-31T21:41:41.390Z] Start of script
17:41:41 [2020-10-31T21:41:41.390Z] include file start
17:41:41 [2020-10-31T21:41:41.390Z] Include file processed
17:41:41 [2020-10-31T21:41:41.390Z] line after include file
17:41:41 [2020-10-31T21:41:41.390Z] Result of testMethod = 5
17:41:41 [2020-10-31T21:41:41.390Z] End of script
17:41:41 [2020-10-31T21:41:41.645Z] Start of script
17:41:41 [2020-10-31T21:41:41.645Z] include file start
17:41:41 [2020-10-31T21:41:41.645Z] Include file processed
17:41:41 [2020-10-31T21:41:41.645Z] line after include file
17:41:41 [2020-10-31T21:41:41.901Z] Start of script
17:41:41 [2020-10-31T21:41:41.901Z] include file start
17:41:42 [2020-10-31T21:41:42.157Z] Include file processed
17:41:42 [2020-10-31T21:41:42.157Z] line after include file
17:41:42 [2020-10-31T21:41:42.157Z] Result of testMethod = 5
17:41:42 [2020-10-31T21:41:42.157Z] End of script
17:41:42 [2020-10-31T21:41:42.157Z] Start of script
17:41:42 [2020-10-31T21:41:42.157Z] include file start
17:41:42 [2020-10-31T21:41:42.157Z] Include file processed
17:41:42 [2020-10-31T21:41:42.157Z] line after include file
17:41:42 [2020-10-31T21:41:42.412Z] Result of testMethod = 5
17:41:42 [2020-10-31T21:41:42.412Z] End of script
17:41:42 [2020-10-31T21:41:42.667Z] Start of script
17:41:42 [2020-10-31T21:41:42.923Z] include file start
17:41:42 [2020-10-31T21:41:42.923Z] Include file processed
17:41:42 [2020-10-31T21:41:42.923Z] line after include file
17:41:42 [2020-10-31T21:41:42.923Z] Result of testMethod = 5
17:41:42 [2020-10-31T21:41:42.923Z] End of script
17:41:42 [2020-10-31T21:41:42.923Z] Start of script
17:41:42 [2020-10-31T21:41:42.923Z] include file start
17:41:42 [2020-10-31T21:41:42.923Z] Include file processed
17:41:42 [2020-10-31T21:41:42.923Z] line after include file
17:41:43 [2020-10-31T21:41:43.179Z] Result of testMethod = 5
17:41:43 [2020-10-31T21:41:43.179Z] End of script
17:41:43 [2020-10-31T21:41:43.179Z] Start of script
17:41:43 [2020-10-31T21:41:43.179Z] include file start
17:41:43 [2020-10-31T21:41:43.179Z] Include file processed
17:41:43 [2020-10-31T21:41:43.179Z] line after include file
17:41:43 [2020-10-31T21:41:43.179Z] Result of testMethod = 5
17:41:43 [2020-10-31T21:41:43.434Z] Start of script
17:41:43 [2020-10-31T21:41:43.434Z] include file start
17:41:43 [2020-10-31T21:41:43.434Z] Include file processed
17:41:43 [2020-10-31T21:41:43.434Z] line after include file
17:41:43 [2020-10-31T21:41:43.690Z] Result of testMethod = 5
17:41:43 [2020-10-31T21:41:43.690Z] End of script
17:41:43 [2020-10-31T21:41:43.945Z] Start of script
17:41:43 [2020-10-31T21:41:43.945Z] include file start
17:41:43 [2020-10-31T21:41:43.945Z] Include file processed
17:41:43 [2020-10-31T21:41:43.945Z] line after include file
17:41:43 [2020-10-31T21:41:43.945Z] Result of testMethod = 5
17:41:44 [2020-10-31T21:41:44.201Z] End of script
17:41:44 [2020-10-31T21:41:44.201Z] Start of script
17:41:44 [2020-10-31T21:41:44.201Z] include file start
17:41:44 [2020-10-31T21:41:44.201Z] Include file processed
17:41:44 [2020-10-31T21:41:44.201Z] line after include file
17:41:44 [2020-10-31T21:41:44.456Z] Result of testMethod = 5
17:41:44 [2020-10-31T21:41:44.456Z] End of script
17:41:44 [2020-10-31T21:41:44.711Z] Start of script
17:41:44 [2020-10-31T21:41:44.711Z] include file start
17:41:44 [2020-10-31T21:41:44.711Z] Include file processed
17:41:44 [2020-10-31T21:41:44.711Z] line after include file
17:41:44 [2020-10-31T21:41:44.968Z] Result of testMethod = 5
17:41:44 [2020-10-31T21:41:44.968Z] End of script
17:41:44 [2020-10-31T21:41:44.968Z] Start of script
17:41:44 [2020-10-31T21:41:44.968Z] include file start
17:41:44 [2020-10-31T21:41:44.968Z] Include file processed
17:41:44 [2020-10-31T21:41:44.968Z] line after include file
17:41:44 [2020-10-31T21:41:44.968Z] Result of testMethod = 5
17:41:45 [2020-10-31T21:41:45.529Z] Start of script
17:41:45 [2020-10-31T21:41:45.529Z] include file start
17:41:45 [2020-10-31T21:41:45.529Z] Include file processed
17:41:45 [2020-10-31T21:41:45.529Z] line after include file
17:41:45 [2020-10-31T21:41:45.529Z] Result of testMethod = 5
17:41:45 [2020-10-31T21:41:45.529Z] End of script
17:41:45 [2020-10-31T21:41:45.529Z] Start of script
17:41:45 [2020-10-31T21:41:45.529Z] include file start
17:41:45 [2020-10-31T21:41:45.529Z] Include file processed
17:41:45 [2020-10-31T21:41:45.529Z] line after include file
17:41:45 [2020-10-31T21:41:45.784Z] Result of testMethod = 5
17:41:45 [2020-10-31T21:41:45.784Z] End of script
17:41:45 [2020-10-31T21:41:45.784Z] Start of script
17:41:45 [2020-10-31T21:41:45.784Z] include file start
17:41:45 [2020-10-31T21:41:45.784Z] Include file processed
17:41:45 [2020-10-31T21:41:45.784Z] line after include file
17:41:45 [2020-10-31T21:41:45.784Z] Result of testMethod = 5
17:41:45 [2020-10-31T21:41:45.784Z] End of script
17:41:46 [2020-10-31T21:41:46.040Z] Start of script
17:41:46 [2020-10-31T21:41:46.040Z] include file start
17:41:46 [2020-10-31T21:41:46.040Z] Include file processed
17:41:46 [2020-10-31T21:41:46.295Z] line after include file
17:41:46 [2020-10-31T21:41:46.295Z] Result of testMethod = 5
17:41:46 [2020-10-31T21:41:46.295Z] End of script
17:41:46 [2020-10-31T21:41:46.295Z] Start of script
17:41:46 [2020-10-31T21:41:46.295Z] include file start
17:41:46 [2020-10-31T21:41:46.295Z] Include file processed
17:41:46 [2020-10-31T21:41:46.295Z] line after include file
17:41:46 [2020-10-31T21:41:46.551Z] Start of script
17:41:46 [2020-10-31T21:41:46.807Z] include file start
17:41:46 [2020-10-31T21:41:46.807Z] Include file processed
17:41:46 [2020-10-31T21:41:46.807Z] line after include file
17:41:46 [2020-10-31T21:41:46.807Z] Result of testMethod = 5
17:41:46 [2020-10-31T21:41:46.807Z] End of script
17:41:46 [2020-10-31T21:41:46.807Z] Start of script
17:41:46 [2020-10-31T21:41:46.807Z] include file start
17:41:46 [2020-10-31T21:41:46.807Z] Include file processed
17:41:46 [2020-10-31T21:41:46.807Z] line after include file
17:41:46 [2020-10-31T21:41:46.807Z] Result of testMethod = 5
17:41:47 [2020-10-31T21:41:47.392Z] Start of script
17:41:47 [2020-10-31T21:41:47.392Z] include file start
17:41:47 [2020-10-31T21:41:47.392Z] Include file processed
17:41:47 [2020-10-31T21:41:47.392Z] line after include file
17:41:47 [2020-10-31T21:41:47.392Z] Result of testMethod = 5
17:41:47 [2020-10-31T21:41:47.392Z] End of script
17:41:47 [2020-10-31T21:41:47.392Z] Start of script
17:41:47 [2020-10-31T21:41:47.392Z] include file start
17:41:47 [2020-10-31T21:41:47.392Z] Include file processed
17:41:47 [2020-10-31T21:41:47.392Z] line after include file
17:41:47 [2020-10-31T21:41:47.648Z] Result of testMethod = 5
17:41:47 [2020-10-31T21:41:47.648Z] End of script
17:41:47 [2020-10-31T21:41:47.648Z] Start of script
17:41:47 [2020-10-31T21:41:47.648Z] include file start
17:41:47 [2020-10-31T21:41:47.648Z] Include file processed
17:41:47 [2020-10-31T21:41:47.648Z] line after include file
17:41:47 [2020-10-31T21:41:47.904Z] Result of testMethod = 5
17:41:47 [2020-10-31T21:41:47.904Z] End of script
17:41:48 [2020-10-31T21:41:48.160Z] Start of script
17:41:48 [2020-10-31T21:41:48.160Z] include file start
17:41:48 [2020-10-31T21:41:48.160Z] Include file processed
17:41:48 [2020-10-31T21:41:48.160Z] line after include file
17:41:48 [2020-10-31T21:41:48.160Z] Result of testMethod = 5
17:41:48 [2020-10-31T21:41:48.160Z] End of script
17:41:48 [2020-10-31T21:41:48.160Z] Start of script
17:41:48 [2020-10-31T21:41:48.160Z] include file start
17:41:48 [2020-10-31T21:41:48.160Z] Include file processed
17:41:48 [2020-10-31T21:41:48.160Z] line after include file
17:41:48 [2020-10-31T21:41:48.160Z] Result of testMethod = 5
17:41:48 [2020-10-31T21:41:48.722Z] Start of script
17:41:48 [2020-10-31T21:41:48.722Z] include file start
17:41:48 [2020-10-31T21:41:48.722Z] Include file processed
17:41:48 [2020-10-31T21:41:48.722Z] line after include file
17:41:48 [2020-10-31T21:41:48.722Z] Result of testMethod = 5
17:41:48 [2020-10-31T21:41:48.722Z] End of script
17:41:48 [2020-10-31T21:41:48.722Z] Start of script
17:41:48 [2020-10-31T21:41:48.722Z] include file start
17:41:48 [2020-10-31T21:41:48.722Z] Include file processed
17:41:48 [2020-10-31T21:41:48.722Z] line after include file
17:41:48 [2020-10-31T21:41:48.722Z] Result of testMethod = 5
17:41:49 [2020-10-31T21:41:49.285Z] Start of script
17:41:49 [2020-10-31T21:41:49.285Z] include file start
17:41:49 [2020-10-31T21:41:49.285Z] Include file processed
17:41:49 [2020-10-31T21:41:49.285Z] line after include file
17:41:49 [2020-10-31T21:41:49.285Z] Result of testMethod = 5
17:41:49 [2020-10-31T21:41:49.285Z] End of script
17:41:49 [2020-10-31T21:41:49.542Z] Start of script
17:41:49 [2020-10-31T21:41:49.542Z] include file start
17:41:49 [2020-10-31T21:41:49.542Z] Include file processed
17:41:49 [2020-10-31T21:41:49.542Z] line after include file
17:41:49 [2020-10-31T21:41:49.798Z] Result of testMethod = 5
17:41:49 [2020-10-31T21:41:49.798Z] End of script
17:41:49 [2020-10-31T21:41:49.798Z] Start of script
17:41:49 [2020-10-31T21:41:49.798Z] include file start
17:41:49 [2020-10-31T21:41:49.798Z] Include file processed
17:41:49 [2020-10-31T21:41:49.798Z] line after include file
17:41:49 [2020-10-31T21:41:49.798Z] Result of testMethod = 5
17:41:49 [2020-10-31T21:41:49.798Z] End of script
17:41:50 [2020-10-31T21:41:50.081Z] Tests run: 42, Failures: 0, Errors: 0, Skipped: 0, Time elapsed: 10.961 s - in org.eclipse.ease.lang.javascript.rhino.RhinoDebugTest
17:41:50 [2020-10-31T21:41:50.081Z] disconnectProcessInSuspendedState(org.eclipse.ease.lang.javascript.rhino.RhinoDebugTest)  Time elapsed: 0.29 s
17:41:50 [2020-10-31T21:41:50.081Z] stepReturnIncludeCommand(org.eclipse.ease.lang.javascript.rhino.RhinoDebugTest)  Time elapsed: 0.209 s
17:41:50 [2020-10-31T21:41:50.081Z] arrayVariableSorting(org.eclipse.ease.lang.javascript.rhino.RhinoDebugTest)  Time elapsed: 0.309 s
17:41:50 [2020-10-31T21:41:50.081Z] stepOverOnDebugTarget(org.eclipse.ease.lang.javascript.rhino.RhinoDebugTest)  Time elapsed: 0.31 s
17:41:50 [2020-10-31T21:41:50.081Z] hasDebugTarget(org.eclipse.ease.lang.javascript.rhino.RhinoDebugTest)  Time elapsed: 0.105 s
17:41:50 [2020-10-31T21:41:50.081Z] disconnectThreadInSuspendedState(org.eclipse.ease.lang.javascript.rhino.RhinoDebugTest)  Time elapsed: 0.208 s
17:41:50 [2020-10-31T21:41:50.081Z] stepReturnOnDebugTarget(org.eclipse.ease.lang.javascript.rhino.RhinoDebugTest)  Time elapsed: 0.308 s
17:41:50 [2020-10-31T21:41:50.081Z] nullVariable(org.eclipse.ease.lang.javascript.rhino.RhinoDebugTest)  Time elapsed: 0.307 s
17:41:50 [2020-10-31T21:41:50.081Z] stepOverOnStackFrame(org.eclipse.ease.lang.javascript.rhino.RhinoDebugTest)  Time elapsed: 0.308 s
17:41:50 [2020-10-31T21:41:50.081Z] resumeOnDebugTarget(org.eclipse.ease.lang.javascript.rhino.RhinoDebugTest)  Time elapsed: 0.206 s
17:41:50 [2020-10-31T21:41:50.081Z] modifyVariableKeepingType(org.eclipse.ease.lang.javascript.rhino.RhinoDebugTest)  Time elapsed: 0.406 s
17:41:50 [2020-10-31T21:41:50.081Z] resumeOnLastIncludeLine(org.eclipse.ease.lang.javascript.rhino.RhinoDebugTest)  Time elapsed: 0.208 s
17:41:50 [2020-10-31T21:41:50.081Z] stepReturnOnStackFrame(org.eclipse.ease.lang.javascript.rhino.RhinoDebugTest)  Time elapsed: 0.309 s
17:41:50 [2020-10-31T21:41:50.081Z] terminateStackFrameInSuspendedState(org.eclipse.ease.lang.javascript.rhino.RhinoDebugTest)  Time elapsed: 0.207 s
17:41:50 [2020-10-31T21:41:50.081Z] breakpointLocation(org.eclipse.ease.lang.javascript.rhino.RhinoDebugTest)  Time elapsed: 0.208 s
17:41:50 [2020-10-31T21:41:50.081Z] stepReturnOnThread(org.eclipse.ease.lang.javascript.rhino.RhinoDebugTest)  Time elapsed: 0.308 s
17:41:50 [2020-10-31T21:41:50.081Z] javaClassVariable(org.eclipse.ease.lang.javascript.rhino.RhinoDebugTest)  Time elapsed: 0.308 s
17:41:50 [2020-10-31T21:41:50.081Z] stepIntoOnThread(org.eclipse.ease.lang.javascript.rhino.RhinoDebugTest)  Time elapsed: 0.307 s
17:41:50 [2020-10-31T21:41:50.081Z] terminateThreadInSuspendedState(org.eclipse.ease.lang.javascript.rhino.RhinoDebugTest)  Time elapsed: 0.206 s
17:41:50 [2020-10-31T21:41:50.081Z] resumeOnThread(org.eclipse.ease.lang.javascript.rhino.RhinoDebugTest)  Time elapsed: 0.205 s
17:41:50 [2020-10-31T21:41:50.081Z] stepIntoOnStackFrame(org.eclipse.ease.lang.javascript.rhino.RhinoDebugTest)  Time elapsed: 0.307 s
17:41:50 [2020-10-31T21:41:50.081Z] terminateProcessInSuspendedState(org.eclipse.ease.lang.javascript.rhino.RhinoDebugTest)  Time elapsed: 0.205 s
17:41:50 [2020-10-31T21:41:50.081Z] stepOverOnProcess(org.eclipse.ease.lang.javascript.rhino.RhinoDebugTest)  Time elapsed: 0.307 s
17:41:50 [2020-10-31T21:41:50.081Z] nativeArrayVariable(org.eclipse.ease.lang.javascript.rhino.RhinoDebugTest)  Time elapsed: 0.306 s
17:41:50 [2020-10-31T21:41:50.081Z] disconnectDebugTargetInSuspendedState(org.eclipse.ease.lang.javascript.rhino.RhinoDebugTest)  Time elapsed: 0.206 s
17:41:50 [2020-10-31T21:41:50.081Z] stepIntoOnProcess(org.eclipse.ease.lang.javascript.rhino.RhinoDebugTest)  Time elapsed: 0.306 s
17:41:50 [2020-10-31T21:41:50.081Z] terminatedState(org.eclipse.ease.lang.javascript.rhino.RhinoDebugTest)  Time elapsed: 0.104 s
17:41:50 [2020-10-31T21:41:50.081Z] stepOverIncludeCommand(org.eclipse.ease.lang.javascript.rhino.RhinoDebugTest)  Time elapsed: 0.304 s
17:41:50 [2020-10-31T21:41:50.081Z] innerScopeVariableBeforeOuterScopeVariable(org.eclipse.ease.lang.javascript.rhino.RhinoDebugTest)  Time elapsed: 0.306 s
17:41:50 [2020-10-31T21:41:50.081Z] stepIntoIncludeCommand(org.eclipse.ease.lang.javascript.rhino.RhinoDebugTest)  Time elapsed: 0.305 s
17:41:50 [2020-10-31T21:41:50.081Z] primitiveStringVariable(org.eclipse.ease.lang.javascript.rhino.RhinoDebugTest)  Time elapsed: 0.306 s
17:41:50 [2020-10-31T21:41:50.081Z] resumeOnProcess(org.eclipse.ease.lang.javascript.rhino.RhinoDebugTest)  Time elapsed: 0.206 s
17:41:50 [2020-10-31T21:41:50.081Z] stepIntoOnDebugTarget(org.eclipse.ease.lang.javascript.rhino.RhinoDebugTest)  Time elapsed: 0.305 s
17:41:50 [2020-10-31T21:41:50.081Z] stepOverOnThread(org.eclipse.ease.lang.javascript.rhino.RhinoDebugTest)  Time elapsed: 0.305 s
17:41:50 [2020-10-31T21:41:50.081Z] suspendedState(org.eclipse.ease.lang.javascript.rhino.RhinoDebugTest)  Time elapsed: 0.205 s
17:41:50 [2020-10-31T21:41:50.081Z] primitiveDoubleVariable(org.eclipse.ease.lang.javascript.rhino.RhinoDebugTest)  Time elapsed: 0.305 s
17:41:50 [2020-10-31T21:41:50.081Z] resumeOnStackFrame(org.eclipse.ease.lang.javascript.rhino.RhinoDebugTest)  Time elapsed: 0.205 s
17:41:50 [2020-10-31T21:41:50.081Z] nativeObjectVariable(org.eclipse.ease.lang.javascript.rhino.RhinoDebugTest)  Time elapsed: 0.306 s
17:41:50 [2020-10-31T21:41:50.081Z] terminateDebugTargetInSuspendedState(org.eclipse.ease.lang.javascript.rhino.RhinoDebugTest)  Time elapsed: 0.205 s
17:41:50 [2020-10-31T21:41:50.081Z] disconnectStackFrameInSuspendedState(org.eclipse.ease.lang.javascript.rhino.RhinoDebugTest)  Time elapsed: 0.205 s
17:41:50 [2020-10-31T21:41:50.081Z] stepReturnOnProcess(org.eclipse.ease.lang.javascript.rhino.RhinoDebugTest)  Time elapsed: 0.306 s
17:41:50 [2020-10-31T21:41:50.081Z] evaluateWatchExpression(org.eclipse.ease.lang.javascript.rhino.RhinoDebugTest)  Time elapsed: 0.207 s
17:41:50 [2020-10-31T21:41:50.081Z] Running org.eclipse.ease.lang.javascript.rhino.RhinoEnvironmentTest
17:41:50 [2020-10-31T21:41:50.081Z] Tests run: 5, Failures: 0, Errors: 0, Skipped: 0, Time elapsed: 0.115 s - in org.eclipse.ease.lang.javascript.rhino.RhinoEnvironmentTest
17:41:50 [2020-10-31T21:41:50.081Z] reloadEnvironment(org.eclipse.ease.lang.javascript.rhino.RhinoEnvironmentTest)  Time elapsed: 0.031 s
17:41:50 [2020-10-31T21:41:50.082Z] bootstrappedEnvironment(org.eclipse.ease.lang.javascript.rhino.RhinoEnvironmentTest)  Time elapsed: 0.009 s
17:41:50 [2020-10-31T21:41:50.082Z] postMethodCallback(org.eclipse.ease.lang.javascript.rhino.RhinoEnvironmentTest)  Time elapsed: 0.019 s
17:41:50 [2020-10-31T21:41:50.082Z] preMethodCallback(org.eclipse.ease.lang.javascript.rhino.RhinoEnvironmentTest)  Time elapsed: 0.011 s
17:41:50 [2020-10-31T21:41:50.082Z] reloadFunctionDefinitions(org.eclipse.ease.lang.javascript.rhino.RhinoEnvironmentTest)  Time elapsed: 0.044 s
17:41:50 [2020-10-31T21:41:50.082Z] Running org.eclipse.ease.lang.javascript.rhino.RhinoScriptEngineTest
17:41:50 [2020-10-31T21:41:50.082Z] org.eclipse.ease.ScriptExecutionException: JavaError: NotThere cannot be found by org.mozilla.javascript_1.7.5.v201504281450
17:41:50 [2020-10-31T21:41:50.082Z] 	at <unknown source>
17:41:50 [2020-10-31T21:41:50.082Z] 
17:41:50 [2020-10-31T21:41:50.082Z] Java Stacktrace:
17:41:50 [2020-10-31T21:41:50.082Z] java.lang.ClassNotFoundException: NotThere cannot be found by org.mozilla.javascript_1.7.5.v201504281450
17:41:50 [2020-10-31T21:41:50.082Z] 	at org.eclipse.osgi.internal.loader.BundleLoader.findClassInternal(BundleLoader.java:511)
17:41:50 [2020-10-31T21:41:50.082Z] 	at org.eclipse.osgi.internal.loader.BundleLoader.findClass(BundleLoader.java:422)
17:41:50 [2020-10-31T21:41:50.082Z] 	at org.eclipse.osgi.internal.loader.BundleLoader.findClass(BundleLoader.java:414)
17:41:50 [2020-10-31T21:41:50.082Z] 	at org.eclipse.osgi.internal.loader.ModuleClassLoader.loadClass(ModuleClassLoader.java:153)
17:41:50 [2020-10-31T21:41:50.082Z] 	at java.base/java.lang.ClassLoader.loadClass(ClassLoader.java:521)
17:41:50 [2020-10-31T21:41:50.082Z] 	at java.base/java.lang.Class.forName0(Native Method)
17:41:50 [2020-10-31T21:41:50.082Z] 	at java.base/java.lang.Class.forName(Class.java:315)
17:41:50 [2020-10-31T21:41:50.082Z] 	at java.base/jdk.internal.reflect.NativeMethodAccessorImpl.invoke0(Native Method)
17:41:50 [2020-10-31T21:41:50.082Z] 	at java.base/jdk.internal.reflect.NativeMethodAccessorImpl.invoke(NativeMethodAccessorImpl.java:62)
17:41:50 [2020-10-31T21:41:50.082Z] 	at java.base/jdk.internal.reflect.DelegatingMethodAccessorImpl.invoke(DelegatingMethodAccessorImpl.java:43)
17:41:50 [2020-10-31T21:41:50.082Z] 	at java.base/java.lang.reflect.Method.invoke(Method.java:566)
17:41:50 [2020-10-31T21:41:50.082Z] 	at org.mozilla.javascript.MemberBox.invoke(MemberBox.java:126)
17:41:50 [2020-10-31T21:41:50.082Z] 	at org.mozilla.javascript.NativeJavaMethod.call(NativeJavaMethod.java:225)
17:41:50 [2020-10-31T21:41:50.082Z] 	at org.mozilla.javascript.optimizer.OptRuntime.call1(OptRuntime.java:32)
17:41:50 [2020-10-31T21:41:50.082Z] 	at org.mozilla.javascript.gen.c_27._c_script_0(Unknown Source)
17:41:50 [2020-10-31T21:41:50.082Z] 	at org.mozilla.javascript.gen.c_27.call(Unknown Source)
17:41:50 [2020-10-31T21:41:50.082Z] 	at org.mozilla.javascript.ContextFactory.doTopCall(ContextFactory.java:394)
17:41:50 [2020-10-31T21:41:50.082Z] 	at org.mozilla.javascript.ScriptRuntime.doTopCall(ScriptRuntime.java:3091)
17:41:50 [2020-10-31T21:41:50.082Z] 	at org.mozilla.javascript.gen.c_27.call(Unknown Source)
17:41:50 [2020-10-31T21:41:50.082Z] 	at org.mozilla.javascript.gen.c_27.exec(Unknown Source)
17:41:50 [2020-10-31T21:41:50.082Z] 	at org.mozilla.javascript.Context.evaluateReader(Context.java:1110)
17:41:50 [2020-10-31T21:41:50.082Z] 	at org.eclipse.ease.lang.javascript.rhino.RhinoScriptEngine.internalExecute(RhinoScriptEngine.java:222)
17:41:50 [2020-10-31T21:41:50.082Z] 	at org.eclipse.ease.lang.javascript.rhino.RhinoScriptEngine.execute(RhinoScriptEngine.java:201)
17:41:50 [2020-10-31T21:41:50.082Z] 	at org.eclipse.ease.AbstractScriptEngine.inject(AbstractScriptEngine.java:224)
17:41:50 [2020-10-31T21:41:50.082Z] 	at org.eclipse.ease.AbstractScriptEngine.run(AbstractScriptEngine.java:274)
17:41:50 [2020-10-31T21:41:50.082Z] 	at org.eclipse.core.internal.jobs.Worker.run(Worker.java:63)
17:41:50 [2020-10-31T21:41:50.082Z] org.eclipse.ease.ScriptExecutionException: TypeError: Cannot call method "foobar" of undefined
17:41:50 [2020-10-31T21:41:50.082Z] 	at <unknown source>
17:41:50 [2020-10-31T21:41:50.082Z] org.eclipse.ease.ScriptExecutionException: ScriptException: test
17:41:50 [2020-10-31T21:41:50.082Z] 	at <unknown source>
17:41:50 [2020-10-31T21:41:50.082Z] org.eclipse.ease.ScriptExecutionException: JavaError: java.lang.Exception
17:41:50 [2020-10-31T21:41:50.082Z] 	at <unknown source>
17:41:50 [2020-10-31T21:41:50.082Z] 
17:41:50 [2020-10-31T21:41:50.082Z] Java Stacktrace:
17:41:50 [2020-10-31T21:41:50.082Z] java.lang.Exception
17:41:50 [2020-10-31T21:41:50.082Z] 	at java.base/jdk.internal.reflect.NativeConstructorAccessorImpl.newInstance0(Native Method)
17:41:50 [2020-10-31T21:41:50.082Z] 	at java.base/jdk.internal.reflect.NativeConstructorAccessorImpl.newInstance(NativeConstructorAccessorImpl.java:62)
17:41:50 [2020-10-31T21:41:50.082Z] 	at java.base/jdk.internal.reflect.DelegatingConstructorAccessorImpl.newInstance(DelegatingConstructorAccessorImpl.java:45)
17:41:50 [2020-10-31T21:41:50.082Z] 	at java.base/java.lang.reflect.Constructor.newInstance(Constructor.java:490)
17:41:50 [2020-10-31T21:41:50.082Z] 	at org.mozilla.javascript.MemberBox.newInstance(MemberBox.java:159)
17:41:50 [2020-10-31T21:41:50.082Z] 	at org.mozilla.javascript.NativeJavaClass.constructInternal(NativeJavaClass.java:266)
17:41:50 [2020-10-31T21:41:50.082Z] 	at org.mozilla.javascript.NativeJavaClass.constructSpecific(NativeJavaClass.java:205)
17:41:50 [2020-10-31T21:41:50.082Z] 	at org.mozilla.javascript.NativeJavaClass.construct(NativeJavaClass.java:166)
17:41:50 [2020-10-31T21:41:50.082Z] 	at org.mozilla.javascript.ScriptRuntime.newObject(ScriptRuntime.java:2349)
17:41:50 [2020-10-31T21:41:50.082Z] 	at org.mozilla.javascript.gen.c_45._c_script_0(Unknown Source)
17:41:50 [2020-10-31T21:41:50.082Z] 	at org.mozilla.javascript.gen.c_45.call(Unknown Source)
17:41:50 [2020-10-31T21:41:50.082Z] 	at org.mozilla.javascript.ContextFactory.doTopCall(ContextFactory.java:394)
17:41:50 [2020-10-31T21:41:50.082Z] 	at org.mozilla.javascript.ScriptRuntime.doTopCall(ScriptRuntime.java:3091)
17:41:50 [2020-10-31T21:41:50.082Z] 	at org.mozilla.javascript.gen.c_45.call(Unknown Source)
17:41:50 [2020-10-31T21:41:50.082Z] 	at org.mozilla.javascript.gen.c_45.exec(Unknown Source)
17:41:50 [2020-10-31T21:41:50.082Z] 	at org.mozilla.javascript.Context.evaluateReader(Context.java:1110)
17:41:50 [2020-10-31T21:41:50.082Z] 	at org.eclipse.ease.lang.javascript.rhino.RhinoScriptEngine.internalExecute(RhinoScriptEngine.java:222)
17:41:50 [2020-10-31T21:41:50.082Z] 	at org.eclipse.ease.lang.javascript.rhino.RhinoScriptEngine.execute(RhinoScriptEngine.java:201)
17:41:50 [2020-10-31T21:41:50.082Z] 	at org.eclipse.ease.AbstractScriptEngine.inject(AbstractScriptEngine.java:224)
17:41:50 [2020-10-31T21:41:50.082Z] 	at org.eclipse.ease.AbstractScriptEngine.run(AbstractScriptEngine.java:274)
17:41:50 [2020-10-31T21:41:50.082Z] 	at org.eclipse.core.internal.jobs.Worker.run(Worker.java:63)
17:41:50 [2020-10-31T21:41:50.338Z] org.eclipse.ease.ScriptExecutionException: ScriptException: JavaScript
17:41:50 [2020-10-31T21:41:50.338Z] 	at <unknown source>
17:41:50 [2020-10-31T21:41:50.338Z] org.eclipse.ease.ScriptExecutionException: SyntaxError: unterminated string literal (#1)
17:41:50 [2020-10-31T21:41:50.338Z] 'asdf
17:41:50 [2020-10-31T21:41:50.338Z]     ^
17:41:50 [2020-10-31T21:41:50.338Z] 	at <unknown source>
17:41:50 [2020-10-31T21:41:50.338Z] Tests run: 11, Failures: 0, Errors: 0, Skipped: 0, Time elapsed: 0.109 s - in org.eclipse.ease.lang.javascript.rhino.RhinoScriptEngineTest
17:41:50 [2020-10-31T21:41:50.338Z] causeWrappedException(org.eclipse.ease.lang.javascript.rhino.RhinoScriptEngineTest)  Time elapsed: 0.008 s
17:41:50 [2020-10-31T21:41:50.338Z] optionalModuleParameters(org.eclipse.ease.lang.javascript.rhino.RhinoScriptEngineTest)  Time elapsed: 0.008 s
17:41:50 [2020-10-31T21:41:50.338Z] simpleScriptCode(org.eclipse.ease.lang.javascript.rhino.RhinoScriptEngineTest)  Time elapsed: 0.006 s
17:41:50 [2020-10-31T21:41:50.338Z] causeRuntimeErrorException(org.eclipse.ease.lang.javascript.rhino.RhinoScriptEngineTest)  Time elapsed: 0.007 s
17:41:50 [2020-10-31T21:41:50.338Z] callModuleCode(org.eclipse.ease.lang.javascript.rhino.RhinoScriptEngineTest)  Time elapsed: 0.007 s
17:41:50 [2020-10-31T21:41:50.338Z] throwJavaClass(org.eclipse.ease.lang.javascript.rhino.RhinoScriptEngineTest)  Time elapsed: 0.009 s
17:41:50 [2020-10-31T21:41:50.338Z] throwJavaException(org.eclipse.ease.lang.javascript.rhino.RhinoScriptEngineTest)  Time elapsed: 0.007 s
17:41:50 [2020-10-31T21:41:50.338Z] accessJavaClasses(org.eclipse.ease.lang.javascript.rhino.RhinoScriptEngineTest)  Time elapsed: 0.007 s
17:41:50 [2020-10-31T21:41:50.338Z] accessEclipseClasses(org.eclipse.ease.lang.javascript.rhino.RhinoScriptEngineTest)  Time elapsed: 0.007 s
17:41:50 [2020-10-31T21:41:50.338Z] throwJavaScriptException(org.eclipse.ease.lang.javascript.rhino.RhinoScriptEngineTest)  Time elapsed: 0.033 s
17:41:50 [2020-10-31T21:41:50.338Z] causeSyntaxErrorException(org.eclipse.ease.lang.javascript.rhino.RhinoScriptEngineTest)  Time elapsed: 0.007 s
17:41:50 [2020-10-31T21:41:50.338Z] 
17:41:50 [2020-10-31T21:41:50.338Z] Results:
17:41:50 [2020-10-31T21:41:50.338Z] 
17:41:50 [2020-10-31T21:41:50.338Z] Tests run: 70, Failures: 0, Errors: 0, Skipped: 0
17:41:50 [2020-10-31T21:41:50.338Z] 
17:41:50 [2020-10-31T21:41:50.593Z] [INFO] All tests passed!
17:41:50 [2020-10-31T21:41:50.593Z] [INFO] 
17:41:50 [2020-10-31T21:41:50.593Z] [INFO] -------< org.eclipse.ease:org.eclipse.ease.lang.javascript.test >-------
17:41:50 [2020-10-31T21:41:50.593Z] [INFO] Building org.eclipse.ease.lang.javascript.test 0.8.0-SNAPSHOT     [6/11]
17:41:50 [2020-10-31T21:41:50.593Z] [INFO] ------------------------[ eclipse-test-plugin ]-------------------------
17:41:50 [2020-10-31T21:41:50.593Z] [INFO] 
17:41:50 [2020-10-31T21:41:50.593Z] [INFO] --- tycho-packaging-plugin:1.5.0:build-qualifier (default-build-qualifier) @ org.eclipse.ease.lang.javascript.test ---
17:41:50 [2020-10-31T21:41:50.593Z] [INFO] The project's OSGi version is 0.8.0.I201910171213
17:41:50 [2020-10-31T21:41:50.593Z] [INFO] 
17:41:50 [2020-10-31T21:41:50.593Z] [INFO] --- tycho-packaging-plugin:1.5.0:validate-id (default-validate-id) @ org.eclipse.ease.lang.javascript.test ---
17:41:50 [2020-10-31T21:41:50.593Z] [INFO] 
17:41:50 [2020-10-31T21:41:50.593Z] [INFO] --- tycho-packaging-plugin:1.5.0:validate-version (default-validate-version) @ org.eclipse.ease.lang.javascript.test ---
17:41:50 [2020-10-31T21:41:50.593Z] [INFO] 
17:41:50 [2020-10-31T21:41:50.593Z] [INFO] --- maven-resources-plugin:2.4.3:resources (default-resources) @ org.eclipse.ease.lang.javascript.test ---
17:41:50 [2020-10-31T21:41:50.593Z] [INFO] Using 'UTF-8' encoding to copy filtered resources.
17:41:50 [2020-10-31T21:41:50.593Z] [INFO] skip non existing resourceDirectory /home/jenkins/agent/workspace/ease.verify.core.target.2019-03/tests/org.eclipse.ease.lang.javascript.test/src/main/resources
17:41:50 [2020-10-31T21:41:50.593Z] [INFO] 
17:41:50 [2020-10-31T21:41:50.593Z] [INFO] --- tycho-compiler-plugin:1.5.0:compile (default-compile) @ org.eclipse.ease.lang.javascript.test ---
17:41:50 [2020-10-31T21:41:50.593Z] [INFO] Nothing to compile - all classes are up to date
17:41:50 [2020-10-31T21:41:50.593Z] [INFO] 
17:41:50 [2020-10-31T21:41:50.593Z] [INFO] --- maven-resources-plugin:2.4.3:testResources (default-testResources) @ org.eclipse.ease.lang.javascript.test ---
17:41:50 [2020-10-31T21:41:50.593Z] [INFO] Using 'UTF-8' encoding to copy filtered resources.
17:41:50 [2020-10-31T21:41:50.593Z] [INFO] skip non existing resourceDirectory /home/jenkins/agent/workspace/ease.verify.core.target.2019-03/tests/org.eclipse.ease.lang.javascript.test/src/test/resources
17:41:50 [2020-10-31T21:41:50.593Z] [INFO] 
17:41:50 [2020-10-31T21:41:50.594Z] [INFO] --- tycho-source-plugin:1.5.0:plugin-source (plugin-source) @ org.eclipse.ease.lang.javascript.test ---
17:41:50 [2020-10-31T21:41:50.594Z] [WARNING] Bundle-Vendor header not found in /home/jenkins/agent/workspace/ease.verify.core.target.2019-03/tests/org.eclipse.ease.lang.javascript.test/META-INF/MANIFEST.MF, fallback to 'unknown' for source bundle
17:41:50 [2020-10-31T21:41:50.594Z] [INFO] Building jar: /home/jenkins/agent/workspace/ease.verify.core.target.2019-03/tests/org.eclipse.ease.lang.javascript.test/target/org.eclipse.ease.lang.javascript.test-0.8.0-SNAPSHOT-sources.jar
17:41:50 [2020-10-31T21:41:50.594Z] [INFO] 
17:41:50 [2020-10-31T21:41:50.594Z] [INFO] --- target-platform-configuration:1.5.0:target-platform (default-target-platform) @ org.eclipse.ease.lang.javascript.test ---
17:41:50 [2020-10-31T21:41:50.594Z] [INFO] 
17:41:50 [2020-10-31T21:41:50.594Z] [INFO] --- tycho-packaging-plugin:1.5.0:package-plugin (default-package-plugin) @ org.eclipse.ease.lang.javascript.test ---
17:41:50 [2020-10-31T21:41:50.594Z] [INFO] Building jar: /home/jenkins/agent/workspace/ease.verify.core.target.2019-03/tests/org.eclipse.ease.lang.javascript.test/target/org.eclipse.ease.lang.javascript.test-0.8.0-SNAPSHOT.jar
17:41:50 [2020-10-31T21:41:50.594Z] [INFO] 
17:41:50 [2020-10-31T21:41:50.594Z] [INFO] --- tycho-p2-plugin:1.5.0:p2-metadata-default (default-p2-metadata-default) @ org.eclipse.ease.lang.javascript.test ---
17:41:50 [2020-10-31T21:41:50.594Z] [INFO] 
17:41:50 [2020-10-31T21:41:50.594Z] [INFO] --- tycho-source-feature-plugin:1.5.0:source-feature (source-feature) @ org.eclipse.ease.lang.javascript.test ---
17:41:50 [2020-10-31T21:41:50.594Z] [INFO] 
17:41:50 [2020-10-31T21:41:50.594Z] [INFO] --- tycho-p2-plugin:1.5.0:p2-metadata (attached-p2-metadata) @ org.eclipse.ease.lang.javascript.test ---
17:41:50 [2020-10-31T21:41:50.594Z] [INFO] 
17:41:50 [2020-10-31T21:41:50.594Z] [INFO] --- tycho-surefire-plugin:1.5.0:test (default-test) @ org.eclipse.ease.lang.javascript.test ---
17:41:50 [2020-10-31T21:41:50.849Z] [INFO] Expected eclipse log file: /home/jenkins/agent/workspace/ease.verify.core.target.2019-03/tests/org.eclipse.ease.lang.javascript.test/target/work/data/.metadata/.log
17:41:50 [2020-10-31T21:41:50.849Z] [INFO] Command line:
17:41:50 [2020-10-31T21:41:50.850Z] 	[/opt/tools/java/openjdk/jdk-11/11.0.2+9/bin/java, -Dosgi.noShutdown=false, -Dosgi.os=linux, -Dosgi.ws=gtk, -Dosgi.arch=x86_64, -Dosgi.clean=true, -jar, /home/jenkins/.m2/repository/p2/osgi/bundle/org.eclipse.equinox.launcher/1.5.300.v20190213-1655/org.eclipse.equinox.launcher-1.5.300.v20190213-1655.jar, -data, /home/jenkins/agent/workspace/ease.verify.core.target.2019-03/tests/org.eclipse.ease.lang.javascript.test/target/work/data, -install, /home/jenkins/agent/workspace/ease.verify.core.target.2019-03/tests/org.eclipse.ease.lang.javascript.test/target/work, -configuration, /home/jenkins/agent/workspace/ease.verify.core.target.2019-03/tests/org.eclipse.ease.lang.javascript.test/target/work/configuration, -application, org.eclipse.tycho.surefire.osgibooter.headlesstest, -testproperties, /home/jenkins/agent/workspace/ease.verify.core.target.2019-03/tests/org.eclipse.ease.lang.javascript.test/target/surefire.properties]
17:41:50 [2020-10-31T21:41:50.850Z] Picked up JAVA_TOOL_OPTIONS: -Dmaven.ext.class.path="/home/jenkins/agent/workspace/ease.verify.core.target.2019-03@tmp/withMaven4b016809/pipeline-maven-spy.jar" -Dorg.jenkinsci.plugins.pipeline.maven.reportsFolder="/home/jenkins/agent/workspace/ease.verify.core.target.2019-03@tmp/withMaven4b016809" 
17:41:52 [2020-10-31T21:41:52.741Z] Running org.eclipse.ease.lang.javascript.JavaScriptCodeFactoryTest
17:41:52 [2020-10-31T21:41:52.741Z] Tests run: 1, Failures: 0, Errors: 0, Skipped: 0, Time elapsed: 0.091 s - in org.eclipse.ease.lang.javascript.JavaScriptCodeFactoryTest
17:41:52 [2020-10-31T21:41:52.741Z] testCommentCreator(org.eclipse.ease.lang.javascript.JavaScriptCodeFactoryTest)  Time elapsed: 0.003 s
17:41:52 [2020-10-31T21:41:52.741Z] Running org.eclipse.ease.lang.javascript.JavaScriptCompletionContextTest
17:41:52 [2020-10-31T21:41:52.741Z] Tests run: 8, Failures: 0, Errors: 0, Skipped: 0, Time elapsed: 0.127 s - in org.eclipse.ease.lang.javascript.JavaScriptCompletionContextTest
17:41:52 [2020-10-31T21:41:52.742Z] verifyStaticClassTypes(org.eclipse.ease.lang.javascript.JavaScriptCompletionContextTest)  Time elapsed: 0.003 s
17:41:52 [2020-10-31T21:41:52.742Z] verifyClassInstanceTypes(org.eclipse.ease.lang.javascript.JavaScriptCompletionContextTest)  Time elapsed: 0.005 s
17:41:52 [2020-10-31T21:41:52.742Z] verifyTypesForScriptEngine(org.eclipse.ease.lang.javascript.JavaScriptCompletionContextTest)  Time elapsed: 0.114 s
17:41:52 [2020-10-31T21:41:52.742Z] verifyPackageTypes(org.eclipse.ease.lang.javascript.JavaScriptCompletionContextTest)  Time elapsed: 0.001 s
17:41:52 [2020-10-31T21:41:52.742Z] definedVariableTypes(org.eclipse.ease.lang.javascript.JavaScriptCompletionContextTest)  Time elapsed: 0 s
17:41:52 [2020-10-31T21:41:52.742Z] verifyStringLiteralTypes(org.eclipse.ease.lang.javascript.JavaScriptCompletionContextTest)  Time elapsed: 0.001 s
17:41:52 [2020-10-31T21:41:52.742Z] verifyUnknownTypes(org.eclipse.ease.lang.javascript.JavaScriptCompletionContextTest)  Time elapsed: 0 s
17:41:52 [2020-10-31T21:41:52.742Z] verifyNoneTypes(org.eclipse.ease.lang.javascript.JavaScriptCompletionContextTest)  Time elapsed: 0 s
17:41:52 [2020-10-31T21:41:52.742Z] 
17:41:52 [2020-10-31T21:41:52.742Z] Results:
17:41:52 [2020-10-31T21:41:52.742Z] 
17:41:52 [2020-10-31T21:41:52.742Z] Tests run: 9, Failures: 0, Errors: 0, Skipped: 0
17:41:52 [2020-10-31T21:41:52.742Z] 
17:41:52 [2020-10-31T21:41:52.997Z] [INFO] All tests passed!
17:41:52 [2020-10-31T21:41:52.998Z] [INFO] 
17:41:52 [2020-10-31T21:41:52.998Z] [INFO] ---------< org.eclipse.ease:org.eclipse.ease.lang.python.test >---------
17:41:52 [2020-10-31T21:41:52.998Z] [INFO] Building org.eclipse.ease.lang.python.test 0.8.0-SNAPSHOT         [7/11]
17:41:52 [2020-10-31T21:41:52.998Z] [INFO] ------------------------[ eclipse-test-plugin ]-------------------------
17:41:52 [2020-10-31T21:41:52.998Z] [INFO] 
17:41:52 [2020-10-31T21:41:52.998Z] [INFO] --- tycho-packaging-plugin:1.5.0:build-qualifier (default-build-qualifier) @ org.eclipse.ease.lang.python.test ---
17:41:52 [2020-10-31T21:41:52.998Z] [INFO] The project's OSGi version is 0.8.0.I201910171213
17:41:52 [2020-10-31T21:41:52.998Z] [INFO] 
17:41:52 [2020-10-31T21:41:52.998Z] [INFO] --- tycho-packaging-plugin:1.5.0:validate-id (default-validate-id) @ org.eclipse.ease.lang.python.test ---
17:41:52 [2020-10-31T21:41:52.998Z] [INFO] 
17:41:52 [2020-10-31T21:41:52.998Z] [INFO] --- tycho-packaging-plugin:1.5.0:validate-version (default-validate-version) @ org.eclipse.ease.lang.python.test ---
17:41:52 [2020-10-31T21:41:52.998Z] [INFO] 
17:41:52 [2020-10-31T21:41:52.998Z] [INFO] --- maven-resources-plugin:2.4.3:resources (default-resources) @ org.eclipse.ease.lang.python.test ---
17:41:52 [2020-10-31T21:41:52.998Z] [INFO] Using 'UTF-8' encoding to copy filtered resources.
17:41:52 [2020-10-31T21:41:52.998Z] [INFO] skip non existing resourceDirectory /home/jenkins/agent/workspace/ease.verify.core.target.2019-03/tests/org.eclipse.ease.lang.python.test/src/main/resources
17:41:52 [2020-10-31T21:41:52.998Z] [INFO] 
17:41:52 [2020-10-31T21:41:52.998Z] [INFO] --- tycho-compiler-plugin:1.5.0:compile (default-compile) @ org.eclipse.ease.lang.python.test ---
17:41:52 [2020-10-31T21:41:52.998Z] [INFO] Nothing to compile - all classes are up to date
17:41:52 [2020-10-31T21:41:52.998Z] [INFO] 
17:41:52 [2020-10-31T21:41:52.998Z] [INFO] --- maven-resources-plugin:2.4.3:testResources (default-testResources) @ org.eclipse.ease.lang.python.test ---
17:41:52 [2020-10-31T21:41:52.998Z] [INFO] Using 'UTF-8' encoding to copy filtered resources.
17:41:52 [2020-10-31T21:41:52.998Z] [INFO] skip non existing resourceDirectory /home/jenkins/agent/workspace/ease.verify.core.target.2019-03/tests/org.eclipse.ease.lang.python.test/src/test/resources
17:41:52 [2020-10-31T21:41:52.998Z] [INFO] 
17:41:52 [2020-10-31T21:41:52.998Z] [INFO] --- tycho-source-plugin:1.5.0:plugin-source (plugin-source) @ org.eclipse.ease.lang.python.test ---
17:41:52 [2020-10-31T21:41:52.998Z] [WARNING] Bundle-Vendor header not found in /home/jenkins/agent/workspace/ease.verify.core.target.2019-03/tests/org.eclipse.ease.lang.python.test/META-INF/MANIFEST.MF, fallback to 'unknown' for source bundle
17:41:52 [2020-10-31T21:41:52.998Z] [INFO] Building jar: /home/jenkins/agent/workspace/ease.verify.core.target.2019-03/tests/org.eclipse.ease.lang.python.test/target/org.eclipse.ease.lang.python.test-0.8.0-SNAPSHOT-sources.jar
17:41:53 [2020-10-31T21:41:53.254Z] [INFO] 
17:41:53 [2020-10-31T21:41:53.254Z] [INFO] --- target-platform-configuration:1.5.0:target-platform (default-target-platform) @ org.eclipse.ease.lang.python.test ---
17:41:53 [2020-10-31T21:41:53.254Z] [INFO] 
17:41:53 [2020-10-31T21:41:53.254Z] [INFO] --- tycho-packaging-plugin:1.5.0:package-plugin (default-package-plugin) @ org.eclipse.ease.lang.python.test ---
17:41:53 [2020-10-31T21:41:53.254Z] [INFO] Building jar: /home/jenkins/agent/workspace/ease.verify.core.target.2019-03/tests/org.eclipse.ease.lang.python.test/target/org.eclipse.ease.lang.python.test-0.8.0-SNAPSHOT.jar
17:41:53 [2020-10-31T21:41:53.254Z] [INFO] 
17:41:53 [2020-10-31T21:41:53.254Z] [INFO] --- tycho-p2-plugin:1.5.0:p2-metadata-default (default-p2-metadata-default) @ org.eclipse.ease.lang.python.test ---
17:41:53 [2020-10-31T21:41:53.254Z] [INFO] 
17:41:53 [2020-10-31T21:41:53.254Z] [INFO] --- tycho-source-feature-plugin:1.5.0:source-feature (source-feature) @ org.eclipse.ease.lang.python.test ---
17:41:53 [2020-10-31T21:41:53.254Z] [INFO] 
17:41:53 [2020-10-31T21:41:53.254Z] [INFO] --- tycho-p2-plugin:1.5.0:p2-metadata (attached-p2-metadata) @ org.eclipse.ease.lang.python.test ---
17:41:53 [2020-10-31T21:41:53.254Z] [INFO] 
17:41:53 [2020-10-31T21:41:53.254Z] [INFO] --- tycho-surefire-plugin:1.5.0:test (default-test) @ org.eclipse.ease.lang.python.test ---
17:41:53 [2020-10-31T21:41:53.254Z] [INFO] Expected eclipse log file: /home/jenkins/agent/workspace/ease.verify.core.target.2019-03/tests/org.eclipse.ease.lang.python.test/target/work/data/.metadata/.log
17:41:53 [2020-10-31T21:41:53.254Z] [INFO] Command line:
17:41:53 [2020-10-31T21:41:53.254Z] 	[/opt/tools/java/openjdk/jdk-11/11.0.2+9/bin/java, -Dosgi.noShutdown=false, -Dosgi.os=linux, -Dosgi.ws=gtk, -Dosgi.arch=x86_64, -Dosgi.clean=true, -jar, /home/jenkins/.m2/repository/p2/osgi/bundle/org.eclipse.equinox.launcher/1.5.300.v20190213-1655/org.eclipse.equinox.launcher-1.5.300.v20190213-1655.jar, -data, /home/jenkins/agent/workspace/ease.verify.core.target.2019-03/tests/org.eclipse.ease.lang.python.test/target/work/data, -install, /home/jenkins/agent/workspace/ease.verify.core.target.2019-03/tests/org.eclipse.ease.lang.python.test/target/work, -configuration, /home/jenkins/agent/workspace/ease.verify.core.target.2019-03/tests/org.eclipse.ease.lang.python.test/target/work/configuration, -application, org.eclipse.tycho.surefire.osgibooter.headlesstest, -testproperties, /home/jenkins/agent/workspace/ease.verify.core.target.2019-03/tests/org.eclipse.ease.lang.python.test/target/surefire.properties]
17:41:53 [2020-10-31T21:41:53.254Z] Picked up JAVA_TOOL_OPTIONS: -Dmaven.ext.class.path="/home/jenkins/agent/workspace/ease.verify.core.target.2019-03@tmp/withMaven4b016809/pipeline-maven-spy.jar" -Dorg.jenkinsci.plugins.pipeline.maven.reportsFolder="/home/jenkins/agent/workspace/ease.verify.core.target.2019-03@tmp/withMaven4b016809" 
17:41:55 [2020-10-31T21:41:55.143Z] Running org.eclipse.ease.lang.python.PythonCodeFactoryTest
17:41:55 [2020-10-31T21:41:55.143Z] Tests run: 1, Failures: 0, Errors: 0, Skipped: 0, Time elapsed: 0.058 s - in org.eclipse.ease.lang.python.PythonCodeFactoryTest
17:41:55 [2020-10-31T21:41:55.143Z] testCommentCreator(org.eclipse.ease.lang.python.PythonCodeFactoryTest)  Time elapsed: 0.029 s
17:41:55 [2020-10-31T21:41:55.143Z] 
17:41:55 [2020-10-31T21:41:55.143Z] Results:
17:41:55 [2020-10-31T21:41:55.143Z] 
17:41:55 [2020-10-31T21:41:55.143Z] Tests run: 1, Failures: 0, Errors: 0, Skipped: 0
17:41:55 [2020-10-31T21:41:55.143Z] 
17:41:55 [2020-10-31T21:41:55.143Z] [INFO] All tests passed!
17:41:55 [2020-10-31T21:41:55.143Z] [INFO] 
17:41:55 [2020-10-31T21:41:55.143Z] [INFO] -----< org.eclipse.ease:org.eclipse.ease.lang.python.jython.test >------
17:41:55 [2020-10-31T21:41:55.143Z] [INFO] Building org.eclipse.ease.lang.python.jython.test 0.8.0-SNAPSHOT  [8/11]
17:41:55 [2020-10-31T21:41:55.143Z] [INFO] ------------------------[ eclipse-test-plugin ]-------------------------
17:41:55 [2020-10-31T21:41:55.143Z] [INFO] 
17:41:55 [2020-10-31T21:41:55.143Z] [INFO] --- tycho-packaging-plugin:1.5.0:build-qualifier (default-build-qualifier) @ org.eclipse.ease.lang.python.jython.test ---
17:41:55 [2020-10-31T21:41:55.143Z] [INFO] The project's OSGi version is 0.8.0.I201911291239
17:41:55 [2020-10-31T21:41:55.143Z] [INFO] 
17:41:55 [2020-10-31T21:41:55.143Z] [INFO] --- tycho-packaging-plugin:1.5.0:validate-id (default-validate-id) @ org.eclipse.ease.lang.python.jython.test ---
17:41:55 [2020-10-31T21:41:55.143Z] [INFO] 
17:41:55 [2020-10-31T21:41:55.143Z] [INFO] --- tycho-packaging-plugin:1.5.0:validate-version (default-validate-version) @ org.eclipse.ease.lang.python.jython.test ---
17:41:55 [2020-10-31T21:41:55.143Z] [INFO] 
17:41:55 [2020-10-31T21:41:55.143Z] [INFO] --- maven-resources-plugin:2.4.3:resources (default-resources) @ org.eclipse.ease.lang.python.jython.test ---
17:41:55 [2020-10-31T21:41:55.143Z] [INFO] Using 'UTF-8' encoding to copy filtered resources.
17:41:55 [2020-10-31T21:41:55.143Z] [INFO] skip non existing resourceDirectory /home/jenkins/agent/workspace/ease.verify.core.target.2019-03/tests/org.eclipse.ease.lang.python.jython.test/src/main/resources
17:41:55 [2020-10-31T21:41:55.143Z] [INFO] 
17:41:55 [2020-10-31T21:41:55.143Z] [INFO] --- tycho-compiler-plugin:1.5.0:compile (default-compile) @ org.eclipse.ease.lang.python.jython.test ---
17:41:55 [2020-10-31T21:41:55.143Z] [INFO] Nothing to compile - all classes are up to date
17:41:55 [2020-10-31T21:41:55.143Z] [INFO] 
17:41:55 [2020-10-31T21:41:55.143Z] [INFO] --- maven-resources-plugin:2.4.3:testResources (default-testResources) @ org.eclipse.ease.lang.python.jython.test ---
17:41:55 [2020-10-31T21:41:55.144Z] [INFO] Using 'UTF-8' encoding to copy filtered resources.
17:41:55 [2020-10-31T21:41:55.144Z] [INFO] skip non existing resourceDirectory /home/jenkins/agent/workspace/ease.verify.core.target.2019-03/tests/org.eclipse.ease.lang.python.jython.test/src/test/resources
17:41:55 [2020-10-31T21:41:55.144Z] [INFO] 
17:41:55 [2020-10-31T21:41:55.144Z] [INFO] --- tycho-source-plugin:1.5.0:plugin-source (plugin-source) @ org.eclipse.ease.lang.python.jython.test ---
17:41:55 [2020-10-31T21:41:55.144Z] [WARNING] Bundle-Vendor header not found in /home/jenkins/agent/workspace/ease.verify.core.target.2019-03/tests/org.eclipse.ease.lang.python.jython.test/META-INF/MANIFEST.MF, fallback to 'unknown' for source bundle
17:41:55 [2020-10-31T21:41:55.144Z] [INFO] Building jar: /home/jenkins/agent/workspace/ease.verify.core.target.2019-03/tests/org.eclipse.ease.lang.python.jython.test/target/org.eclipse.ease.lang.python.jython.test-0.8.0-SNAPSHOT-sources.jar
17:41:55 [2020-10-31T21:41:55.399Z] [INFO] 
17:41:55 [2020-10-31T21:41:55.399Z] [INFO] --- target-platform-configuration:1.5.0:target-platform (default-target-platform) @ org.eclipse.ease.lang.python.jython.test ---
17:41:55 [2020-10-31T21:41:55.399Z] [INFO] 
17:41:55 [2020-10-31T21:41:55.399Z] [INFO] --- tycho-packaging-plugin:1.5.0:package-plugin (default-package-plugin) @ org.eclipse.ease.lang.python.jython.test ---
17:41:55 [2020-10-31T21:41:55.399Z] [INFO] Building jar: /home/jenkins/agent/workspace/ease.verify.core.target.2019-03/tests/org.eclipse.ease.lang.python.jython.test/target/org.eclipse.ease.lang.python.jython.test-0.8.0-SNAPSHOT.jar
17:41:55 [2020-10-31T21:41:55.399Z] [INFO] 
17:41:55 [2020-10-31T21:41:55.399Z] [INFO] --- tycho-p2-plugin:1.5.0:p2-metadata-default (default-p2-metadata-default) @ org.eclipse.ease.lang.python.jython.test ---
17:41:55 [2020-10-31T21:41:55.399Z] [INFO] 
17:41:55 [2020-10-31T21:41:55.399Z] [INFO] --- tycho-source-feature-plugin:1.5.0:source-feature (source-feature) @ org.eclipse.ease.lang.python.jython.test ---
17:41:55 [2020-10-31T21:41:55.399Z] [INFO] 
17:41:55 [2020-10-31T21:41:55.399Z] [INFO] --- tycho-p2-plugin:1.5.0:p2-metadata (attached-p2-metadata) @ org.eclipse.ease.lang.python.jython.test ---
17:41:55 [2020-10-31T21:41:55.399Z] [INFO] 
17:41:55 [2020-10-31T21:41:55.399Z] [INFO] --- tycho-surefire-plugin:1.5.0:test (default-test) @ org.eclipse.ease.lang.python.jython.test ---
17:41:55 [2020-10-31T21:41:55.959Z] [INFO] Expected eclipse log file: /home/jenkins/agent/workspace/ease.verify.core.target.2019-03/tests/org.eclipse.ease.lang.python.jython.test/target/work/data/.metadata/.log
17:41:55 [2020-10-31T21:41:55.959Z] [INFO] Command line:
17:41:55 [2020-10-31T21:41:55.959Z] 	[/opt/tools/java/openjdk/jdk-11/11.0.2+9/bin/java, -Dosgi.noShutdown=false, -Dosgi.os=linux, -Dosgi.ws=gtk, -Dosgi.arch=x86_64, -Dosgi.clean=true, -jar, /home/jenkins/.m2/repository/p2/osgi/bundle/org.eclipse.equinox.launcher/1.5.300.v20190213-1655/org.eclipse.equinox.launcher-1.5.300.v20190213-1655.jar, -data, /home/jenkins/agent/workspace/ease.verify.core.target.2019-03/tests/org.eclipse.ease.lang.python.jython.test/target/work/data, -install, /home/jenkins/agent/workspace/ease.verify.core.target.2019-03/tests/org.eclipse.ease.lang.python.jython.test/target/work, -configuration, /home/jenkins/agent/workspace/ease.verify.core.target.2019-03/tests/org.eclipse.ease.lang.python.jython.test/target/work/configuration, -application, org.eclipse.tycho.surefire.osgibooter.headlesstest, -testproperties, /home/jenkins/agent/workspace/ease.verify.core.target.2019-03/tests/org.eclipse.ease.lang.python.jython.test/target/surefire.properties]
17:41:55 [2020-10-31T21:41:55.959Z] Picked up JAVA_TOOL_OPTIONS: -Dmaven.ext.class.path="/home/jenkins/agent/workspace/ease.verify.core.target.2019-03@tmp/withMaven4b016809/pipeline-maven-spy.jar" -Dorg.jenkinsci.plugins.pipeline.maven.reportsFolder="/home/jenkins/agent/workspace/ease.verify.core.target.2019-03@tmp/withMaven4b016809" 
17:41:57 [2020-10-31T21:41:57.324Z] WARNING: An illegal reflective access operation has occurred
17:41:57 [2020-10-31T21:41:57.324Z] WARNING: Illegal reflective access by org.python.core.PySystemState (file:/home/jenkins/agent/workspace/ease.verify.core.target.2019-03/tests/org.eclipse.ease.lang.python.jython.test/target/work/plugins/org.jython_2.7.0.I201609090924/jython.jar) to method java.io.Console.encoding()
17:41:57 [2020-10-31T21:41:57.324Z] WARNING: Please consider reporting this to the maintainers of org.python.core.PySystemState
17:41:57 [2020-10-31T21:41:57.324Z] WARNING: Use --illegal-access=warn to enable warnings of further illegal reflective access operations
17:41:57 [2020-10-31T21:41:57.324Z] WARNING: All illegal access operations will be denied in a future release
17:41:57 [2020-10-31T21:41:57.580Z] Running org.eclipse.ease.lang.python.jython.debugger.JythonDebugTest
17:41:58 [2020-10-31T21:41:58.943Z] Start of script
17:41:58 [2020-10-31T21:41:58.943Z] include file start
17:41:58 [2020-10-31T21:41:58.943Z] include file processed
17:41:58 [2020-10-31T21:41:58.943Z] Result of testMethod = 5
17:41:58 [2020-10-31T21:41:58.943Z] End of script
17:41:59 [2020-10-31T21:41:59.198Z] Start of script
17:41:59 [2020-10-31T21:41:59.198Z] include file start
17:41:59 [2020-10-31T21:41:59.198Z] include file processed
17:41:59 [2020-10-31T21:41:59.198Z] Result of testMethod = 5
17:41:59 [2020-10-31T21:41:59.198Z] End of script
17:41:59 [2020-10-31T21:41:59.198Z] Start of script
17:41:59 [2020-10-31T21:41:59.198Z] include file start
17:41:59 [2020-10-31T21:41:59.198Z] include file processed
17:41:59 [2020-10-31T21:41:59.198Z] Result of testMethod = 5
17:41:59 [2020-10-31T21:41:59.454Z] Traceback (most recent call last):
17:41:59 [2020-10-31T21:41:59.454Z]   File "(none)", line 184, in run
17:41:59 [2020-10-31T21:41:59.454Z]   File "__ref_L/Debug Test/Main.py_xnwhefcwjr", line 23, in <module>
17:41:59 [2020-10-31T21:41:59.454Z]   File "(none)", line 161, in trace_dispatch
17:41:59 [2020-10-31T21:41:59.454Z] org.eclipse.ease.ExitException: 
17:41:59 [2020-10-31T21:41:59.454Z] 
17:41:59 [2020-10-31T21:41:59.454Z] org.eclipse.ease.ExitException: org.eclipse.ease.ExitException: 
17:41:59 [2020-10-31T21:41:59.710Z] Start of script
17:41:59 [2020-10-31T21:41:59.710Z] include file start
17:41:59 [2020-10-31T21:41:59.710Z] include file processed
17:41:59 [2020-10-31T21:41:59.710Z] Result of testMethod = 5
17:41:59 [2020-10-31T21:41:59.710Z] End of script
17:41:59 [2020-10-31T21:41:59.965Z] Start of script
17:41:59 [2020-10-31T21:41:59.965Z] include file start
17:41:59 [2020-10-31T21:41:59.965Z] include file processed
17:41:59 [2020-10-31T21:41:59.965Z] Result of testMethod = 5
17:41:59 [2020-10-31T21:41:59.965Z] End of script
17:42:00 [2020-10-31T21:42:00.220Z] Start of script
17:42:00 [2020-10-31T21:42:00.220Z] include file start
17:42:00 [2020-10-31T21:42:00.220Z] include file processed
17:42:00 [2020-10-31T21:42:00.475Z] Result of testMethod = 5
17:42:00 [2020-10-31T21:42:00.475Z] End of script
17:42:00 [2020-10-31T21:42:00.475Z] Start of script
17:42:00 [2020-10-31T21:42:00.475Z] include file start
17:42:00 [2020-10-31T21:42:00.475Z] include file processed
17:42:00 [2020-10-31T21:42:00.475Z] Result of testMethod = 5
17:42:00 [2020-10-31T21:42:00.730Z] Traceback (most recent call last):
17:42:00 [2020-10-31T21:42:00.730Z]   File "(none)", line 184, in run
17:42:00 [2020-10-31T21:42:00.730Z]   File "__ref_L/Debug Test/Main.py_nvggaztjan", line 23, in <module>
17:42:00 [2020-10-31T21:42:00.731Z]   File "(none)", line 161, in trace_dispatch
17:42:00 [2020-10-31T21:42:00.731Z] org.eclipse.ease.ExitException: 
17:42:00 [2020-10-31T21:42:00.731Z] 
17:42:00 [2020-10-31T21:42:00.731Z] org.eclipse.ease.ExitException: org.eclipse.ease.ExitException: 
17:42:00 [2020-10-31T21:42:00.731Z] Start of script
17:42:00 [2020-10-31T21:42:00.731Z] include file start
17:42:00 [2020-10-31T21:42:00.731Z] include file processed
17:42:00 [2020-10-31T21:42:00.986Z] Result of testMethod = 5
17:42:00 [2020-10-31T21:42:00.986Z] End of script
17:42:01 [2020-10-31T21:42:01.242Z] Start of script
17:42:01 [2020-10-31T21:42:01.242Z] include file start
17:42:01 [2020-10-31T21:42:01.242Z] include file processed
17:42:01 [2020-10-31T21:42:01.242Z] Result of testMethod = 5
17:42:01 [2020-10-31T21:42:01.242Z] End of script
17:42:01 [2020-10-31T21:42:01.242Z] Start of script
17:42:01 [2020-10-31T21:42:01.242Z] include file start
17:42:01 [2020-10-31T21:42:01.242Z] include file processed
17:42:01 [2020-10-31T21:42:01.804Z] Traceback (most recent call last):
17:42:01 [2020-10-31T21:42:01.804Z]   File "(none)", line 184, in run
17:42:01 [2020-10-31T21:42:01.804Z]   File "__ref_L/Debug Test/Main.py_lcfgecuish", line 22, in <module>
17:42:01 [2020-10-31T21:42:01.804Z]   File "(none)", line 161, in trace_dispatch
17:42:01 [2020-10-31T21:42:01.804Z] org.eclipse.ease.ExitException: 
17:42:01 [2020-10-31T21:42:01.804Z] 
17:42:01 [2020-10-31T21:42:01.804Z] org.eclipse.ease.ExitException: org.eclipse.ease.ExitException: 
17:42:01 [2020-10-31T21:42:01.804Z] Start of script
17:42:01 [2020-10-31T21:42:01.804Z] include file start
17:42:01 [2020-10-31T21:42:01.804Z] include file processed
17:42:01 [2020-10-31T21:42:01.804Z] Result of testMethod = 5
17:42:01 [2020-10-31T21:42:01.804Z] End of script
17:42:02 [2020-10-31T21:42:02.060Z] Start of script
17:42:02 [2020-10-31T21:42:02.060Z] include file start
17:42:02 [2020-10-31T21:42:02.060Z] include file processed
17:42:02 [2020-10-31T21:42:02.315Z] Result of testMethod = 5
17:42:02 [2020-10-31T21:42:02.315Z] End of script
17:42:02 [2020-10-31T21:42:02.570Z] Traceback (most recent call last):
17:42:02 [2020-10-31T21:42:02.570Z]   File "(none)", line 184, in run
17:42:02 [2020-10-31T21:42:02.570Z]   File "__ref_L/Debug Test/Main.py_rbgdovjoww", line 1, in <module>
17:42:02 [2020-10-31T21:42:02.570Z]   File "(none)", line 161, in trace_dispatch
17:42:02 [2020-10-31T21:42:02.570Z] org.eclipse.ease.ExitException: 
17:42:02 [2020-10-31T21:42:02.570Z] 
17:42:02 [2020-10-31T21:42:02.570Z] org.eclipse.ease.ExitException: org.eclipse.ease.ExitException: 
17:42:02 [2020-10-31T21:42:02.570Z] Start of script
17:42:02 [2020-10-31T21:42:02.570Z] include file start
17:42:02 [2020-10-31T21:42:02.570Z] include file processed
17:42:02 [2020-10-31T21:42:02.570Z] Result of testMethod = 5
17:42:02 [2020-10-31T21:42:02.570Z] End of script
17:42:02 [2020-10-31T21:42:02.826Z] Start of script
17:42:02 [2020-10-31T21:42:02.826Z] include file start
17:42:02 [2020-10-31T21:42:02.826Z] include file processed
17:42:03 [2020-10-31T21:42:03.083Z] Result of testMethod = 5
17:42:03 [2020-10-31T21:42:03.083Z] End of script
17:42:03 [2020-10-31T21:42:03.083Z] Start of script
17:42:03 [2020-10-31T21:42:03.083Z] include file start
17:42:03 [2020-10-31T21:42:03.083Z] include file processed
17:42:03 [2020-10-31T21:42:03.083Z] Result of testMethod = 5
17:42:03 [2020-10-31T21:42:03.338Z] Traceback (most recent call last):
17:42:03 [2020-10-31T21:42:03.338Z]   File "(none)", line 184, in run
17:42:03 [2020-10-31T21:42:03.338Z]   File "__ref_L/Debug Test/Main.py_zlfqkpuogh", line 23, in <module>
17:42:03 [2020-10-31T21:42:03.338Z]   File "(none)", line 161, in trace_dispatch
17:42:03 [2020-10-31T21:42:03.338Z] org.eclipse.ease.ExitException: 
17:42:03 [2020-10-31T21:42:03.338Z] 
17:42:03 [2020-10-31T21:42:03.339Z] org.eclipse.ease.ExitException: org.eclipse.ease.ExitException: 
17:42:03 [2020-10-31T21:42:03.339Z] Start of script
17:42:03 [2020-10-31T21:42:03.339Z] include file start
17:42:03 [2020-10-31T21:42:03.339Z] include file processed
17:42:03 [2020-10-31T21:42:03.594Z] Result of testMethod = 5
17:42:03 [2020-10-31T21:42:03.594Z] End of script
17:42:03 [2020-10-31T21:42:03.850Z] Traceback (most recent call last):
17:42:03 [2020-10-31T21:42:03.850Z]   File "(none)", line 184, in run
17:42:03 [2020-10-31T21:42:03.850Z]   File "__ref_L/Debug Test/Main.py_trhsheqthv", line 1, in <module>
17:42:03 [2020-10-31T21:42:03.850Z]   File "(none)", line 161, in trace_dispatch
17:42:03 [2020-10-31T21:42:03.850Z] org.eclipse.ease.ExitException: 
17:42:03 [2020-10-31T21:42:03.850Z] 
17:42:03 [2020-10-31T21:42:03.850Z] org.eclipse.ease.ExitException: org.eclipse.ease.ExitException: 
17:42:03 [2020-10-31T21:42:03.850Z] Start of script
17:42:03 [2020-10-31T21:42:03.850Z] include file start
17:42:03 [2020-10-31T21:42:03.850Z] include file processed
17:42:03 [2020-10-31T21:42:03.850Z] Result of testMethod = 5
17:42:04 [2020-10-31T21:42:04.106Z] End of script
17:42:04 [2020-10-31T21:42:04.106Z] Start of script
17:42:04 [2020-10-31T21:42:04.106Z] include file start
17:42:04 [2020-10-31T21:42:04.106Z] include file processed
17:42:04 [2020-10-31T21:42:04.361Z] Result of testMethod = 5
17:42:04 [2020-10-31T21:42:04.361Z] End of script
17:42:04 [2020-10-31T21:42:04.617Z] Traceback (most recent call last):
17:42:04 [2020-10-31T21:42:04.617Z]   File "(none)", line 184, in run
17:42:04 [2020-10-31T21:42:04.617Z]   File "__ref_L/Debug Test/Main.py_jjkwokzgsy", line 1, in <module>
17:42:04 [2020-10-31T21:42:04.617Z]   File "(none)", line 161, in trace_dispatch
17:42:04 [2020-10-31T21:42:04.617Z] org.eclipse.ease.ExitException: 
17:42:04 [2020-10-31T21:42:04.617Z] 
17:42:04 [2020-10-31T21:42:04.617Z] org.eclipse.ease.ExitException: org.eclipse.ease.ExitException: 
17:42:04 [2020-10-31T21:42:04.617Z] Start of script
17:42:04 [2020-10-31T21:42:04.617Z] include file start
17:42:04 [2020-10-31T21:42:04.617Z] include file processed
17:42:04 [2020-10-31T21:42:04.873Z] Result of testMethod = 5
17:42:04 [2020-10-31T21:42:04.874Z] End of script
17:42:04 [2020-10-31T21:42:04.874Z] Start of script
17:42:04 [2020-10-31T21:42:04.874Z] include file start
17:42:04 [2020-10-31T21:42:04.874Z] include file processed
17:42:04 [2020-10-31T21:42:04.874Z] Result of testMethod = 5
17:42:05 [2020-10-31T21:42:05.131Z] Traceback (most recent call last):
17:42:05 [2020-10-31T21:42:05.131Z]   File "(none)", line 184, in run
17:42:05 [2020-10-31T21:42:05.131Z]   File "__ref_L/Debug Test/Main.py_xoaocbxvcy", line 23, in <module>
17:42:05 [2020-10-31T21:42:05.131Z]   File "(none)", line 161, in trace_dispatch
17:42:05 [2020-10-31T21:42:05.131Z] org.eclipse.ease.ExitException: 
17:42:05 [2020-10-31T21:42:05.131Z] 
17:42:05 [2020-10-31T21:42:05.131Z] org.eclipse.ease.ExitException: org.eclipse.ease.ExitException: 
17:42:05 [2020-10-31T21:42:05.386Z] Start of script
17:42:05 [2020-10-31T21:42:05.386Z] include file start
17:42:05 [2020-10-31T21:42:05.386Z] include file processed
17:42:05 [2020-10-31T21:42:05.387Z] Result of testMethod = 5
17:42:05 [2020-10-31T21:42:05.387Z] End of script
17:42:05 [2020-10-31T21:42:05.387Z] Start of script
17:42:05 [2020-10-31T21:42:05.387Z] include file start
17:42:05 [2020-10-31T21:42:05.387Z] include file processed
17:42:05 [2020-10-31T21:42:05.642Z] Result of testMethod = 5
17:42:05 [2020-10-31T21:42:05.642Z] End of script
17:42:05 [2020-10-31T21:42:05.642Z] Start of script
17:42:05 [2020-10-31T21:42:05.642Z] include file start
17:42:05 [2020-10-31T21:42:05.642Z] include file processed
17:42:05 [2020-10-31T21:42:05.642Z] Result of testMethod = 5
17:42:05 [2020-10-31T21:42:05.642Z] End of script
17:42:05 [2020-10-31T21:42:05.897Z] Start of script
17:42:05 [2020-10-31T21:42:05.897Z] include file start
17:42:05 [2020-10-31T21:42:05.897Z] include file processed
17:42:06 [2020-10-31T21:42:06.153Z] Result of testMethod = 5
17:42:06 [2020-10-31T21:42:06.153Z] End of script
17:42:06 [2020-10-31T21:42:06.153Z] Start of script
17:42:06 [2020-10-31T21:42:06.153Z] include file start
17:42:06 [2020-10-31T21:42:06.153Z] include file processed
17:42:06 [2020-10-31T21:42:06.409Z] Traceback (most recent call last):
17:42:06 [2020-10-31T21:42:06.409Z]   File "(none)", line 184, in run
17:42:06 [2020-10-31T21:42:06.409Z]   File "__ref_L/Debug Test/Main.py_datgrxnsun", line 21, in <module>
17:42:06 [2020-10-31T21:42:06.409Z]   File "__ref_L/Debug Test/Main.py_datgrxnsun", line 18, in testMethod
17:42:06 [2020-10-31T21:42:06.409Z]   File "(none)", line 161, in trace_dispatch
17:42:06 [2020-10-31T21:42:06.409Z] org.eclipse.ease.ExitException: 
17:42:06 [2020-10-31T21:42:06.409Z] 
17:42:06 [2020-10-31T21:42:06.409Z] org.eclipse.ease.ExitException: org.eclipse.ease.ExitException: 
17:42:06 [2020-10-31T21:42:06.409Z] Start of script
17:42:06 [2020-10-31T21:42:06.664Z] include file start
17:42:06 [2020-10-31T21:42:06.664Z] include file processed
17:42:06 [2020-10-31T21:42:06.664Z] Result of testMethod = 5
17:42:06 [2020-10-31T21:42:06.664Z] End of script
17:42:06 [2020-10-31T21:42:06.664Z] Start of script
17:42:06 [2020-10-31T21:42:06.664Z] include file start
17:42:06 [2020-10-31T21:42:06.664Z] include file processed
17:42:06 [2020-10-31T21:42:06.664Z] Result of testMethod = 5
17:42:06 [2020-10-31T21:42:06.920Z] Traceback (most recent call last):
17:42:06 [2020-10-31T21:42:06.920Z]   File "(none)", line 184, in run
17:42:06 [2020-10-31T21:42:06.920Z]   File "__ref_L/Debug Test/Main.py_egfzybppxl", line 23, in <module>
17:42:06 [2020-10-31T21:42:06.920Z]   File "(none)", line 161, in trace_dispatch
17:42:06 [2020-10-31T21:42:06.920Z] org.eclipse.ease.ExitException: 
17:42:06 [2020-10-31T21:42:06.920Z] 
17:42:06 [2020-10-31T21:42:06.920Z] org.eclipse.ease.ExitException: org.eclipse.ease.ExitException: 
17:42:07 [2020-10-31T21:42:07.176Z] Start of script
17:42:07 [2020-10-31T21:42:07.176Z] include file start
17:42:07 [2020-10-31T21:42:07.176Z] include file processed
17:42:07 [2020-10-31T21:42:07.176Z] Result of testMethod = 5
17:42:07 [2020-10-31T21:42:07.176Z] End of script
17:42:07 [2020-10-31T21:42:07.176Z] Start of script
17:42:07 [2020-10-31T21:42:07.176Z] include file start
17:42:07 [2020-10-31T21:42:07.176Z] include file processed
17:42:07 [2020-10-31T21:42:07.432Z] Result of testMethod = 5
17:42:07 [2020-10-31T21:42:07.432Z] End of script
17:42:07 [2020-10-31T21:42:07.688Z] Start of script
17:42:07 [2020-10-31T21:42:07.688Z] include file start
17:42:07 [2020-10-31T21:42:07.688Z] include file processed
17:42:07 [2020-10-31T21:42:07.688Z] Result of testMethod = 5
17:42:07 [2020-10-31T21:42:07.688Z] End of script
17:42:07 [2020-10-31T21:42:07.944Z] Start of script
17:42:07 [2020-10-31T21:42:07.944Z] include file start
17:42:07 [2020-10-31T21:42:07.944Z] include file processed
17:42:07 [2020-10-31T21:42:07.944Z] Result of testMethod = 5
17:42:07 [2020-10-31T21:42:07.944Z] End of script
17:42:08 [2020-10-31T21:42:08.200Z] Start of script
17:42:08 [2020-10-31T21:42:08.200Z] include file start
17:42:08 [2020-10-31T21:42:08.200Z] include file processed
17:42:08 [2020-10-31T21:42:08.200Z] Result of testMethod = 5
17:42:08 [2020-10-31T21:42:08.200Z] Traceback (most recent call last):
17:42:08 [2020-10-31T21:42:08.200Z]   File "(none)", line 184, in run
17:42:08 [2020-10-31T21:42:08.200Z]   File "__ref_L/Debug Test/Main.py_mlwpupmulv", line 23, in <module>
17:42:08 [2020-10-31T21:42:08.200Z]   File "(none)", line 161, in trace_dispatch
17:42:08 [2020-10-31T21:42:08.200Z] org.eclipse.ease.ExitException: 
17:42:08 [2020-10-31T21:42:08.200Z] 
17:42:08 [2020-10-31T21:42:08.200Z] org.eclipse.ease.ExitException: org.eclipse.ease.ExitException: 
17:42:08 [2020-10-31T21:42:08.456Z] Start of script
17:42:08 [2020-10-31T21:42:08.456Z] include file start
17:42:08 [2020-10-31T21:42:08.456Z] include file processed
17:42:08 [2020-10-31T21:42:08.456Z] Result of testMethod = 5
17:42:08 [2020-10-31T21:42:08.456Z] End of script
17:42:08 [2020-10-31T21:42:08.713Z] Start of script
17:42:08 [2020-10-31T21:42:08.713Z] include file start
17:42:08 [2020-10-31T21:42:08.713Z] include file processed
17:42:08 [2020-10-31T21:42:08.713Z] Result of testMethod = 5
17:42:08 [2020-10-31T21:42:08.713Z] Traceback (most recent call last):
17:42:08 [2020-10-31T21:42:08.713Z]   File "(none)", line 184, in run
17:42:08 [2020-10-31T21:42:08.713Z]   File "__ref_L/Debug Test/Main.py_yknlnowrrg", line 23, in <module>
17:42:08 [2020-10-31T21:42:08.713Z]   File "(none)", line 161, in trace_dispatch
17:42:08 [2020-10-31T21:42:08.713Z] org.eclipse.ease.ExitException: 
17:42:08 [2020-10-31T21:42:08.713Z] 
17:42:08 [2020-10-31T21:42:08.713Z] org.eclipse.ease.ExitException: org.eclipse.ease.ExitException: 
17:42:08 [2020-10-31T21:42:08.968Z] Traceback (most recent call last):
17:42:08 [2020-10-31T21:42:08.968Z]   File "(none)", line 184, in run
17:42:08 [2020-10-31T21:42:08.968Z]   File "__ref_L/Debug Test/Main.py_bhmndyozfq", line 1, in <module>
17:42:08 [2020-10-31T21:42:08.968Z]   File "(none)", line 161, in trace_dispatch
17:42:08 [2020-10-31T21:42:08.968Z] org.eclipse.ease.ExitException: 
17:42:08 [2020-10-31T21:42:08.968Z] 
17:42:08 [2020-10-31T21:42:08.968Z] org.eclipse.ease.ExitException: org.eclipse.ease.ExitException: 
17:42:09 [2020-10-31T21:42:09.223Z] Start of script
17:42:09 [2020-10-31T21:42:09.223Z] include file start
17:42:09 [2020-10-31T21:42:09.223Z] include file processed
17:42:09 [2020-10-31T21:42:09.223Z] Result of testMethod = 5
17:42:09 [2020-10-31T21:42:09.223Z] End of script
17:42:09 [2020-10-31T21:42:09.223Z] Start of script
17:42:09 [2020-10-31T21:42:09.223Z] include file start
17:42:09 [2020-10-31T21:42:09.223Z] include file processed
17:42:09 [2020-10-31T21:42:09.479Z] Result of testMethod = 5
17:42:09 [2020-10-31T21:42:09.479Z] End of script
17:42:09 [2020-10-31T21:42:09.734Z] Start of script
17:42:09 [2020-10-31T21:42:09.734Z] include file start
17:42:09 [2020-10-31T21:42:09.734Z] include file processed
17:42:09 [2020-10-31T21:42:09.734Z] Result of testMethod = 5
17:42:09 [2020-10-31T21:42:09.734Z] End of script
17:42:09 [2020-10-31T21:42:09.734Z] Tests run: 42, Failures: 1, Errors: 0, Skipped: 0, Time elapsed: 12.235 s <<< FAILURE! - in org.eclipse.ease.lang.python.jython.debugger.JythonDebugTest
17:42:09 [2020-10-31T21:42:09.734Z] disconnectProcessInSuspendedState(org.eclipse.ease.lang.python.jython.debugger.JythonDebugTest)  Time elapsed: 1.422 s  <<< FAILURE!
17:42:09 [2020-10-31T21:42:09.734Z] java.lang.AssertionError: expected:<1> but was:<0>
17:42:09 [2020-10-31T21:42:09.734Z] 
17:42:09 [2020-10-31T21:42:09.734Z] stepReturnIncludeCommand(org.eclipse.ease.lang.python.jython.debugger.JythonDebugTest)  Time elapsed: 0.213 s
17:42:09 [2020-10-31T21:42:09.734Z] arrayVariableSorting(org.eclipse.ease.lang.python.jython.debugger.JythonDebugTest)  Time elapsed: 0.31 s
17:42:09 [2020-10-31T21:42:09.734Z] stepOverOnDebugTarget(org.eclipse.ease.lang.python.jython.debugger.JythonDebugTest)  Time elapsed: 0.312 s
17:42:09 [2020-10-31T21:42:09.734Z] hasDebugTarget(org.eclipse.ease.lang.python.jython.debugger.JythonDebugTest)  Time elapsed: 0.107 s
17:42:09 [2020-10-31T21:42:09.734Z] disconnectThreadInSuspendedState(org.eclipse.ease.lang.python.jython.debugger.JythonDebugTest)  Time elapsed: 0.207 s
17:42:09 [2020-10-31T21:42:09.734Z] stepReturnOnDebugTarget(org.eclipse.ease.lang.python.jython.debugger.JythonDebugTest)  Time elapsed: 0.308 s
17:42:09 [2020-10-31T21:42:09.735Z] nullVariable(org.eclipse.ease.lang.python.jython.debugger.JythonDebugTest)  Time elapsed: 0.308 s
17:42:09 [2020-10-31T21:42:09.735Z] stepOverOnStackFrame(org.eclipse.ease.lang.python.jython.debugger.JythonDebugTest)  Time elapsed: 0.308 s
17:42:09 [2020-10-31T21:42:09.735Z] resumeOnDebugTarget(org.eclipse.ease.lang.python.jython.debugger.JythonDebugTest)  Time elapsed: 0.208 s
17:42:09 [2020-10-31T21:42:09.735Z] modifyVariableKeepingType(org.eclipse.ease.lang.python.jython.debugger.JythonDebugTest)  Time elapsed: 0.506 s
17:42:09 [2020-10-31T21:42:09.735Z] resumeOnLastIncludeLine(org.eclipse.ease.lang.python.jython.debugger.JythonDebugTest)  Time elapsed: 0.207 s
17:42:09 [2020-10-31T21:42:09.735Z] stepReturnOnStackFrame(org.eclipse.ease.lang.python.jython.debugger.JythonDebugTest)  Time elapsed: 0.308 s
17:42:09 [2020-10-31T21:42:09.735Z] terminateStackFrameInSuspendedState(org.eclipse.ease.lang.python.jython.debugger.JythonDebugTest)  Time elapsed: 0.207 s
17:42:09 [2020-10-31T21:42:09.735Z] breakpointLocation(org.eclipse.ease.lang.python.jython.debugger.JythonDebugTest)  Time elapsed: 0.207 s
17:42:09 [2020-10-31T21:42:09.735Z] stepReturnOnThread(org.eclipse.ease.lang.python.jython.debugger.JythonDebugTest)  Time elapsed: 0.308 s
17:42:09 [2020-10-31T21:42:09.735Z] javaClassVariable(org.eclipse.ease.lang.python.jython.debugger.JythonDebugTest)  Time elapsed: 0.308 s
17:42:09 [2020-10-31T21:42:09.735Z] stepIntoOnThread(org.eclipse.ease.lang.python.jython.debugger.JythonDebugTest)  Time elapsed: 0.307 s
17:42:09 [2020-10-31T21:42:09.735Z] terminateThreadInSuspendedState(org.eclipse.ease.lang.python.jython.debugger.JythonDebugTest)  Time elapsed: 0.206 s
17:42:09 [2020-10-31T21:42:09.735Z] resumeOnThread(org.eclipse.ease.lang.python.jython.debugger.JythonDebugTest)  Time elapsed: 0.207 s
17:42:09 [2020-10-31T21:42:09.735Z] stepIntoOnStackFrame(org.eclipse.ease.lang.python.jython.debugger.JythonDebugTest)  Time elapsed: 0.306 s
17:42:09 [2020-10-31T21:42:09.735Z] terminateProcessInSuspendedState(org.eclipse.ease.lang.python.jython.debugger.JythonDebugTest)  Time elapsed: 0.207 s
17:42:09 [2020-10-31T21:42:09.735Z] stepOverOnProcess(org.eclipse.ease.lang.python.jython.debugger.JythonDebugTest)  Time elapsed: 0.307 s
17:42:09 [2020-10-31T21:42:09.735Z] nativeArrayVariable(org.eclipse.ease.lang.python.jython.debugger.JythonDebugTest)  Time elapsed: 0.306 s
17:42:09 [2020-10-31T21:42:09.735Z] disconnectDebugTargetInSuspendedState(org.eclipse.ease.lang.python.jython.debugger.JythonDebugTest)  Time elapsed: 0.206 s
17:42:09 [2020-10-31T21:42:09.735Z] stepIntoOnProcess(org.eclipse.ease.lang.python.jython.debugger.JythonDebugTest)  Time elapsed: 0.308 s
17:42:09 [2020-10-31T21:42:09.735Z] terminatedState(org.eclipse.ease.lang.python.jython.debugger.JythonDebugTest)  Time elapsed: 0.104 s
17:42:09 [2020-10-31T21:42:09.735Z] stepOverIncludeCommand(org.eclipse.ease.lang.python.jython.debugger.JythonDebugTest)  Time elapsed: 0.305 s
17:42:09 [2020-10-31T21:42:09.735Z] innerScopeVariableBeforeOuterScopeVariable(org.eclipse.ease.lang.python.jython.debugger.JythonDebugTest)  Time elapsed: 0.306 s
17:42:09 [2020-10-31T21:42:09.735Z] stepIntoIncludeCommand(org.eclipse.ease.lang.python.jython.debugger.JythonDebugTest)  Time elapsed: 0.305 s
17:42:09 [2020-10-31T21:42:09.735Z] primitiveStringVariable(org.eclipse.ease.lang.python.jython.debugger.JythonDebugTest)  Time elapsed: 0.306 s
17:42:09 [2020-10-31T21:42:09.735Z] resumeOnProcess(org.eclipse.ease.lang.python.jython.debugger.JythonDebugTest)  Time elapsed: 0.206 s
17:42:09 [2020-10-31T21:42:09.735Z] stepIntoOnDebugTarget(org.eclipse.ease.lang.python.jython.debugger.JythonDebugTest)  Time elapsed: 0.306 s
17:42:09 [2020-10-31T21:42:09.735Z] stepOverOnThread(org.eclipse.ease.lang.python.jython.debugger.JythonDebugTest)  Time elapsed: 0.307 s
17:42:09 [2020-10-31T21:42:09.735Z] suspendedState(org.eclipse.ease.lang.python.jython.debugger.JythonDebugTest)  Time elapsed: 0.205 s
17:42:09 [2020-10-31T21:42:09.735Z] primitiveDoubleVariable(org.eclipse.ease.lang.python.jython.debugger.JythonDebugTest)  Time elapsed: 0.305 s
17:42:09 [2020-10-31T21:42:09.735Z] resumeOnStackFrame(org.eclipse.ease.lang.python.jython.debugger.JythonDebugTest)  Time elapsed: 0.206 s
17:42:09 [2020-10-31T21:42:09.735Z] nativeObjectVariable(org.eclipse.ease.lang.python.jython.debugger.JythonDebugTest)  Time elapsed: 0.305 s
17:42:09 [2020-10-31T21:42:09.735Z] terminateDebugTargetInSuspendedState(org.eclipse.ease.lang.python.jython.debugger.JythonDebugTest)  Time elapsed: 0.206 s
17:42:09 [2020-10-31T21:42:09.735Z] disconnectStackFrameInSuspendedState(org.eclipse.ease.lang.python.jython.debugger.JythonDebugTest)  Time elapsed: 0.205 s
17:42:09 [2020-10-31T21:42:09.735Z] stepReturnOnProcess(org.eclipse.ease.lang.python.jython.debugger.JythonDebugTest)  Time elapsed: 0.307 s
17:42:09 [2020-10-31T21:42:09.735Z] evaluateWatchExpression(org.eclipse.ease.lang.python.jython.debugger.JythonDebugTest)  Time elapsed: 0.207 s
17:42:09 [2020-10-31T21:42:09.735Z] 
17:42:09 [2020-10-31T21:42:09.735Z] Results:
17:42:09 [2020-10-31T21:42:09.735Z] 
17:42:09 [2020-10-31T21:42:09.735Z] Failures: 
17:42:09 [2020-10-31T21:42:09.735Z]   JythonDebugTest>AbstractDebugTest.disconnectProcessInSuspendedState:523->AbstractDebugTest.disconnectTestTemplate:513 expected:<1> but was:<0>
17:42:09 [2020-10-31T21:42:09.735Z] 
17:42:09 [2020-10-31T21:42:09.735Z] Tests run: 42, Failures: 1, Errors: 0, Skipped: 0
17:42:09 [2020-10-31T21:42:09.735Z] 
17:42:10 [2020-10-31T21:42:10.295Z] [INFO] ------------------------------------------------------------------------
17:42:10 [2020-10-31T21:42:10.295Z] [INFO] Reactor Summary for org.eclipse.ease.releng 0.8.0-SNAPSHOT:
17:42:10 [2020-10-31T21:42:10.295Z] [INFO] 
17:42:10 [2020-10-31T21:42:10.295Z] [INFO] org.eclipse.ease.releng ............................ SUCCESS [  0.002 s]
17:42:10 [2020-10-31T21:42:10.295Z] [INFO] org.eclipse.ease.releng.target ..................... SUCCESS [  0.183 s]
17:42:10 [2020-10-31T21:42:10.295Z] [INFO] org.eclipse.ease.test .............................. SUCCESS [ 14.665 s]
17:42:10 [2020-10-31T21:42:10.295Z] [INFO] org.eclipse.ease.lang.javascript.nashorn.test ...... SUCCESS [  3.090 s]
17:42:10 [2020-10-31T21:42:10.295Z] [INFO] org.eclipse.ease.lang.javascript.rhino.test ........ SUCCESS [ 14.064 s]
17:42:10 [2020-10-31T21:42:10.295Z] [INFO] org.eclipse.ease.lang.javascript.test .............. SUCCESS [  2.436 s]
17:42:10 [2020-10-31T21:42:10.295Z] [INFO] org.eclipse.ease.lang.python.test .................. SUCCESS [  2.154 s]
17:42:10 [2020-10-31T21:42:10.295Z] [INFO] org.eclipse.ease.lang.python.jython.test ........... FAILURE [ 14.983 s]
17:42:10 [2020-10-31T21:42:10.295Z] [INFO] org.eclipse.ease.lang.python.py4j.test ............. SKIPPED
17:42:10 [2020-10-31T21:42:10.295Z] [INFO] org.eclipse.ease.lang.scriptarchive.test ........... SKIPPED
17:42:10 [2020-10-31T21:42:10.295Z] [INFO] org.eclipse.ease.ui.test ........................... SKIPPED
17:42:10 [2020-10-31T21:42:10.295Z] [INFO] ------------------------------------------------------------------------
17:42:10 [2020-10-31T21:42:10.295Z] [INFO] BUILD FAILURE
17:42:10 [2020-10-31T21:42:10.295Z] [INFO] ------------------------------------------------------------------------
17:42:10 [2020-10-31T21:42:10.295Z] [INFO] Total time:  01:40 min
17:42:10 [2020-10-31T21:42:10.295Z] [INFO] Finished at: 2020-10-31T21:42:10Z
17:42:10 [2020-10-31T21:42:10.295Z] [INFO] ------------------------------------------------------------------------
17:42:10 [2020-10-31T21:42:10.295Z] [WARNING] [jenkins-event-spy] Unexpected Maven project file name 'target-tests-pom.xml', problems may occur
17:42:10 [2020-10-31T21:42:10.295Z] [INFO] [jenkins-event-spy] Generated /home/jenkins/agent/workspace/ease.verify.core.target.2019-03@tmp/withMaven4b016809/maven-spy-20201031-214029-8922662302091193628007.log
17:42:10 [2020-10-31T21:42:10.295Z] [ERROR] Failed to execute goal org.eclipse.tycho:tycho-surefire-plugin:1.5.0:test (default-test) on project org.eclipse.ease.lang.python.jython.test: There are test failures.
17:42:10 [2020-10-31T21:42:10.296Z] [ERROR] 
17:42:10 [2020-10-31T21:42:10.296Z] [ERROR] Please refer to /home/jenkins/agent/workspace/ease.verify.core.target.2019-03/tests/org.eclipse.ease.lang.python.jython.test/target/surefire-reports for the individual test results.
17:42:10 [2020-10-31T21:42:10.296Z] [ERROR] -> [Help 1]
17:42:10 [2020-10-31T21:42:10.296Z] [ERROR] 
17:42:10 [2020-10-31T21:42:10.296Z] [ERROR] To see the full stack trace of the errors, re-run Maven with the -e switch.
17:42:10 [2020-10-31T21:42:10.296Z] [ERROR] Re-run Maven using the -X switch to enable full debug logging.
17:42:10 [2020-10-31T21:42:10.296Z] [ERROR] 
17:42:10 [2020-10-31T21:42:10.296Z] [ERROR] For more information about the errors and possible solutions, please read the following articles:
17:42:10 [2020-10-31T21:42:10.296Z] [ERROR] [Help 1] http://cwiki.apache.org/confluence/display/MAVEN/MojoFailureException
17:42:10 [2020-10-31T21:42:10.296Z] [ERROR] 
17:42:10 [2020-10-31T21:42:10.296Z] [ERROR] After correcting the problems, you can resume the build with the command
17:42:10 [2020-10-31T21:42:10.296Z] [ERROR]   mvn <args> -rf :org.eclipse.ease.lang.python.jython.test