SuccessConsole Output

Skipping 725 KB.. Full Log
target/surefire.properties]
17:39:33 [2020-10-31T21:39:33.237Z] Picked up JAVA_TOOL_OPTIONS: -Dmaven.ext.class.path="/home/jenkins/agent/workspace/ease.verify.core.target.2019-03@tmp/withMaven8fe89d1e/pipeline-maven-spy.jar" -Dorg.jenkinsci.plugins.pipeline.maven.reportsFolder="/home/jenkins/agent/workspace/ease.verify.core.target.2019-03@tmp/withMaven8fe89d1e" 
17:39:35 [2020-10-31T21:39:35.214Z] Running org.eclipse.ease.lang.javascript.JavaScriptCodeFactoryTest
17:39:35 [2020-10-31T21:39:35.215Z] Tests run: 1, Failures: 0, Errors: 0, Skipped: 0, Time elapsed: 0.118 s - in org.eclipse.ease.lang.javascript.JavaScriptCodeFactoryTest
17:39:35 [2020-10-31T21:39:35.215Z] testCommentCreator(org.eclipse.ease.lang.javascript.JavaScriptCodeFactoryTest)  Time elapsed: 0.004 s
17:39:35 [2020-10-31T21:39:35.215Z] Running org.eclipse.ease.lang.javascript.JavaScriptCompletionContextTest
17:39:35 [2020-10-31T21:39:35.215Z] Tests run: 8, Failures: 0, Errors: 0, Skipped: 0, Time elapsed: 0.105 s - in org.eclipse.ease.lang.javascript.JavaScriptCompletionContextTest
17:39:35 [2020-10-31T21:39:35.215Z] verifyStaticClassTypes(org.eclipse.ease.lang.javascript.JavaScriptCompletionContextTest)  Time elapsed: 0.003 s
17:39:35 [2020-10-31T21:39:35.215Z] verifyClassInstanceTypes(org.eclipse.ease.lang.javascript.JavaScriptCompletionContextTest)  Time elapsed: 0.006 s
17:39:35 [2020-10-31T21:39:35.215Z] verifyTypesForScriptEngine(org.eclipse.ease.lang.javascript.JavaScriptCompletionContextTest)  Time elapsed: 0.091 s
17:39:35 [2020-10-31T21:39:35.215Z] verifyPackageTypes(org.eclipse.ease.lang.javascript.JavaScriptCompletionContextTest)  Time elapsed: 0.001 s
17:39:35 [2020-10-31T21:39:35.215Z] definedVariableTypes(org.eclipse.ease.lang.javascript.JavaScriptCompletionContextTest)  Time elapsed: 0.001 s
17:39:35 [2020-10-31T21:39:35.215Z] verifyStringLiteralTypes(org.eclipse.ease.lang.javascript.JavaScriptCompletionContextTest)  Time elapsed: 0 s
17:39:35 [2020-10-31T21:39:35.215Z] verifyUnknownTypes(org.eclipse.ease.lang.javascript.JavaScriptCompletionContextTest)  Time elapsed: 0 s
17:39:35 [2020-10-31T21:39:35.215Z] verifyNoneTypes(org.eclipse.ease.lang.javascript.JavaScriptCompletionContextTest)  Time elapsed: 0 s
17:39:35 [2020-10-31T21:39:35.215Z] 
17:39:35 [2020-10-31T21:39:35.215Z] Results:
17:39:35 [2020-10-31T21:39:35.215Z] 
17:39:35 [2020-10-31T21:39:35.215Z] Tests run: 9, Failures: 0, Errors: 0, Skipped: 0
17:39:35 [2020-10-31T21:39:35.215Z] 
17:39:35 [2020-10-31T21:39:35.776Z] [INFO] All tests passed!
17:39:35 [2020-10-31T21:39:35.776Z] [INFO] 
17:39:35 [2020-10-31T21:39:35.776Z] [INFO] --- maven-install-plugin:2.3.1:install (default-install) @ org.eclipse.ease.lang.javascript.test ---
17:39:35 [2020-10-31T21:39:35.776Z] [INFO] Installing /home/jenkins/agent/workspace/ease.verify.core.target.2019-03/tests/org.eclipse.ease.lang.javascript.test/target/org.eclipse.ease.lang.javascript.test-0.8.0-SNAPSHOT.jar to /home/jenkins/.m2/repository/org/eclipse/ease/org.eclipse.ease.lang.javascript.test/0.8.0-SNAPSHOT/org.eclipse.ease.lang.javascript.test-0.8.0-SNAPSHOT.jar
17:39:35 [2020-10-31T21:39:35.776Z] [INFO] Installing /home/jenkins/agent/workspace/ease.verify.core.target.2019-03/tests/org.eclipse.ease.lang.javascript.test/pom.xml to /home/jenkins/.m2/repository/org/eclipse/ease/org.eclipse.ease.lang.javascript.test/0.8.0-SNAPSHOT/org.eclipse.ease.lang.javascript.test-0.8.0-SNAPSHOT.pom
17:39:35 [2020-10-31T21:39:35.776Z] [INFO] Installing /home/jenkins/agent/workspace/ease.verify.core.target.2019-03/tests/org.eclipse.ease.lang.javascript.test/target/org.eclipse.ease.lang.javascript.test-0.8.0-SNAPSHOT-sources.jar to /home/jenkins/.m2/repository/org/eclipse/ease/org.eclipse.ease.lang.javascript.test/0.8.0-SNAPSHOT/org.eclipse.ease.lang.javascript.test-0.8.0-SNAPSHOT-sources.jar
17:39:35 [2020-10-31T21:39:35.776Z] [INFO] Installing /home/jenkins/agent/workspace/ease.verify.core.target.2019-03/tests/org.eclipse.ease.lang.javascript.test/target/p2content.xml to /home/jenkins/.m2/repository/org/eclipse/ease/org.eclipse.ease.lang.javascript.test/0.8.0-SNAPSHOT/org.eclipse.ease.lang.javascript.test-0.8.0-SNAPSHOT-p2metadata.xml
17:39:35 [2020-10-31T21:39:35.776Z] [INFO] Installing /home/jenkins/agent/workspace/ease.verify.core.target.2019-03/tests/org.eclipse.ease.lang.javascript.test/target/p2artifacts.xml to /home/jenkins/.m2/repository/org/eclipse/ease/org.eclipse.ease.lang.javascript.test/0.8.0-SNAPSHOT/org.eclipse.ease.lang.javascript.test-0.8.0-SNAPSHOT-p2artifacts.xml
17:39:35 [2020-10-31T21:39:35.776Z] [INFO] Installing /home/jenkins/agent/workspace/ease.verify.core.target.2019-03/tests/org.eclipse.ease.lang.javascript.test/target/p2content.xml to /home/jenkins/.m2/repository/org/eclipse/ease/org.eclipse.ease.lang.javascript.test/0.8.0-SNAPSHOT/org.eclipse.ease.lang.javascript.test-0.8.0-SNAPSHOT-p2metadata.xml
17:39:35 [2020-10-31T21:39:35.776Z] [INFO] Installing /home/jenkins/agent/workspace/ease.verify.core.target.2019-03/tests/org.eclipse.ease.lang.javascript.test/target/p2artifacts.xml to /home/jenkins/.m2/repository/org/eclipse/ease/org.eclipse.ease.lang.javascript.test/0.8.0-SNAPSHOT/org.eclipse.ease.lang.javascript.test-0.8.0-SNAPSHOT-p2artifacts.xml
17:39:35 [2020-10-31T21:39:35.776Z] [INFO] 
17:39:35 [2020-10-31T21:39:35.776Z] [INFO] --- tycho-p2-plugin:1.5.0:update-local-index (default-update-local-index) @ org.eclipse.ease.lang.javascript.test ---
17:39:35 [2020-10-31T21:39:35.776Z] [INFO] 
17:39:35 [2020-10-31T21:39:35.776Z] [INFO] ---------< org.eclipse.ease:org.eclipse.ease.lang.python.test >---------
17:39:35 [2020-10-31T21:39:35.776Z] [INFO] Building org.eclipse.ease.lang.python.test 0.8.0-SNAPSHOT        [42/48]
17:39:35 [2020-10-31T21:39:35.776Z] [INFO] ------------------------[ eclipse-test-plugin ]-------------------------
17:39:35 [2020-10-31T21:39:35.776Z] [INFO] 
17:39:35 [2020-10-31T21:39:35.776Z] [INFO] --- maven-clean-plugin:2.5:clean (default-clean) @ org.eclipse.ease.lang.python.test ---
17:39:35 [2020-10-31T21:39:35.776Z] [INFO] 
17:39:35 [2020-10-31T21:39:35.776Z] [INFO] --- tycho-packaging-plugin:1.5.0:build-qualifier (default-build-qualifier) @ org.eclipse.ease.lang.python.test ---
17:39:35 [2020-10-31T21:39:35.776Z] [INFO] The project's OSGi version is 0.8.0.I201910171213
17:39:35 [2020-10-31T21:39:35.776Z] [INFO] 
17:39:35 [2020-10-31T21:39:35.776Z] [INFO] --- tycho-packaging-plugin:1.5.0:validate-id (default-validate-id) @ org.eclipse.ease.lang.python.test ---
17:39:35 [2020-10-31T21:39:35.776Z] [INFO] 
17:39:35 [2020-10-31T21:39:35.776Z] [INFO] --- tycho-packaging-plugin:1.5.0:validate-version (default-validate-version) @ org.eclipse.ease.lang.python.test ---
17:39:35 [2020-10-31T21:39:35.776Z] [INFO] 
17:39:35 [2020-10-31T21:39:35.776Z] [INFO] >>> maven-javadoc-plugin:2.9.1:javadoc (build-docs) > generate-sources @ org.eclipse.ease.lang.python.test >>>
17:39:35 [2020-10-31T21:39:35.776Z] [INFO] 
17:39:35 [2020-10-31T21:39:35.776Z] [INFO] --- tycho-packaging-plugin:1.5.0:build-qualifier (default-build-qualifier) @ org.eclipse.ease.lang.python.test ---
17:39:35 [2020-10-31T21:39:35.776Z] [INFO] The project's OSGi version is 0.8.0.I201910171213
17:39:35 [2020-10-31T21:39:35.776Z] [INFO] 
17:39:35 [2020-10-31T21:39:35.776Z] [INFO] --- tycho-packaging-plugin:1.5.0:validate-id (default-validate-id) @ org.eclipse.ease.lang.python.test ---
17:39:35 [2020-10-31T21:39:35.776Z] [INFO] 
17:39:35 [2020-10-31T21:39:35.776Z] [INFO] --- tycho-packaging-plugin:1.5.0:validate-version (default-validate-version) @ org.eclipse.ease.lang.python.test ---
17:39:35 [2020-10-31T21:39:35.776Z] [INFO] 
17:39:35 [2020-10-31T21:39:35.776Z] [INFO] <<< maven-javadoc-plugin:2.9.1:javadoc (build-docs) < generate-sources @ org.eclipse.ease.lang.python.test <<<
17:39:35 [2020-10-31T21:39:35.776Z] [INFO] 
17:39:35 [2020-10-31T21:39:35.776Z] [INFO] 
17:39:35 [2020-10-31T21:39:35.777Z] [INFO] --- maven-javadoc-plugin:2.9.1:javadoc (build-docs) @ org.eclipse.ease.lang.python.test ---
17:39:35 [2020-10-31T21:39:35.777Z] [ERROR] Error fetching link: http://help.eclipse.org/oxygen/topic/org.eclipse.platform.doc.isv/reference/api/package-list. Ignored it.
17:39:36 [2020-10-31T21:39:36.033Z] [ERROR] Error fetching link: https://ci.eclipse.org/ease/job/ease.build.core/JavaDoc/package-list. Ignored it.
17:39:36 [2020-10-31T21:39:36.980Z] [INFO] 
17:39:36 [2020-10-31T21:39:36.980Z] Loading source files for package org.eclipse.ease.lang.python...
17:39:36 [2020-10-31T21:39:36.980Z] Constructing Javadoc information...
17:39:36 [2020-10-31T21:39:36.980Z] WARNING: Cannot open location "/home/jenkins/agent/workspace/ease.verify.core.target.2019-03/tests/org.eclipse.ease.lang.python.test/target/javadoc-bundle-options/package-list"
17:39:36 [2020-10-31T21:39:36.980Z] No plugin definition found, skipping
17:39:36 [2020-10-31T21:39:36.980Z] No plugin definition found, skipping
17:39:36 [2020-10-31T21:39:36.980Z] [WARNING] Javadoc Warnings
17:39:36 [2020-10-31T21:39:36.980Z] [WARNING] Picked up JAVA_TOOL_OPTIONS: -Dmaven.ext.class.path="/home/jenkins/agent/workspace/ease.verify.core.target.2019-03@tmp/withMaven8fe89d1e/pipeline-maven-spy.jar" -Dorg.jenkinsci.plugins.pipeline.maven.reportsFolder="/home/jenkins/agent/workspace/ease.verify.core.target.2019-03@tmp/withMaven8fe89d1e"
17:39:36 [2020-10-31T21:39:36.980Z] [WARNING] javadoc: warning - The old Doclet and Taglet APIs in the packages
17:39:36 [2020-10-31T21:39:36.980Z] [WARNING] com.sun.javadoc, com.sun.tools.doclets and their implementations
17:39:36 [2020-10-31T21:39:36.980Z] [WARNING] are planned to be removed in a future JDK release. These
17:39:36 [2020-10-31T21:39:36.980Z] [WARNING] components have been superseded by the new APIs in jdk.javadoc.doclet.
17:39:36 [2020-10-31T21:39:36.980Z] [WARNING] Users are strongly recommended to migrate to the new APIs.
17:39:36 [2020-10-31T21:39:36.980Z] [INFO] 
17:39:36 [2020-10-31T21:39:36.980Z] [INFO] --- build-helper-maven-plugin:1.9.1:add-resource (add_help) @ org.eclipse.ease.lang.python.test ---
17:39:36 [2020-10-31T21:39:36.980Z] [INFO] 
17:39:36 [2020-10-31T21:39:36.980Z] [INFO] --- maven-resources-plugin:2.4.3:resources (default-resources) @ org.eclipse.ease.lang.python.test ---
17:39:36 [2020-10-31T21:39:36.980Z] [INFO] Using 'UTF-8' encoding to copy filtered resources.
17:39:36 [2020-10-31T21:39:36.980Z] [INFO] skip non existing resourceDirectory /home/jenkins/agent/workspace/ease.verify.core.target.2019-03/tests/org.eclipse.ease.lang.python.test/src/main/resources
17:39:36 [2020-10-31T21:39:36.980Z] [INFO] skip non existing resourceDirectory /home/jenkins/agent/workspace/ease.verify.core.target.2019-03/tests/org.eclipse.ease.lang.python.test/help
17:39:36 [2020-10-31T21:39:36.980Z] [INFO] 
17:39:36 [2020-10-31T21:39:36.980Z] [INFO] --- tycho-compiler-plugin:1.5.0:compile (default-compile) @ org.eclipse.ease.lang.python.test ---
17:39:36 [2020-10-31T21:39:36.980Z] [INFO] Compiling 1 source file to /home/jenkins/agent/workspace/ease.verify.core.target.2019-03/tests/org.eclipse.ease.lang.python.test/target/classes
17:39:36 [2020-10-31T21:39:36.980Z] [INFO] 
17:39:36 [2020-10-31T21:39:36.980Z] [INFO] --- maven-resources-plugin:2.4.3:testResources (default-testResources) @ org.eclipse.ease.lang.python.test ---
17:39:36 [2020-10-31T21:39:36.980Z] [INFO] Using 'UTF-8' encoding to copy filtered resources.
17:39:36 [2020-10-31T21:39:36.980Z] [INFO] skip non existing resourceDirectory /home/jenkins/agent/workspace/ease.verify.core.target.2019-03/tests/org.eclipse.ease.lang.python.test/src/test/resources
17:39:36 [2020-10-31T21:39:36.980Z] [INFO] 
17:39:36 [2020-10-31T21:39:36.980Z] [INFO] --- tycho-source-plugin:1.5.0:plugin-source (plugin-source) @ org.eclipse.ease.lang.python.test ---
17:39:36 [2020-10-31T21:39:36.980Z] [WARNING] Bundle-Vendor header not found in /home/jenkins/agent/workspace/ease.verify.core.target.2019-03/tests/org.eclipse.ease.lang.python.test/META-INF/MANIFEST.MF, fallback to 'unknown' for source bundle
17:39:36 [2020-10-31T21:39:36.980Z] [INFO] Building jar: /home/jenkins/agent/workspace/ease.verify.core.target.2019-03/tests/org.eclipse.ease.lang.python.test/target/org.eclipse.ease.lang.python.test-0.8.0-SNAPSHOT-sources.jar
17:39:36 [2020-10-31T21:39:36.980Z] [INFO] 
17:39:36 [2020-10-31T21:39:36.980Z] [INFO] --- target-platform-configuration:1.5.0:target-platform (default-target-platform) @ org.eclipse.ease.lang.python.test ---
17:39:36 [2020-10-31T21:39:36.980Z] [INFO] 
17:39:36 [2020-10-31T21:39:36.980Z] [INFO] --- tycho-packaging-plugin:1.5.0:package-plugin (default-package-plugin) @ org.eclipse.ease.lang.python.test ---
17:39:36 [2020-10-31T21:39:36.980Z] [INFO] Building jar: /home/jenkins/agent/workspace/ease.verify.core.target.2019-03/tests/org.eclipse.ease.lang.python.test/target/org.eclipse.ease.lang.python.test-0.8.0-SNAPSHOT.jar
17:39:36 [2020-10-31T21:39:36.980Z] [INFO] 
17:39:36 [2020-10-31T21:39:36.981Z] [INFO] --- tycho-p2-plugin:1.5.0:p2-metadata-default (default-p2-metadata-default) @ org.eclipse.ease.lang.python.test ---
17:39:36 [2020-10-31T21:39:36.981Z] [INFO] 
17:39:36 [2020-10-31T21:39:36.981Z] [INFO] --- tycho-source-feature-plugin:1.5.0:source-feature (source-feature) @ org.eclipse.ease.lang.python.test ---
17:39:36 [2020-10-31T21:39:36.981Z] [INFO] 
17:39:36 [2020-10-31T21:39:36.981Z] [INFO] --- tycho-p2-plugin:1.5.0:p2-metadata (attached-p2-metadata) @ org.eclipse.ease.lang.python.test ---
17:39:36 [2020-10-31T21:39:36.981Z] [INFO] 
17:39:36 [2020-10-31T21:39:36.981Z] [INFO] --- tycho-surefire-plugin:1.5.0:test (default-test) @ org.eclipse.ease.lang.python.test ---
17:39:36 [2020-10-31T21:39:36.981Z] [INFO] Expected eclipse log file: /home/jenkins/agent/workspace/ease.verify.core.target.2019-03/tests/org.eclipse.ease.lang.python.test/target/work/data/.metadata/.log
17:39:36 [2020-10-31T21:39:36.981Z] [INFO] Command line:
17:39:36 [2020-10-31T21:39:36.981Z] 	[/opt/tools/java/openjdk/jdk-11/11.0.2+9/bin/java, -Dosgi.noShutdown=false, -Dosgi.os=linux, -Dosgi.ws=gtk, -Dosgi.arch=x86_64, -Dosgi.clean=true, -jar, /home/jenkins/.m2/repository/p2/osgi/bundle/org.eclipse.equinox.launcher/1.5.800.v20200727-1323/org.eclipse.equinox.launcher-1.5.800.v20200727-1323.jar, -data, /home/jenkins/agent/workspace/ease.verify.core.target.2019-03/tests/org.eclipse.ease.lang.python.test/target/work/data, -install, /home/jenkins/agent/workspace/ease.verify.core.target.2019-03/tests/org.eclipse.ease.lang.python.test/target/work, -configuration, /home/jenkins/agent/workspace/ease.verify.core.target.2019-03/tests/org.eclipse.ease.lang.python.test/target/work/configuration, -application, org.eclipse.tycho.surefire.osgibooter.headlesstest, -testproperties, /home/jenkins/agent/workspace/ease.verify.core.target.2019-03/tests/org.eclipse.ease.lang.python.test/target/surefire.properties]
17:39:36 [2020-10-31T21:39:36.981Z] Picked up JAVA_TOOL_OPTIONS: -Dmaven.ext.class.path="/home/jenkins/agent/workspace/ease.verify.core.target.2019-03@tmp/withMaven8fe89d1e/pipeline-maven-spy.jar" -Dorg.jenkinsci.plugins.pipeline.maven.reportsFolder="/home/jenkins/agent/workspace/ease.verify.core.target.2019-03@tmp/withMaven8fe89d1e" 
17:39:38 [2020-10-31T21:39:38.870Z] Running org.eclipse.ease.lang.python.PythonCodeFactoryTest
17:39:38 [2020-10-31T21:39:38.870Z] Tests run: 1, Failures: 0, Errors: 0, Skipped: 0, Time elapsed: 0.035 s - in org.eclipse.ease.lang.python.PythonCodeFactoryTest
17:39:38 [2020-10-31T21:39:38.870Z] testCommentCreator(org.eclipse.ease.lang.python.PythonCodeFactoryTest)  Time elapsed: 0.004 s
17:39:38 [2020-10-31T21:39:38.870Z] 
17:39:38 [2020-10-31T21:39:38.870Z] Results:
17:39:38 [2020-10-31T21:39:38.870Z] 
17:39:38 [2020-10-31T21:39:38.870Z] Tests run: 1, Failures: 0, Errors: 0, Skipped: 0
17:39:38 [2020-10-31T21:39:38.870Z] 
17:39:39 [2020-10-31T21:39:39.432Z] [INFO] All tests passed!
17:39:39 [2020-10-31T21:39:39.432Z] [INFO] 
17:39:39 [2020-10-31T21:39:39.432Z] [INFO] --- maven-install-plugin:2.3.1:install (default-install) @ org.eclipse.ease.lang.python.test ---
17:39:39 [2020-10-31T21:39:39.432Z] [INFO] Installing /home/jenkins/agent/workspace/ease.verify.core.target.2019-03/tests/org.eclipse.ease.lang.python.test/target/org.eclipse.ease.lang.python.test-0.8.0-SNAPSHOT.jar to /home/jenkins/.m2/repository/org/eclipse/ease/org.eclipse.ease.lang.python.test/0.8.0-SNAPSHOT/org.eclipse.ease.lang.python.test-0.8.0-SNAPSHOT.jar
17:39:39 [2020-10-31T21:39:39.432Z] [INFO] Installing /home/jenkins/agent/workspace/ease.verify.core.target.2019-03/tests/org.eclipse.ease.lang.python.test/pom.xml to /home/jenkins/.m2/repository/org/eclipse/ease/org.eclipse.ease.lang.python.test/0.8.0-SNAPSHOT/org.eclipse.ease.lang.python.test-0.8.0-SNAPSHOT.pom
17:39:39 [2020-10-31T21:39:39.432Z] [INFO] Installing /home/jenkins/agent/workspace/ease.verify.core.target.2019-03/tests/org.eclipse.ease.lang.python.test/target/org.eclipse.ease.lang.python.test-0.8.0-SNAPSHOT-sources.jar to /home/jenkins/.m2/repository/org/eclipse/ease/org.eclipse.ease.lang.python.test/0.8.0-SNAPSHOT/org.eclipse.ease.lang.python.test-0.8.0-SNAPSHOT-sources.jar
17:39:39 [2020-10-31T21:39:39.432Z] [INFO] Installing /home/jenkins/agent/workspace/ease.verify.core.target.2019-03/tests/org.eclipse.ease.lang.python.test/target/p2content.xml to /home/jenkins/.m2/repository/org/eclipse/ease/org.eclipse.ease.lang.python.test/0.8.0-SNAPSHOT/org.eclipse.ease.lang.python.test-0.8.0-SNAPSHOT-p2metadata.xml
17:39:39 [2020-10-31T21:39:39.432Z] [INFO] Installing /home/jenkins/agent/workspace/ease.verify.core.target.2019-03/tests/org.eclipse.ease.lang.python.test/target/p2artifacts.xml to /home/jenkins/.m2/repository/org/eclipse/ease/org.eclipse.ease.lang.python.test/0.8.0-SNAPSHOT/org.eclipse.ease.lang.python.test-0.8.0-SNAPSHOT-p2artifacts.xml
17:39:39 [2020-10-31T21:39:39.432Z] [INFO] Installing /home/jenkins/agent/workspace/ease.verify.core.target.2019-03/tests/org.eclipse.ease.lang.python.test/target/p2content.xml to /home/jenkins/.m2/repository/org/eclipse/ease/org.eclipse.ease.lang.python.test/0.8.0-SNAPSHOT/org.eclipse.ease.lang.python.test-0.8.0-SNAPSHOT-p2metadata.xml
17:39:39 [2020-10-31T21:39:39.432Z] [INFO] Installing /home/jenkins/agent/workspace/ease.verify.core.target.2019-03/tests/org.eclipse.ease.lang.python.test/target/p2artifacts.xml to /home/jenkins/.m2/repository/org/eclipse/ease/org.eclipse.ease.lang.python.test/0.8.0-SNAPSHOT/org.eclipse.ease.lang.python.test-0.8.0-SNAPSHOT-p2artifacts.xml
17:39:39 [2020-10-31T21:39:39.432Z] [INFO] 
17:39:39 [2020-10-31T21:39:39.432Z] [INFO] --- tycho-p2-plugin:1.5.0:update-local-index (default-update-local-index) @ org.eclipse.ease.lang.python.test ---
17:39:39 [2020-10-31T21:39:39.432Z] [INFO] 
17:39:39 [2020-10-31T21:39:39.432Z] [INFO] -----< org.eclipse.ease:org.eclipse.ease.lang.python.jython.test >------
17:39:39 [2020-10-31T21:39:39.432Z] [INFO] Building org.eclipse.ease.lang.python.jython.test 0.8.0-SNAPSHOT [43/48]
17:39:39 [2020-10-31T21:39:39.432Z] [INFO] ------------------------[ eclipse-test-plugin ]-------------------------
17:39:39 [2020-10-31T21:39:39.432Z] [INFO] 
17:39:39 [2020-10-31T21:39:39.432Z] [INFO] --- maven-clean-plugin:2.5:clean (default-clean) @ org.eclipse.ease.lang.python.jython.test ---
17:39:39 [2020-10-31T21:39:39.432Z] [INFO] 
17:39:39 [2020-10-31T21:39:39.432Z] [INFO] --- tycho-packaging-plugin:1.5.0:build-qualifier (default-build-qualifier) @ org.eclipse.ease.lang.python.jython.test ---
17:39:39 [2020-10-31T21:39:39.432Z] [INFO] The project's OSGi version is 0.8.0.I201911291239
17:39:39 [2020-10-31T21:39:39.432Z] [INFO] 
17:39:39 [2020-10-31T21:39:39.432Z] [INFO] --- tycho-packaging-plugin:1.5.0:validate-id (default-validate-id) @ org.eclipse.ease.lang.python.jython.test ---
17:39:39 [2020-10-31T21:39:39.432Z] [INFO] 
17:39:39 [2020-10-31T21:39:39.432Z] [INFO] --- tycho-packaging-plugin:1.5.0:validate-version (default-validate-version) @ org.eclipse.ease.lang.python.jython.test ---
17:39:39 [2020-10-31T21:39:39.432Z] [INFO] 
17:39:39 [2020-10-31T21:39:39.432Z] [INFO] >>> maven-javadoc-plugin:2.9.1:javadoc (build-docs) > generate-sources @ org.eclipse.ease.lang.python.jython.test >>>
17:39:39 [2020-10-31T21:39:39.432Z] [INFO] 
17:39:39 [2020-10-31T21:39:39.432Z] [INFO] --- tycho-packaging-plugin:1.5.0:build-qualifier (default-build-qualifier) @ org.eclipse.ease.lang.python.jython.test ---
17:39:39 [2020-10-31T21:39:39.432Z] [INFO] The project's OSGi version is 0.8.0.I201911291239
17:39:39 [2020-10-31T21:39:39.432Z] [INFO] 
17:39:39 [2020-10-31T21:39:39.432Z] [INFO] --- tycho-packaging-plugin:1.5.0:validate-id (default-validate-id) @ org.eclipse.ease.lang.python.jython.test ---
17:39:39 [2020-10-31T21:39:39.432Z] [INFO] 
17:39:39 [2020-10-31T21:39:39.432Z] [INFO] --- tycho-packaging-plugin:1.5.0:validate-version (default-validate-version) @ org.eclipse.ease.lang.python.jython.test ---
17:39:39 [2020-10-31T21:39:39.432Z] [INFO] 
17:39:39 [2020-10-31T21:39:39.432Z] [INFO] <<< maven-javadoc-plugin:2.9.1:javadoc (build-docs) < generate-sources @ org.eclipse.ease.lang.python.jython.test <<<
17:39:39 [2020-10-31T21:39:39.432Z] [INFO] 
17:39:39 [2020-10-31T21:39:39.432Z] [INFO] 
17:39:39 [2020-10-31T21:39:39.432Z] [INFO] --- maven-javadoc-plugin:2.9.1:javadoc (build-docs) @ org.eclipse.ease.lang.python.jython.test ---
17:39:39 [2020-10-31T21:39:39.432Z] [ERROR] Error fetching link: http://help.eclipse.org/oxygen/topic/org.eclipse.platform.doc.isv/reference/api/package-list. Ignored it.
17:39:39 [2020-10-31T21:39:39.688Z] [ERROR] Error fetching link: https://ci.eclipse.org/ease/job/ease.build.core/JavaDoc/package-list. Ignored it.
17:39:40 [2020-10-31T21:39:40.681Z] [INFO] 
17:39:40 [2020-10-31T21:39:40.681Z] Loading source files for package org.eclipse.ease.lang.python.jython.debugger...
17:39:40 [2020-10-31T21:39:40.681Z] Constructing Javadoc information...
17:39:40 [2020-10-31T21:39:40.681Z] WARNING: Cannot open location "/home/jenkins/agent/workspace/ease.verify.core.target.2019-03/tests/org.eclipse.ease.lang.python.jython.test/target/javadoc-bundle-options/package-list"
17:39:40 [2020-10-31T21:39:40.681Z] No plugin definition found, skipping
17:39:40 [2020-10-31T21:39:40.681Z] No plugin definition found, skipping
17:39:40 [2020-10-31T21:39:40.681Z] [WARNING] Javadoc Warnings
17:39:40 [2020-10-31T21:39:40.681Z] [WARNING] Picked up JAVA_TOOL_OPTIONS: -Dmaven.ext.class.path="/home/jenkins/agent/workspace/ease.verify.core.target.2019-03@tmp/withMaven8fe89d1e/pipeline-maven-spy.jar" -Dorg.jenkinsci.plugins.pipeline.maven.reportsFolder="/home/jenkins/agent/workspace/ease.verify.core.target.2019-03@tmp/withMaven8fe89d1e"
17:39:40 [2020-10-31T21:39:40.681Z] [WARNING] javadoc: warning - The old Doclet and Taglet APIs in the packages
17:39:40 [2020-10-31T21:39:40.681Z] [WARNING] com.sun.javadoc, com.sun.tools.doclets and their implementations
17:39:40 [2020-10-31T21:39:40.681Z] [WARNING] are planned to be removed in a future JDK release. These
17:39:40 [2020-10-31T21:39:40.681Z] [WARNING] components have been superseded by the new APIs in jdk.javadoc.doclet.
17:39:40 [2020-10-31T21:39:40.681Z] [WARNING] Users are strongly recommended to migrate to the new APIs.
17:39:40 [2020-10-31T21:39:40.681Z] [INFO] 
17:39:40 [2020-10-31T21:39:40.681Z] [INFO] --- build-helper-maven-plugin:1.9.1:add-resource (add_help) @ org.eclipse.ease.lang.python.jython.test ---
17:39:40 [2020-10-31T21:39:40.681Z] [INFO] 
17:39:40 [2020-10-31T21:39:40.681Z] [INFO] --- maven-resources-plugin:2.4.3:resources (default-resources) @ org.eclipse.ease.lang.python.jython.test ---
17:39:40 [2020-10-31T21:39:40.681Z] [INFO] Using 'UTF-8' encoding to copy filtered resources.
17:39:40 [2020-10-31T21:39:40.681Z] [INFO] skip non existing resourceDirectory /home/jenkins/agent/workspace/ease.verify.core.target.2019-03/tests/org.eclipse.ease.lang.python.jython.test/src/main/resources
17:39:40 [2020-10-31T21:39:40.682Z] [INFO] skip non existing resourceDirectory /home/jenkins/agent/workspace/ease.verify.core.target.2019-03/tests/org.eclipse.ease.lang.python.jython.test/help
17:39:40 [2020-10-31T21:39:40.682Z] [INFO] 
17:39:40 [2020-10-31T21:39:40.682Z] [INFO] --- tycho-compiler-plugin:1.5.0:compile (default-compile) @ org.eclipse.ease.lang.python.jython.test ---
17:39:40 [2020-10-31T21:39:40.682Z] [INFO] Compiling 1 source file to /home/jenkins/agent/workspace/ease.verify.core.target.2019-03/tests/org.eclipse.ease.lang.python.jython.test/target/classes
17:39:40 [2020-10-31T21:39:40.682Z] [INFO] 
17:39:40 [2020-10-31T21:39:40.682Z] [INFO] --- maven-resources-plugin:2.4.3:testResources (default-testResources) @ org.eclipse.ease.lang.python.jython.test ---
17:39:40 [2020-10-31T21:39:40.682Z] [INFO] Using 'UTF-8' encoding to copy filtered resources.
17:39:40 [2020-10-31T21:39:40.682Z] [INFO] skip non existing resourceDirectory /home/jenkins/agent/workspace/ease.verify.core.target.2019-03/tests/org.eclipse.ease.lang.python.jython.test/src/test/resources
17:39:40 [2020-10-31T21:39:40.682Z] [INFO] 
17:39:40 [2020-10-31T21:39:40.682Z] [INFO] --- tycho-source-plugin:1.5.0:plugin-source (plugin-source) @ org.eclipse.ease.lang.python.jython.test ---
17:39:40 [2020-10-31T21:39:40.682Z] [WARNING] Bundle-Vendor header not found in /home/jenkins/agent/workspace/ease.verify.core.target.2019-03/tests/org.eclipse.ease.lang.python.jython.test/META-INF/MANIFEST.MF, fallback to 'unknown' for source bundle
17:39:40 [2020-10-31T21:39:40.682Z] [INFO] Building jar: /home/jenkins/agent/workspace/ease.verify.core.target.2019-03/tests/org.eclipse.ease.lang.python.jython.test/target/org.eclipse.ease.lang.python.jython.test-0.8.0-SNAPSHOT-sources.jar
17:39:40 [2020-10-31T21:39:40.682Z] [INFO] 
17:39:40 [2020-10-31T21:39:40.682Z] [INFO] --- target-platform-configuration:1.5.0:target-platform (default-target-platform) @ org.eclipse.ease.lang.python.jython.test ---
17:39:40 [2020-10-31T21:39:40.682Z] [INFO] 
17:39:40 [2020-10-31T21:39:40.682Z] [INFO] --- tycho-packaging-plugin:1.5.0:package-plugin (default-package-plugin) @ org.eclipse.ease.lang.python.jython.test ---
17:39:40 [2020-10-31T21:39:40.682Z] [INFO] Building jar: /home/jenkins/agent/workspace/ease.verify.core.target.2019-03/tests/org.eclipse.ease.lang.python.jython.test/target/org.eclipse.ease.lang.python.jython.test-0.8.0-SNAPSHOT.jar
17:39:40 [2020-10-31T21:39:40.682Z] [INFO] 
17:39:40 [2020-10-31T21:39:40.682Z] [INFO] --- tycho-p2-plugin:1.5.0:p2-metadata-default (default-p2-metadata-default) @ org.eclipse.ease.lang.python.jython.test ---
17:39:40 [2020-10-31T21:39:40.682Z] [INFO] 
17:39:40 [2020-10-31T21:39:40.682Z] [INFO] --- tycho-source-feature-plugin:1.5.0:source-feature (source-feature) @ org.eclipse.ease.lang.python.jython.test ---
17:39:40 [2020-10-31T21:39:40.682Z] [INFO] 
17:39:40 [2020-10-31T21:39:40.682Z] [INFO] --- tycho-p2-plugin:1.5.0:p2-metadata (attached-p2-metadata) @ org.eclipse.ease.lang.python.jython.test ---
17:39:40 [2020-10-31T21:39:40.682Z] [INFO] 
17:39:40 [2020-10-31T21:39:40.682Z] [INFO] --- tycho-surefire-plugin:1.5.0:test (default-test) @ org.eclipse.ease.lang.python.jython.test ---
17:39:41 [2020-10-31T21:39:41.243Z] [INFO] Expected eclipse log file: /home/jenkins/agent/workspace/ease.verify.core.target.2019-03/tests/org.eclipse.ease.lang.python.jython.test/target/work/data/.metadata/.log
17:39:41 [2020-10-31T21:39:41.243Z] [INFO] Command line:
17:39:41 [2020-10-31T21:39:41.243Z] 	[/opt/tools/java/openjdk/jdk-11/11.0.2+9/bin/java, -Dosgi.noShutdown=false, -Dosgi.os=linux, -Dosgi.ws=gtk, -Dosgi.arch=x86_64, -Dosgi.clean=true, -jar, /home/jenkins/.m2/repository/p2/osgi/bundle/org.eclipse.equinox.launcher/1.5.800.v20200727-1323/org.eclipse.equinox.launcher-1.5.800.v20200727-1323.jar, -data, /home/jenkins/agent/workspace/ease.verify.core.target.2019-03/tests/org.eclipse.ease.lang.python.jython.test/target/work/data, -install, /home/jenkins/agent/workspace/ease.verify.core.target.2019-03/tests/org.eclipse.ease.lang.python.jython.test/target/work, -configuration, /home/jenkins/agent/workspace/ease.verify.core.target.2019-03/tests/org.eclipse.ease.lang.python.jython.test/target/work/configuration, -application, org.eclipse.tycho.surefire.osgibooter.headlesstest, -testproperties, /home/jenkins/agent/workspace/ease.verify.core.target.2019-03/tests/org.eclipse.ease.lang.python.jython.test/target/surefire.properties]
17:39:41 [2020-10-31T21:39:41.244Z] Picked up JAVA_TOOL_OPTIONS: -Dmaven.ext.class.path="/home/jenkins/agent/workspace/ease.verify.core.target.2019-03@tmp/withMaven8fe89d1e/pipeline-maven-spy.jar" -Dorg.jenkinsci.plugins.pipeline.maven.reportsFolder="/home/jenkins/agent/workspace/ease.verify.core.target.2019-03@tmp/withMaven8fe89d1e" 
17:39:43 [2020-10-31T21:39:43.133Z] WARNING: An illegal reflective access operation has occurred
17:39:43 [2020-10-31T21:39:43.133Z] WARNING: Illegal reflective access by org.python.core.PySystemState (file:/home/jenkins/agent/workspace/ease.verify.core.target.2019-03/tests/org.eclipse.ease.lang.python.jython.test/target/work/plugins/org.jython_2.7.0.I201609090924/jython.jar) to method java.io.Console.encoding()
17:39:43 [2020-10-31T21:39:43.133Z] WARNING: Please consider reporting this to the maintainers of org.python.core.PySystemState
17:39:43 [2020-10-31T21:39:43.133Z] WARNING: Use --illegal-access=warn to enable warnings of further illegal reflective access operations
17:39:43 [2020-10-31T21:39:43.133Z] WARNING: All illegal access operations will be denied in a future release
17:39:43 [2020-10-31T21:39:43.133Z] Running org.eclipse.ease.lang.python.jython.debugger.JythonDebugTest
17:39:44 [2020-10-31T21:39:44.519Z] Start of script
17:39:44 [2020-10-31T21:39:44.519Z] include file start
17:39:44 [2020-10-31T21:39:44.519Z] include file processed
17:39:44 [2020-10-31T21:39:44.519Z] Result of testMethod = 5
17:39:44 [2020-10-31T21:39:44.519Z] End of script
17:39:44 [2020-10-31T21:39:44.775Z] Start of script
17:39:44 [2020-10-31T21:39:44.775Z] include file start
17:39:44 [2020-10-31T21:39:44.775Z] include file processed
17:39:44 [2020-10-31T21:39:44.775Z] Result of testMethod = 5
17:39:44 [2020-10-31T21:39:44.775Z] End of script
17:39:44 [2020-10-31T21:39:44.775Z] Start of script
17:39:44 [2020-10-31T21:39:44.775Z] include file start
17:39:44 [2020-10-31T21:39:44.775Z] include file processed
17:39:44 [2020-10-31T21:39:44.775Z] Result of testMethod = 5
17:39:45 [2020-10-31T21:39:45.030Z] Traceback (most recent call last):
17:39:45 [2020-10-31T21:39:45.030Z]   File "(none)", line 184, in run
17:39:45 [2020-10-31T21:39:45.031Z]   File "__ref_L/Debug Test/Main.py_khbvgqgrgd", line 23, in <module>
17:39:45 [2020-10-31T21:39:45.031Z]   File "(none)", line 161, in trace_dispatch
17:39:45 [2020-10-31T21:39:45.031Z] org.eclipse.ease.ExitException: 
17:39:45 [2020-10-31T21:39:45.031Z] 
17:39:45 [2020-10-31T21:39:45.031Z] org.eclipse.ease.ExitException: org.eclipse.ease.ExitException: 
17:39:45 [2020-10-31T21:39:45.287Z] Start of script
17:39:45 [2020-10-31T21:39:45.287Z] include file start
17:39:45 [2020-10-31T21:39:45.287Z] include file processed
17:39:45 [2020-10-31T21:39:45.287Z] Result of testMethod = 5
17:39:45 [2020-10-31T21:39:45.287Z] End of script
17:39:45 [2020-10-31T21:39:45.543Z] Start of script
17:39:45 [2020-10-31T21:39:45.802Z] include file start
17:39:45 [2020-10-31T21:39:45.802Z] include file processed
17:39:45 [2020-10-31T21:39:45.802Z] Result of testMethod = 5
17:39:45 [2020-10-31T21:39:45.802Z] End of script
17:39:45 [2020-10-31T21:39:45.802Z] Start of script
17:39:45 [2020-10-31T21:39:45.802Z] include file start
17:39:45 [2020-10-31T21:39:45.802Z] include file processed
17:39:46 [2020-10-31T21:39:46.069Z] Result of testMethod = 5
17:39:46 [2020-10-31T21:39:46.069Z] End of script
17:39:46 [2020-10-31T21:39:46.069Z] Start of script
17:39:46 [2020-10-31T21:39:46.069Z] include file start
17:39:46 [2020-10-31T21:39:46.069Z] include file processed
17:39:46 [2020-10-31T21:39:46.069Z] Result of testMethod = 5
17:39:46 [2020-10-31T21:39:46.327Z] Traceback (most recent call last):
17:39:46 [2020-10-31T21:39:46.327Z]   File "(none)", line 184, in run
17:39:46 [2020-10-31T21:39:46.327Z]   File "__ref_L/Debug Test/Main.py_opcvhyarss", line 23, in <module>
17:39:46 [2020-10-31T21:39:46.327Z]   File "(none)", line 161, in trace_dispatch
17:39:46 [2020-10-31T21:39:46.327Z] org.eclipse.ease.ExitException: 
17:39:46 [2020-10-31T21:39:46.327Z] 
17:39:46 [2020-10-31T21:39:46.327Z] org.eclipse.ease.ExitException: org.eclipse.ease.ExitException: 
17:39:46 [2020-10-31T21:39:46.327Z] Start of script
17:39:46 [2020-10-31T21:39:46.327Z] include file start
17:39:46 [2020-10-31T21:39:46.327Z] include file processed
17:39:46 [2020-10-31T21:39:46.583Z] Result of testMethod = 5
17:39:46 [2020-10-31T21:39:46.583Z] End of script
17:39:46 [2020-10-31T21:39:46.840Z] Start of script
17:39:46 [2020-10-31T21:39:46.840Z] include file start
17:39:46 [2020-10-31T21:39:46.840Z] include file processed
17:39:46 [2020-10-31T21:39:46.840Z] Result of testMethod = 5
17:39:46 [2020-10-31T21:39:46.840Z] End of script
17:39:46 [2020-10-31T21:39:46.840Z] Start of script
17:39:46 [2020-10-31T21:39:46.840Z] include file start
17:39:46 [2020-10-31T21:39:46.840Z] include file processed
17:39:47 [2020-10-31T21:39:47.401Z] Traceback (most recent call last):
17:39:47 [2020-10-31T21:39:47.401Z]   File "(none)", line 184, in run
17:39:47 [2020-10-31T21:39:47.401Z]   File "__ref_L/Debug Test/Main.py_ilcimyqnur", line 22, in <module>
17:39:47 [2020-10-31T21:39:47.401Z]   File "(none)", line 161, in trace_dispatch
17:39:47 [2020-10-31T21:39:47.401Z] org.eclipse.ease.ExitException: 
17:39:47 [2020-10-31T21:39:47.401Z] 
17:39:47 [2020-10-31T21:39:47.401Z] org.eclipse.ease.ExitException: org.eclipse.ease.ExitException: 
17:39:47 [2020-10-31T21:39:47.401Z] Start of script
17:39:47 [2020-10-31T21:39:47.401Z] include file start
17:39:47 [2020-10-31T21:39:47.401Z] include file processed
17:39:47 [2020-10-31T21:39:47.401Z] Result of testMethod = 5
17:39:47 [2020-10-31T21:39:47.401Z] End of script
17:39:47 [2020-10-31T21:39:47.656Z] Start of script
17:39:47 [2020-10-31T21:39:47.656Z] include file start
17:39:47 [2020-10-31T21:39:47.656Z] include file processed
17:39:47 [2020-10-31T21:39:47.911Z] Result of testMethod = 5
17:39:47 [2020-10-31T21:39:47.911Z] End of script
17:39:47 [2020-10-31T21:39:47.911Z] Traceback (most recent call last):
17:39:47 [2020-10-31T21:39:47.911Z]   File "(none)", line 184, in run
17:39:47 [2020-10-31T21:39:47.911Z]   File "__ref_L/Debug Test/Main.py_jfcopseyxt", line 1, in <module>
17:39:47 [2020-10-31T21:39:47.911Z]   File "(none)", line 161, in trace_dispatch
17:39:47 [2020-10-31T21:39:47.911Z] org.eclipse.ease.ExitException: 
17:39:47 [2020-10-31T21:39:47.911Z] 
17:39:47 [2020-10-31T21:39:47.911Z] org.eclipse.ease.ExitException: org.eclipse.ease.ExitException: 
17:39:48 [2020-10-31T21:39:48.167Z] Start of script
17:39:48 [2020-10-31T21:39:48.167Z] include file start
17:39:48 [2020-10-31T21:39:48.167Z] include file processed
17:39:48 [2020-10-31T21:39:48.167Z] Result of testMethod = 5
17:39:48 [2020-10-31T21:39:48.167Z] End of script
17:39:48 [2020-10-31T21:39:48.423Z] Start of script
17:39:48 [2020-10-31T21:39:48.423Z] include file start
17:39:48 [2020-10-31T21:39:48.423Z] include file processed
17:39:48 [2020-10-31T21:39:48.423Z] Result of testMethod = 5
17:39:48 [2020-10-31T21:39:48.423Z] End of script
17:39:48 [2020-10-31T21:39:48.679Z] Start of script
17:39:48 [2020-10-31T21:39:48.679Z] include file start
17:39:48 [2020-10-31T21:39:48.679Z] include file processed
17:39:48 [2020-10-31T21:39:48.679Z] Result of testMethod = 5
17:39:48 [2020-10-31T21:39:48.934Z] Traceback (most recent call last):
17:39:48 [2020-10-31T21:39:48.934Z]   File "(none)", line 184, in run
17:39:48 [2020-10-31T21:39:48.934Z]   File "__ref_L/Debug Test/Main.py_twxgsomvpc", line 23, in <module>
17:39:48 [2020-10-31T21:39:48.934Z]   File "(none)", line 161, in trace_dispatch
17:39:48 [2020-10-31T21:39:48.934Z] org.eclipse.ease.ExitException: 
17:39:48 [2020-10-31T21:39:48.934Z] 
17:39:48 [2020-10-31T21:39:48.934Z] org.eclipse.ease.ExitException: org.eclipse.ease.ExitException: 
17:39:48 [2020-10-31T21:39:48.934Z] Start of script
17:39:48 [2020-10-31T21:39:48.934Z] include file start
17:39:48 [2020-10-31T21:39:48.934Z] include file processed
17:39:49 [2020-10-31T21:39:49.190Z] Result of testMethod = 5
17:39:49 [2020-10-31T21:39:49.190Z] End of script
17:39:49 [2020-10-31T21:39:49.445Z] Traceback (most recent call last):
17:39:49 [2020-10-31T21:39:49.445Z]   File "(none)", line 184, in run
17:39:49 [2020-10-31T21:39:49.445Z]   File "__ref_L/Debug Test/Main.py_otwpxcajxw", line 1, in <module>
17:39:49 [2020-10-31T21:39:49.445Z]   File "(none)", line 161, in trace_dispatch
17:39:49 [2020-10-31T21:39:49.445Z] org.eclipse.ease.ExitException: 
17:39:49 [2020-10-31T21:39:49.445Z] 
17:39:49 [2020-10-31T21:39:49.445Z] org.eclipse.ease.ExitException: org.eclipse.ease.ExitException: 
17:39:49 [2020-10-31T21:39:49.445Z] Start of script
17:39:49 [2020-10-31T21:39:49.446Z] include file start
17:39:49 [2020-10-31T21:39:49.446Z] include file processed
17:39:49 [2020-10-31T21:39:49.446Z] Result of testMethod = 5
17:39:49 [2020-10-31T21:39:49.701Z] End of script
17:39:49 [2020-10-31T21:39:49.701Z] Start of script
17:39:49 [2020-10-31T21:39:49.701Z] include file start
17:39:49 [2020-10-31T21:39:49.701Z] include file processed
17:39:49 [2020-10-31T21:39:49.956Z] Result of testMethod = 5
17:39:49 [2020-10-31T21:39:49.956Z] End of script
17:39:50 [2020-10-31T21:39:50.211Z] Traceback (most recent call last):
17:39:50 [2020-10-31T21:39:50.211Z]   File "(none)", line 184, in run
17:39:50 [2020-10-31T21:39:50.211Z]   File "__ref_L/Debug Test/Main.py_ftdiygxbze", line 1, in <module>
17:39:50 [2020-10-31T21:39:50.211Z]   File "(none)", line 161, in trace_dispatch
17:39:50 [2020-10-31T21:39:50.211Z] org.eclipse.ease.ExitException: 
17:39:50 [2020-10-31T21:39:50.211Z] 
17:39:50 [2020-10-31T21:39:50.211Z] org.eclipse.ease.ExitException: org.eclipse.ease.ExitException: 
17:39:50 [2020-10-31T21:39:50.211Z] Start of script
17:39:50 [2020-10-31T21:39:50.211Z] include file start
17:39:50 [2020-10-31T21:39:50.211Z] include file processed
17:39:50 [2020-10-31T21:39:50.466Z] Result of testMethod = 5
17:39:50 [2020-10-31T21:39:50.466Z] End of script
17:39:50 [2020-10-31T21:39:50.466Z] Start of script
17:39:50 [2020-10-31T21:39:50.466Z] include file start
17:39:50 [2020-10-31T21:39:50.466Z] include file processed
17:39:50 [2020-10-31T21:39:50.466Z] Result of testMethod = 5
17:39:50 [2020-10-31T21:39:50.722Z] Traceback (most recent call last):
17:39:50 [2020-10-31T21:39:50.722Z]   File "(none)", line 184, in run
17:39:50 [2020-10-31T21:39:50.722Z]   File "__ref_L/Debug Test/Main.py_eetguldejn", line 23, in <module>
17:39:50 [2020-10-31T21:39:50.722Z]   File "(none)", line 161, in trace_dispatch
17:39:50 [2020-10-31T21:39:50.722Z] org.eclipse.ease.ExitException: 
17:39:50 [2020-10-31T21:39:50.722Z] 
17:39:50 [2020-10-31T21:39:50.722Z] org.eclipse.ease.ExitException: org.eclipse.ease.ExitException: 
17:39:50 [2020-10-31T21:39:50.977Z] Start of script
17:39:50 [2020-10-31T21:39:50.977Z] include file start
17:39:50 [2020-10-31T21:39:50.977Z] include file processed
17:39:50 [2020-10-31T21:39:50.977Z] Result of testMethod = 5
17:39:50 [2020-10-31T21:39:50.977Z] End of script
17:39:50 [2020-10-31T21:39:50.977Z] Start of script
17:39:50 [2020-10-31T21:39:50.977Z] include file start
17:39:50 [2020-10-31T21:39:50.977Z] include file processed
17:39:51 [2020-10-31T21:39:51.232Z] Result of testMethod = 5
17:39:51 [2020-10-31T21:39:51.233Z] End of script
17:39:51 [2020-10-31T21:39:51.233Z] Start of script
17:39:51 [2020-10-31T21:39:51.233Z] include file start
17:39:51 [2020-10-31T21:39:51.233Z] include file processed
17:39:51 [2020-10-31T21:39:51.233Z] Result of testMethod = 5
17:39:51 [2020-10-31T21:39:51.233Z] End of script
17:39:51 [2020-10-31T21:39:51.488Z] Start of script
17:39:51 [2020-10-31T21:39:51.488Z] include file start
17:39:51 [2020-10-31T21:39:51.488Z] include file processed
17:39:51 [2020-10-31T21:39:51.744Z] Result of testMethod = 5
17:39:51 [2020-10-31T21:39:51.744Z] End of script
17:39:51 [2020-10-31T21:39:51.744Z] Start of script
17:39:51 [2020-10-31T21:39:51.744Z] include file start
17:39:51 [2020-10-31T21:39:51.744Z] include file processed
17:39:51 [2020-10-31T21:39:51.999Z] Traceback (most recent call last):
17:39:51 [2020-10-31T21:39:51.999Z]   File "(none)", line 184, in run
17:39:51 [2020-10-31T21:39:51.999Z]   File "__ref_L/Debug Test/Main.py_dycbpxfapy", line 21, in <module>
17:39:51 [2020-10-31T21:39:51.999Z]   File "__ref_L/Debug Test/Main.py_dycbpxfapy", line 18, in testMethod
17:39:51 [2020-10-31T21:39:51.999Z]   File "(none)", line 161, in trace_dispatch
17:39:51 [2020-10-31T21:39:51.999Z] org.eclipse.ease.ExitException: 
17:39:51 [2020-10-31T21:39:51.999Z] 
17:39:51 [2020-10-31T21:39:51.999Z] org.eclipse.ease.ExitException: org.eclipse.ease.ExitException: 
17:39:51 [2020-10-31T21:39:51.999Z] Start of script
17:39:52 [2020-10-31T21:39:52.255Z] include file start
17:39:52 [2020-10-31T21:39:52.255Z] include file processed
17:39:52 [2020-10-31T21:39:52.255Z] Result of testMethod = 5
17:39:52 [2020-10-31T21:39:52.255Z] End of script
17:39:52 [2020-10-31T21:39:52.255Z] Start of script
17:39:52 [2020-10-31T21:39:52.255Z] include file start
17:39:52 [2020-10-31T21:39:52.255Z] include file processed
17:39:52 [2020-10-31T21:39:52.255Z] Result of testMethod = 5
17:39:52 [2020-10-31T21:39:52.511Z] Traceback (most recent call last):
17:39:52 [2020-10-31T21:39:52.511Z]   File "(none)", line 184, in run
17:39:52 [2020-10-31T21:39:52.511Z]   File "__ref_L/Debug Test/Main.py_ovshtqewkt", line 23, in <module>
17:39:52 [2020-10-31T21:39:52.511Z]   File "(none)", line 161, in trace_dispatch
17:39:52 [2020-10-31T21:39:52.511Z] org.eclipse.ease.ExitException: 
17:39:52 [2020-10-31T21:39:52.511Z] 
17:39:52 [2020-10-31T21:39:52.511Z] org.eclipse.ease.ExitException: org.eclipse.ease.ExitException: 
17:39:52 [2020-10-31T21:39:52.766Z] Start of script
17:39:52 [2020-10-31T21:39:52.766Z] include file start
17:39:52 [2020-10-31T21:39:52.766Z] include file processed
17:39:52 [2020-10-31T21:39:52.766Z] Result of testMethod = 5
17:39:52 [2020-10-31T21:39:52.766Z] End of script
17:39:52 [2020-10-31T21:39:52.766Z] Start of script
17:39:52 [2020-10-31T21:39:52.766Z] include file start
17:39:52 [2020-10-31T21:39:52.766Z] include file processed
17:39:53 [2020-10-31T21:39:53.022Z] Result of testMethod = 5
17:39:53 [2020-10-31T21:39:53.022Z] End of script
17:39:53 [2020-10-31T21:39:53.278Z] Start of script
17:39:53 [2020-10-31T21:39:53.278Z] include file start
17:39:53 [2020-10-31T21:39:53.278Z] include file processed
17:39:53 [2020-10-31T21:39:53.278Z] Result of testMethod = 5
17:39:53 [2020-10-31T21:39:53.278Z] End of script
17:39:53 [2020-10-31T21:39:53.533Z] Start of script
17:39:53 [2020-10-31T21:39:53.533Z] include file start
17:39:53 [2020-10-31T21:39:53.533Z] include file processed
17:39:53 [2020-10-31T21:39:53.533Z] Result of testMethod = 5
17:39:53 [2020-10-31T21:39:53.533Z] End of script
17:39:53 [2020-10-31T21:39:53.790Z] Start of script
17:39:53 [2020-10-31T21:39:53.790Z] include file start
17:39:53 [2020-10-31T21:39:53.790Z] include file processed
17:39:53 [2020-10-31T21:39:53.790Z] Result of testMethod = 5
17:39:53 [2020-10-31T21:39:53.790Z] Traceback (most recent call last):
17:39:53 [2020-10-31T21:39:53.790Z]   File "(none)", line 184, in run
17:39:53 [2020-10-31T21:39:53.790Z]   File "__ref_L/Debug Test/Main.py_kchgaavmwi", line 23, in <module>
17:39:53 [2020-10-31T21:39:53.790Z]   File "(none)", line 161, in trace_dispatch
17:39:53 [2020-10-31T21:39:53.790Z] org.eclipse.ease.ExitException: 
17:39:53 [2020-10-31T21:39:53.790Z] 
17:39:53 [2020-10-31T21:39:53.790Z] org.eclipse.ease.ExitException: org.eclipse.ease.ExitException: 
17:39:54 [2020-10-31T21:39:54.047Z] Start of script
17:39:54 [2020-10-31T21:39:54.047Z] include file start
17:39:54 [2020-10-31T21:39:54.047Z] include file processed
17:39:54 [2020-10-31T21:39:54.047Z] Result of testMethod = 5
17:39:54 [2020-10-31T21:39:54.047Z] End of script
17:39:54 [2020-10-31T21:39:54.302Z] Start of script
17:39:54 [2020-10-31T21:39:54.302Z] include file start
17:39:54 [2020-10-31T21:39:54.302Z] include file processed
17:39:54 [2020-10-31T21:39:54.302Z] Result of testMethod = 5
17:39:54 [2020-10-31T21:39:54.302Z] Traceback (most recent call last):
17:39:54 [2020-10-31T21:39:54.302Z]   File "(none)", line 184, in run
17:39:54 [2020-10-31T21:39:54.302Z]   File "__ref_L/Debug Test/Main.py_pdbpmmnite", line 23, in <module>
17:39:54 [2020-10-31T21:39:54.302Z]   File "(none)", line 161, in trace_dispatch
17:39:54 [2020-10-31T21:39:54.302Z] org.eclipse.ease.ExitException: 
17:39:54 [2020-10-31T21:39:54.302Z] 
17:39:54 [2020-10-31T21:39:54.302Z] org.eclipse.ease.ExitException: org.eclipse.ease.ExitException: 
17:39:54 [2020-10-31T21:39:54.558Z] Traceback (most recent call last):
17:39:54 [2020-10-31T21:39:54.558Z]   File "(none)", line 184, in run
17:39:54 [2020-10-31T21:39:54.558Z]   File "__ref_L/Debug Test/Main.py_zbahlbtxen", line 1, in <module>
17:39:54 [2020-10-31T21:39:54.558Z]   File "(none)", line 161, in trace_dispatch
17:39:54 [2020-10-31T21:39:54.558Z] org.eclipse.ease.ExitException: 
17:39:54 [2020-10-31T21:39:54.558Z] 
17:39:54 [2020-10-31T21:39:54.558Z] org.eclipse.ease.ExitException: org.eclipse.ease.ExitException: 
17:39:54 [2020-10-31T21:39:54.814Z] Start of script
17:39:54 [2020-10-31T21:39:54.814Z] include file start
17:39:54 [2020-10-31T21:39:54.814Z] include file processed
17:39:54 [2020-10-31T21:39:54.814Z] Result of testMethod = 5
17:39:54 [2020-10-31T21:39:54.814Z] End of script
17:39:54 [2020-10-31T21:39:54.814Z] Start of script
17:39:54 [2020-10-31T21:39:54.814Z] include file start
17:39:54 [2020-10-31T21:39:54.814Z] include file processed
17:39:55 [2020-10-31T21:39:55.070Z] Result of testMethod = 5
17:39:55 [2020-10-31T21:39:55.070Z] End of script
17:39:55 [2020-10-31T21:39:55.325Z] Start of script
17:39:55 [2020-10-31T21:39:55.325Z] include file start
17:39:55 [2020-10-31T21:39:55.325Z] include file processed
17:39:55 [2020-10-31T21:39:55.325Z] Result of testMethod = 5
17:39:55 [2020-10-31T21:39:55.325Z] End of script
17:39:55 [2020-10-31T21:39:55.325Z] Tests run: 42, Failures: 0, Errors: 0, Skipped: 0, Time elapsed: 12.355 s - in org.eclipse.ease.lang.python.jython.debugger.JythonDebugTest
17:39:55 [2020-10-31T21:39:55.325Z] disconnectProcessInSuspendedState(org.eclipse.ease.lang.python.jython.debugger.JythonDebugTest)  Time elapsed: 1.553 s
17:39:55 [2020-10-31T21:39:55.325Z] stepReturnIncludeCommand(org.eclipse.ease.lang.python.jython.debugger.JythonDebugTest)  Time elapsed: 0.21 s
17:39:55 [2020-10-31T21:39:55.325Z] arrayVariableSorting(org.eclipse.ease.lang.python.jython.debugger.JythonDebugTest)  Time elapsed: 0.308 s
17:39:55 [2020-10-31T21:39:55.325Z] stepOverOnDebugTarget(org.eclipse.ease.lang.python.jython.debugger.JythonDebugTest)  Time elapsed: 0.31 s
17:39:55 [2020-10-31T21:39:55.325Z] hasDebugTarget(org.eclipse.ease.lang.python.jython.debugger.JythonDebugTest)  Time elapsed: 0.106 s
17:39:55 [2020-10-31T21:39:55.325Z] disconnectThreadInSuspendedState(org.eclipse.ease.lang.python.jython.debugger.JythonDebugTest)  Time elapsed: 0.207 s
17:39:55 [2020-10-31T21:39:55.325Z] stepReturnOnDebugTarget(org.eclipse.ease.lang.python.jython.debugger.JythonDebugTest)  Time elapsed: 0.31 s
17:39:55 [2020-10-31T21:39:55.325Z] nullVariable(org.eclipse.ease.lang.python.jython.debugger.JythonDebugTest)  Time elapsed: 0.309 s
17:39:55 [2020-10-31T21:39:55.325Z] stepOverOnStackFrame(org.eclipse.ease.lang.python.jython.debugger.JythonDebugTest)  Time elapsed: 0.308 s
17:39:55 [2020-10-31T21:39:55.325Z] resumeOnDebugTarget(org.eclipse.ease.lang.python.jython.debugger.JythonDebugTest)  Time elapsed: 0.207 s
17:39:55 [2020-10-31T21:39:55.325Z] modifyVariableKeepingType(org.eclipse.ease.lang.python.jython.debugger.JythonDebugTest)  Time elapsed: 0.506 s
17:39:55 [2020-10-31T21:39:55.325Z] resumeOnLastIncludeLine(org.eclipse.ease.lang.python.jython.debugger.JythonDebugTest)  Time elapsed: 0.207 s
17:39:55 [2020-10-31T21:39:55.325Z] stepReturnOnStackFrame(org.eclipse.ease.lang.python.jython.debugger.JythonDebugTest)  Time elapsed: 0.307 s
17:39:55 [2020-10-31T21:39:55.325Z] terminateStackFrameInSuspendedState(org.eclipse.ease.lang.python.jython.debugger.JythonDebugTest)  Time elapsed: 0.207 s
17:39:55 [2020-10-31T21:39:55.325Z] breakpointLocation(org.eclipse.ease.lang.python.jython.debugger.JythonDebugTest)  Time elapsed: 0.206 s
17:39:55 [2020-10-31T21:39:55.325Z] stepReturnOnThread(org.eclipse.ease.lang.python.jython.debugger.JythonDebugTest)  Time elapsed: 0.309 s
17:39:55 [2020-10-31T21:39:55.325Z] javaClassVariable(org.eclipse.ease.lang.python.jython.debugger.JythonDebugTest)  Time elapsed: 0.311 s
17:39:55 [2020-10-31T21:39:55.325Z] stepIntoOnThread(org.eclipse.ease.lang.python.jython.debugger.JythonDebugTest)  Time elapsed: 0.307 s
17:39:55 [2020-10-31T21:39:55.325Z] terminateThreadInSuspendedState(org.eclipse.ease.lang.python.jython.debugger.JythonDebugTest)  Time elapsed: 0.207 s
17:39:55 [2020-10-31T21:39:55.325Z] resumeOnThread(org.eclipse.ease.lang.python.jython.debugger.JythonDebugTest)  Time elapsed: 0.206 s
17:39:55 [2020-10-31T21:39:55.325Z] stepIntoOnStackFrame(org.eclipse.ease.lang.python.jython.debugger.JythonDebugTest)  Time elapsed: 0.306 s
17:39:55 [2020-10-31T21:39:55.325Z] terminateProcessInSuspendedState(org.eclipse.ease.lang.python.jython.debugger.JythonDebugTest)  Time elapsed: 0.207 s
17:39:55 [2020-10-31T21:39:55.325Z] stepOverOnProcess(org.eclipse.ease.lang.python.jython.debugger.JythonDebugTest)  Time elapsed: 0.307 s
17:39:55 [2020-10-31T21:39:55.325Z] nativeArrayVariable(org.eclipse.ease.lang.python.jython.debugger.JythonDebugTest)  Time elapsed: 0.306 s
17:39:55 [2020-10-31T21:39:55.325Z] disconnectDebugTargetInSuspendedState(org.eclipse.ease.lang.python.jython.debugger.JythonDebugTest)  Time elapsed: 0.206 s
17:39:55 [2020-10-31T21:39:55.325Z] stepIntoOnProcess(org.eclipse.ease.lang.python.jython.debugger.JythonDebugTest)  Time elapsed: 0.307 s
17:39:55 [2020-10-31T21:39:55.325Z] terminatedState(org.eclipse.ease.lang.python.jython.debugger.JythonDebugTest)  Time elapsed: 0.105 s
17:39:55 [2020-10-31T21:39:55.325Z] stepOverIncludeCommand(org.eclipse.ease.lang.python.jython.debugger.JythonDebugTest)  Time elapsed: 0.305 s
17:39:55 [2020-10-31T21:39:55.325Z] innerScopeVariableBeforeOuterScopeVariable(org.eclipse.ease.lang.python.jython.debugger.JythonDebugTest)  Time elapsed: 0.306 s
17:39:55 [2020-10-31T21:39:55.325Z] stepIntoIncludeCommand(org.eclipse.ease.lang.python.jython.debugger.JythonDebugTest)  Time elapsed: 0.305 s
17:39:55 [2020-10-31T21:39:55.325Z] primitiveStringVariable(org.eclipse.ease.lang.python.jython.debugger.JythonDebugTest)  Time elapsed: 0.305 s
17:39:55 [2020-10-31T21:39:55.325Z] resumeOnProcess(org.eclipse.ease.lang.python.jython.debugger.JythonDebugTest)  Time elapsed: 0.205 s
17:39:55 [2020-10-31T21:39:55.325Z] stepIntoOnDebugTarget(org.eclipse.ease.lang.python.jython.debugger.JythonDebugTest)  Time elapsed: 0.306 s
17:39:55 [2020-10-31T21:39:55.326Z] stepOverOnThread(org.eclipse.ease.lang.python.jython.debugger.JythonDebugTest)  Time elapsed: 0.307 s
17:39:55 [2020-10-31T21:39:55.326Z] suspendedState(org.eclipse.ease.lang.python.jython.debugger.JythonDebugTest)  Time elapsed: 0.205 s
17:39:55 [2020-10-31T21:39:55.326Z] primitiveDoubleVariable(org.eclipse.ease.lang.python.jython.debugger.JythonDebugTest)  Time elapsed: 0.306 s
17:39:55 [2020-10-31T21:39:55.326Z] resumeOnStackFrame(org.eclipse.ease.lang.python.jython.debugger.JythonDebugTest)  Time elapsed: 0.205 s
17:39:55 [2020-10-31T21:39:55.326Z] nativeObjectVariable(org.eclipse.ease.lang.python.jython.debugger.JythonDebugTest)  Time elapsed: 0.306 s
17:39:55 [2020-10-31T21:39:55.326Z] terminateDebugTargetInSuspendedState(org.eclipse.ease.lang.python.jython.debugger.JythonDebugTest)  Time elapsed: 0.206 s
17:39:55 [2020-10-31T21:39:55.326Z] disconnectStackFrameInSuspendedState(org.eclipse.ease.lang.python.jython.debugger.JythonDebugTest)  Time elapsed: 0.205 s
17:39:55 [2020-10-31T21:39:55.326Z] stepReturnOnProcess(org.eclipse.ease.lang.python.jython.debugger.JythonDebugTest)  Time elapsed: 0.306 s
17:39:55 [2020-10-31T21:39:55.326Z] evaluateWatchExpression(org.eclipse.ease.lang.python.jython.debugger.JythonDebugTest)  Time elapsed: 0.207 s
17:39:55 [2020-10-31T21:39:55.326Z] 
17:39:55 [2020-10-31T21:39:55.326Z] Results:
17:39:55 [2020-10-31T21:39:55.326Z] 
17:39:55 [2020-10-31T21:39:55.326Z] Tests run: 42, Failures: 0, Errors: 0, Skipped: 0
17:39:55 [2020-10-31T21:39:55.326Z] 
17:39:55 [2020-10-31T21:39:55.887Z] [INFO] All tests passed!
17:39:55 [2020-10-31T21:39:55.887Z] [INFO] 
17:39:55 [2020-10-31T21:39:55.887Z] [INFO] --- maven-install-plugin:2.3.1:install (default-install) @ org.eclipse.ease.lang.python.jython.test ---
17:39:55 [2020-10-31T21:39:55.887Z] [INFO] Installing /home/jenkins/agent/workspace/ease.verify.core.target.2019-03/tests/org.eclipse.ease.lang.python.jython.test/target/org.eclipse.ease.lang.python.jython.test-0.8.0-SNAPSHOT.jar to /home/jenkins/.m2/repository/org/eclipse/ease/org.eclipse.ease.lang.python.jython.test/0.8.0-SNAPSHOT/org.eclipse.ease.lang.python.jython.test-0.8.0-SNAPSHOT.jar
17:39:55 [2020-10-31T21:39:55.887Z] [INFO] Installing /home/jenkins/agent/workspace/ease.verify.core.target.2019-03/tests/org.eclipse.ease.lang.python.jython.test/pom.xml to /home/jenkins/.m2/repository/org/eclipse/ease/org.eclipse.ease.lang.python.jython.test/0.8.0-SNAPSHOT/org.eclipse.ease.lang.python.jython.test-0.8.0-SNAPSHOT.pom
17:39:55 [2020-10-31T21:39:55.887Z] [INFO] Installing /home/jenkins/agent/workspace/ease.verify.core.target.2019-03/tests/org.eclipse.ease.lang.python.jython.test/target/org.eclipse.ease.lang.python.jython.test-0.8.0-SNAPSHOT-sources.jar to /home/jenkins/.m2/repository/org/eclipse/ease/org.eclipse.ease.lang.python.jython.test/0.8.0-SNAPSHOT/org.eclipse.ease.lang.python.jython.test-0.8.0-SNAPSHOT-sources.jar
17:39:55 [2020-10-31T21:39:55.887Z] [INFO] Installing /home/jenkins/agent/workspace/ease.verify.core.target.2019-03/tests/org.eclipse.ease.lang.python.jython.test/target/p2content.xml to /home/jenkins/.m2/repository/org/eclipse/ease/org.eclipse.ease.lang.python.jython.test/0.8.0-SNAPSHOT/org.eclipse.ease.lang.python.jython.test-0.8.0-SNAPSHOT-p2metadata.xml
17:39:55 [2020-10-31T21:39:55.887Z] [INFO] Installing /home/jenkins/agent/workspace/ease.verify.core.target.2019-03/tests/org.eclipse.ease.lang.python.jython.test/target/p2artifacts.xml to /home/jenkins/.m2/repository/org/eclipse/ease/org.eclipse.ease.lang.python.jython.test/0.8.0-SNAPSHOT/org.eclipse.ease.lang.python.jython.test-0.8.0-SNAPSHOT-p2artifacts.xml
17:39:55 [2020-10-31T21:39:55.887Z] [INFO] Installing /home/jenkins/agent/workspace/ease.verify.core.target.2019-03/tests/org.eclipse.ease.lang.python.jython.test/target/p2content.xml to /home/jenkins/.m2/repository/org/eclipse/ease/org.eclipse.ease.lang.python.jython.test/0.8.0-SNAPSHOT/org.eclipse.ease.lang.python.jython.test-0.8.0-SNAPSHOT-p2metadata.xml
17:39:55 [2020-10-31T21:39:55.887Z] [INFO] Installing /home/jenkins/agent/workspace/ease.verify.core.target.2019-03/tests/org.eclipse.ease.lang.python.jython.test/target/p2artifacts.xml to /home/jenkins/.m2/repository/org/eclipse/ease/org.eclipse.ease.lang.python.jython.test/0.8.0-SNAPSHOT/org.eclipse.ease.lang.python.jython.test-0.8.0-SNAPSHOT-p2artifacts.xml
17:39:55 [2020-10-31T21:39:55.887Z] [INFO] 
17:39:55 [2020-10-31T21:39:55.887Z] [INFO] --- tycho-p2-plugin:1.5.0:update-local-index (default-update-local-index) @ org.eclipse.ease.lang.python.jython.test ---
17:39:55 [2020-10-31T21:39:55.887Z] [INFO] 
17:39:55 [2020-10-31T21:39:55.887Z] [INFO] -----< org.eclipse.ease:org.eclipse.ease.lang.scriptarchive.test >------
17:39:55 [2020-10-31T21:39:55.887Z] [INFO] Building org.eclipse.ease.lang.scriptarchive.test 0.8.0-SNAPSHOT [44/48]
17:39:55 [2020-10-31T21:39:55.887Z] [INFO] ------------------------[ eclipse-test-plugin ]-------------------------
17:39:55 [2020-10-31T21:39:55.887Z] [INFO] 
17:39:55 [2020-10-31T21:39:55.887Z] [INFO] --- maven-clean-plugin:2.5:clean (default-clean) @ org.eclipse.ease.lang.scriptarchive.test ---
17:39:55 [2020-10-31T21:39:55.887Z] [INFO] 
17:39:55 [2020-10-31T21:39:55.887Z] [INFO] --- tycho-packaging-plugin:1.5.0:build-qualifier (default-build-qualifier) @ org.eclipse.ease.lang.scriptarchive.test ---
17:39:55 [2020-10-31T21:39:55.887Z] [INFO] The project's OSGi version is 0.8.0.I201910171213
17:39:55 [2020-10-31T21:39:55.887Z] [INFO] 
17:39:55 [2020-10-31T21:39:55.887Z] [INFO] --- tycho-packaging-plugin:1.5.0:validate-id (default-validate-id) @ org.eclipse.ease.lang.scriptarchive.test ---
17:39:55 [2020-10-31T21:39:55.887Z] [INFO] 
17:39:55 [2020-10-31T21:39:55.887Z] [INFO] --- tycho-packaging-plugin:1.5.0:validate-version (default-validate-version) @ org.eclipse.ease.lang.scriptarchive.test ---
17:39:55 [2020-10-31T21:39:55.887Z] [INFO] 
17:39:55 [2020-10-31T21:39:55.887Z] [INFO] >>> maven-javadoc-plugin:2.9.1:javadoc (build-docs) > generate-sources @ org.eclipse.ease.lang.scriptarchive.test >>>
17:39:55 [2020-10-31T21:39:55.887Z] [INFO] 
17:39:55 [2020-10-31T21:39:55.887Z] [INFO] --- tycho-packaging-plugin:1.5.0:build-qualifier (default-build-qualifier) @ org.eclipse.ease.lang.scriptarchive.test ---
17:39:55 [2020-10-31T21:39:55.887Z] [INFO] The project's OSGi version is 0.8.0.I201910171213
17:39:55 [2020-10-31T21:39:55.887Z] [INFO] 
17:39:55 [2020-10-31T21:39:55.887Z] [INFO] --- tycho-packaging-plugin:1.5.0:validate-id (default-validate-id) @ org.eclipse.ease.lang.scriptarchive.test ---
17:39:55 [2020-10-31T21:39:55.887Z] [INFO] 
17:39:55 [2020-10-31T21:39:55.887Z] [INFO] --- tycho-packaging-plugin:1.5.0:validate-version (default-validate-version) @ org.eclipse.ease.lang.scriptarchive.test ---
17:39:55 [2020-10-31T21:39:55.887Z] [INFO] 
17:39:55 [2020-10-31T21:39:55.887Z] [INFO] <<< maven-javadoc-plugin:2.9.1:javadoc (build-docs) < generate-sources @ org.eclipse.ease.lang.scriptarchive.test <<<
17:39:55 [2020-10-31T21:39:55.887Z] [INFO] 
17:39:55 [2020-10-31T21:39:55.887Z] [INFO] 
17:39:55 [2020-10-31T21:39:55.887Z] [INFO] --- maven-javadoc-plugin:2.9.1:javadoc (build-docs) @ org.eclipse.ease.lang.scriptarchive.test ---
17:39:56 [2020-10-31T21:39:56.143Z] [ERROR] Error fetching link: http://help.eclipse.org/oxygen/topic/org.eclipse.platform.doc.isv/reference/api/package-list. Ignored it.
17:39:56 [2020-10-31T21:39:56.143Z] [ERROR] Error fetching link: https://ci.eclipse.org/ease/job/ease.build.core/JavaDoc/package-list. Ignored it.
17:39:57 [2020-10-31T21:39:57.070Z] [INFO] 
17:39:57 [2020-10-31T21:39:57.070Z] Loading source files for package org.eclipse.ease.lang.scriptarchive...
17:39:57 [2020-10-31T21:39:57.070Z] Constructing Javadoc information...
17:39:57 [2020-10-31T21:39:57.070Z] WARNING: Cannot open location "/home/jenkins/agent/workspace/ease.verify.core.target.2019-03/tests/org.eclipse.ease.lang.scriptarchive.test/target/javadoc-bundle-options/package-list"
17:39:57 [2020-10-31T21:39:57.070Z] No plugin definition found, skipping
17:39:57 [2020-10-31T21:39:57.070Z] No plugin definition found, skipping
17:39:57 [2020-10-31T21:39:57.070Z] [WARNING] Javadoc Warnings
17:39:57 [2020-10-31T21:39:57.070Z] [WARNING] Picked up JAVA_TOOL_OPTIONS: -Dmaven.ext.class.path="/home/jenkins/agent/workspace/ease.verify.core.target.2019-03@tmp/withMaven8fe89d1e/pipeline-maven-spy.jar" -Dorg.jenkinsci.plugins.pipeline.maven.reportsFolder="/home/jenkins/agent/workspace/ease.verify.core.target.2019-03@tmp/withMaven8fe89d1e"
17:39:57 [2020-10-31T21:39:57.070Z] [WARNING] javadoc: warning - The old Doclet and Taglet APIs in the packages
17:39:57 [2020-10-31T21:39:57.070Z] [WARNING] com.sun.javadoc, com.sun.tools.doclets and their implementations
17:39:57 [2020-10-31T21:39:57.070Z] [WARNING] are planned to be removed in a future JDK release. These
17:39:57 [2020-10-31T21:39:57.070Z] [WARNING] components have been superseded by the new APIs in jdk.javadoc.doclet.
17:39:57 [2020-10-31T21:39:57.070Z] [WARNING] Users are strongly recommended to migrate to the new APIs.
17:39:57 [2020-10-31T21:39:57.070Z] [INFO] 
17:39:57 [2020-10-31T21:39:57.070Z] [INFO] --- build-helper-maven-plugin:1.9.1:add-resource (add_help) @ org.eclipse.ease.lang.scriptarchive.test ---
17:39:57 [2020-10-31T21:39:57.070Z] [INFO] 
17:39:57 [2020-10-31T21:39:57.070Z] [INFO] --- maven-resources-plugin:2.4.3:resources (default-resources) @ org.eclipse.ease.lang.scriptarchive.test ---
17:39:57 [2020-10-31T21:39:57.070Z] [INFO] Using 'UTF-8' encoding to copy filtered resources.
17:39:57 [2020-10-31T21:39:57.070Z] [INFO] skip non existing resourceDirectory /home/jenkins/agent/workspace/ease.verify.core.target.2019-03/tests/org.eclipse.ease.lang.scriptarchive.test/src/main/resources
17:39:57 [2020-10-31T21:39:57.070Z] [INFO] skip non existing resourceDirectory /home/jenkins/agent/workspace/ease.verify.core.target.2019-03/tests/org.eclipse.ease.lang.scriptarchive.test/help
17:39:57 [2020-10-31T21:39:57.070Z] [INFO] 
17:39:57 [2020-10-31T21:39:57.070Z] [INFO] --- tycho-compiler-plugin:1.5.0:compile (default-compile) @ org.eclipse.ease.lang.scriptarchive.test ---
17:39:57 [2020-10-31T21:39:57.070Z] [INFO] Compiling 1 source file to /home/jenkins/agent/workspace/ease.verify.core.target.2019-03/tests/org.eclipse.ease.lang.scriptarchive.test/target/classes
17:39:57 [2020-10-31T21:39:57.325Z] [INFO] 
17:39:57 [2020-10-31T21:39:57.325Z] [INFO] --- maven-resources-plugin:2.4.3:testResources (default-testResources) @ org.eclipse.ease.lang.scriptarchive.test ---
17:39:57 [2020-10-31T21:39:57.325Z] [INFO] Using 'UTF-8' encoding to copy filtered resources.
17:39:57 [2020-10-31T21:39:57.325Z] [INFO] skip non existing resourceDirectory /home/jenkins/agent/workspace/ease.verify.core.target.2019-03/tests/org.eclipse.ease.lang.scriptarchive.test/src/test/resources
17:39:57 [2020-10-31T21:39:57.325Z] [INFO] 
17:39:57 [2020-10-31T21:39:57.325Z] [INFO] --- tycho-source-plugin:1.5.0:plugin-source (plugin-source) @ org.eclipse.ease.lang.scriptarchive.test ---
17:39:57 [2020-10-31T21:39:57.325Z] [INFO] Building jar: /home/jenkins/agent/workspace/ease.verify.core.target.2019-03/tests/org.eclipse.ease.lang.scriptarchive.test/target/org.eclipse.ease.lang.scriptarchive.test-0.8.0-SNAPSHOT-sources.jar
17:39:57 [2020-10-31T21:39:57.325Z] [INFO] 
17:39:57 [2020-10-31T21:39:57.325Z] [INFO] --- target-platform-configuration:1.5.0:target-platform (default-target-platform) @ org.eclipse.ease.lang.scriptarchive.test ---
17:39:57 [2020-10-31T21:39:57.325Z] [INFO] 
17:39:57 [2020-10-31T21:39:57.325Z] [INFO] --- tycho-packaging-plugin:1.5.0:package-plugin (default-package-plugin) @ org.eclipse.ease.lang.scriptarchive.test ---
17:39:57 [2020-10-31T21:39:57.325Z] [INFO] Building jar: /home/jenkins/agent/workspace/ease.verify.core.target.2019-03/tests/org.eclipse.ease.lang.scriptarchive.test/target/org.eclipse.ease.lang.scriptarchive.test-0.8.0-SNAPSHOT.jar
17:39:57 [2020-10-31T21:39:57.325Z] [INFO] 
17:39:57 [2020-10-31T21:39:57.325Z] [INFO] --- tycho-p2-plugin:1.5.0:p2-metadata-default (default-p2-metadata-default) @ org.eclipse.ease.lang.scriptarchive.test ---
17:39:57 [2020-10-31T21:39:57.325Z] [INFO] 
17:39:57 [2020-10-31T21:39:57.325Z] [INFO] --- tycho-source-feature-plugin:1.5.0:source-feature (source-feature) @ org.eclipse.ease.lang.scriptarchive.test ---
17:39:57 [2020-10-31T21:39:57.325Z] [INFO] 
17:39:57 [2020-10-31T21:39:57.325Z] [INFO] --- tycho-p2-plugin:1.5.0:p2-metadata (attached-p2-metadata) @ org.eclipse.ease.lang.scriptarchive.test ---
17:39:57 [2020-10-31T21:39:57.325Z] [INFO] 
17:39:57 [2020-10-31T21:39:57.325Z] [INFO] --- tycho-surefire-plugin:1.5.0:test (default-test) @ org.eclipse.ease.lang.scriptarchive.test ---
17:39:57 [2020-10-31T21:39:57.582Z] [INFO] Expected eclipse log file: /home/jenkins/agent/workspace/ease.verify.core.target.2019-03/tests/org.eclipse.ease.lang.scriptarchive.test/target/work/data/.metadata/.log
17:39:57 [2020-10-31T21:39:57.582Z] [INFO] Command line:
17:39:57 [2020-10-31T21:39:57.582Z] 	[/opt/tools/java/openjdk/jdk-11/11.0.2+9/bin/java, -Dosgi.noShutdown=false, -Dosgi.os=linux, -Dosgi.ws=gtk, -Dosgi.arch=x86_64, -Dosgi.clean=true, -jar, /home/jenkins/.m2/repository/p2/osgi/bundle/org.eclipse.equinox.launcher/1.5.800.v20200727-1323/org.eclipse.equinox.launcher-1.5.800.v20200727-1323.jar, -data, /home/jenkins/agent/workspace/ease.verify.core.target.2019-03/tests/org.eclipse.ease.lang.scriptarchive.test/target/work/data, -install, /home/jenkins/agent/workspace/ease.verify.core.target.2019-03/tests/org.eclipse.ease.lang.scriptarchive.test/target/work, -configuration, /home/jenkins/agent/workspace/ease.verify.core.target.2019-03/tests/org.eclipse.ease.lang.scriptarchive.test/target/work/configuration, -application, org.eclipse.tycho.surefire.osgibooter.headlesstest, -testproperties, /home/jenkins/agent/workspace/ease.verify.core.target.2019-03/tests/org.eclipse.ease.lang.scriptarchive.test/target/surefire.properties]
17:39:57 [2020-10-31T21:39:57.582Z] Picked up JAVA_TOOL_OPTIONS: -Dmaven.ext.class.path="/home/jenkins/agent/workspace/ease.verify.core.target.2019-03@tmp/withMaven8fe89d1e/pipeline-maven-spy.jar" -Dorg.jenkinsci.plugins.pipeline.maven.reportsFolder="/home/jenkins/agent/workspace/ease.verify.core.target.2019-03@tmp/withMaven8fe89d1e" 
17:39:59 [2020-10-31T21:39:59.505Z] Running org.eclipse.ease.lang.scriptarchive.ArchiveEngineTest
17:39:59 [2020-10-31T21:39:59.505Z] We are running from a zip file!
17:39:59 [2020-10-31T21:39:59.505Z] org.eclipse.ease.ScriptExecutionException: SyntaxError: missing ; before statement (workspace://__EASE_ScriptArchive_1/scripts/Master.js#3)
17:39:59 [2020-10-31T21:39:59.505Z] this is an error
17:39:59 [2020-10-31T21:39:59.505Z]        ^
17:39:59 [2020-10-31T21:39:59.505Z] 	at Master.js,workspace://__EASE_ScriptArchive_1/scripts/Master.js
17:39:59 [2020-10-31T21:39:59.505Z] org.eclipse.ease.ScriptExecutionException: SyntaxError: missing ; before statement (workspace://__EASE_ScriptArchive_1/scripts/Master.js#3)
17:39:59 [2020-10-31T21:39:59.505Z] this is an error
17:39:59 [2020-10-31T21:39:59.505Z]        ^
17:39:59 [2020-10-31T21:39:59.505Z] 	at Master.js,workspace://__EASE_ScriptArchive_1/scripts/Master.js
17:39:59 [2020-10-31T21:39:59.505Z] Tests run: 7, Failures: 0, Errors: 0, Skipped: 0, Time elapsed: 0.432 s - in org.eclipse.ease.lang.scriptarchive.ArchiveEngineTest
17:39:59 [2020-10-31T21:39:59.505Z] executeWithManifest(org.eclipse.ease.lang.scriptarchive.ArchiveEngineTest)  Time elapsed: 0.291 s
17:39:59 [2020-10-31T21:39:59.505Z] zipFileRegistration(org.eclipse.ease.lang.scriptarchive.ArchiveEngineTest)  Time elapsed: 0.006 s
17:39:59 [2020-10-31T21:39:59.505Z] engineIdRegistration(org.eclipse.ease.lang.scriptarchive.ArchiveEngineTest)  Time elapsed: 0 s
17:39:59 [2020-10-31T21:39:59.505Z] jarFileRegistration(org.eclipse.ease.lang.scriptarchive.ArchiveEngineTest)  Time elapsed: 0.001 s
17:39:59 [2020-10-31T21:39:59.505Z] sarFileRegistration(org.eclipse.ease.lang.scriptarchive.ArchiveEngineTest)  Time elapsed: 0 s
17:39:59 [2020-10-31T21:39:59.505Z] executeWithErrors(org.eclipse.ease.lang.scriptarchive.ArchiveEngineTest)  Time elapsed: 0.078 s
17:39:59 [2020-10-31T21:39:59.505Z] executeWithIncludes(org.eclipse.ease.lang.scriptarchive.ArchiveEngineTest)  Time elapsed: 0.035 s
17:39:59 [2020-10-31T21:39:59.505Z] 
17:39:59 [2020-10-31T21:39:59.505Z] Results:
17:39:59 [2020-10-31T21:39:59.505Z] 
17:39:59 [2020-10-31T21:39:59.505Z] Tests run: 7, Failures: 0, Errors: 0, Skipped: 0
17:39:59 [2020-10-31T21:39:59.505Z] 
17:40:00 [2020-10-31T21:40:00.431Z] [INFO] All tests passed!
17:40:00 [2020-10-31T21:40:00.431Z] [INFO] 
17:40:00 [2020-10-31T21:40:00.431Z] [INFO] --- maven-install-plugin:2.3.1:install (default-install) @ org.eclipse.ease.lang.scriptarchive.test ---
17:40:00 [2020-10-31T21:40:00.431Z] [INFO] Installing /home/jenkins/agent/workspace/ease.verify.core.target.2019-03/tests/org.eclipse.ease.lang.scriptarchive.test/target/org.eclipse.ease.lang.scriptarchive.test-0.8.0-SNAPSHOT.jar to /home/jenkins/.m2/repository/org/eclipse/ease/org.eclipse.ease.lang.scriptarchive.test/0.8.0-SNAPSHOT/org.eclipse.ease.lang.scriptarchive.test-0.8.0-SNAPSHOT.jar
17:40:00 [2020-10-31T21:40:00.431Z] [INFO] Installing /home/jenkins/agent/workspace/ease.verify.core.target.2019-03/tests/org.eclipse.ease.lang.scriptarchive.test/pom.xml to /home/jenkins/.m2/repository/org/eclipse/ease/org.eclipse.ease.lang.scriptarchive.test/0.8.0-SNAPSHOT/org.eclipse.ease.lang.scriptarchive.test-0.8.0-SNAPSHOT.pom
17:40:00 [2020-10-31T21:40:00.431Z] [INFO] Installing /home/jenkins/agent/workspace/ease.verify.core.target.2019-03/tests/org.eclipse.ease.lang.scriptarchive.test/target/org.eclipse.ease.lang.scriptarchive.test-0.8.0-SNAPSHOT-sources.jar to /home/jenkins/.m2/repository/org/eclipse/ease/org.eclipse.ease.lang.scriptarchive.test/0.8.0-SNAPSHOT/org.eclipse.ease.lang.scriptarchive.test-0.8.0-SNAPSHOT-sources.jar
17:40:00 [2020-10-31T21:40:00.431Z] [INFO] Installing /home/jenkins/agent/workspace/ease.verify.core.target.2019-03/tests/org.eclipse.ease.lang.scriptarchive.test/target/p2content.xml to /home/jenkins/.m2/repository/org/eclipse/ease/org.eclipse.ease.lang.scriptarchive.test/0.8.0-SNAPSHOT/org.eclipse.ease.lang.scriptarchive.test-0.8.0-SNAPSHOT-p2metadata.xml
17:40:00 [2020-10-31T21:40:00.431Z] [INFO] Installing /home/jenkins/agent/workspace/ease.verify.core.target.2019-03/tests/org.eclipse.ease.lang.scriptarchive.test/target/p2artifacts.xml to /home/jenkins/.m2/repository/org/eclipse/ease/org.eclipse.ease.lang.scriptarchive.test/0.8.0-SNAPSHOT/org.eclipse.ease.lang.scriptarchive.test-0.8.0-SNAPSHOT-p2artifacts.xml
17:40:00 [2020-10-31T21:40:00.431Z] [INFO] Installing /home/jenkins/agent/workspace/ease.verify.core.target.2019-03/tests/org.eclipse.ease.lang.scriptarchive.test/target/p2content.xml to /home/jenkins/.m2/repository/org/eclipse/ease/org.eclipse.ease.lang.scriptarchive.test/0.8.0-SNAPSHOT/org.eclipse.ease.lang.scriptarchive.test-0.8.0-SNAPSHOT-p2metadata.xml
17:40:00 [2020-10-31T21:40:00.431Z] [INFO] Installing /home/jenkins/agent/workspace/ease.verify.core.target.2019-03/tests/org.eclipse.ease.lang.scriptarchive.test/target/p2artifacts.xml to /home/jenkins/.m2/repository/org/eclipse/ease/org.eclipse.ease.lang.scriptarchive.test/0.8.0-SNAPSHOT/org.eclipse.ease.lang.scriptarchive.test-0.8.0-SNAPSHOT-p2artifacts.xml
17:40:00 [2020-10-31T21:40:00.431Z] [INFO] 
17:40:00 [2020-10-31T21:40:00.431Z] [INFO] --- tycho-p2-plugin:1.5.0:update-local-index (default-update-local-index) @ org.eclipse.ease.lang.scriptarchive.test ---
17:40:00 [2020-10-31T21:40:00.431Z] [INFO] 
17:40:00 [2020-10-31T21:40:00.431Z] [INFO] --------< org.eclipse.ease:org.eclipse.ease.lang.unittest.test >--------
17:40:00 [2020-10-31T21:40:00.431Z] [INFO] Building org.eclipse.ease.lang.unittest.test 0.8.0-SNAPSHOT      [45/48]
17:40:00 [2020-10-31T21:40:00.431Z] [INFO] ------------------------[ eclipse-test-plugin ]-------------------------
17:40:00 [2020-10-31T21:40:00.431Z] [INFO] 
17:40:00 [2020-10-31T21:40:00.431Z] [INFO] --- maven-clean-plugin:2.5:clean (default-clean) @ org.eclipse.ease.lang.unittest.test ---
17:40:00 [2020-10-31T21:40:00.431Z] [INFO] 
17:40:00 [2020-10-31T21:40:00.431Z] [INFO] --- tycho-packaging-plugin:1.5.0:build-qualifier (default-build-qualifier) @ org.eclipse.ease.lang.unittest.test ---
17:40:00 [2020-10-31T21:40:00.431Z] [INFO] The project's OSGi version is 0.8.0.I202009240747
17:40:00 [2020-10-31T21:40:00.431Z] [INFO] 
17:40:00 [2020-10-31T21:40:00.431Z] [INFO] --- tycho-packaging-plugin:1.5.0:validate-id (default-validate-id) @ org.eclipse.ease.lang.unittest.test ---
17:40:00 [2020-10-31T21:40:00.431Z] [INFO] 
17:40:00 [2020-10-31T21:40:00.431Z] [INFO] --- tycho-packaging-plugin:1.5.0:validate-version (default-validate-version) @ org.eclipse.ease.lang.unittest.test ---
17:40:00 [2020-10-31T21:40:00.431Z] [INFO] 
17:40:00 [2020-10-31T21:40:00.431Z] [INFO] >>> maven-javadoc-plugin:2.9.1:javadoc (build-docs) > generate-sources @ org.eclipse.ease.lang.unittest.test >>>
17:40:00 [2020-10-31T21:40:00.431Z] [INFO] 
17:40:00 [2020-10-31T21:40:00.431Z] [INFO] --- tycho-packaging-plugin:1.5.0:build-qualifier (default-build-qualifier) @ org.eclipse.ease.lang.unittest.test ---
17:40:00 [2020-10-31T21:40:00.432Z] [INFO] The project's OSGi version is 0.8.0.I202009240747
17:40:00 [2020-10-31T21:40:00.432Z] [INFO] 
17:40:00 [2020-10-31T21:40:00.432Z] [INFO] --- tycho-packaging-plugin:1.5.0:validate-id (default-validate-id) @ org.eclipse.ease.lang.unittest.test ---
17:40:00 [2020-10-31T21:40:00.432Z] [INFO] 
17:40:00 [2020-10-31T21:40:00.432Z] [INFO] --- tycho-packaging-plugin:1.5.0:validate-version (default-validate-version) @ org.eclipse.ease.lang.unittest.test ---
17:40:00 [2020-10-31T21:40:00.432Z] [INFO] 
17:40:00 [2020-10-31T21:40:00.432Z] [INFO] <<< maven-javadoc-plugin:2.9.1:javadoc (build-docs) < generate-sources @ org.eclipse.ease.lang.unittest.test <<<
17:40:00 [2020-10-31T21:40:00.432Z] [INFO] 
17:40:00 [2020-10-31T21:40:00.432Z] [INFO] 
17:40:00 [2020-10-31T21:40:00.432Z] [INFO] --- maven-javadoc-plugin:2.9.1:javadoc (build-docs) @ org.eclipse.ease.lang.unittest.test ---
17:40:00 [2020-10-31T21:40:00.432Z] [ERROR] Error fetching link: http://help.eclipse.org/oxygen/topic/org.eclipse.platform.doc.isv/reference/api/package-list. Ignored it.
17:40:00 [2020-10-31T21:40:00.432Z] [ERROR] Error fetching link: https://ci.eclipse.org/ease/job/ease.build.core/JavaDoc/package-list. Ignored it.
17:40:01 [2020-10-31T21:40:01.378Z] [INFO] 
17:40:01 [2020-10-31T21:40:01.378Z] Loading source files for package org.eclipse.ease.lang.unittest...
17:40:01 [2020-10-31T21:40:01.378Z] Constructing Javadoc information...
17:40:01 [2020-10-31T21:40:01.378Z] WARNING: Cannot open location "/home/jenkins/agent/workspace/ease.verify.core.target.2019-03/tests/org.eclipse.ease.lang.unittest.test/target/javadoc-bundle-options/package-list"
17:40:01 [2020-10-31T21:40:01.378Z] No plugin definition found, skipping
17:40:01 [2020-10-31T21:40:01.378Z] No plugin definition found, skipping
17:40:01 [2020-10-31T21:40:01.378Z] [WARNING] Javadoc Warnings
17:40:01 [2020-10-31T21:40:01.378Z] [WARNING] Picked up JAVA_TOOL_OPTIONS: -Dmaven.ext.class.path="/home/jenkins/agent/workspace/ease.verify.core.target.2019-03@tmp/withMaven8fe89d1e/pipeline-maven-spy.jar" -Dorg.jenkinsci.plugins.pipeline.maven.reportsFolder="/home/jenkins/agent/workspace/ease.verify.core.target.2019-03@tmp/withMaven8fe89d1e"
17:40:01 [2020-10-31T21:40:01.378Z] [WARNING] javadoc: warning - The old Doclet and Taglet APIs in the packages
17:40:01 [2020-10-31T21:40:01.378Z] [WARNING] com.sun.javadoc, com.sun.tools.doclets and their implementations
17:40:01 [2020-10-31T21:40:01.378Z] [WARNING] are planned to be removed in a future JDK release. These
17:40:01 [2020-10-31T21:40:01.378Z] [WARNING] components have been superseded by the new APIs in jdk.javadoc.doclet.
17:40:01 [2020-10-31T21:40:01.378Z] [WARNING] Users are strongly recommended to migrate to the new APIs.
17:40:01 [2020-10-31T21:40:01.378Z] [INFO] 
17:40:01 [2020-10-31T21:40:01.378Z] [INFO] --- build-helper-maven-plugin:1.9.1:add-resource (add_help) @ org.eclipse.ease.lang.unittest.test ---
17:40:01 [2020-10-31T21:40:01.378Z] [INFO] 
17:40:01 [2020-10-31T21:40:01.378Z] [INFO] --- maven-resources-plugin:2.4.3:resources (default-resources) @ org.eclipse.ease.lang.unittest.test ---
17:40:01 [2020-10-31T21:40:01.378Z] [INFO] Using 'UTF-8' encoding to copy filtered resources.
17:40:01 [2020-10-31T21:40:01.378Z] [INFO] skip non existing resourceDirectory /home/jenkins/agent/workspace/ease.verify.core.target.2019-03/tests/org.eclipse.ease.lang.unittest.test/src/main/resources
17:40:01 [2020-10-31T21:40:01.378Z] [INFO] skip non existing resourceDirectory /home/jenkins/agent/workspace/ease.verify.core.target.2019-03/tests/org.eclipse.ease.lang.unittest.test/help
17:40:01 [2020-10-31T21:40:01.378Z] [INFO] 
17:40:01 [2020-10-31T21:40:01.378Z] [INFO] --- tycho-compiler-plugin:1.5.0:compile (default-compile) @ org.eclipse.ease.lang.unittest.test ---
17:40:01 [2020-10-31T21:40:01.378Z] [INFO] Compiling 3 source files to /home/jenkins/agent/workspace/ease.verify.core.target.2019-03/tests/org.eclipse.ease.lang.unittest.test/target/classes
17:40:01 [2020-10-31T21:40:01.634Z] [INFO] 
17:40:01 [2020-10-31T21:40:01.634Z] [INFO] --- maven-resources-plugin:2.4.3:testResources (default-testResources) @ org.eclipse.ease.lang.unittest.test ---
17:40:01 [2020-10-31T21:40:01.634Z] [INFO] Using 'UTF-8' encoding to copy filtered resources.
17:40:01 [2020-10-31T21:40:01.634Z] [INFO] skip non existing resourceDirectory /home/jenkins/agent/workspace/ease.verify.core.target.2019-03/tests/org.eclipse.ease.lang.unittest.test/src/test/resources
17:40:01 [2020-10-31T21:40:01.634Z] [INFO] 
17:40:01 [2020-10-31T21:40:01.634Z] [INFO] --- tycho-source-plugin:1.5.0:plugin-source (plugin-source) @ org.eclipse.ease.lang.unittest.test ---
17:40:01 [2020-10-31T21:40:01.634Z] [WARNING] Bundle-Name header not found in /home/jenkins/agent/workspace/ease.verify.core.target.2019-03/tests/org.eclipse.ease.lang.unittest.test/META-INF/MANIFEST.MF, fallback to Bundle-SymbolicName for source bundle
17:40:01 [2020-10-31T21:40:01.634Z] [WARNING] Bundle-Vendor header not found in /home/jenkins/agent/workspace/ease.verify.core.target.2019-03/tests/org.eclipse.ease.lang.unittest.test/META-INF/MANIFEST.MF, fallback to 'unknown' for source bundle
17:40:01 [2020-10-31T21:40:01.634Z] [INFO] Building jar: /home/jenkins/agent/workspace/ease.verify.core.target.2019-03/tests/org.eclipse.ease.lang.unittest.test/target/org.eclipse.ease.lang.unittest.test-0.8.0-SNAPSHOT-sources.jar
17:40:01 [2020-10-31T21:40:01.634Z] [INFO] 
17:40:01 [2020-10-31T21:40:01.634Z] [INFO] --- target-platform-configuration:1.5.0:target-platform (default-target-platform) @ org.eclipse.ease.lang.unittest.test ---
17:40:01 [2020-10-31T21:40:01.634Z] [INFO] 
17:40:01 [2020-10-31T21:40:01.634Z] [INFO] --- tycho-packaging-plugin:1.5.0:package-plugin (default-package-plugin) @ org.eclipse.ease.lang.unittest.test ---
17:40:01 [2020-10-31T21:40:01.634Z] [INFO] Building jar: /home/jenkins/agent/workspace/ease.verify.core.target.2019-03/tests/org.eclipse.ease.lang.unittest.test/target/org.eclipse.ease.lang.unittest.test-0.8.0-SNAPSHOT.jar
17:40:01 [2020-10-31T21:40:01.634Z] [INFO] 
17:40:01 [2020-10-31T21:40:01.634Z] [INFO] --- tycho-p2-plugin:1.5.0:p2-metadata-default (default-p2-metadata-default) @ org.eclipse.ease.lang.unittest.test ---
17:40:01 [2020-10-31T21:40:01.634Z] [INFO] 
17:40:01 [2020-10-31T21:40:01.634Z] [INFO] --- tycho-source-feature-plugin:1.5.0:source-feature (source-feature) @ org.eclipse.ease.lang.unittest.test ---
17:40:01 [2020-10-31T21:40:01.634Z] [INFO] 
17:40:01 [2020-10-31T21:40:01.634Z] [INFO] --- tycho-p2-plugin:1.5.0:p2-metadata (attached-p2-metadata) @ org.eclipse.ease.lang.unittest.test ---
17:40:01 [2020-10-31T21:40:01.634Z] [INFO] 
17:40:01 [2020-10-31T21:40:01.634Z] [INFO] --- tycho-surefire-plugin:1.5.0:test (default-test) @ org.eclipse.ease.lang.unittest.test ---
17:40:01 [2020-10-31T21:40:01.634Z] [INFO] Expected eclipse log file: /home/jenkins/agent/workspace/ease.verify.core.target.2019-03/tests/org.eclipse.ease.lang.unittest.test/target/work/data/.metadata/.log
17:40:01 [2020-10-31T21:40:01.634Z] [INFO] Command line:
17:40:01 [2020-10-31T21:40:01.634Z] 	[/opt/tools/java/openjdk/jdk-11/11.0.2+9/bin/java, -Dosgi.noShutdown=false, -Dosgi.os=linux, -Dosgi.ws=gtk, -Dosgi.arch=x86_64, -Dosgi.clean=true, -jar, /home/jenkins/.m2/repository/p2/osgi/bundle/org.eclipse.equinox.launcher/1.5.800.v20200727-1323/org.eclipse.equinox.launcher-1.5.800.v20200727-1323.jar, -data, /home/jenkins/agent/workspace/ease.verify.core.target.2019-03/tests/org.eclipse.ease.lang.unittest.test/target/work/data, -install, /home/jenkins/agent/workspace/ease.verify.core.target.2019-03/tests/org.eclipse.ease.lang.unittest.test/target/work, -configuration, /home/jenkins/agent/workspace/ease.verify.core.target.2019-03/tests/org.eclipse.ease.lang.unittest.test/target/work/configuration, -application, org.eclipse.tycho.surefire.osgibooter.headlesstest, -testproperties, /home/jenkins/agent/workspace/ease.verify.core.target.2019-03/tests/org.eclipse.ease.lang.unittest.test/target/surefire.properties]
17:40:01 [2020-10-31T21:40:01.634Z] Picked up JAVA_TOOL_OPTIONS: -Dmaven.ext.class.path="/home/jenkins/agent/workspace/ease.verify.core.target.2019-03@tmp/withMaven8fe89d1e/pipeline-maven-spy.jar" -Dorg.jenkinsci.plugins.pipeline.maven.reportsFolder="/home/jenkins/agent/workspace/ease.verify.core.target.2019-03@tmp/withMaven8fe89d1e" 
17:40:03 [2020-10-31T21:40:03.564Z] Running org.eclipse.ease.lang.unittest.ClassicJavaScriptTest
17:40:04 [2020-10-31T21:40:04.928Z] Tests run: 7, Failures: 0, Errors: 0, Skipped: 0, Time elapsed: 1.496 s - in org.eclipse.ease.lang.unittest.ClassicJavaScriptTest
17:40:04 [2020-10-31T21:40:04.928Z] folderStatus(org.eclipse.ease.lang.unittest.ClassicJavaScriptTest)  Time elapsed: 0.636 s
17:40:04 [2020-10-31T21:40:04.928Z] errorTestStatus(org.eclipse.ease.lang.unittest.ClassicJavaScriptTest)  Time elapsed: 0.197 s
17:40:04 [2020-10-31T21:40:04.928Z] failureTestStatus(org.eclipse.ease.lang.unittest.ClassicJavaScriptTest)  Time elapsed: 0.116 s
17:40:04 [2020-10-31T21:40:04.928Z] verifyOutput(org.eclipse.ease.lang.unittest.ClassicJavaScriptTest)  Time elapsed: 0.142 s
17:40:04 [2020-10-31T21:40:04.928Z] suiteStatus(org.eclipse.ease.lang.unittest.ClassicJavaScriptTest)  Time elapsed: 0.11 s
17:40:04 [2020-10-31T21:40:04.928Z] ignoreTestStatus(org.eclipse.ease.lang.unittest.ClassicJavaScriptTest)  Time elapsed: 0.115 s
17:40:04 [2020-10-31T21:40:04.928Z] passTestStatus(org.eclipse.ease.lang.unittest.ClassicJavaScriptTest)  Time elapsed: 0.097 s
17:40:04 [2020-10-31T21:40:04.928Z] Running org.eclipse.ease.lang.unittest.ModernJavaScriptTest
17:40:05 [2020-10-31T21:40:05.855Z] Tests run: 8, Failures: 0, Errors: 0, Skipped: 0, Time elapsed: 0.796 s - in org.eclipse.ease.lang.unittest.ModernJavaScriptTest
17:40:05 [2020-10-31T21:40:05.855Z] folderStatus(org.eclipse.ease.lang.unittest.ModernJavaScriptTest)  Time elapsed: 0.131 s
17:40:05 [2020-10-31T21:40:05.855Z] verifyOutput(org.eclipse.ease.lang.unittest.ModernJavaScriptTest)  Time elapsed: 0.133 s
17:40:05 [2020-10-31T21:40:05.855Z] suiteStatus(org.eclipse.ease.lang.unittest.ModernJavaScriptTest)  Time elapsed: 0.099 s
17:40:05 [2020-10-31T21:40:05.855Z] ignoreTestStatus(org.eclipse.ease.lang.unittest.ModernJavaScriptTest)  Time elapsed: 0.098 s
17:40:05 [2020-10-31T21:40:05.855Z] ignoreTestClassStatus(org.eclipse.ease.lang.unittest.ModernJavaScriptTest)  Time elapsed: 0.07 s
17:40:05 [2020-10-31T21:40:05.855Z] failureTestClassStatus(org.eclipse.ease.lang.unittest.ModernJavaScriptTest)  Time elapsed: 0.089 s
17:40:05 [2020-10-31T21:40:05.855Z] errorTestClassStatus(org.eclipse.ease.lang.unittest.ModernJavaScriptTest)  Time elapsed: 0.089 s
17:40:05 [2020-10-31T21:40:05.855Z] passTestClassStatus(org.eclipse.ease.lang.unittest.ModernJavaScriptTest)  Time elapsed: 0.085 s
17:40:05 [2020-10-31T21:40:05.855Z] 
17:40:05 [2020-10-31T21:40:05.855Z] Results:
17:40:05 [2020-10-31T21:40:05.855Z] 
17:40:05 [2020-10-31T21:40:05.855Z] Tests run: 15, Failures: 0, Errors: 0, Skipped: 0
17:40:05 [2020-10-31T21:40:05.855Z] 
17:40:06 [2020-10-31T21:40:06.415Z] [INFO] All tests passed!
17:40:06 [2020-10-31T21:40:06.415Z] [INFO] 
17:40:06 [2020-10-31T21:40:06.415Z] [INFO] --- maven-install-plugin:2.3.1:install (default-install) @ org.eclipse.ease.lang.unittest.test ---
17:40:06 [2020-10-31T21:40:06.415Z] [INFO] Installing /home/jenkins/agent/workspace/ease.verify.core.target.2019-03/tests/org.eclipse.ease.lang.unittest.test/target/org.eclipse.ease.lang.unittest.test-0.8.0-SNAPSHOT.jar to /home/jenkins/.m2/repository/org/eclipse/ease/org.eclipse.ease.lang.unittest.test/0.8.0-SNAPSHOT/org.eclipse.ease.lang.unittest.test-0.8.0-SNAPSHOT.jar
17:40:06 [2020-10-31T21:40:06.415Z] [INFO] Installing /home/jenkins/agent/workspace/ease.verify.core.target.2019-03/tests/org.eclipse.ease.lang.unittest.test/pom.xml to /home/jenkins/.m2/repository/org/eclipse/ease/org.eclipse.ease.lang.unittest.test/0.8.0-SNAPSHOT/org.eclipse.ease.lang.unittest.test-0.8.0-SNAPSHOT.pom
17:40:06 [2020-10-31T21:40:06.415Z] [INFO] Installing /home/jenkins/agent/workspace/ease.verify.core.target.2019-03/tests/org.eclipse.ease.lang.unittest.test/target/org.eclipse.ease.lang.unittest.test-0.8.0-SNAPSHOT-sources.jar to /home/jenkins/.m2/repository/org/eclipse/ease/org.eclipse.ease.lang.unittest.test/0.8.0-SNAPSHOT/org.eclipse.ease.lang.unittest.test-0.8.0-SNAPSHOT-sources.jar
17:40:06 [2020-10-31T21:40:06.415Z] [INFO] Installing /home/jenkins/agent/workspace/ease.verify.core.target.2019-03/tests/org.eclipse.ease.lang.unittest.test/target/p2content.xml to /home/jenkins/.m2/repository/org/eclipse/ease/org.eclipse.ease.lang.unittest.test/0.8.0-SNAPSHOT/org.eclipse.ease.lang.unittest.test-0.8.0-SNAPSHOT-p2metadata.xml
17:40:06 [2020-10-31T21:40:06.416Z] [INFO] Installing /home/jenkins/agent/workspace/ease.verify.core.target.2019-03/tests/org.eclipse.ease.lang.unittest.test/target/p2artifacts.xml to /home/jenkins/.m2/repository/org/eclipse/ease/org.eclipse.ease.lang.unittest.test/0.8.0-SNAPSHOT/org.eclipse.ease.lang.unittest.test-0.8.0-SNAPSHOT-p2artifacts.xml
17:40:06 [2020-10-31T21:40:06.416Z] [INFO] Installing /home/jenkins/agent/workspace/ease.verify.core.target.2019-03/tests/org.eclipse.ease.lang.unittest.test/target/p2content.xml to /home/jenkins/.m2/repository/org/eclipse/ease/org.eclipse.ease.lang.unittest.test/0.8.0-SNAPSHOT/org.eclipse.ease.lang.unittest.test-0.8.0-SNAPSHOT-p2metadata.xml
17:40:06 [2020-10-31T21:40:06.416Z] [INFO] Installing /home/jenkins/agent/workspace/ease.verify.core.target.2019-03/tests/org.eclipse.ease.lang.unittest.test/target/p2artifacts.xml to /home/jenkins/.m2/repository/org/eclipse/ease/org.eclipse.ease.lang.unittest.test/0.8.0-SNAPSHOT/org.eclipse.ease.lang.unittest.test-0.8.0-SNAPSHOT-p2artifacts.xml
17:40:06 [2020-10-31T21:40:06.416Z] [INFO] 
17:40:06 [2020-10-31T21:40:06.416Z] [INFO] --- tycho-p2-plugin:1.5.0:update-local-index (default-update-local-index) @ org.eclipse.ease.lang.unittest.test ---
17:40:06 [2020-10-31T21:40:06.416Z] [INFO] 
17:40:06 [2020-10-31T21:40:06.416Z] [INFO] ---------< org.eclipse.ease:org.eclipse.ease.ui.scripts.test >----------
17:40:06 [2020-10-31T21:40:06.416Z] [INFO] Building org.eclipse.ease.ui.scripts.test 0.8.0-SNAPSHOT         [46/48]
17:40:06 [2020-10-31T21:40:06.416Z] [INFO] ------------------------[ eclipse-test-plugin ]-------------------------
17:40:06 [2020-10-31T21:40:06.416Z] [INFO] 
17:40:06 [2020-10-31T21:40:06.416Z] [INFO] --- maven-clean-plugin:2.5:clean (default-clean) @ org.eclipse.ease.ui.scripts.test ---
17:40:06 [2020-10-31T21:40:06.416Z] [INFO] 
17:40:06 [2020-10-31T21:40:06.416Z] [INFO] --- tycho-packaging-plugin:1.5.0:build-qualifier (default-build-qualifier) @ org.eclipse.ease.ui.scripts.test ---
17:40:06 [2020-10-31T21:40:06.416Z] [INFO] The project's OSGi version is 0.8.0.I202009240747
17:40:06 [2020-10-31T21:40:06.416Z] [INFO] 
17:40:06 [2020-10-31T21:40:06.416Z] [INFO] --- tycho-packaging-plugin:1.5.0:validate-id (default-validate-id) @ org.eclipse.ease.ui.scripts.test ---
17:40:06 [2020-10-31T21:40:06.416Z] [INFO] 
17:40:06 [2020-10-31T21:40:06.416Z] [INFO] --- tycho-packaging-plugin:1.5.0:validate-version (default-validate-version) @ org.eclipse.ease.ui.scripts.test ---
17:40:06 [2020-10-31T21:40:06.416Z] [INFO] 
17:40:06 [2020-10-31T21:40:06.416Z] [INFO] >>> maven-javadoc-plugin:2.9.1:javadoc (build-docs) > generate-sources @ org.eclipse.ease.ui.scripts.test >>>
17:40:06 [2020-10-31T21:40:06.416Z] [INFO] 
17:40:06 [2020-10-31T21:40:06.416Z] [INFO] --- tycho-packaging-plugin:1.5.0:build-qualifier (default-build-qualifier) @ org.eclipse.ease.ui.scripts.test ---
17:40:06 [2020-10-31T21:40:06.416Z] [INFO] The project's OSGi version is 0.8.0.I202009240747
17:40:06 [2020-10-31T21:40:06.416Z] [INFO] 
17:40:06 [2020-10-31T21:40:06.416Z] [INFO] --- tycho-packaging-plugin:1.5.0:validate-id (default-validate-id) @ org.eclipse.ease.ui.scripts.test ---
17:40:06 [2020-10-31T21:40:06.416Z] [INFO] 
17:40:06 [2020-10-31T21:40:06.416Z] [INFO] --- tycho-packaging-plugin:1.5.0:validate-version (default-validate-version) @ org.eclipse.ease.ui.scripts.test ---
17:40:06 [2020-10-31T21:40:06.416Z] [INFO] 
17:40:06 [2020-10-31T21:40:06.416Z] [INFO] <<< maven-javadoc-plugin:2.9.1:javadoc (build-docs) < generate-sources @ org.eclipse.ease.ui.scripts.test <<<
17:40:06 [2020-10-31T21:40:06.416Z] [INFO] 
17:40:06 [2020-10-31T21:40:06.416Z] [INFO] 
17:40:06 [2020-10-31T21:40:06.416Z] [INFO] --- maven-javadoc-plugin:2.9.1:javadoc (build-docs) @ org.eclipse.ease.ui.scripts.test ---
17:40:06 [2020-10-31T21:40:06.416Z] [ERROR] Error fetching link: http://help.eclipse.org/oxygen/topic/org.eclipse.platform.doc.isv/reference/api/package-list. Ignored it.
17:40:06 [2020-10-31T21:40:06.416Z] [ERROR] Error fetching link: https://ci.eclipse.org/ease/job/ease.build.core/JavaDoc/package-list. Ignored it.
17:40:07 [2020-10-31T21:40:07.348Z] [INFO] 
17:40:07 [2020-10-31T21:40:07.348Z] Loading source files for package org.eclipse.ease.ui.scripts.expressions.definitions...
17:40:07 [2020-10-31T21:40:07.348Z] Constructing Javadoc information...
17:40:07 [2020-10-31T21:40:07.348Z] WARNING: Cannot open location "/home/jenkins/agent/workspace/ease.verify.core.target.2019-03/tests/org.eclipse.ease.ui.scripts.test/target/javadoc-bundle-options/package-list"
17:40:07 [2020-10-31T21:40:07.348Z] No plugin definition found, skipping
17:40:07 [2020-10-31T21:40:07.348Z] No plugin definition found, skipping
17:40:07 [2020-10-31T21:40:07.348Z] [WARNING] Javadoc Warnings
17:40:07 [2020-10-31T21:40:07.348Z] [WARNING] Picked up JAVA_TOOL_OPTIONS: -Dmaven.ext.class.path="/home/jenkins/agent/workspace/ease.verify.core.target.2019-03@tmp/withMaven8fe89d1e/pipeline-maven-spy.jar" -Dorg.jenkinsci.plugins.pipeline.maven.reportsFolder="/home/jenkins/agent/workspace/ease.verify.core.target.2019-03@tmp/withMaven8fe89d1e"
17:40:07 [2020-10-31T21:40:07.348Z] [WARNING] javadoc: warning - The old Doclet and Taglet APIs in the packages
17:40:07 [2020-10-31T21:40:07.348Z] [WARNING] com.sun.javadoc, com.sun.tools.doclets and their implementations
17:40:07 [2020-10-31T21:40:07.349Z] [WARNING] are planned to be removed in a future JDK release. These
17:40:07 [2020-10-31T21:40:07.349Z] [WARNING] components have been superseded by the new APIs in jdk.javadoc.doclet.
17:40:07 [2020-10-31T21:40:07.349Z] [WARNING] Users are strongly recommended to migrate to the new APIs.
17:40:07 [2020-10-31T21:40:07.349Z] [INFO] 
17:40:07 [2020-10-31T21:40:07.349Z] [INFO] --- build-helper-maven-plugin:1.9.1:add-resource (add_help) @ org.eclipse.ease.ui.scripts.test ---
17:40:07 [2020-10-31T21:40:07.349Z] [INFO] 
17:40:07 [2020-10-31T21:40:07.349Z] [INFO] --- maven-resources-plugin:2.4.3:resources (default-resources) @ org.eclipse.ease.ui.scripts.test ---
17:40:07 [2020-10-31T21:40:07.349Z] [INFO] Using 'UTF-8' encoding to copy filtered resources.
17:40:07 [2020-10-31T21:40:07.349Z] [INFO] skip non existing resourceDirectory /home/jenkins/agent/workspace/ease.verify.core.target.2019-03/tests/org.eclipse.ease.ui.scripts.test/src/main/resources
17:40:07 [2020-10-31T21:40:07.349Z] [INFO] skip non existing resourceDirectory /home/jenkins/agent/workspace/ease.verify.core.target.2019-03/tests/org.eclipse.ease.ui.scripts.test/help
17:40:07 [2020-10-31T21:40:07.349Z] [INFO] 
17:40:07 [2020-10-31T21:40:07.349Z] [INFO] --- tycho-compiler-plugin:1.5.0:compile (default-compile) @ org.eclipse.ease.ui.scripts.test ---
17:40:07 [2020-10-31T21:40:07.349Z] [INFO] Compiling 1 source file to /home/jenkins/agent/workspace/ease.verify.core.target.2019-03/tests/org.eclipse.ease.ui.scripts.test/target/classes
17:40:07 [2020-10-31T21:40:07.604Z] [INFO] 
17:40:07 [2020-10-31T21:40:07.604Z] [INFO] --- maven-resources-plugin:2.4.3:testResources (default-testResources) @ org.eclipse.ease.ui.scripts.test ---
17:40:07 [2020-10-31T21:40:07.604Z] [INFO] Using 'UTF-8' encoding to copy filtered resources.
17:40:07 [2020-10-31T21:40:07.604Z] [INFO] skip non existing resourceDirectory /home/jenkins/agent/workspace/ease.verify.core.target.2019-03/tests/org.eclipse.ease.ui.scripts.test/src/test/resources
17:40:07 [2020-10-31T21:40:07.604Z] [INFO] 
17:40:07 [2020-10-31T21:40:07.604Z] [INFO] --- tycho-source-plugin:1.5.0:plugin-source (plugin-source) @ org.eclipse.ease.ui.scripts.test ---
17:40:07 [2020-10-31T21:40:07.604Z] [INFO] Building jar: /home/jenkins/agent/workspace/ease.verify.core.target.2019-03/tests/org.eclipse.ease.ui.scripts.test/target/org.eclipse.ease.ui.scripts.test-0.8.0-SNAPSHOT-sources.jar
17:40:07 [2020-10-31T21:40:07.604Z] [INFO] 
17:40:07 [2020-10-31T21:40:07.604Z] [INFO] --- target-platform-configuration:1.5.0:target-platform (default-target-platform) @ org.eclipse.ease.ui.scripts.test ---
17:40:07 [2020-10-31T21:40:07.604Z] [INFO] 
17:40:07 [2020-10-31T21:40:07.604Z] [INFO] --- tycho-packaging-plugin:1.5.0:package-plugin (default-package-plugin) @ org.eclipse.ease.ui.scripts.test ---
17:40:07 [2020-10-31T21:40:07.604Z] [INFO] Building jar: /home/jenkins/agent/workspace/ease.verify.core.target.2019-03/tests/org.eclipse.ease.ui.scripts.test/target/org.eclipse.ease.ui.scripts.test-0.8.0-SNAPSHOT.jar
17:40:07 [2020-10-31T21:40:07.604Z] [INFO] 
17:40:07 [2020-10-31T21:40:07.604Z] [INFO] --- tycho-p2-plugin:1.5.0:p2-metadata-default (default-p2-metadata-default) @ org.eclipse.ease.ui.scripts.test ---
17:40:07 [2020-10-31T21:40:07.604Z] [INFO] 
17:40:07 [2020-10-31T21:40:07.604Z] [INFO] --- tycho-source-feature-plugin:1.5.0:source-feature (source-feature) @ org.eclipse.ease.ui.scripts.test ---
17:40:07 [2020-10-31T21:40:07.604Z] [INFO] 
17:40:07 [2020-10-31T21:40:07.604Z] [INFO] --- tycho-p2-plugin:1.5.0:p2-metadata (attached-p2-metadata) @ org.eclipse.ease.ui.scripts.test ---
17:40:07 [2020-10-31T21:40:07.604Z] [INFO] 
17:40:07 [2020-10-31T21:40:07.604Z] [INFO] --- tycho-surefire-plugin:1.5.0:test (default-test) @ org.eclipse.ease.ui.scripts.test ---
17:40:07 [2020-10-31T21:40:07.604Z] [INFO] Expected eclipse log file: /home/jenkins/agent/workspace/ease.verify.core.target.2019-03/tests/org.eclipse.ease.ui.scripts.test/target/work/data/.metadata/.log
17:40:07 [2020-10-31T21:40:07.604Z] [INFO] Command line:
17:40:07 [2020-10-31T21:40:07.605Z] 	[/opt/tools/java/openjdk/jdk-11/11.0.2+9/bin/java, -Dosgi.noShutdown=false, -Dosgi.os=linux, -Dosgi.ws=gtk, -Dosgi.arch=x86_64, -Dosgi.clean=true, -jar, /home/jenkins/.m2/repository/p2/osgi/bundle/org.eclipse.equinox.launcher/1.5.800.v20200727-1323/org.eclipse.equinox.launcher-1.5.800.v20200727-1323.jar, -data, /home/jenkins/agent/workspace/ease.verify.core.target.2019-03/tests/org.eclipse.ease.ui.scripts.test/target/work/data, -install, /home/jenkins/agent/workspace/ease.verify.core.target.2019-03/tests/org.eclipse.ease.ui.scripts.test/target/work, -configuration, /home/jenkins/agent/workspace/ease.verify.core.target.2019-03/tests/org.eclipse.ease.ui.scripts.test/target/work/configuration, -application, org.eclipse.tycho.surefire.osgibooter.headlesstest, -testproperties, /home/jenkins/agent/workspace/ease.verify.core.target.2019-03/tests/org.eclipse.ease.ui.scripts.test/target/surefire.properties]
17:40:07 [2020-10-31T21:40:07.605Z] Picked up JAVA_TOOL_OPTIONS: -Dmaven.ext.class.path="/home/jenkins/agent/workspace/ease.verify.core.target.2019-03@tmp/withMaven8fe89d1e/pipeline-maven-spy.jar" -Dorg.jenkinsci.plugins.pipeline.maven.reportsFolder="/home/jenkins/agent/workspace/ease.verify.core.target.2019-03@tmp/withMaven8fe89d1e" 
17:40:09 [2020-10-31T21:40:09.547Z] Running org.eclipse.ease.ui.scripts.expressions.definitions.ExpressionFactoryTest
17:40:09 [2020-10-31T21:40:09.547Z] Tests run: 14, Failures: 0, Errors: 0, Skipped: 0, Time elapsed: 0.049 s - in org.eclipse.ease.ui.scripts.expressions.definitions.ExpressionFactoryTest
17:40:09 [2020-10-31T21:40:09.547Z] loadClassWithExpression  Time elapsed: 0.033 s
17:40:09 [2020-10-31T21:40:09.547Z] createWithExpression  Time elapsed: 0 s
17:40:09 [2020-10-31T21:40:09.547Z] createReferenceExpression  Time elapsed: 0 s
17:40:09 [2020-10-31T21:40:09.547Z] loadClassReferenceExpression  Time elapsed: 0.001 s
17:40:09 [2020-10-31T21:40:09.547Z] loadClassTestExpression  Time elapsed: 0.001 s
17:40:09 [2020-10-31T21:40:09.548Z] createEqualsExpression  Time elapsed: 0 s
17:40:09 [2020-10-31T21:40:09.548Z] loadClassCountExpression  Time elapsed: 0 s
17:40:09 [2020-10-31T21:40:09.548Z] loadClassOrExpression  Time elapsed: 0.001 s
17:40:09 [2020-10-31T21:40:09.548Z] createTestExpression  Time elapsed: 0.002 s
17:40:09 [2020-10-31T21:40:09.548Z] createOrExpression  Time elapsed: 0.001 s
17:40:09 [2020-10-31T21:40:09.548Z] loadClassAndExpression  Time elapsed: 0.001 s
17:40:09 [2020-10-31T21:40:09.548Z] createAndExpression  Time elapsed: 0 s
17:40:09 [2020-10-31T21:40:09.548Z] loadClassEqualsExpression  Time elapsed: 0 s
17:40:09 [2020-10-31T21:40:09.548Z] createCountExpression  Time elapsed: 0.001 s
17:40:09 [2020-10-31T21:40:09.548Z] 
17:40:09 [2020-10-31T21:40:09.548Z] Results:
17:40:09 [2020-10-31T21:40:09.548Z] 
17:40:09 [2020-10-31T21:40:09.548Z] Tests run: 14, Failures: 0, Errors: 0, Skipped: 0
17:40:09 [2020-10-31T21:40:09.548Z] 
17:40:10 [2020-10-31T21:40:10.110Z] [INFO] All tests passed!
17:40:10 [2020-10-31T21:40:10.110Z] [INFO] 
17:40:10 [2020-10-31T21:40:10.110Z] [INFO] --- maven-install-plugin:2.3.1:install (default-install) @ org.eclipse.ease.ui.scripts.test ---
17:40:10 [2020-10-31T21:40:10.110Z] [INFO] Installing /home/jenkins/agent/workspace/ease.verify.core.target.2019-03/tests/org.eclipse.ease.ui.scripts.test/target/org.eclipse.ease.ui.scripts.test-0.8.0-SNAPSHOT.jar to /home/jenkins/.m2/repository/org/eclipse/ease/org.eclipse.ease.ui.scripts.test/0.8.0-SNAPSHOT/org.eclipse.ease.ui.scripts.test-0.8.0-SNAPSHOT.jar
17:40:10 [2020-10-31T21:40:10.110Z] [INFO] Installing /home/jenkins/agent/workspace/ease.verify.core.target.2019-03/tests/org.eclipse.ease.ui.scripts.test/pom.xml to /home/jenkins/.m2/repository/org/eclipse/ease/org.eclipse.ease.ui.scripts.test/0.8.0-SNAPSHOT/org.eclipse.ease.ui.scripts.test-0.8.0-SNAPSHOT.pom
17:40:10 [2020-10-31T21:40:10.110Z] [INFO] Installing /home/jenkins/agent/workspace/ease.verify.core.target.2019-03/tests/org.eclipse.ease.ui.scripts.test/target/org.eclipse.ease.ui.scripts.test-0.8.0-SNAPSHOT-sources.jar to /home/jenkins/.m2/repository/org/eclipse/ease/org.eclipse.ease.ui.scripts.test/0.8.0-SNAPSHOT/org.eclipse.ease.ui.scripts.test-0.8.0-SNAPSHOT-sources.jar
17:40:10 [2020-10-31T21:40:10.110Z] [INFO] Installing /home/jenkins/agent/workspace/ease.verify.core.target.2019-03/tests/org.eclipse.ease.ui.scripts.test/target/p2content.xml to /home/jenkins/.m2/repository/org/eclipse/ease/org.eclipse.ease.ui.scripts.test/0.8.0-SNAPSHOT/org.eclipse.ease.ui.scripts.test-0.8.0-SNAPSHOT-p2metadata.xml
17:40:10 [2020-10-31T21:40:10.110Z] [INFO] Installing /home/jenkins/agent/workspace/ease.verify.core.target.2019-03/tests/org.eclipse.ease.ui.scripts.test/target/p2artifacts.xml to /home/jenkins/.m2/repository/org/eclipse/ease/org.eclipse.ease.ui.scripts.test/0.8.0-SNAPSHOT/org.eclipse.ease.ui.scripts.test-0.8.0-SNAPSHOT-p2artifacts.xml
17:40:10 [2020-10-31T21:40:10.111Z] [INFO] Installing /home/jenkins/agent/workspace/ease.verify.core.target.2019-03/tests/org.eclipse.ease.ui.scripts.test/target/p2content.xml to /home/jenkins/.m2/repository/org/eclipse/ease/org.eclipse.ease.ui.scripts.test/0.8.0-SNAPSHOT/org.eclipse.ease.ui.scripts.test-0.8.0-SNAPSHOT-p2metadata.xml
17:40:10 [2020-10-31T21:40:10.111Z] [INFO] Installing /home/jenkins/agent/workspace/ease.verify.core.target.2019-03/tests/org.eclipse.ease.ui.scripts.test/target/p2artifacts.xml to /home/jenkins/.m2/repository/org/eclipse/ease/org.eclipse.ease.ui.scripts.test/0.8.0-SNAPSHOT/org.eclipse.ease.ui.scripts.test-0.8.0-SNAPSHOT-p2artifacts.xml
17:40:10 [2020-10-31T21:40:10.111Z] [INFO] 
17:40:10 [2020-10-31T21:40:10.111Z] [INFO] --- tycho-p2-plugin:1.5.0:update-local-index (default-update-local-index) @ org.eclipse.ease.ui.scripts.test ---
17:40:10 [2020-10-31T21:40:10.111Z] [INFO] 
17:40:10 [2020-10-31T21:40:10.111Z] [INFO] -------------< org.eclipse.ease:org.eclipse.ease.ui.test >--------------
17:40:10 [2020-10-31T21:40:10.111Z] [INFO] Building org.eclipse.ease.ui.test 0.8.0-SNAPSHOT                 [47/48]
17:40:10 [2020-10-31T21:40:10.111Z] [INFO] ------------------------[ eclipse-test-plugin ]-------------------------
17:40:10 [2020-10-31T21:40:10.111Z] [INFO] 
17:40:10 [2020-10-31T21:40:10.111Z] [INFO] --- maven-clean-plugin:2.5:clean (default-clean) @ org.eclipse.ease.ui.test ---
17:40:10 [2020-10-31T21:40:10.111Z] [INFO] 
17:40:10 [2020-10-31T21:40:10.111Z] [INFO] --- tycho-packaging-plugin:1.5.0:build-qualifier (default-build-qualifier) @ org.eclipse.ease.ui.test ---
17:40:10 [2020-10-31T21:40:10.111Z] [INFO] The project's OSGi version is 0.8.0.I201910171213
17:40:10 [2020-10-31T21:40:10.111Z] [INFO] 
17:40:10 [2020-10-31T21:40:10.111Z] [INFO] --- tycho-packaging-plugin:1.5.0:validate-id (default-validate-id) @ org.eclipse.ease.ui.test ---
17:40:10 [2020-10-31T21:40:10.111Z] [INFO] 
17:40:10 [2020-10-31T21:40:10.111Z] [INFO] --- tycho-packaging-plugin:1.5.0:validate-version (default-validate-version) @ org.eclipse.ease.ui.test ---
17:40:10 [2020-10-31T21:40:10.111Z] [INFO] 
17:40:10 [2020-10-31T21:40:10.111Z] [INFO] >>> maven-javadoc-plugin:2.9.1:javadoc (build-docs) > generate-sources @ org.eclipse.ease.ui.test >>>
17:40:10 [2020-10-31T21:40:10.111Z] [INFO] 
17:40:10 [2020-10-31T21:40:10.111Z] [INFO] --- tycho-packaging-plugin:1.5.0:build-qualifier (default-build-qualifier) @ org.eclipse.ease.ui.test ---
17:40:10 [2020-10-31T21:40:10.111Z] [INFO] The project's OSGi version is 0.8.0.I201910171213
17:40:10 [2020-10-31T21:40:10.111Z] [INFO] 
17:40:10 [2020-10-31T21:40:10.111Z] [INFO] --- tycho-packaging-plugin:1.5.0:validate-id (default-validate-id) @ org.eclipse.ease.ui.test ---
17:40:10 [2020-10-31T21:40:10.111Z] [INFO] 
17:40:10 [2020-10-31T21:40:10.111Z] [INFO] --- tycho-packaging-plugin:1.5.0:validate-version (default-validate-version) @ org.eclipse.ease.ui.test ---
17:40:10 [2020-10-31T21:40:10.111Z] [INFO] 
17:40:10 [2020-10-31T21:40:10.111Z] [INFO] <<< maven-javadoc-plugin:2.9.1:javadoc (build-docs) < generate-sources @ org.eclipse.ease.ui.test <<<
17:40:10 [2020-10-31T21:40:10.111Z] [INFO] 
17:40:10 [2020-10-31T21:40:10.111Z] [INFO] 
17:40:10 [2020-10-31T21:40:10.111Z] [INFO] --- maven-javadoc-plugin:2.9.1:javadoc (build-docs) @ org.eclipse.ease.ui.test ---
17:40:10 [2020-10-31T21:40:10.366Z] [ERROR] Error fetching link: http://help.eclipse.org/oxygen/topic/org.eclipse.platform.doc.isv/reference/api/package-list. Ignored it.
17:40:10 [2020-10-31T21:40:10.366Z] [ERROR] Error fetching link: https://ci.eclipse.org/ease/job/ease.build.core/JavaDoc/package-list. Ignored it.
17:40:11 [2020-10-31T21:40:11.292Z] [INFO] 
17:40:11 [2020-10-31T21:40:11.292Z] Loading source files for package org.eclipse.ease.ui.completion...
17:40:11 [2020-10-31T21:40:11.292Z] Loading source files for package org.eclipse.ease.ui.completion.provider...
17:40:11 [2020-10-31T21:40:11.292Z] Loading source files for package org.eclipse.ease.ui.completions.java.provider...
17:40:11 [2020-10-31T21:40:11.292Z] Loading source files for package org.eclipse.ease.ui.help.hovers...
17:40:11 [2020-10-31T21:40:11.292Z] Constructing Javadoc information...
17:40:11 [2020-10-31T21:40:11.292Z] WARNING: Cannot open location "/home/jenkins/agent/workspace/ease.verify.core.target.2019-03/tests/org.eclipse.ease.ui.test/target/javadoc-bundle-options/package-list"
17:40:11 [2020-10-31T21:40:11.293Z] [WARNING] Javadoc Warnings
17:40:11 [2020-10-31T21:40:11.293Z] [WARNING] Picked up JAVA_TOOL_OPTIONS: -Dmaven.ext.class.path="/home/jenkins/agent/workspace/ease.verify.core.target.2019-03@tmp/withMaven8fe89d1e/pipeline-maven-spy.jar" -Dorg.jenkinsci.plugins.pipeline.maven.reportsFolder="/home/jenkins/agent/workspace/ease.verify.core.target.2019-03@tmp/withMaven8fe89d1e"
17:40:11 [2020-10-31T21:40:11.293Z] [WARNING] javadoc: warning - The old Doclet and Taglet APIs in the packages
17:40:11 [2020-10-31T21:40:11.293Z] [WARNING] com.sun.javadoc, com.sun.tools.doclets and their implementations
17:40:11 [2020-10-31T21:40:11.293Z] [WARNING] are planned to be removed in a future JDK release. These
17:40:11 [2020-10-31T21:40:11.293Z] [WARNING] components have been superseded by the new APIs in jdk.javadoc.doclet.
17:40:11 [2020-10-31T21:40:11.293Z] [WARNING] Users are strongly recommended to migrate to the new APIs.
17:40:11 [2020-10-31T21:40:11.293Z] [INFO] 
17:40:11 [2020-10-31T21:40:11.293Z] [INFO] --- build-helper-maven-plugin:1.9.1:add-resource (add_help) @ org.eclipse.ease.ui.test ---
17:40:11 [2020-10-31T21:40:11.293Z] [INFO] 
17:40:11 [2020-10-31T21:40:11.293Z] [INFO] --- maven-resources-plugin:2.4.3:resources (default-resources) @ org.eclipse.ease.ui.test ---
17:40:11 [2020-10-31T21:40:11.293Z] [INFO] Using 'UTF-8' encoding to copy filtered resources.
17:40:11 [2020-10-31T21:40:11.581Z] [INFO] skip non existing resourceDirectory /home/jenkins/agent/workspace/ease.verify.core.target.2019-03/tests/org.eclipse.ease.ui.test/src/main/resources
17:40:11 [2020-10-31T21:40:11.581Z] [INFO] Copying 2 resources to help
17:40:11 [2020-10-31T21:40:11.581Z] [INFO] 
17:40:11 [2020-10-31T21:40:11.581Z] [INFO] --- tycho-compiler-plugin:1.5.0:compile (default-compile) @ org.eclipse.ease.ui.test ---
17:40:11 [2020-10-31T21:40:11.581Z] [INFO] Compiling 6 source files to /home/jenkins/agent/workspace/ease.verify.core.target.2019-03/tests/org.eclipse.ease.ui.test/target/classes
17:40:11 [2020-10-31T21:40:11.581Z] [INFO] 
17:40:11 [2020-10-31T21:40:11.581Z] [INFO] --- maven-resources-plugin:2.4.3:testResources (default-testResources) @ org.eclipse.ease.ui.test ---
17:40:11 [2020-10-31T21:40:11.581Z] [INFO] Using 'UTF-8' encoding to copy filtered resources.
17:40:11 [2020-10-31T21:40:11.581Z] [INFO] skip non existing resourceDirectory /home/jenkins/agent/workspace/ease.verify.core.target.2019-03/tests/org.eclipse.ease.ui.test/src/test/resources
17:40:11 [2020-10-31T21:40:11.581Z] [INFO] 
17:40:11 [2020-10-31T21:40:11.581Z] [INFO] --- tycho-source-plugin:1.5.0:plugin-source (plugin-source) @ org.eclipse.ease.ui.test ---
17:40:11 [2020-10-31T21:40:11.581Z] [WARNING] Bundle-Vendor header not found in /home/jenkins/agent/workspace/ease.verify.core.target.2019-03/tests/org.eclipse.ease.ui.test/META-INF/MANIFEST.MF, fallback to 'unknown' for source bundle
17:40:11 [2020-10-31T21:40:11.581Z] [INFO] Building jar: /home/jenkins/agent/workspace/ease.verify.core.target.2019-03/tests/org.eclipse.ease.ui.test/target/org.eclipse.ease.ui.test-0.8.0-SNAPSHOT-sources.jar
17:40:11 [2020-10-31T21:40:11.581Z] [INFO] 
17:40:11 [2020-10-31T21:40:11.581Z] [INFO] --- target-platform-configuration:1.5.0:target-platform (default-target-platform) @ org.eclipse.ease.ui.test ---
17:40:11 [2020-10-31T21:40:11.581Z] [INFO] 
17:40:11 [2020-10-31T21:40:11.581Z] [INFO] --- tycho-packaging-plugin:1.5.0:package-plugin (default-package-plugin) @ org.eclipse.ease.ui.test ---
17:40:11 [2020-10-31T21:40:11.581Z] [INFO] Building jar: /home/jenkins/agent/workspace/ease.verify.core.target.2019-03/tests/org.eclipse.ease.ui.test/target/org.eclipse.ease.ui.test-0.8.0-SNAPSHOT.jar
17:40:11 [2020-10-31T21:40:11.581Z] [INFO] 
17:40:11 [2020-10-31T21:40:11.581Z] [INFO] --- tycho-p2-plugin:1.5.0:p2-metadata-default (default-p2-metadata-default) @ org.eclipse.ease.ui.test ---
17:40:11 [2020-10-31T21:40:11.582Z] [INFO] 
17:40:11 [2020-10-31T21:40:11.582Z] [INFO] --- tycho-source-feature-plugin:1.5.0:source-feature (source-feature) @ org.eclipse.ease.ui.test ---
17:40:11 [2020-10-31T21:40:11.582Z] [INFO] 
17:40:11 [2020-10-31T21:40:11.582Z] [INFO] --- tycho-p2-plugin:1.5.0:p2-metadata (attached-p2-metadata) @ org.eclipse.ease.ui.test ---
17:40:11 [2020-10-31T21:40:11.582Z] [INFO] 
17:40:11 [2020-10-31T21:40:11.582Z] [INFO] --- tycho-surefire-plugin:1.5.0:test (default-test) @ org.eclipse.ease.ui.test ---
17:40:11 [2020-10-31T21:40:11.838Z] [INFO] Expected eclipse log file: /home/jenkins/agent/workspace/ease.verify.core.target.2019-03/tests/org.eclipse.ease.ui.test/target/work/data/.metadata/.log
17:40:11 [2020-10-31T21:40:11.838Z] [INFO] Command line:
17:40:11 [2020-10-31T21:40:11.838Z] 	[/opt/tools/java/openjdk/jdk-11/11.0.2+9/bin/java, -Dosgi.noShutdown=false, -Dosgi.os=linux, -Dosgi.ws=gtk, -Dosgi.arch=x86_64, -Dosgi.clean=true, -jar, /home/jenkins/.m2/repository/p2/osgi/bundle/org.eclipse.equinox.launcher/1.5.800.v20200727-1323/org.eclipse.equinox.launcher-1.5.800.v20200727-1323.jar, -data, /home/jenkins/agent/workspace/ease.verify.core.target.2019-03/tests/org.eclipse.ease.ui.test/target/work/data, -install, /home/jenkins/agent/workspace/ease.verify.core.target.2019-03/tests/org.eclipse.ease.ui.test/target/work, -configuration, /home/jenkins/agent/workspace/ease.verify.core.target.2019-03/tests/org.eclipse.ease.ui.test/target/work/configuration, -application, org.eclipse.tycho.surefire.osgibooter.headlesstest, -testproperties, /home/jenkins/agent/workspace/ease.verify.core.target.2019-03/tests/org.eclipse.ease.ui.test/target/surefire.properties]
17:40:11 [2020-10-31T21:40:11.838Z] Picked up JAVA_TOOL_OPTIONS: -Dmaven.ext.class.path="/home/jenkins/agent/workspace/ease.verify.core.target.2019-03@tmp/withMaven8fe89d1e/pipeline-maven-spy.jar" -Dorg.jenkinsci.plugins.pipeline.maven.reportsFolder="/home/jenkins/agent/workspace/ease.verify.core.target.2019-03@tmp/withMaven8fe89d1e" 
17:40:13 [2020-10-31T21:40:13.781Z] Running org.eclipse.ease.ui.help.hovers.ModuleHelpTest
17:40:13 [2020-10-31T21:40:13.781Z] Tests run: 4, Failures: 0, Errors: 0, Skipped: 4, Time elapsed: 0.029 s - in org.eclipse.ease.ui.help.hovers.ModuleHelpTest
17:40:13 [2020-10-31T21:40:13.781Z] getModuleHelpLocation(org.eclipse.ease.ui.help.hovers.ModuleHelpTest) skipped
17:40:13 [2020-10-31T21:40:13.781Z] getModuleHelp(org.eclipse.ease.ui.help.hovers.ModuleHelpTest) skipped
17:40:13 [2020-10-31T21:40:13.781Z] getMethodHelp(org.eclipse.ease.ui.help.hovers.ModuleHelpTest) skipped
17:40:13 [2020-10-31T21:40:13.781Z] getConstantHelp(org.eclipse.ease.ui.help.hovers.ModuleHelpTest) skipped
17:40:13 [2020-10-31T21:40:13.781Z] Running org.eclipse.ease.ui.completion.provider.AbstractFileLocationCompletionProviderTest
17:40:13 [2020-10-31T21:40:13.781Z] Tests run: 8, Failures: 0, Errors: 0, Skipped: 8, Time elapsed: 0.097 s - in org.eclipse.ease.ui.completion.provider.AbstractFileLocationCompletionProviderTest
17:40:13 [2020-10-31T21:40:13.781Z] workspaceProjectProposals(org.eclipse.ease.ui.completion.provider.AbstractFileLocationCompletionProviderTest) skipped
17:40:13 [2020-10-31T21:40:13.781Z] checkOperatingSystem(org.eclipse.ease.ui.completion.provider.AbstractFileLocationCompletionProviderTest) skipped
17:40:13 [2020-10-31T21:40:13.781Z] absoluteRootWorkspaceProposals(org.eclipse.ease.ui.completion.provider.AbstractFileLocationCompletionProviderTest) skipped
17:40:13 [2020-10-31T21:40:13.781Z] workspaceFolderProposals(org.eclipse.ease.ui.completion.provider.AbstractFileLocationCompletionProviderTest) skipped
17:40:13 [2020-10-31T21:40:13.781Z] fileSystemFolderProposals(org.eclipse.ease.ui.completion.provider.AbstractFileLocationCompletionProviderTest) skipped
17:40:13 [2020-10-31T21:40:13.781Z] workspaceProposals(org.eclipse.ease.ui.completion.provider.AbstractFileLocationCompletionProviderTest) skipped
17:40:13 [2020-10-31T21:40:13.781Z] relativeRootWorkspaceProposals(org.eclipse.ease.ui.completion.provider.AbstractFileLocationCompletionProviderTest) skipped
17:40:13 [2020-10-31T21:40:13.781Z] fileSystemRootProposals(org.eclipse.ease.ui.completion.provider.AbstractFileLocationCompletionProviderTest) skipped
17:40:13 [2020-10-31T21:40:13.781Z] Running org.eclipse.ease.ui.completion.CompletionContextTest
17:40:13 [2020-10-31T21:40:13.781Z] Tests run: 9, Failures: 0, Errors: 0, Skipped: 0, Time elapsed: 0.009 s - in org.eclipse.ease.ui.completion.CompletionContextTest
17:40:13 [2020-10-31T21:40:13.782Z] resolveStaticClass(org.eclipse.ease.ui.completion.CompletionContextTest)  Time elapsed: 0.003 s
17:40:13 [2020-10-31T21:40:13.782Z] resolveClassWithFilter(org.eclipse.ease.ui.completion.CompletionContextTest)  Time elapsed: 0.001 s
17:40:13 [2020-10-31T21:40:13.782Z] simplifyCalls(org.eclipse.ease.ui.completion.CompletionContextTest)  Time elapsed: 0 s
17:40:13 [2020-10-31T21:40:13.782Z] resolveClass(org.eclipse.ease.ui.completion.CompletionContextTest)  Time elapsed: 0.001 s
17:40:13 [2020-10-31T21:40:13.782Z] replaceEscapedStringLiterals(org.eclipse.ease.ui.completion.CompletionContextTest)  Time elapsed: 0 s
17:40:13 [2020-10-31T21:40:13.782Z] replaceSimpleStringLiterals(org.eclipse.ease.ui.completion.CompletionContextTest)  Time elapsed: 0 s
17:40:13 [2020-10-31T21:40:13.782Z] resolveStaticClassWithFilter(org.eclipse.ease.ui.completion.CompletionContextTest)  Time elapsed: 0 s
17:40:13 [2020-10-31T21:40:13.782Z] resolveClassWithParameters(org.eclipse.ease.ui.completion.CompletionContextTest)  Time elapsed: 0 s
17:40:13 [2020-10-31T21:40:13.782Z] replaceMultipleStringLiterals(org.eclipse.ease.ui.completion.CompletionContextTest)  Time elapsed: 0.001 s
17:40:13 [2020-10-31T21:40:13.782Z] Running org.eclipse.ease.ui.completions.java.provider.JavaPackagesCompletionsProviderTest
17:40:13 [2020-10-31T21:40:13.782Z] WARNING: An illegal reflective access operation has occurred
17:40:13 [2020-10-31T21:40:13.782Z] WARNING: Illegal reflective access by org.mockito.cglib.core.ReflectUtils$2 (file:/home/jenkins/.m2/repository/p2/osgi/bundle/org.mockito/1.9.5.v201605172210/org.mockito-1.9.5.v201605172210.jar) to method java.lang.ClassLoader.defineClass(java.lang.String,byte[],int,int,java.security.ProtectionDomain)
17:40:13 [2020-10-31T21:40:13.782Z] WARNING: Please consider reporting this to the maintainers of org.mockito.cglib.core.ReflectUtils$2
17:40:13 [2020-10-31T21:40:13.782Z] WARNING: Use --illegal-access=warn to enable warnings of further illegal reflective access operations
17:40:13 [2020-10-31T21:40:13.782Z] WARNING: All illegal access operations will be denied in a future release
17:40:20 [2020-10-31T21:40:20.318Z] Tests run: 4, Failures: 0, Errors: 0, Skipped: 0, Time elapsed: 5.958 s - in org.eclipse.ease.ui.completions.java.provider.JavaPackagesCompletionsProviderTest
17:40:20 [2020-10-31T21:40:20.318Z] containsJavaLangPackageProposal(org.eclipse.ease.ui.completions.java.provider.JavaPackagesCompletionsProviderTest)  Time elapsed: 0.495 s
17:40:20 [2020-10-31T21:40:20.318Z] containsOrgRootPackageProposal(org.eclipse.ease.ui.completions.java.provider.JavaPackagesCompletionsProviderTest)  Time elapsed: 0.007 s
17:40:20 [2020-10-31T21:40:20.318Z] containsJavaRootPackageProposal(org.eclipse.ease.ui.completions.java.provider.JavaPackagesCompletionsProviderTest)  Time elapsed: 0.007 s
17:40:20 [2020-10-31T21:40:20.318Z] containsOrgEclipsePackageProposal(org.eclipse.ease.ui.completions.java.provider.JavaPackagesCompletionsProviderTest)  Time elapsed: 0.091 s
17:40:20 [2020-10-31T21:40:20.319Z] Running org.eclipse.ease.ui.completions.java.provider.JavaClassCompletionsProviderTest
17:40:25 [2020-10-31T21:40:25.570Z] Tests run: 6, Failures: 0, Errors: 0, Skipped: 0, Time elapsed: 5.184 s - in org.eclipse.ease.ui.completions.java.provider.JavaClassCompletionsProviderTest
17:40:25 [2020-10-31T21:40:25.570Z] containsPackageFileCompletion(org.eclipse.ease.ui.completions.java.provider.JavaClassCompletionsProviderTest)  Time elapsed: 0.009 s
17:40:25 [2020-10-31T21:40:25.570Z] containsGlobalFileCompletion(org.eclipse.ease.ui.completions.java.provider.JavaClassCompletionsProviderTest)  Time elapsed: 0.037 s
17:40:25 [2020-10-31T21:40:25.570Z] containsJavaLangPackageProposal(org.eclipse.ease.ui.completions.java.provider.JavaClassCompletionsProviderTest)  Time elapsed: 0.071 s
17:40:25 [2020-10-31T21:40:25.570Z] containsOrgRootPackageProposal(org.eclipse.ease.ui.completions.java.provider.JavaClassCompletionsProviderTest)  Time elapsed: 0.013 s
17:40:25 [2020-10-31T21:40:25.570Z] containsJavaRootPackageProposal(org.eclipse.ease.ui.completions.java.provider.JavaClassCompletionsProviderTest)  Time elapsed: 0.005 s
17:40:25 [2020-10-31T21:40:25.570Z] containsOrgEclipsePackageProposal(org.eclipse.ease.ui.completions.java.provider.JavaClassCompletionsProviderTest)  Time elapsed: 0.043 s
17:40:25 [2020-10-31T21:40:25.570Z] 
17:40:25 [2020-10-31T21:40:25.570Z] Results:
17:40:25 [2020-10-31T21:40:25.570Z] 
17:40:25 [2020-10-31T21:40:25.570Z] Tests run: 31, Failures: 0, Errors: 0, Skipped: 12
17:40:25 [2020-10-31T21:40:25.570Z] 
17:40:26 [2020-10-31T21:40:26.131Z] [INFO] All tests passed!
17:40:26 [2020-10-31T21:40:26.131Z] [INFO] 
17:40:26 [2020-10-31T21:40:26.131Z] [INFO] --- maven-install-plugin:2.3.1:install (default-install) @ org.eclipse.ease.ui.test ---
17:40:26 [2020-10-31T21:40:26.131Z] [INFO] Installing /home/jenkins/agent/workspace/ease.verify.core.target.2019-03/tests/org.eclipse.ease.ui.test/target/org.eclipse.ease.ui.test-0.8.0-SNAPSHOT.jar to /home/jenkins/.m2/repository/org/eclipse/ease/org.eclipse.ease.ui.test/0.8.0-SNAPSHOT/org.eclipse.ease.ui.test-0.8.0-SNAPSHOT.jar
17:40:26 [2020-10-31T21:40:26.131Z] [INFO] Installing /home/jenkins/agent/workspace/ease.verify.core.target.2019-03/tests/org.eclipse.ease.ui.test/pom.xml to /home/jenkins/.m2/repository/org/eclipse/ease/org.eclipse.ease.ui.test/0.8.0-SNAPSHOT/org.eclipse.ease.ui.test-0.8.0-SNAPSHOT.pom
17:40:26 [2020-10-31T21:40:26.131Z] [INFO] Installing /home/jenkins/agent/workspace/ease.verify.core.target.2019-03/tests/org.eclipse.ease.ui.test/target/org.eclipse.ease.ui.test-0.8.0-SNAPSHOT-sources.jar to /home/jenkins/.m2/repository/org/eclipse/ease/org.eclipse.ease.ui.test/0.8.0-SNAPSHOT/org.eclipse.ease.ui.test-0.8.0-SNAPSHOT-sources.jar
17:40:26 [2020-10-31T21:40:26.131Z] [INFO] Installing /home/jenkins/agent/workspace/ease.verify.core.target.2019-03/tests/org.eclipse.ease.ui.test/target/p2content.xml to /home/jenkins/.m2/repository/org/eclipse/ease/org.eclipse.ease.ui.test/0.8.0-SNAPSHOT/org.eclipse.ease.ui.test-0.8.0-SNAPSHOT-p2metadata.xml
17:40:26 [2020-10-31T21:40:26.131Z] [INFO] Installing /home/jenkins/agent/workspace/ease.verify.core.target.2019-03/tests/org.eclipse.ease.ui.test/target/p2artifacts.xml to /home/jenkins/.m2/repository/org/eclipse/ease/org.eclipse.ease.ui.test/0.8.0-SNAPSHOT/org.eclipse.ease.ui.test-0.8.0-SNAPSHOT-p2artifacts.xml
17:40:26 [2020-10-31T21:40:26.131Z] [INFO] Installing /home/jenkins/agent/workspace/ease.verify.core.target.2019-03/tests/org.eclipse.ease.ui.test/target/p2content.xml to /home/jenkins/.m2/repository/org/eclipse/ease/org.eclipse.ease.ui.test/0.8.0-SNAPSHOT/org.eclipse.ease.ui.test-0.8.0-SNAPSHOT-p2metadata.xml
17:40:26 [2020-10-31T21:40:26.131Z] [INFO] Installing /home/jenkins/agent/workspace/ease.verify.core.target.2019-03/tests/org.eclipse.ease.ui.test/target/p2artifacts.xml to /home/jenkins/.m2/repository/org/eclipse/ease/org.eclipse.ease.ui.test/0.8.0-SNAPSHOT/org.eclipse.ease.ui.test-0.8.0-SNAPSHOT-p2artifacts.xml
17:40:26 [2020-10-31T21:40:26.131Z] [INFO] 
17:40:26 [2020-10-31T21:40:26.131Z] [INFO] --- tycho-p2-plugin:1.5.0:update-local-index (default-update-local-index) @ org.eclipse.ease.ui.test ---
17:40:26 [2020-10-31T21:40:26.131Z] [INFO] 
17:40:26 [2020-10-31T21:40:26.131Z] [INFO] ---------------------< org.eclipse.ease:ease.core >---------------------
17:40:26 [2020-10-31T21:40:26.131Z] [INFO] Building EASE (Incubation) 0.4.0-SNAPSHOT                        [48/48]
17:40:26 [2020-10-31T21:40:26.131Z] [INFO] --------------------------------[ pom ]---------------------------------
17:40:26 [2020-10-31T21:40:26.131Z] [INFO] 
17:40:26 [2020-10-31T21:40:26.131Z] [INFO] --- maven-clean-plugin:2.5:clean (default-clean) @ ease.core ---
17:40:26 [2020-10-31T21:40:26.131Z] [INFO] 
17:40:26 [2020-10-31T21:40:26.131Z] [INFO] --- maven-install-plugin:2.4:install (default-install) @ ease.core ---
17:40:26 [2020-10-31T21:40:26.131Z] [INFO] Installing /home/jenkins/agent/workspace/ease.verify.core.target.2019-03/pom.xml to /home/jenkins/.m2/repository/org/eclipse/ease/ease.core/0.4.0-SNAPSHOT/ease.core-0.4.0-SNAPSHOT.pom
17:40:26 [2020-10-31T21:40:26.132Z] [INFO] ------------------------------------------------------------------------
17:40:26 [2020-10-31T21:40:26.132Z] [INFO] Reactor Summary:
17:40:26 [2020-10-31T21:40:26.132Z] [INFO] 
17:40:26 [2020-10-31T21:40:26.132Z] [INFO] org.eclipse.ease.releng 0.8.0-SNAPSHOT ............. SUCCESS [  5.219 s]
17:40:26 [2020-10-31T21:40:26.132Z] [INFO] org.eclipse.ease.classloader 0.8.0-SNAPSHOT ........ SUCCESS [  8.853 s]
17:40:26 [2020-10-31T21:40:26.132Z] [INFO] org.eclipse.ease 0.8.0-SNAPSHOT .................... SUCCESS [  2.788 s]
17:40:26 [2020-10-31T21:40:26.132Z] [INFO] org.eclipse.ease.ui 0.8.0-SNAPSHOT ................. SUCCESS [  3.096 s]
17:40:26 [2020-10-31T21:40:26.132Z] [INFO] org.eclipse.ease.ui.completions.java 0.8.0-SNAPSHOT  SUCCESS [  2.162 s]
17:40:26 [2020-10-31T21:40:26.132Z] [INFO] org.eclipse.ease.ui.scripts 0.8.0-SNAPSHOT ......... SUCCESS [  2.519 s]
17:40:26 [2020-10-31T21:40:26.132Z] [INFO] org.eclipse.ease.lang.javascript 0.8.0-SNAPSHOT .... SUCCESS [  1.399 s]
17:40:26 [2020-10-31T21:40:26.132Z] [INFO] org.eclipse.ease.lang.scriptarchive 0.8.0-SNAPSHOT . SUCCESS [  1.496 s]
17:40:26 [2020-10-31T21:40:26.132Z] [INFO] org.eclipse.ease.lang.python 0.8.0-SNAPSHOT ........ SUCCESS [  1.910 s]
17:40:26 [2020-10-31T21:40:26.132Z] [INFO] org.eclipse.ease.lang.python.py4j 0.8.0-SNAPSHOT ... SUCCESS [  1.592 s]
17:40:26 [2020-10-31T21:40:26.132Z] [INFO] org.eclipse.ease.lang.groovy 0.8.0-SNAPSHOT ........ SUCCESS [  1.316 s]
17:40:26 [2020-10-31T21:40:26.132Z] [INFO] org.eclipse.ease.lang.groovy.interpreter 0.8.0-SNAPSHOT SUCCESS [  1.413 s]
17:40:26 [2020-10-31T21:40:26.132Z] [INFO] org.eclipse.ease.lang.unittest 0.8.0-SNAPSHOT ...... SUCCESS [  2.085 s]
17:40:26 [2020-10-31T21:40:26.132Z] [INFO] org.eclipse.ease.lang.unittest.ui 0.8.0-SNAPSHOT ... SUCCESS [  2.080 s]
17:40:26 [2020-10-31T21:40:26.132Z] [INFO] org.eclipse.ease.lang.ruby 0.8.0-SNAPSHOT .......... SUCCESS [  1.379 s]
17:40:26 [2020-10-31T21:40:26.132Z] [INFO] org.eclipse.ease.lang.ruby.jruby 0.8.0-SNAPSHOT .... SUCCESS [  1.417 s]
17:40:26 [2020-10-31T21:40:26.132Z] [INFO] org.eclipse.ease.lang.javascript.nashorn 0.8.0-SNAPSHOT SUCCESS [  1.401 s]
17:40:26 [2020-10-31T21:40:26.132Z] [INFO] org.eclipse.ease.lang.javascript.rhino 0.8.0-SNAPSHOT SUCCESS [  1.831 s]
17:40:26 [2020-10-31T21:40:26.132Z] [INFO] org.eclipse.ease.lang.python.jython 0.8.0-SNAPSHOT . SUCCESS [  1.579 s]
17:40:26 [2020-10-31T21:40:26.132Z] [INFO] org.eclipse.ease.lang.javascript.ui 0.8.0-SNAPSHOT . SUCCESS [  1.625 s]
17:40:26 [2020-10-31T21:40:26.132Z] [INFO] org.eclipse.ease.lang.jvm.compiled 0.8.0-SNAPSHOT .. SUCCESS [  1.455 s]
17:40:26 [2020-10-31T21:40:26.132Z] [INFO] org.eclipse.ease.lang.scriptarchive.ui 0.8.0-SNAPSHOT SUCCESS [  1.438 s]
17:40:26 [2020-10-31T21:40:26.132Z] [INFO] org.eclipse.ease.help 0.8.0-SNAPSHOT ............... SUCCESS [  0.174 s]
17:40:26 [2020-10-31T21:40:26.132Z] [INFO] org.eclipse.ease.feature 0.8.0-SNAPSHOT ............ SUCCESS [  0.212 s]
17:40:26 [2020-10-31T21:40:26.132Z] [INFO] org.eclipse.ease.ui.feature 0.8.0-SNAPSHOT ......... SUCCESS [  0.189 s]
17:40:26 [2020-10-31T21:40:26.132Z] [INFO] org.eclipse.ease.lang.javascript.feature 0.8.0-SNAPSHOT SUCCESS [  0.174 s]
17:40:26 [2020-10-31T21:40:26.132Z] [INFO] org.eclipse.ease.lang.python.feature 0.8.0-SNAPSHOT  SUCCESS [  0.272 s]
17:40:26 [2020-10-31T21:40:26.132Z] [INFO] org.eclipse.ease.python.jython.feature 0.8.0-SNAPSHOT SUCCESS [  0.087 s]
17:40:26 [2020-10-31T21:40:26.132Z] [INFO] org.eclipse.ease.lang.python.py4j.feature 0.8.0-SNAPSHOT SUCCESS [  0.085 s]
17:40:26 [2020-10-31T21:40:26.132Z] [INFO] org.eclipse.ease.lang.jvm.feature 0.8.0-SNAPSHOT ... SUCCESS [  0.111 s]
17:40:26 [2020-10-31T21:40:26.132Z] [INFO] org.eclipse.ease.lang.groovy.feature 0.8.0-SNAPSHOT  SUCCESS [  0.100 s]
17:40:26 [2020-10-31T21:40:26.132Z] [INFO] org.eclipse.ease.lang.ruby.feature 0.8.0-SNAPSHOT .. SUCCESS [  0.155 s]
17:40:26 [2020-10-31T21:40:26.132Z] [INFO] org.eclipse.ease.lang.scriptarchive.feature 0.8.0-SNAPSHOT SUCCESS [  0.108 s]
17:40:26 [2020-10-31T21:40:26.132Z] [INFO] org.eclipse.ease.lang.unittest.feature 0.8.0-SNAPSHOT SUCCESS [  0.104 s]
17:40:26 [2020-10-31T21:40:26.132Z] [INFO] org.eclipse.ease.releng.target 0.8.0-SNAPSHOT ...... SUCCESS [  0.033 s]
17:40:26 [2020-10-31T21:40:26.132Z] [INFO] org.eclipse.ease.releng.p2 0.8.0-SNAPSHOT .......... SUCCESS [  3.411 s]
17:40:26 [2020-10-31T21:40:26.132Z] [INFO] org.eclipse.ease.testhelper 0.8.0-SNAPSHOT ......... SUCCESS [  1.464 s]
17:40:26 [2020-10-31T21:40:26.132Z] [INFO] org.eclipse.ease.test 0.8.0-SNAPSHOT ............... SUCCESS [ 17.077 s]
17:40:26 [2020-10-31T21:40:26.132Z] [INFO] org.eclipse.ease.lang.javascript.nashorn.test 0.8.0-SNAPSHOT SUCCESS [  4.399 s]
17:40:26 [2020-10-31T21:40:26.132Z] [INFO] org.eclipse.ease.lang.javascript.rhino.test 0.8.0-SNAPSHOT SUCCESS [ 15.678 s]
17:40:26 [2020-10-31T21:40:26.132Z] [INFO] org.eclipse.ease.lang.javascript.test 0.8.0-SNAPSHOT SUCCESS [  3.901 s]
17:40:26 [2020-10-31T21:40:26.132Z] [INFO] org.eclipse.ease.lang.python.test 0.8.0-SNAPSHOT ... SUCCESS [  3.640 s]
17:40:26 [2020-10-31T21:40:26.132Z] [INFO] org.eclipse.ease.lang.python.jython.test 0.8.0-SNAPSHOT SUCCESS [ 16.657 s]
17:40:26 [2020-10-31T21:40:26.132Z] [INFO] org.eclipse.ease.lang.scriptarchive.test 0.8.0-SNAPSHOT SUCCESS [  4.247 s]
17:40:26 [2020-10-31T21:40:26.132Z] [INFO] org.eclipse.ease.lang.unittest.test 0.8.0-SNAPSHOT . SUCCESS [  6.072 s]
17:40:26 [2020-10-31T21:40:26.132Z] [INFO] org.eclipse.ease.ui.scripts.test 0.8.0-SNAPSHOT .... SUCCESS [  3.836 s]
17:40:26 [2020-10-31T21:40:26.132Z] [INFO] org.eclipse.ease.ui.test 0.8.0-SNAPSHOT ............ SUCCESS [ 15.819 s]
17:40:26 [2020-10-31T21:40:26.132Z] [INFO] EASE (Incubation) 0.4.0-SNAPSHOT ................... SUCCESS [  0.196 s]
17:40:26 [2020-10-31T21:40:26.132Z] [INFO] ------------------------------------------------------------------------
17:40:26 [2020-10-31T21:40:26.132Z] [INFO] BUILD SUCCESS
17:40:26 [2020-10-31T21:40:26.132Z] [INFO] ------------------------------------------------------------------------
17:40:26 [2020-10-31T21:40:26.132Z] [INFO] Total time:  04:58 min
17:40:26 [2020-10-31T21:40:26.132Z] [INFO] Finished at: 2020-10-31T21:40:26Z
17:40:26 [2020-10-31T21:40:26.132Z] [INFO] ------------------------------------------------------------------------
17:40:26 [2020-10-31T21:40:26.132Z] [INFO] [jenkins-event-spy] Generated /home/jenkins/agent/workspace/ease.verify.core.target.2019-03@tmp/withMaven8fe89d1e/maven-spy-20201031-213527-34115826194255547623895.log