FailedConsole Output

Skipping 664 KB.. Full Log
o copy filtered resources.
17:39:08 [2020-10-17T21:39:08.409Z] [INFO] skip non existing resourceDirectory /home/jenkins/agent/workspace/ease.verify.core.target.2019-03/tests/org.eclipse.ease.lang.javascript.nashorn.test/src/test/resources
17:39:08 [2020-10-17T21:39:08.409Z] [INFO] 
17:39:08 [2020-10-17T21:39:08.409Z] [INFO] --- tycho-source-plugin:1.5.0:plugin-source (plugin-source) @ org.eclipse.ease.lang.javascript.nashorn.test ---
17:39:08 [2020-10-17T21:39:08.409Z] [WARNING] Bundle-Vendor header not found in /home/jenkins/agent/workspace/ease.verify.core.target.2019-03/tests/org.eclipse.ease.lang.javascript.nashorn.test/META-INF/MANIFEST.MF, fallback to 'unknown' for source bundle
17:39:08 [2020-10-17T21:39:08.409Z] [INFO] Building jar: /home/jenkins/agent/workspace/ease.verify.core.target.2019-03/tests/org.eclipse.ease.lang.javascript.nashorn.test/target/org.eclipse.ease.lang.javascript.nashorn.test-0.8.0-SNAPSHOT-sources.jar
17:39:08 [2020-10-17T21:39:08.409Z] [INFO] 
17:39:08 [2020-10-17T21:39:08.409Z] [INFO] --- target-platform-configuration:1.5.0:target-platform (default-target-platform) @ org.eclipse.ease.lang.javascript.nashorn.test ---
17:39:08 [2020-10-17T21:39:08.409Z] [INFO] 
17:39:08 [2020-10-17T21:39:08.409Z] [INFO] --- tycho-packaging-plugin:1.5.0:package-plugin (default-package-plugin) @ org.eclipse.ease.lang.javascript.nashorn.test ---
17:39:08 [2020-10-17T21:39:08.409Z] [INFO] Building jar: /home/jenkins/agent/workspace/ease.verify.core.target.2019-03/tests/org.eclipse.ease.lang.javascript.nashorn.test/target/org.eclipse.ease.lang.javascript.nashorn.test-0.8.0-SNAPSHOT.jar
17:39:08 [2020-10-17T21:39:08.679Z] [INFO] 
17:39:08 [2020-10-17T21:39:08.679Z] [INFO] --- tycho-p2-plugin:1.5.0:p2-metadata-default (default-p2-metadata-default) @ org.eclipse.ease.lang.javascript.nashorn.test ---
17:39:08 [2020-10-17T21:39:08.679Z] [INFO] 
17:39:08 [2020-10-17T21:39:08.679Z] [INFO] --- tycho-source-feature-plugin:1.5.0:source-feature (source-feature) @ org.eclipse.ease.lang.javascript.nashorn.test ---
17:39:08 [2020-10-17T21:39:08.679Z] [INFO] 
17:39:08 [2020-10-17T21:39:08.679Z] [INFO] --- tycho-p2-plugin:1.5.0:p2-metadata (attached-p2-metadata) @ org.eclipse.ease.lang.javascript.nashorn.test ---
17:39:08 [2020-10-17T21:39:08.679Z] [INFO] 
17:39:08 [2020-10-17T21:39:08.679Z] [INFO] --- tycho-surefire-plugin:1.5.0:test (default-test) @ org.eclipse.ease.lang.javascript.nashorn.test ---
17:39:08 [2020-10-17T21:39:08.679Z] [INFO] Expected eclipse log file: /home/jenkins/agent/workspace/ease.verify.core.target.2019-03/tests/org.eclipse.ease.lang.javascript.nashorn.test/target/work/data/.metadata/.log
17:39:08 [2020-10-17T21:39:08.679Z] [INFO] Command line:
17:39:08 [2020-10-17T21:39:08.679Z] 	[/opt/tools/java/openjdk/jdk-11/11.0.2+9/bin/java, -Dosgi.noShutdown=false, -Dosgi.os=linux, -Dosgi.ws=gtk, -Dosgi.arch=x86_64, -Dosgi.clean=true, -jar, /home/jenkins/.m2/repository/p2/osgi/bundle/org.eclipse.equinox.launcher/1.5.800.v20200727-1323/org.eclipse.equinox.launcher-1.5.800.v20200727-1323.jar, -data, /home/jenkins/agent/workspace/ease.verify.core.target.2019-03/tests/org.eclipse.ease.lang.javascript.nashorn.test/target/work/data, -install, /home/jenkins/agent/workspace/ease.verify.core.target.2019-03/tests/org.eclipse.ease.lang.javascript.nashorn.test/target/work, -configuration, /home/jenkins/agent/workspace/ease.verify.core.target.2019-03/tests/org.eclipse.ease.lang.javascript.nashorn.test/target/work/configuration, -application, org.eclipse.tycho.surefire.osgibooter.headlesstest, -testproperties, /home/jenkins/agent/workspace/ease.verify.core.target.2019-03/tests/org.eclipse.ease.lang.javascript.nashorn.test/target/surefire.properties]
17:39:08 [2020-10-17T21:39:08.679Z] Picked up JAVA_TOOL_OPTIONS: -Dmaven.ext.class.path="/home/jenkins/agent/workspace/ease.verify.core.target.2019-03@tmp/withMaven135a0756/pipeline-maven-spy.jar" -Dorg.jenkinsci.plugins.pipeline.maven.reportsFolder="/home/jenkins/agent/workspace/ease.verify.core.target.2019-03@tmp/withMaven135a0756" 
17:39:10 [2020-10-17T21:39:10.568Z] Running org.eclipse.ease.lang.javascript.nashorn.NashornEnvironmentTest
17:39:10 [2020-10-17T21:39:10.568Z] Warning: Nashorn engine is planned to be removed from a future JDK release
17:39:10 [2020-10-17T21:39:10.831Z] Warning: Nashorn engine is planned to be removed from a future JDK release
17:39:10 [2020-10-17T21:39:10.831Z] Warning: Nashorn engine is planned to be removed from a future JDK release
17:39:11 [2020-10-17T21:39:11.087Z] WARNING: An illegal reflective access operation has occurred
17:39:11 [2020-10-17T21:39:11.087Z] WARNING: Illegal reflective access by org.mockito.cglib.core.ReflectUtils$2 (file:/home/jenkins/.m2/repository/p2/osgi/bundle/org.mockito/1.9.5.v201605172210/org.mockito-1.9.5.v201605172210.jar) to method java.lang.ClassLoader.defineClass(java.lang.String,byte[],int,int,java.security.ProtectionDomain)
17:39:11 [2020-10-17T21:39:11.087Z] WARNING: Please consider reporting this to the maintainers of org.mockito.cglib.core.ReflectUtils$2
17:39:11 [2020-10-17T21:39:11.087Z] WARNING: Use --illegal-access=warn to enable warnings of further illegal reflective access operations
17:39:11 [2020-10-17T21:39:11.087Z] WARNING: All illegal access operations will be denied in a future release
17:39:11 [2020-10-17T21:39:11.087Z] Warning: Nashorn engine is planned to be removed from a future JDK release
17:39:11 [2020-10-17T21:39:11.087Z] Warning: Nashorn engine is planned to be removed from a future JDK release
17:39:11 [2020-10-17T21:39:11.343Z] Tests run: 5, Failures: 0, Errors: 0, Skipped: 0, Time elapsed: 0.915 s - in org.eclipse.ease.lang.javascript.nashorn.NashornEnvironmentTest
17:39:11 [2020-10-17T21:39:11.343Z] reloadEnvironment(org.eclipse.ease.lang.javascript.nashorn.NashornEnvironmentTest)  Time elapsed: 0.527 s
17:39:11 [2020-10-17T21:39:11.343Z] bootstrappedEnvironment(org.eclipse.ease.lang.javascript.nashorn.NashornEnvironmentTest)  Time elapsed: 0.072 s
17:39:11 [2020-10-17T21:39:11.343Z] postMethodCallback(org.eclipse.ease.lang.javascript.nashorn.NashornEnvironmentTest)  Time elapsed: 0.133 s
17:39:11 [2020-10-17T21:39:11.343Z] preMethodCallback(org.eclipse.ease.lang.javascript.nashorn.NashornEnvironmentTest)  Time elapsed: 0.067 s
17:39:11 [2020-10-17T21:39:11.343Z] reloadFunctionDefinitions(org.eclipse.ease.lang.javascript.nashorn.NashornEnvironmentTest)  Time elapsed: 0.097 s
17:39:11 [2020-10-17T21:39:11.343Z] 
17:39:11 [2020-10-17T21:39:11.343Z] Results:
17:39:11 [2020-10-17T21:39:11.343Z] 
17:39:11 [2020-10-17T21:39:11.343Z] Tests run: 5, Failures: 0, Errors: 0, Skipped: 0
17:39:11 [2020-10-17T21:39:11.343Z] 
17:39:11 [2020-10-17T21:39:11.905Z] [INFO] All tests passed!
17:39:11 [2020-10-17T21:39:11.905Z] [INFO] 
17:39:11 [2020-10-17T21:39:11.905Z] [INFO] --- maven-install-plugin:2.3.1:install (default-install) @ org.eclipse.ease.lang.javascript.nashorn.test ---
17:39:11 [2020-10-17T21:39:11.905Z] [INFO] Installing /home/jenkins/agent/workspace/ease.verify.core.target.2019-03/tests/org.eclipse.ease.lang.javascript.nashorn.test/target/org.eclipse.ease.lang.javascript.nashorn.test-0.8.0-SNAPSHOT.jar to /home/jenkins/.m2/repository/org/eclipse/ease/org.eclipse.ease.lang.javascript.nashorn.test/0.8.0-SNAPSHOT/org.eclipse.ease.lang.javascript.nashorn.test-0.8.0-SNAPSHOT.jar
17:39:11 [2020-10-17T21:39:11.905Z] [INFO] Installing /home/jenkins/agent/workspace/ease.verify.core.target.2019-03/tests/org.eclipse.ease.lang.javascript.nashorn.test/pom.xml to /home/jenkins/.m2/repository/org/eclipse/ease/org.eclipse.ease.lang.javascript.nashorn.test/0.8.0-SNAPSHOT/org.eclipse.ease.lang.javascript.nashorn.test-0.8.0-SNAPSHOT.pom
17:39:11 [2020-10-17T21:39:11.905Z] [INFO] Installing /home/jenkins/agent/workspace/ease.verify.core.target.2019-03/tests/org.eclipse.ease.lang.javascript.nashorn.test/target/org.eclipse.ease.lang.javascript.nashorn.test-0.8.0-SNAPSHOT-sources.jar to /home/jenkins/.m2/repository/org/eclipse/ease/org.eclipse.ease.lang.javascript.nashorn.test/0.8.0-SNAPSHOT/org.eclipse.ease.lang.javascript.nashorn.test-0.8.0-SNAPSHOT-sources.jar
17:39:11 [2020-10-17T21:39:11.905Z] [INFO] Installing /home/jenkins/agent/workspace/ease.verify.core.target.2019-03/tests/org.eclipse.ease.lang.javascript.nashorn.test/target/p2content.xml to /home/jenkins/.m2/repository/org/eclipse/ease/org.eclipse.ease.lang.javascript.nashorn.test/0.8.0-SNAPSHOT/org.eclipse.ease.lang.javascript.nashorn.test-0.8.0-SNAPSHOT-p2metadata.xml
17:39:11 [2020-10-17T21:39:11.905Z] [INFO] Installing /home/jenkins/agent/workspace/ease.verify.core.target.2019-03/tests/org.eclipse.ease.lang.javascript.nashorn.test/target/p2artifacts.xml to /home/jenkins/.m2/repository/org/eclipse/ease/org.eclipse.ease.lang.javascript.nashorn.test/0.8.0-SNAPSHOT/org.eclipse.ease.lang.javascript.nashorn.test-0.8.0-SNAPSHOT-p2artifacts.xml
17:39:11 [2020-10-17T21:39:11.905Z] [INFO] Installing /home/jenkins/agent/workspace/ease.verify.core.target.2019-03/tests/org.eclipse.ease.lang.javascript.nashorn.test/target/p2content.xml to /home/jenkins/.m2/repository/org/eclipse/ease/org.eclipse.ease.lang.javascript.nashorn.test/0.8.0-SNAPSHOT/org.eclipse.ease.lang.javascript.nashorn.test-0.8.0-SNAPSHOT-p2metadata.xml
17:39:11 [2020-10-17T21:39:11.905Z] [INFO] Installing /home/jenkins/agent/workspace/ease.verify.core.target.2019-03/tests/org.eclipse.ease.lang.javascript.nashorn.test/target/p2artifacts.xml to /home/jenkins/.m2/repository/org/eclipse/ease/org.eclipse.ease.lang.javascript.nashorn.test/0.8.0-SNAPSHOT/org.eclipse.ease.lang.javascript.nashorn.test-0.8.0-SNAPSHOT-p2artifacts.xml
17:39:11 [2020-10-17T21:39:11.905Z] [INFO] 
17:39:11 [2020-10-17T21:39:11.905Z] [INFO] --- tycho-p2-plugin:1.5.0:update-local-index (default-update-local-index) @ org.eclipse.ease.lang.javascript.nashorn.test ---
17:39:11 [2020-10-17T21:39:11.905Z] [INFO] 
17:39:11 [2020-10-17T21:39:11.905Z] [INFO] ----< org.eclipse.ease:org.eclipse.ease.lang.javascript.rhino.test >----
17:39:11 [2020-10-17T21:39:11.905Z] [INFO] Building org.eclipse.ease.lang.javascript.rhino.test 0.8.0-SNAPSHOT [40/48]
17:39:11 [2020-10-17T21:39:11.905Z] [INFO] ------------------------[ eclipse-test-plugin ]-------------------------
17:39:11 [2020-10-17T21:39:11.905Z] [INFO] 
17:39:11 [2020-10-17T21:39:11.905Z] [INFO] --- maven-clean-plugin:2.5:clean (default-clean) @ org.eclipse.ease.lang.javascript.rhino.test ---
17:39:11 [2020-10-17T21:39:11.905Z] [INFO] 
17:39:11 [2020-10-17T21:39:11.905Z] [INFO] --- tycho-packaging-plugin:1.5.0:build-qualifier (default-build-qualifier) @ org.eclipse.ease.lang.javascript.rhino.test ---
17:39:11 [2020-10-17T21:39:11.905Z] [INFO] The project's OSGi version is 0.8.0.I201911291239
17:39:11 [2020-10-17T21:39:11.905Z] [INFO] 
17:39:11 [2020-10-17T21:39:11.905Z] [INFO] --- tycho-packaging-plugin:1.5.0:validate-id (default-validate-id) @ org.eclipse.ease.lang.javascript.rhino.test ---
17:39:11 [2020-10-17T21:39:11.905Z] [INFO] 
17:39:11 [2020-10-17T21:39:11.905Z] [INFO] --- tycho-packaging-plugin:1.5.0:validate-version (default-validate-version) @ org.eclipse.ease.lang.javascript.rhino.test ---
17:39:11 [2020-10-17T21:39:11.905Z] [INFO] 
17:39:11 [2020-10-17T21:39:11.905Z] [INFO] >>> maven-javadoc-plugin:2.9.1:javadoc (build-docs) > generate-sources @ org.eclipse.ease.lang.javascript.rhino.test >>>
17:39:11 [2020-10-17T21:39:11.905Z] [INFO] 
17:39:11 [2020-10-17T21:39:11.906Z] [INFO] --- tycho-packaging-plugin:1.5.0:build-qualifier (default-build-qualifier) @ org.eclipse.ease.lang.javascript.rhino.test ---
17:39:11 [2020-10-17T21:39:11.906Z] [INFO] The project's OSGi version is 0.8.0.I201911291239
17:39:11 [2020-10-17T21:39:11.906Z] [INFO] 
17:39:11 [2020-10-17T21:39:11.906Z] [INFO] --- tycho-packaging-plugin:1.5.0:validate-id (default-validate-id) @ org.eclipse.ease.lang.javascript.rhino.test ---
17:39:11 [2020-10-17T21:39:11.906Z] [INFO] 
17:39:11 [2020-10-17T21:39:11.906Z] [INFO] --- tycho-packaging-plugin:1.5.0:validate-version (default-validate-version) @ org.eclipse.ease.lang.javascript.rhino.test ---
17:39:11 [2020-10-17T21:39:11.906Z] [INFO] 
17:39:11 [2020-10-17T21:39:11.906Z] [INFO] <<< maven-javadoc-plugin:2.9.1:javadoc (build-docs) < generate-sources @ org.eclipse.ease.lang.javascript.rhino.test <<<
17:39:11 [2020-10-17T21:39:11.906Z] [INFO] 
17:39:11 [2020-10-17T21:39:11.906Z] [INFO] 
17:39:11 [2020-10-17T21:39:11.906Z] [INFO] --- maven-javadoc-plugin:2.9.1:javadoc (build-docs) @ org.eclipse.ease.lang.javascript.rhino.test ---
17:39:12 [2020-10-17T21:39:12.161Z] [ERROR] Error fetching link: http://help.eclipse.org/oxygen/topic/org.eclipse.platform.doc.isv/reference/api/package-list. Ignored it.
17:39:12 [2020-10-17T21:39:12.161Z] [ERROR] Error fetching link: https://ci.eclipse.org/ease/job/ease.build.core/JavaDoc/package-list. Ignored it.
17:39:13 [2020-10-17T21:39:13.145Z] [INFO] 
17:39:13 [2020-10-17T21:39:13.145Z] Loading source files for package org.eclipse.ease.lang.javascript.rhino...
17:39:13 [2020-10-17T21:39:13.145Z] Constructing Javadoc information...
17:39:13 [2020-10-17T21:39:13.146Z] WARNING: Cannot open location "/home/jenkins/agent/workspace/ease.verify.core.target.2019-03/tests/org.eclipse.ease.lang.javascript.rhino.test/target/javadoc-bundle-options/package-list"
17:39:13 [2020-10-17T21:39:13.146Z] No plugin definition found, skipping
17:39:13 [2020-10-17T21:39:13.146Z] No plugin definition found, skipping
17:39:13 [2020-10-17T21:39:13.146Z] [WARNING] Javadoc Warnings
17:39:13 [2020-10-17T21:39:13.146Z] [WARNING] Picked up JAVA_TOOL_OPTIONS: -Dmaven.ext.class.path="/home/jenkins/agent/workspace/ease.verify.core.target.2019-03@tmp/withMaven135a0756/pipeline-maven-spy.jar" -Dorg.jenkinsci.plugins.pipeline.maven.reportsFolder="/home/jenkins/agent/workspace/ease.verify.core.target.2019-03@tmp/withMaven135a0756"
17:39:13 [2020-10-17T21:39:13.146Z] [WARNING] javadoc: warning - The old Doclet and Taglet APIs in the packages
17:39:13 [2020-10-17T21:39:13.146Z] [WARNING] com.sun.javadoc, com.sun.tools.doclets and their implementations
17:39:13 [2020-10-17T21:39:13.146Z] [WARNING] are planned to be removed in a future JDK release. These
17:39:13 [2020-10-17T21:39:13.146Z] [WARNING] components have been superseded by the new APIs in jdk.javadoc.doclet.
17:39:13 [2020-10-17T21:39:13.146Z] [WARNING] Users are strongly recommended to migrate to the new APIs.
17:39:13 [2020-10-17T21:39:13.146Z] [INFO] 
17:39:13 [2020-10-17T21:39:13.146Z] [INFO] --- build-helper-maven-plugin:1.9.1:add-resource (add_help) @ org.eclipse.ease.lang.javascript.rhino.test ---
17:39:13 [2020-10-17T21:39:13.146Z] [INFO] 
17:39:13 [2020-10-17T21:39:13.146Z] [INFO] --- maven-resources-plugin:2.4.3:resources (default-resources) @ org.eclipse.ease.lang.javascript.rhino.test ---
17:39:13 [2020-10-17T21:39:13.146Z] [INFO] Using 'UTF-8' encoding to copy filtered resources.
17:39:13 [2020-10-17T21:39:13.146Z] [INFO] skip non existing resourceDirectory /home/jenkins/agent/workspace/ease.verify.core.target.2019-03/tests/org.eclipse.ease.lang.javascript.rhino.test/src/main/resources
17:39:13 [2020-10-17T21:39:13.146Z] [INFO] skip non existing resourceDirectory /home/jenkins/agent/workspace/ease.verify.core.target.2019-03/tests/org.eclipse.ease.lang.javascript.rhino.test/help
17:39:13 [2020-10-17T21:39:13.146Z] [INFO] 
17:39:13 [2020-10-17T21:39:13.146Z] [INFO] --- tycho-compiler-plugin:1.5.0:compile (default-compile) @ org.eclipse.ease.lang.javascript.rhino.test ---
17:39:13 [2020-10-17T21:39:13.146Z] [INFO] Compiling 4 source files to /home/jenkins/agent/workspace/ease.verify.core.target.2019-03/tests/org.eclipse.ease.lang.javascript.rhino.test/target/classes
17:39:13 [2020-10-17T21:39:13.405Z] [INFO] 
17:39:13 [2020-10-17T21:39:13.405Z] [INFO] --- maven-resources-plugin:2.4.3:testResources (default-testResources) @ org.eclipse.ease.lang.javascript.rhino.test ---
17:39:13 [2020-10-17T21:39:13.405Z] [INFO] Using 'UTF-8' encoding to copy filtered resources.
17:39:13 [2020-10-17T21:39:13.405Z] [INFO] skip non existing resourceDirectory /home/jenkins/agent/workspace/ease.verify.core.target.2019-03/tests/org.eclipse.ease.lang.javascript.rhino.test/src/test/resources
17:39:13 [2020-10-17T21:39:13.405Z] [INFO] 
17:39:13 [2020-10-17T21:39:13.405Z] [INFO] --- tycho-source-plugin:1.5.0:plugin-source (plugin-source) @ org.eclipse.ease.lang.javascript.rhino.test ---
17:39:13 [2020-10-17T21:39:13.405Z] [WARNING] Bundle-Vendor header not found in /home/jenkins/agent/workspace/ease.verify.core.target.2019-03/tests/org.eclipse.ease.lang.javascript.rhino.test/META-INF/MANIFEST.MF, fallback to 'unknown' for source bundle
17:39:13 [2020-10-17T21:39:13.405Z] [INFO] Building jar: /home/jenkins/agent/workspace/ease.verify.core.target.2019-03/tests/org.eclipse.ease.lang.javascript.rhino.test/target/org.eclipse.ease.lang.javascript.rhino.test-0.8.0-SNAPSHOT-sources.jar
17:39:13 [2020-10-17T21:39:13.405Z] [INFO] 
17:39:13 [2020-10-17T21:39:13.405Z] [INFO] --- target-platform-configuration:1.5.0:target-platform (default-target-platform) @ org.eclipse.ease.lang.javascript.rhino.test ---
17:39:13 [2020-10-17T21:39:13.405Z] [INFO] 
17:39:13 [2020-10-17T21:39:13.405Z] [INFO] --- tycho-packaging-plugin:1.5.0:package-plugin (default-package-plugin) @ org.eclipse.ease.lang.javascript.rhino.test ---
17:39:13 [2020-10-17T21:39:13.405Z] [INFO] Building jar: /home/jenkins/agent/workspace/ease.verify.core.target.2019-03/tests/org.eclipse.ease.lang.javascript.rhino.test/target/org.eclipse.ease.lang.javascript.rhino.test-0.8.0-SNAPSHOT.jar
17:39:13 [2020-10-17T21:39:13.405Z] [INFO] 
17:39:13 [2020-10-17T21:39:13.405Z] [INFO] --- tycho-p2-plugin:1.5.0:p2-metadata-default (default-p2-metadata-default) @ org.eclipse.ease.lang.javascript.rhino.test ---
17:39:13 [2020-10-17T21:39:13.405Z] [INFO] 
17:39:13 [2020-10-17T21:39:13.405Z] [INFO] --- tycho-source-feature-plugin:1.5.0:source-feature (source-feature) @ org.eclipse.ease.lang.javascript.rhino.test ---
17:39:13 [2020-10-17T21:39:13.405Z] [INFO] 
17:39:13 [2020-10-17T21:39:13.405Z] [INFO] --- tycho-p2-plugin:1.5.0:p2-metadata (attached-p2-metadata) @ org.eclipse.ease.lang.javascript.rhino.test ---
17:39:13 [2020-10-17T21:39:13.405Z] [INFO] 
17:39:13 [2020-10-17T21:39:13.405Z] [INFO] --- tycho-surefire-plugin:1.5.0:test (default-test) @ org.eclipse.ease.lang.javascript.rhino.test ---
17:39:13 [2020-10-17T21:39:13.678Z] [INFO] Expected eclipse log file: /home/jenkins/agent/workspace/ease.verify.core.target.2019-03/tests/org.eclipse.ease.lang.javascript.rhino.test/target/work/data/.metadata/.log
17:39:13 [2020-10-17T21:39:13.678Z] [INFO] Command line:
17:39:13 [2020-10-17T21:39:13.678Z] 	[/opt/tools/java/openjdk/jdk-11/11.0.2+9/bin/java, -Dosgi.noShutdown=false, -Dosgi.os=linux, -Dosgi.ws=gtk, -Dosgi.arch=x86_64, -Dosgi.clean=true, -jar, /home/jenkins/.m2/repository/p2/osgi/bundle/org.eclipse.equinox.launcher/1.5.800.v20200727-1323/org.eclipse.equinox.launcher-1.5.800.v20200727-1323.jar, -data, /home/jenkins/agent/workspace/ease.verify.core.target.2019-03/tests/org.eclipse.ease.lang.javascript.rhino.test/target/work/data, -install, /home/jenkins/agent/workspace/ease.verify.core.target.2019-03/tests/org.eclipse.ease.lang.javascript.rhino.test/target/work, -configuration, /home/jenkins/agent/workspace/ease.verify.core.target.2019-03/tests/org.eclipse.ease.lang.javascript.rhino.test/target/work/configuration, -application, org.eclipse.tycho.surefire.osgibooter.headlesstest, -testproperties, /home/jenkins/agent/workspace/ease.verify.core.target.2019-03/tests/org.eclipse.ease.lang.javascript.rhino.test/target/surefire.properties]
17:39:13 [2020-10-17T21:39:13.678Z] Picked up JAVA_TOOL_OPTIONS: -Dmaven.ext.class.path="/home/jenkins/agent/workspace/ease.verify.core.target.2019-03@tmp/withMaven135a0756/pipeline-maven-spy.jar" -Dorg.jenkinsci.plugins.pipeline.maven.reportsFolder="/home/jenkins/agent/workspace/ease.verify.core.target.2019-03@tmp/withMaven135a0756" 
17:39:15 [2020-10-17T21:39:15.580Z] Running org.eclipse.ease.lang.javascript.rhino.RhinoDebuggerEngineTest
17:39:15 [2020-10-17T21:39:15.580Z] org.eclipse.ease.ScriptExecutionException: JavaError: NotThere cannot be found by org.mozilla.javascript_1.7.10.v20190430-1943
17:39:15 [2020-10-17T21:39:15.580Z] 
17:39:15 [2020-10-17T21:39:15.580Z] Java Stacktrace:
17:39:15 [2020-10-17T21:39:15.580Z] java.lang.ClassNotFoundException: NotThere cannot be found by org.mozilla.javascript_1.7.10.v20190430-1943
17:39:15 [2020-10-17T21:39:15.580Z] 	at org.eclipse.osgi.internal.loader.BundleLoader.findClass(BundleLoader.java:516)
17:39:15 [2020-10-17T21:39:15.580Z] 	at org.eclipse.osgi.internal.loader.ModuleClassLoader.loadClass(ModuleClassLoader.java:171)
17:39:15 [2020-10-17T21:39:15.580Z] 	at java.base/java.lang.ClassLoader.loadClass(ClassLoader.java:521)
17:39:15 [2020-10-17T21:39:15.580Z] 	at java.base/java.lang.Class.forName0(Native Method)
17:39:15 [2020-10-17T21:39:15.580Z] 	at java.base/java.lang.Class.forName(Class.java:315)
17:39:15 [2020-10-17T21:39:15.580Z] 	at java.base/jdk.internal.reflect.NativeMethodAccessorImpl.invoke0(Native Method)
17:39:15 [2020-10-17T21:39:15.580Z] 	at java.base/jdk.internal.reflect.NativeMethodAccessorImpl.invoke(NativeMethodAccessorImpl.java:62)
17:39:15 [2020-10-17T21:39:15.580Z] 	at java.base/jdk.internal.reflect.DelegatingMethodAccessorImpl.invoke(DelegatingMethodAccessorImpl.java:43)
17:39:15 [2020-10-17T21:39:15.580Z] 	at java.base/java.lang.reflect.Method.invoke(Method.java:566)
17:39:15 [2020-10-17T21:39:15.580Z] 	at org.mozilla.javascript.MemberBox.invoke(MemberBox.java:126)
17:39:15 [2020-10-17T21:39:15.580Z] 	at org.mozilla.javascript.NativeJavaMethod.call(NativeJavaMethod.java:225)
17:39:15 [2020-10-17T21:39:15.580Z] 	at org.mozilla.javascript.Interpreter.interpretLoop(Interpreter.java:1573)
17:39:15 [2020-10-17T21:39:15.580Z] 	at org.mozilla.javascript.Interpreter.interpret(Interpreter.java:911)
17:39:15 [2020-10-17T21:39:15.580Z] 	at org.mozilla.javascript.InterpretedFunction.call(InterpretedFunction.java:109)
17:39:15 [2020-10-17T21:39:15.580Z] 	at org.mozilla.javascript.ContextFactory.doTopCall(ContextFactory.java:405)
17:39:15 [2020-10-17T21:39:15.580Z] 	at org.mozilla.javascript.ScriptRuntime.doTopCall(ScriptRuntime.java:3508)
17:39:15 [2020-10-17T21:39:15.580Z] 	at org.mozilla.javascript.InterpretedFunction.exec(InterpretedFunction.java:120)
17:39:15 [2020-10-17T21:39:15.580Z] 	at org.mozilla.javascript.Context.evaluateReader(Context.java:1293)
17:39:15 [2020-10-17T21:39:15.580Z] 	at org.eclipse.ease.lang.javascript.rhino.RhinoScriptEngine.internalExecute(RhinoScriptEngine.java:222)
17:39:15 [2020-10-17T21:39:15.580Z] 	at org.eclipse.ease.lang.javascript.rhino.RhinoScriptEngine.execute(RhinoScriptEngine.java:201)
17:39:15 [2020-10-17T21:39:15.580Z] 	at org.eclipse.ease.AbstractScriptEngine.inject(AbstractScriptEngine.java:224)
17:39:15 [2020-10-17T21:39:15.580Z] 	at org.eclipse.ease.AbstractScriptEngine.run(AbstractScriptEngine.java:274)
17:39:15 [2020-10-17T21:39:15.580Z] 	at org.eclipse.core.internal.jobs.Worker.run(Worker.java:63)
17:39:15 [2020-10-17T21:39:15.837Z] org.eclipse.ease.ScriptExecutionException: TypeError: Cannot call method "foobar" of undefined
17:39:15 [2020-10-17T21:39:15.837Z] org.eclipse.ease.ScriptExecutionException: ScriptException: test
17:39:15 [2020-10-17T21:39:15.837Z] org.eclipse.ease.ScriptExecutionException: JavaError: java.lang.Exception
17:39:15 [2020-10-17T21:39:15.837Z] 
17:39:15 [2020-10-17T21:39:15.837Z] Java Stacktrace:
17:39:15 [2020-10-17T21:39:15.837Z] java.lang.Exception
17:39:15 [2020-10-17T21:39:15.837Z] 	at java.base/jdk.internal.reflect.NativeConstructorAccessorImpl.newInstance0(Native Method)
17:39:15 [2020-10-17T21:39:15.837Z] 	at java.base/jdk.internal.reflect.NativeConstructorAccessorImpl.newInstance(NativeConstructorAccessorImpl.java:62)
17:39:15 [2020-10-17T21:39:15.837Z] 	at java.base/jdk.internal.reflect.DelegatingConstructorAccessorImpl.newInstance(DelegatingConstructorAccessorImpl.java:45)
17:39:15 [2020-10-17T21:39:15.837Z] 	at java.base/java.lang.reflect.Constructor.newInstance(Constructor.java:490)
17:39:15 [2020-10-17T21:39:15.837Z] 	at org.mozilla.javascript.MemberBox.newInstance(MemberBox.java:159)
17:39:15 [2020-10-17T21:39:15.837Z] 	at org.mozilla.javascript.NativeJavaClass.constructInternal(NativeJavaClass.java:266)
17:39:15 [2020-10-17T21:39:15.837Z] 	at org.mozilla.javascript.NativeJavaClass.constructSpecific(NativeJavaClass.java:205)
17:39:15 [2020-10-17T21:39:15.837Z] 	at org.mozilla.javascript.NativeJavaClass.construct(NativeJavaClass.java:166)
17:39:15 [2020-10-17T21:39:15.837Z] 	at org.mozilla.javascript.Interpreter.interpretLoop(Interpreter.java:1617)
17:39:15 [2020-10-17T21:39:15.837Z] 	at org.mozilla.javascript.Interpreter.interpret(Interpreter.java:911)
17:39:15 [2020-10-17T21:39:15.837Z] 	at org.mozilla.javascript.InterpretedFunction.call(InterpretedFunction.java:109)
17:39:15 [2020-10-17T21:39:15.837Z] 	at org.mozilla.javascript.ContextFactory.doTopCall(ContextFactory.java:405)
17:39:15 [2020-10-17T21:39:15.837Z] 	at org.mozilla.javascript.ScriptRuntime.doTopCall(ScriptRuntime.java:3508)
17:39:15 [2020-10-17T21:39:15.837Z] 	at org.mozilla.javascript.InterpretedFunction.exec(InterpretedFunction.java:120)
17:39:15 [2020-10-17T21:39:15.837Z] 	at org.mozilla.javascript.Context.evaluateReader(Context.java:1293)
17:39:15 [2020-10-17T21:39:15.837Z] 	at org.eclipse.ease.lang.javascript.rhino.RhinoScriptEngine.internalExecute(RhinoScriptEngine.java:222)
17:39:15 [2020-10-17T21:39:15.837Z] 	at org.eclipse.ease.lang.javascript.rhino.RhinoScriptEngine.execute(RhinoScriptEngine.java:201)
17:39:15 [2020-10-17T21:39:15.837Z] 	at org.eclipse.ease.AbstractScriptEngine.inject(AbstractScriptEngine.java:224)
17:39:15 [2020-10-17T21:39:15.837Z] 	at org.eclipse.ease.AbstractScriptEngine.run(AbstractScriptEngine.java:274)
17:39:15 [2020-10-17T21:39:15.837Z] 	at org.eclipse.core.internal.jobs.Worker.run(Worker.java:63)
17:39:15 [2020-10-17T21:39:15.837Z] org.eclipse.ease.ScriptExecutionException: ScriptException: JavaScript
17:39:15 [2020-10-17T21:39:15.837Z] org.eclipse.ease.ScriptExecutionException: SyntaxError: unterminated string literal (#1)
17:39:15 [2020-10-17T21:39:15.837Z] 'asdf
17:39:15 [2020-10-17T21:39:15.837Z]     ^
17:39:15 [2020-10-17T21:39:15.837Z] 	at <unknown source>:1
17:39:15 [2020-10-17T21:39:15.837Z] Tests run: 12, Failures: 0, Errors: 0, Skipped: 0, Time elapsed: 0.502 s - in org.eclipse.ease.lang.javascript.rhino.RhinoDebuggerEngineTest
17:39:15 [2020-10-17T21:39:15.837Z] getExceptionStackTrace(org.eclipse.ease.lang.javascript.rhino.RhinoDebuggerEngineTest)  Time elapsed: 0.183 s
17:39:15 [2020-10-17T21:39:15.837Z] causeWrappedException(org.eclipse.ease.lang.javascript.rhino.RhinoDebuggerEngineTest)  Time elapsed: 0.027 s
17:39:15 [2020-10-17T21:39:15.837Z] optionalModuleParameters(org.eclipse.ease.lang.javascript.rhino.RhinoDebuggerEngineTest)  Time elapsed: 0.022 s
17:39:15 [2020-10-17T21:39:15.837Z] simpleScriptCode(org.eclipse.ease.lang.javascript.rhino.RhinoDebuggerEngineTest)  Time elapsed: 0.016 s
17:39:15 [2020-10-17T21:39:15.837Z] causeRuntimeErrorException(org.eclipse.ease.lang.javascript.rhino.RhinoDebuggerEngineTest)  Time elapsed: 0.016 s
17:39:15 [2020-10-17T21:39:15.837Z] callModuleCode(org.eclipse.ease.lang.javascript.rhino.RhinoDebuggerEngineTest)  Time elapsed: 0.051 s
17:39:15 [2020-10-17T21:39:15.837Z] throwJavaClass(org.eclipse.ease.lang.javascript.rhino.RhinoDebuggerEngineTest)  Time elapsed: 0.016 s
17:39:15 [2020-10-17T21:39:15.837Z] throwJavaException(org.eclipse.ease.lang.javascript.rhino.RhinoDebuggerEngineTest)  Time elapsed: 0.017 s
17:39:15 [2020-10-17T21:39:15.837Z] accessJavaClasses(org.eclipse.ease.lang.javascript.rhino.RhinoDebuggerEngineTest)  Time elapsed: 0.024 s
17:39:15 [2020-10-17T21:39:15.837Z] accessEclipseClasses(org.eclipse.ease.lang.javascript.rhino.RhinoDebuggerEngineTest)  Time elapsed: 0.049 s
17:39:15 [2020-10-17T21:39:15.837Z] throwJavaScriptException(org.eclipse.ease.lang.javascript.rhino.RhinoDebuggerEngineTest)  Time elapsed: 0.012 s
17:39:15 [2020-10-17T21:39:15.837Z] causeSyntaxErrorException(org.eclipse.ease.lang.javascript.rhino.RhinoDebuggerEngineTest)  Time elapsed: 0.014 s
17:39:15 [2020-10-17T21:39:15.837Z] Running org.eclipse.ease.lang.javascript.rhino.RhinoDebugTest
17:39:16 [2020-10-17T21:39:16.094Z] WARNING: An illegal reflective access operation has occurred
17:39:16 [2020-10-17T21:39:16.094Z] WARNING: Illegal reflective access by org.mockito.cglib.core.ReflectUtils$2 (file:/home/jenkins/.m2/repository/p2/osgi/bundle/org.mockito/1.9.5.v201605172210/org.mockito-1.9.5.v201605172210.jar) to method java.lang.ClassLoader.defineClass(java.lang.String,byte[],int,int,java.security.ProtectionDomain)
17:39:16 [2020-10-17T21:39:16.094Z] WARNING: Please consider reporting this to the maintainers of org.mockito.cglib.core.ReflectUtils$2
17:39:16 [2020-10-17T21:39:16.094Z] WARNING: Use --illegal-access=warn to enable warnings of further illegal reflective access operations
17:39:16 [2020-10-17T21:39:16.094Z] WARNING: All illegal access operations will be denied in a future release
17:39:16 [2020-10-17T21:39:16.094Z] Start of script
17:39:16 [2020-10-17T21:39:16.094Z] include file start
17:39:16 [2020-10-17T21:39:16.094Z] Include file processed
17:39:16 [2020-10-17T21:39:16.094Z] line after include file
17:39:16 [2020-10-17T21:39:16.094Z] Result of testMethod = 5
17:39:16 [2020-10-17T21:39:16.094Z] End of script
17:39:16 [2020-10-17T21:39:16.349Z] Start of script
17:39:16 [2020-10-17T21:39:16.349Z] include file start
17:39:16 [2020-10-17T21:39:16.349Z] Include file processed
17:39:16 [2020-10-17T21:39:16.349Z] line after include file
17:39:16 [2020-10-17T21:39:16.349Z] Result of testMethod = 5
17:39:16 [2020-10-17T21:39:16.349Z] End of script
17:39:16 [2020-10-17T21:39:16.605Z] Start of script
17:39:16 [2020-10-17T21:39:16.605Z] include file start
17:39:16 [2020-10-17T21:39:16.605Z] Include file processed
17:39:16 [2020-10-17T21:39:16.605Z] line after include file
17:39:16 [2020-10-17T21:39:16.605Z] Result of testMethod = 5
17:39:16 [2020-10-17T21:39:16.862Z] Start of script
17:39:16 [2020-10-17T21:39:16.862Z] include file start
17:39:16 [2020-10-17T21:39:16.862Z] Include file processed
17:39:16 [2020-10-17T21:39:16.862Z] line after include file
17:39:17 [2020-10-17T21:39:17.117Z] Result of testMethod = 5
17:39:17 [2020-10-17T21:39:17.117Z] End of script
17:39:17 [2020-10-17T21:39:17.373Z] Start of script
17:39:17 [2020-10-17T21:39:17.373Z] include file start
17:39:17 [2020-10-17T21:39:17.373Z] Include file processed
17:39:17 [2020-10-17T21:39:17.373Z] line after include file
17:39:17 [2020-10-17T21:39:17.373Z] Result of testMethod = 5
17:39:17 [2020-10-17T21:39:17.373Z] End of script
17:39:17 [2020-10-17T21:39:17.373Z] Start of script
17:39:17 [2020-10-17T21:39:17.373Z] include file start
17:39:17 [2020-10-17T21:39:17.373Z] Include file processed
17:39:17 [2020-10-17T21:39:17.373Z] line after include file
17:39:17 [2020-10-17T21:39:17.629Z] Result of testMethod = 5
17:39:17 [2020-10-17T21:39:17.629Z] End of script
17:39:17 [2020-10-17T21:39:17.629Z] Start of script
17:39:17 [2020-10-17T21:39:17.629Z] include file start
17:39:17 [2020-10-17T21:39:17.629Z] Include file processed
17:39:17 [2020-10-17T21:39:17.629Z] line after include file
17:39:17 [2020-10-17T21:39:17.629Z] Result of testMethod = 5
17:39:18 [2020-10-17T21:39:18.190Z] Start of script
17:39:18 [2020-10-17T21:39:18.190Z] include file start
17:39:18 [2020-10-17T21:39:18.190Z] Include file processed
17:39:18 [2020-10-17T21:39:18.190Z] line after include file
17:39:18 [2020-10-17T21:39:18.190Z] Result of testMethod = 5
17:39:18 [2020-10-17T21:39:18.190Z] End of script
17:39:19 [2020-10-17T21:39:19.635Z] Start of script
17:39:19 [2020-10-17T21:39:19.635Z] include file start
17:39:19 [2020-10-17T21:39:19.635Z] Include file processed
17:39:19 [2020-10-17T21:39:19.635Z] line after include file
17:39:19 [2020-10-17T21:39:19.635Z] Result of testMethod = 5
17:39:19 [2020-10-17T21:39:19.635Z] End of script
17:39:19 [2020-10-17T21:39:19.635Z] Start of script
17:39:19 [2020-10-17T21:39:19.635Z] include file start
17:39:19 [2020-10-17T21:39:19.635Z] Include file processed
17:39:19 [2020-10-17T21:39:19.635Z] line after include file
17:39:19 [2020-10-17T21:39:19.635Z] Start of script
17:39:19 [2020-10-17T21:39:19.635Z] include file start
17:39:19 [2020-10-17T21:39:19.635Z] Include file processed
17:39:19 [2020-10-17T21:39:19.635Z] line after include file
17:39:19 [2020-10-17T21:39:19.635Z] Result of testMethod = 5
17:39:19 [2020-10-17T21:39:19.635Z] End of script
17:39:19 [2020-10-17T21:39:19.635Z] Start of script
17:39:19 [2020-10-17T21:39:19.635Z] include file start
17:39:19 [2020-10-17T21:39:19.635Z] Include file processed
17:39:19 [2020-10-17T21:39:19.635Z] line after include file
17:39:19 [2020-10-17T21:39:19.635Z] Result of testMethod = 5
17:39:19 [2020-10-17T21:39:19.635Z] End of script
17:39:19 [2020-10-17T21:39:19.635Z] Start of script
17:39:19 [2020-10-17T21:39:19.891Z] include file start
17:39:19 [2020-10-17T21:39:19.891Z] Include file processed
17:39:19 [2020-10-17T21:39:19.891Z] line after include file
17:39:19 [2020-10-17T21:39:19.891Z] Result of testMethod = 5
17:39:19 [2020-10-17T21:39:19.891Z] End of script
17:39:19 [2020-10-17T21:39:19.891Z] Start of script
17:39:19 [2020-10-17T21:39:19.891Z] include file start
17:39:19 [2020-10-17T21:39:19.891Z] Include file processed
17:39:19 [2020-10-17T21:39:19.891Z] line after include file
17:39:20 [2020-10-17T21:39:20.146Z] Result of testMethod = 5
17:39:20 [2020-10-17T21:39:20.146Z] End of script
17:39:20 [2020-10-17T21:39:20.146Z] Start of script
17:39:20 [2020-10-17T21:39:20.146Z] include file start
17:39:20 [2020-10-17T21:39:20.146Z] Include file processed
17:39:20 [2020-10-17T21:39:20.146Z] line after include file
17:39:20 [2020-10-17T21:39:20.146Z] Result of testMethod = 5
17:39:20 [2020-10-17T21:39:20.402Z] Start of script
17:39:20 [2020-10-17T21:39:20.402Z] include file start
17:39:20 [2020-10-17T21:39:20.402Z] Include file processed
17:39:20 [2020-10-17T21:39:20.402Z] line after include file
17:39:20 [2020-10-17T21:39:20.658Z] Result of testMethod = 5
17:39:20 [2020-10-17T21:39:20.658Z] End of script
17:39:20 [2020-10-17T21:39:20.914Z] Start of script
17:39:20 [2020-10-17T21:39:20.914Z] include file start
17:39:20 [2020-10-17T21:39:20.914Z] Include file processed
17:39:20 [2020-10-17T21:39:20.914Z] line after include file
17:39:20 [2020-10-17T21:39:20.914Z] Result of testMethod = 5
17:39:21 [2020-10-17T21:39:21.170Z] End of script
17:39:21 [2020-10-17T21:39:21.170Z] Start of script
17:39:21 [2020-10-17T21:39:21.170Z] include file start
17:39:21 [2020-10-17T21:39:21.170Z] Include file processed
17:39:21 [2020-10-17T21:39:21.170Z] line after include file
17:39:21 [2020-10-17T21:39:21.425Z] Result of testMethod = 5
17:39:21 [2020-10-17T21:39:21.425Z] End of script
17:39:21 [2020-10-17T21:39:21.680Z] Start of script
17:39:21 [2020-10-17T21:39:21.680Z] include file start
17:39:21 [2020-10-17T21:39:21.681Z] Include file processed
17:39:21 [2020-10-17T21:39:21.681Z] line after include file
17:39:21 [2020-10-17T21:39:21.936Z] Result of testMethod = 5
17:39:21 [2020-10-17T21:39:21.936Z] End of script
17:39:21 [2020-10-17T21:39:21.936Z] Start of script
17:39:21 [2020-10-17T21:39:21.936Z] include file start
17:39:21 [2020-10-17T21:39:21.936Z] Include file processed
17:39:21 [2020-10-17T21:39:21.936Z] line after include file
17:39:21 [2020-10-17T21:39:21.936Z] Result of testMethod = 5
17:39:22 [2020-10-17T21:39:22.498Z] Start of script
17:39:22 [2020-10-17T21:39:22.498Z] include file start
17:39:22 [2020-10-17T21:39:22.498Z] Include file processed
17:39:22 [2020-10-17T21:39:22.498Z] line after include file
17:39:22 [2020-10-17T21:39:22.498Z] Result of testMethod = 5
17:39:22 [2020-10-17T21:39:22.498Z] End of script
17:39:22 [2020-10-17T21:39:22.498Z] Start of script
17:39:22 [2020-10-17T21:39:22.498Z] include file start
17:39:22 [2020-10-17T21:39:22.498Z] Include file processed
17:39:22 [2020-10-17T21:39:22.498Z] line after include file
17:39:22 [2020-10-17T21:39:22.753Z] Result of testMethod = 5
17:39:22 [2020-10-17T21:39:22.753Z] End of script
17:39:22 [2020-10-17T21:39:22.753Z] Start of script
17:39:22 [2020-10-17T21:39:22.753Z] include file start
17:39:22 [2020-10-17T21:39:22.753Z] Include file processed
17:39:22 [2020-10-17T21:39:22.753Z] line after include file
17:39:22 [2020-10-17T21:39:22.753Z] Result of testMethod = 5
17:39:22 [2020-10-17T21:39:22.753Z] End of script
17:39:23 [2020-10-17T21:39:23.008Z] Start of script
17:39:23 [2020-10-17T21:39:23.008Z] include file start
17:39:23 [2020-10-17T21:39:23.008Z] Include file processed
17:39:23 [2020-10-17T21:39:23.264Z] line after include file
17:39:23 [2020-10-17T21:39:23.264Z] Result of testMethod = 5
17:39:23 [2020-10-17T21:39:23.264Z] End of script
17:39:23 [2020-10-17T21:39:23.264Z] Start of script
17:39:23 [2020-10-17T21:39:23.264Z] include file start
17:39:23 [2020-10-17T21:39:23.264Z] Include file processed
17:39:23 [2020-10-17T21:39:23.264Z] line after include file
17:39:23 [2020-10-17T21:39:23.520Z] Start of script
17:39:23 [2020-10-17T21:39:23.776Z] include file start
17:39:23 [2020-10-17T21:39:23.776Z] Include file processed
17:39:23 [2020-10-17T21:39:23.776Z] line after include file
17:39:23 [2020-10-17T21:39:23.776Z] Result of testMethod = 5
17:39:23 [2020-10-17T21:39:23.776Z] End of script
17:39:23 [2020-10-17T21:39:23.776Z] Start of script
17:39:23 [2020-10-17T21:39:23.776Z] include file start
17:39:23 [2020-10-17T21:39:23.776Z] Include file processed
17:39:23 [2020-10-17T21:39:23.776Z] line after include file
17:39:23 [2020-10-17T21:39:23.776Z] Result of testMethod = 5
17:39:24 [2020-10-17T21:39:24.336Z] Start of script
17:39:24 [2020-10-17T21:39:24.336Z] include file start
17:39:24 [2020-10-17T21:39:24.336Z] Include file processed
17:39:24 [2020-10-17T21:39:24.336Z] line after include file
17:39:24 [2020-10-17T21:39:24.336Z] Result of testMethod = 5
17:39:24 [2020-10-17T21:39:24.336Z] End of script
17:39:24 [2020-10-17T21:39:24.336Z] Start of script
17:39:24 [2020-10-17T21:39:24.336Z] include file start
17:39:24 [2020-10-17T21:39:24.336Z] Include file processed
17:39:24 [2020-10-17T21:39:24.336Z] line after include file
17:39:24 [2020-10-17T21:39:24.592Z] Result of testMethod = 5
17:39:24 [2020-10-17T21:39:24.592Z] End of script
17:39:24 [2020-10-17T21:39:24.592Z] Start of script
17:39:24 [2020-10-17T21:39:24.592Z] include file start
17:39:24 [2020-10-17T21:39:24.592Z] Include file processed
17:39:24 [2020-10-17T21:39:24.592Z] line after include file
17:39:24 [2020-10-17T21:39:24.848Z] Result of testMethod = 5
17:39:24 [2020-10-17T21:39:24.848Z] End of script
17:39:25 [2020-10-17T21:39:25.103Z] Start of script
17:39:25 [2020-10-17T21:39:25.103Z] include file start
17:39:25 [2020-10-17T21:39:25.103Z] Include file processed
17:39:25 [2020-10-17T21:39:25.103Z] line after include file
17:39:25 [2020-10-17T21:39:25.103Z] Result of testMethod = 5
17:39:25 [2020-10-17T21:39:25.103Z] End of script
17:39:25 [2020-10-17T21:39:25.103Z] Start of script
17:39:25 [2020-10-17T21:39:25.103Z] include file start
17:39:25 [2020-10-17T21:39:25.103Z] Include file processed
17:39:25 [2020-10-17T21:39:25.103Z] line after include file
17:39:25 [2020-10-17T21:39:25.103Z] Result of testMethod = 5
17:39:25 [2020-10-17T21:39:25.664Z] Start of script
17:39:25 [2020-10-17T21:39:25.664Z] include file start
17:39:25 [2020-10-17T21:39:25.664Z] Include file processed
17:39:25 [2020-10-17T21:39:25.665Z] line after include file
17:39:25 [2020-10-17T21:39:25.665Z] Result of testMethod = 5
17:39:25 [2020-10-17T21:39:25.665Z] End of script
17:39:25 [2020-10-17T21:39:25.665Z] Start of script
17:39:25 [2020-10-17T21:39:25.665Z] include file start
17:39:25 [2020-10-17T21:39:25.665Z] Include file processed
17:39:25 [2020-10-17T21:39:25.665Z] line after include file
17:39:25 [2020-10-17T21:39:25.665Z] Result of testMethod = 5
17:39:26 [2020-10-17T21:39:26.225Z] Start of script
17:39:26 [2020-10-17T21:39:26.225Z] include file start
17:39:26 [2020-10-17T21:39:26.225Z] Include file processed
17:39:26 [2020-10-17T21:39:26.225Z] line after include file
17:39:26 [2020-10-17T21:39:26.225Z] Result of testMethod = 5
17:39:26 [2020-10-17T21:39:26.225Z] End of script
17:39:26 [2020-10-17T21:39:26.481Z] Start of script
17:39:26 [2020-10-17T21:39:26.481Z] include file start
17:39:26 [2020-10-17T21:39:26.481Z] Include file processed
17:39:26 [2020-10-17T21:39:26.481Z] line after include file
17:39:26 [2020-10-17T21:39:26.736Z] Result of testMethod = 5
17:39:26 [2020-10-17T21:39:26.736Z] End of script
17:39:26 [2020-10-17T21:39:26.736Z] Start of script
17:39:26 [2020-10-17T21:39:26.736Z] include file start
17:39:26 [2020-10-17T21:39:26.736Z] Include file processed
17:39:26 [2020-10-17T21:39:26.736Z] line after include file
17:39:26 [2020-10-17T21:39:26.736Z] Result of testMethod = 5
17:39:26 [2020-10-17T21:39:26.736Z] End of script
17:39:26 [2020-10-17T21:39:26.992Z] Tests run: 42, Failures: 0, Errors: 0, Skipped: 0, Time elapsed: 10.973 s - in org.eclipse.ease.lang.javascript.rhino.RhinoDebugTest
17:39:26 [2020-10-17T21:39:26.992Z] disconnectProcessInSuspendedState(org.eclipse.ease.lang.javascript.rhino.RhinoDebugTest)  Time elapsed: 0.304 s
17:39:26 [2020-10-17T21:39:26.992Z] stepReturnIncludeCommand(org.eclipse.ease.lang.javascript.rhino.RhinoDebugTest)  Time elapsed: 0.21 s
17:39:26 [2020-10-17T21:39:26.992Z] arrayVariableSorting(org.eclipse.ease.lang.javascript.rhino.RhinoDebugTest)  Time elapsed: 0.31 s
17:39:26 [2020-10-17T21:39:26.992Z] stepOverOnDebugTarget(org.eclipse.ease.lang.javascript.rhino.RhinoDebugTest)  Time elapsed: 0.309 s
17:39:26 [2020-10-17T21:39:26.992Z] hasDebugTarget(org.eclipse.ease.lang.javascript.rhino.RhinoDebugTest)  Time elapsed: 0.105 s
17:39:26 [2020-10-17T21:39:26.992Z] disconnectThreadInSuspendedState(org.eclipse.ease.lang.javascript.rhino.RhinoDebugTest)  Time elapsed: 0.208 s
17:39:26 [2020-10-17T21:39:26.992Z] stepReturnOnDebugTarget(org.eclipse.ease.lang.javascript.rhino.RhinoDebugTest)  Time elapsed: 0.309 s
17:39:26 [2020-10-17T21:39:26.992Z] nullVariable(org.eclipse.ease.lang.javascript.rhino.RhinoDebugTest)  Time elapsed: 0.308 s
17:39:26 [2020-10-17T21:39:26.992Z] stepOverOnStackFrame(org.eclipse.ease.lang.javascript.rhino.RhinoDebugTest)  Time elapsed: 0.307 s
17:39:26 [2020-10-17T21:39:26.992Z] resumeOnDebugTarget(org.eclipse.ease.lang.javascript.rhino.RhinoDebugTest)  Time elapsed: 0.206 s
17:39:26 [2020-10-17T21:39:26.992Z] modifyVariableKeepingType(org.eclipse.ease.lang.javascript.rhino.RhinoDebugTest)  Time elapsed: 0.406 s
17:39:26 [2020-10-17T21:39:26.992Z] resumeOnLastIncludeLine(org.eclipse.ease.lang.javascript.rhino.RhinoDebugTest)  Time elapsed: 0.207 s
17:39:26 [2020-10-17T21:39:26.992Z] stepReturnOnStackFrame(org.eclipse.ease.lang.javascript.rhino.RhinoDebugTest)  Time elapsed: 0.307 s
17:39:26 [2020-10-17T21:39:26.992Z] terminateStackFrameInSuspendedState(org.eclipse.ease.lang.javascript.rhino.RhinoDebugTest)  Time elapsed: 0.207 s
17:39:26 [2020-10-17T21:39:26.992Z] breakpointLocation(org.eclipse.ease.lang.javascript.rhino.RhinoDebugTest)  Time elapsed: 0.207 s
17:39:26 [2020-10-17T21:39:26.992Z] stepReturnOnThread(org.eclipse.ease.lang.javascript.rhino.RhinoDebugTest)  Time elapsed: 0.307 s
17:39:26 [2020-10-17T21:39:26.992Z] javaClassVariable(org.eclipse.ease.lang.javascript.rhino.RhinoDebugTest)  Time elapsed: 0.309 s
17:39:26 [2020-10-17T21:39:26.992Z] stepIntoOnThread(org.eclipse.ease.lang.javascript.rhino.RhinoDebugTest)  Time elapsed: 0.306 s
17:39:26 [2020-10-17T21:39:26.992Z] terminateThreadInSuspendedState(org.eclipse.ease.lang.javascript.rhino.RhinoDebugTest)  Time elapsed: 0.207 s
17:39:26 [2020-10-17T21:39:26.992Z] resumeOnThread(org.eclipse.ease.lang.javascript.rhino.RhinoDebugTest)  Time elapsed: 0.205 s
17:39:26 [2020-10-17T21:39:26.992Z] stepIntoOnStackFrame(org.eclipse.ease.lang.javascript.rhino.RhinoDebugTest)  Time elapsed: 0.306 s
17:39:26 [2020-10-17T21:39:26.992Z] terminateProcessInSuspendedState(org.eclipse.ease.lang.javascript.rhino.RhinoDebugTest)  Time elapsed: 0.206 s
17:39:26 [2020-10-17T21:39:26.992Z] stepOverOnProcess(org.eclipse.ease.lang.javascript.rhino.RhinoDebugTest)  Time elapsed: 0.306 s
17:39:26 [2020-10-17T21:39:26.992Z] nativeArrayVariable(org.eclipse.ease.lang.javascript.rhino.RhinoDebugTest)  Time elapsed: 0.306 s
17:39:26 [2020-10-17T21:39:26.992Z] disconnectDebugTargetInSuspendedState(org.eclipse.ease.lang.javascript.rhino.RhinoDebugTest)  Time elapsed: 0.206 s
17:39:26 [2020-10-17T21:39:26.992Z] stepIntoOnProcess(org.eclipse.ease.lang.javascript.rhino.RhinoDebugTest)  Time elapsed: 0.306 s
17:39:26 [2020-10-17T21:39:26.992Z] terminatedState(org.eclipse.ease.lang.javascript.rhino.RhinoDebugTest)  Time elapsed: 0.104 s
17:39:26 [2020-10-17T21:39:26.992Z] stepOverIncludeCommand(org.eclipse.ease.lang.javascript.rhino.RhinoDebugTest)  Time elapsed: 0.305 s
17:39:26 [2020-10-17T21:39:26.992Z] innerScopeVariableBeforeOuterScopeVariable(org.eclipse.ease.lang.javascript.rhino.RhinoDebugTest)  Time elapsed: 0.306 s
17:39:26 [2020-10-17T21:39:26.992Z] stepIntoIncludeCommand(org.eclipse.ease.lang.javascript.rhino.RhinoDebugTest)  Time elapsed: 0.305 s
17:39:26 [2020-10-17T21:39:26.992Z] primitiveStringVariable(org.eclipse.ease.lang.javascript.rhino.RhinoDebugTest)  Time elapsed: 0.305 s
17:39:26 [2020-10-17T21:39:26.992Z] resumeOnProcess(org.eclipse.ease.lang.javascript.rhino.RhinoDebugTest)  Time elapsed: 0.206 s
17:39:26 [2020-10-17T21:39:26.992Z] stepIntoOnDebugTarget(org.eclipse.ease.lang.javascript.rhino.RhinoDebugTest)  Time elapsed: 0.306 s
17:39:26 [2020-10-17T21:39:26.992Z] stepOverOnThread(org.eclipse.ease.lang.javascript.rhino.RhinoDebugTest)  Time elapsed: 0.307 s
17:39:26 [2020-10-17T21:39:26.992Z] suspendedState(org.eclipse.ease.lang.javascript.rhino.RhinoDebugTest)  Time elapsed: 0.204 s
17:39:26 [2020-10-17T21:39:26.992Z] primitiveDoubleVariable(org.eclipse.ease.lang.javascript.rhino.RhinoDebugTest)  Time elapsed: 0.307 s
17:39:26 [2020-10-17T21:39:26.992Z] resumeOnStackFrame(org.eclipse.ease.lang.javascript.rhino.RhinoDebugTest)  Time elapsed: 0.205 s
17:39:26 [2020-10-17T21:39:26.992Z] nativeObjectVariable(org.eclipse.ease.lang.javascript.rhino.RhinoDebugTest)  Time elapsed: 0.305 s
17:39:26 [2020-10-17T21:39:26.992Z] terminateDebugTargetInSuspendedState(org.eclipse.ease.lang.javascript.rhino.RhinoDebugTest)  Time elapsed: 0.205 s
17:39:26 [2020-10-17T21:39:26.992Z] disconnectStackFrameInSuspendedState(org.eclipse.ease.lang.javascript.rhino.RhinoDebugTest)  Time elapsed: 0.205 s
17:39:26 [2020-10-17T21:39:26.992Z] stepReturnOnProcess(org.eclipse.ease.lang.javascript.rhino.RhinoDebugTest)  Time elapsed: 0.306 s
17:39:26 [2020-10-17T21:39:26.992Z] evaluateWatchExpression(org.eclipse.ease.lang.javascript.rhino.RhinoDebugTest)  Time elapsed: 0.207 s
17:39:26 [2020-10-17T21:39:26.992Z] Running org.eclipse.ease.lang.javascript.rhino.RhinoEnvironmentTest
17:39:26 [2020-10-17T21:39:26.992Z] Tests run: 5, Failures: 0, Errors: 0, Skipped: 0, Time elapsed: 0.12 s - in org.eclipse.ease.lang.javascript.rhino.RhinoEnvironmentTest
17:39:26 [2020-10-17T21:39:26.993Z] reloadEnvironment(org.eclipse.ease.lang.javascript.rhino.RhinoEnvironmentTest)  Time elapsed: 0.051 s
17:39:26 [2020-10-17T21:39:26.993Z] bootstrappedEnvironment(org.eclipse.ease.lang.javascript.rhino.RhinoEnvironmentTest)  Time elapsed: 0.016 s
17:39:26 [2020-10-17T21:39:26.993Z] postMethodCallback(org.eclipse.ease.lang.javascript.rhino.RhinoEnvironmentTest)  Time elapsed: 0.02 s
17:39:26 [2020-10-17T21:39:26.993Z] preMethodCallback(org.eclipse.ease.lang.javascript.rhino.RhinoEnvironmentTest)  Time elapsed: 0.013 s
17:39:26 [2020-10-17T21:39:26.993Z] reloadFunctionDefinitions(org.eclipse.ease.lang.javascript.rhino.RhinoEnvironmentTest)  Time elapsed: 0.02 s
17:39:26 [2020-10-17T21:39:26.993Z] Running org.eclipse.ease.lang.javascript.rhino.RhinoScriptEngineTest
17:39:26 [2020-10-17T21:39:26.993Z] org.eclipse.ease.ScriptExecutionException: JavaError: NotThere cannot be found by org.mozilla.javascript_1.7.10.v20190430-1943
17:39:26 [2020-10-17T21:39:26.993Z] 	at <unknown source>
17:39:26 [2020-10-17T21:39:26.993Z] 
17:39:26 [2020-10-17T21:39:26.993Z] Java Stacktrace:
17:39:26 [2020-10-17T21:39:26.993Z] java.lang.ClassNotFoundException: NotThere cannot be found by org.mozilla.javascript_1.7.10.v20190430-1943
17:39:26 [2020-10-17T21:39:26.993Z] 	at org.eclipse.osgi.internal.loader.BundleLoader.findClass(BundleLoader.java:516)
17:39:26 [2020-10-17T21:39:26.993Z] 	at org.eclipse.osgi.internal.loader.ModuleClassLoader.loadClass(ModuleClassLoader.java:171)
17:39:26 [2020-10-17T21:39:26.993Z] 	at java.base/java.lang.ClassLoader.loadClass(ClassLoader.java:521)
17:39:26 [2020-10-17T21:39:26.993Z] 	at java.base/java.lang.Class.forName0(Native Method)
17:39:26 [2020-10-17T21:39:26.993Z] 	at java.base/java.lang.Class.forName(Class.java:315)
17:39:26 [2020-10-17T21:39:26.993Z] 	at java.base/jdk.internal.reflect.NativeMethodAccessorImpl.invoke0(Native Method)
17:39:26 [2020-10-17T21:39:26.993Z] 	at java.base/jdk.internal.reflect.NativeMethodAccessorImpl.invoke(NativeMethodAccessorImpl.java:62)
17:39:26 [2020-10-17T21:39:26.993Z] 	at java.base/jdk.internal.reflect.DelegatingMethodAccessorImpl.invoke(DelegatingMethodAccessorImpl.java:43)
17:39:26 [2020-10-17T21:39:26.993Z] 	at java.base/java.lang.reflect.Method.invoke(Method.java:566)
17:39:26 [2020-10-17T21:39:26.993Z] 	at org.mozilla.javascript.MemberBox.invoke(MemberBox.java:126)
17:39:26 [2020-10-17T21:39:26.993Z] 	at org.mozilla.javascript.NativeJavaMethod.call(NativeJavaMethod.java:225)
17:39:26 [2020-10-17T21:39:26.993Z] 	at org.mozilla.javascript.optimizer.OptRuntime.call1(OptRuntime.java:32)
17:39:26 [2020-10-17T21:39:26.993Z] 	at org.mozilla.javascript.gen.c_27._c_script_0(Unknown Source)
17:39:26 [2020-10-17T21:39:26.993Z] 	at org.mozilla.javascript.gen.c_27.call(Unknown Source)
17:39:26 [2020-10-17T21:39:26.993Z] 	at org.mozilla.javascript.ContextFactory.doTopCall(ContextFactory.java:405)
17:39:26 [2020-10-17T21:39:26.993Z] 	at org.mozilla.javascript.ScriptRuntime.doTopCall(ScriptRuntime.java:3508)
17:39:26 [2020-10-17T21:39:26.993Z] 	at org.mozilla.javascript.gen.c_27.call(Unknown Source)
17:39:26 [2020-10-17T21:39:26.993Z] 	at org.mozilla.javascript.gen.c_27.exec(Unknown Source)
17:39:26 [2020-10-17T21:39:26.993Z] 	at org.mozilla.javascript.Context.evaluateReader(Context.java:1293)
17:39:26 [2020-10-17T21:39:26.993Z] 	at org.eclipse.ease.lang.javascript.rhino.RhinoScriptEngine.internalExecute(RhinoScriptEngine.java:222)
17:39:26 [2020-10-17T21:39:26.993Z] 	at org.eclipse.ease.lang.javascript.rhino.RhinoScriptEngine.execute(RhinoScriptEngine.java:201)
17:39:26 [2020-10-17T21:39:26.993Z] 	at org.eclipse.ease.AbstractScriptEngine.inject(AbstractScriptEngine.java:224)
17:39:26 [2020-10-17T21:39:26.993Z] 	at org.eclipse.ease.AbstractScriptEngine.run(AbstractScriptEngine.java:274)
17:39:26 [2020-10-17T21:39:26.993Z] 	at org.eclipse.core.internal.jobs.Worker.run(Worker.java:63)
17:39:27 [2020-10-17T21:39:27.248Z] org.eclipse.ease.ScriptExecutionException: TypeError: Cannot call method "foobar" of undefined
17:39:27 [2020-10-17T21:39:27.248Z] 	at <unknown source>
17:39:27 [2020-10-17T21:39:27.248Z] org.eclipse.ease.ScriptExecutionException: ScriptException: test
17:39:27 [2020-10-17T21:39:27.248Z] 	at <unknown source>
17:39:27 [2020-10-17T21:39:27.248Z] org.eclipse.ease.ScriptExecutionException: JavaError: java.lang.Exception
17:39:27 [2020-10-17T21:39:27.248Z] 	at <unknown source>
17:39:27 [2020-10-17T21:39:27.248Z] 
17:39:27 [2020-10-17T21:39:27.248Z] Java Stacktrace:
17:39:27 [2020-10-17T21:39:27.248Z] java.lang.Exception
17:39:27 [2020-10-17T21:39:27.248Z] 	at java.base/jdk.internal.reflect.NativeConstructorAccessorImpl.newInstance0(Native Method)
17:39:27 [2020-10-17T21:39:27.248Z] 	at java.base/jdk.internal.reflect.NativeConstructorAccessorImpl.newInstance(NativeConstructorAccessorImpl.java:62)
17:39:27 [2020-10-17T21:39:27.248Z] 	at java.base/jdk.internal.reflect.DelegatingConstructorAccessorImpl.newInstance(DelegatingConstructorAccessorImpl.java:45)
17:39:27 [2020-10-17T21:39:27.248Z] 	at java.base/java.lang.reflect.Constructor.newInstance(Constructor.java:490)
17:39:27 [2020-10-17T21:39:27.248Z] 	at org.mozilla.javascript.MemberBox.newInstance(MemberBox.java:159)
17:39:27 [2020-10-17T21:39:27.248Z] 	at org.mozilla.javascript.NativeJavaClass.constructInternal(NativeJavaClass.java:266)
17:39:27 [2020-10-17T21:39:27.248Z] 	at org.mozilla.javascript.NativeJavaClass.constructSpecific(NativeJavaClass.java:205)
17:39:27 [2020-10-17T21:39:27.248Z] 	at org.mozilla.javascript.NativeJavaClass.construct(NativeJavaClass.java:166)
17:39:27 [2020-10-17T21:39:27.248Z] 	at org.mozilla.javascript.ScriptRuntime.newObject(ScriptRuntime.java:2655)
17:39:27 [2020-10-17T21:39:27.248Z] 	at org.mozilla.javascript.gen.c_45._c_script_0(Unknown Source)
17:39:27 [2020-10-17T21:39:27.248Z] 	at org.mozilla.javascript.gen.c_45.call(Unknown Source)
17:39:27 [2020-10-17T21:39:27.248Z] 	at org.mozilla.javascript.ContextFactory.doTopCall(ContextFactory.java:405)
17:39:27 [2020-10-17T21:39:27.249Z] 	at org.mozilla.javascript.ScriptRuntime.doTopCall(ScriptRuntime.java:3508)
17:39:27 [2020-10-17T21:39:27.249Z] 	at org.mozilla.javascript.gen.c_45.call(Unknown Source)
17:39:27 [2020-10-17T21:39:27.249Z] 	at org.mozilla.javascript.gen.c_45.exec(Unknown Source)
17:39:27 [2020-10-17T21:39:27.249Z] 	at org.mozilla.javascript.Context.evaluateReader(Context.java:1293)
17:39:27 [2020-10-17T21:39:27.249Z] 	at org.eclipse.ease.lang.javascript.rhino.RhinoScriptEngine.internalExecute(RhinoScriptEngine.java:222)
17:39:27 [2020-10-17T21:39:27.249Z] 	at org.eclipse.ease.lang.javascript.rhino.RhinoScriptEngine.execute(RhinoScriptEngine.java:201)
17:39:27 [2020-10-17T21:39:27.249Z] 	at org.eclipse.ease.AbstractScriptEngine.inject(AbstractScriptEngine.java:224)
17:39:27 [2020-10-17T21:39:27.249Z] 	at org.eclipse.ease.AbstractScriptEngine.run(AbstractScriptEngine.java:274)
17:39:27 [2020-10-17T21:39:27.249Z] 	at org.eclipse.core.internal.jobs.Worker.run(Worker.java:63)
17:39:27 [2020-10-17T21:39:27.249Z] org.eclipse.ease.ScriptExecutionException: ScriptException: JavaScript
17:39:27 [2020-10-17T21:39:27.249Z] 	at <unknown source>
17:39:27 [2020-10-17T21:39:27.249Z] org.eclipse.ease.ScriptExecutionException: SyntaxError: unterminated string literal (#1)
17:39:27 [2020-10-17T21:39:27.249Z] 'asdf
17:39:27 [2020-10-17T21:39:27.249Z]     ^
17:39:27 [2020-10-17T21:39:27.249Z] 	at <unknown source>
17:39:27 [2020-10-17T21:39:27.249Z] Tests run: 11, Failures: 0, Errors: 0, Skipped: 0, Time elapsed: 0.164 s - in org.eclipse.ease.lang.javascript.rhino.RhinoScriptEngineTest
17:39:27 [2020-10-17T21:39:27.249Z] causeWrappedException(org.eclipse.ease.lang.javascript.rhino.RhinoScriptEngineTest)  Time elapsed: 0.041 s
17:39:27 [2020-10-17T21:39:27.249Z] optionalModuleParameters(org.eclipse.ease.lang.javascript.rhino.RhinoScriptEngineTest)  Time elapsed: 0.008 s
17:39:27 [2020-10-17T21:39:27.249Z] simpleScriptCode(org.eclipse.ease.lang.javascript.rhino.RhinoScriptEngineTest)  Time elapsed: 0.009 s
17:39:27 [2020-10-17T21:39:27.249Z] causeRuntimeErrorException(org.eclipse.ease.lang.javascript.rhino.RhinoScriptEngineTest)  Time elapsed: 0.009 s
17:39:27 [2020-10-17T21:39:27.249Z] callModuleCode(org.eclipse.ease.lang.javascript.rhino.RhinoScriptEngineTest)  Time elapsed: 0.008 s
17:39:27 [2020-10-17T21:39:27.249Z] throwJavaClass(org.eclipse.ease.lang.javascript.rhino.RhinoScriptEngineTest)  Time elapsed: 0.009 s
17:39:27 [2020-10-17T21:39:27.249Z] throwJavaException(org.eclipse.ease.lang.javascript.rhino.RhinoScriptEngineTest)  Time elapsed: 0.008 s
17:39:27 [2020-10-17T21:39:27.249Z] accessJavaClasses(org.eclipse.ease.lang.javascript.rhino.RhinoScriptEngineTest)  Time elapsed: 0.008 s
17:39:27 [2020-10-17T21:39:27.249Z] accessEclipseClasses(org.eclipse.ease.lang.javascript.rhino.RhinoScriptEngineTest)  Time elapsed: 0.008 s
17:39:27 [2020-10-17T21:39:27.249Z] throwJavaScriptException(org.eclipse.ease.lang.javascript.rhino.RhinoScriptEngineTest)  Time elapsed: 0.043 s
17:39:27 [2020-10-17T21:39:27.249Z] causeSyntaxErrorException(org.eclipse.ease.lang.javascript.rhino.RhinoScriptEngineTest)  Time elapsed: 0.012 s
17:39:27 [2020-10-17T21:39:27.249Z] 
17:39:27 [2020-10-17T21:39:27.249Z] Results:
17:39:27 [2020-10-17T21:39:27.249Z] 
17:39:27 [2020-10-17T21:39:27.249Z] Tests run: 70, Failures: 0, Errors: 0, Skipped: 0
17:39:27 [2020-10-17T21:39:27.249Z] 
17:39:27 [2020-10-17T21:39:27.809Z] [INFO] All tests passed!
17:39:27 [2020-10-17T21:39:27.810Z] [INFO] 
17:39:27 [2020-10-17T21:39:27.810Z] [INFO] --- maven-install-plugin:2.3.1:install (default-install) @ org.eclipse.ease.lang.javascript.rhino.test ---
17:39:27 [2020-10-17T21:39:27.810Z] [INFO] Installing /home/jenkins/agent/workspace/ease.verify.core.target.2019-03/tests/org.eclipse.ease.lang.javascript.rhino.test/target/org.eclipse.ease.lang.javascript.rhino.test-0.8.0-SNAPSHOT.jar to /home/jenkins/.m2/repository/org/eclipse/ease/org.eclipse.ease.lang.javascript.rhino.test/0.8.0-SNAPSHOT/org.eclipse.ease.lang.javascript.rhino.test-0.8.0-SNAPSHOT.jar
17:39:27 [2020-10-17T21:39:27.810Z] [INFO] Installing /home/jenkins/agent/workspace/ease.verify.core.target.2019-03/tests/org.eclipse.ease.lang.javascript.rhino.test/pom.xml to /home/jenkins/.m2/repository/org/eclipse/ease/org.eclipse.ease.lang.javascript.rhino.test/0.8.0-SNAPSHOT/org.eclipse.ease.lang.javascript.rhino.test-0.8.0-SNAPSHOT.pom
17:39:27 [2020-10-17T21:39:27.810Z] [INFO] Installing /home/jenkins/agent/workspace/ease.verify.core.target.2019-03/tests/org.eclipse.ease.lang.javascript.rhino.test/target/org.eclipse.ease.lang.javascript.rhino.test-0.8.0-SNAPSHOT-sources.jar to /home/jenkins/.m2/repository/org/eclipse/ease/org.eclipse.ease.lang.javascript.rhino.test/0.8.0-SNAPSHOT/org.eclipse.ease.lang.javascript.rhino.test-0.8.0-SNAPSHOT-sources.jar
17:39:27 [2020-10-17T21:39:27.810Z] [INFO] Installing /home/jenkins/agent/workspace/ease.verify.core.target.2019-03/tests/org.eclipse.ease.lang.javascript.rhino.test/target/p2content.xml to /home/jenkins/.m2/repository/org/eclipse/ease/org.eclipse.ease.lang.javascript.rhino.test/0.8.0-SNAPSHOT/org.eclipse.ease.lang.javascript.rhino.test-0.8.0-SNAPSHOT-p2metadata.xml
17:39:27 [2020-10-17T21:39:27.810Z] [INFO] Installing /home/jenkins/agent/workspace/ease.verify.core.target.2019-03/tests/org.eclipse.ease.lang.javascript.rhino.test/target/p2artifacts.xml to /home/jenkins/.m2/repository/org/eclipse/ease/org.eclipse.ease.lang.javascript.rhino.test/0.8.0-SNAPSHOT/org.eclipse.ease.lang.javascript.rhino.test-0.8.0-SNAPSHOT-p2artifacts.xml
17:39:27 [2020-10-17T21:39:27.810Z] [INFO] Installing /home/jenkins/agent/workspace/ease.verify.core.target.2019-03/tests/org.eclipse.ease.lang.javascript.rhino.test/target/p2content.xml to /home/jenkins/.m2/repository/org/eclipse/ease/org.eclipse.ease.lang.javascript.rhino.test/0.8.0-SNAPSHOT/org.eclipse.ease.lang.javascript.rhino.test-0.8.0-SNAPSHOT-p2metadata.xml
17:39:27 [2020-10-17T21:39:27.810Z] [INFO] Installing /home/jenkins/agent/workspace/ease.verify.core.target.2019-03/tests/org.eclipse.ease.lang.javascript.rhino.test/target/p2artifacts.xml to /home/jenkins/.m2/repository/org/eclipse/ease/org.eclipse.ease.lang.javascript.rhino.test/0.8.0-SNAPSHOT/org.eclipse.ease.lang.javascript.rhino.test-0.8.0-SNAPSHOT-p2artifacts.xml
17:39:27 [2020-10-17T21:39:27.810Z] [INFO] 
17:39:27 [2020-10-17T21:39:27.810Z] [INFO] --- tycho-p2-plugin:1.5.0:update-local-index (default-update-local-index) @ org.eclipse.ease.lang.javascript.rhino.test ---
17:39:27 [2020-10-17T21:39:27.810Z] [INFO] 
17:39:27 [2020-10-17T21:39:27.810Z] [INFO] -------< org.eclipse.ease:org.eclipse.ease.lang.javascript.test >-------
17:39:27 [2020-10-17T21:39:27.810Z] [INFO] Building org.eclipse.ease.lang.javascript.test 0.8.0-SNAPSHOT    [41/48]
17:39:27 [2020-10-17T21:39:27.810Z] [INFO] ------------------------[ eclipse-test-plugin ]-------------------------
17:39:27 [2020-10-17T21:39:27.810Z] [INFO] 
17:39:27 [2020-10-17T21:39:27.810Z] [INFO] --- maven-clean-plugin:2.5:clean (default-clean) @ org.eclipse.ease.lang.javascript.test ---
17:39:27 [2020-10-17T21:39:27.810Z] [INFO] 
17:39:27 [2020-10-17T21:39:27.810Z] [INFO] --- tycho-packaging-plugin:1.5.0:build-qualifier (default-build-qualifier) @ org.eclipse.ease.lang.javascript.test ---
17:39:27 [2020-10-17T21:39:27.810Z] [INFO] The project's OSGi version is 0.8.0.I201910171213
17:39:27 [2020-10-17T21:39:27.810Z] [INFO] 
17:39:27 [2020-10-17T21:39:27.810Z] [INFO] --- tycho-packaging-plugin:1.5.0:validate-id (default-validate-id) @ org.eclipse.ease.lang.javascript.test ---
17:39:27 [2020-10-17T21:39:27.810Z] [INFO] 
17:39:27 [2020-10-17T21:39:27.810Z] [INFO] --- tycho-packaging-plugin:1.5.0:validate-version (default-validate-version) @ org.eclipse.ease.lang.javascript.test ---
17:39:27 [2020-10-17T21:39:27.810Z] [INFO] 
17:39:27 [2020-10-17T21:39:27.810Z] [INFO] >>> maven-javadoc-plugin:2.9.1:javadoc (build-docs) > generate-sources @ org.eclipse.ease.lang.javascript.test >>>
17:39:27 [2020-10-17T21:39:27.810Z] [INFO] 
17:39:27 [2020-10-17T21:39:27.810Z] [INFO] --- tycho-packaging-plugin:1.5.0:build-qualifier (default-build-qualifier) @ org.eclipse.ease.lang.javascript.test ---
17:39:27 [2020-10-17T21:39:27.810Z] [INFO] The project's OSGi version is 0.8.0.I201910171213
17:39:27 [2020-10-17T21:39:27.810Z] [INFO] 
17:39:27 [2020-10-17T21:39:27.810Z] [INFO] --- tycho-packaging-plugin:1.5.0:validate-id (default-validate-id) @ org.eclipse.ease.lang.javascript.test ---
17:39:27 [2020-10-17T21:39:27.810Z] [INFO] 
17:39:27 [2020-10-17T21:39:27.810Z] [INFO] --- tycho-packaging-plugin:1.5.0:validate-version (default-validate-version) @ org.eclipse.ease.lang.javascript.test ---
17:39:27 [2020-10-17T21:39:27.810Z] [INFO] 
17:39:27 [2020-10-17T21:39:27.810Z] [INFO] <<< maven-javadoc-plugin:2.9.1:javadoc (build-docs) < generate-sources @ org.eclipse.ease.lang.javascript.test <<<
17:39:27 [2020-10-17T21:39:27.810Z] [INFO] 
17:39:27 [2020-10-17T21:39:27.810Z] [INFO] 
17:39:27 [2020-10-17T21:39:27.810Z] [INFO] --- maven-javadoc-plugin:2.9.1:javadoc (build-docs) @ org.eclipse.ease.lang.javascript.test ---
17:39:28 [2020-10-17T21:39:28.066Z] [ERROR] Error fetching link: http://help.eclipse.org/oxygen/topic/org.eclipse.platform.doc.isv/reference/api/package-list. Ignored it.
17:39:28 [2020-10-17T21:39:28.066Z] [ERROR] Error fetching link: https://ci.eclipse.org/ease/job/ease.build.core/JavaDoc/package-list. Ignored it.
17:39:28 [2020-10-17T21:39:28.992Z] [INFO] 
17:39:28 [2020-10-17T21:39:28.992Z] Loading source files for package org.eclipse.ease.lang.javascript...
17:39:28 [2020-10-17T21:39:28.992Z] Constructing Javadoc information...
17:39:28 [2020-10-17T21:39:28.992Z] WARNING: Cannot open location "/home/jenkins/agent/workspace/ease.verify.core.target.2019-03/tests/org.eclipse.ease.lang.javascript.test/target/javadoc-bundle-options/package-list"
17:39:28 [2020-10-17T21:39:28.992Z] No plugin definition found, skipping
17:39:28 [2020-10-17T21:39:28.992Z] No plugin definition found, skipping
17:39:28 [2020-10-17T21:39:28.992Z] [WARNING] Javadoc Warnings
17:39:28 [2020-10-17T21:39:28.992Z] [WARNING] Picked up JAVA_TOOL_OPTIONS: -Dmaven.ext.class.path="/home/jenkins/agent/workspace/ease.verify.core.target.2019-03@tmp/withMaven135a0756/pipeline-maven-spy.jar" -Dorg.jenkinsci.plugins.pipeline.maven.reportsFolder="/home/jenkins/agent/workspace/ease.verify.core.target.2019-03@tmp/withMaven135a0756"
17:39:28 [2020-10-17T21:39:28.992Z] [WARNING] javadoc: warning - The old Doclet and Taglet APIs in the packages
17:39:28 [2020-10-17T21:39:28.992Z] [WARNING] com.sun.javadoc, com.sun.tools.doclets and their implementations
17:39:28 [2020-10-17T21:39:28.992Z] [WARNING] are planned to be removed in a future JDK release. These
17:39:28 [2020-10-17T21:39:28.992Z] [WARNING] components have been superseded by the new APIs in jdk.javadoc.doclet.
17:39:28 [2020-10-17T21:39:28.992Z] [WARNING] Users are strongly recommended to migrate to the new APIs.
17:39:28 [2020-10-17T21:39:28.992Z] [INFO] 
17:39:28 [2020-10-17T21:39:28.992Z] [INFO] --- build-helper-maven-plugin:1.9.1:add-resource (add_help) @ org.eclipse.ease.lang.javascript.test ---
17:39:28 [2020-10-17T21:39:28.992Z] [INFO] 
17:39:28 [2020-10-17T21:39:28.993Z] [INFO] --- maven-resources-plugin:2.4.3:resources (default-resources) @ org.eclipse.ease.lang.javascript.test ---
17:39:28 [2020-10-17T21:39:28.993Z] [INFO] Using 'UTF-8' encoding to copy filtered resources.
17:39:28 [2020-10-17T21:39:28.993Z] [INFO] skip non existing resourceDirectory /home/jenkins/agent/workspace/ease.verify.core.target.2019-03/tests/org.eclipse.ease.lang.javascript.test/src/main/resources
17:39:28 [2020-10-17T21:39:28.993Z] [INFO] skip non existing resourceDirectory /home/jenkins/agent/workspace/ease.verify.core.target.2019-03/tests/org.eclipse.ease.lang.javascript.test/help
17:39:28 [2020-10-17T21:39:28.993Z] [INFO] 
17:39:28 [2020-10-17T21:39:28.993Z] [INFO] --- tycho-compiler-plugin:1.5.0:compile (default-compile) @ org.eclipse.ease.lang.javascript.test ---
17:39:28 [2020-10-17T21:39:28.993Z] [INFO] Compiling 2 source files to /home/jenkins/agent/workspace/ease.verify.core.target.2019-03/tests/org.eclipse.ease.lang.javascript.test/target/classes
17:39:29 [2020-10-17T21:39:29.279Z] [INFO] 
17:39:29 [2020-10-17T21:39:29.280Z] [INFO] --- maven-resources-plugin:2.4.3:testResources (default-testResources) @ org.eclipse.ease.lang.javascript.test ---
17:39:29 [2020-10-17T21:39:29.280Z] [INFO] Using 'UTF-8' encoding to copy filtered resources.
17:39:29 [2020-10-17T21:39:29.280Z] [INFO] skip non existing resourceDirectory /home/jenkins/agent/workspace/ease.verify.core.target.2019-03/tests/org.eclipse.ease.lang.javascript.test/src/test/resources
17:39:29 [2020-10-17T21:39:29.280Z] [INFO] 
17:39:29 [2020-10-17T21:39:29.280Z] [INFO] --- tycho-source-plugin:1.5.0:plugin-source (plugin-source) @ org.eclipse.ease.lang.javascript.test ---
17:39:29 [2020-10-17T21:39:29.280Z] [WARNING] Bundle-Vendor header not found in /home/jenkins/agent/workspace/ease.verify.core.target.2019-03/tests/org.eclipse.ease.lang.javascript.test/META-INF/MANIFEST.MF, fallback to 'unknown' for source bundle
17:39:29 [2020-10-17T21:39:29.280Z] [INFO] Building jar: /home/jenkins/agent/workspace/ease.verify.core.target.2019-03/tests/org.eclipse.ease.lang.javascript.test/target/org.eclipse.ease.lang.javascript.test-0.8.0-SNAPSHOT-sources.jar
17:39:29 [2020-10-17T21:39:29.280Z] [INFO] 
17:39:29 [2020-10-17T21:39:29.280Z] [INFO] --- target-platform-configuration:1.5.0:target-platform (default-target-platform) @ org.eclipse.ease.lang.javascript.test ---
17:39:29 [2020-10-17T21:39:29.280Z] [INFO] 
17:39:29 [2020-10-17T21:39:29.280Z] [INFO] --- tycho-packaging-plugin:1.5.0:package-plugin (default-package-plugin) @ org.eclipse.ease.lang.javascript.test ---
17:39:29 [2020-10-17T21:39:29.280Z] [INFO] Building jar: /home/jenkins/agent/workspace/ease.verify.core.target.2019-03/tests/org.eclipse.ease.lang.javascript.test/target/org.eclipse.ease.lang.javascript.test-0.8.0-SNAPSHOT.jar
17:39:29 [2020-10-17T21:39:29.280Z] [INFO] 
17:39:29 [2020-10-17T21:39:29.280Z] [INFO] --- tycho-p2-plugin:1.5.0:p2-metadata-default (default-p2-metadata-default) @ org.eclipse.ease.lang.javascript.test ---
17:39:29 [2020-10-17T21:39:29.280Z] [INFO] 
17:39:29 [2020-10-17T21:39:29.280Z] [INFO] --- tycho-source-feature-plugin:1.5.0:source-feature (source-feature) @ org.eclipse.ease.lang.javascript.test ---
17:39:29 [2020-10-17T21:39:29.280Z] [INFO] 
17:39:29 [2020-10-17T21:39:29.280Z] [INFO] --- tycho-p2-plugin:1.5.0:p2-metadata (attached-p2-metadata) @ org.eclipse.ease.lang.javascript.test ---
17:39:29 [2020-10-17T21:39:29.280Z] [INFO] 
17:39:29 [2020-10-17T21:39:29.280Z] [INFO] --- tycho-surefire-plugin:1.5.0:test (default-test) @ org.eclipse.ease.lang.javascript.test ---
17:39:29 [2020-10-17T21:39:29.280Z] [INFO] Expected eclipse log file: /home/jenkins/agent/workspace/ease.verify.core.target.2019-03/tests/org.eclipse.ease.lang.javascript.test/target/work/data/.metadata/.log
17:39:29 [2020-10-17T21:39:29.280Z] [INFO] Command line:
17:39:29 [2020-10-17T21:39:29.280Z] 	[/opt/tools/java/openjdk/jdk-11/11.0.2+9/bin/java, -Dosgi.noShutdown=false, -Dosgi.os=linux, -Dosgi.ws=gtk, -Dosgi.arch=x86_64, -Dosgi.clean=true, -jar, /home/jenkins/.m2/repository/p2/osgi/bundle/org.eclipse.equinox.launcher/1.5.800.v20200727-1323/org.eclipse.equinox.launcher-1.5.800.v20200727-1323.jar, -data, /home/jenkins/agent/workspace/ease.verify.core.target.2019-03/tests/org.eclipse.ease.lang.javascript.test/target/work/data, -install, /home/jenkins/agent/workspace/ease.verify.core.target.2019-03/tests/org.eclipse.ease.lang.javascript.test/target/work, -configuration, /home/jenkins/agent/workspace/ease.verify.core.target.2019-03/tests/org.eclipse.ease.lang.javascript.test/target/work/configuration, -application, org.eclipse.tycho.surefire.osgibooter.headlesstest, -testproperties, /home/jenkins/agent/workspace/ease.verify.core.target.2019-03/tests/org.eclipse.ease.lang.javascript.test/target/surefire.properties]
17:39:29 [2020-10-17T21:39:29.280Z] Picked up JAVA_TOOL_OPTIONS: -Dmaven.ext.class.path="/home/jenkins/agent/workspace/ease.verify.core.target.2019-03@tmp/withMaven135a0756/pipeline-maven-spy.jar" -Dorg.jenkinsci.plugins.pipeline.maven.reportsFolder="/home/jenkins/agent/workspace/ease.verify.core.target.2019-03@tmp/withMaven135a0756" 
17:39:30 [2020-10-17T21:39:30.644Z] Running org.eclipse.ease.lang.javascript.JavaScriptCodeFactoryTest
17:39:30 [2020-10-17T21:39:30.900Z] Tests run: 1, Failures: 0, Errors: 0, Skipped: 0, Time elapsed: 0.153 s - in org.eclipse.ease.lang.javascript.JavaScriptCodeFactoryTest
17:39:30 [2020-10-17T21:39:30.900Z] testCommentCreator(org.eclipse.ease.lang.javascript.JavaScriptCodeFactoryTest)  Time elapsed: 0.003 s
17:39:30 [2020-10-17T21:39:30.900Z] Running org.eclipse.ease.lang.javascript.JavaScriptCompletionContextTest
17:39:31 [2020-10-17T21:39:31.155Z] Tests run: 8, Failures: 0, Errors: 0, Skipped: 0, Time elapsed: 0.117 s - in org.eclipse.ease.lang.javascript.JavaScriptCompletionContextTest
17:39:31 [2020-10-17T21:39:31.155Z] verifyStaticClassTypes(org.eclipse.ease.lang.javascript.JavaScriptCompletionContextTest)  Time elapsed: 0.003 s
17:39:31 [2020-10-17T21:39:31.155Z] verifyClassInstanceTypes(org.eclipse.ease.lang.javascript.JavaScriptCompletionContextTest)  Time elapsed: 0.005 s
17:39:31 [2020-10-17T21:39:31.155Z] verifyTypesForScriptEngine(org.eclipse.ease.lang.javascript.JavaScriptCompletionContextTest)  Time elapsed: 0.103 s
17:39:31 [2020-10-17T21:39:31.155Z] verifyPackageTypes(org.eclipse.ease.lang.javascript.JavaScriptCompletionContextTest)  Time elapsed: 0 s
17:39:31 [2020-10-17T21:39:31.155Z] definedVariableTypes(org.eclipse.ease.lang.javascript.JavaScriptCompletionContextTest)  Time elapsed: 0.001 s
17:39:31 [2020-10-17T21:39:31.155Z] verifyStringLiteralTypes(org.eclipse.ease.lang.javascript.JavaScriptCompletionContextTest)  Time elapsed: 0 s
17:39:31 [2020-10-17T21:39:31.155Z] verifyUnknownTypes(org.eclipse.ease.lang.javascript.JavaScriptCompletionContextTest)  Time elapsed: 0 s
17:39:31 [2020-10-17T21:39:31.155Z] verifyNoneTypes(org.eclipse.ease.lang.javascript.JavaScriptCompletionContextTest)  Time elapsed: 0.001 s
17:39:31 [2020-10-17T21:39:31.155Z] 
17:39:31 [2020-10-17T21:39:31.155Z] Results:
17:39:31 [2020-10-17T21:39:31.155Z] 
17:39:31 [2020-10-17T21:39:31.155Z] Tests run: 9, Failures: 0, Errors: 0, Skipped: 0
17:39:31 [2020-10-17T21:39:31.155Z] 
17:39:31 [2020-10-17T21:39:31.716Z] [INFO] All tests passed!
17:39:31 [2020-10-17T21:39:31.716Z] [INFO] 
17:39:31 [2020-10-17T21:39:31.717Z] [INFO] --- maven-install-plugin:2.3.1:install (default-install) @ org.eclipse.ease.lang.javascript.test ---
17:39:31 [2020-10-17T21:39:31.717Z] [INFO] Installing /home/jenkins/agent/workspace/ease.verify.core.target.2019-03/tests/org.eclipse.ease.lang.javascript.test/target/org.eclipse.ease.lang.javascript.test-0.8.0-SNAPSHOT.jar to /home/jenkins/.m2/repository/org/eclipse/ease/org.eclipse.ease.lang.javascript.test/0.8.0-SNAPSHOT/org.eclipse.ease.lang.javascript.test-0.8.0-SNAPSHOT.jar
17:39:31 [2020-10-17T21:39:31.717Z] [INFO] Installing /home/jenkins/agent/workspace/ease.verify.core.target.2019-03/tests/org.eclipse.ease.lang.javascript.test/pom.xml to /home/jenkins/.m2/repository/org/eclipse/ease/org.eclipse.ease.lang.javascript.test/0.8.0-SNAPSHOT/org.eclipse.ease.lang.javascript.test-0.8.0-SNAPSHOT.pom
17:39:31 [2020-10-17T21:39:31.717Z] [INFO] Installing /home/jenkins/agent/workspace/ease.verify.core.target.2019-03/tests/org.eclipse.ease.lang.javascript.test/target/org.eclipse.ease.lang.javascript.test-0.8.0-SNAPSHOT-sources.jar to /home/jenkins/.m2/repository/org/eclipse/ease/org.eclipse.ease.lang.javascript.test/0.8.0-SNAPSHOT/org.eclipse.ease.lang.javascript.test-0.8.0-SNAPSHOT-sources.jar
17:39:31 [2020-10-17T21:39:31.717Z] [INFO] Installing /home/jenkins/agent/workspace/ease.verify.core.target.2019-03/tests/org.eclipse.ease.lang.javascript.test/target/p2content.xml to /home/jenkins/.m2/repository/org/eclipse/ease/org.eclipse.ease.lang.javascript.test/0.8.0-SNAPSHOT/org.eclipse.ease.lang.javascript.test-0.8.0-SNAPSHOT-p2metadata.xml
17:39:31 [2020-10-17T21:39:31.717Z] [INFO] Installing /home/jenkins/agent/workspace/ease.verify.core.target.2019-03/tests/org.eclipse.ease.lang.javascript.test/target/p2artifacts.xml to /home/jenkins/.m2/repository/org/eclipse/ease/org.eclipse.ease.lang.javascript.test/0.8.0-SNAPSHOT/org.eclipse.ease.lang.javascript.test-0.8.0-SNAPSHOT-p2artifacts.xml
17:39:31 [2020-10-17T21:39:31.717Z] [INFO] Installing /home/jenkins/agent/workspace/ease.verify.core.target.2019-03/tests/org.eclipse.ease.lang.javascript.test/target/p2content.xml to /home/jenkins/.m2/repository/org/eclipse/ease/org.eclipse.ease.lang.javascript.test/0.8.0-SNAPSHOT/org.eclipse.ease.lang.javascript.test-0.8.0-SNAPSHOT-p2metadata.xml
17:39:31 [2020-10-17T21:39:31.717Z] [INFO] Installing /home/jenkins/agent/workspace/ease.verify.core.target.2019-03/tests/org.eclipse.ease.lang.javascript.test/target/p2artifacts.xml to /home/jenkins/.m2/repository/org/eclipse/ease/org.eclipse.ease.lang.javascript.test/0.8.0-SNAPSHOT/org.eclipse.ease.lang.javascript.test-0.8.0-SNAPSHOT-p2artifacts.xml
17:39:31 [2020-10-17T21:39:31.717Z] [INFO] 
17:39:31 [2020-10-17T21:39:31.717Z] [INFO] --- tycho-p2-plugin:1.5.0:update-local-index (default-update-local-index) @ org.eclipse.ease.lang.javascript.test ---
17:39:31 [2020-10-17T21:39:31.717Z] [INFO] 
17:39:31 [2020-10-17T21:39:31.717Z] [INFO] ---------< org.eclipse.ease:org.eclipse.ease.lang.python.test >---------
17:39:31 [2020-10-17T21:39:31.717Z] [INFO] Building org.eclipse.ease.lang.python.test 0.8.0-SNAPSHOT        [42/48]
17:39:31 [2020-10-17T21:39:31.717Z] [INFO] ------------------------[ eclipse-test-plugin ]-------------------------
17:39:31 [2020-10-17T21:39:31.717Z] [INFO] 
17:39:31 [2020-10-17T21:39:31.717Z] [INFO] --- maven-clean-plugin:2.5:clean (default-clean) @ org.eclipse.ease.lang.python.test ---
17:39:31 [2020-10-17T21:39:31.717Z] [INFO] 
17:39:31 [2020-10-17T21:39:31.717Z] [INFO] --- tycho-packaging-plugin:1.5.0:build-qualifier (default-build-qualifier) @ org.eclipse.ease.lang.python.test ---
17:39:31 [2020-10-17T21:39:31.717Z] [INFO] The project's OSGi version is 0.8.0.I201910171213
17:39:31 [2020-10-17T21:39:31.717Z] [INFO] 
17:39:31 [2020-10-17T21:39:31.717Z] [INFO] --- tycho-packaging-plugin:1.5.0:validate-id (default-validate-id) @ org.eclipse.ease.lang.python.test ---
17:39:31 [2020-10-17T21:39:31.717Z] [INFO] 
17:39:31 [2020-10-17T21:39:31.717Z] [INFO] --- tycho-packaging-plugin:1.5.0:validate-version (default-validate-version) @ org.eclipse.ease.lang.python.test ---
17:39:31 [2020-10-17T21:39:31.717Z] [INFO] 
17:39:31 [2020-10-17T21:39:31.717Z] [INFO] >>> maven-javadoc-plugin:2.9.1:javadoc (build-docs) > generate-sources @ org.eclipse.ease.lang.python.test >>>
17:39:31 [2020-10-17T21:39:31.717Z] [INFO] 
17:39:31 [2020-10-17T21:39:31.717Z] [INFO] --- tycho-packaging-plugin:1.5.0:build-qualifier (default-build-qualifier) @ org.eclipse.ease.lang.python.test ---
17:39:31 [2020-10-17T21:39:31.717Z] [INFO] The project's OSGi version is 0.8.0.I201910171213
17:39:31 [2020-10-17T21:39:31.717Z] [INFO] 
17:39:31 [2020-10-17T21:39:31.717Z] [INFO] --- tycho-packaging-plugin:1.5.0:validate-id (default-validate-id) @ org.eclipse.ease.lang.python.test ---
17:39:31 [2020-10-17T21:39:31.717Z] [INFO] 
17:39:31 [2020-10-17T21:39:31.717Z] [INFO] --- tycho-packaging-plugin:1.5.0:validate-version (default-validate-version) @ org.eclipse.ease.lang.python.test ---
17:39:31 [2020-10-17T21:39:31.717Z] [INFO] 
17:39:31 [2020-10-17T21:39:31.717Z] [INFO] <<< maven-javadoc-plugin:2.9.1:javadoc (build-docs) < generate-sources @ org.eclipse.ease.lang.python.test <<<
17:39:31 [2020-10-17T21:39:31.717Z] [INFO] 
17:39:31 [2020-10-17T21:39:31.717Z] [INFO] 
17:39:31 [2020-10-17T21:39:31.717Z] [INFO] --- maven-javadoc-plugin:2.9.1:javadoc (build-docs) @ org.eclipse.ease.lang.python.test ---
17:39:31 [2020-10-17T21:39:31.717Z] [ERROR] Error fetching link: http://help.eclipse.org/oxygen/topic/org.eclipse.platform.doc.isv/reference/api/package-list. Ignored it.
17:39:31 [2020-10-17T21:39:31.980Z] [ERROR] Error fetching link: https://ci.eclipse.org/ease/job/ease.build.core/JavaDoc/package-list. Ignored it.
17:39:32 [2020-10-17T21:39:32.905Z] [INFO] 
17:39:32 [2020-10-17T21:39:32.905Z] Loading source files for package org.eclipse.ease.lang.python...
17:39:32 [2020-10-17T21:39:32.905Z] Constructing Javadoc information...
17:39:32 [2020-10-17T21:39:32.905Z] WARNING: Cannot open location "/home/jenkins/agent/workspace/ease.verify.core.target.2019-03/tests/org.eclipse.ease.lang.python.test/target/javadoc-bundle-options/package-list"
17:39:32 [2020-10-17T21:39:32.905Z] No plugin definition found, skipping
17:39:32 [2020-10-17T21:39:32.905Z] No plugin definition found, skipping
17:39:32 [2020-10-17T21:39:32.905Z] [WARNING] Javadoc Warnings
17:39:32 [2020-10-17T21:39:32.905Z] [WARNING] Picked up JAVA_TOOL_OPTIONS: -Dmaven.ext.class.path="/home/jenkins/agent/workspace/ease.verify.core.target.2019-03@tmp/withMaven135a0756/pipeline-maven-spy.jar" -Dorg.jenkinsci.plugins.pipeline.maven.reportsFolder="/home/jenkins/agent/workspace/ease.verify.core.target.2019-03@tmp/withMaven135a0756"
17:39:32 [2020-10-17T21:39:32.905Z] [WARNING] javadoc: warning - The old Doclet and Taglet APIs in the packages
17:39:32 [2020-10-17T21:39:32.905Z] [WARNING] com.sun.javadoc, com.sun.tools.doclets and their implementations
17:39:32 [2020-10-17T21:39:32.905Z] [WARNING] are planned to be removed in a future JDK release. These
17:39:32 [2020-10-17T21:39:32.905Z] [WARNING] components have been superseded by the new APIs in jdk.javadoc.doclet.
17:39:32 [2020-10-17T21:39:32.905Z] [WARNING] Users are strongly recommended to migrate to the new APIs.
17:39:32 [2020-10-17T21:39:32.905Z] [INFO] 
17:39:32 [2020-10-17T21:39:32.905Z] [INFO] --- build-helper-maven-plugin:1.9.1:add-resource (add_help) @ org.eclipse.ease.lang.python.test ---
17:39:32 [2020-10-17T21:39:32.905Z] [INFO] 
17:39:32 [2020-10-17T21:39:32.905Z] [INFO] --- maven-resources-plugin:2.4.3:resources (default-resources) @ org.eclipse.ease.lang.python.test ---
17:39:32 [2020-10-17T21:39:32.905Z] [INFO] Using 'UTF-8' encoding to copy filtered resources.
17:39:32 [2020-10-17T21:39:32.905Z] [INFO] skip non existing resourceDirectory /home/jenkins/agent/workspace/ease.verify.core.target.2019-03/tests/org.eclipse.ease.lang.python.test/src/main/resources
17:39:32 [2020-10-17T21:39:32.906Z] [INFO] skip non existing resourceDirectory /home/jenkins/agent/workspace/ease.verify.core.target.2019-03/tests/org.eclipse.ease.lang.python.test/help
17:39:32 [2020-10-17T21:39:32.906Z] [INFO] 
17:39:32 [2020-10-17T21:39:32.906Z] [INFO] --- tycho-compiler-plugin:1.5.0:compile (default-compile) @ org.eclipse.ease.lang.python.test ---
17:39:32 [2020-10-17T21:39:32.906Z] [INFO] Compiling 1 source file to /home/jenkins/agent/workspace/ease.verify.core.target.2019-03/tests/org.eclipse.ease.lang.python.test/target/classes
17:39:32 [2020-10-17T21:39:32.906Z] [INFO] 
17:39:32 [2020-10-17T21:39:32.906Z] [INFO] --- maven-resources-plugin:2.4.3:testResources (default-testResources) @ org.eclipse.ease.lang.python.test ---
17:39:32 [2020-10-17T21:39:32.906Z] [INFO] Using 'UTF-8' encoding to copy filtered resources.
17:39:32 [2020-10-17T21:39:32.906Z] [INFO] skip non existing resourceDirectory /home/jenkins/agent/workspace/ease.verify.core.target.2019-03/tests/org.eclipse.ease.lang.python.test/src/test/resources
17:39:32 [2020-10-17T21:39:32.906Z] [INFO] 
17:39:32 [2020-10-17T21:39:32.906Z] [INFO] --- tycho-source-plugin:1.5.0:plugin-source (plugin-source) @ org.eclipse.ease.lang.python.test ---
17:39:32 [2020-10-17T21:39:32.906Z] [WARNING] Bundle-Vendor header not found in /home/jenkins/agent/workspace/ease.verify.core.target.2019-03/tests/org.eclipse.ease.lang.python.test/META-INF/MANIFEST.MF, fallback to 'unknown' for source bundle
17:39:32 [2020-10-17T21:39:32.906Z] [INFO] Building jar: /home/jenkins/agent/workspace/ease.verify.core.target.2019-03/tests/org.eclipse.ease.lang.python.test/target/org.eclipse.ease.lang.python.test-0.8.0-SNAPSHOT-sources.jar
17:39:32 [2020-10-17T21:39:32.906Z] [INFO] 
17:39:32 [2020-10-17T21:39:32.906Z] [INFO] --- target-platform-configuration:1.5.0:target-platform (default-target-platform) @ org.eclipse.ease.lang.python.test ---
17:39:32 [2020-10-17T21:39:32.906Z] [INFO] 
17:39:32 [2020-10-17T21:39:32.906Z] [INFO] --- tycho-packaging-plugin:1.5.0:package-plugin (default-package-plugin) @ org.eclipse.ease.lang.python.test ---
17:39:32 [2020-10-17T21:39:32.906Z] [INFO] Building jar: /home/jenkins/agent/workspace/ease.verify.core.target.2019-03/tests/org.eclipse.ease.lang.python.test/target/org.eclipse.ease.lang.python.test-0.8.0-SNAPSHOT.jar
17:39:32 [2020-10-17T21:39:32.906Z] [INFO] 
17:39:32 [2020-10-17T21:39:32.906Z] [INFO] --- tycho-p2-plugin:1.5.0:p2-metadata-default (default-p2-metadata-default) @ org.eclipse.ease.lang.python.test ---
17:39:32 [2020-10-17T21:39:32.906Z] [INFO] 
17:39:32 [2020-10-17T21:39:32.906Z] [INFO] --- tycho-source-feature-plugin:1.5.0:source-feature (source-feature) @ org.eclipse.ease.lang.python.test ---
17:39:32 [2020-10-17T21:39:32.906Z] [INFO] 
17:39:32 [2020-10-17T21:39:32.906Z] [INFO] --- tycho-p2-plugin:1.5.0:p2-metadata (attached-p2-metadata) @ org.eclipse.ease.lang.python.test ---
17:39:32 [2020-10-17T21:39:32.906Z] [INFO] 
17:39:32 [2020-10-17T21:39:32.906Z] [INFO] --- tycho-surefire-plugin:1.5.0:test (default-test) @ org.eclipse.ease.lang.python.test ---
17:39:32 [2020-10-17T21:39:32.906Z] [INFO] Expected eclipse log file: /home/jenkins/agent/workspace/ease.verify.core.target.2019-03/tests/org.eclipse.ease.lang.python.test/target/work/data/.metadata/.log
17:39:32 [2020-10-17T21:39:32.906Z] [INFO] Command line:
17:39:32 [2020-10-17T21:39:32.906Z] 	[/opt/tools/java/openjdk/jdk-11/11.0.2+9/bin/java, -Dosgi.noShutdown=false, -Dosgi.os=linux, -Dosgi.ws=gtk, -Dosgi.arch=x86_64, -Dosgi.clean=true, -jar, /home/jenkins/.m2/repository/p2/osgi/bundle/org.eclipse.equinox.launcher/1.5.800.v20200727-1323/org.eclipse.equinox.launcher-1.5.800.v20200727-1323.jar, -data, /home/jenkins/agent/workspace/ease.verify.core.target.2019-03/tests/org.eclipse.ease.lang.python.test/target/work/data, -install, /home/jenkins/agent/workspace/ease.verify.core.target.2019-03/tests/org.eclipse.ease.lang.python.test/target/work, -configuration, /home/jenkins/agent/workspace/ease.verify.core.target.2019-03/tests/org.eclipse.ease.lang.python.test/target/work/configuration, -application, org.eclipse.tycho.surefire.osgibooter.headlesstest, -testproperties, /home/jenkins/agent/workspace/ease.verify.core.target.2019-03/tests/org.eclipse.ease.lang.python.test/target/surefire.properties]
17:39:32 [2020-10-17T21:39:32.906Z] Picked up JAVA_TOOL_OPTIONS: -Dmaven.ext.class.path="/home/jenkins/agent/workspace/ease.verify.core.target.2019-03@tmp/withMaven135a0756/pipeline-maven-spy.jar" -Dorg.jenkinsci.plugins.pipeline.maven.reportsFolder="/home/jenkins/agent/workspace/ease.verify.core.target.2019-03@tmp/withMaven135a0756" 
17:39:34 [2020-10-17T21:39:34.812Z] Running org.eclipse.ease.lang.python.PythonCodeFactoryTest
17:39:34 [2020-10-17T21:39:34.812Z] Tests run: 1, Failures: 0, Errors: 0, Skipped: 0, Time elapsed: 0.03 s - in org.eclipse.ease.lang.python.PythonCodeFactoryTest
17:39:34 [2020-10-17T21:39:34.812Z] testCommentCreator(org.eclipse.ease.lang.python.PythonCodeFactoryTest)  Time elapsed: 0.003 s
17:39:34 [2020-10-17T21:39:34.812Z] 
17:39:34 [2020-10-17T21:39:34.812Z] Results:
17:39:34 [2020-10-17T21:39:34.812Z] 
17:39:34 [2020-10-17T21:39:34.812Z] Tests run: 1, Failures: 0, Errors: 0, Skipped: 0
17:39:34 [2020-10-17T21:39:34.813Z] 
17:39:35 [2020-10-17T21:39:35.374Z] [INFO] All tests passed!
17:39:35 [2020-10-17T21:39:35.374Z] [INFO] 
17:39:35 [2020-10-17T21:39:35.374Z] [INFO] --- maven-install-plugin:2.3.1:install (default-install) @ org.eclipse.ease.lang.python.test ---
17:39:35 [2020-10-17T21:39:35.374Z] [INFO] Installing /home/jenkins/agent/workspace/ease.verify.core.target.2019-03/tests/org.eclipse.ease.lang.python.test/target/org.eclipse.ease.lang.python.test-0.8.0-SNAPSHOT.jar to /home/jenkins/.m2/repository/org/eclipse/ease/org.eclipse.ease.lang.python.test/0.8.0-SNAPSHOT/org.eclipse.ease.lang.python.test-0.8.0-SNAPSHOT.jar
17:39:35 [2020-10-17T21:39:35.374Z] [INFO] Installing /home/jenkins/agent/workspace/ease.verify.core.target.2019-03/tests/org.eclipse.ease.lang.python.test/pom.xml to /home/jenkins/.m2/repository/org/eclipse/ease/org.eclipse.ease.lang.python.test/0.8.0-SNAPSHOT/org.eclipse.ease.lang.python.test-0.8.0-SNAPSHOT.pom
17:39:35 [2020-10-17T21:39:35.374Z] [INFO] Installing /home/jenkins/agent/workspace/ease.verify.core.target.2019-03/tests/org.eclipse.ease.lang.python.test/target/org.eclipse.ease.lang.python.test-0.8.0-SNAPSHOT-sources.jar to /home/jenkins/.m2/repository/org/eclipse/ease/org.eclipse.ease.lang.python.test/0.8.0-SNAPSHOT/org.eclipse.ease.lang.python.test-0.8.0-SNAPSHOT-sources.jar
17:39:35 [2020-10-17T21:39:35.374Z] [INFO] Installing /home/jenkins/agent/workspace/ease.verify.core.target.2019-03/tests/org.eclipse.ease.lang.python.test/target/p2content.xml to /home/jenkins/.m2/repository/org/eclipse/ease/org.eclipse.ease.lang.python.test/0.8.0-SNAPSHOT/org.eclipse.ease.lang.python.test-0.8.0-SNAPSHOT-p2metadata.xml
17:39:35 [2020-10-17T21:39:35.374Z] [INFO] Installing /home/jenkins/agent/workspace/ease.verify.core.target.2019-03/tests/org.eclipse.ease.lang.python.test/target/p2artifacts.xml to /home/jenkins/.m2/repository/org/eclipse/ease/org.eclipse.ease.lang.python.test/0.8.0-SNAPSHOT/org.eclipse.ease.lang.python.test-0.8.0-SNAPSHOT-p2artifacts.xml
17:39:35 [2020-10-17T21:39:35.374Z] [INFO] Installing /home/jenkins/agent/workspace/ease.verify.core.target.2019-03/tests/org.eclipse.ease.lang.python.test/target/p2content.xml to /home/jenkins/.m2/repository/org/eclipse/ease/org.eclipse.ease.lang.python.test/0.8.0-SNAPSHOT/org.eclipse.ease.lang.python.test-0.8.0-SNAPSHOT-p2metadata.xml
17:39:35 [2020-10-17T21:39:35.374Z] [INFO] Installing /home/jenkins/agent/workspace/ease.verify.core.target.2019-03/tests/org.eclipse.ease.lang.python.test/target/p2artifacts.xml to /home/jenkins/.m2/repository/org/eclipse/ease/org.eclipse.ease.lang.python.test/0.8.0-SNAPSHOT/org.eclipse.ease.lang.python.test-0.8.0-SNAPSHOT-p2artifacts.xml
17:39:35 [2020-10-17T21:39:35.374Z] [INFO] 
17:39:35 [2020-10-17T21:39:35.374Z] [INFO] --- tycho-p2-plugin:1.5.0:update-local-index (default-update-local-index) @ org.eclipse.ease.lang.python.test ---
17:39:35 [2020-10-17T21:39:35.374Z] [INFO] 
17:39:35 [2020-10-17T21:39:35.374Z] [INFO] -----< org.eclipse.ease:org.eclipse.ease.lang.python.jython.test >------
17:39:35 [2020-10-17T21:39:35.375Z] [INFO] Building org.eclipse.ease.lang.python.jython.test 0.8.0-SNAPSHOT [43/48]
17:39:35 [2020-10-17T21:39:35.375Z] [INFO] ------------------------[ eclipse-test-plugin ]-------------------------
17:39:35 [2020-10-17T21:39:35.375Z] [INFO] 
17:39:35 [2020-10-17T21:39:35.375Z] [INFO] --- maven-clean-plugin:2.5:clean (default-clean) @ org.eclipse.ease.lang.python.jython.test ---
17:39:35 [2020-10-17T21:39:35.375Z] [INFO] 
17:39:35 [2020-10-17T21:39:35.375Z] [INFO] --- tycho-packaging-plugin:1.5.0:build-qualifier (default-build-qualifier) @ org.eclipse.ease.lang.python.jython.test ---
17:39:35 [2020-10-17T21:39:35.375Z] [INFO] The project's OSGi version is 0.8.0.I201911291239
17:39:35 [2020-10-17T21:39:35.375Z] [INFO] 
17:39:35 [2020-10-17T21:39:35.375Z] [INFO] --- tycho-packaging-plugin:1.5.0:validate-id (default-validate-id) @ org.eclipse.ease.lang.python.jython.test ---
17:39:35 [2020-10-17T21:39:35.375Z] [INFO] 
17:39:35 [2020-10-17T21:39:35.375Z] [INFO] --- tycho-packaging-plugin:1.5.0:validate-version (default-validate-version) @ org.eclipse.ease.lang.python.jython.test ---
17:39:35 [2020-10-17T21:39:35.375Z] [INFO] 
17:39:35 [2020-10-17T21:39:35.375Z] [INFO] >>> maven-javadoc-plugin:2.9.1:javadoc (build-docs) > generate-sources @ org.eclipse.ease.lang.python.jython.test >>>
17:39:35 [2020-10-17T21:39:35.375Z] [INFO] 
17:39:35 [2020-10-17T21:39:35.375Z] [INFO] --- tycho-packaging-plugin:1.5.0:build-qualifier (default-build-qualifier) @ org.eclipse.ease.lang.python.jython.test ---
17:39:35 [2020-10-17T21:39:35.375Z] [INFO] The project's OSGi version is 0.8.0.I201911291239
17:39:35 [2020-10-17T21:39:35.375Z] [INFO] 
17:39:35 [2020-10-17T21:39:35.375Z] [INFO] --- tycho-packaging-plugin:1.5.0:validate-id (default-validate-id) @ org.eclipse.ease.lang.python.jython.test ---
17:39:35 [2020-10-17T21:39:35.375Z] [INFO] 
17:39:35 [2020-10-17T21:39:35.375Z] [INFO] --- tycho-packaging-plugin:1.5.0:validate-version (default-validate-version) @ org.eclipse.ease.lang.python.jython.test ---
17:39:35 [2020-10-17T21:39:35.375Z] [INFO] 
17:39:35 [2020-10-17T21:39:35.375Z] [INFO] <<< maven-javadoc-plugin:2.9.1:javadoc (build-docs) < generate-sources @ org.eclipse.ease.lang.python.jython.test <<<
17:39:35 [2020-10-17T21:39:35.375Z] [INFO] 
17:39:35 [2020-10-17T21:39:35.375Z] [INFO] 
17:39:35 [2020-10-17T21:39:35.375Z] [INFO] --- maven-javadoc-plugin:2.9.1:javadoc (build-docs) @ org.eclipse.ease.lang.python.jython.test ---
17:39:35 [2020-10-17T21:39:35.375Z] [ERROR] Error fetching link: http://help.eclipse.org/oxygen/topic/org.eclipse.platform.doc.isv/reference/api/package-list. Ignored it.
17:39:35 [2020-10-17T21:39:35.375Z] [ERROR] Error fetching link: https://ci.eclipse.org/ease/job/ease.build.core/JavaDoc/package-list. Ignored it.
17:39:36 [2020-10-17T21:39:36.738Z] [INFO] 
17:39:36 [2020-10-17T21:39:36.738Z] Loading source files for package org.eclipse.ease.lang.python.jython.debugger...
17:39:36 [2020-10-17T21:39:36.738Z] Constructing Javadoc information...
17:39:36 [2020-10-17T21:39:36.738Z] WARNING: Cannot open location "/home/jenkins/agent/workspace/ease.verify.core.target.2019-03/tests/org.eclipse.ease.lang.python.jython.test/target/javadoc-bundle-options/package-list"
17:39:36 [2020-10-17T21:39:36.738Z] No plugin definition found, skipping
17:39:36 [2020-10-17T21:39:36.738Z] No plugin definition found, skipping
17:39:36 [2020-10-17T21:39:36.738Z] [WARNING] Javadoc Warnings
17:39:36 [2020-10-17T21:39:36.738Z] [WARNING] Picked up JAVA_TOOL_OPTIONS: -Dmaven.ext.class.path="/home/jenkins/agent/workspace/ease.verify.core.target.2019-03@tmp/withMaven135a0756/pipeline-maven-spy.jar" -Dorg.jenkinsci.plugins.pipeline.maven.reportsFolder="/home/jenkins/agent/workspace/ease.verify.core.target.2019-03@tmp/withMaven135a0756"
17:39:36 [2020-10-17T21:39:36.738Z] [WARNING] javadoc: warning - The old Doclet and Taglet APIs in the packages
17:39:36 [2020-10-17T21:39:36.738Z] [WARNING] com.sun.javadoc, com.sun.tools.doclets and their implementations
17:39:36 [2020-10-17T21:39:36.738Z] [WARNING] are planned to be removed in a future JDK release. These
17:39:36 [2020-10-17T21:39:36.738Z] [WARNING] components have been superseded by the new APIs in jdk.javadoc.doclet.
17:39:36 [2020-10-17T21:39:36.738Z] [WARNING] Users are strongly recommended to migrate to the new APIs.
17:39:36 [2020-10-17T21:39:36.738Z] [INFO] 
17:39:36 [2020-10-17T21:39:36.738Z] [INFO] --- build-helper-maven-plugin:1.9.1:add-resource (add_help) @ org.eclipse.ease.lang.python.jython.test ---
17:39:36 [2020-10-17T21:39:36.738Z] [INFO] 
17:39:36 [2020-10-17T21:39:36.738Z] [INFO] --- maven-resources-plugin:2.4.3:resources (default-resources) @ org.eclipse.ease.lang.python.jython.test ---
17:39:36 [2020-10-17T21:39:36.738Z] [INFO] Using 'UTF-8' encoding to copy filtered resources.
17:39:36 [2020-10-17T21:39:36.738Z] [INFO] skip non existing resourceDirectory /home/jenkins/agent/workspace/ease.verify.core.target.2019-03/tests/org.eclipse.ease.lang.python.jython.test/src/main/resources
17:39:36 [2020-10-17T21:39:36.738Z] [INFO] skip non existing resourceDirectory /home/jenkins/agent/workspace/ease.verify.core.target.2019-03/tests/org.eclipse.ease.lang.python.jython.test/help
17:39:36 [2020-10-17T21:39:36.738Z] [INFO] 
17:39:36 [2020-10-17T21:39:36.738Z] [INFO] --- tycho-compiler-plugin:1.5.0:compile (default-compile) @ org.eclipse.ease.lang.python.jython.test ---
17:39:36 [2020-10-17T21:39:36.738Z] [INFO] Compiling 1 source file to /home/jenkins/agent/workspace/ease.verify.core.target.2019-03/tests/org.eclipse.ease.lang.python.jython.test/target/classes
17:39:36 [2020-10-17T21:39:36.738Z] [INFO] 
17:39:36 [2020-10-17T21:39:36.738Z] [INFO] --- maven-resources-plugin:2.4.3:testResources (default-testResources) @ org.eclipse.ease.lang.python.jython.test ---
17:39:36 [2020-10-17T21:39:36.738Z] [INFO] Using 'UTF-8' encoding to copy filtered resources.
17:39:36 [2020-10-17T21:39:36.738Z] [INFO] skip non existing resourceDirectory /home/jenkins/agent/workspace/ease.verify.core.target.2019-03/tests/org.eclipse.ease.lang.python.jython.test/src/test/resources
17:39:36 [2020-10-17T21:39:36.738Z] [INFO] 
17:39:36 [2020-10-17T21:39:36.738Z] [INFO] --- tycho-source-plugin:1.5.0:plugin-source (plugin-source) @ org.eclipse.ease.lang.python.jython.test ---
17:39:36 [2020-10-17T21:39:36.739Z] [WARNING] Bundle-Vendor header not found in /home/jenkins/agent/workspace/ease.verify.core.target.2019-03/tests/org.eclipse.ease.lang.python.jython.test/META-INF/MANIFEST.MF, fallback to 'unknown' for source bundle
17:39:36 [2020-10-17T21:39:36.739Z] [INFO] Building jar: /home/jenkins/agent/workspace/ease.verify.core.target.2019-03/tests/org.eclipse.ease.lang.python.jython.test/target/org.eclipse.ease.lang.python.jython.test-0.8.0-SNAPSHOT-sources.jar
17:39:36 [2020-10-17T21:39:36.739Z] [INFO] 
17:39:36 [2020-10-17T21:39:36.739Z] [INFO] --- target-platform-configuration:1.5.0:target-platform (default-target-platform) @ org.eclipse.ease.lang.python.jython.test ---
17:39:36 [2020-10-17T21:39:36.739Z] [INFO] 
17:39:36 [2020-10-17T21:39:36.739Z] [INFO] --- tycho-packaging-plugin:1.5.0:package-plugin (default-package-plugin) @ org.eclipse.ease.lang.python.jython.test ---
17:39:36 [2020-10-17T21:39:36.739Z] [INFO] Building jar: /home/jenkins/agent/workspace/ease.verify.core.target.2019-03/tests/org.eclipse.ease.lang.python.jython.test/target/org.eclipse.ease.lang.python.jython.test-0.8.0-SNAPSHOT.jar
17:39:36 [2020-10-17T21:39:36.739Z] [INFO] 
17:39:36 [2020-10-17T21:39:36.739Z] [INFO] --- tycho-p2-plugin:1.5.0:p2-metadata-default (default-p2-metadata-default) @ org.eclipse.ease.lang.python.jython.test ---
17:39:36 [2020-10-17T21:39:36.739Z] [INFO] 
17:39:36 [2020-10-17T21:39:36.739Z] [INFO] --- tycho-source-feature-plugin:1.5.0:source-feature (source-feature) @ org.eclipse.ease.lang.python.jython.test ---
17:39:36 [2020-10-17T21:39:36.739Z] [INFO] 
17:39:36 [2020-10-17T21:39:36.739Z] [INFO] --- tycho-p2-plugin:1.5.0:p2-metadata (attached-p2-metadata) @ org.eclipse.ease.lang.python.jython.test ---
17:39:36 [2020-10-17T21:39:36.739Z] [INFO] 
17:39:36 [2020-10-17T21:39:36.739Z] [INFO] --- tycho-surefire-plugin:1.5.0:test (default-test) @ org.eclipse.ease.lang.python.jython.test ---
17:39:36 [2020-10-17T21:39:36.998Z] [INFO] Expected eclipse log file: /home/jenkins/agent/workspace/ease.verify.core.target.2019-03/tests/org.eclipse.ease.lang.python.jython.test/target/work/data/.metadata/.log
17:39:36 [2020-10-17T21:39:36.998Z] [INFO] Command line:
17:39:36 [2020-10-17T21:39:36.998Z] 	[/opt/tools/java/openjdk/jdk-11/11.0.2+9/bin/java, -Dosgi.noShutdown=false, -Dosgi.os=linux, -Dosgi.ws=gtk, -Dosgi.arch=x86_64, -Dosgi.clean=true, -jar, /home/jenkins/.m2/repository/p2/osgi/bundle/org.eclipse.equinox.launcher/1.5.800.v20200727-1323/org.eclipse.equinox.launcher-1.5.800.v20200727-1323.jar, -data, /home/jenkins/agent/workspace/ease.verify.core.target.2019-03/tests/org.eclipse.ease.lang.python.jython.test/target/work/data, -install, /home/jenkins/agent/workspace/ease.verify.core.target.2019-03/tests/org.eclipse.ease.lang.python.jython.test/target/work, -configuration, /home/jenkins/agent/workspace/ease.verify.core.target.2019-03/tests/org.eclipse.ease.lang.python.jython.test/target/work/configuration, -application, org.eclipse.tycho.surefire.osgibooter.headlesstest, -testproperties, /home/jenkins/agent/workspace/ease.verify.core.target.2019-03/tests/org.eclipse.ease.lang.python.jython.test/target/surefire.properties]
17:39:36 [2020-10-17T21:39:36.998Z] Picked up JAVA_TOOL_OPTIONS: -Dmaven.ext.class.path="/home/jenkins/agent/workspace/ease.verify.core.target.2019-03@tmp/withMaven135a0756/pipeline-maven-spy.jar" -Dorg.jenkinsci.plugins.pipeline.maven.reportsFolder="/home/jenkins/agent/workspace/ease.verify.core.target.2019-03@tmp/withMaven135a0756" 
17:39:38 [2020-10-17T21:39:38.941Z] WARNING: An illegal reflective access operation has occurred
17:39:38 [2020-10-17T21:39:38.941Z] WARNING: Illegal reflective access by org.python.core.PySystemState (file:/home/jenkins/agent/workspace/ease.verify.core.target.2019-03/tests/org.eclipse.ease.lang.python.jython.test/target/work/plugins/org.jython_2.7.0.I201609090924/jython.jar) to method java.io.Console.encoding()
17:39:38 [2020-10-17T21:39:38.941Z] WARNING: Please consider reporting this to the maintainers of org.python.core.PySystemState
17:39:38 [2020-10-17T21:39:38.941Z] WARNING: Use --illegal-access=warn to enable warnings of further illegal reflective access operations
17:39:38 [2020-10-17T21:39:38.941Z] WARNING: All illegal access operations will be denied in a future release
17:39:38 [2020-10-17T21:39:38.941Z] Running org.eclipse.ease.lang.python.jython.debugger.JythonDebugTest
17:39:40 [2020-10-17T21:39:40.316Z] Start of script
17:39:40 [2020-10-17T21:39:40.316Z] include file start
17:39:40 [2020-10-17T21:39:40.316Z] include file processed
17:39:40 [2020-10-17T21:39:40.316Z] Result of testMethod = 5
17:39:40 [2020-10-17T21:39:40.316Z] End of script
17:39:40 [2020-10-17T21:39:40.571Z] Start of script
17:39:40 [2020-10-17T21:39:40.571Z] include file start
17:39:40 [2020-10-17T21:39:40.571Z] include file processed
17:39:40 [2020-10-17T21:39:40.571Z] Result of testMethod = 5
17:39:40 [2020-10-17T21:39:40.571Z] End of script
17:39:40 [2020-10-17T21:39:40.571Z] Start of script
17:39:40 [2020-10-17T21:39:40.571Z] include file start
17:39:40 [2020-10-17T21:39:40.571Z] include file processed
17:39:40 [2020-10-17T21:39:40.571Z] Result of testMethod = 5
17:39:40 [2020-10-17T21:39:40.827Z] Traceback (most recent call last):
17:39:40 [2020-10-17T21:39:40.827Z]   File "(none)", line 184, in run
17:39:40 [2020-10-17T21:39:40.827Z]   File "__ref_L/Debug Test/Main.py_sgdfckhphw", line 23, in <module>
17:39:40 [2020-10-17T21:39:40.827Z]   File "(none)", line 161, in trace_dispatch
17:39:40 [2020-10-17T21:39:40.827Z] org.eclipse.ease.ExitException: 
17:39:40 [2020-10-17T21:39:40.827Z] 
17:39:40 [2020-10-17T21:39:40.827Z] org.eclipse.ease.ExitException: org.eclipse.ease.ExitException: 
17:39:41 [2020-10-17T21:39:41.082Z] Start of script
17:39:41 [2020-10-17T21:39:41.082Z] include file start
17:39:41 [2020-10-17T21:39:41.082Z] include file processed
17:39:41 [2020-10-17T21:39:41.082Z] Result of testMethod = 5
17:39:41 [2020-10-17T21:39:41.082Z] End of script
17:39:41 [2020-10-17T21:39:41.643Z] Start of script
17:39:41 [2020-10-17T21:39:41.643Z] include file start
17:39:41 [2020-10-17T21:39:41.643Z] include file processed
17:39:41 [2020-10-17T21:39:41.643Z] Result of testMethod = 5
17:39:41 [2020-10-17T21:39:41.643Z] End of script
17:39:41 [2020-10-17T21:39:41.643Z] Start of script
17:39:41 [2020-10-17T21:39:41.643Z] include file start
17:39:41 [2020-10-17T21:39:41.643Z] include file processed
17:39:41 [2020-10-17T21:39:41.899Z] Result of testMethod = 5
17:39:41 [2020-10-17T21:39:41.899Z] End of script
17:39:41 [2020-10-17T21:39:41.899Z] Start of script
17:39:41 [2020-10-17T21:39:41.899Z] include file start
17:39:41 [2020-10-17T21:39:41.899Z] include file processed
17:39:41 [2020-10-17T21:39:41.899Z] Result of testMethod = 5
17:39:42 [2020-10-17T21:39:42.155Z] Traceback (most recent call last):
17:39:42 [2020-10-17T21:39:42.155Z]   File "(none)", line 184, in run
17:39:42 [2020-10-17T21:39:42.155Z]   File "__ref_L/Debug Test/Main.py_qwomaqpwcm", line 23, in <module>
17:39:42 [2020-10-17T21:39:42.155Z]   File "(none)", line 161, in trace_dispatch
17:39:42 [2020-10-17T21:39:42.155Z] org.eclipse.ease.ExitException: 
17:39:42 [2020-10-17T21:39:42.155Z] 
17:39:42 [2020-10-17T21:39:42.155Z] org.eclipse.ease.ExitException: org.eclipse.ease.ExitException: 
17:39:42 [2020-10-17T21:39:42.155Z] Start of script
17:39:42 [2020-10-17T21:39:42.155Z] include file start
17:39:42 [2020-10-17T21:39:42.155Z] include file processed
17:39:42 [2020-10-17T21:39:42.410Z] Result of testMethod = 5
17:39:42 [2020-10-17T21:39:42.410Z] End of script
17:39:42 [2020-10-17T21:39:42.410Z] Start of script
17:39:42 [2020-10-17T21:39:42.666Z] include file start
17:39:42 [2020-10-17T21:39:42.666Z] include file processed
17:39:42 [2020-10-17T21:39:42.666Z] Result of testMethod = 5
17:39:42 [2020-10-17T21:39:42.666Z] End of script
17:39:42 [2020-10-17T21:39:42.666Z] Start of script
17:39:42 [2020-10-17T21:39:42.666Z] include file start
17:39:42 [2020-10-17T21:39:42.666Z] include file processed
17:39:43 [2020-10-17T21:39:43.226Z] Traceback (most recent call last):
17:39:43 [2020-10-17T21:39:43.226Z]   File "(none)", line 184, in run
17:39:43 [2020-10-17T21:39:43.226Z]   File "__ref_L/Debug Test/Main.py_oqnnhccyrm", line 22, in <module>
17:39:43 [2020-10-17T21:39:43.226Z]   File "(none)", line 161, in trace_dispatch
17:39:43 [2020-10-17T21:39:43.226Z] org.eclipse.ease.ExitException: 
17:39:43 [2020-10-17T21:39:43.226Z] 
17:39:43 [2020-10-17T21:39:43.226Z] org.eclipse.ease.ExitException: org.eclipse.ease.ExitException: 
17:39:43 [2020-10-17T21:39:43.226Z] Start of script
17:39:43 [2020-10-17T21:39:43.226Z] include file start
17:39:43 [2020-10-17T21:39:43.226Z] include file processed
17:39:43 [2020-10-17T21:39:43.226Z] Result of testMethod = 5
17:39:43 [2020-10-17T21:39:43.226Z] End of script
17:39:43 [2020-10-17T21:39:43.482Z] Start of script
17:39:43 [2020-10-17T21:39:43.482Z] include file start
17:39:43 [2020-10-17T21:39:43.482Z] include file processed
17:39:43 [2020-10-17T21:39:43.737Z] Result of testMethod = 5
17:39:43 [2020-10-17T21:39:43.737Z] End of script
17:39:43 [2020-10-17T21:39:43.737Z] Traceback (most recent call last):
17:39:43 [2020-10-17T21:39:43.737Z]   File "(none)", line 184, in run
17:39:43 [2020-10-17T21:39:43.737Z]   File "__ref_L/Debug Test/Main.py_watmitelcl", line 1, in <module>
17:39:43 [2020-10-17T21:39:43.737Z]   File "(none)", line 161, in trace_dispatch
17:39:43 [2020-10-17T21:39:43.737Z] org.eclipse.ease.ExitException: 
17:39:43 [2020-10-17T21:39:43.737Z] 
17:39:43 [2020-10-17T21:39:43.737Z] org.eclipse.ease.ExitException: org.eclipse.ease.ExitException: 
17:39:43 [2020-10-17T21:39:43.992Z] Start of script
17:39:43 [2020-10-17T21:39:43.993Z] include file start
17:39:43 [2020-10-17T21:39:43.993Z] include file processed
17:39:43 [2020-10-17T21:39:43.993Z] Result of testMethod = 5
17:39:43 [2020-10-17T21:39:43.993Z] End of script
17:39:44 [2020-10-17T21:39:44.248Z] Start of script
17:39:44 [2020-10-17T21:39:44.248Z] include file start
17:39:44 [2020-10-17T21:39:44.248Z] include file processed
17:39:44 [2020-10-17T21:39:44.248Z] Result of testMethod = 5
17:39:44 [2020-10-17T21:39:44.248Z] End of script
17:39:44 [2020-10-17T21:39:44.504Z] Start of script
17:39:44 [2020-10-17T21:39:44.504Z] include file start
17:39:44 [2020-10-17T21:39:44.504Z] include file processed
17:39:44 [2020-10-17T21:39:44.504Z] Result of testMethod = 5
17:39:44 [2020-10-17T21:39:44.760Z] Traceback (most recent call last):
17:39:44 [2020-10-17T21:39:44.760Z]   File "(none)", line 184, in run
17:39:44 [2020-10-17T21:39:44.760Z]   File "__ref_L/Debug Test/Main.py_aqbnktoqqi", line 23, in <module>
17:39:44 [2020-10-17T21:39:44.760Z]   File "(none)", line 161, in trace_dispatch
17:39:44 [2020-10-17T21:39:44.760Z] org.eclipse.ease.ExitException: 
17:39:44 [2020-10-17T21:39:44.760Z] 
17:39:44 [2020-10-17T21:39:44.760Z] org.eclipse.ease.ExitException: org.eclipse.ease.ExitException: 
17:39:44 [2020-10-17T21:39:44.760Z] Start of script
17:39:44 [2020-10-17T21:39:44.760Z] include file start
17:39:44 [2020-10-17T21:39:44.760Z] include file processed
17:39:45 [2020-10-17T21:39:45.015Z] Result of testMethod = 5
17:39:45 [2020-10-17T21:39:45.015Z] End of script
17:39:45 [2020-10-17T21:39:45.271Z] Traceback (most recent call last):
17:39:45 [2020-10-17T21:39:45.271Z]   File "(none)", line 184, in run
17:39:45 [2020-10-17T21:39:45.271Z]   File "__ref_L/Debug Test/Main.py_bvudxvvfva", line 1, in <module>
17:39:45 [2020-10-17T21:39:45.271Z]   File "(none)", line 161, in trace_dispatch
17:39:45 [2020-10-17T21:39:45.271Z] org.eclipse.ease.ExitException: 
17:39:45 [2020-10-17T21:39:45.271Z] 
17:39:45 [2020-10-17T21:39:45.271Z] org.eclipse.ease.ExitException: org.eclipse.ease.ExitException: 
17:39:45 [2020-10-17T21:39:45.271Z] Start of script
17:39:45 [2020-10-17T21:39:45.271Z] include file start
17:39:45 [2020-10-17T21:39:45.271Z] include file processed
17:39:45 [2020-10-17T21:39:45.271Z] Result of testMethod = 5
17:39:45 [2020-10-17T21:39:45.271Z] End of script
17:39:45 [2020-10-17T21:39:45.526Z] Start of script
17:39:45 [2020-10-17T21:39:45.526Z] include file start
17:39:45 [2020-10-17T21:39:45.526Z] include file processed
17:39:45 [2020-10-17T21:39:45.782Z] Result of testMethod = 5
17:39:45 [2020-10-17T21:39:45.782Z] End of script
17:39:46 [2020-10-17T21:39:46.038Z] Traceback (most recent call last):
17:39:46 [2020-10-17T21:39:46.038Z]   File "(none)", line 184, in run
17:39:46 [2020-10-17T21:39:46.038Z]   File "__ref_L/Debug Test/Main.py_ftgtftifev", line 1, in <module>
17:39:46 [2020-10-17T21:39:46.038Z]   File "(none)", line 161, in trace_dispatch
17:39:46 [2020-10-17T21:39:46.038Z] org.eclipse.ease.ExitException: 
17:39:46 [2020-10-17T21:39:46.038Z] 
17:39:46 [2020-10-17T21:39:46.038Z] org.eclipse.ease.ExitException: org.eclipse.ease.ExitException: 
17:39:46 [2020-10-17T21:39:46.038Z] Start of script
17:39:46 [2020-10-17T21:39:46.038Z] include file start
17:39:46 [2020-10-17T21:39:46.038Z] include file processed
17:39:46 [2020-10-17T21:39:46.294Z] Result of testMethod = 5
17:39:46 [2020-10-17T21:39:46.294Z] End of script
17:39:46 [2020-10-17T21:39:46.294Z] Start of script
17:39:46 [2020-10-17T21:39:46.294Z] include file start
17:39:46 [2020-10-17T21:39:46.294Z] include file processed
17:39:46 [2020-10-17T21:39:46.294Z] Result of testMethod = 5
17:39:46 [2020-10-17T21:39:46.549Z] Traceback (most recent call last):
17:39:46 [2020-10-17T21:39:46.549Z]   File "(none)", line 184, in run
17:39:46 [2020-10-17T21:39:46.549Z]   File "__ref_L/Debug Test/Main.py_inquktkqlt", line 23, in <module>
17:39:46 [2020-10-17T21:39:46.549Z]   File "(none)", line 161, in trace_dispatch
17:39:46 [2020-10-17T21:39:46.549Z] org.eclipse.ease.ExitException: 
17:39:46 [2020-10-17T21:39:46.549Z] 
17:39:46 [2020-10-17T21:39:46.549Z] org.eclipse.ease.ExitException: org.eclipse.ease.ExitException: 
17:39:46 [2020-10-17T21:39:46.804Z] Start of script
17:39:46 [2020-10-17T21:39:46.804Z] include file start
17:39:46 [2020-10-17T21:39:46.804Z] include file processed
17:39:46 [2020-10-17T21:39:46.804Z] Result of testMethod = 5
17:39:46 [2020-10-17T21:39:46.804Z] End of script
17:39:46 [2020-10-17T21:39:46.804Z] Start of script
17:39:46 [2020-10-17T21:39:46.804Z] include file start
17:39:46 [2020-10-17T21:39:46.804Z] include file processed
17:39:47 [2020-10-17T21:39:47.060Z] Result of testMethod = 5
17:39:47 [2020-10-17T21:39:47.060Z] End of script
17:39:47 [2020-10-17T21:39:47.060Z] Start of script
17:39:47 [2020-10-17T21:39:47.060Z] include file start
17:39:47 [2020-10-17T21:39:47.060Z] include file processed
17:39:47 [2020-10-17T21:39:47.060Z] Result of testMethod = 5
17:39:47 [2020-10-17T21:39:47.060Z] End of script
17:39:47 [2020-10-17T21:39:47.315Z] Start of script
17:39:47 [2020-10-17T21:39:47.315Z] include file start
17:39:47 [2020-10-17T21:39:47.315Z] include file processed
17:39:47 [2020-10-17T21:39:47.570Z] Result of testMethod = 5
17:39:47 [2020-10-17T21:39:47.570Z] End of script
17:39:47 [2020-10-17T21:39:47.570Z] Start of script
17:39:47 [2020-10-17T21:39:47.570Z] include file start
17:39:47 [2020-10-17T21:39:47.570Z] include file processed
17:39:47 [2020-10-17T21:39:47.826Z] Traceback (most recent call last):
17:39:47 [2020-10-17T21:39:47.826Z]   File "(none)", line 184, in run
17:39:47 [2020-10-17T21:39:47.826Z]   File "__ref_L/Debug Test/Main.py_ljqamvqsff", line 21, in <module>
17:39:47 [2020-10-17T21:39:47.826Z]   File "__ref_L/Debug Test/Main.py_ljqamvqsff", line 18, in testMethod
17:39:47 [2020-10-17T21:39:47.826Z]   File "(none)", line 161, in trace_dispatch
17:39:47 [2020-10-17T21:39:47.826Z] org.eclipse.ease.ExitException: 
17:39:47 [2020-10-17T21:39:47.826Z] 
17:39:47 [2020-10-17T21:39:47.826Z] org.eclipse.ease.ExitException: org.eclipse.ease.ExitException: 
17:39:47 [2020-10-17T21:39:47.826Z] Start of script
17:39:48 [2020-10-17T21:39:48.081Z] include file start
17:39:48 [2020-10-17T21:39:48.081Z] include file processed
17:39:48 [2020-10-17T21:39:48.081Z] Result of testMethod = 5
17:39:48 [2020-10-17T21:39:48.081Z] End of script
17:39:48 [2020-10-17T21:39:48.081Z] Start of script
17:39:48 [2020-10-17T21:39:48.081Z] include file start
17:39:48 [2020-10-17T21:39:48.081Z] include file processed
17:39:48 [2020-10-17T21:39:48.081Z] Result of testMethod = 5
17:39:48 [2020-10-17T21:39:48.337Z] Traceback (most recent call last):
17:39:48 [2020-10-17T21:39:48.337Z]   File "(none)", line 184, in run
17:39:48 [2020-10-17T21:39:48.337Z]   File "__ref_L/Debug Test/Main.py_xcevyjfrgu", line 23, in <module>
17:39:48 [2020-10-17T21:39:48.337Z]   File "(none)", line 161, in trace_dispatch
17:39:48 [2020-10-17T21:39:48.337Z] org.eclipse.ease.ExitException: 
17:39:48 [2020-10-17T21:39:48.337Z] 
17:39:48 [2020-10-17T21:39:48.337Z] org.eclipse.ease.ExitException: org.eclipse.ease.ExitException: 
17:39:48 [2020-10-17T21:39:48.592Z] Start of script
17:39:48 [2020-10-17T21:39:48.592Z] include file start
17:39:48 [2020-10-17T21:39:48.592Z] include file processed
17:39:48 [2020-10-17T21:39:48.592Z] Result of testMethod = 5
17:39:48 [2020-10-17T21:39:48.592Z] End of script
17:39:48 [2020-10-17T21:39:48.592Z] Start of script
17:39:48 [2020-10-17T21:39:48.592Z] include file start
17:39:48 [2020-10-17T21:39:48.592Z] include file processed
17:39:48 [2020-10-17T21:39:48.848Z] Result of testMethod = 5
17:39:48 [2020-10-17T21:39:48.848Z] End of script
17:39:49 [2020-10-17T21:39:49.104Z] Start of script
17:39:49 [2020-10-17T21:39:49.104Z] include file start
17:39:49 [2020-10-17T21:39:49.104Z] include file processed
17:39:49 [2020-10-17T21:39:49.104Z] Result of testMethod = 5
17:39:49 [2020-10-17T21:39:49.104Z] End of script
17:39:49 [2020-10-17T21:39:49.104Z] Start of script
17:39:49 [2020-10-17T21:39:49.104Z] include file start
17:39:49 [2020-10-17T21:39:49.104Z] include file processed
17:39:49 [2020-10-17T21:39:49.104Z] Result of testMethod = 5
17:39:49 [2020-10-17T21:39:49.104Z] End of script
17:39:49 [2020-10-17T21:39:49.360Z] Start of script
17:39:49 [2020-10-17T21:39:49.360Z] include file start
17:39:49 [2020-10-17T21:39:49.360Z] include file processed
17:39:49 [2020-10-17T21:39:49.360Z] Result of testMethod = 5
17:39:49 [2020-10-17T21:39:49.616Z] Traceback (most recent call last):
17:39:49 [2020-10-17T21:39:49.616Z]   File "(none)", line 184, in run
17:39:49 [2020-10-17T21:39:49.616Z]   File "__ref_L/Debug Test/Main.py_fqhbxftiyp", line 23, in <module>
17:39:49 [2020-10-17T21:39:49.616Z]   File "(none)", line 161, in trace_dispatch
17:39:49 [2020-10-17T21:39:49.616Z] org.eclipse.ease.ExitException: 
17:39:49 [2020-10-17T21:39:49.616Z] 
17:39:49 [2020-10-17T21:39:49.616Z] org.eclipse.ease.ExitException: org.eclipse.ease.ExitException: 
17:39:49 [2020-10-17T21:39:49.616Z] Start of script
17:39:49 [2020-10-17T21:39:49.616Z] include file start
17:39:49 [2020-10-17T21:39:49.616Z] include file processed
17:39:49 [2020-10-17T21:39:49.616Z] Result of testMethod = 5
17:39:49 [2020-10-17T21:39:49.616Z] End of script
17:39:49 [2020-10-17T21:39:49.872Z] Start of script
17:39:49 [2020-10-17T21:39:49.872Z] include file start
17:39:49 [2020-10-17T21:39:49.872Z] include file processed
17:39:49 [2020-10-17T21:39:49.872Z] Result of testMethod = 5
17:39:50 [2020-10-17T21:39:50.129Z] Traceback (most recent call last):
17:39:50 [2020-10-17T21:39:50.129Z]   File "(none)", line 184, in run
17:39:50 [2020-10-17T21:39:50.129Z]   File "__ref_L/Debug Test/Main.py_stdhvtybsn", line 23, in <module>
17:39:50 [2020-10-17T21:39:50.129Z]   File "(none)", line 161, in trace_dispatch
17:39:50 [2020-10-17T21:39:50.129Z] org.eclipse.ease.ExitException: 
17:39:50 [2020-10-17T21:39:50.129Z] 
17:39:50 [2020-10-17T21:39:50.129Z] org.eclipse.ease.ExitException: org.eclipse.ease.ExitException: 
17:39:50 [2020-10-17T21:39:50.129Z] Traceback (most recent call last):
17:39:50 [2020-10-17T21:39:50.129Z]   File "(none)", line 184, in run
17:39:50 [2020-10-17T21:39:50.129Z]   File "__ref_L/Debug Test/Main.py_epyujetsuc", line 1, in <module>
17:39:50 [2020-10-17T21:39:50.129Z]   File "(none)", line 161, in trace_dispatch
17:39:50 [2020-10-17T21:39:50.129Z] org.eclipse.ease.ExitException: 
17:39:50 [2020-10-17T21:39:50.129Z] 
17:39:50 [2020-10-17T21:39:50.129Z] org.eclipse.ease.ExitException: org.eclipse.ease.ExitException: 
17:39:50 [2020-10-17T21:39:50.385Z] Start of script
17:39:50 [2020-10-17T21:39:50.385Z] include file start
17:39:50 [2020-10-17T21:39:50.385Z] include file processed
17:39:50 [2020-10-17T21:39:50.385Z] Result of testMethod = 5
17:39:50 [2020-10-17T21:39:50.385Z] End of script
17:39:50 [2020-10-17T21:39:50.641Z] Start of script
17:39:50 [2020-10-17T21:39:50.641Z] include file start
17:39:50 [2020-10-17T21:39:50.641Z] include file processed
17:39:50 [2020-10-17T21:39:50.641Z] Result of testMethod = 5
17:39:50 [2020-10-17T21:39:50.641Z] End of script
17:39:50 [2020-10-17T21:39:50.897Z] Start of script
17:39:50 [2020-10-17T21:39:50.897Z] include file start
17:39:50 [2020-10-17T21:39:50.897Z] include file processed
17:39:50 [2020-10-17T21:39:50.897Z] Result of testMethod = 5
17:39:50 [2020-10-17T21:39:50.897Z] End of script
17:39:51 [2020-10-17T21:39:51.153Z] Tests run: 42, Failures: 1, Errors: 0, Skipped: 0, Time elapsed: 12.088 s <<< FAILURE! - in org.eclipse.ease.lang.python.jython.debugger.JythonDebugTest
17:39:51 [2020-10-17T21:39:51.153Z] disconnectProcessInSuspendedState(org.eclipse.ease.lang.python.jython.debugger.JythonDebugTest)  Time elapsed: 1.469 s
17:39:51 [2020-10-17T21:39:51.153Z] stepReturnIncludeCommand(org.eclipse.ease.lang.python.jython.debugger.JythonDebugTest)  Time elapsed: 0.213 s
17:39:51 [2020-10-17T21:39:51.153Z] arrayVariableSorting(org.eclipse.ease.lang.python.jython.debugger.JythonDebugTest)  Time elapsed: 0.309 s
17:39:51 [2020-10-17T21:39:51.153Z] stepOverOnDebugTarget(org.eclipse.ease.lang.python.jython.debugger.JythonDebugTest)  Time elapsed: 0.309 s
17:39:51 [2020-10-17T21:39:51.153Z] hasDebugTarget(org.eclipse.ease.lang.python.jython.debugger.JythonDebugTest)  Time elapsed: 0.105 s
17:39:51 [2020-10-17T21:39:51.153Z] disconnectThreadInSuspendedState(org.eclipse.ease.lang.python.jython.debugger.JythonDebugTest)  Time elapsed: 0.208 s
17:39:51 [2020-10-17T21:39:51.153Z] stepReturnOnDebugTarget(org.eclipse.ease.lang.python.jython.debugger.JythonDebugTest)  Time elapsed: 0.309 s
17:39:51 [2020-10-17T21:39:51.153Z] nullVariable(org.eclipse.ease.lang.python.jython.debugger.JythonDebugTest)  Time elapsed: 0.308 s
17:39:51 [2020-10-17T21:39:51.153Z] stepOverOnStackFrame(org.eclipse.ease.lang.python.jython.debugger.JythonDebugTest)  Time elapsed: 0.308 s
17:39:51 [2020-10-17T21:39:51.153Z] resumeOnDebugTarget(org.eclipse.ease.lang.python.jython.debugger.JythonDebugTest)  Time elapsed: 0.208 s
17:39:51 [2020-10-17T21:39:51.153Z] modifyVariableKeepingType(org.eclipse.ease.lang.python.jython.debugger.JythonDebugTest)  Time elapsed: 0.515 s
17:39:51 [2020-10-17T21:39:51.153Z] resumeOnLastIncludeLine(org.eclipse.ease.lang.python.jython.debugger.JythonDebugTest)  Time elapsed: 0.207 s
17:39:51 [2020-10-17T21:39:51.153Z] stepReturnOnStackFrame(org.eclipse.ease.lang.python.jython.debugger.JythonDebugTest)  Time elapsed: 0.307 s
17:39:51 [2020-10-17T21:39:51.153Z] terminateStackFrameInSuspendedState(org.eclipse.ease.lang.python.jython.debugger.JythonDebugTest)  Time elapsed: 0.208 s
17:39:51 [2020-10-17T21:39:51.153Z] breakpointLocation(org.eclipse.ease.lang.python.jython.debugger.JythonDebugTest)  Time elapsed: 0.207 s
17:39:51 [2020-10-17T21:39:51.153Z] stepReturnOnThread(org.eclipse.ease.lang.python.jython.debugger.JythonDebugTest)  Time elapsed: 0.309 s
17:39:51 [2020-10-17T21:39:51.153Z] javaClassVariable(org.eclipse.ease.lang.python.jython.debugger.JythonDebugTest)  Time elapsed: 0.308 s
17:39:51 [2020-10-17T21:39:51.153Z] stepIntoOnThread(org.eclipse.ease.lang.python.jython.debugger.JythonDebugTest)  Time elapsed: 0.307 s
17:39:51 [2020-10-17T21:39:51.153Z] terminateThreadInSuspendedState(org.eclipse.ease.lang.python.jython.debugger.JythonDebugTest)  Time elapsed: 0.207 s
17:39:51 [2020-10-17T21:39:51.153Z] resumeOnThread(org.eclipse.ease.lang.python.jython.debugger.JythonDebugTest)  Time elapsed: 0.207 s
17:39:51 [2020-10-17T21:39:51.153Z] stepIntoOnStackFrame(org.eclipse.ease.lang.python.jython.debugger.JythonDebugTest)  Time elapsed: 0.307 s
17:39:51 [2020-10-17T21:39:51.153Z] terminateProcessInSuspendedState(org.eclipse.ease.lang.python.jython.debugger.JythonDebugTest)  Time elapsed: 0.207 s
17:39:51 [2020-10-17T21:39:51.153Z] stepOverOnProcess(org.eclipse.ease.lang.python.jython.debugger.JythonDebugTest)  Time elapsed: 0.308 s
17:39:51 [2020-10-17T21:39:51.153Z] nativeArrayVariable(org.eclipse.ease.lang.python.jython.debugger.JythonDebugTest)  Time elapsed: 0.306 s
17:39:51 [2020-10-17T21:39:51.153Z] disconnectDebugTargetInSuspendedState(org.eclipse.ease.lang.python.jython.debugger.JythonDebugTest)  Time elapsed: 0.206 s
17:39:51 [2020-10-17T21:39:51.153Z] stepIntoOnProcess(org.eclipse.ease.lang.python.jython.debugger.JythonDebugTest)  Time elapsed: 0.308 s
17:39:51 [2020-10-17T21:39:51.153Z] terminatedState(org.eclipse.ease.lang.python.jython.debugger.JythonDebugTest)  Time elapsed: 0.104 s
17:39:51 [2020-10-17T21:39:51.153Z] stepOverIncludeCommand(org.eclipse.ease.lang.python.jython.debugger.JythonDebugTest)  Time elapsed: 0.305 s
17:39:51 [2020-10-17T21:39:51.154Z] innerScopeVariableBeforeOuterScopeVariable(org.eclipse.ease.lang.python.jython.debugger.JythonDebugTest)  Time elapsed: 0.305 s
17:39:51 [2020-10-17T21:39:51.154Z] stepIntoIncludeCommand(org.eclipse.ease.lang.python.jython.debugger.JythonDebugTest)  Time elapsed: 0.305 s
17:39:51 [2020-10-17T21:39:51.154Z] primitiveStringVariable(org.eclipse.ease.lang.python.jython.debugger.JythonDebugTest)  Time elapsed: 0.307 s
17:39:51 [2020-10-17T21:39:51.154Z] resumeOnProcess(org.eclipse.ease.lang.python.jython.debugger.JythonDebugTest)  Time elapsed: 0.205 s
17:39:51 [2020-10-17T21:39:51.154Z] stepIntoOnDebugTarget(org.eclipse.ease.lang.python.jython.debugger.JythonDebugTest)  Time elapsed: 0.306 s
17:39:51 [2020-10-17T21:39:51.154Z] stepOverOnThread(org.eclipse.ease.lang.python.jython.debugger.JythonDebugTest)  Time elapsed: 0.106 s  <<< FAILURE!
17:39:51 [2020-10-17T21:39:51.154Z] java.lang.AssertionError: expected:<2> but was:<0>
17:39:51 [2020-10-17T21:39:51.154Z] 
17:39:51 [2020-10-17T21:39:51.154Z] suspendedState(org.eclipse.ease.lang.python.jython.debugger.JythonDebugTest)  Time elapsed: 0.205 s
17:39:51 [2020-10-17T21:39:51.154Z] primitiveDoubleVariable(org.eclipse.ease.lang.python.jython.debugger.JythonDebugTest)  Time elapsed: 0.305 s
17:39:51 [2020-10-17T21:39:51.154Z] resumeOnStackFrame(org.eclipse.ease.lang.python.jython.debugger.JythonDebugTest)  Time elapsed: 0.212 s
17:39:51 [2020-10-17T21:39:51.154Z] nativeObjectVariable(org.eclipse.ease.lang.python.jython.debugger.JythonDebugTest)  Time elapsed: 0.306 s
17:39:51 [2020-10-17T21:39:51.154Z] terminateDebugTargetInSuspendedState(org.eclipse.ease.lang.python.jython.debugger.JythonDebugTest)  Time elapsed: 0.205 s
17:39:51 [2020-10-17T21:39:51.154Z] disconnectStackFrameInSuspendedState(org.eclipse.ease.lang.python.jython.debugger.JythonDebugTest)  Time elapsed: 0.206 s
17:39:51 [2020-10-17T21:39:51.154Z] stepReturnOnProcess(org.eclipse.ease.lang.python.jython.debugger.JythonDebugTest)  Time elapsed: 0.306 s
17:39:51 [2020-10-17T21:39:51.154Z] evaluateWatchExpression(org.eclipse.ease.lang.python.jython.debugger.JythonDebugTest)  Time elapsed: 0.208 s
17:39:51 [2020-10-17T21:39:51.154Z] 
17:39:51 [2020-10-17T21:39:51.154Z] Results:
17:39:51 [2020-10-17T21:39:51.154Z] 
17:39:51 [2020-10-17T21:39:51.154Z] Failures: 
17:39:51 [2020-10-17T21:39:51.154Z]   JythonDebugTest>AbstractDebugTest.stepOverOnThread:200->AbstractDebugTest.stepOverTestTemplate:185 expected:<2> but was:<0>
17:39:51 [2020-10-17T21:39:51.154Z] 
17:39:51 [2020-10-17T21:39:51.154Z] Tests run: 42, Failures: 1, Errors: 0, Skipped: 0
17:39:51 [2020-10-17T21:39:51.154Z] 
17:39:51 [2020-10-17T21:39:51.715Z] [INFO] ------------------------------------------------------------------------
17:39:51 [2020-10-17T21:39:51.715Z] [INFO] Reactor Summary:
17:39:51 [2020-10-17T21:39:51.715Z] [INFO] 
17:39:51 [2020-10-17T21:39:51.715Z] [INFO] org.eclipse.ease.releng 0.8.0-SNAPSHOT ............. SUCCESS [  8.410 s]
17:39:51 [2020-10-17T21:39:51.715Z] [INFO] org.eclipse.ease.classloader 0.8.0-SNAPSHOT ........ SUCCESS [  8.532 s]
17:39:51 [2020-10-17T21:39:51.715Z] [INFO] org.eclipse.ease 0.8.0-SNAPSHOT .................... SUCCESS [  2.856 s]
17:39:51 [2020-10-17T21:39:51.715Z] [INFO] org.eclipse.ease.ui 0.8.0-SNAPSHOT ................. SUCCESS [  2.916 s]
17:39:51 [2020-10-17T21:39:51.715Z] [INFO] org.eclipse.ease.ui.completions.java 0.8.0-SNAPSHOT  SUCCESS [  1.999 s]
17:39:51 [2020-10-17T21:39:51.715Z] [INFO] org.eclipse.ease.ui.scripts 0.8.0-SNAPSHOT ......... SUCCESS [  2.504 s]
17:39:51 [2020-10-17T21:39:51.715Z] [INFO] org.eclipse.ease.lang.javascript 0.8.0-SNAPSHOT .... SUCCESS [  1.625 s]
17:39:51 [2020-10-17T21:39:51.715Z] [INFO] org.eclipse.ease.lang.scriptarchive 0.8.0-SNAPSHOT . SUCCESS [  1.384 s]
17:39:51 [2020-10-17T21:39:51.715Z] [INFO] org.eclipse.ease.lang.python 0.8.0-SNAPSHOT ........ SUCCESS [  1.681 s]
17:39:51 [2020-10-17T21:39:51.715Z] [INFO] org.eclipse.ease.lang.python.py4j 0.8.0-SNAPSHOT ... SUCCESS [  1.692 s]
17:39:51 [2020-10-17T21:39:51.715Z] [INFO] org.eclipse.ease.lang.groovy 0.8.0-SNAPSHOT ........ SUCCESS [  1.397 s]
17:39:51 [2020-10-17T21:39:51.715Z] [INFO] org.eclipse.ease.lang.groovy.interpreter 0.8.0-SNAPSHOT SUCCESS [  1.298 s]
17:39:51 [2020-10-17T21:39:51.715Z] [INFO] org.eclipse.ease.lang.unittest 0.8.0-SNAPSHOT ...... SUCCESS [  2.045 s]
17:39:51 [2020-10-17T21:39:51.715Z] [INFO] org.eclipse.ease.lang.unittest.ui 0.8.0-SNAPSHOT ... SUCCESS [  2.283 s]
17:39:51 [2020-10-17T21:39:51.715Z] [INFO] org.eclipse.ease.lang.ruby 0.8.0-SNAPSHOT .......... SUCCESS [  1.302 s]
17:39:51 [2020-10-17T21:39:51.715Z] [INFO] org.eclipse.ease.lang.ruby.jruby 0.8.0-SNAPSHOT .... SUCCESS [  1.404 s]
17:39:51 [2020-10-17T21:39:51.715Z] [INFO] org.eclipse.ease.lang.javascript.nashorn 0.8.0-SNAPSHOT SUCCESS [  1.465 s]
17:39:51 [2020-10-17T21:39:51.715Z] [INFO] org.eclipse.ease.lang.javascript.rhino 0.8.0-SNAPSHOT SUCCESS [  1.799 s]
17:39:51 [2020-10-17T21:39:51.715Z] [INFO] org.eclipse.ease.lang.python.jython 0.8.0-SNAPSHOT . SUCCESS [  1.602 s]
17:39:51 [2020-10-17T21:39:51.715Z] [INFO] org.eclipse.ease.lang.javascript.ui 0.8.0-SNAPSHOT . SUCCESS [  1.509 s]
17:39:51 [2020-10-17T21:39:51.715Z] [INFO] org.eclipse.ease.lang.jvm.compiled 0.8.0-SNAPSHOT .. SUCCESS [  1.420 s]
17:39:51 [2020-10-17T21:39:51.715Z] [INFO] org.eclipse.ease.lang.scriptarchive.ui 0.8.0-SNAPSHOT SUCCESS [  1.474 s]
17:39:51 [2020-10-17T21:39:51.715Z] [INFO] org.eclipse.ease.help 0.8.0-SNAPSHOT ............... SUCCESS [  0.210 s]
17:39:51 [2020-10-17T21:39:51.715Z] [INFO] org.eclipse.ease.feature 0.8.0-SNAPSHOT ............ SUCCESS [  0.197 s]
17:39:51 [2020-10-17T21:39:51.715Z] [INFO] org.eclipse.ease.ui.feature 0.8.0-SNAPSHOT ......... SUCCESS [  0.206 s]
17:39:51 [2020-10-17T21:39:51.715Z] [INFO] org.eclipse.ease.lang.javascript.feature 0.8.0-SNAPSHOT SUCCESS [  0.103 s]
17:39:51 [2020-10-17T21:39:51.715Z] [INFO] org.eclipse.ease.lang.python.feature 0.8.0-SNAPSHOT  SUCCESS [  0.515 s]
17:39:51 [2020-10-17T21:39:51.715Z] [INFO] org.eclipse.ease.python.jython.feature 0.8.0-SNAPSHOT SUCCESS [  0.060 s]
17:39:51 [2020-10-17T21:39:51.715Z] [INFO] org.eclipse.ease.lang.python.py4j.feature 0.8.0-SNAPSHOT SUCCESS [  0.057 s]
17:39:51 [2020-10-17T21:39:51.715Z] [INFO] org.eclipse.ease.lang.jvm.feature 0.8.0-SNAPSHOT ... SUCCESS [  0.099 s]
17:39:51 [2020-10-17T21:39:51.715Z] [INFO] org.eclipse.ease.lang.groovy.feature 0.8.0-SNAPSHOT  SUCCESS [  0.159 s]
17:39:51 [2020-10-17T21:39:51.715Z] [INFO] org.eclipse.ease.lang.ruby.feature 0.8.0-SNAPSHOT .. SUCCESS [  0.096 s]
17:39:51 [2020-10-17T21:39:51.715Z] [INFO] org.eclipse.ease.lang.scriptarchive.feature 0.8.0-SNAPSHOT SUCCESS [  0.095 s]
17:39:51 [2020-10-17T21:39:51.715Z] [INFO] org.eclipse.ease.lang.unittest.feature 0.8.0-SNAPSHOT SUCCESS [  0.106 s]
17:39:51 [2020-10-17T21:39:51.715Z] [INFO] org.eclipse.ease.releng.target 0.8.0-SNAPSHOT ...... SUCCESS [  0.009 s]
17:39:51 [2020-10-17T21:39:51.715Z] [INFO] org.eclipse.ease.releng.p2 0.8.0-SNAPSHOT .......... SUCCESS [  3.111 s]
17:39:51 [2020-10-17T21:39:51.715Z] [INFO] org.eclipse.ease.testhelper 0.8.0-SNAPSHOT ......... SUCCESS [  1.692 s]
17:39:51 [2020-10-17T21:39:51.715Z] [INFO] org.eclipse.ease.test 0.8.0-SNAPSHOT ............... SUCCESS [ 17.240 s]
17:39:51 [2020-10-17T21:39:51.715Z] [INFO] org.eclipse.ease.lang.javascript.nashorn.test 0.8.0-SNAPSHOT SUCCESS [  4.587 s]
17:39:51 [2020-10-17T21:39:51.715Z] [INFO] org.eclipse.ease.lang.javascript.rhino.test 0.8.0-SNAPSHOT SUCCESS [ 15.886 s]
17:39:51 [2020-10-17T21:39:51.715Z] [INFO] org.eclipse.ease.lang.javascript.test 0.8.0-SNAPSHOT SUCCESS [  3.820 s]
17:39:51 [2020-10-17T21:39:51.716Z] [INFO] org.eclipse.ease.lang.python.test 0.8.0-SNAPSHOT ... SUCCESS [  3.610 s]
17:39:51 [2020-10-17T21:39:51.716Z] [INFO] org.eclipse.ease.lang.python.jython.test 0.8.0-SNAPSHOT FAILURE [ 16.323 s]
17:39:51 [2020-10-17T21:39:51.716Z] [INFO] org.eclipse.ease.lang.scriptarchive.test 0.8.0-SNAPSHOT SKIPPED
17:39:51 [2020-10-17T21:39:51.716Z] [INFO] org.eclipse.ease.lang.unittest.test 0.8.0-SNAPSHOT . SKIPPED
17:39:51 [2020-10-17T21:39:51.716Z] [INFO] org.eclipse.ease.ui.scripts.test 0.8.0-SNAPSHOT .... SKIPPED
17:39:51 [2020-10-17T21:39:51.716Z] [INFO] org.eclipse.ease.ui.test 0.8.0-SNAPSHOT ............ SKIPPED
17:39:51 [2020-10-17T21:39:51.716Z] [INFO] EASE (Incubation) 0.4.0-SNAPSHOT ................... SKIPPED
17:39:51 [2020-10-17T21:39:51.716Z] [INFO] ------------------------------------------------------------------------
17:39:51 [2020-10-17T21:39:51.716Z] [INFO] BUILD FAILURE
17:39:51 [2020-10-17T21:39:51.716Z] [INFO] ------------------------------------------------------------------------
17:39:51 [2020-10-17T21:39:51.716Z] [INFO] Total time:  04:23 min
17:39:51 [2020-10-17T21:39:51.716Z] [INFO] Finished at: 2020-10-17T21:39:51Z
17:39:51 [2020-10-17T21:39:51.716Z] [INFO] ------------------------------------------------------------------------
17:39:51 [2020-10-17T21:39:51.716Z] [INFO] [jenkins-event-spy] Generated /home/jenkins/agent/workspace/ease.verify.core.target.2019-03@tmp/withMaven135a0756/maven-spy-20201017-213527-62912525775267051935916.log
17:39:51 [2020-10-17T21:39:51.716Z] [ERROR] Failed to execute goal org.eclipse.tycho:tycho-surefire-plugin:1.5.0:test (default-test) on project org.eclipse.ease.lang.python.jython.test: There are test failures.
17:39:51 [2020-10-17T21:39:51.716Z] [ERROR] 
17:39:51 [2020-10-17T21:39:51.716Z] [ERROR] Please refer to /home/jenkins/agent/workspace/ease.verify.core.target.2019-03/tests/org.eclipse.ease.lang.python.jython.test/target/surefire-reports for the individual test results.
17:39:51 [2020-10-17T21:39:51.716Z] [ERROR] -> [Help 1]
17:39:51 [2020-10-17T21:39:51.716Z] [ERROR] 
17:39:51 [2020-10-17T21:39:51.716Z] [ERROR] To see the full stack trace of the errors, re-run Maven with the -e switch.
17:39:51 [2020-10-17T21:39:51.716Z] [ERROR] Re-run Maven using the -X switch to enable full debug logging.
17:39:51 [2020-10-17T21:39:51.716Z] [ERROR] 
17:39:51 [2020-10-17T21:39:51.716Z] [ERROR] For more information about the errors and possible solutions, please read the following articles:
17:39:51 [2020-10-17T21:39:51.716Z] [ERROR] [Help 1] http://cwiki.apache.org/confluence/display/MAVEN/MojoFailureException
17:39:51 [2020-10-17T21:39:51.716Z] [ERROR] 
17:39:51 [2020-10-17T21:39:51.716Z] [ERROR] After correcting the problems, you can resume the build with the command
17:39:51 [2020-10-17T21:39:51.716Z] [ERROR]   mvn <args> -rf :org.eclipse.ease.lang.python.jython.test
[Pipeline] }
17:39:54 [2020-10-17T21:39:54.356Z] [withMaven] Publishers: Pipeline Graph Publisher: 35 ms, Invoker Publisher: 1 ms, Junit Publisher: 1 ms, Concordion Publisher: 1 ms, Dependencies Fingerprint Publisher: 957 ms, Findbugs Publisher: 1 ms
[Pipeline] // withMaven
[Pipeline] }
[Pipeline] // stage
[Pipeline] stage
[Pipeline] { (Test)
Stage "Test" skipped due to earlier failure(s)
[Pipeline] }
[Pipeline] // stage
[Pipeline] stage
[Pipeline] { (Declarative: Post Actions)
[Pipeline] archiveArtifacts
17:39:54 [2020-10-17T21:39:54.403Z] Archiving artifacts
[Pipeline] emailext
17:40:05 [2020-10-17T21:40:05.275Z] Sending email to: christian.pontesegger@web.de
[Pipeline] }
[Pipeline] // stage
[Pipeline] }
[Pipeline] // timeout
[Pipeline] }
[Pipeline] // timestamps
[Pipeline] }
[Pipeline] // node
[Pipeline] End of Pipeline
ERROR: script returned exit code 1
Finished: FAILURE