FailedConsole Output

Skipping 758 KB.. Full Log
VPzxdEGvvmZ+X75ZekLlOVfvTjc8FPJgaGiiIGKaiG5Py84vycVD1nCA1SyAABjCCFBQCV27OjYAAAAA==[INFO] --- tycho-surefire-plugin:1.5.0:test (default-test) @ org.eclipse.ease.lang.python.test ---
17:39:49 [2020-09-26T21:39:49.091Z] [INFO] Expected eclipse log file: /home/jenkins/agent/workspace/ease.verify.core.target.2019-03/tests/org.eclipse.ease.lang.python.test/target/work/data/.metadata/.log
17:39:49 [2020-09-26T21:39:49.091Z] [INFO] Command line:
17:39:49 [2020-09-26T21:39:49.092Z] 	[/opt/tools/java/openjdk/jdk-11/11.0.2+9/bin/java, -Dosgi.noShutdown=false, -Dosgi.os=linux, -Dosgi.ws=gtk, -Dosgi.arch=x86_64, -Dosgi.clean=true, -jar, /home/jenkins/.m2/repository/p2/osgi/bundle/org.eclipse.equinox.launcher/1.5.800.v20200727-1323/org.eclipse.equinox.launcher-1.5.800.v20200727-1323.jar, -data, /home/jenkins/agent/workspace/ease.verify.core.target.2019-03/tests/org.eclipse.ease.lang.python.test/target/work/data, -install, /home/jenkins/agent/workspace/ease.verify.core.target.2019-03/tests/org.eclipse.ease.lang.python.test/target/work, -configuration, /home/jenkins/agent/workspace/ease.verify.core.target.2019-03/tests/org.eclipse.ease.lang.python.test/target/work/configuration, -application, org.eclipse.tycho.surefire.osgibooter.headlesstest, -testproperties, /home/jenkins/agent/workspace/ease.verify.core.target.2019-03/tests/org.eclipse.ease.lang.python.test/target/surefire.properties]
17:39:49 [2020-09-26T21:39:49.092Z] Picked up JAVA_TOOL_OPTIONS: -Dmaven.ext.class.path="/home/jenkins/agent/workspace/ease.verify.core.target.2019-03@tmp/withMavene09eca7f/pipeline-maven-spy.jar" -Dorg.jenkinsci.plugins.pipeline.maven.reportsFolder="/home/jenkins/agent/workspace/ease.verify.core.target.2019-03@tmp/withMavene09eca7f" 
17:39:51 [2020-09-26T21:39:51.030Z] Running org.eclipse.ease.lang.python.PythonCodeFactoryTest
17:39:51 [2020-09-26T21:39:51.030Z] Tests run: 1, Failures: 0, Errors: 0, Skipped: 0, Time elapsed: 0.029 s - in org.eclipse.ease.lang.python.PythonCodeFactoryTest
17:39:51 [2020-09-26T21:39:51.030Z] testCommentCreator(org.eclipse.ease.lang.python.PythonCodeFactoryTest)  Time elapsed: 0.003 s
17:39:51 [2020-09-26T21:39:51.030Z] 
17:39:51 [2020-09-26T21:39:51.030Z] Results:
17:39:51 [2020-09-26T21:39:51.030Z] 
17:39:51 [2020-09-26T21:39:51.030Z] Tests run: 1, Failures: 0, Errors: 0, Skipped: 0
17:39:51 [2020-09-26T21:39:51.030Z] 
17:39:51 [2020-09-26T21:39:51.591Z] [INFO] All tests passed!
17:39:51 [2020-09-26T21:39:51.591Z] [INFO] 
17:39:51 [2020-09-26T21:39:51.591Z] [INFO] --- maven-install-plugin:2.3.1:install (default-install) @ org.eclipse.ease.lang.python.test ---
17:39:51 [2020-09-26T21:39:51.591Z] [INFO] Installing /home/jenkins/agent/workspace/ease.verify.core.target.2019-03/tests/org.eclipse.ease.lang.python.test/target/org.eclipse.ease.lang.python.test-0.8.0-SNAPSHOT.jar to /home/jenkins/.m2/repository/org/eclipse/ease/org.eclipse.ease.lang.python.test/0.8.0-SNAPSHOT/org.eclipse.ease.lang.python.test-0.8.0-SNAPSHOT.jar
17:39:51 [2020-09-26T21:39:51.591Z] [INFO] Installing /home/jenkins/agent/workspace/ease.verify.core.target.2019-03/tests/org.eclipse.ease.lang.python.test/pom.xml to /home/jenkins/.m2/repository/org/eclipse/ease/org.eclipse.ease.lang.python.test/0.8.0-SNAPSHOT/org.eclipse.ease.lang.python.test-0.8.0-SNAPSHOT.pom
17:39:51 [2020-09-26T21:39:51.591Z] [INFO] Installing /home/jenkins/agent/workspace/ease.verify.core.target.2019-03/tests/org.eclipse.ease.lang.python.test/target/org.eclipse.ease.lang.python.test-0.8.0-SNAPSHOT-sources.jar to /home/jenkins/.m2/repository/org/eclipse/ease/org.eclipse.ease.lang.python.test/0.8.0-SNAPSHOT/org.eclipse.ease.lang.python.test-0.8.0-SNAPSHOT-sources.jar
17:39:51 [2020-09-26T21:39:51.591Z] [INFO] Installing /home/jenkins/agent/workspace/ease.verify.core.target.2019-03/tests/org.eclipse.ease.lang.python.test/target/p2content.xml to /home/jenkins/.m2/repository/org/eclipse/ease/org.eclipse.ease.lang.python.test/0.8.0-SNAPSHOT/org.eclipse.ease.lang.python.test-0.8.0-SNAPSHOT-p2metadata.xml
17:39:51 [2020-09-26T21:39:51.591Z] [INFO] Installing /home/jenkins/agent/workspace/ease.verify.core.target.2019-03/tests/org.eclipse.ease.lang.python.test/target/p2artifacts.xml to /home/jenkins/.m2/repository/org/eclipse/ease/org.eclipse.ease.lang.python.test/0.8.0-SNAPSHOT/org.eclipse.ease.lang.python.test-0.8.0-SNAPSHOT-p2artifacts.xml
17:39:51 [2020-09-26T21:39:51.591Z] [INFO] Installing /home/jenkins/agent/workspace/ease.verify.core.target.2019-03/tests/org.eclipse.ease.lang.python.test/target/p2content.xml to /home/jenkins/.m2/repository/org/eclipse/ease/org.eclipse.ease.lang.python.test/0.8.0-SNAPSHOT/org.eclipse.ease.lang.python.test-0.8.0-SNAPSHOT-p2metadata.xml
17:39:51 [2020-09-26T21:39:51.591Z] [INFO] Installing /home/jenkins/agent/workspace/ease.verify.core.target.2019-03/tests/org.eclipse.ease.lang.python.test/target/p2artifacts.xml to /home/jenkins/.m2/repository/org/eclipse/ease/org.eclipse.ease.lang.python.test/0.8.0-SNAPSHOT/org.eclipse.ease.lang.python.test-0.8.0-SNAPSHOT-p2artifacts.xml
17:39:51 [2020-09-26T21:39:51.591Z] [INFO] 
17:39:51 [2020-09-26T21:39:51.591Z] [INFO] --- tycho-p2-plugin:1.5.0:update-local-index (default-update-local-index) @ org.eclipse.ease.lang.python.test ---
17:39:51 [2020-09-26T21:39:51.591Z] [INFO] 
17:39:51 [2020-09-26T21:39:51.591Z] [INFO] -----< org.eclipse.ease:org.eclipse.ease.lang.python.jython.test >------
17:39:51 [2020-09-26T21:39:51.591Z] [INFO] Building org.eclipse.ease.lang.python.jython.test 0.8.0-SNAPSHOT [43/48]
17:39:51 [2020-09-26T21:39:51.591Z] [INFO] ------------------------[ eclipse-test-plugin ]-------------------------
17:39:51 [2020-09-26T21:39:51.591Z] [INFO] 
17:39:51 [2020-09-26T21:39:51.591Z] [INFO] --- maven-clean-plugin:2.5:clean (default-clean) @ org.eclipse.ease.lang.python.jython.test ---
17:39:51 [2020-09-26T21:39:51.591Z] [INFO] 
17:39:51 [2020-09-26T21:39:51.591Z] [INFO] --- tycho-packaging-plugin:1.5.0:build-qualifier (default-build-qualifier) @ org.eclipse.ease.lang.python.jython.test ---
17:39:51 [2020-09-26T21:39:51.591Z] [INFO] The project's OSGi version is 0.8.0.I201911291239
17:39:51 [2020-09-26T21:39:51.591Z] [INFO] 
17:39:51 [2020-09-26T21:39:51.591Z] [INFO] --- tycho-packaging-plugin:1.5.0:validate-id (default-validate-id) @ org.eclipse.ease.lang.python.jython.test ---
17:39:51 [2020-09-26T21:39:51.591Z] [INFO] 
17:39:51 [2020-09-26T21:39:51.591Z] [INFO] --- tycho-packaging-plugin:1.5.0:validate-version (default-validate-version) @ org.eclipse.ease.lang.python.jython.test ---
17:39:51 [2020-09-26T21:39:51.591Z] [INFO] 
17:39:51 [2020-09-26T21:39:51.591Z] [INFO] >>> maven-javadoc-plugin:2.9.1:javadoc (build-docs) > generate-sources @ org.eclipse.ease.lang.python.jython.test >>>
17:39:51 [2020-09-26T21:39:51.591Z] [INFO] 
17:39:51 [2020-09-26T21:39:51.591Z] [INFO] --- tycho-packaging-plugin:1.5.0:build-qualifier (default-build-qualifier) @ org.eclipse.ease.lang.python.jython.test ---
17:39:51 [2020-09-26T21:39:51.591Z] [INFO] The project's OSGi version is 0.8.0.I201911291239
17:39:51 [2020-09-26T21:39:51.591Z] [INFO] 
17:39:51 [2020-09-26T21:39:51.591Z] [INFO] --- tycho-packaging-plugin:1.5.0:validate-id (default-validate-id) @ org.eclipse.ease.lang.python.jython.test ---
17:39:51 [2020-09-26T21:39:51.591Z] [INFO] 
17:39:51 [2020-09-26T21:39:51.591Z] [INFO] --- tycho-packaging-plugin:1.5.0:validate-version (default-validate-version) @ org.eclipse.ease.lang.python.jython.test ---
17:39:51 [2020-09-26T21:39:51.591Z] [INFO] 
17:39:51 [2020-09-26T21:39:51.591Z] [INFO] <<< maven-javadoc-plugin:2.9.1:javadoc (build-docs) < generate-sources @ org.eclipse.ease.lang.python.jython.test <<<
17:39:51 [2020-09-26T21:39:51.591Z] [INFO] 
17:39:51 [2020-09-26T21:39:51.591Z] [INFO] 
17:39:51 [2020-09-26T21:39:51.591Z] [INFO] --- maven-javadoc-plugin:2.9.1:javadoc (build-docs) @ org.eclipse.ease.lang.python.jython.test ---
17:39:51 [2020-09-26T21:39:51.591Z] [ERROR] Error fetching link: http://help.eclipse.org/oxygen/topic/org.eclipse.platform.doc.isv/reference/api/package-list. Ignored it.
17:39:51 [2020-09-26T21:39:51.591Z] [ERROR] Error fetching link: https://ci.eclipse.org/ease/job/ease.build.core/JavaDoc/package-list. Ignored it.
17:39:52 [2020-09-26T21:39:52.518Z] [INFO] 
17:39:52 [2020-09-26T21:39:52.518Z] Loading source files for package org.eclipse.ease.lang.python.jython.debugger...
17:39:52 [2020-09-26T21:39:52.518Z] Constructing Javadoc information...
17:39:52 [2020-09-26T21:39:52.518Z] WARNING: Cannot open location "/home/jenkins/agent/workspace/ease.verify.core.target.2019-03/tests/org.eclipse.ease.lang.python.jython.test/target/javadoc-bundle-options/package-list"
17:39:52 [2020-09-26T21:39:52.518Z] No plugin definition found, skipping
17:39:52 [2020-09-26T21:39:52.518Z] No plugin definition found, skipping
17:39:52 [2020-09-26T21:39:52.518Z] [WARNING] Javadoc Warnings
17:39:52 [2020-09-26T21:39:52.518Z] [WARNING] Picked up JAVA_TOOL_OPTIONS: -Dmaven.ext.class.path="/home/jenkins/agent/workspace/ease.verify.core.target.2019-03@tmp/withMavene09eca7f/pipeline-maven-spy.jar" -Dorg.jenkinsci.plugins.pipeline.maven.reportsFolder="/home/jenkins/agent/workspace/ease.verify.core.target.2019-03@tmp/withMavene09eca7f"
17:39:52 [2020-09-26T21:39:52.518Z] [WARNING] javadoc: warning - The old Doclet and Taglet APIs in the packages
17:39:52 [2020-09-26T21:39:52.518Z] [WARNING] com.sun.javadoc, com.sun.tools.doclets and their implementations
17:39:52 [2020-09-26T21:39:52.518Z] [WARNING] are planned to be removed in a future JDK release. These
17:39:52 [2020-09-26T21:39:52.518Z] [WARNING] components have been superseded by the new APIs in jdk.javadoc.doclet.
17:39:52 [2020-09-26T21:39:52.518Z] [WARNING] Users are strongly recommended to migrate to the new APIs.
17:39:52 [2020-09-26T21:39:52.518Z] [INFO] 
17:39:52 [2020-09-26T21:39:52.518Z] [INFO] --- build-helper-maven-plugin:1.9.1:add-resource (add_help) @ org.eclipse.ease.lang.python.jython.test ---
17:39:52 [2020-09-26T21:39:52.518Z] [INFO] 
17:39:52 [2020-09-26T21:39:52.518Z] [INFO] --- maven-resources-plugin:2.4.3:resources (default-resources) @ org.eclipse.ease.lang.python.jython.test ---
17:39:52 [2020-09-26T21:39:52.519Z] [INFO] Using 'UTF-8' encoding to copy filtered resources.
17:39:52 [2020-09-26T21:39:52.519Z] [INFO] skip non existing resourceDirectory /home/jenkins/agent/workspace/ease.verify.core.target.2019-03/tests/org.eclipse.ease.lang.python.jython.test/src/main/resources
17:39:52 [2020-09-26T21:39:52.519Z] [INFO] skip non existing resourceDirectory /home/jenkins/agent/workspace/ease.verify.core.target.2019-03/tests/org.eclipse.ease.lang.python.jython.test/help
17:39:52 [2020-09-26T21:39:52.519Z] [INFO] 
17:39:52 [2020-09-26T21:39:52.519Z] [INFO] --- tycho-compiler-plugin:1.5.0:compile (default-compile) @ org.eclipse.ease.lang.python.jython.test ---
17:39:52 [2020-09-26T21:39:52.519Z] [INFO] Compiling 1 source file to /home/jenkins/agent/workspace/ease.verify.core.target.2019-03/tests/org.eclipse.ease.lang.python.jython.test/target/classes
17:39:52 [2020-09-26T21:39:52.788Z] [INFO] 
17:39:52 [2020-09-26T21:39:52.788Z] [INFO] --- maven-resources-plugin:2.4.3:testResources (default-testResources) @ org.eclipse.ease.lang.python.jython.test ---
17:39:52 [2020-09-26T21:39:52.788Z] [INFO] Using 'UTF-8' encoding to copy filtered resources.
17:39:52 [2020-09-26T21:39:52.788Z] [INFO] skip non existing resourceDirectory /home/jenkins/agent/workspace/ease.verify.core.target.2019-03/tests/org.eclipse.ease.lang.python.jython.test/src/test/resources
17:39:52 [2020-09-26T21:39:52.788Z] [INFO] 
17:39:52 [2020-09-26T21:39:52.788Z] [INFO] --- tycho-source-plugin:1.5.0:plugin-source (plugin-source) @ org.eclipse.ease.lang.python.jython.test ---
17:39:52 [2020-09-26T21:39:52.789Z] [WARNING] Bundle-Vendor header not found in /home/jenkins/agent/workspace/ease.verify.core.target.2019-03/tests/org.eclipse.ease.lang.python.jython.test/META-INF/MANIFEST.MF, fallback to 'unknown' for source bundle
17:39:52 [2020-09-26T21:39:52.789Z] [INFO] Building jar: /home/jenkins/agent/workspace/ease.verify.core.target.2019-03/tests/org.eclipse.ease.lang.python.jython.test/target/org.eclipse.ease.lang.python.jython.test-0.8.0-SNAPSHOT-sources.jar
17:39:52 [2020-09-26T21:39:52.789Z] [INFO] 
17:39:52 [2020-09-26T21:39:52.789Z] [INFO] --- target-platform-configuration:1.5.0:target-platform (default-target-platform) @ org.eclipse.ease.lang.python.jython.test ---
17:39:52 [2020-09-26T21:39:52.789Z] [INFO] 
17:39:52 [2020-09-26T21:39:52.789Z] [INFO] --- tycho-packaging-plugin:1.5.0:package-plugin (default-package-plugin) @ org.eclipse.ease.lang.python.jython.test ---
17:39:52 [2020-09-26T21:39:52.789Z] [INFO] Building jar: /home/jenkins/agent/workspace/ease.verify.core.target.2019-03/tests/org.eclipse.ease.lang.python.jython.test/target/org.eclipse.ease.lang.python.jython.test-0.8.0-SNAPSHOT.jar
17:39:52 [2020-09-26T21:39:52.789Z] [INFO] 
17:39:52 [2020-09-26T21:39:52.789Z] [INFO] --- tycho-p2-plugin:1.5.0:p2-metadata-default (default-p2-metadata-default) @ org.eclipse.ease.lang.python.jython.test ---
17:39:52 [2020-09-26T21:39:52.789Z] [INFO] 
17:39:52 [2020-09-26T21:39:52.789Z] [INFO] --- tycho-source-feature-plugin:1.5.0:source-feature (source-feature) @ org.eclipse.ease.lang.python.jython.test ---
17:39:52 [2020-09-26T21:39:52.789Z] [INFO] 
17:39:52 [2020-09-26T21:39:52.789Z] [INFO] --- tycho-p2-plugin:1.5.0:p2-metadata (attached-p2-metadata) @ org.eclipse.ease.lang.python.jython.test ---
17:39:52 [2020-09-26T21:39:52.789Z] [INFO] 
17:39:52 [2020-09-26T21:39:52.789Z] [INFO] --- tycho-surefire-plugin:1.5.0:test (default-test) @ org.eclipse.ease.lang.python.jython.test ---
17:39:53 [2020-09-26T21:39:53.350Z] [INFO] Expected eclipse log file: /home/jenkins/agent/workspace/ease.verify.core.target.2019-03/tests/org.eclipse.ease.lang.python.jython.test/target/work/data/.metadata/.log
17:39:53 [2020-09-26T21:39:53.350Z] [INFO] Command line:
17:39:53 [2020-09-26T21:39:53.350Z] 	[/opt/tools/java/openjdk/jdk-11/11.0.2+9/bin/java, -Dosgi.noShutdown=false, -Dosgi.os=linux, -Dosgi.ws=gtk, -Dosgi.arch=x86_64, -Dosgi.clean=true, -jar, /home/jenkins/.m2/repository/p2/osgi/bundle/org.eclipse.equinox.launcher/1.5.800.v20200727-1323/org.eclipse.equinox.launcher-1.5.800.v20200727-1323.jar, -data, /home/jenkins/agent/workspace/ease.verify.core.target.2019-03/tests/org.eclipse.ease.lang.python.jython.test/target/work/data, -install, /home/jenkins/agent/workspace/ease.verify.core.target.2019-03/tests/org.eclipse.ease.lang.python.jython.test/target/work, -configuration, /home/jenkins/agent/workspace/ease.verify.core.target.2019-03/tests/org.eclipse.ease.lang.python.jython.test/target/work/configuration, -application, org.eclipse.tycho.surefire.osgibooter.headlesstest, -testproperties, /home/jenkins/agent/workspace/ease.verify.core.target.2019-03/tests/org.eclipse.ease.lang.python.jython.test/target/surefire.properties]
17:39:53 [2020-09-26T21:39:53.350Z] Picked up JAVA_TOOL_OPTIONS: -Dmaven.ext.class.path="/home/jenkins/agent/workspace/ease.verify.core.target.2019-03@tmp/withMavene09eca7f/pipeline-maven-spy.jar" -Dorg.jenkinsci.plugins.pipeline.maven.reportsFolder="/home/jenkins/agent/workspace/ease.verify.core.target.2019-03@tmp/withMavene09eca7f" 
17:39:55 [2020-09-26T21:39:55.252Z] WARNING: An illegal reflective access operation has occurred
17:39:55 [2020-09-26T21:39:55.252Z] WARNING: Illegal reflective access by org.python.core.PySystemState (file:/home/jenkins/agent/workspace/ease.verify.core.target.2019-03/tests/org.eclipse.ease.lang.python.jython.test/target/work/plugins/org.jython_2.7.0.I201609090924/jython.jar) to method java.io.Console.encoding()
17:39:55 [2020-09-26T21:39:55.252Z] WARNING: Please consider reporting this to the maintainers of org.python.core.PySystemState
17:39:55 [2020-09-26T21:39:55.252Z] WARNING: Use --illegal-access=warn to enable warnings of further illegal reflective access operations
17:39:55 [2020-09-26T21:39:55.252Z] WARNING: All illegal access operations will be denied in a future release
17:39:55 [2020-09-26T21:39:55.252Z] Running org.eclipse.ease.lang.python.jython.debugger.JythonDebugTest
17:39:56 [2020-09-26T21:39:56.628Z] Start of script
17:39:56 [2020-09-26T21:39:56.628Z] include file start
17:39:56 [2020-09-26T21:39:56.628Z] include file processed
17:39:56 [2020-09-26T21:39:56.628Z] Result of testMethod = 5
17:39:56 [2020-09-26T21:39:56.628Z] End of script
17:39:56 [2020-09-26T21:39:56.628Z] Start of script
17:39:56 [2020-09-26T21:39:56.628Z] include file start
17:39:56 [2020-09-26T21:39:56.628Z] include file processed
17:39:56 [2020-09-26T21:39:56.628Z] Result of testMethod = 5
17:39:56 [2020-09-26T21:39:56.628Z] End of script
17:39:56 [2020-09-26T21:39:56.884Z] Start of script
17:39:56 [2020-09-26T21:39:56.884Z] include file start
17:39:56 [2020-09-26T21:39:56.884Z] include file processed
17:39:56 [2020-09-26T21:39:56.884Z] Result of testMethod = 5
17:39:57 [2020-09-26T21:39:57.140Z] Traceback (most recent call last):
17:39:57 [2020-09-26T21:39:57.140Z]   File "(none)", line 184, in run
17:39:57 [2020-09-26T21:39:57.140Z]   File "__ref_L/Debug Test/Main.py_gerklglyyo", line 23, in <module>
17:39:57 [2020-09-26T21:39:57.140Z]   File "(none)", line 161, in trace_dispatch
17:39:57 [2020-09-26T21:39:57.140Z] org.eclipse.ease.ExitException: 
17:39:57 [2020-09-26T21:39:57.140Z] 
17:39:57 [2020-09-26T21:39:57.140Z] org.eclipse.ease.ExitException: org.eclipse.ease.ExitException: 
17:39:57 [2020-09-26T21:39:57.140Z] Start of script
17:39:57 [2020-09-26T21:39:57.140Z] include file start
17:39:57 [2020-09-26T21:39:57.140Z] include file processed
17:39:57 [2020-09-26T21:39:57.396Z] Result of testMethod = 5
17:39:57 [2020-09-26T21:39:57.396Z] End of script
17:39:57 [2020-09-26T21:39:57.652Z] Start of script
17:39:57 [2020-09-26T21:39:57.652Z] include file start
17:39:57 [2020-09-26T21:39:57.652Z] include file processed
17:39:57 [2020-09-26T21:39:57.652Z] Result of testMethod = 5
17:39:57 [2020-09-26T21:39:57.652Z] End of script
17:39:57 [2020-09-26T21:39:57.908Z] Start of script
17:39:57 [2020-09-26T21:39:57.908Z] include file start
17:39:57 [2020-09-26T21:39:57.908Z] include file processed
17:39:57 [2020-09-26T21:39:57.908Z] Result of testMethod = 5
17:39:57 [2020-09-26T21:39:57.908Z] End of script
17:39:58 [2020-09-26T21:39:58.163Z] Start of script
17:39:58 [2020-09-26T21:39:58.163Z] include file start
17:39:58 [2020-09-26T21:39:58.163Z] include file processed
17:39:58 [2020-09-26T21:39:58.163Z] Result of testMethod = 5
17:39:58 [2020-09-26T21:39:58.163Z] Traceback (most recent call last):
17:39:58 [2020-09-26T21:39:58.163Z]   File "(none)", line 184, in run
17:39:58 [2020-09-26T21:39:58.163Z]   File "__ref_L/Debug Test/Main.py_vvjiokwruo", line 23, in <module>
17:39:58 [2020-09-26T21:39:58.163Z]   File "(none)", line 161, in trace_dispatch
17:39:58 [2020-09-26T21:39:58.163Z] org.eclipse.ease.ExitException: 
17:39:58 [2020-09-26T21:39:58.163Z] 
17:39:58 [2020-09-26T21:39:58.163Z] org.eclipse.ease.ExitException: org.eclipse.ease.ExitException: 
17:39:58 [2020-09-26T21:39:58.419Z] Start of script
17:39:58 [2020-09-26T21:39:58.419Z] include file start
17:39:58 [2020-09-26T21:39:58.419Z] include file processed
17:39:58 [2020-09-26T21:39:58.675Z] Result of testMethod = 5
17:39:58 [2020-09-26T21:39:58.675Z] End of script
17:39:58 [2020-09-26T21:39:58.675Z] Start of script
17:39:58 [2020-09-26T21:39:58.675Z] include file start
17:39:58 [2020-09-26T21:39:58.675Z] include file processed
17:39:58 [2020-09-26T21:39:58.675Z] Result of testMethod = 5
17:39:58 [2020-09-26T21:39:58.675Z] End of script
17:39:58 [2020-09-26T21:39:58.931Z] Start of script
17:39:58 [2020-09-26T21:39:58.931Z] include file start
17:39:58 [2020-09-26T21:39:58.931Z] include file processed
17:39:59 [2020-09-26T21:39:59.186Z] Traceback (most recent call last):
17:39:59 [2020-09-26T21:39:59.186Z]   File "(none)", line 184, in run
17:39:59 [2020-09-26T21:39:59.186Z]   File "__ref_L/Debug Test/Main.py_furunnyslu", line 22, in <module>
17:39:59 [2020-09-26T21:39:59.186Z]   File "(none)", line 161, in trace_dispatch
17:39:59 [2020-09-26T21:39:59.186Z] org.eclipse.ease.ExitException: 
17:39:59 [2020-09-26T21:39:59.186Z] 
17:39:59 [2020-09-26T21:39:59.186Z] org.eclipse.ease.ExitException: org.eclipse.ease.ExitException: 
17:39:59 [2020-09-26T21:39:59.442Z] Start of script
17:39:59 [2020-09-26T21:39:59.442Z] include file start
17:39:59 [2020-09-26T21:39:59.442Z] include file processed
17:39:59 [2020-09-26T21:39:59.442Z] Result of testMethod = 5
17:39:59 [2020-09-26T21:39:59.442Z] End of script
17:39:59 [2020-09-26T21:39:59.698Z] Start of script
17:39:59 [2020-09-26T21:39:59.698Z] include file start
17:39:59 [2020-09-26T21:39:59.698Z] include file processed
17:39:59 [2020-09-26T21:39:59.698Z] Result of testMethod = 5
17:39:59 [2020-09-26T21:39:59.698Z] End of script
17:39:59 [2020-09-26T21:39:59.953Z] Traceback (most recent call last):
17:39:59 [2020-09-26T21:39:59.953Z]   File "(none)", line 184, in run
17:39:59 [2020-09-26T21:39:59.953Z]   File "__ref_L/Debug Test/Main.py_lipzvblbzt", line 1, in <module>
17:39:59 [2020-09-26T21:39:59.953Z]   File "(none)", line 161, in trace_dispatch
17:39:59 [2020-09-26T21:39:59.953Z] org.eclipse.ease.ExitException: 
17:39:59 [2020-09-26T21:39:59.953Z] 
17:39:59 [2020-09-26T21:39:59.953Z] org.eclipse.ease.ExitException: org.eclipse.ease.ExitException: 
17:40:00 [2020-09-26T21:40:00.209Z] Start of script
17:40:00 [2020-09-26T21:40:00.209Z] include file start
17:40:00 [2020-09-26T21:40:00.209Z] include file processed
17:40:00 [2020-09-26T21:40:00.209Z] Result of testMethod = 5
17:40:00 [2020-09-26T21:40:00.209Z] End of script
17:40:00 [2020-09-26T21:40:00.465Z] Start of script
17:40:00 [2020-09-26T21:40:00.465Z] include file start
17:40:00 [2020-09-26T21:40:00.465Z] include file processed
17:40:00 [2020-09-26T21:40:00.465Z] Result of testMethod = 5
17:40:00 [2020-09-26T21:40:00.465Z] End of script
17:40:00 [2020-09-26T21:40:00.721Z] Start of script
17:40:00 [2020-09-26T21:40:00.721Z] include file start
17:40:00 [2020-09-26T21:40:00.721Z] include file processed
17:40:00 [2020-09-26T21:40:00.721Z] Result of testMethod = 5
17:40:00 [2020-09-26T21:40:00.976Z] Traceback (most recent call last):
17:40:00 [2020-09-26T21:40:00.976Z]   File "(none)", line 184, in run
17:40:00 [2020-09-26T21:40:00.976Z]   File "__ref_L/Debug Test/Main.py_trggfutinm", line 23, in <module>
17:40:00 [2020-09-26T21:40:00.976Z]   File "(none)", line 161, in trace_dispatch
17:40:00 [2020-09-26T21:40:00.976Z] org.eclipse.ease.ExitException: 
17:40:00 [2020-09-26T21:40:00.976Z] 
17:40:00 [2020-09-26T21:40:00.977Z] org.eclipse.ease.ExitException: org.eclipse.ease.ExitException: 
17:40:00 [2020-09-26T21:40:00.977Z] Start of script
17:40:00 [2020-09-26T21:40:00.977Z] include file start
17:40:00 [2020-09-26T21:40:00.977Z] include file processed
17:40:01 [2020-09-26T21:40:01.232Z] Result of testMethod = 5
17:40:01 [2020-09-26T21:40:01.232Z] End of script
17:40:01 [2020-09-26T21:40:01.488Z] Traceback (most recent call last):
17:40:01 [2020-09-26T21:40:01.488Z]   File "(none)", line 184, in run
17:40:01 [2020-09-26T21:40:01.488Z]   File "__ref_L/Debug Test/Main.py_sojrcnnbju", line 1, in <module>
17:40:01 [2020-09-26T21:40:01.488Z]   File "(none)", line 161, in trace_dispatch
17:40:01 [2020-09-26T21:40:01.488Z] org.eclipse.ease.ExitException: 
17:40:01 [2020-09-26T21:40:01.488Z] 
17:40:01 [2020-09-26T21:40:01.488Z] org.eclipse.ease.ExitException: org.eclipse.ease.ExitException: 
17:40:01 [2020-09-26T21:40:01.488Z] Start of script
17:40:01 [2020-09-26T21:40:01.488Z] include file start
17:40:01 [2020-09-26T21:40:01.488Z] include file processed
17:40:01 [2020-09-26T21:40:01.488Z] Result of testMethod = 5
17:40:01 [2020-09-26T21:40:01.488Z] End of script
17:40:01 [2020-09-26T21:40:01.744Z] Start of script
17:40:01 [2020-09-26T21:40:01.744Z] include file start
17:40:01 [2020-09-26T21:40:01.744Z] include file processed
17:40:02 [2020-09-26T21:40:02.000Z] Result of testMethod = 5
17:40:02 [2020-09-26T21:40:02.000Z] End of script
17:40:02 [2020-09-26T21:40:02.000Z] Traceback (most recent call last):
17:40:02 [2020-09-26T21:40:02.000Z]   File "(none)", line 184, in run
17:40:02 [2020-09-26T21:40:02.000Z]   File "__ref_L/Debug Test/Main.py_gwgclzczrw", line 1, in <module>
17:40:02 [2020-09-26T21:40:02.000Z]   File "(none)", line 161, in trace_dispatch
17:40:02 [2020-09-26T21:40:02.000Z] org.eclipse.ease.ExitException: 
17:40:02 [2020-09-26T21:40:02.000Z] 
17:40:02 [2020-09-26T21:40:02.000Z] org.eclipse.ease.ExitException: org.eclipse.ease.ExitException: 
17:40:02 [2020-09-26T21:40:02.256Z] Start of script
17:40:02 [2020-09-26T21:40:02.256Z] include file start
17:40:02 [2020-09-26T21:40:02.256Z] include file processed
17:40:02 [2020-09-26T21:40:02.511Z] Result of testMethod = 5
17:40:02 [2020-09-26T21:40:02.511Z] End of script
17:40:02 [2020-09-26T21:40:02.511Z] Start of script
17:40:02 [2020-09-26T21:40:02.511Z] include file start
17:40:02 [2020-09-26T21:40:02.511Z] include file processed
17:40:02 [2020-09-26T21:40:02.511Z] Result of testMethod = 5
17:40:02 [2020-09-26T21:40:02.768Z] Traceback (most recent call last):
17:40:02 [2020-09-26T21:40:02.768Z]   File "(none)", line 184, in run
17:40:02 [2020-09-26T21:40:02.768Z]   File "__ref_L/Debug Test/Main.py_dopfwxerxd", line 23, in <module>
17:40:02 [2020-09-26T21:40:02.768Z]   File "(none)", line 161, in trace_dispatch
17:40:02 [2020-09-26T21:40:02.768Z] org.eclipse.ease.ExitException: 
17:40:02 [2020-09-26T21:40:02.768Z] 
17:40:02 [2020-09-26T21:40:02.768Z] org.eclipse.ease.ExitException: org.eclipse.ease.ExitException: 
17:40:03 [2020-09-26T21:40:03.024Z] Start of script
17:40:03 [2020-09-26T21:40:03.024Z] include file start
17:40:03 [2020-09-26T21:40:03.024Z] include file processed
17:40:03 [2020-09-26T21:40:03.024Z] Result of testMethod = 5
17:40:03 [2020-09-26T21:40:03.024Z] End of script
17:40:03 [2020-09-26T21:40:03.024Z] Start of script
17:40:03 [2020-09-26T21:40:03.024Z] include file start
17:40:03 [2020-09-26T21:40:03.024Z] include file processed
17:40:03 [2020-09-26T21:40:03.280Z] Result of testMethod = 5
17:40:03 [2020-09-26T21:40:03.280Z] End of script
17:40:03 [2020-09-26T21:40:03.280Z] Start of script
17:40:03 [2020-09-26T21:40:03.280Z] include file start
17:40:03 [2020-09-26T21:40:03.280Z] include file processed
17:40:03 [2020-09-26T21:40:03.280Z] Result of testMethod = 5
17:40:03 [2020-09-26T21:40:03.280Z] End of script
17:40:03 [2020-09-26T21:40:03.536Z] Start of script
17:40:03 [2020-09-26T21:40:03.536Z] include file start
17:40:03 [2020-09-26T21:40:03.536Z] include file processed
17:40:03 [2020-09-26T21:40:03.792Z] Result of testMethod = 5
17:40:03 [2020-09-26T21:40:03.792Z] End of script
17:40:03 [2020-09-26T21:40:03.792Z] Start of script
17:40:03 [2020-09-26T21:40:03.792Z] include file start
17:40:03 [2020-09-26T21:40:03.792Z] include file processed
17:40:04 [2020-09-26T21:40:04.047Z] Traceback (most recent call last):
17:40:04 [2020-09-26T21:40:04.047Z]   File "(none)", line 184, in run
17:40:04 [2020-09-26T21:40:04.047Z]   File "__ref_L/Debug Test/Main.py_heavhxynra", line 21, in <module>
17:40:04 [2020-09-26T21:40:04.047Z]   File "__ref_L/Debug Test/Main.py_heavhxynra", line 18, in testMethod
17:40:04 [2020-09-26T21:40:04.047Z]   File "(none)", line 161, in trace_dispatch
17:40:04 [2020-09-26T21:40:04.047Z] org.eclipse.ease.ExitException: 
17:40:04 [2020-09-26T21:40:04.047Z] 
17:40:04 [2020-09-26T21:40:04.047Z] org.eclipse.ease.ExitException: org.eclipse.ease.ExitException: 
17:40:04 [2020-09-26T21:40:04.047Z] Start of script
17:40:04 [2020-09-26T21:40:04.303Z] include file start
17:40:04 [2020-09-26T21:40:04.303Z] include file processed
17:40:04 [2020-09-26T21:40:04.303Z] Result of testMethod = 5
17:40:04 [2020-09-26T21:40:04.303Z] End of script
17:40:04 [2020-09-26T21:40:04.559Z] Start of script
17:40:04 [2020-09-26T21:40:04.559Z] include file start
17:40:04 [2020-09-26T21:40:04.559Z] include file processed
17:40:04 [2020-09-26T21:40:04.559Z] Result of testMethod = 5
17:40:04 [2020-09-26T21:40:04.559Z] Traceback (most recent call last):
17:40:04 [2020-09-26T21:40:04.559Z]   File "(none)", line 184, in run
17:40:04 [2020-09-26T21:40:04.559Z]   File "__ref_L/Debug Test/Main.py_tzuhkpmtbn", line 23, in <module>
17:40:04 [2020-09-26T21:40:04.559Z]   File "(none)", line 161, in trace_dispatch
17:40:04 [2020-09-26T21:40:04.559Z] org.eclipse.ease.ExitException: 
17:40:04 [2020-09-26T21:40:04.559Z] 
17:40:04 [2020-09-26T21:40:04.559Z] org.eclipse.ease.ExitException: org.eclipse.ease.ExitException: 
17:40:04 [2020-09-26T21:40:04.815Z] Start of script
17:40:04 [2020-09-26T21:40:04.815Z] include file start
17:40:04 [2020-09-26T21:40:04.815Z] include file processed
17:40:04 [2020-09-26T21:40:04.815Z] Result of testMethod = 5
17:40:04 [2020-09-26T21:40:04.815Z] End of script
17:40:05 [2020-09-26T21:40:05.070Z] Start of script
17:40:05 [2020-09-26T21:40:05.070Z] include file start
17:40:05 [2020-09-26T21:40:05.070Z] include file processed
17:40:05 [2020-09-26T21:40:05.070Z] Result of testMethod = 5
17:40:05 [2020-09-26T21:40:05.070Z] End of script
17:40:05 [2020-09-26T21:40:05.326Z] Start of script
17:40:05 [2020-09-26T21:40:05.326Z] include file start
17:40:05 [2020-09-26T21:40:05.326Z] include file processed
17:40:05 [2020-09-26T21:40:05.326Z] Result of testMethod = 5
17:40:05 [2020-09-26T21:40:05.326Z] End of script
17:40:05 [2020-09-26T21:40:05.581Z] Start of script
17:40:05 [2020-09-26T21:40:05.581Z] include file start
17:40:05 [2020-09-26T21:40:05.581Z] include file processed
17:40:05 [2020-09-26T21:40:05.581Z] Result of testMethod = 5
17:40:05 [2020-09-26T21:40:05.581Z] End of script
17:40:05 [2020-09-26T21:40:05.836Z] Start of script
17:40:05 [2020-09-26T21:40:05.837Z] include file start
17:40:05 [2020-09-26T21:40:05.837Z] include file processed
17:40:05 [2020-09-26T21:40:05.837Z] Result of testMethod = 5
17:40:05 [2020-09-26T21:40:05.837Z] Traceback (most recent call last):
17:40:05 [2020-09-26T21:40:05.837Z]   File "(none)", line 184, in run
17:40:05 [2020-09-26T21:40:05.837Z]   File "__ref_L/Debug Test/Main.py_maikjgtefo", line 23, in <module>
17:40:05 [2020-09-26T21:40:05.837Z]   File "(none)", line 161, in trace_dispatch
17:40:05 [2020-09-26T21:40:05.837Z] org.eclipse.ease.ExitException: 
17:40:05 [2020-09-26T21:40:05.837Z] 
17:40:05 [2020-09-26T21:40:05.837Z] org.eclipse.ease.ExitException: org.eclipse.ease.ExitException: 
17:40:06 [2020-09-26T21:40:06.092Z] Start of script
17:40:06 [2020-09-26T21:40:06.092Z] include file start
17:40:06 [2020-09-26T21:40:06.092Z] include file processed
17:40:06 [2020-09-26T21:40:06.092Z] Result of testMethod = 5
17:40:06 [2020-09-26T21:40:06.092Z] End of script
17:40:06 [2020-09-26T21:40:06.348Z] Start of script
17:40:06 [2020-09-26T21:40:06.348Z] include file start
17:40:06 [2020-09-26T21:40:06.348Z] include file processed
17:40:06 [2020-09-26T21:40:06.348Z] Result of testMethod = 5
17:40:06 [2020-09-26T21:40:06.348Z] Traceback (most recent call last):
17:40:06 [2020-09-26T21:40:06.348Z]   File "(none)", line 184, in run
17:40:06 [2020-09-26T21:40:06.348Z]   File "__ref_L/Debug Test/Main.py_qwaioscfod", line 23, in <module>
17:40:06 [2020-09-26T21:40:06.348Z]   File "(none)", line 161, in trace_dispatch
17:40:06 [2020-09-26T21:40:06.348Z] org.eclipse.ease.ExitException: 
17:40:06 [2020-09-26T21:40:06.348Z] 
17:40:06 [2020-09-26T21:40:06.348Z] org.eclipse.ease.ExitException: org.eclipse.ease.ExitException: 
17:40:06 [2020-09-26T21:40:06.604Z] Traceback (most recent call last):
17:40:06 [2020-09-26T21:40:06.604Z]   File "(none)", line 184, in run
17:40:06 [2020-09-26T21:40:06.604Z]   File "__ref_L/Debug Test/Main.py_lqayjoxamz", line 1, in <module>
17:40:06 [2020-09-26T21:40:06.604Z]   File "(none)", line 161, in trace_dispatch
17:40:06 [2020-09-26T21:40:06.604Z] org.eclipse.ease.ExitException: 
17:40:06 [2020-09-26T21:40:06.604Z] 
17:40:06 [2020-09-26T21:40:06.604Z] org.eclipse.ease.ExitException: org.eclipse.ease.ExitException: 
17:40:06 [2020-09-26T21:40:06.859Z] Start of script
17:40:06 [2020-09-26T21:40:06.859Z] include file start
17:40:06 [2020-09-26T21:40:06.859Z] include file processed
17:40:06 [2020-09-26T21:40:06.859Z] Result of testMethod = 5
17:40:06 [2020-09-26T21:40:06.859Z] End of script
17:40:07 [2020-09-26T21:40:07.115Z] Start of script
17:40:07 [2020-09-26T21:40:07.115Z] include file start
17:40:07 [2020-09-26T21:40:07.115Z] include file processed
17:40:07 [2020-09-26T21:40:07.115Z] Result of testMethod = 5
17:40:07 [2020-09-26T21:40:07.115Z] End of script
17:40:07 [2020-09-26T21:40:07.371Z] Start of script
17:40:07 [2020-09-26T21:40:07.371Z] include file start
17:40:07 [2020-09-26T21:40:07.371Z] include file processed
17:40:07 [2020-09-26T21:40:07.371Z] Result of testMethod = 5
17:40:07 [2020-09-26T21:40:07.371Z] End of script
17:40:07 [2020-09-26T21:40:07.627Z] Tests run: 42, Failures: 0, Errors: 0, Skipped: 0, Time elapsed: 12.437 s - in org.eclipse.ease.lang.python.jython.debugger.JythonDebugTest
17:40:07 [2020-09-26T21:40:07.627Z] disconnectProcessInSuspendedState(org.eclipse.ease.lang.python.jython.debugger.JythonDebugTest)  Time elapsed: 1.545 s
17:40:07 [2020-09-26T21:40:07.627Z] stepReturnIncludeCommand(org.eclipse.ease.lang.python.jython.debugger.JythonDebugTest)  Time elapsed: 0.21 s
17:40:07 [2020-09-26T21:40:07.627Z] arrayVariableSorting(org.eclipse.ease.lang.python.jython.debugger.JythonDebugTest)  Time elapsed: 0.31 s
17:40:07 [2020-09-26T21:40:07.627Z] stepOverOnDebugTarget(org.eclipse.ease.lang.python.jython.debugger.JythonDebugTest)  Time elapsed: 0.31 s
17:40:07 [2020-09-26T21:40:07.627Z] hasDebugTarget(org.eclipse.ease.lang.python.jython.debugger.JythonDebugTest)  Time elapsed: 0.106 s
17:40:07 [2020-09-26T21:40:07.627Z] disconnectThreadInSuspendedState(org.eclipse.ease.lang.python.jython.debugger.JythonDebugTest)  Time elapsed: 0.208 s
17:40:07 [2020-09-26T21:40:07.627Z] stepReturnOnDebugTarget(org.eclipse.ease.lang.python.jython.debugger.JythonDebugTest)  Time elapsed: 0.309 s
17:40:07 [2020-09-26T21:40:07.627Z] nullVariable(org.eclipse.ease.lang.python.jython.debugger.JythonDebugTest)  Time elapsed: 0.309 s
17:40:07 [2020-09-26T21:40:07.627Z] stepOverOnStackFrame(org.eclipse.ease.lang.python.jython.debugger.JythonDebugTest)  Time elapsed: 0.309 s
17:40:07 [2020-09-26T21:40:07.627Z] resumeOnDebugTarget(org.eclipse.ease.lang.python.jython.debugger.JythonDebugTest)  Time elapsed: 0.208 s
17:40:07 [2020-09-26T21:40:07.627Z] modifyVariableKeepingType(org.eclipse.ease.lang.python.jython.debugger.JythonDebugTest)  Time elapsed: 0.507 s
17:40:07 [2020-09-26T21:40:07.627Z] resumeOnLastIncludeLine(org.eclipse.ease.lang.python.jython.debugger.JythonDebugTest)  Time elapsed: 0.209 s
17:40:07 [2020-09-26T21:40:07.627Z] stepReturnOnStackFrame(org.eclipse.ease.lang.python.jython.debugger.JythonDebugTest)  Time elapsed: 0.309 s
17:40:07 [2020-09-26T21:40:07.627Z] terminateStackFrameInSuspendedState(org.eclipse.ease.lang.python.jython.debugger.JythonDebugTest)  Time elapsed: 0.208 s
17:40:07 [2020-09-26T21:40:07.627Z] breakpointLocation(org.eclipse.ease.lang.python.jython.debugger.JythonDebugTest)  Time elapsed: 0.208 s
17:40:07 [2020-09-26T21:40:07.627Z] stepReturnOnThread(org.eclipse.ease.lang.python.jython.debugger.JythonDebugTest)  Time elapsed: 0.308 s
17:40:07 [2020-09-26T21:40:07.627Z] javaClassVariable(org.eclipse.ease.lang.python.jython.debugger.JythonDebugTest)  Time elapsed: 0.309 s
17:40:07 [2020-09-26T21:40:07.627Z] stepIntoOnThread(org.eclipse.ease.lang.python.jython.debugger.JythonDebugTest)  Time elapsed: 0.308 s
17:40:07 [2020-09-26T21:40:07.627Z] terminateThreadInSuspendedState(org.eclipse.ease.lang.python.jython.debugger.JythonDebugTest)  Time elapsed: 0.207 s
17:40:07 [2020-09-26T21:40:07.627Z] resumeOnThread(org.eclipse.ease.lang.python.jython.debugger.JythonDebugTest)  Time elapsed: 0.207 s
17:40:07 [2020-09-26T21:40:07.627Z] stepIntoOnStackFrame(org.eclipse.ease.lang.python.jython.debugger.JythonDebugTest)  Time elapsed: 0.307 s
17:40:07 [2020-09-26T21:40:07.627Z] terminateProcessInSuspendedState(org.eclipse.ease.lang.python.jython.debugger.JythonDebugTest)  Time elapsed: 0.206 s
17:40:07 [2020-09-26T21:40:07.627Z] stepOverOnProcess(org.eclipse.ease.lang.python.jython.debugger.JythonDebugTest)  Time elapsed: 0.308 s
17:40:07 [2020-09-26T21:40:07.627Z] nativeArrayVariable(org.eclipse.ease.lang.python.jython.debugger.JythonDebugTest)  Time elapsed: 0.307 s
17:40:07 [2020-09-26T21:40:07.627Z] disconnectDebugTargetInSuspendedState(org.eclipse.ease.lang.python.jython.debugger.JythonDebugTest)  Time elapsed: 0.206 s
17:40:07 [2020-09-26T21:40:07.627Z] stepIntoOnProcess(org.eclipse.ease.lang.python.jython.debugger.JythonDebugTest)  Time elapsed: 0.309 s
17:40:07 [2020-09-26T21:40:07.627Z] terminatedState(org.eclipse.ease.lang.python.jython.debugger.JythonDebugTest)  Time elapsed: 0.105 s
17:40:07 [2020-09-26T21:40:07.627Z] stepOverIncludeCommand(org.eclipse.ease.lang.python.jython.debugger.JythonDebugTest)  Time elapsed: 0.381 s
17:40:07 [2020-09-26T21:40:07.628Z] innerScopeVariableBeforeOuterScopeVariable(org.eclipse.ease.lang.python.jython.debugger.JythonDebugTest)  Time elapsed: 0.306 s
17:40:07 [2020-09-26T21:40:07.628Z] stepIntoIncludeCommand(org.eclipse.ease.lang.python.jython.debugger.JythonDebugTest)  Time elapsed: 0.304 s
17:40:07 [2020-09-26T21:40:07.628Z] primitiveStringVariable(org.eclipse.ease.lang.python.jython.debugger.JythonDebugTest)  Time elapsed: 0.306 s
17:40:07 [2020-09-26T21:40:07.628Z] resumeOnProcess(org.eclipse.ease.lang.python.jython.debugger.JythonDebugTest)  Time elapsed: 0.206 s
17:40:07 [2020-09-26T21:40:07.628Z] stepIntoOnDebugTarget(org.eclipse.ease.lang.python.jython.debugger.JythonDebugTest)  Time elapsed: 0.306 s
17:40:07 [2020-09-26T21:40:07.628Z] stepOverOnThread(org.eclipse.ease.lang.python.jython.debugger.JythonDebugTest)  Time elapsed: 0.306 s
17:40:07 [2020-09-26T21:40:07.628Z] suspendedState(org.eclipse.ease.lang.python.jython.debugger.JythonDebugTest)  Time elapsed: 0.205 s
17:40:07 [2020-09-26T21:40:07.628Z] primitiveDoubleVariable(org.eclipse.ease.lang.python.jython.debugger.JythonDebugTest)  Time elapsed: 0.304 s
17:40:07 [2020-09-26T21:40:07.628Z] resumeOnStackFrame(org.eclipse.ease.lang.python.jython.debugger.JythonDebugTest)  Time elapsed: 0.206 s
17:40:07 [2020-09-26T21:40:07.628Z] nativeObjectVariable(org.eclipse.ease.lang.python.jython.debugger.JythonDebugTest)  Time elapsed: 0.305 s
17:40:07 [2020-09-26T21:40:07.628Z] terminateDebugTargetInSuspendedState(org.eclipse.ease.lang.python.jython.debugger.JythonDebugTest)  Time elapsed: 0.206 s
17:40:07 [2020-09-26T21:40:07.628Z] disconnectStackFrameInSuspendedState(org.eclipse.ease.lang.python.jython.debugger.JythonDebugTest)  Time elapsed: 0.206 s
17:40:07 [2020-09-26T21:40:07.628Z] stepReturnOnProcess(org.eclipse.ease.lang.python.jython.debugger.JythonDebugTest)  Time elapsed: 0.306 s
17:40:07 [2020-09-26T21:40:07.628Z] evaluateWatchExpression(org.eclipse.ease.lang.python.jython.debugger.JythonDebugTest)  Time elapsed: 0.208 s
17:40:07 [2020-09-26T21:40:07.628Z] 
17:40:07 [2020-09-26T21:40:07.628Z] Results:
17:40:07 [2020-09-26T21:40:07.628Z] 
17:40:07 [2020-09-26T21:40:07.628Z] Tests run: 42, Failures: 0, Errors: 0, Skipped: 0
17:40:07 [2020-09-26T21:40:07.628Z] 
17:40:08 [2020-09-26T21:40:08.189Z] [INFO] All tests passed!
17:40:08 [2020-09-26T21:40:08.189Z] [INFO] 
17:40:08 [2020-09-26T21:40:08.189Z] [INFO] --- maven-install-plugin:2.3.1:install (default-install) @ org.eclipse.ease.lang.python.jython.test ---
17:40:08 [2020-09-26T21:40:08.189Z] [INFO] Installing /home/jenkins/agent/workspace/ease.verify.core.target.2019-03/tests/org.eclipse.ease.lang.python.jython.test/target/org.eclipse.ease.lang.python.jython.test-0.8.0-SNAPSHOT.jar to /home/jenkins/.m2/repository/org/eclipse/ease/org.eclipse.ease.lang.python.jython.test/0.8.0-SNAPSHOT/org.eclipse.ease.lang.python.jython.test-0.8.0-SNAPSHOT.jar
17:40:08 [2020-09-26T21:40:08.189Z] [INFO] Installing /home/jenkins/agent/workspace/ease.verify.core.target.2019-03/tests/org.eclipse.ease.lang.python.jython.test/pom.xml to /home/jenkins/.m2/repository/org/eclipse/ease/org.eclipse.ease.lang.python.jython.test/0.8.0-SNAPSHOT/org.eclipse.ease.lang.python.jython.test-0.8.0-SNAPSHOT.pom
17:40:08 [2020-09-26T21:40:08.189Z] [INFO] Installing /home/jenkins/agent/workspace/ease.verify.core.target.2019-03/tests/org.eclipse.ease.lang.python.jython.test/target/org.eclipse.ease.lang.python.jython.test-0.8.0-SNAPSHOT-sources.jar to /home/jenkins/.m2/repository/org/eclipse/ease/org.eclipse.ease.lang.python.jython.test/0.8.0-SNAPSHOT/org.eclipse.ease.lang.python.jython.test-0.8.0-SNAPSHOT-sources.jar
17:40:08 [2020-09-26T21:40:08.189Z] [INFO] Installing /home/jenkins/agent/workspace/ease.verify.core.target.2019-03/tests/org.eclipse.ease.lang.python.jython.test/target/p2content.xml to /home/jenkins/.m2/repository/org/eclipse/ease/org.eclipse.ease.lang.python.jython.test/0.8.0-SNAPSHOT/org.eclipse.ease.lang.python.jython.test-0.8.0-SNAPSHOT-p2metadata.xml
17:40:08 [2020-09-26T21:40:08.189Z] [INFO] Installing /home/jenkins/agent/workspace/ease.verify.core.target.2019-03/tests/org.eclipse.ease.lang.python.jython.test/target/p2artifacts.xml to /home/jenkins/.m2/repository/org/eclipse/ease/org.eclipse.ease.lang.python.jython.test/0.8.0-SNAPSHOT/org.eclipse.ease.lang.python.jython.test-0.8.0-SNAPSHOT-p2artifacts.xml
17:40:08 [2020-09-26T21:40:08.189Z] [INFO] Installing /home/jenkins/agent/workspace/ease.verify.core.target.2019-03/tests/org.eclipse.ease.lang.python.jython.test/target/p2content.xml to /home/jenkins/.m2/repository/org/eclipse/ease/org.eclipse.ease.lang.python.jython.test/0.8.0-SNAPSHOT/org.eclipse.ease.lang.python.jython.test-0.8.0-SNAPSHOT-p2metadata.xml
17:40:08 [2020-09-26T21:40:08.189Z] [INFO] Installing /home/jenkins/agent/workspace/ease.verify.core.target.2019-03/tests/org.eclipse.ease.lang.python.jython.test/target/p2artifacts.xml to /home/jenkins/.m2/repository/org/eclipse/ease/org.eclipse.ease.lang.python.jython.test/0.8.0-SNAPSHOT/org.eclipse.ease.lang.python.jython.test-0.8.0-SNAPSHOT-p2artifacts.xml
17:40:08 [2020-09-26T21:40:08.189Z] [INFO] 
17:40:08 [2020-09-26T21:40:08.189Z] [INFO] --- tycho-p2-plugin:1.5.0:update-local-index (default-update-local-index) @ org.eclipse.ease.lang.python.jython.test ---
17:40:08 [2020-09-26T21:40:08.189Z] [INFO] 
17:40:08 [2020-09-26T21:40:08.189Z] [INFO] -----< org.eclipse.ease:org.eclipse.ease.lang.scriptarchive.test >------
17:40:08 [2020-09-26T21:40:08.189Z] [INFO] Building org.eclipse.ease.lang.scriptarchive.test 0.8.0-SNAPSHOT [44/48]
17:40:08 [2020-09-26T21:40:08.189Z] [INFO] ------------------------[ eclipse-test-plugin ]-------------------------
17:40:08 [2020-09-26T21:40:08.189Z] [INFO] 
17:40:08 [2020-09-26T21:40:08.189Z] [INFO] --- maven-clean-plugin:2.5:clean (default-clean) @ org.eclipse.ease.lang.scriptarchive.test ---
17:40:08 [2020-09-26T21:40:08.189Z] [INFO] 
17:40:08 [2020-09-26T21:40:08.189Z] [INFO] --- tycho-packaging-plugin:1.5.0:build-qualifier (default-build-qualifier) @ org.eclipse.ease.lang.scriptarchive.test ---
17:40:08 [2020-09-26T21:40:08.189Z] [INFO] The project's OSGi version is 0.8.0.I201910171213
17:40:08 [2020-09-26T21:40:08.189Z] [INFO] 
17:40:08 [2020-09-26T21:40:08.189Z] [INFO] --- tycho-packaging-plugin:1.5.0:validate-id (default-validate-id) @ org.eclipse.ease.lang.scriptarchive.test ---
17:40:08 [2020-09-26T21:40:08.189Z] [INFO] 
17:40:08 [2020-09-26T21:40:08.189Z] [INFO] --- tycho-packaging-plugin:1.5.0:validate-version (default-validate-version) @ org.eclipse.ease.lang.scriptarchive.test ---
17:40:08 [2020-09-26T21:40:08.190Z] [INFO] 
17:40:08 [2020-09-26T21:40:08.190Z] [INFO] >>> maven-javadoc-plugin:2.9.1:javadoc (build-docs) > generate-sources @ org.eclipse.ease.lang.scriptarchive.test >>>
17:40:08 [2020-09-26T21:40:08.190Z] [INFO] 
17:40:08 [2020-09-26T21:40:08.190Z] [INFO] --- tycho-packaging-plugin:1.5.0:build-qualifier (default-build-qualifier) @ org.eclipse.ease.lang.scriptarchive.test ---
17:40:08 [2020-09-26T21:40:08.190Z] [INFO] The project's OSGi version is 0.8.0.I201910171213
17:40:08 [2020-09-26T21:40:08.190Z] [INFO] 
17:40:08 [2020-09-26T21:40:08.190Z] [INFO] --- tycho-packaging-plugin:1.5.0:validate-id (default-validate-id) @ org.eclipse.ease.lang.scriptarchive.test ---
17:40:08 [2020-09-26T21:40:08.190Z] [INFO] 
17:40:08 [2020-09-26T21:40:08.190Z] [INFO] --- tycho-packaging-plugin:1.5.0:validate-version (default-validate-version) @ org.eclipse.ease.lang.scriptarchive.test ---
17:40:08 [2020-09-26T21:40:08.190Z] [INFO] 
17:40:08 [2020-09-26T21:40:08.190Z] [INFO] <<< maven-javadoc-plugin:2.9.1:javadoc (build-docs) < generate-sources @ org.eclipse.ease.lang.scriptarchive.test <<<
17:40:08 [2020-09-26T21:40:08.190Z] [INFO] 
17:40:08 [2020-09-26T21:40:08.190Z] [INFO] 
17:40:08 [2020-09-26T21:40:08.190Z] [INFO] --- maven-javadoc-plugin:2.9.1:javadoc (build-docs) @ org.eclipse.ease.lang.scriptarchive.test ---
17:40:08 [2020-09-26T21:40:08.190Z] [ERROR] Error fetching link: http://help.eclipse.org/oxygen/topic/org.eclipse.platform.doc.isv/reference/api/package-list. Ignored it.
17:40:08 [2020-09-26T21:40:08.190Z] [ERROR] Error fetching link: https://ci.eclipse.org/ease/job/ease.build.core/JavaDoc/package-list. Ignored it.
17:40:09 [2020-09-26T21:40:09.594Z] [INFO] 
17:40:09 [2020-09-26T21:40:09.594Z] Loading source files for package org.eclipse.ease.lang.scriptarchive...
17:40:09 [2020-09-26T21:40:09.594Z] Constructing Javadoc information...
17:40:09 [2020-09-26T21:40:09.594Z] WARNING: Cannot open location "/home/jenkins/agent/workspace/ease.verify.core.target.2019-03/tests/org.eclipse.ease.lang.scriptarchive.test/target/javadoc-bundle-options/package-list"
17:40:09 [2020-09-26T21:40:09.594Z] No plugin definition found, skipping
17:40:09 [2020-09-26T21:40:09.594Z] No plugin definition found, skipping
17:40:09 [2020-09-26T21:40:09.594Z] [WARNING] Javadoc Warnings
17:40:09 [2020-09-26T21:40:09.594Z] [WARNING] Picked up JAVA_TOOL_OPTIONS: -Dmaven.ext.class.path="/home/jenkins/agent/workspace/ease.verify.core.target.2019-03@tmp/withMavene09eca7f/pipeline-maven-spy.jar" -Dorg.jenkinsci.plugins.pipeline.maven.reportsFolder="/home/jenkins/agent/workspace/ease.verify.core.target.2019-03@tmp/withMavene09eca7f"
17:40:09 [2020-09-26T21:40:09.594Z] [WARNING] javadoc: warning - The old Doclet and Taglet APIs in the packages
17:40:09 [2020-09-26T21:40:09.594Z] [WARNING] com.sun.javadoc, com.sun.tools.doclets and their implementations
17:40:09 [2020-09-26T21:40:09.594Z] [WARNING] are planned to be removed in a future JDK release. These
17:40:09 [2020-09-26T21:40:09.594Z] [WARNING] components have been superseded by the new APIs in jdk.javadoc.doclet.
17:40:09 [2020-09-26T21:40:09.594Z] [WARNING] Users are strongly recommended to migrate to the new APIs.
17:40:09 [2020-09-26T21:40:09.594Z] [INFO] 
17:40:09 [2020-09-26T21:40:09.595Z] [INFO] --- build-helper-maven-plugin:1.9.1:add-resource (add_help) @ org.eclipse.ease.lang.scriptarchive.test ---
17:40:09 [2020-09-26T21:40:09.595Z] [INFO] 
17:40:09 [2020-09-26T21:40:09.595Z] [INFO] --- maven-resources-plugin:2.4.3:resources (default-resources) @ org.eclipse.ease.lang.scriptarchive.test ---
17:40:09 [2020-09-26T21:40:09.595Z] [INFO] Using 'UTF-8' encoding to copy filtered resources.
17:40:09 [2020-09-26T21:40:09.595Z] [INFO] skip non existing resourceDirectory /home/jenkins/agent/workspace/ease.verify.core.target.2019-03/tests/org.eclipse.ease.lang.scriptarchive.test/src/main/resources
17:40:09 [2020-09-26T21:40:09.595Z] [INFO] skip non existing resourceDirectory /home/jenkins/agent/workspace/ease.verify.core.target.2019-03/tests/org.eclipse.ease.lang.scriptarchive.test/help
17:40:09 [2020-09-26T21:40:09.595Z] [INFO] 
17:40:09 [2020-09-26T21:40:09.595Z] [INFO] --- tycho-compiler-plugin:1.5.0:compile (default-compile) @ org.eclipse.ease.lang.scriptarchive.test ---
17:40:09 [2020-09-26T21:40:09.595Z] [INFO] Compiling 1 source file to /home/jenkins/agent/workspace/ease.verify.core.target.2019-03/tests/org.eclipse.ease.lang.scriptarchive.test/target/classes
17:40:09 [2020-09-26T21:40:09.595Z] [INFO] 
17:40:09 [2020-09-26T21:40:09.595Z] [INFO] --- maven-resources-plugin:2.4.3:testResources (default-testResources) @ org.eclipse.ease.lang.scriptarchive.test ---
17:40:09 [2020-09-26T21:40:09.595Z] [INFO] Using 'UTF-8' encoding to copy filtered resources.
17:40:09 [2020-09-26T21:40:09.595Z] [INFO] skip non existing resourceDirectory /home/jenkins/agent/workspace/ease.verify.core.target.2019-03/tests/org.eclipse.ease.lang.scriptarchive.test/src/test/resources
17:40:09 [2020-09-26T21:40:09.595Z] [INFO] 
17:40:09 [2020-09-26T21:40:09.595Z] [INFO] --- tycho-source-plugin:1.5.0:plugin-source (plugin-source) @ org.eclipse.ease.lang.scriptarchive.test ---
17:40:09 [2020-09-26T21:40:09.595Z] [INFO] Building jar: /home/jenkins/agent/workspace/ease.verify.core.target.2019-03/tests/org.eclipse.ease.lang.scriptarchive.test/target/org.eclipse.ease.lang.scriptarchive.test-0.8.0-SNAPSHOT-sources.jar
17:40:09 [2020-09-26T21:40:09.595Z] [INFO] 
17:40:09 [2020-09-26T21:40:09.595Z] [INFO] --- target-platform-configuration:1.5.0:target-platform (default-target-platform) @ org.eclipse.ease.lang.scriptarchive.test ---
17:40:09 [2020-09-26T21:40:09.595Z] [INFO] 
17:40:09 [2020-09-26T21:40:09.595Z] [INFO] --- tycho-packaging-plugin:1.5.0:package-plugin (default-package-plugin) @ org.eclipse.ease.lang.scriptarchive.test ---
17:40:09 [2020-09-26T21:40:09.595Z] [INFO] Building jar: /home/jenkins/agent/workspace/ease.verify.core.target.2019-03/tests/org.eclipse.ease.lang.scriptarchive.test/target/org.eclipse.ease.lang.scriptarchive.test-0.8.0-SNAPSHOT.jar
17:40:09 [2020-09-26T21:40:09.595Z] [INFO] 
17:40:09 [2020-09-26T21:40:09.595Z] [INFO] --- tycho-p2-plugin:1.5.0:p2-metadata-default (default-p2-metadata-default) @ org.eclipse.ease.lang.scriptarchive.test ---
17:40:09 [2020-09-26T21:40:09.595Z] [INFO] 
17:40:09 [2020-09-26T21:40:09.595Z] [INFO] --- tycho-source-feature-plugin:1.5.0:source-feature (source-feature) @ org.eclipse.ease.lang.scriptarchive.test ---
17:40:09 [2020-09-26T21:40:09.595Z] [INFO] 
17:40:09 [2020-09-26T21:40:09.595Z] [INFO] --- tycho-p2-plugin:1.5.0:p2-metadata (attached-p2-metadata) @ org.eclipse.ease.lang.scriptarchive.test ---
17:40:09 [2020-09-26T21:40:09.595Z] [INFO] 
17:40:09 [2020-09-26T21:40:09.595Z] [INFO] --- tycho-surefire-plugin:1.5.0:test (default-test) @ org.eclipse.ease.lang.scriptarchive.test ---
17:40:09 [2020-09-26T21:40:09.595Z] [INFO] Expected eclipse log file: /home/jenkins/agent/workspace/ease.verify.core.target.2019-03/tests/org.eclipse.ease.lang.scriptarchive.test/target/work/data/.metadata/.log
17:40:09 [2020-09-26T21:40:09.595Z] [INFO] Command line:
17:40:09 [2020-09-26T21:40:09.595Z] 	[/opt/tools/java/openjdk/jdk-11/11.0.2+9/bin/java, -Dosgi.noShutdown=false, -Dosgi.os=linux, -Dosgi.ws=gtk, -Dosgi.arch=x86_64, -Dosgi.clean=true, -jar, /home/jenkins/.m2/repository/p2/osgi/bundle/org.eclipse.equinox.launcher/1.5.800.v20200727-1323/org.eclipse.equinox.launcher-1.5.800.v20200727-1323.jar, -data, /home/jenkins/agent/workspace/ease.verify.core.target.2019-03/tests/org.eclipse.ease.lang.scriptarchive.test/target/work/data, -install, /home/jenkins/agent/workspace/ease.verify.core.target.2019-03/tests/org.eclipse.ease.lang.scriptarchive.test/target/work, -configuration, /home/jenkins/agent/workspace/ease.verify.core.target.2019-03/tests/org.eclipse.ease.lang.scriptarchive.test/target/work/configuration, -application, org.eclipse.tycho.surefire.osgibooter.headlesstest, -testproperties, /home/jenkins/agent/workspace/ease.verify.core.target.2019-03/tests/org.eclipse.ease.lang.scriptarchive.test/target/surefire.properties]
17:40:09 [2020-09-26T21:40:09.595Z] Picked up JAVA_TOOL_OPTIONS: -Dmaven.ext.class.path="/home/jenkins/agent/workspace/ease.verify.core.target.2019-03@tmp/withMavene09eca7f/pipeline-maven-spy.jar" -Dorg.jenkinsci.plugins.pipeline.maven.reportsFolder="/home/jenkins/agent/workspace/ease.verify.core.target.2019-03@tmp/withMavene09eca7f" 
17:40:11 [2020-09-26T21:40:11.515Z] Running org.eclipse.ease.lang.scriptarchive.ArchiveEngineTest
17:40:11 [2020-09-26T21:40:11.515Z] We are running from a zip file!
17:40:11 [2020-09-26T21:40:11.515Z] org.eclipse.ease.ScriptExecutionException: SyntaxError: missing ; before statement (workspace://__EASE_ScriptArchive_1/scripts/Master.js#3)
17:40:11 [2020-09-26T21:40:11.515Z] this is an error
17:40:11 [2020-09-26T21:40:11.515Z]        ^
17:40:11 [2020-09-26T21:40:11.515Z] 	at Master.js,workspace://__EASE_ScriptArchive_1/scripts/Master.js
17:40:11 [2020-09-26T21:40:11.515Z] org.eclipse.ease.ScriptExecutionException: SyntaxError: missing ; before statement (workspace://__EASE_ScriptArchive_1/scripts/Master.js#3)
17:40:11 [2020-09-26T21:40:11.515Z] this is an error
17:40:11 [2020-09-26T21:40:11.515Z]        ^
17:40:11 [2020-09-26T21:40:11.515Z] 	at Master.js,workspace://__EASE_ScriptArchive_1/scripts/Master.js
17:40:11 [2020-09-26T21:40:11.771Z] Tests run: 7, Failures: 0, Errors: 0, Skipped: 0, Time elapsed: 0.492 s - in org.eclipse.ease.lang.scriptarchive.ArchiveEngineTest
17:40:11 [2020-09-26T21:40:11.771Z] executeWithManifest(org.eclipse.ease.lang.scriptarchive.ArchiveEngineTest)  Time elapsed: 0.355 s
17:40:11 [2020-09-26T21:40:11.771Z] zipFileRegistration(org.eclipse.ease.lang.scriptarchive.ArchiveEngineTest)  Time elapsed: 0.006 s
17:40:11 [2020-09-26T21:40:11.771Z] engineIdRegistration(org.eclipse.ease.lang.scriptarchive.ArchiveEngineTest)  Time elapsed: 0 s
17:40:11 [2020-09-26T21:40:11.771Z] jarFileRegistration(org.eclipse.ease.lang.scriptarchive.ArchiveEngineTest)  Time elapsed: 0 s
17:40:11 [2020-09-26T21:40:11.771Z] sarFileRegistration(org.eclipse.ease.lang.scriptarchive.ArchiveEngineTest)  Time elapsed: 0 s
17:40:11 [2020-09-26T21:40:11.771Z] executeWithErrors(org.eclipse.ease.lang.scriptarchive.ArchiveEngineTest)  Time elapsed: 0.04 s
17:40:11 [2020-09-26T21:40:11.771Z] executeWithIncludes(org.eclipse.ease.lang.scriptarchive.ArchiveEngineTest)  Time elapsed: 0.069 s
17:40:11 [2020-09-26T21:40:11.771Z] 
17:40:11 [2020-09-26T21:40:11.771Z] Results:
17:40:11 [2020-09-26T21:40:11.771Z] 
17:40:11 [2020-09-26T21:40:11.771Z] Tests run: 7, Failures: 0, Errors: 0, Skipped: 0
17:40:11 [2020-09-26T21:40:11.771Z] 
17:40:12 [2020-09-26T21:40:12.332Z] [INFO] All tests passed!
17:40:12 [2020-09-26T21:40:12.332Z] [INFO] 
17:40:12 [2020-09-26T21:40:12.332Z] [INFO] --- maven-install-plugin:2.3.1:install (default-install) @ org.eclipse.ease.lang.scriptarchive.test ---
17:40:12 [2020-09-26T21:40:12.332Z] [INFO] Installing /home/jenkins/agent/workspace/ease.verify.core.target.2019-03/tests/org.eclipse.ease.lang.scriptarchive.test/target/org.eclipse.ease.lang.scriptarchive.test-0.8.0-SNAPSHOT.jar to /home/jenkins/.m2/repository/org/eclipse/ease/org.eclipse.ease.lang.scriptarchive.test/0.8.0-SNAPSHOT/org.eclipse.ease.lang.scriptarchive.test-0.8.0-SNAPSHOT.jar
17:40:12 [2020-09-26T21:40:12.332Z] [INFO] Installing /home/jenkins/agent/workspace/ease.verify.core.target.2019-03/tests/org.eclipse.ease.lang.scriptarchive.test/pom.xml to /home/jenkins/.m2/repository/org/eclipse/ease/org.eclipse.ease.lang.scriptarchive.test/0.8.0-SNAPSHOT/org.eclipse.ease.lang.scriptarchive.test-0.8.0-SNAPSHOT.pom
17:40:12 [2020-09-26T21:40:12.332Z] [INFO] Installing /home/jenkins/agent/workspace/ease.verify.core.target.2019-03/tests/org.eclipse.ease.lang.scriptarchive.test/target/org.eclipse.ease.lang.scriptarchive.test-0.8.0-SNAPSHOT-sources.jar to /home/jenkins/.m2/repository/org/eclipse/ease/org.eclipse.ease.lang.scriptarchive.test/0.8.0-SNAPSHOT/org.eclipse.ease.lang.scriptarchive.test-0.8.0-SNAPSHOT-sources.jar
17:40:12 [2020-09-26T21:40:12.332Z] [INFO] Installing /home/jenkins/agent/workspace/ease.verify.core.target.2019-03/tests/org.eclipse.ease.lang.scriptarchive.test/target/p2content.xml to /home/jenkins/.m2/repository/org/eclipse/ease/org.eclipse.ease.lang.scriptarchive.test/0.8.0-SNAPSHOT/org.eclipse.ease.lang.scriptarchive.test-0.8.0-SNAPSHOT-p2metadata.xml
17:40:12 [2020-09-26T21:40:12.332Z] [INFO] Installing /home/jenkins/agent/workspace/ease.verify.core.target.2019-03/tests/org.eclipse.ease.lang.scriptarchive.test/target/p2artifacts.xml to /home/jenkins/.m2/repository/org/eclipse/ease/org.eclipse.ease.lang.scriptarchive.test/0.8.0-SNAPSHOT/org.eclipse.ease.lang.scriptarchive.test-0.8.0-SNAPSHOT-p2artifacts.xml
17:40:12 [2020-09-26T21:40:12.332Z] [INFO] Installing /home/jenkins/agent/workspace/ease.verify.core.target.2019-03/tests/org.eclipse.ease.lang.scriptarchive.test/target/p2content.xml to /home/jenkins/.m2/repository/org/eclipse/ease/org.eclipse.ease.lang.scriptarchive.test/0.8.0-SNAPSHOT/org.eclipse.ease.lang.scriptarchive.test-0.8.0-SNAPSHOT-p2metadata.xml
17:40:12 [2020-09-26T21:40:12.332Z] [INFO] Installing /home/jenkins/agent/workspace/ease.verify.core.target.2019-03/tests/org.eclipse.ease.lang.scriptarchive.test/target/p2artifacts.xml to /home/jenkins/.m2/repository/org/eclipse/ease/org.eclipse.ease.lang.scriptarchive.test/0.8.0-SNAPSHOT/org.eclipse.ease.lang.scriptarchive.test-0.8.0-SNAPSHOT-p2artifacts.xml
17:40:12 [2020-09-26T21:40:12.332Z] [INFO] 
17:40:12 [2020-09-26T21:40:12.332Z] [INFO] --- tycho-p2-plugin:1.5.0:update-local-index (default-update-local-index) @ org.eclipse.ease.lang.scriptarchive.test ---
17:40:12 [2020-09-26T21:40:12.332Z] [INFO] 
17:40:12 [2020-09-26T21:40:12.332Z] [INFO] --------< org.eclipse.ease:org.eclipse.ease.lang.unittest.test >--------
17:40:12 [2020-09-26T21:40:12.332Z] [INFO] Building org.eclipse.ease.lang.unittest.test 0.8.0-SNAPSHOT      [45/48]
17:40:12 [2020-09-26T21:40:12.332Z] [INFO] ------------------------[ eclipse-test-plugin ]-------------------------
17:40:12 [2020-09-26T21:40:12.332Z] [INFO] 
17:40:12 [2020-09-26T21:40:12.332Z] [INFO] --- maven-clean-plugin:2.5:clean (default-clean) @ org.eclipse.ease.lang.unittest.test ---
17:40:12 [2020-09-26T21:40:12.333Z] [INFO] 
17:40:12 [2020-09-26T21:40:12.333Z] [INFO] --- tycho-packaging-plugin:1.5.0:build-qualifier (default-build-qualifier) @ org.eclipse.ease.lang.unittest.test ---
17:40:12 [2020-09-26T21:40:12.333Z] [INFO] The project's OSGi version is 0.8.0.I202009240747
17:40:12 [2020-09-26T21:40:12.333Z] [INFO] 
17:40:12 [2020-09-26T21:40:12.333Z] [INFO] --- tycho-packaging-plugin:1.5.0:validate-id (default-validate-id) @ org.eclipse.ease.lang.unittest.test ---
17:40:12 [2020-09-26T21:40:12.333Z] [INFO] 
17:40:12 [2020-09-26T21:40:12.333Z] [INFO] --- tycho-packaging-plugin:1.5.0:validate-version (default-validate-version) @ org.eclipse.ease.lang.unittest.test ---
17:40:12 [2020-09-26T21:40:12.333Z] [INFO] 
17:40:12 [2020-09-26T21:40:12.333Z] [INFO] >>> maven-javadoc-plugin:2.9.1:javadoc (build-docs) > generate-sources @ org.eclipse.ease.lang.unittest.test >>>
17:40:12 [2020-09-26T21:40:12.333Z] [INFO] 
17:40:12 [2020-09-26T21:40:12.333Z] [INFO] --- tycho-packaging-plugin:1.5.0:build-qualifier (default-build-qualifier) @ org.eclipse.ease.lang.unittest.test ---
17:40:12 [2020-09-26T21:40:12.333Z] [INFO] The project's OSGi version is 0.8.0.I202009240747
17:40:12 [2020-09-26T21:40:12.333Z] [INFO] 
17:40:12 [2020-09-26T21:40:12.333Z] [INFO] --- tycho-packaging-plugin:1.5.0:validate-id (default-validate-id) @ org.eclipse.ease.lang.unittest.test ---
17:40:12 [2020-09-26T21:40:12.333Z] [INFO] 
17:40:12 [2020-09-26T21:40:12.333Z] [INFO] --- tycho-packaging-plugin:1.5.0:validate-version (default-validate-version) @ org.eclipse.ease.lang.unittest.test ---
17:40:12 [2020-09-26T21:40:12.333Z] [INFO] 
17:40:12 [2020-09-26T21:40:12.333Z] [INFO] <<< maven-javadoc-plugin:2.9.1:javadoc (build-docs) < generate-sources @ org.eclipse.ease.lang.unittest.test <<<
17:40:12 [2020-09-26T21:40:12.333Z] [INFO] 
17:40:12 [2020-09-26T21:40:12.333Z] [INFO] 
17:40:12 [2020-09-26T21:40:12.333Z] [INFO] --- maven-javadoc-plugin:2.9.1:javadoc (build-docs) @ org.eclipse.ease.lang.unittest.test ---
17:40:12 [2020-09-26T21:40:12.588Z] [ERROR] Error fetching link: http://help.eclipse.org/oxygen/topic/org.eclipse.platform.doc.isv/reference/api/package-list. Ignored it.
17:40:12 [2020-09-26T21:40:12.844Z] [ERROR] Error fetching link: https://ci.eclipse.org/ease/job/ease.build.core/JavaDoc/package-list. Ignored it.
17:40:13 [2020-09-26T21:40:13.791Z] [INFO] 
17:40:13 [2020-09-26T21:40:13.791Z] Loading source files for package org.eclipse.ease.lang.unittest...
17:40:13 [2020-09-26T21:40:13.791Z] Constructing Javadoc information...
17:40:13 [2020-09-26T21:40:13.791Z] WARNING: Cannot open location "/home/jenkins/agent/workspace/ease.verify.core.target.2019-03/tests/org.eclipse.ease.lang.unittest.test/target/javadoc-bundle-options/package-list"
17:40:13 [2020-09-26T21:40:13.791Z] No plugin definition found, skipping
17:40:13 [2020-09-26T21:40:13.791Z] No plugin definition found, skipping
17:40:13 [2020-09-26T21:40:13.791Z] [WARNING] Javadoc Warnings
17:40:13 [2020-09-26T21:40:13.791Z] [WARNING] Picked up JAVA_TOOL_OPTIONS: -Dmaven.ext.class.path="/home/jenkins/agent/workspace/ease.verify.core.target.2019-03@tmp/withMavene09eca7f/pipeline-maven-spy.jar" -Dorg.jenkinsci.plugins.pipeline.maven.reportsFolder="/home/jenkins/agent/workspace/ease.verify.core.target.2019-03@tmp/withMavene09eca7f"
17:40:13 [2020-09-26T21:40:13.791Z] [WARNING] javadoc: warning - The old Doclet and Taglet APIs in the packages
17:40:13 [2020-09-26T21:40:13.791Z] [WARNING] com.sun.javadoc, com.sun.tools.doclets and their implementations
17:40:13 [2020-09-26T21:40:13.791Z] [WARNING] are planned to be removed in a future JDK release. These
17:40:13 [2020-09-26T21:40:13.791Z] [WARNING] components have been superseded by the new APIs in jdk.javadoc.doclet.
17:40:13 [2020-09-26T21:40:13.791Z] [WARNING] Users are strongly recommended to migrate to the new APIs.
17:40:13 [2020-09-26T21:40:13.791Z] [INFO] 
17:40:13 [2020-09-26T21:40:13.791Z] [INFO] --- build-helper-maven-plugin:1.9.1:add-resource (add_help) @ org.eclipse.ease.lang.unittest.test ---
17:40:13 [2020-09-26T21:40:13.791Z] [INFO] 
17:40:13 [2020-09-26T21:40:13.791Z] [INFO] --- maven-resources-plugin:2.4.3:resources (default-resources) @ org.eclipse.ease.lang.unittest.test ---
17:40:13 [2020-09-26T21:40:13.791Z] [INFO] Using 'UTF-8' encoding to copy filtered resources.
17:40:13 [2020-09-26T21:40:13.791Z] [INFO] skip non existing resourceDirectory /home/jenkins/agent/workspace/ease.verify.core.target.2019-03/tests/org.eclipse.ease.lang.unittest.test/src/main/resources
17:40:13 [2020-09-26T21:40:13.791Z] [INFO] skip non existing resourceDirectory /home/jenkins/agent/workspace/ease.verify.core.target.2019-03/tests/org.eclipse.ease.lang.unittest.test/help
17:40:13 [2020-09-26T21:40:13.791Z] [INFO] 
17:40:13 [2020-09-26T21:40:13.791Z] [INFO] --- tycho-compiler-plugin:1.5.0:compile (default-compile) @ org.eclipse.ease.lang.unittest.test ---
17:40:13 [2020-09-26T21:40:13.791Z] [INFO] Compiling 3 source files to /home/jenkins/agent/workspace/ease.verify.core.target.2019-03/tests/org.eclipse.ease.lang.unittest.test/target/classes
17:40:13 [2020-09-26T21:40:13.791Z] [INFO] 
17:40:13 [2020-09-26T21:40:13.791Z] [INFO] --- maven-resources-plugin:2.4.3:testResources (default-testResources) @ org.eclipse.ease.lang.unittest.test ---
17:40:13 [2020-09-26T21:40:13.791Z] [INFO] Using 'UTF-8' encoding to copy filtered resources.
17:40:13 [2020-09-26T21:40:13.791Z] [INFO] skip non existing resourceDirectory /home/jenkins/agent/workspace/ease.verify.core.target.2019-03/tests/org.eclipse.ease.lang.unittest.test/src/test/resources
17:40:13 [2020-09-26T21:40:13.791Z] [INFO] 
17:40:13 [2020-09-26T21:40:13.791Z] [INFO] --- tycho-source-plugin:1.5.0:plugin-source (plugin-source) @ org.eclipse.ease.lang.unittest.test ---
17:40:13 [2020-09-26T21:40:13.791Z] [WARNING] Bundle-Name header not found in /home/jenkins/agent/workspace/ease.verify.core.target.2019-03/tests/org.eclipse.ease.lang.unittest.test/META-INF/MANIFEST.MF, fallback to Bundle-SymbolicName for source bundle
17:40:13 [2020-09-26T21:40:13.791Z] [WARNING] Bundle-Vendor header not found in /home/jenkins/agent/workspace/ease.verify.core.target.2019-03/tests/org.eclipse.ease.lang.unittest.test/META-INF/MANIFEST.MF, fallback to 'unknown' for source bundle
17:40:13 [2020-09-26T21:40:13.791Z] [INFO] Building jar: /home/jenkins/agent/workspace/ease.verify.core.target.2019-03/tests/org.eclipse.ease.lang.unittest.test/target/org.eclipse.ease.lang.unittest.test-0.8.0-SNAPSHOT-sources.jar
17:40:13 [2020-09-26T21:40:13.791Z] [INFO] 
17:40:13 [2020-09-26T21:40:13.791Z] [INFO] --- target-platform-configuration:1.5.0:target-platform (default-target-platform) @ org.eclipse.ease.lang.unittest.test ---
17:40:13 [2020-09-26T21:40:13.792Z] [INFO] 
17:40:13 [2020-09-26T21:40:13.792Z] [INFO] --- tycho-packaging-plugin:1.5.0:package-plugin (default-package-plugin) @ org.eclipse.ease.lang.unittest.test ---
17:40:13 [2020-09-26T21:40:13.792Z] [INFO] Building jar: /home/jenkins/agent/workspace/ease.verify.core.target.2019-03/tests/org.eclipse.ease.lang.unittest.test/target/org.eclipse.ease.lang.unittest.test-0.8.0-SNAPSHOT.jar
17:40:13 [2020-09-26T21:40:13.792Z] [INFO] 
17:40:13 [2020-09-26T21:40:13.792Z] [INFO] --- tycho-p2-plugin:1.5.0:p2-metadata-default (default-p2-metadata-default) @ org.eclipse.ease.lang.unittest.test ---
17:40:13 [2020-09-26T21:40:13.792Z] [INFO] 
17:40:13 [2020-09-26T21:40:13.792Z] [INFO] --- tycho-source-feature-plugin:1.5.0:source-feature (source-feature) @ org.eclipse.ease.lang.unittest.test ---
17:40:13 [2020-09-26T21:40:13.792Z] [INFO] 
17:40:13 [2020-09-26T21:40:13.792Z] [INFO] --- tycho-p2-plugin:1.5.0:p2-metadata (attached-p2-metadata) @ org.eclipse.ease.lang.unittest.test ---
17:40:13 [2020-09-26T21:40:13.792Z] [INFO] 
17:40:13 [2020-09-26T21:40:13.792Z] [INFO] --- tycho-surefire-plugin:1.5.0:test (default-test) @ org.eclipse.ease.lang.unittest.test ---
17:40:14 [2020-09-26T21:40:14.047Z] [INFO] Expected eclipse log file: /home/jenkins/agent/workspace/ease.verify.core.target.2019-03/tests/org.eclipse.ease.lang.unittest.test/target/work/data/.metadata/.log
17:40:14 [2020-09-26T21:40:14.047Z] [INFO] Command line:
17:40:14 [2020-09-26T21:40:14.047Z] 	[/opt/tools/java/openjdk/jdk-11/11.0.2+9/bin/java, -Dosgi.noShutdown=false, -Dosgi.os=linux, -Dosgi.ws=gtk, -Dosgi.arch=x86_64, -Dosgi.clean=true, -jar, /home/jenkins/.m2/repository/p2/osgi/bundle/org.eclipse.equinox.launcher/1.5.800.v20200727-1323/org.eclipse.equinox.launcher-1.5.800.v20200727-1323.jar, -data, /home/jenkins/agent/workspace/ease.verify.core.target.2019-03/tests/org.eclipse.ease.lang.unittest.test/target/work/data, -install, /home/jenkins/agent/workspace/ease.verify.core.target.2019-03/tests/org.eclipse.ease.lang.unittest.test/target/work, -configuration, /home/jenkins/agent/workspace/ease.verify.core.target.2019-03/tests/org.eclipse.ease.lang.unittest.test/target/work/configuration, -application, org.eclipse.tycho.surefire.osgibooter.headlesstest, -testproperties, /home/jenkins/agent/workspace/ease.verify.core.target.2019-03/tests/org.eclipse.ease.lang.unittest.test/target/surefire.properties]
17:40:14 [2020-09-26T21:40:14.047Z] Picked up JAVA_TOOL_OPTIONS: -Dmaven.ext.class.path="/home/jenkins/agent/workspace/ease.verify.core.target.2019-03@tmp/withMavene09eca7f/pipeline-maven-spy.jar" -Dorg.jenkinsci.plugins.pipeline.maven.reportsFolder="/home/jenkins/agent/workspace/ease.verify.core.target.2019-03@tmp/withMavene09eca7f" 
17:40:15 [2020-09-26T21:40:15.949Z] Running org.eclipse.ease.lang.unittest.ClassicJavaScriptTest
17:40:17 [2020-09-26T21:40:17.330Z] Tests run: 7, Failures: 0, Errors: 0, Skipped: 0, Time elapsed: 1.4 s - in org.eclipse.ease.lang.unittest.ClassicJavaScriptTest
17:40:17 [2020-09-26T21:40:17.330Z] folderStatus(org.eclipse.ease.lang.unittest.ClassicJavaScriptTest)  Time elapsed: 0.589 s
17:40:17 [2020-09-26T21:40:17.330Z] errorTestStatus(org.eclipse.ease.lang.unittest.ClassicJavaScriptTest)  Time elapsed: 0.193 s
17:40:17 [2020-09-26T21:40:17.330Z] failureTestStatus(org.eclipse.ease.lang.unittest.ClassicJavaScriptTest)  Time elapsed: 0.123 s
17:40:17 [2020-09-26T21:40:17.330Z] verifyOutput(org.eclipse.ease.lang.unittest.ClassicJavaScriptTest)  Time elapsed: 0.111 s
17:40:17 [2020-09-26T21:40:17.330Z] suiteStatus(org.eclipse.ease.lang.unittest.ClassicJavaScriptTest)  Time elapsed: 0.112 s
17:40:17 [2020-09-26T21:40:17.330Z] ignoreTestStatus(org.eclipse.ease.lang.unittest.ClassicJavaScriptTest)  Time elapsed: 0.098 s
17:40:17 [2020-09-26T21:40:17.330Z] passTestStatus(org.eclipse.ease.lang.unittest.ClassicJavaScriptTest)  Time elapsed: 0.1 s
17:40:17 [2020-09-26T21:40:17.330Z] Running org.eclipse.ease.lang.unittest.ModernJavaScriptTest
17:40:17 [2020-09-26T21:40:17.895Z] Tests run: 8, Failures: 0, Errors: 0, Skipped: 0, Time elapsed: 0.745 s - in org.eclipse.ease.lang.unittest.ModernJavaScriptTest
17:40:17 [2020-09-26T21:40:17.895Z] folderStatus(org.eclipse.ease.lang.unittest.ModernJavaScriptTest)  Time elapsed: 0.116 s
17:40:17 [2020-09-26T21:40:17.895Z] verifyOutput(org.eclipse.ease.lang.unittest.ModernJavaScriptTest)  Time elapsed: 0.097 s
17:40:17 [2020-09-26T21:40:17.895Z] suiteStatus(org.eclipse.ease.lang.unittest.ModernJavaScriptTest)  Time elapsed: 0.101 s
17:40:17 [2020-09-26T21:40:17.895Z] ignoreTestStatus(org.eclipse.ease.lang.unittest.ModernJavaScriptTest)  Time elapsed: 0.097 s
17:40:17 [2020-09-26T21:40:17.895Z] ignoreTestClassStatus(org.eclipse.ease.lang.unittest.ModernJavaScriptTest)  Time elapsed: 0.096 s
17:40:17 [2020-09-26T21:40:17.895Z] failureTestClassStatus(org.eclipse.ease.lang.unittest.ModernJavaScriptTest)  Time elapsed: 0.094 s
17:40:17 [2020-09-26T21:40:17.895Z] errorTestClassStatus(org.eclipse.ease.lang.unittest.ModernJavaScriptTest)  Time elapsed: 0.06 s
17:40:17 [2020-09-26T21:40:17.895Z] passTestClassStatus(org.eclipse.ease.lang.unittest.ModernJavaScriptTest)  Time elapsed: 0.082 s
17:40:17 [2020-09-26T21:40:17.895Z] 
17:40:17 [2020-09-26T21:40:17.895Z] Results:
17:40:17 [2020-09-26T21:40:17.895Z] 
17:40:17 [2020-09-26T21:40:17.895Z] Tests run: 15, Failures: 0, Errors: 0, Skipped: 0
17:40:17 [2020-09-26T21:40:17.895Z] 
17:40:18 [2020-09-26T21:40:18.457Z] [INFO] All tests passed!
17:40:18 [2020-09-26T21:40:18.457Z] [INFO] 
17:40:18 [2020-09-26T21:40:18.457Z] [INFO] --- maven-install-plugin:2.3.1:install (default-install) @ org.eclipse.ease.lang.unittest.test ---
17:40:18 [2020-09-26T21:40:18.457Z] [INFO] Installing /home/jenkins/agent/workspace/ease.verify.core.target.2019-03/tests/org.eclipse.ease.lang.unittest.test/target/org.eclipse.ease.lang.unittest.test-0.8.0-SNAPSHOT.jar to /home/jenkins/.m2/repository/org/eclipse/ease/org.eclipse.ease.lang.unittest.test/0.8.0-SNAPSHOT/org.eclipse.ease.lang.unittest.test-0.8.0-SNAPSHOT.jar
17:40:18 [2020-09-26T21:40:18.457Z] [INFO] Installing /home/jenkins/agent/workspace/ease.verify.core.target.2019-03/tests/org.eclipse.ease.lang.unittest.test/pom.xml to /home/jenkins/.m2/repository/org/eclipse/ease/org.eclipse.ease.lang.unittest.test/0.8.0-SNAPSHOT/org.eclipse.ease.lang.unittest.test-0.8.0-SNAPSHOT.pom
17:40:18 [2020-09-26T21:40:18.457Z] [INFO] Installing /home/jenkins/agent/workspace/ease.verify.core.target.2019-03/tests/org.eclipse.ease.lang.unittest.test/target/org.eclipse.ease.lang.unittest.test-0.8.0-SNAPSHOT-sources.jar to /home/jenkins/.m2/repository/org/eclipse/ease/org.eclipse.ease.lang.unittest.test/0.8.0-SNAPSHOT/org.eclipse.ease.lang.unittest.test-0.8.0-SNAPSHOT-sources.jar
17:40:18 [2020-09-26T21:40:18.457Z] [INFO] Installing /home/jenkins/agent/workspace/ease.verify.core.target.2019-03/tests/org.eclipse.ease.lang.unittest.test/target/p2content.xml to /home/jenkins/.m2/repository/org/eclipse/ease/org.eclipse.ease.lang.unittest.test/0.8.0-SNAPSHOT/org.eclipse.ease.lang.unittest.test-0.8.0-SNAPSHOT-p2metadata.xml
17:40:18 [2020-09-26T21:40:18.457Z] [INFO] Installing /home/jenkins/agent/workspace/ease.verify.core.target.2019-03/tests/org.eclipse.ease.lang.unittest.test/target/p2artifacts.xml to /home/jenkins/.m2/repository/org/eclipse/ease/org.eclipse.ease.lang.unittest.test/0.8.0-SNAPSHOT/org.eclipse.ease.lang.unittest.test-0.8.0-SNAPSHOT-p2artifacts.xml
17:40:18 [2020-09-26T21:40:18.457Z] [INFO] Installing /home/jenkins/agent/workspace/ease.verify.core.target.2019-03/tests/org.eclipse.ease.lang.unittest.test/target/p2content.xml to /home/jenkins/.m2/repository/org/eclipse/ease/org.eclipse.ease.lang.unittest.test/0.8.0-SNAPSHOT/org.eclipse.ease.lang.unittest.test-0.8.0-SNAPSHOT-p2metadata.xml
17:40:18 [2020-09-26T21:40:18.457Z] [INFO] Installing /home/jenkins/agent/workspace/ease.verify.core.target.2019-03/tests/org.eclipse.ease.lang.unittest.test/target/p2artifacts.xml to /home/jenkins/.m2/repository/org/eclipse/ease/org.eclipse.ease.lang.unittest.test/0.8.0-SNAPSHOT/org.eclipse.ease.lang.unittest.test-0.8.0-SNAPSHOT-p2artifacts.xml
17:40:18 [2020-09-26T21:40:18.457Z] [INFO] 
17:40:18 [2020-09-26T21:40:18.457Z] [INFO] --- tycho-p2-plugin:1.5.0:update-local-index (default-update-local-index) @ org.eclipse.ease.lang.unittest.test ---
17:40:18 [2020-09-26T21:40:18.457Z] [INFO] 
17:40:18 [2020-09-26T21:40:18.457Z] [INFO] ---------< org.eclipse.ease:org.eclipse.ease.ui.scripts.test >----------
17:40:18 [2020-09-26T21:40:18.457Z] [INFO] Building org.eclipse.ease.ui.scripts.test 0.8.0-SNAPSHOT         [46/48]
17:40:18 [2020-09-26T21:40:18.457Z] [INFO] ------------------------[ eclipse-test-plugin ]-------------------------
17:40:18 [2020-09-26T21:40:18.457Z] [INFO] 
17:40:18 [2020-09-26T21:40:18.457Z] [INFO] --- maven-clean-plugin:2.5:clean (default-clean) @ org.eclipse.ease.ui.scripts.test ---
17:40:18 [2020-09-26T21:40:18.457Z] [INFO] 
17:40:18 [2020-09-26T21:40:18.457Z] [INFO] --- tycho-packaging-plugin:1.5.0:build-qualifier (default-build-qualifier) @ org.eclipse.ease.ui.scripts.test ---
17:40:18 [2020-09-26T21:40:18.457Z] [INFO] The project's OSGi version is 0.8.0.I202009240747
17:40:18 [2020-09-26T21:40:18.457Z] [INFO] 
17:40:18 [2020-09-26T21:40:18.457Z] [INFO] --- tycho-packaging-plugin:1.5.0:validate-id (default-validate-id) @ org.eclipse.ease.ui.scripts.test ---
17:40:18 [2020-09-26T21:40:18.457Z] [INFO] 
17:40:18 [2020-09-26T21:40:18.457Z] [INFO] --- tycho-packaging-plugin:1.5.0:validate-version (default-validate-version) @ org.eclipse.ease.ui.scripts.test ---
17:40:18 [2020-09-26T21:40:18.457Z] [INFO] 
17:40:18 [2020-09-26T21:40:18.457Z] [INFO] >>> maven-javadoc-plugin:2.9.1:javadoc (build-docs) > generate-sources @ org.eclipse.ease.ui.scripts.test >>>
17:40:18 [2020-09-26T21:40:18.457Z] [INFO] 
17:40:18 [2020-09-26T21:40:18.457Z] [INFO] --- tycho-packaging-plugin:1.5.0:build-qualifier (default-build-qualifier) @ org.eclipse.ease.ui.scripts.test ---
17:40:18 [2020-09-26T21:40:18.457Z] [INFO] The project's OSGi version is 0.8.0.I202009240747
17:40:18 [2020-09-26T21:40:18.457Z] [INFO] 
17:40:18 [2020-09-26T21:40:18.457Z] [INFO] --- tycho-packaging-plugin:1.5.0:validate-id (default-validate-id) @ org.eclipse.ease.ui.scripts.test ---
17:40:18 [2020-09-26T21:40:18.457Z] [INFO] 
17:40:18 [2020-09-26T21:40:18.457Z] [INFO] --- tycho-packaging-plugin:1.5.0:validate-version (default-validate-version) @ org.eclipse.ease.ui.scripts.test ---
17:40:18 [2020-09-26T21:40:18.457Z] [INFO] 
17:40:18 [2020-09-26T21:40:18.457Z] [INFO] <<< maven-javadoc-plugin:2.9.1:javadoc (build-docs) < generate-sources @ org.eclipse.ease.ui.scripts.test <<<
17:40:18 [2020-09-26T21:40:18.457Z] [INFO] 
17:40:18 [2020-09-26T21:40:18.457Z] [INFO] 
17:40:18 [2020-09-26T21:40:18.457Z] [INFO] --- maven-javadoc-plugin:2.9.1:javadoc (build-docs) @ org.eclipse.ease.ui.scripts.test ---
17:40:18 [2020-09-26T21:40:18.713Z] [ERROR] Error fetching link: http://help.eclipse.org/oxygen/topic/org.eclipse.platform.doc.isv/reference/api/package-list. Ignored it.
17:40:18 [2020-09-26T21:40:18.713Z] [ERROR] Error fetching link: https://ci.eclipse.org/ease/job/ease.build.core/JavaDoc/package-list. Ignored it.
17:40:19 [2020-09-26T21:40:19.690Z] [INFO] 
17:40:19 [2020-09-26T21:40:19.690Z] Loading source files for package org.eclipse.ease.ui.scripts.expressions.definitions...
17:40:19 [2020-09-26T21:40:19.690Z] Constructing Javadoc information...
17:40:19 [2020-09-26T21:40:19.690Z] WARNING: Cannot open location "/home/jenkins/agent/workspace/ease.verify.core.target.2019-03/tests/org.eclipse.ease.ui.scripts.test/target/javadoc-bundle-options/package-list"
17:40:19 [2020-09-26T21:40:19.690Z] No plugin definition found, skipping
17:40:19 [2020-09-26T21:40:19.690Z] No plugin definition found, skipping
17:40:19 [2020-09-26T21:40:19.690Z] [WARNING] Javadoc Warnings
17:40:19 [2020-09-26T21:40:19.690Z] [WARNING] Picked up JAVA_TOOL_OPTIONS: -Dmaven.ext.class.path="/home/jenkins/agent/workspace/ease.verify.core.target.2019-03@tmp/withMavene09eca7f/pipeline-maven-spy.jar" -Dorg.jenkinsci.plugins.pipeline.maven.reportsFolder="/home/jenkins/agent/workspace/ease.verify.core.target.2019-03@tmp/withMavene09eca7f"
17:40:19 [2020-09-26T21:40:19.690Z] [WARNING] javadoc: warning - The old Doclet and Taglet APIs in the packages
17:40:19 [2020-09-26T21:40:19.690Z] [WARNING] com.sun.javadoc, com.sun.tools.doclets and their implementations
17:40:19 [2020-09-26T21:40:19.690Z] [WARNING] are planned to be removed in a future JDK release. These
17:40:19 [2020-09-26T21:40:19.690Z] [WARNING] components have been superseded by the new APIs in jdk.javadoc.doclet.
17:40:19 [2020-09-26T21:40:19.690Z] [WARNING] Users are strongly recommended to migrate to the new APIs.
17:40:19 [2020-09-26T21:40:19.690Z] [INFO] 
17:40:19 [2020-09-26T21:40:19.690Z] [INFO] --- build-helper-maven-plugin:1.9.1:add-resource (add_help) @ org.eclipse.ease.ui.scripts.test ---
17:40:19 [2020-09-26T21:40:19.690Z] [INFO] 
17:40:19 [2020-09-26T21:40:19.690Z] [INFO] --- maven-resources-plugin:2.4.3:resources (default-resources) @ org.eclipse.ease.ui.scripts.test ---
17:40:19 [2020-09-26T21:40:19.691Z] [INFO] Using 'UTF-8' encoding to copy filtered resources.
17:40:19 [2020-09-26T21:40:19.691Z] [INFO] skip non existing resourceDirectory /home/jenkins/agent/workspace/ease.verify.core.target.2019-03/tests/org.eclipse.ease.ui.scripts.test/src/main/resources
17:40:19 [2020-09-26T21:40:19.691Z] [INFO] skip non existing resourceDirectory /home/jenkins/agent/workspace/ease.verify.core.target.2019-03/tests/org.eclipse.ease.ui.scripts.test/help
17:40:19 [2020-09-26T21:40:19.691Z] [INFO] 
17:40:19 [2020-09-26T21:40:19.691Z] [INFO] --- tycho-compiler-plugin:1.5.0:compile (default-compile) @ org.eclipse.ease.ui.scripts.test ---
17:40:19 [2020-09-26T21:40:19.691Z] [INFO] Compiling 1 source file to /home/jenkins/agent/workspace/ease.verify.core.target.2019-03/tests/org.eclipse.ease.ui.scripts.test/target/classes
17:40:19 [2020-09-26T21:40:19.691Z] [INFO] 
17:40:19 [2020-09-26T21:40:19.691Z] [INFO] --- maven-resources-plugin:2.4.3:testResources (default-testResources) @ org.eclipse.ease.ui.scripts.test ---
17:40:19 [2020-09-26T21:40:19.691Z] [INFO] Using 'UTF-8' encoding to copy filtered resources.
17:40:19 [2020-09-26T21:40:19.691Z] [INFO] skip non existing resourceDirectory /home/jenkins/agent/workspace/ease.verify.core.target.2019-03/tests/org.eclipse.ease.ui.scripts.test/src/test/resources
17:40:19 [2020-09-26T21:40:19.691Z] [INFO] 
17:40:19 [2020-09-26T21:40:19.691Z] [INFO] --- tycho-source-plugin:1.5.0:plugin-source (plugin-source) @ org.eclipse.ease.ui.scripts.test ---
17:40:19 [2020-09-26T21:40:19.691Z] [INFO] Building jar: /home/jenkins/agent/workspace/ease.verify.core.target.2019-03/tests/org.eclipse.ease.ui.scripts.test/target/org.eclipse.ease.ui.scripts.test-0.8.0-SNAPSHOT-sources.jar
17:40:19 [2020-09-26T21:40:19.691Z] [INFO] 
17:40:19 [2020-09-26T21:40:19.691Z] [INFO] --- target-platform-configuration:1.5.0:target-platform (default-target-platform) @ org.eclipse.ease.ui.scripts.test ---
17:40:19 [2020-09-26T21:40:19.691Z] [INFO] 
17:40:19 [2020-09-26T21:40:19.691Z] [INFO] --- tycho-packaging-plugin:1.5.0:package-plugin (default-package-plugin) @ org.eclipse.ease.ui.scripts.test ---
17:40:19 [2020-09-26T21:40:19.691Z] [INFO] Building jar: /home/jenkins/agent/workspace/ease.verify.core.target.2019-03/tests/org.eclipse.ease.ui.scripts.test/target/org.eclipse.ease.ui.scripts.test-0.8.0-SNAPSHOT.jar
17:40:19 [2020-09-26T21:40:19.691Z] [INFO] 
17:40:19 [2020-09-26T21:40:19.691Z] [INFO] --- tycho-p2-plugin:1.5.0:p2-metadata-default (default-p2-metadata-default) @ org.eclipse.ease.ui.scripts.test ---
17:40:19 [2020-09-26T21:40:19.691Z] [INFO] 
17:40:19 [2020-09-26T21:40:19.691Z] [INFO] --- tycho-source-feature-plugin:1.5.0:source-feature (source-feature) @ org.eclipse.ease.ui.scripts.test ---
17:40:19 [2020-09-26T21:40:19.691Z] [INFO] 
17:40:19 [2020-09-26T21:40:19.691Z] [INFO] --- tycho-p2-plugin:1.5.0:p2-metadata (attached-p2-metadata) @ org.eclipse.ease.ui.scripts.test ---
17:40:19 [2020-09-26T21:40:19.691Z] [INFO] 
17:40:19 [2020-09-26T21:40:19.691Z] [INFO] --- tycho-surefire-plugin:1.5.0:test (default-test) @ org.eclipse.ease.ui.scripts.test ---
17:40:19 [2020-09-26T21:40:19.691Z] [INFO] Expected eclipse log file: /home/jenkins/agent/workspace/ease.verify.core.target.2019-03/tests/org.eclipse.ease.ui.scripts.test/target/work/data/.metadata/.log
17:40:19 [2020-09-26T21:40:19.691Z] [INFO] Command line:
17:40:19 [2020-09-26T21:40:19.691Z] 	[/opt/tools/java/openjdk/jdk-11/11.0.2+9/bin/java, -Dosgi.noShutdown=false, -Dosgi.os=linux, -Dosgi.ws=gtk, -Dosgi.arch=x86_64, -Dosgi.clean=true, -jar, /home/jenkins/.m2/repository/p2/osgi/bundle/org.eclipse.equinox.launcher/1.5.800.v20200727-1323/org.eclipse.equinox.launcher-1.5.800.v20200727-1323.jar, -data, /home/jenkins/agent/workspace/ease.verify.core.target.2019-03/tests/org.eclipse.ease.ui.scripts.test/target/work/data, -install, /home/jenkins/agent/workspace/ease.verify.core.target.2019-03/tests/org.eclipse.ease.ui.scripts.test/target/work, -configuration, /home/jenkins/agent/workspace/ease.verify.core.target.2019-03/tests/org.eclipse.ease.ui.scripts.test/target/work/configuration, -application, org.eclipse.tycho.surefire.osgibooter.headlesstest, -testproperties, /home/jenkins/agent/workspace/ease.verify.core.target.2019-03/tests/org.eclipse.ease.ui.scripts.test/target/surefire.properties]
17:40:19 [2020-09-26T21:40:19.691Z] Picked up JAVA_TOOL_OPTIONS: -Dmaven.ext.class.path="/home/jenkins/agent/workspace/ease.verify.core.target.2019-03@tmp/withMavene09eca7f/pipeline-maven-spy.jar" -Dorg.jenkinsci.plugins.pipeline.maven.reportsFolder="/home/jenkins/agent/workspace/ease.verify.core.target.2019-03@tmp/withMavene09eca7f" 
17:40:21 [2020-09-26T21:40:21.653Z] Running org.eclipse.ease.ui.scripts.expressions.definitions.ExpressionFactoryTest
17:40:21 [2020-09-26T21:40:21.653Z] Tests run: 14, Failures: 0, Errors: 0, Skipped: 0, Time elapsed: 0.046 s - in org.eclipse.ease.ui.scripts.expressions.definitions.ExpressionFactoryTest
17:40:21 [2020-09-26T21:40:21.653Z] loadClassWithExpression  Time elapsed: 0.032 s
17:40:21 [2020-09-26T21:40:21.653Z] createWithExpression  Time elapsed: 0 s
17:40:21 [2020-09-26T21:40:21.653Z] createReferenceExpression  Time elapsed: 0 s
17:40:21 [2020-09-26T21:40:21.653Z] loadClassReferenceExpression  Time elapsed: 0 s
17:40:21 [2020-09-26T21:40:21.653Z] loadClassTestExpression  Time elapsed: 0.001 s
17:40:21 [2020-09-26T21:40:21.653Z] createEqualsExpression  Time elapsed: 0.001 s
17:40:21 [2020-09-26T21:40:21.653Z] loadClassCountExpression  Time elapsed: 0 s
17:40:21 [2020-09-26T21:40:21.653Z] loadClassOrExpression  Time elapsed: 0 s
17:40:21 [2020-09-26T21:40:21.653Z] createTestExpression  Time elapsed: 0.002 s
17:40:21 [2020-09-26T21:40:21.653Z] createOrExpression  Time elapsed: 0.001 s
17:40:21 [2020-09-26T21:40:21.653Z] loadClassAndExpression  Time elapsed: 0 s
17:40:21 [2020-09-26T21:40:21.653Z] createAndExpression  Time elapsed: 0 s
17:40:21 [2020-09-26T21:40:21.653Z] loadClassEqualsExpression  Time elapsed: 0.001 s
17:40:21 [2020-09-26T21:40:21.653Z] createCountExpression  Time elapsed: 0.001 s
17:40:21 [2020-09-26T21:40:21.653Z] 
17:40:21 [2020-09-26T21:40:21.653Z] Results:
17:40:21 [2020-09-26T21:40:21.653Z] 
17:40:21 [2020-09-26T21:40:21.653Z] Tests run: 14, Failures: 0, Errors: 0, Skipped: 0
17:40:21 [2020-09-26T21:40:21.653Z] 
17:40:22 [2020-09-26T21:40:22.215Z] [INFO] All tests passed!
17:40:22 [2020-09-26T21:40:22.215Z] [INFO] 
17:40:22 [2020-09-26T21:40:22.215Z] [INFO] --- maven-install-plugin:2.3.1:install (default-install) @ org.eclipse.ease.ui.scripts.test ---
17:40:22 [2020-09-26T21:40:22.215Z] [INFO] Installing /home/jenkins/agent/workspace/ease.verify.core.target.2019-03/tests/org.eclipse.ease.ui.scripts.test/target/org.eclipse.ease.ui.scripts.test-0.8.0-SNAPSHOT.jar to /home/jenkins/.m2/repository/org/eclipse/ease/org.eclipse.ease.ui.scripts.test/0.8.0-SNAPSHOT/org.eclipse.ease.ui.scripts.test-0.8.0-SNAPSHOT.jar
17:40:22 [2020-09-26T21:40:22.215Z] [INFO] Installing /home/jenkins/agent/workspace/ease.verify.core.target.2019-03/tests/org.eclipse.ease.ui.scripts.test/pom.xml to /home/jenkins/.m2/repository/org/eclipse/ease/org.eclipse.ease.ui.scripts.test/0.8.0-SNAPSHOT/org.eclipse.ease.ui.scripts.test-0.8.0-SNAPSHOT.pom
17:40:22 [2020-09-26T21:40:22.215Z] [INFO] Installing /home/jenkins/agent/workspace/ease.verify.core.target.2019-03/tests/org.eclipse.ease.ui.scripts.test/target/org.eclipse.ease.ui.scripts.test-0.8.0-SNAPSHOT-sources.jar to /home/jenkins/.m2/repository/org/eclipse/ease/org.eclipse.ease.ui.scripts.test/0.8.0-SNAPSHOT/org.eclipse.ease.ui.scripts.test-0.8.0-SNAPSHOT-sources.jar
17:40:22 [2020-09-26T21:40:22.215Z] [INFO] Installing /home/jenkins/agent/workspace/ease.verify.core.target.2019-03/tests/org.eclipse.ease.ui.scripts.test/target/p2content.xml to /home/jenkins/.m2/repository/org/eclipse/ease/org.eclipse.ease.ui.scripts.test/0.8.0-SNAPSHOT/org.eclipse.ease.ui.scripts.test-0.8.0-SNAPSHOT-p2metadata.xml
17:40:22 [2020-09-26T21:40:22.215Z] [INFO] Installing /home/jenkins/agent/workspace/ease.verify.core.target.2019-03/tests/org.eclipse.ease.ui.scripts.test/target/p2artifacts.xml to /home/jenkins/.m2/repository/org/eclipse/ease/org.eclipse.ease.ui.scripts.test/0.8.0-SNAPSHOT/org.eclipse.ease.ui.scripts.test-0.8.0-SNAPSHOT-p2artifacts.xml
17:40:22 [2020-09-26T21:40:22.215Z] [INFO] Installing /home/jenkins/agent/workspace/ease.verify.core.target.2019-03/tests/org.eclipse.ease.ui.scripts.test/target/p2content.xml to /home/jenkins/.m2/repository/org/eclipse/ease/org.eclipse.ease.ui.scripts.test/0.8.0-SNAPSHOT/org.eclipse.ease.ui.scripts.test-0.8.0-SNAPSHOT-p2metadata.xml
17:40:22 [2020-09-26T21:40:22.215Z] [INFO] Installing /home/jenkins/agent/workspace/ease.verify.core.target.2019-03/tests/org.eclipse.ease.ui.scripts.test/target/p2artifacts.xml to /home/jenkins/.m2/repository/org/eclipse/ease/org.eclipse.ease.ui.scripts.test/0.8.0-SNAPSHOT/org.eclipse.ease.ui.scripts.test-0.8.0-SNAPSHOT-p2artifacts.xml
17:40:22 [2020-09-26T21:40:22.215Z] [INFO] 
17:40:22 [2020-09-26T21:40:22.215Z] [INFO] --- tycho-p2-plugin:1.5.0:update-local-index (default-update-local-index) @ org.eclipse.ease.ui.scripts.test ---
17:40:22 [2020-09-26T21:40:22.215Z] [INFO] 
17:40:22 [2020-09-26T21:40:22.215Z] [INFO] -------------< org.eclipse.ease:org.eclipse.ease.ui.test >--------------
17:40:22 [2020-09-26T21:40:22.215Z] [INFO] Building org.eclipse.ease.ui.test 0.8.0-SNAPSHOT                 [47/48]
17:40:22 [2020-09-26T21:40:22.215Z] [INFO] ------------------------[ eclipse-test-plugin ]-------------------------
17:40:22 [2020-09-26T21:40:22.215Z] [INFO] 
17:40:22 [2020-09-26T21:40:22.215Z] [INFO] --- maven-clean-plugin:2.5:clean (default-clean) @ org.eclipse.ease.ui.test ---
17:40:22 [2020-09-26T21:40:22.215Z] [INFO] 
17:40:22 [2020-09-26T21:40:22.215Z] [INFO] --- tycho-packaging-plugin:1.5.0:build-qualifier (default-build-qualifier) @ org.eclipse.ease.ui.test ---
17:40:22 [2020-09-26T21:40:22.215Z] [INFO] The project's OSGi version is 0.8.0.I201910171213
17:40:22 [2020-09-26T21:40:22.215Z] [INFO] 
17:40:22 [2020-09-26T21:40:22.215Z] [INFO] --- tycho-packaging-plugin:1.5.0:validate-id (default-validate-id) @ org.eclipse.ease.ui.test ---
17:40:22 [2020-09-26T21:40:22.215Z] [INFO] 
17:40:22 [2020-09-26T21:40:22.216Z] [INFO] --- tycho-packaging-plugin:1.5.0:validate-version (default-validate-version) @ org.eclipse.ease.ui.test ---
17:40:22 [2020-09-26T21:40:22.216Z] [INFO] 
17:40:22 [2020-09-26T21:40:22.216Z] [INFO] >>> maven-javadoc-plugin:2.9.1:javadoc (build-docs) > generate-sources @ org.eclipse.ease.ui.test >>>
17:40:22 [2020-09-26T21:40:22.216Z] [INFO] 
17:40:22 [2020-09-26T21:40:22.216Z] [INFO] --- tycho-packaging-plugin:1.5.0:build-qualifier (default-build-qualifier) @ org.eclipse.ease.ui.test ---
17:40:22 [2020-09-26T21:40:22.216Z] [INFO] The project's OSGi version is 0.8.0.I201910171213
17:40:22 [2020-09-26T21:40:22.216Z] [INFO] 
17:40:22 [2020-09-26T21:40:22.216Z] [INFO] --- tycho-packaging-plugin:1.5.0:validate-id (default-validate-id) @ org.eclipse.ease.ui.test ---
17:40:22 [2020-09-26T21:40:22.216Z] [INFO] 
17:40:22 [2020-09-26T21:40:22.216Z] [INFO] --- tycho-packaging-plugin:1.5.0:validate-version (default-validate-version) @ org.eclipse.ease.ui.test ---
17:40:22 [2020-09-26T21:40:22.216Z] [INFO] 
17:40:22 [2020-09-26T21:40:22.216Z] [INFO] <<< maven-javadoc-plugin:2.9.1:javadoc (build-docs) < generate-sources @ org.eclipse.ease.ui.test <<<
17:40:22 [2020-09-26T21:40:22.216Z] [INFO] 
17:40:22 [2020-09-26T21:40:22.216Z] [INFO] 
17:40:22 [2020-09-26T21:40:22.216Z] [INFO] --- maven-javadoc-plugin:2.9.1:javadoc (build-docs) @ org.eclipse.ease.ui.test ---
17:40:22 [2020-09-26T21:40:22.471Z] [ERROR] Error fetching link: http://help.eclipse.org/oxygen/topic/org.eclipse.platform.doc.isv/reference/api/package-list. Ignored it.
17:40:22 [2020-09-26T21:40:22.471Z] [ERROR] Error fetching link: https://ci.eclipse.org/ease/job/ease.build.core/JavaDoc/package-list. Ignored it.
17:40:23 [2020-09-26T21:40:23.835Z] [INFO] 
17:40:23 [2020-09-26T21:40:23.835Z] Loading source files for package org.eclipse.ease.ui.completion...
17:40:23 [2020-09-26T21:40:23.835Z] Loading source files for package org.eclipse.ease.ui.completion.provider...
17:40:23 [2020-09-26T21:40:23.835Z] Loading source files for package org.eclipse.ease.ui.completions.java.provider...
17:40:23 [2020-09-26T21:40:23.835Z] Loading source files for package org.eclipse.ease.ui.help.hovers...
17:40:23 [2020-09-26T21:40:23.835Z] Constructing Javadoc information...
17:40:23 [2020-09-26T21:40:23.835Z] WARNING: Cannot open location "/home/jenkins/agent/workspace/ease.verify.core.target.2019-03/tests/org.eclipse.ease.ui.test/target/javadoc-bundle-options/package-list"
17:40:23 [2020-09-26T21:40:23.835Z] [WARNING] Javadoc Warnings
17:40:23 [2020-09-26T21:40:23.835Z] [WARNING] Picked up JAVA_TOOL_OPTIONS: -Dmaven.ext.class.path="/home/jenkins/agent/workspace/ease.verify.core.target.2019-03@tmp/withMavene09eca7f/pipeline-maven-spy.jar" -Dorg.jenkinsci.plugins.pipeline.maven.reportsFolder="/home/jenkins/agent/workspace/ease.verify.core.target.2019-03@tmp/withMavene09eca7f"
17:40:23 [2020-09-26T21:40:23.835Z] [WARNING] javadoc: warning - The old Doclet and Taglet APIs in the packages
17:40:23 [2020-09-26T21:40:23.835Z] [WARNING] com.sun.javadoc, com.sun.tools.doclets and their implementations
17:40:23 [2020-09-26T21:40:23.835Z] [WARNING] are planned to be removed in a future JDK release. These
17:40:23 [2020-09-26T21:40:23.835Z] [WARNING] components have been superseded by the new APIs in jdk.javadoc.doclet.
17:40:23 [2020-09-26T21:40:23.835Z] [WARNING] Users are strongly recommended to migrate to the new APIs.
17:40:23 [2020-09-26T21:40:23.835Z] [INFO] 
17:40:23 [2020-09-26T21:40:23.836Z] [INFO] --- build-helper-maven-plugin:1.9.1:add-resource (add_help) @ org.eclipse.ease.ui.test ---
17:40:23 [2020-09-26T21:40:23.836Z] [INFO] 
17:40:23 [2020-09-26T21:40:23.836Z] [INFO] --- maven-resources-plugin:2.4.3:resources (default-resources) @ org.eclipse.ease.ui.test ---
17:40:23 [2020-09-26T21:40:23.836Z] [INFO] Using 'UTF-8' encoding to copy filtered resources.
17:40:23 [2020-09-26T21:40:23.836Z] [INFO] skip non existing resourceDirectory /home/jenkins/agent/workspace/ease.verify.core.target.2019-03/tests/org.eclipse.ease.ui.test/src/main/resources
17:40:23 [2020-09-26T21:40:23.836Z] [INFO] Copying 2 resources to help
17:40:23 [2020-09-26T21:40:23.836Z] [INFO] 
17:40:23 [2020-09-26T21:40:23.836Z] [INFO] --- tycho-compiler-plugin:1.5.0:compile (default-compile) @ org.eclipse.ease.ui.test ---
17:40:23 [2020-09-26T21:40:23.836Z] [INFO] Compiling 6 source files to /home/jenkins/agent/workspace/ease.verify.core.target.2019-03/tests/org.eclipse.ease.ui.test/target/classes
17:40:23 [2020-09-26T21:40:23.836Z] [INFO] 
17:40:23 [2020-09-26T21:40:23.836Z] [INFO] --- maven-resources-plugin:2.4.3:testResources (default-testResources) @ org.eclipse.ease.ui.test ---
17:40:23 [2020-09-26T21:40:23.836Z] [INFO] Using 'UTF-8' encoding to copy filtered resources.
17:40:23 [2020-09-26T21:40:23.836Z] [INFO] skip non existing resourceDirectory /home/jenkins/agent/workspace/ease.verify.core.target.2019-03/tests/org.eclipse.ease.ui.test/src/test/resources
17:40:23 [2020-09-26T21:40:23.836Z] [INFO] 
17:40:23 [2020-09-26T21:40:23.836Z] [INFO] --- tycho-source-plugin:1.5.0:plugin-source (plugin-source) @ org.eclipse.ease.ui.test ---
17:40:23 [2020-09-26T21:40:23.836Z] [WARNING] Bundle-Vendor header not found in /home/jenkins/agent/workspace/ease.verify.core.target.2019-03/tests/org.eclipse.ease.ui.test/META-INF/MANIFEST.MF, fallback to 'unknown' for source bundle
17:40:23 [2020-09-26T21:40:23.836Z] [INFO] Building jar: /home/jenkins/agent/workspace/ease.verify.core.target.2019-03/tests/org.eclipse.ease.ui.test/target/org.eclipse.ease.ui.test-0.8.0-SNAPSHOT-sources.jar
17:40:23 [2020-09-26T21:40:23.836Z] [INFO] 
17:40:23 [2020-09-26T21:40:23.836Z] [INFO] --- target-platform-configuration:1.5.0:target-platform (default-target-platform) @ org.eclipse.ease.ui.test ---
17:40:23 [2020-09-26T21:40:23.836Z] [INFO] 
17:40:23 [2020-09-26T21:40:23.836Z] [INFO] --- tycho-packaging-plugin:1.5.0:package-plugin (default-package-plugin) @ org.eclipse.ease.ui.test ---
17:40:23 [2020-09-26T21:40:23.836Z] [INFO] Building jar: /home/jenkins/agent/workspace/ease.verify.core.target.2019-03/tests/org.eclipse.ease.ui.test/target/org.eclipse.ease.ui.test-0.8.0-SNAPSHOT.jar
17:40:23 [2020-09-26T21:40:23.836Z] [INFO] 
17:40:23 [2020-09-26T21:40:23.836Z] [INFO] --- tycho-p2-plugin:1.5.0:p2-metadata-default (default-p2-metadata-default) @ org.eclipse.ease.ui.test ---
17:40:23 [2020-09-26T21:40:23.836Z] [INFO] 
17:40:23 [2020-09-26T21:40:23.836Z] [INFO] --- tycho-source-feature-plugin:1.5.0:source-feature (source-feature) @ org.eclipse.ease.ui.test ---
17:40:23 [2020-09-26T21:40:23.836Z] [INFO] 
17:40:23 [2020-09-26T21:40:23.836Z] [INFO] --- tycho-p2-plugin:1.5.0:p2-metadata (attached-p2-metadata) @ org.eclipse.ease.ui.test ---
17:40:23 [2020-09-26T21:40:23.836Z] [INFO] 
17:40:23 [2020-09-26T21:40:23.836Z] [INFO] --- tycho-surefire-plugin:1.5.0:test (default-test) @ org.eclipse.ease.ui.test ---
17:40:23 [2020-09-26T21:40:23.836Z] [INFO] Expected eclipse log file: /home/jenkins/agent/workspace/ease.verify.core.target.2019-03/tests/org.eclipse.ease.ui.test/target/work/data/.metadata/.log
17:40:23 [2020-09-26T21:40:23.836Z] [INFO] Command line:
17:40:23 [2020-09-26T21:40:23.836Z] 	[/opt/tools/java/openjdk/jdk-11/11.0.2+9/bin/java, -Dosgi.noShutdown=false, -Dosgi.os=linux, -Dosgi.ws=gtk, -Dosgi.arch=x86_64, -Dosgi.clean=true, -jar, /home/jenkins/.m2/repository/p2/osgi/bundle/org.eclipse.equinox.launcher/1.5.800.v20200727-1323/org.eclipse.equinox.launcher-1.5.800.v20200727-1323.jar, -data, /home/jenkins/agent/workspace/ease.verify.core.target.2019-03/tests/org.eclipse.ease.ui.test/target/work/data, -install, /home/jenkins/agent/workspace/ease.verify.core.target.2019-03/tests/org.eclipse.ease.ui.test/target/work, -configuration, /home/jenkins/agent/workspace/ease.verify.core.target.2019-03/tests/org.eclipse.ease.ui.test/target/work/configuration, -application, org.eclipse.tycho.surefire.osgibooter.headlesstest, -testproperties, /home/jenkins/agent/workspace/ease.verify.core.target.2019-03/tests/org.eclipse.ease.ui.test/target/surefire.properties]
17:40:23 [2020-09-26T21:40:23.836Z] Picked up JAVA_TOOL_OPTIONS: -Dmaven.ext.class.path="/home/jenkins/agent/workspace/ease.verify.core.target.2019-03@tmp/withMavene09eca7f/pipeline-maven-spy.jar" -Dorg.jenkinsci.plugins.pipeline.maven.reportsFolder="/home/jenkins/agent/workspace/ease.verify.core.target.2019-03@tmp/withMavene09eca7f" 
17:40:25 [2020-09-26T21:40:25.752Z] Running org.eclipse.ease.ui.help.hovers.ModuleHelpTest
17:40:25 [2020-09-26T21:40:25.752Z] Tests run: 4, Failures: 0, Errors: 0, Skipped: 4, Time elapsed: 0.021 s - in org.eclipse.ease.ui.help.hovers.ModuleHelpTest
17:40:25 [2020-09-26T21:40:25.752Z] getModuleHelpLocation(org.eclipse.ease.ui.help.hovers.ModuleHelpTest) skipped
17:40:25 [2020-09-26T21:40:25.752Z] getModuleHelp(org.eclipse.ease.ui.help.hovers.ModuleHelpTest) skipped
17:40:25 [2020-09-26T21:40:25.752Z] getMethodHelp(org.eclipse.ease.ui.help.hovers.ModuleHelpTest) skipped
17:40:25 [2020-09-26T21:40:25.752Z] getConstantHelp(org.eclipse.ease.ui.help.hovers.ModuleHelpTest) skipped
17:40:25 [2020-09-26T21:40:25.752Z] Running org.eclipse.ease.ui.completion.provider.AbstractFileLocationCompletionProviderTest
17:40:25 [2020-09-26T21:40:25.752Z] Tests run: 8, Failures: 0, Errors: 0, Skipped: 8, Time elapsed: 0.077 s - in org.eclipse.ease.ui.completion.provider.AbstractFileLocationCompletionProviderTest
17:40:25 [2020-09-26T21:40:25.752Z] workspaceProjectProposals(org.eclipse.ease.ui.completion.provider.AbstractFileLocationCompletionProviderTest) skipped
17:40:25 [2020-09-26T21:40:25.752Z] checkOperatingSystem(org.eclipse.ease.ui.completion.provider.AbstractFileLocationCompletionProviderTest) skipped
17:40:25 [2020-09-26T21:40:25.752Z] absoluteRootWorkspaceProposals(org.eclipse.ease.ui.completion.provider.AbstractFileLocationCompletionProviderTest) skipped
17:40:25 [2020-09-26T21:40:25.752Z] workspaceFolderProposals(org.eclipse.ease.ui.completion.provider.AbstractFileLocationCompletionProviderTest) skipped
17:40:25 [2020-09-26T21:40:25.752Z] fileSystemFolderProposals(org.eclipse.ease.ui.completion.provider.AbstractFileLocationCompletionProviderTest) skipped
17:40:25 [2020-09-26T21:40:25.752Z] workspaceProposals(org.eclipse.ease.ui.completion.provider.AbstractFileLocationCompletionProviderTest) skipped
17:40:25 [2020-09-26T21:40:25.752Z] relativeRootWorkspaceProposals(org.eclipse.ease.ui.completion.provider.AbstractFileLocationCompletionProviderTest) skipped
17:40:25 [2020-09-26T21:40:25.752Z] fileSystemRootProposals(org.eclipse.ease.ui.completion.provider.AbstractFileLocationCompletionProviderTest) skipped
17:40:25 [2020-09-26T21:40:25.752Z] Running org.eclipse.ease.ui.completion.CompletionContextTest
17:40:25 [2020-09-26T21:40:25.752Z] Tests run: 9, Failures: 0, Errors: 0, Skipped: 0, Time elapsed: 0.006 s - in org.eclipse.ease.ui.completion.CompletionContextTest
17:40:25 [2020-09-26T21:40:25.752Z] resolveStaticClass(org.eclipse.ease.ui.completion.CompletionContextTest)  Time elapsed: 0.003 s
17:40:25 [2020-09-26T21:40:25.753Z] resolveClassWithFilter(org.eclipse.ease.ui.completion.CompletionContextTest)  Time elapsed: 0 s
17:40:25 [2020-09-26T21:40:25.753Z] simplifyCalls(org.eclipse.ease.ui.completion.CompletionContextTest)  Time elapsed: 0 s
17:40:25 [2020-09-26T21:40:25.753Z] resolveClass(org.eclipse.ease.ui.completion.CompletionContextTest)  Time elapsed: 0 s
17:40:25 [2020-09-26T21:40:25.753Z] replaceEscapedStringLiterals(org.eclipse.ease.ui.completion.CompletionContextTest)  Time elapsed: 0.001 s
17:40:25 [2020-09-26T21:40:25.753Z] replaceSimpleStringLiterals(org.eclipse.ease.ui.completion.CompletionContextTest)  Time elapsed: 0 s
17:40:25 [2020-09-26T21:40:25.753Z] resolveStaticClassWithFilter(org.eclipse.ease.ui.completion.CompletionContextTest)  Time elapsed: 0 s
17:40:25 [2020-09-26T21:40:25.753Z] resolveClassWithParameters(org.eclipse.ease.ui.completion.CompletionContextTest)  Time elapsed: 0 s
17:40:25 [2020-09-26T21:40:25.753Z] replaceMultipleStringLiterals(org.eclipse.ease.ui.completion.CompletionContextTest)  Time elapsed: 0 s
17:40:25 [2020-09-26T21:40:25.753Z] Running org.eclipse.ease.ui.completions.java.provider.JavaPackagesCompletionsProviderTest
17:40:26 [2020-09-26T21:40:26.008Z] WARNING: An illegal reflective access operation has occurred
17:40:26 [2020-09-26T21:40:26.008Z] WARNING: Illegal reflective access by org.mockito.cglib.core.ReflectUtils$2 (file:/home/jenkins/.m2/repository/p2/osgi/bundle/org.mockito/1.9.5.v201605172210/org.mockito-1.9.5.v201605172210.jar) to method java.lang.ClassLoader.defineClass(java.lang.String,byte[],int,int,java.security.ProtectionDomain)
17:40:26 [2020-09-26T21:40:26.008Z] WARNING: Please consider reporting this to the maintainers of org.mockito.cglib.core.ReflectUtils$2
17:40:26 [2020-09-26T21:40:26.008Z] WARNING: Use --illegal-access=warn to enable warnings of further illegal reflective access operations
17:40:26 [2020-09-26T21:40:26.008Z] WARNING: All illegal access operations will be denied in a future release
17:40:32 [2020-09-26T21:40:32.545Z] Tests run: 4, Failures: 0, Errors: 0, Skipped: 0, Time elapsed: 5.837 s - in org.eclipse.ease.ui.completions.java.provider.JavaPackagesCompletionsProviderTest
17:40:32 [2020-09-26T21:40:32.545Z] containsJavaLangPackageProposal(org.eclipse.ease.ui.completions.java.provider.JavaPackagesCompletionsProviderTest)  Time elapsed: 0.463 s
17:40:32 [2020-09-26T21:40:32.545Z] containsOrgRootPackageProposal(org.eclipse.ease.ui.completions.java.provider.JavaPackagesCompletionsProviderTest)  Time elapsed: 0.008 s
17:40:32 [2020-09-26T21:40:32.545Z] containsJavaRootPackageProposal(org.eclipse.ease.ui.completions.java.provider.JavaPackagesCompletionsProviderTest)  Time elapsed: 0.007 s
17:40:32 [2020-09-26T21:40:32.545Z] containsOrgEclipsePackageProposal(org.eclipse.ease.ui.completions.java.provider.JavaPackagesCompletionsProviderTest)  Time elapsed: 0.05 s
17:40:32 [2020-09-26T21:40:32.545Z] Running org.eclipse.ease.ui.completions.java.provider.JavaClassCompletionsProviderTest
17:40:37 [2020-09-26T21:40:37.789Z] Tests run: 6, Failures: 0, Errors: 0, Skipped: 0, Time elapsed: 5.182 s - in org.eclipse.ease.ui.completions.java.provider.JavaClassCompletionsProviderTest
17:40:37 [2020-09-26T21:40:37.790Z] containsPackageFileCompletion(org.eclipse.ease.ui.completions.java.provider.JavaClassCompletionsProviderTest)  Time elapsed: 0.009 s
17:40:37 [2020-09-26T21:40:37.790Z] containsGlobalFileCompletion(org.eclipse.ease.ui.completions.java.provider.JavaClassCompletionsProviderTest)  Time elapsed: 0.036 s
17:40:37 [2020-09-26T21:40:37.790Z] containsJavaLangPackageProposal(org.eclipse.ease.ui.completions.java.provider.JavaClassCompletionsProviderTest)  Time elapsed: 0.059 s
17:40:37 [2020-09-26T21:40:37.790Z] containsOrgRootPackageProposal(org.eclipse.ease.ui.completions.java.provider.JavaClassCompletionsProviderTest)  Time elapsed: 0.005 s
17:40:37 [2020-09-26T21:40:37.790Z] containsJavaRootPackageProposal(org.eclipse.ease.ui.completions.java.provider.JavaClassCompletionsProviderTest)  Time elapsed: 0.005 s
17:40:37 [2020-09-26T21:40:37.790Z] containsOrgEclipsePackageProposal(org.eclipse.ease.ui.completions.java.provider.JavaClassCompletionsProviderTest)  Time elapsed: 0.045 s
17:40:37 [2020-09-26T21:40:37.790Z] 
17:40:37 [2020-09-26T21:40:37.790Z] Results:
17:40:37 [2020-09-26T21:40:37.790Z] 
17:40:37 [2020-09-26T21:40:37.790Z] Tests run: 31, Failures: 0, Errors: 0, Skipped: 12
17:40:37 [2020-09-26T21:40:37.790Z] 
17:40:38 [2020-09-26T21:40:38.045Z] [INFO] All tests passed!
17:40:38 [2020-09-26T21:40:38.045Z] [INFO] 
17:40:38 [2020-09-26T21:40:38.045Z] [INFO] --- maven-install-plugin:2.3.1:install (default-install) @ org.eclipse.ease.ui.test ---
17:40:38 [2020-09-26T21:40:38.045Z] [INFO] Installing /home/jenkins/agent/workspace/ease.verify.core.target.2019-03/tests/org.eclipse.ease.ui.test/target/org.eclipse.ease.ui.test-0.8.0-SNAPSHOT.jar to /home/jenkins/.m2/repository/org/eclipse/ease/org.eclipse.ease.ui.test/0.8.0-SNAPSHOT/org.eclipse.ease.ui.test-0.8.0-SNAPSHOT.jar
17:40:38 [2020-09-26T21:40:38.045Z] [INFO] Installing /home/jenkins/agent/workspace/ease.verify.core.target.2019-03/tests/org.eclipse.ease.ui.test/pom.xml to /home/jenkins/.m2/repository/org/eclipse/ease/org.eclipse.ease.ui.test/0.8.0-SNAPSHOT/org.eclipse.ease.ui.test-0.8.0-SNAPSHOT.pom
17:40:38 [2020-09-26T21:40:38.045Z] [INFO] Installing /home/jenkins/agent/workspace/ease.verify.core.target.2019-03/tests/org.eclipse.ease.ui.test/target/org.eclipse.ease.ui.test-0.8.0-SNAPSHOT-sources.jar to /home/jenkins/.m2/repository/org/eclipse/ease/org.eclipse.ease.ui.test/0.8.0-SNAPSHOT/org.eclipse.ease.ui.test-0.8.0-SNAPSHOT-sources.jar
17:40:38 [2020-09-26T21:40:38.045Z] [INFO] Installing /home/jenkins/agent/workspace/ease.verify.core.target.2019-03/tests/org.eclipse.ease.ui.test/target/p2content.xml to /home/jenkins/.m2/repository/org/eclipse/ease/org.eclipse.ease.ui.test/0.8.0-SNAPSHOT/org.eclipse.ease.ui.test-0.8.0-SNAPSHOT-p2metadata.xml
17:40:38 [2020-09-26T21:40:38.046Z] [INFO] Installing /home/jenkins/agent/workspace/ease.verify.core.target.2019-03/tests/org.eclipse.ease.ui.test/target/p2artifacts.xml to /home/jenkins/.m2/repository/org/eclipse/ease/org.eclipse.ease.ui.test/0.8.0-SNAPSHOT/org.eclipse.ease.ui.test-0.8.0-SNAPSHOT-p2artifacts.xml
17:40:38 [2020-09-26T21:40:38.046Z] [INFO] Installing /home/jenkins/agent/workspace/ease.verify.core.target.2019-03/tests/org.eclipse.ease.ui.test/target/p2content.xml to /home/jenkins/.m2/repository/org/eclipse/ease/org.eclipse.ease.ui.test/0.8.0-SNAPSHOT/org.eclipse.ease.ui.test-0.8.0-SNAPSHOT-p2metadata.xml
17:40:38 [2020-09-26T21:40:38.046Z] [INFO] Installing /home/jenkins/agent/workspace/ease.verify.core.target.2019-03/tests/org.eclipse.ease.ui.test/target/p2artifacts.xml to /home/jenkins/.m2/repository/org/eclipse/ease/org.eclipse.ease.ui.test/0.8.0-SNAPSHOT/org.eclipse.ease.ui.test-0.8.0-SNAPSHOT-p2artifacts.xml
17:40:38 [2020-09-26T21:40:38.046Z] [INFO] 
17:40:38 [2020-09-26T21:40:38.046Z] [INFO] --- tycho-p2-plugin:1.5.0:update-local-index (default-update-local-index) @ org.eclipse.ease.ui.test ---
17:40:38 [2020-09-26T21:40:38.046Z] [INFO] 
17:40:38 [2020-09-26T21:40:38.046Z] [INFO] ---------------------< org.eclipse.ease:ease.core >---------------------
17:40:38 [2020-09-26T21:40:38.046Z] [INFO] Building EASE (Incubation) 0.4.0-SNAPSHOT                        [48/48]
17:40:38 [2020-09-26T21:40:38.046Z] [INFO] --------------------------------[ pom ]---------------------------------
17:40:38 [2020-09-26T21:40:38.046Z] [INFO] 
17:40:38 [2020-09-26T21:40:38.046Z] [INFO] --- maven-clean-plugin:2.5:clean (default-clean) @ ease.core ---
17:40:38 [2020-09-26T21:40:38.046Z] [INFO] 
17:40:38 [2020-09-26T21:40:38.046Z] [INFO] --- maven-install-plugin:2.4:install (default-install) @ ease.core ---
17:40:38 [2020-09-26T21:40:38.305Z] [INFO] Installing /home/jenkins/agent/workspace/ease.verify.core.target.2019-03/pom.xml to /home/jenkins/.m2/repository/org/eclipse/ease/ease.core/0.4.0-SNAPSHOT/ease.core-0.4.0-SNAPSHOT.pom
17:40:38 [2020-09-26T21:40:38.305Z] [INFO] ------------------------------------------------------------------------
17:40:38 [2020-09-26T21:40:38.305Z] [INFO] Reactor Summary:
17:40:38 [2020-09-26T21:40:38.305Z] [INFO] 
17:40:38 [2020-09-26T21:40:38.305Z] [INFO] org.eclipse.ease.releng 0.8.0-SNAPSHOT ............. SUCCESS [  5.119 s]
17:40:38 [2020-09-26T21:40:38.305Z] [INFO] org.eclipse.ease.classloader 0.8.0-SNAPSHOT ........ SUCCESS [  8.272 s]
17:40:38 [2020-09-26T21:40:38.306Z] [INFO] org.eclipse.ease 0.8.0-SNAPSHOT .................... SUCCESS [  2.951 s]
17:40:38 [2020-09-26T21:40:38.306Z] [INFO] org.eclipse.ease.ui 0.8.0-SNAPSHOT ................. SUCCESS [  3.003 s]
17:40:38 [2020-09-26T21:40:38.306Z] [INFO] org.eclipse.ease.ui.completions.java 0.8.0-SNAPSHOT  SUCCESS [  2.121 s]
17:40:38 [2020-09-26T21:40:38.306Z] [INFO] org.eclipse.ease.ui.scripts 0.8.0-SNAPSHOT ......... SUCCESS [  2.600 s]
17:40:38 [2020-09-26T21:40:38.306Z] [INFO] org.eclipse.ease.lang.javascript 0.8.0-SNAPSHOT .... SUCCESS [  1.702 s]
17:40:38 [2020-09-26T21:40:38.306Z] [INFO] org.eclipse.ease.lang.scriptarchive 0.8.0-SNAPSHOT . SUCCESS [  1.325 s]
17:40:38 [2020-09-26T21:40:38.306Z] [INFO] org.eclipse.ease.lang.python 0.8.0-SNAPSHOT ........ SUCCESS [  1.774 s]
17:40:38 [2020-09-26T21:40:38.318Z] [INFO] org.eclipse.ease.lang.python.py4j 0.8.0-SNAPSHOT ... SUCCESS [  1.627 s]
17:40:38 [2020-09-26T21:40:38.318Z] [INFO] org.eclipse.ease.lang.groovy 0.8.0-SNAPSHOT ........ SUCCESS [  1.449 s]
17:40:38 [2020-09-26T21:40:38.318Z] [INFO] org.eclipse.ease.lang.groovy.interpreter 0.8.0-SNAPSHOT SUCCESS [  1.307 s]
17:40:38 [2020-09-26T21:40:38.318Z] [INFO] org.eclipse.ease.lang.unittest 0.8.0-SNAPSHOT ...... SUCCESS [  2.022 s]
17:40:38 [2020-09-26T21:40:38.318Z] [INFO] org.eclipse.ease.lang.unittest.ui 0.8.0-SNAPSHOT ... SUCCESS [  1.976 s]
17:40:38 [2020-09-26T21:40:38.318Z] [INFO] org.eclipse.ease.lang.ruby 0.8.0-SNAPSHOT .......... SUCCESS [  1.342 s]
17:40:38 [2020-09-26T21:40:38.318Z] [INFO] org.eclipse.ease.lang.ruby.jruby 0.8.0-SNAPSHOT .... SUCCESS [  1.382 s]
17:40:38 [2020-09-26T21:40:38.318Z] [INFO] org.eclipse.ease.lang.javascript.nashorn 0.8.0-SNAPSHOT SUCCESS [  1.317 s]
17:40:38 [2020-09-26T21:40:38.319Z] [INFO] org.eclipse.ease.lang.javascript.rhino 0.8.0-SNAPSHOT SUCCESS [  1.980 s]
17:40:38 [2020-09-26T21:40:38.319Z] [INFO] org.eclipse.ease.lang.python.jython 0.8.0-SNAPSHOT . SUCCESS [  1.514 s]
17:40:38 [2020-09-26T21:40:38.319Z] [INFO] org.eclipse.ease.lang.javascript.ui 0.8.0-SNAPSHOT . SUCCESS [  1.597 s]
17:40:38 [2020-09-26T21:40:38.319Z] [INFO] org.eclipse.ease.lang.jvm.compiled 0.8.0-SNAPSHOT .. SUCCESS [  1.379 s]
17:40:38 [2020-09-26T21:40:38.319Z] [INFO] org.eclipse.ease.lang.scriptarchive.ui 0.8.0-SNAPSHOT SUCCESS [  1.508 s]
17:40:38 [2020-09-26T21:40:38.319Z] [INFO] org.eclipse.ease.help 0.8.0-SNAPSHOT ............... SUCCESS [  0.348 s]
17:40:38 [2020-09-26T21:40:38.319Z] [INFO] org.eclipse.ease.feature 0.8.0-SNAPSHOT ............ SUCCESS [  0.135 s]
17:40:38 [2020-09-26T21:40:38.319Z] [INFO] org.eclipse.ease.ui.feature 0.8.0-SNAPSHOT ......... SUCCESS [  0.254 s]
17:40:38 [2020-09-26T21:40:38.319Z] [INFO] org.eclipse.ease.lang.javascript.feature 0.8.0-SNAPSHOT SUCCESS [  0.066 s]
17:40:38 [2020-09-26T21:40:38.319Z] [INFO] org.eclipse.ease.lang.python.feature 0.8.0-SNAPSHOT  SUCCESS [  0.091 s]
17:40:38 [2020-09-26T21:40:38.319Z] [INFO] org.eclipse.ease.python.jython.feature 0.8.0-SNAPSHOT SUCCESS [  0.107 s]
17:40:38 [2020-09-26T21:40:38.319Z] [INFO] org.eclipse.ease.lang.python.py4j.feature 0.8.0-SNAPSHOT SUCCESS [  0.099 s]
17:40:38 [2020-09-26T21:40:38.319Z] [INFO] org.eclipse.ease.lang.jvm.feature 0.8.0-SNAPSHOT ... SUCCESS [  0.091 s]
17:40:38 [2020-09-26T21:40:38.319Z] [INFO] org.eclipse.ease.lang.groovy.feature 0.8.0-SNAPSHOT  SUCCESS [  0.103 s]
17:40:38 [2020-09-26T21:40:38.319Z] [INFO] org.eclipse.ease.lang.ruby.feature 0.8.0-SNAPSHOT .. SUCCESS [  0.254 s]
17:40:38 [2020-09-26T21:40:38.319Z] [INFO] org.eclipse.ease.lang.scriptarchive.feature 0.8.0-SNAPSHOT SUCCESS [  0.118 s]
17:40:38 [2020-09-26T21:40:38.319Z] [INFO] org.eclipse.ease.lang.unittest.feature 0.8.0-SNAPSHOT SUCCESS [  0.104 s]
17:40:38 [2020-09-26T21:40:38.319Z] [INFO] org.eclipse.ease.releng.target 0.8.0-SNAPSHOT ...... SUCCESS [  0.009 s]
17:40:38 [2020-09-26T21:40:38.319Z] [INFO] org.eclipse.ease.releng.p2 0.8.0-SNAPSHOT .......... SUCCESS [  3.475 s]
17:40:38 [2020-09-26T21:40:38.319Z] [INFO] org.eclipse.ease.testhelper 0.8.0-SNAPSHOT ......... SUCCESS [  1.468 s]
17:40:38 [2020-09-26T21:40:38.319Z] [INFO] org.eclipse.ease.test 0.8.0-SNAPSHOT ............... SUCCESS [ 16.536 s]
17:40:38 [2020-09-26T21:40:38.319Z] [INFO] org.eclipse.ease.lang.javascript.nashorn.test 0.8.0-SNAPSHOT SUCCESS [  4.619 s]
17:40:38 [2020-09-26T21:40:38.319Z] [INFO] org.eclipse.ease.lang.javascript.rhino.test 0.8.0-SNAPSHOT SUCCESS [ 15.772 s]
17:40:38 [2020-09-26T21:40:38.319Z] [INFO] org.eclipse.ease.lang.javascript.test 0.8.0-SNAPSHOT SUCCESS [  4.216 s]
17:40:38 [2020-09-26T21:40:38.319Z] [INFO] org.eclipse.ease.lang.python.test 0.8.0-SNAPSHOT ... SUCCESS [  3.728 s]
17:40:38 [2020-09-26T21:40:38.319Z] [INFO] org.eclipse.ease.lang.python.jython.test 0.8.0-SNAPSHOT SUCCESS [ 16.600 s]
17:40:38 [2020-09-26T21:40:38.319Z] [INFO] org.eclipse.ease.lang.scriptarchive.test 0.8.0-SNAPSHOT SUCCESS [  4.304 s]
17:40:38 [2020-09-26T21:40:38.319Z] [INFO] org.eclipse.ease.lang.unittest.test 0.8.0-SNAPSHOT . SUCCESS [  6.194 s]
17:40:38 [2020-09-26T21:40:38.319Z] [INFO] org.eclipse.ease.ui.scripts.test 0.8.0-SNAPSHOT .... SUCCESS [  3.723 s]
17:40:38 [2020-09-26T21:40:38.319Z] [INFO] org.eclipse.ease.ui.test 0.8.0-SNAPSHOT ............ SUCCESS [ 15.740 s]
17:40:38 [2020-09-26T21:40:38.319Z] [INFO] EASE (Incubation) 0.4.0-SNAPSHOT ................... SUCCESS [  0.209 s]
17:40:38 [2020-09-26T21:40:38.319Z] [INFO] ------------------------------------------------------------------------
17:40:38 [2020-09-26T21:40:38.319Z] [INFO] BUILD SUCCESS
17:40:38 [2020-09-26T21:40:38.319Z] [INFO] ------------------------------------------------------------------------
17:40:38 [2020-09-26T21:40:38.319Z] [INFO] Total time:  05:09 min
17:40:38 [2020-09-26T21:40:38.319Z] [INFO] Finished at: 2020-09-26T21:40:38Z
17:40:38 [2020-09-26T21:40:38.319Z] [INFO] ------------------------------------------------------------------------
17:40:38 [2020-09-26T21:40:38.319Z] [INFO] [jenkins-event-spy] Generated /home/jenkins/agent/workspace/ease.verify.core.target.2019-03@tmp/withMavene09eca7f/maven-spy-20200926-213528-715103163302600011260.log
[Pipeline] }
17:40:40 [2020-09-26T21:40:40.646Z] [withMaven] Publishers: Pipeline Graph Publisher: 149 ms, Invoker Publisher: 2 ms, Junit Publisher: 1 ms, Concordion Publisher: 1 ms, Dependencies Fingerprint Publisher: 985 ms, Findbugs Publisher: 1 ms, Jacoco Publisher: 1 ms
[Pipeline] // withMaven
[Pipeline] }
[Pipeline] // stage
[Pipeline] stage
[Pipeline] { (Test)
[Pipeline] sh
17:40:40 [2020-09-26T21:40:40.961Z] + cp 'releng/org.eclipse.ease.releng.target/previous targets/2019-03.target' releng/org.eclipse.ease.releng.target/org.eclipse.ease.releng.target.target
[Pipeline] withMaven
17:40:40 [2020-09-26T21:40:40.968Z] [withMaven] Options: [org.jenkinsci.plugins.pipeline.maven.publishers.GeneratedArtifactsPublisher[disabled=true], org.jenkinsci.plugins.pipeline.maven.publishers.FindbugsAnalysisPublisher[disabled='false', healthy='', unHealthy='', thresholdLimit='low'], org.jenkinsci.plugins.pipeline.maven.publishers.TasksScannerPublisher[disabled='true', healthy='', unHealthy='', thresholdLimit='low']]
17:40:40 [2020-09-26T21:40:40.969Z] [withMaven] Available options: 
17:40:40 [2020-09-26T21:40:40.969Z] [withMaven] using JDK installation openjdk-jdk11-latest
17:40:40 [2020-09-26T21:40:40.974Z] [withMaven] using Maven installation 'apache-maven-latest'
[Pipeline] {
[Pipeline] sh
17:40:41 [2020-09-26T21:40:41.256Z] + mvn integration-test -f releng/org.eclipse.ease.releng/target-tests-pom.xml
17:40:41 [2020-09-26T21:40:41.257Z] ----- withMaven Wrapper script -----
17:40:41 [2020-09-26T21:40:41.257Z] Picked up JAVA_TOOL_OPTIONS: -Dmaven.ext.class.path="/home/jenkins/agent/workspace/ease.verify.core.target.2019-03@tmp/withMavenf6a247a0/pipeline-maven-spy.jar" -Dorg.jenkinsci.plugins.pipeline.maven.reportsFolder="/home/jenkins/agent/workspace/ease.verify.core.target.2019-03@tmp/withMavenf6a247a0" 
17:40:41 [2020-09-26T21:40:41.257Z] Apache Maven 3.6.3 (cecedd343002696d0abb50b32b541b8a6ba2883f)
17:40:41 [2020-09-26T21:40:41.257Z] Maven home: /opt/tools/apache-maven/latest
17:40:41 [2020-09-26T21:40:41.257Z] Java version: 11.0.2, vendor: Oracle Corporation, runtime: /opt/tools/java/openjdk/jdk-11/11.0.2+9
17:40:41 [2020-09-26T21:40:41.257Z] Default locale: en_US, platform encoding: UTF-8
17:40:41 [2020-09-26T21:40:41.257Z] OS name: "linux", version: "3.10.0-1062.el7.x86_64", arch: "amd64", family: "unix"
17:40:42 [2020-09-26T21:40:42.191Z] [INFO] [jenkins-event-spy] Generate /home/jenkins/agent/workspace/ease.verify.core.target.2019-03@tmp/withMavenf6a247a0/maven-spy-20200926-214041-8124464994970817628380.log.tmp ...
17:40:42 [2020-09-26T21:40:42.191Z] [INFO] Scanning for projects...
17:40:50 [2020-09-26T21:40:50.274Z] [ERROR] Several versions of tycho plugins are configured [1.3.0, 1.5.0]:
17:40:50 [2020-09-26T21:40:50.274Z] [ERROR] 1.3.0:
17:40:50 [2020-09-26T21:40:50.274Z] [ERROR] 	MavenProject: org.eclipse.ease:org.eclipse.ease.releng:0.8.0-SNAPSHOT @ /home/jenkins/agent/workspace/ease.verify.core.target.2019-03/releng/org.eclipse.ease.releng/target-tests-pom.xml
17:40:50 [2020-09-26T21:40:50.274Z] [ERROR] 1.5.0:
17:40:50 [2020-09-26T21:40:50.274Z] [ERROR] 	MavenProject: org.eclipse.ease:org.eclipse.ease.releng.target:0.8.0-SNAPSHOT @ /home/jenkins/agent/workspace/ease.verify.core.target.2019-03/releng/org.eclipse.ease.releng.target/pom.xml
17:40:50 [2020-09-26T21:40:50.274Z] [ERROR] 	MavenProject: org.eclipse.ease:org.eclipse.ease.test:0.8.0-SNAPSHOT @ /home/jenkins/agent/workspace/ease.verify.core.target.2019-03/tests/org.eclipse.ease.test/pom.xml
17:40:50 [2020-09-26T21:40:50.274Z] [ERROR] 	MavenProject: org.eclipse.ease:org.eclipse.ease.lang.javascript.nashorn.test:0.8.0-SNAPSHOT @ /home/jenkins/agent/workspace/ease.verify.core.target.2019-03/tests/org.eclipse.ease.lang.javascript.nashorn.test/pom.xml
17:40:50 [2020-09-26T21:40:50.274Z] [ERROR] 	MavenProject: org.eclipse.ease:org.eclipse.ease.lang.javascript.rhino.test:0.8.0-SNAPSHOT @ /home/jenkins/agent/workspace/ease.verify.core.target.2019-03/tests/org.eclipse.ease.lang.javascript.rhino.test/pom.xml
17:40:50 [2020-09-26T21:40:50.274Z] [ERROR] 	MavenProject: org.eclipse.ease:org.eclipse.ease.lang.javascript.test:0.8.0-SNAPSHOT @ /home/jenkins/agent/workspace/ease.verify.core.target.2019-03/tests/org.eclipse.ease.lang.javascript.test/pom.xml
17:40:50 [2020-09-26T21:40:50.274Z] [ERROR] 	MavenProject: org.eclipse.ease:org.eclipse.ease.lang.python.test:0.8.0-SNAPSHOT @ /home/jenkins/agent/workspace/ease.verify.core.target.2019-03/tests/org.eclipse.ease.lang.python.test/pom.xml
17:40:50 [2020-09-26T21:40:50.274Z] [ERROR] 	MavenProject: org.eclipse.ease:org.eclipse.ease.lang.python.jython.test:0.8.0-SNAPSHOT @ /home/jenkins/agent/workspace/ease.verify.core.target.2019-03/tests/org.eclipse.ease.lang.python.jython.test/pom.xml
17:40:50 [2020-09-26T21:40:50.274Z] [ERROR] 	MavenProject: org.eclipse.ease:org.eclipse.ease.lang.python.py4j.test:0.8.0-SNAPSHOT @ /home/jenkins/agent/workspace/ease.verify.core.target.2019-03/tests/org.eclipse.ease.lang.python.py4j.test/pom.xml
17:40:50 [2020-09-26T21:40:50.274Z] [ERROR] 	MavenProject: org.eclipse.ease:org.eclipse.ease.lang.scriptarchive.test:0.8.0-SNAPSHOT @ /home/jenkins/agent/workspace/ease.verify.core.target.2019-03/tests/org.eclipse.ease.lang.scriptarchive.test/pom.xml
17:40:50 [2020-09-26T21:40:50.275Z] [ERROR] 	MavenProject: org.eclipse.ease:org.eclipse.ease.ui.test:0.8.0-SNAPSHOT @ /home/jenkins/agent/workspace/ease.verify.core.target.2019-03/tests/org.eclipse.ease.ui.test/pom.xml
17:40:50 [2020-09-26T21:40:50.275Z] [INFO] [jenkins-event-spy] Generated /home/jenkins/agent/workspace/ease.verify.core.target.2019-03@tmp/withMavenf6a247a0/maven-spy-20200926-214041-8124464994970817628380.log
17:40:50 [2020-09-26T21:40:50.275Z] [ERROR] All tycho plugins configured in one reactor must use the same version -> [Help 1]
17:40:50 [2020-09-26T21:40:50.275Z] [ERROR] 
17:40:50 [2020-09-26T21:40:50.275Z] [ERROR] To see the full stack trace of the errors, re-run Maven with the -e switch.
17:40:50 [2020-09-26T21:40:50.275Z] [ERROR] Re-run Maven using the -X switch to enable full debug logging.
17:40:50 [2020-09-26T21:40:50.275Z] [ERROR] 
17:40:50 [2020-09-26T21:40:50.275Z] [ERROR] For more information about the errors and possible solutions, please read the following articles:
17:40:50 [2020-09-26T21:40:50.275Z] [ERROR] [Help 1] http://cwiki.apache.org/confluence/display/MAVEN/MavenExecutionException
[Pipeline] }
17:40:50 [2020-09-26T21:40:50.300Z] [withMaven] Publishers: 
[Pipeline] // withMaven
[Pipeline] }
[Pipeline] // stage
[Pipeline] stage
[Pipeline] { (Declarative: Post Actions)
[Pipeline] archiveArtifacts
17:40:50 [2020-09-26T21:40:50.331Z] Archiving artifacts
[Pipeline] emailext
17:41:03 [2020-09-26T21:41:03.516Z] Sending email to: christian.pontesegger@web.de
[Pipeline] }
[Pipeline] // stage
[Pipeline] }
[Pipeline] // timeout
[Pipeline] }
[Pipeline] // timestamps
[Pipeline] }
[Pipeline] // node
[Pipeline] End of Pipeline
ERROR: script returned exit code 1
Finished: FAILURE