SuccessConsole Output

Skipping 768 KB.. Full Log
-04T21:39:54.026Z] 	at org.eclipse.ease.lang.python.debugger.PythonDebugger.traceDispatch(PythonDebugger.java:178)
17:39:54 [2020-07-04T21:39:54.026Z] 	at sun.reflect.GeneratedMethodAccessor12.invoke(Unknown Source)
17:39:54 [2020-07-04T21:39:54.026Z] 	at sun.reflect.DelegatingMethodAccessorImpl.invoke(DelegatingMethodAccessorImpl.java:43)
17:39:54 [2020-07-04T21:39:54.026Z] 	at java.lang.reflect.Method.invoke(Method.java:498)
17:39:54 [2020-07-04T21:39:54.026Z] 	at py4j.reflection.MethodInvoker.invoke(MethodInvoker.java:244)
17:39:54 [2020-07-04T21:39:54.026Z] 	at py4j.reflection.ReflectionEngine.invoke(ReflectionEngine.java:357)
17:39:54 [2020-07-04T21:39:54.026Z] 	at py4j.Gateway.invoke(Gateway.java:282)
17:39:54 [2020-07-04T21:39:54.026Z] 	at py4j.commands.AbstractCommand.invokeMethod(AbstractCommand.java:132)
17:39:54 [2020-07-04T21:39:54.026Z] 	at py4j.commands.CallCommand.execute(CallCommand.java:79)
17:39:54 [2020-07-04T21:39:54.026Z] 	at py4j.ClientServerConnection.sendCommand(ClientServerConnection.java:244)
17:39:54 [2020-07-04T21:39:54.026Z] 	at py4j.CallbackClient.sendCommand(CallbackClient.java:384)
17:39:54 [2020-07-04T21:39:54.026Z] 	at py4j.CallbackClient.sendCommand(CallbackClient.java:356)
17:39:54 [2020-07-04T21:39:54.026Z] 	at py4j.reflection.PythonProxyHandler.invoke(PythonProxyHandler.java:106)
17:39:54 [2020-07-04T21:39:54.026Z] 	at com.sun.proxy.$Proxy13.run(Unknown Source)
17:39:54 [2020-07-04T21:39:54.026Z] 	at org.eclipse.ease.lang.python.py4j.internal.Py4jDebugger.execute(Py4jDebugger.java:106)
17:39:54 [2020-07-04T21:39:54.026Z] 	at org.eclipse.ease.lang.python.py4j.internal.Py4jDebuggerEngine.internalExecute(Py4jDebuggerEngine.java:85)
17:39:54 [2020-07-04T21:39:54.026Z] 	at org.eclipse.ease.lang.python.py4j.internal.Py4jScriptEngine.execute(Py4jScriptEngine.java:226)
17:39:54 [2020-07-04T21:39:54.026Z] 	at org.eclipse.ease.AbstractScriptEngine.inject(AbstractScriptEngine.java:226)
17:39:54 [2020-07-04T21:39:54.026Z] 	at org.eclipse.ease.AbstractScriptEngine.run(AbstractScriptEngine.java:277)
17:39:54 [2020-07-04T21:39:54.026Z] 	at org.eclipse.core.internal.jobs.Worker.run(Worker.java:63)
17:39:54 [2020-07-04T21:39:54.026Z] 
17:39:54 [2020-07-04T21:39:54.026Z] 
17:39:54 [2020-07-04T21:39:54.026Z] 	at py4j.Protocol.getReturnValue(Protocol.java:476)
17:39:54 [2020-07-04T21:39:54.026Z] 	at py4j.reflection.PythonProxyHandler.invoke(PythonProxyHandler.java:108)
17:39:54 [2020-07-04T21:39:54.026Z] 	at com.sun.proxy.$Proxy13.run(Unknown Source)
17:39:54 [2020-07-04T21:39:54.026Z] 	at org.eclipse.ease.lang.python.py4j.internal.Py4jDebugger.execute(Py4jDebugger.java:106)
17:39:54 [2020-07-04T21:39:54.026Z] 	at org.eclipse.ease.lang.python.py4j.internal.Py4jDebuggerEngine.internalExecute(Py4jDebuggerEngine.java:85)
17:39:54 [2020-07-04T21:39:54.026Z] 	at org.eclipse.ease.lang.python.py4j.internal.Py4jScriptEngine.execute(Py4jScriptEngine.java:226)
17:39:54 [2020-07-04T21:39:54.026Z] 	at org.eclipse.ease.AbstractScriptEngine.inject(AbstractScriptEngine.java:226)
17:39:54 [2020-07-04T21:39:54.026Z] 	at org.eclipse.ease.AbstractScriptEngine.run(AbstractScriptEngine.java:277)
17:39:54 [2020-07-04T21:39:54.026Z] 	at org.eclipse.core.internal.jobs.Worker.run(Worker.java:63)
17:39:54 [2020-07-04T21:39:54.282Z] Start of script
17:39:54 [2020-07-04T21:39:54.282Z] include file start
17:39:54 [2020-07-04T21:39:54.282Z] include file processed
17:39:54 [2020-07-04T21:39:54.282Z] Result of testMethod = 5
17:39:54 [2020-07-04T21:39:54.282Z] End of script
17:39:54 [2020-07-04T21:39:54.537Z] Start of script
17:39:54 [2020-07-04T21:39:54.537Z] include file start
17:39:54 [2020-07-04T21:39:54.537Z] include file processed
17:39:54 [2020-07-04T21:39:54.537Z] Result of testMethod = 5
17:39:54 [2020-07-04T21:39:54.537Z] End of script
17:39:54 [2020-07-04T21:39:54.792Z] Start of script
17:39:54 [2020-07-04T21:39:54.792Z] include file start
17:39:54 [2020-07-04T21:39:54.792Z] include file processed
17:39:55 [2020-07-04T21:39:55.048Z] py4j.Py4JException: An exception was raised by the Python Proxy. Return Message: Traceback (most recent call last):
17:39:55 [2020-07-04T21:39:55.048Z]   File "/home/jenkins/agent/workspace/ease.verify.core.target.2019-03/tests/org.eclipse.ease.lang.python.py4j.test/target/work/plugins/py4j-python_0.10.8.1-bnd-2odeag/src/py4j/clientserver.py", line 581, in _call_proxy
17:39:55 [2020-07-04T21:39:55.048Z]     return_value = getattr(self.pool[obj_id], method)(*params)
17:39:55 [2020-07-04T21:39:55.048Z]   File "<...>", line 424, in run
17:39:55 [2020-07-04T21:39:55.048Z]   File "/usr/lib64/python2.7/bdb.py", line 400, in run
17:39:55 [2020-07-04T21:39:55.048Z]     exec cmd in globals, locals
17:39:55 [2020-07-04T21:39:55.048Z]   File "__ref_L/Debug Test/Main.py_bvyazktwde", line 22, in <module>
17:39:55 [2020-07-04T21:39:55.048Z]   File "__ref_L/Debug Test/Main.py_bvyazktwde", line 22, in <module>
17:39:55 [2020-07-04T21:39:55.048Z]   File "<...>", line 231, in trace_dispatch
17:39:55 [2020-07-04T21:39:55.048Z]   File "/usr/lib64/python2.7/bdb.py", line 49, in trace_dispatch
17:39:55 [2020-07-04T21:39:55.049Z]     return self.dispatch_line(frame)
17:39:55 [2020-07-04T21:39:55.049Z]   File "/usr/lib64/python2.7/bdb.py", line 67, in dispatch_line
17:39:55 [2020-07-04T21:39:55.049Z]     self.user_line(frame)
17:39:55 [2020-07-04T21:39:55.049Z]   File "<...>", line 241, in user_line
17:39:55 [2020-07-04T21:39:55.049Z]   File "<...>", line 296, in dispatch
17:39:55 [2020-07-04T21:39:55.049Z]   File "/home/jenkins/agent/workspace/ease.verify.core.target.2019-03/tests/org.eclipse.ease.lang.python.py4j.test/target/work/plugins/py4j-python_0.10.8.1-bnd-2odeag/src/py4j/java_gateway.py", line 1286, in __call__
17:39:55 [2020-07-04T21:39:55.049Z]     answer, self.gateway_client, self.target_id, self.name)
17:39:55 [2020-07-04T21:39:55.049Z]   File "/home/jenkins/agent/workspace/ease.verify.core.target.2019-03/tests/org.eclipse.ease.lang.python.py4j.test/target/work/plugins/py4j-python_0.10.8.1-bnd-2odeag/src/py4j/protocol.py", line 328, in get_return_value
17:39:55 [2020-07-04T21:39:55.049Z]     format(target_id, ".", name), value)
17:39:55 [2020-07-04T21:39:55.049Z] Py4JJavaError: An error occurred while calling o0.traceDispatch.
17:39:55 [2020-07-04T21:39:55.049Z] : org.eclipse.ease.ExitException: 
17:39:55 [2020-07-04T21:39:55.049Z] 	at org.eclipse.ease.debugging.AbstractEaseDebugger.handleEventsInSuspendedState(AbstractEaseDebugger.java:329)
17:39:55 [2020-07-04T21:39:55.049Z] 	at org.eclipse.ease.debugging.AbstractEaseDebugger.suspend(AbstractEaseDebugger.java:255)
17:39:55 [2020-07-04T21:39:55.049Z] 	at org.eclipse.ease.lang.python.py4j.internal.Py4jDebugger.suspend(Py4jDebugger.java:87)
17:39:55 [2020-07-04T21:39:55.049Z] 	at org.eclipse.ease.debugging.AbstractEaseDebugger.processLine(AbstractEaseDebugger.java:510)
17:39:55 [2020-07-04T21:39:55.049Z] 	at org.eclipse.ease.lang.python.debugger.PythonDebugger.traceDispatch(PythonDebugger.java:178)
17:39:55 [2020-07-04T21:39:55.049Z] 	at sun.reflect.GeneratedMethodAccessor12.invoke(Unknown Source)
17:39:55 [2020-07-04T21:39:55.049Z] 	at sun.reflect.DelegatingMethodAccessorImpl.invoke(DelegatingMethodAccessorImpl.java:43)
17:39:55 [2020-07-04T21:39:55.049Z] 	at java.lang.reflect.Method.invoke(Method.java:498)
17:39:55 [2020-07-04T21:39:55.049Z] 	at py4j.reflection.MethodInvoker.invoke(MethodInvoker.java:244)
17:39:55 [2020-07-04T21:39:55.049Z] 	at py4j.reflection.ReflectionEngine.invoke(ReflectionEngine.java:357)
17:39:55 [2020-07-04T21:39:55.049Z] 	at py4j.Gateway.invoke(Gateway.java:282)
17:39:55 [2020-07-04T21:39:55.049Z] 	at py4j.commands.AbstractCommand.invokeMethod(AbstractCommand.java:132)
17:39:55 [2020-07-04T21:39:55.049Z] 	at py4j.commands.CallCommand.execute(CallCommand.java:79)
17:39:55 [2020-07-04T21:39:55.049Z] 	at py4j.ClientServerConnection.sendCommand(ClientServerConnection.java:244)
17:39:55 [2020-07-04T21:39:55.049Z] 	at py4j.CallbackClient.sendCommand(CallbackClient.java:384)
17:39:55 [2020-07-04T21:39:55.049Z] 	at py4j.CallbackClient.sendCommand(CallbackClient.java:356)
17:39:55 [2020-07-04T21:39:55.049Z] 	at py4j.reflection.PythonProxyHandler.invoke(PythonProxyHandler.java:106)
17:39:55 [2020-07-04T21:39:55.049Z] 	at com.sun.proxy.$Proxy13.run(Unknown Source)
17:39:55 [2020-07-04T21:39:55.049Z] 	at org.eclipse.ease.lang.python.py4j.internal.Py4jDebugger.execute(Py4jDebugger.java:106)
17:39:55 [2020-07-04T21:39:55.049Z] 	at org.eclipse.ease.lang.python.py4j.internal.Py4jDebuggerEngine.internalExecute(Py4jDebuggerEngine.java:85)
17:39:55 [2020-07-04T21:39:55.049Z] 	at org.eclipse.ease.lang.python.py4j.internal.Py4jScriptEngine.execute(Py4jScriptEngine.java:226)
17:39:55 [2020-07-04T21:39:55.049Z] 	at org.eclipse.ease.AbstractScriptEngine.inject(AbstractScriptEngine.java:226)
17:39:55 [2020-07-04T21:39:55.049Z] 	at org.eclipse.ease.AbstractScriptEngine.run(AbstractScriptEngine.java:277)
17:39:55 [2020-07-04T21:39:55.049Z] 	at org.eclipse.core.internal.jobs.Worker.run(Worker.java:63)
17:39:55 [2020-07-04T21:39:55.049Z] 
17:39:55 [2020-07-04T21:39:55.049Z] 
17:39:55 [2020-07-04T21:39:55.049Z] 	at py4j.Protocol.getReturnValue(Protocol.java:476)
17:39:55 [2020-07-04T21:39:55.049Z] 	at py4j.reflection.PythonProxyHandler.invoke(PythonProxyHandler.java:108)
17:39:55 [2020-07-04T21:39:55.049Z] 	at com.sun.proxy.$Proxy13.run(Unknown Source)
17:39:55 [2020-07-04T21:39:55.049Z] 	at org.eclipse.ease.lang.python.py4j.internal.Py4jDebugger.execute(Py4jDebugger.java:106)
17:39:55 [2020-07-04T21:39:55.049Z] 	at org.eclipse.ease.lang.python.py4j.internal.Py4jDebuggerEngine.internalExecute(Py4jDebuggerEngine.java:85)
17:39:55 [2020-07-04T21:39:55.049Z] 	at org.eclipse.ease.lang.python.py4j.internal.Py4jScriptEngine.execute(Py4jScriptEngine.java:226)
17:39:55 [2020-07-04T21:39:55.049Z] 	at org.eclipse.ease.AbstractScriptEngine.inject(AbstractScriptEngine.java:226)
17:39:55 [2020-07-04T21:39:55.049Z] 	at org.eclipse.ease.AbstractScriptEngine.run(AbstractScriptEngine.java:277)
17:39:55 [2020-07-04T21:39:55.049Z] 	at org.eclipse.core.internal.jobs.Worker.run(Worker.java:63)
17:39:55 [2020-07-04T21:39:55.305Z] Start of script
17:39:55 [2020-07-04T21:39:55.305Z] include file start
17:39:55 [2020-07-04T21:39:55.305Z] include file processed
17:39:55 [2020-07-04T21:39:55.305Z] Result of testMethod = 5
17:39:55 [2020-07-04T21:39:55.305Z] End of script
17:39:55 [2020-07-04T21:39:55.560Z] py4j.Py4JException: An exception was raised by the Python Proxy. Return Message: Traceback (most recent call last):
17:39:55 [2020-07-04T21:39:55.561Z]   File "/home/jenkins/agent/workspace/ease.verify.core.target.2019-03/tests/org.eclipse.ease.lang.python.py4j.test/target/work/plugins/py4j-python_0.10.8.1-bnd-2odeag/src/py4j/clientserver.py", line 581, in _call_proxy
17:39:55 [2020-07-04T21:39:55.561Z]     return_value = getattr(self.pool[obj_id], method)(*params)
17:39:55 [2020-07-04T21:39:55.561Z]   File "<...>", line 424, in run
17:39:55 [2020-07-04T21:39:55.561Z]   File "/usr/lib64/python2.7/bdb.py", line 400, in run
17:39:55 [2020-07-04T21:39:55.561Z]     exec cmd in globals, locals
17:39:55 [2020-07-04T21:39:55.561Z]   File "__ref_L/Debug Test/Main.py_cuhclsdlkb", line 1, in <module>
17:39:55 [2020-07-04T21:39:55.561Z]   File "__ref_L/Debug Test/Main.py_cuhclsdlkb", line 1, in <module>
17:39:55 [2020-07-04T21:39:55.561Z]   File "<...>", line 231, in trace_dispatch
17:39:55 [2020-07-04T21:39:55.561Z]   File "/usr/lib64/python2.7/bdb.py", line 49, in trace_dispatch
17:39:55 [2020-07-04T21:39:55.561Z]     return self.dispatch_line(frame)
17:39:55 [2020-07-04T21:39:55.561Z]   File "/usr/lib64/python2.7/bdb.py", line 67, in dispatch_line
17:39:55 [2020-07-04T21:39:55.561Z]     self.user_line(frame)
17:39:55 [2020-07-04T21:39:55.561Z]   File "<...>", line 241, in user_line
17:39:55 [2020-07-04T21:39:55.561Z]   File "<...>", line 296, in dispatch
17:39:55 [2020-07-04T21:39:55.561Z]   File "/home/jenkins/agent/workspace/ease.verify.core.target.2019-03/tests/org.eclipse.ease.lang.python.py4j.test/target/work/plugins/py4j-python_0.10.8.1-bnd-2odeag/src/py4j/java_gateway.py", line 1286, in __call__
17:39:55 [2020-07-04T21:39:55.561Z]     answer, self.gateway_client, self.target_id, self.name)
17:39:55 [2020-07-04T21:39:55.561Z]   File "/home/jenkins/agent/workspace/ease.verify.core.target.2019-03/tests/org.eclipse.ease.lang.python.py4j.test/target/work/plugins/py4j-python_0.10.8.1-bnd-2odeag/src/py4j/protocol.py", line 328, in get_return_value
17:39:55 [2020-07-04T21:39:55.561Z]     format(target_id, ".", name), value)
17:39:55 [2020-07-04T21:39:55.561Z] Py4JJavaError: An error occurred while calling o0.traceDispatch.
17:39:55 [2020-07-04T21:39:55.561Z] : org.eclipse.ease.ExitException: 
17:39:55 [2020-07-04T21:39:55.561Z] 	at org.eclipse.ease.debugging.AbstractEaseDebugger.handleEventsInSuspendedState(AbstractEaseDebugger.java:329)
17:39:55 [2020-07-04T21:39:55.561Z] 	at org.eclipse.ease.debugging.AbstractEaseDebugger.suspend(AbstractEaseDebugger.java:255)
17:39:55 [2020-07-04T21:39:55.561Z] 	at org.eclipse.ease.lang.python.py4j.internal.Py4jDebugger.suspend(Py4jDebugger.java:87)
17:39:55 [2020-07-04T21:39:55.561Z] 	at org.eclipse.ease.debugging.AbstractEaseDebugger.processLine(AbstractEaseDebugger.java:490)
17:39:55 [2020-07-04T21:39:55.561Z] 	at org.eclipse.ease.lang.python.debugger.PythonDebugger.traceDispatch(PythonDebugger.java:178)
17:39:55 [2020-07-04T21:39:55.561Z] 	at sun.reflect.GeneratedMethodAccessor12.invoke(Unknown Source)
17:39:55 [2020-07-04T21:39:55.561Z] 	at sun.reflect.DelegatingMethodAccessorImpl.invoke(DelegatingMethodAccessorImpl.java:43)
17:39:55 [2020-07-04T21:39:55.561Z] 	at java.lang.reflect.Method.invoke(Method.java:498)
17:39:55 [2020-07-04T21:39:55.561Z] 	at py4j.reflection.MethodInvoker.invoke(MethodInvoker.java:244)
17:39:55 [2020-07-04T21:39:55.561Z] 	at py4j.reflection.ReflectionEngine.invoke(ReflectionEngine.java:357)
17:39:55 [2020-07-04T21:39:55.561Z] 	at py4j.Gateway.invoke(Gateway.java:282)
17:39:55 [2020-07-04T21:39:55.561Z] 	at py4j.commands.AbstractCommand.invokeMethod(AbstractCommand.java:132)
17:39:55 [2020-07-04T21:39:55.561Z] 	at py4j.commands.CallCommand.execute(CallCommand.java:79)
17:39:55 [2020-07-04T21:39:55.561Z] 	at py4j.ClientServerConnection.sendCommand(ClientServerConnection.java:244)
17:39:55 [2020-07-04T21:39:55.561Z] 	at py4j.CallbackClient.sendCommand(CallbackClient.java:384)
17:39:55 [2020-07-04T21:39:55.561Z] 	at py4j.CallbackClient.sendCommand(CallbackClient.java:356)
17:39:55 [2020-07-04T21:39:55.561Z] 	at py4j.reflection.PythonProxyHandler.invoke(PythonProxyHandler.java:106)
17:39:55 [2020-07-04T21:39:55.561Z] 	at com.sun.proxy.$Proxy13.run(Unknown Source)
17:39:55 [2020-07-04T21:39:55.561Z] 	at org.eclipse.ease.lang.python.py4j.internal.Py4jDebugger.execute(Py4jDebugger.java:106)
17:39:55 [2020-07-04T21:39:55.561Z] 	at org.eclipse.ease.lang.python.py4j.internal.Py4jDebuggerEngine.internalExecute(Py4jDebuggerEngine.java:85)
17:39:55 [2020-07-04T21:39:55.561Z] 	at org.eclipse.ease.lang.python.py4j.internal.Py4jScriptEngine.execute(Py4jScriptEngine.java:226)
17:39:55 [2020-07-04T21:39:55.561Z] 	at org.eclipse.ease.AbstractScriptEngine.inject(AbstractScriptEngine.java:226)
17:39:55 [2020-07-04T21:39:55.561Z] 	at org.eclipse.ease.AbstractScriptEngine.run(AbstractScriptEngine.java:277)
17:39:55 [2020-07-04T21:39:55.561Z] 	at org.eclipse.core.internal.jobs.Worker.run(Worker.java:63)
17:39:55 [2020-07-04T21:39:55.561Z] 
17:39:55 [2020-07-04T21:39:55.561Z] 
17:39:55 [2020-07-04T21:39:55.561Z] 	at py4j.Protocol.getReturnValue(Protocol.java:476)
17:39:55 [2020-07-04T21:39:55.561Z] 	at py4j.reflection.PythonProxyHandler.invoke(PythonProxyHandler.java:108)
17:39:55 [2020-07-04T21:39:55.561Z] 	at com.sun.proxy.$Proxy13.run(Unknown Source)
17:39:55 [2020-07-04T21:39:55.561Z] 	at org.eclipse.ease.lang.python.py4j.internal.Py4jDebugger.execute(Py4jDebugger.java:106)
17:39:55 [2020-07-04T21:39:55.561Z] 	at org.eclipse.ease.lang.python.py4j.internal.Py4jDebuggerEngine.internalExecute(Py4jDebuggerEngine.java:85)
17:39:55 [2020-07-04T21:39:55.561Z] 	at org.eclipse.ease.lang.python.py4j.internal.Py4jScriptEngine.execute(Py4jScriptEngine.java:226)
17:39:55 [2020-07-04T21:39:55.561Z] 	at org.eclipse.ease.AbstractScriptEngine.inject(AbstractScriptEngine.java:226)
17:39:55 [2020-07-04T21:39:55.561Z] 	at org.eclipse.ease.AbstractScriptEngine.run(AbstractScriptEngine.java:277)
17:39:55 [2020-07-04T21:39:55.561Z] 	at org.eclipse.core.internal.jobs.Worker.run(Worker.java:63)
17:39:55 [2020-07-04T21:39:55.816Z] Start of script
17:39:55 [2020-07-04T21:39:55.816Z] include file start
17:39:55 [2020-07-04T21:39:55.816Z] include file processed
17:39:55 [2020-07-04T21:39:55.816Z] Result of testMethod = 5
17:39:55 [2020-07-04T21:39:55.816Z] End of script
17:39:56 [2020-07-04T21:39:56.071Z] Start of script
17:39:56 [2020-07-04T21:39:56.071Z] include file start
17:39:56 [2020-07-04T21:39:56.071Z] include file processed
17:39:56 [2020-07-04T21:39:56.071Z] Result of testMethod = 5
17:39:56 [2020-07-04T21:39:56.071Z] End of script
17:39:56 [2020-07-04T21:39:56.326Z] Start of script
17:39:56 [2020-07-04T21:39:56.326Z] include file start
17:39:56 [2020-07-04T21:39:56.326Z] include file processed
17:39:56 [2020-07-04T21:39:56.326Z] Result of testMethod = 5
17:39:56 [2020-07-04T21:39:56.326Z] py4j.Py4JException: An exception was raised by the Python Proxy. Return Message: Traceback (most recent call last):
17:39:56 [2020-07-04T21:39:56.326Z]   File "/home/jenkins/agent/workspace/ease.verify.core.target.2019-03/tests/org.eclipse.ease.lang.python.py4j.test/target/work/plugins/py4j-python_0.10.8.1-bnd-2odeag/src/py4j/clientserver.py", line 581, in _call_proxy
17:39:56 [2020-07-04T21:39:56.326Z]     return_value = getattr(self.pool[obj_id], method)(*params)
17:39:56 [2020-07-04T21:39:56.326Z]   File "<...>", line 424, in run
17:39:56 [2020-07-04T21:39:56.326Z]   File "/usr/lib64/python2.7/bdb.py", line 400, in run
17:39:56 [2020-07-04T21:39:56.326Z]     exec cmd in globals, locals
17:39:56 [2020-07-04T21:39:56.326Z]   File "__ref_L/Debug Test/Main.py_htygfshhjz", line 23, in <module>
17:39:56 [2020-07-04T21:39:56.326Z]   File "__ref_L/Debug Test/Main.py_htygfshhjz", line 23, in <module>
17:39:56 [2020-07-04T21:39:56.326Z]   File "<...>", line 231, in trace_dispatch
17:39:56 [2020-07-04T21:39:56.326Z]   File "/usr/lib64/python2.7/bdb.py", line 49, in trace_dispatch
17:39:56 [2020-07-04T21:39:56.326Z]     return self.dispatch_line(frame)
17:39:56 [2020-07-04T21:39:56.326Z]   File "/usr/lib64/python2.7/bdb.py", line 67, in dispatch_line
17:39:56 [2020-07-04T21:39:56.326Z]     self.user_line(frame)
17:39:56 [2020-07-04T21:39:56.326Z]   File "<...>", line 241, in user_line
17:39:56 [2020-07-04T21:39:56.326Z]   File "<...>", line 296, in dispatch
17:39:56 [2020-07-04T21:39:56.326Z]   File "/home/jenkins/agent/workspace/ease.verify.core.target.2019-03/tests/org.eclipse.ease.lang.python.py4j.test/target/work/plugins/py4j-python_0.10.8.1-bnd-2odeag/src/py4j/java_gateway.py", line 1286, in __call__
17:39:56 [2020-07-04T21:39:56.326Z]     answer, self.gateway_client, self.target_id, self.name)
17:39:56 [2020-07-04T21:39:56.326Z]   File "/home/jenkins/agent/workspace/ease.verify.core.target.2019-03/tests/org.eclipse.ease.lang.python.py4j.test/target/work/plugins/py4j-python_0.10.8.1-bnd-2odeag/src/py4j/protocol.py", line 328, in get_return_value
17:39:56 [2020-07-04T21:39:56.326Z]     format(target_id, ".", name), value)
17:39:56 [2020-07-04T21:39:56.326Z] Py4JJavaError: An error occurred while calling o0.traceDispatch.
17:39:56 [2020-07-04T21:39:56.326Z] : org.eclipse.ease.ExitException: 
17:39:56 [2020-07-04T21:39:56.326Z] 	at org.eclipse.ease.debugging.AbstractEaseDebugger.handleEventsInSuspendedState(AbstractEaseDebugger.java:329)
17:39:56 [2020-07-04T21:39:56.326Z] 	at org.eclipse.ease.debugging.AbstractEaseDebugger.suspend(AbstractEaseDebugger.java:255)
17:39:56 [2020-07-04T21:39:56.327Z] 	at org.eclipse.ease.lang.python.py4j.internal.Py4jDebugger.suspend(Py4jDebugger.java:87)
17:39:56 [2020-07-04T21:39:56.327Z] 	at org.eclipse.ease.debugging.AbstractEaseDebugger.processLine(AbstractEaseDebugger.java:490)
17:39:56 [2020-07-04T21:39:56.327Z] 	at org.eclipse.ease.lang.python.debugger.PythonDebugger.traceDispatch(PythonDebugger.java:178)
17:39:56 [2020-07-04T21:39:56.327Z] 	at sun.reflect.GeneratedMethodAccessor12.invoke(Unknown Source)
17:39:56 [2020-07-04T21:39:56.327Z] 	at sun.reflect.DelegatingMethodAccessorImpl.invoke(DelegatingMethodAccessorImpl.java:43)
17:39:56 [2020-07-04T21:39:56.327Z] 	at java.lang.reflect.Method.invoke(Method.java:498)
17:39:56 [2020-07-04T21:39:56.327Z] 	at py4j.reflection.MethodInvoker.invoke(MethodInvoker.java:244)
17:39:56 [2020-07-04T21:39:56.327Z] 	at py4j.reflection.ReflectionEngine.invoke(ReflectionEngine.java:357)
17:39:56 [2020-07-04T21:39:56.327Z] 	at py4j.Gateway.invoke(Gateway.java:282)
17:39:56 [2020-07-04T21:39:56.327Z] 	at py4j.commands.AbstractCommand.invokeMethod(AbstractCommand.java:132)
17:39:56 [2020-07-04T21:39:56.327Z] 	at py4j.commands.CallCommand.execute(CallCommand.java:79)
17:39:56 [2020-07-04T21:39:56.327Z] 	at py4j.ClientServerConnection.sendCommand(ClientServerConnection.java:244)
17:39:56 [2020-07-04T21:39:56.327Z] 	at py4j.CallbackClient.sendCommand(CallbackClient.java:384)
17:39:56 [2020-07-04T21:39:56.327Z] 	at py4j.CallbackClient.sendCommand(CallbackClient.java:356)
17:39:56 [2020-07-04T21:39:56.327Z] 	at py4j.reflection.PythonProxyHandler.invoke(PythonProxyHandler.java:106)
17:39:56 [2020-07-04T21:39:56.327Z] 	at com.sun.proxy.$Proxy13.run(Unknown Source)
17:39:56 [2020-07-04T21:39:56.327Z] 	at org.eclipse.ease.lang.python.py4j.internal.Py4jDebugger.execute(Py4jDebugger.java:106)
17:39:56 [2020-07-04T21:39:56.327Z] 	at org.eclipse.ease.lang.python.py4j.internal.Py4jDebuggerEngine.internalExecute(Py4jDebuggerEngine.java:85)
17:39:56 [2020-07-04T21:39:56.327Z] 	at org.eclipse.ease.lang.python.py4j.internal.Py4jScriptEngine.execute(Py4jScriptEngine.java:226)
17:39:56 [2020-07-04T21:39:56.327Z] 	at org.eclipse.ease.AbstractScriptEngine.inject(AbstractScriptEngine.java:226)
17:39:56 [2020-07-04T21:39:56.327Z] 	at org.eclipse.ease.AbstractScriptEngine.run(AbstractScriptEngine.java:277)
17:39:56 [2020-07-04T21:39:56.327Z] 	at org.eclipse.core.internal.jobs.Worker.run(Worker.java:63)
17:39:56 [2020-07-04T21:39:56.327Z] 
17:39:56 [2020-07-04T21:39:56.327Z] 
17:39:56 [2020-07-04T21:39:56.327Z] 	at py4j.Protocol.getReturnValue(Protocol.java:476)
17:39:56 [2020-07-04T21:39:56.327Z] 	at py4j.reflection.PythonProxyHandler.invoke(PythonProxyHandler.java:108)
17:39:56 [2020-07-04T21:39:56.327Z] 	at com.sun.proxy.$Proxy13.run(Unknown Source)
17:39:56 [2020-07-04T21:39:56.327Z] 	at org.eclipse.ease.lang.python.py4j.internal.Py4jDebugger.execute(Py4jDebugger.java:106)
17:39:56 [2020-07-04T21:39:56.327Z] 	at org.eclipse.ease.lang.python.py4j.internal.Py4jDebuggerEngine.internalExecute(Py4jDebuggerEngine.java:85)
17:39:56 [2020-07-04T21:39:56.327Z] 	at org.eclipse.ease.lang.python.py4j.internal.Py4jScriptEngine.execute(Py4jScriptEngine.java:226)
17:39:56 [2020-07-04T21:39:56.327Z] 	at org.eclipse.ease.AbstractScriptEngine.inject(AbstractScriptEngine.java:226)
17:39:56 [2020-07-04T21:39:56.327Z] 	at org.eclipse.ease.AbstractScriptEngine.run(AbstractScriptEngine.java:277)
17:39:56 [2020-07-04T21:39:56.327Z] 	at org.eclipse.core.internal.jobs.Worker.run(Worker.java:63)
17:39:56 [2020-07-04T21:39:56.582Z] Start of script
17:39:56 [2020-07-04T21:39:56.582Z] include file start
17:39:56 [2020-07-04T21:39:56.582Z] include file processed
17:39:56 [2020-07-04T21:39:56.582Z] Result of testMethod = 5
17:39:56 [2020-07-04T21:39:56.582Z] End of script
17:39:56 [2020-07-04T21:39:56.838Z] py4j.Py4JException: An exception was raised by the Python Proxy. Return Message: Traceback (most recent call last):
17:39:56 [2020-07-04T21:39:56.838Z]   File "/home/jenkins/agent/workspace/ease.verify.core.target.2019-03/tests/org.eclipse.ease.lang.python.py4j.test/target/work/plugins/py4j-python_0.10.8.1-bnd-2odeag/src/py4j/clientserver.py", line 581, in _call_proxy
17:39:56 [2020-07-04T21:39:56.838Z]     return_value = getattr(self.pool[obj_id], method)(*params)
17:39:56 [2020-07-04T21:39:56.838Z]   File "<...>", line 424, in run
17:39:56 [2020-07-04T21:39:56.838Z]   File "/usr/lib64/python2.7/bdb.py", line 400, in run
17:39:56 [2020-07-04T21:39:56.839Z]     exec cmd in globals, locals
17:39:56 [2020-07-04T21:39:56.839Z]   File "__ref_L/Debug Test/Main.py_ppttviiwgj", line 1, in <module>
17:39:56 [2020-07-04T21:39:56.839Z]   File "__ref_L/Debug Test/Main.py_ppttviiwgj", line 1, in <module>
17:39:56 [2020-07-04T21:39:56.839Z]   File "<...>", line 231, in trace_dispatch
17:39:56 [2020-07-04T21:39:56.839Z]   File "/usr/lib64/python2.7/bdb.py", line 49, in trace_dispatch
17:39:56 [2020-07-04T21:39:56.839Z]     return self.dispatch_line(frame)
17:39:56 [2020-07-04T21:39:56.839Z]   File "/usr/lib64/python2.7/bdb.py", line 67, in dispatch_line
17:39:56 [2020-07-04T21:39:56.839Z]     self.user_line(frame)
17:39:56 [2020-07-04T21:39:56.839Z]   File "<...>", line 241, in user_line
17:39:56 [2020-07-04T21:39:56.839Z]   File "<...>", line 296, in dispatch
17:39:56 [2020-07-04T21:39:56.839Z]   File "/home/jenkins/agent/workspace/ease.verify.core.target.2019-03/tests/org.eclipse.ease.lang.python.py4j.test/target/work/plugins/py4j-python_0.10.8.1-bnd-2odeag/src/py4j/java_gateway.py", line 1286, in __call__
17:39:56 [2020-07-04T21:39:56.839Z]     answer, self.gateway_client, self.target_id, self.name)
17:39:56 [2020-07-04T21:39:56.839Z]   File "/home/jenkins/agent/workspace/ease.verify.core.target.2019-03/tests/org.eclipse.ease.lang.python.py4j.test/target/work/plugins/py4j-python_0.10.8.1-bnd-2odeag/src/py4j/protocol.py", line 328, in get_return_value
17:39:56 [2020-07-04T21:39:56.839Z]     format(target_id, ".", name), value)
17:39:56 [2020-07-04T21:39:56.839Z] Py4JJavaError: An error occurred while calling o0.traceDispatch.
17:39:56 [2020-07-04T21:39:56.839Z] : org.eclipse.ease.ExitException: 
17:39:56 [2020-07-04T21:39:56.839Z] 	at org.eclipse.ease.debugging.AbstractEaseDebugger.handleEventsInSuspendedState(AbstractEaseDebugger.java:329)
17:39:56 [2020-07-04T21:39:56.839Z] 	at org.eclipse.ease.debugging.AbstractEaseDebugger.suspend(AbstractEaseDebugger.java:255)
17:39:56 [2020-07-04T21:39:56.839Z] 	at org.eclipse.ease.lang.python.py4j.internal.Py4jDebugger.suspend(Py4jDebugger.java:87)
17:39:56 [2020-07-04T21:39:56.839Z] 	at org.eclipse.ease.debugging.AbstractEaseDebugger.processLine(AbstractEaseDebugger.java:490)
17:39:56 [2020-07-04T21:39:56.839Z] 	at org.eclipse.ease.lang.python.debugger.PythonDebugger.traceDispatch(PythonDebugger.java:178)
17:39:56 [2020-07-04T21:39:56.839Z] 	at sun.reflect.GeneratedMethodAccessor12.invoke(Unknown Source)
17:39:56 [2020-07-04T21:39:56.839Z] 	at sun.reflect.DelegatingMethodAccessorImpl.invoke(DelegatingMethodAccessorImpl.java:43)
17:39:56 [2020-07-04T21:39:56.839Z] 	at java.lang.reflect.Method.invoke(Method.java:498)
17:39:56 [2020-07-04T21:39:56.839Z] 	at py4j.reflection.MethodInvoker.invoke(MethodInvoker.java:244)
17:39:56 [2020-07-04T21:39:56.839Z] 	at py4j.reflection.ReflectionEngine.invoke(ReflectionEngine.java:357)
17:39:56 [2020-07-04T21:39:56.839Z] 	at py4j.Gateway.invoke(Gateway.java:282)
17:39:56 [2020-07-04T21:39:56.839Z] 	at py4j.commands.AbstractCommand.invokeMethod(AbstractCommand.java:132)
17:39:56 [2020-07-04T21:39:56.839Z] 	at py4j.commands.CallCommand.execute(CallCommand.java:79)
17:39:56 [2020-07-04T21:39:56.839Z] 	at py4j.ClientServerConnection.sendCommand(ClientServerConnection.java:244)
17:39:56 [2020-07-04T21:39:56.839Z] 	at py4j.CallbackClient.sendCommand(CallbackClient.java:384)
17:39:56 [2020-07-04T21:39:56.839Z] 	at py4j.CallbackClient.sendCommand(CallbackClient.java:356)
17:39:56 [2020-07-04T21:39:56.839Z] 	at py4j.reflection.PythonProxyHandler.invoke(PythonProxyHandler.java:106)
17:39:56 [2020-07-04T21:39:56.839Z] 	at com.sun.proxy.$Proxy13.run(Unknown Source)
17:39:56 [2020-07-04T21:39:56.839Z] 	at org.eclipse.ease.lang.python.py4j.internal.Py4jDebugger.execute(Py4jDebugger.java:106)
17:39:56 [2020-07-04T21:39:56.839Z] 	at org.eclipse.ease.lang.python.py4j.internal.Py4jDebuggerEngine.internalExecute(Py4jDebuggerEngine.java:85)
17:39:56 [2020-07-04T21:39:56.839Z] 	at org.eclipse.ease.lang.python.py4j.internal.Py4jScriptEngine.execute(Py4jScriptEngine.java:226)
17:39:56 [2020-07-04T21:39:56.839Z] 	at org.eclipse.ease.AbstractScriptEngine.inject(AbstractScriptEngine.java:226)
17:39:56 [2020-07-04T21:39:56.839Z] 	at org.eclipse.ease.AbstractScriptEngine.run(AbstractScriptEngine.java:277)
17:39:56 [2020-07-04T21:39:56.839Z] 	at org.eclipse.core.internal.jobs.Worker.run(Worker.java:63)
17:39:56 [2020-07-04T21:39:56.839Z] 
17:39:56 [2020-07-04T21:39:56.839Z] 
17:39:56 [2020-07-04T21:39:56.839Z] 	at py4j.Protocol.getReturnValue(Protocol.java:476)
17:39:56 [2020-07-04T21:39:56.839Z] 	at py4j.reflection.PythonProxyHandler.invoke(PythonProxyHandler.java:108)
17:39:56 [2020-07-04T21:39:56.839Z] 	at com.sun.proxy.$Proxy13.run(Unknown Source)
17:39:56 [2020-07-04T21:39:56.839Z] 	at org.eclipse.ease.lang.python.py4j.internal.Py4jDebugger.execute(Py4jDebugger.java:106)
17:39:56 [2020-07-04T21:39:56.839Z] 	at org.eclipse.ease.lang.python.py4j.internal.Py4jDebuggerEngine.internalExecute(Py4jDebuggerEngine.java:85)
17:39:56 [2020-07-04T21:39:56.839Z] 	at org.eclipse.ease.lang.python.py4j.internal.Py4jScriptEngine.execute(Py4jScriptEngine.java:226)
17:39:56 [2020-07-04T21:39:56.839Z] 	at org.eclipse.ease.AbstractScriptEngine.inject(AbstractScriptEngine.java:226)
17:39:56 [2020-07-04T21:39:56.839Z] 	at org.eclipse.ease.AbstractScriptEngine.run(AbstractScriptEngine.java:277)
17:39:56 [2020-07-04T21:39:56.839Z] 	at org.eclipse.core.internal.jobs.Worker.run(Worker.java:63)
17:39:57 [2020-07-04T21:39:57.094Z] Start of script
17:39:57 [2020-07-04T21:39:57.094Z] include file start
17:39:57 [2020-07-04T21:39:57.095Z] include file processed
17:39:57 [2020-07-04T21:39:57.095Z] Result of testMethod = 5
17:39:57 [2020-07-04T21:39:57.095Z] End of script
17:39:57 [2020-07-04T21:39:57.350Z] Start of script
17:39:57 [2020-07-04T21:39:57.350Z] include file start
17:39:57 [2020-07-04T21:39:57.350Z] include file processed
17:39:57 [2020-07-04T21:39:57.350Z] Result of testMethod = 5
17:39:57 [2020-07-04T21:39:57.350Z] End of script
17:39:57 [2020-07-04T21:39:57.606Z] py4j.Py4JException: An exception was raised by the Python Proxy. Return Message: Traceback (most recent call last):
17:39:57 [2020-07-04T21:39:57.606Z]   File "/home/jenkins/agent/workspace/ease.verify.core.target.2019-03/tests/org.eclipse.ease.lang.python.py4j.test/target/work/plugins/py4j-python_0.10.8.1-bnd-2odeag/src/py4j/clientserver.py", line 581, in _call_proxy
17:39:57 [2020-07-04T21:39:57.606Z]     return_value = getattr(self.pool[obj_id], method)(*params)
17:39:57 [2020-07-04T21:39:57.606Z]   File "<...>", line 424, in run
17:39:57 [2020-07-04T21:39:57.606Z]   File "/usr/lib64/python2.7/bdb.py", line 400, in run
17:39:57 [2020-07-04T21:39:57.606Z]     exec cmd in globals, locals
17:39:57 [2020-07-04T21:39:57.606Z]   File "__ref_L/Debug Test/Main.py_beqfgrlhwr", line 1, in <module>
17:39:57 [2020-07-04T21:39:57.606Z]   File "__ref_L/Debug Test/Main.py_beqfgrlhwr", line 1, in <module>
17:39:57 [2020-07-04T21:39:57.606Z]   File "<...>", line 231, in trace_dispatch
17:39:57 [2020-07-04T21:39:57.606Z]   File "/usr/lib64/python2.7/bdb.py", line 49, in trace_dispatch
17:39:57 [2020-07-04T21:39:57.606Z]     return self.dispatch_line(frame)
17:39:57 [2020-07-04T21:39:57.606Z]   File "/usr/lib64/python2.7/bdb.py", line 67, in dispatch_line
17:39:57 [2020-07-04T21:39:57.606Z]     self.user_line(frame)
17:39:57 [2020-07-04T21:39:57.606Z]   File "<...>", line 241, in user_line
17:39:57 [2020-07-04T21:39:57.606Z]   File "<...>", line 296, in dispatch
17:39:57 [2020-07-04T21:39:57.606Z]   File "/home/jenkins/agent/workspace/ease.verify.core.target.2019-03/tests/org.eclipse.ease.lang.python.py4j.test/target/work/plugins/py4j-python_0.10.8.1-bnd-2odeag/src/py4j/java_gateway.py", line 1286, in __call__
17:39:57 [2020-07-04T21:39:57.606Z]     answer, self.gateway_client, self.target_id, self.name)
17:39:57 [2020-07-04T21:39:57.606Z]   File "/home/jenkins/agent/workspace/ease.verify.core.target.2019-03/tests/org.eclipse.ease.lang.python.py4j.test/target/work/plugins/py4j-python_0.10.8.1-bnd-2odeag/src/py4j/protocol.py", line 328, in get_return_value
17:39:57 [2020-07-04T21:39:57.606Z]     format(target_id, ".", name), value)
17:39:57 [2020-07-04T21:39:57.606Z] Py4JJavaError: An error occurred while calling o0.traceDispatch.
17:39:57 [2020-07-04T21:39:57.606Z] : org.eclipse.ease.ExitException: 
17:39:57 [2020-07-04T21:39:57.606Z] 	at org.eclipse.ease.debugging.AbstractEaseDebugger.handleEventsInSuspendedState(AbstractEaseDebugger.java:329)
17:39:57 [2020-07-04T21:39:57.606Z] 	at org.eclipse.ease.debugging.AbstractEaseDebugger.suspend(AbstractEaseDebugger.java:255)
17:39:57 [2020-07-04T21:39:57.606Z] 	at org.eclipse.ease.lang.python.py4j.internal.Py4jDebugger.suspend(Py4jDebugger.java:87)
17:39:57 [2020-07-04T21:39:57.606Z] 	at org.eclipse.ease.debugging.AbstractEaseDebugger.processLine(AbstractEaseDebugger.java:490)
17:39:57 [2020-07-04T21:39:57.606Z] 	at org.eclipse.ease.lang.python.debugger.PythonDebugger.traceDispatch(PythonDebugger.java:178)
17:39:57 [2020-07-04T21:39:57.606Z] 	at sun.reflect.GeneratedMethodAccessor12.invoke(Unknown Source)
17:39:57 [2020-07-04T21:39:57.606Z] 	at sun.reflect.DelegatingMethodAccessorImpl.invoke(DelegatingMethodAccessorImpl.java:43)
17:39:57 [2020-07-04T21:39:57.606Z] 	at java.lang.reflect.Method.invoke(Method.java:498)
17:39:57 [2020-07-04T21:39:57.606Z] 	at py4j.reflection.MethodInvoker.invoke(MethodInvoker.java:244)
17:39:57 [2020-07-04T21:39:57.606Z] 	at py4j.reflection.ReflectionEngine.invoke(ReflectionEngine.java:357)
17:39:57 [2020-07-04T21:39:57.606Z] 	at py4j.Gateway.invoke(Gateway.java:282)
17:39:57 [2020-07-04T21:39:57.606Z] 	at py4j.commands.AbstractCommand.invokeMethod(AbstractCommand.java:132)
17:39:57 [2020-07-04T21:39:57.606Z] 	at py4j.commands.CallCommand.execute(CallCommand.java:79)
17:39:57 [2020-07-04T21:39:57.606Z] 	at py4j.ClientServerConnection.sendCommand(ClientServerConnection.java:244)
17:39:57 [2020-07-04T21:39:57.606Z] 	at py4j.CallbackClient.sendCommand(CallbackClient.java:384)
17:39:57 [2020-07-04T21:39:57.606Z] 	at py4j.CallbackClient.sendCommand(CallbackClient.java:356)
17:39:57 [2020-07-04T21:39:57.606Z] 	at py4j.reflection.PythonProxyHandler.invoke(PythonProxyHandler.java:106)
17:39:57 [2020-07-04T21:39:57.606Z] 	at com.sun.proxy.$Proxy13.run(Unknown Source)
17:39:57 [2020-07-04T21:39:57.606Z] 	at org.eclipse.ease.lang.python.py4j.internal.Py4jDebugger.execute(Py4jDebugger.java:106)
17:39:57 [2020-07-04T21:39:57.606Z] 	at org.eclipse.ease.lang.python.py4j.internal.Py4jDebuggerEngine.internalExecute(Py4jDebuggerEngine.java:85)
17:39:57 [2020-07-04T21:39:57.606Z] 	at org.eclipse.ease.lang.python.py4j.internal.Py4jScriptEngine.execute(Py4jScriptEngine.java:226)
17:39:57 [2020-07-04T21:39:57.606Z] 	at org.eclipse.ease.AbstractScriptEngine.inject(AbstractScriptEngine.java:226)
17:39:57 [2020-07-04T21:39:57.606Z] 	at org.eclipse.ease.AbstractScriptEngine.run(AbstractScriptEngine.java:277)
17:39:57 [2020-07-04T21:39:57.606Z] 	at org.eclipse.core.internal.jobs.Worker.run(Worker.java:63)
17:39:57 [2020-07-04T21:39:57.606Z] 
17:39:57 [2020-07-04T21:39:57.606Z] 
17:39:57 [2020-07-04T21:39:57.606Z] 	at py4j.Protocol.getReturnValue(Protocol.java:476)
17:39:57 [2020-07-04T21:39:57.606Z] 	at py4j.reflection.PythonProxyHandler.invoke(PythonProxyHandler.java:108)
17:39:57 [2020-07-04T21:39:57.606Z] 	at com.sun.proxy.$Proxy13.run(Unknown Source)
17:39:57 [2020-07-04T21:39:57.606Z] 	at org.eclipse.ease.lang.python.py4j.internal.Py4jDebugger.execute(Py4jDebugger.java:106)
17:39:57 [2020-07-04T21:39:57.606Z] 	at org.eclipse.ease.lang.python.py4j.internal.Py4jDebuggerEngine.internalExecute(Py4jDebuggerEngine.java:85)
17:39:57 [2020-07-04T21:39:57.606Z] 	at org.eclipse.ease.lang.python.py4j.internal.Py4jScriptEngine.execute(Py4jScriptEngine.java:226)
17:39:57 [2020-07-04T21:39:57.606Z] 	at org.eclipse.ease.AbstractScriptEngine.inject(AbstractScriptEngine.java:226)
17:39:57 [2020-07-04T21:39:57.606Z] 	at org.eclipse.ease.AbstractScriptEngine.run(AbstractScriptEngine.java:277)
17:39:57 [2020-07-04T21:39:57.606Z] 	at org.eclipse.core.internal.jobs.Worker.run(Worker.java:63)
17:39:57 [2020-07-04T21:39:57.862Z] Start of script
17:39:57 [2020-07-04T21:39:57.862Z] include file start
17:39:57 [2020-07-04T21:39:57.862Z] include file processed
17:39:57 [2020-07-04T21:39:57.862Z] Result of testMethod = 5
17:39:57 [2020-07-04T21:39:57.862Z] End of script
17:39:58 [2020-07-04T21:39:58.117Z] Start of script
17:39:58 [2020-07-04T21:39:58.117Z] include file start
17:39:58 [2020-07-04T21:39:58.117Z] include file processed
17:39:58 [2020-07-04T21:39:58.117Z] Result of testMethod = 5
17:39:58 [2020-07-04T21:39:58.117Z] End of script
17:39:58 [2020-07-04T21:39:58.373Z] Start of script
17:39:58 [2020-07-04T21:39:58.373Z] include file start
17:39:58 [2020-07-04T21:39:58.373Z] include file processed
17:39:58 [2020-07-04T21:39:58.373Z] Result of testMethod = 5
17:39:58 [2020-07-04T21:39:58.373Z] End of script
17:39:58 [2020-07-04T21:39:58.628Z] Start of script
17:39:58 [2020-07-04T21:39:58.628Z] include file start
17:39:58 [2020-07-04T21:39:58.628Z] include file processed
17:39:58 [2020-07-04T21:39:58.628Z] Result of testMethod = 5
17:39:58 [2020-07-04T21:39:58.628Z] End of script
17:39:58 [2020-07-04T21:39:58.628Z] Start of script
17:39:58 [2020-07-04T21:39:58.628Z] include file start
17:39:58 [2020-07-04T21:39:58.628Z] include file processed
17:39:58 [2020-07-04T21:39:58.886Z] Result of testMethod = 5
17:39:58 [2020-07-04T21:39:58.886Z] End of script
17:39:59 [2020-07-04T21:39:59.146Z] Start of script
17:39:59 [2020-07-04T21:39:59.147Z] include file start
17:39:59 [2020-07-04T21:39:59.147Z] include file processed
17:39:59 [2020-07-04T21:39:59.147Z] py4j.Py4JException: An exception was raised by the Python Proxy. Return Message: Traceback (most recent call last):
17:39:59 [2020-07-04T21:39:59.147Z]   File "/home/jenkins/agent/workspace/ease.verify.core.target.2019-03/tests/org.eclipse.ease.lang.python.py4j.test/target/work/plugins/py4j-python_0.10.8.1-bnd-2odeag/src/py4j/clientserver.py", line 581, in _call_proxy
17:39:59 [2020-07-04T21:39:59.147Z]     return_value = getattr(self.pool[obj_id], method)(*params)
17:39:59 [2020-07-04T21:39:59.147Z]   File "<...>", line 424, in run
17:39:59 [2020-07-04T21:39:59.147Z]   File "/usr/lib64/python2.7/bdb.py", line 400, in run
17:39:59 [2020-07-04T21:39:59.147Z]     exec cmd in globals, locals
17:39:59 [2020-07-04T21:39:59.147Z]   File "__ref_L/Debug Test/Main.py_qicjpekqek", line 21, in <module>
17:39:59 [2020-07-04T21:39:59.147Z]   File "__ref_L/Debug Test/Main.py_qicjpekqek", line 18, in testMethod
17:39:59 [2020-07-04T21:39:59.147Z]   File "__ref_L/Debug Test/Main.py_qicjpekqek", line 18, in testMethod
17:39:59 [2020-07-04T21:39:59.147Z]   File "<...>", line 231, in trace_dispatch
17:39:59 [2020-07-04T21:39:59.147Z]   File "/usr/lib64/python2.7/bdb.py", line 49, in trace_dispatch
17:39:59 [2020-07-04T21:39:59.147Z]     return self.dispatch_line(frame)
17:39:59 [2020-07-04T21:39:59.147Z]   File "/usr/lib64/python2.7/bdb.py", line 67, in dispatch_line
17:39:59 [2020-07-04T21:39:59.147Z]     self.user_line(frame)
17:39:59 [2020-07-04T21:39:59.147Z]   File "<...>", line 241, in user_line
17:39:59 [2020-07-04T21:39:59.147Z]   File "<...>", line 296, in dispatch
17:39:59 [2020-07-04T21:39:59.147Z]   File "/home/jenkins/agent/workspace/ease.verify.core.target.2019-03/tests/org.eclipse.ease.lang.python.py4j.test/target/work/plugins/py4j-python_0.10.8.1-bnd-2odeag/src/py4j/java_gateway.py", line 1286, in __call__
17:39:59 [2020-07-04T21:39:59.147Z]     answer, self.gateway_client, self.target_id, self.name)
17:39:59 [2020-07-04T21:39:59.147Z]   File "/home/jenkins/agent/workspace/ease.verify.core.target.2019-03/tests/org.eclipse.ease.lang.python.py4j.test/target/work/plugins/py4j-python_0.10.8.1-bnd-2odeag/src/py4j/protocol.py", line 328, in get_return_value
17:39:59 [2020-07-04T21:39:59.147Z]     format(target_id, ".", name), value)
17:39:59 [2020-07-04T21:39:59.147Z] Py4JJavaError: An error occurred while calling o0.traceDispatch.
17:39:59 [2020-07-04T21:39:59.147Z] : org.eclipse.ease.ExitException: 
17:39:59 [2020-07-04T21:39:59.147Z] 	at org.eclipse.ease.debugging.AbstractEaseDebugger.handleEventsInSuspendedState(AbstractEaseDebugger.java:329)
17:39:59 [2020-07-04T21:39:59.147Z] 	at org.eclipse.ease.debugging.AbstractEaseDebugger.suspend(AbstractEaseDebugger.java:255)
17:39:59 [2020-07-04T21:39:59.147Z] 	at org.eclipse.ease.lang.python.py4j.internal.Py4jDebugger.suspend(Py4jDebugger.java:87)
17:39:59 [2020-07-04T21:39:59.147Z] 	at org.eclipse.ease.debugging.AbstractEaseDebugger.processLine(AbstractEaseDebugger.java:490)
17:39:59 [2020-07-04T21:39:59.147Z] 	at org.eclipse.ease.lang.python.debugger.PythonDebugger.traceDispatch(PythonDebugger.java:178)
17:39:59 [2020-07-04T21:39:59.147Z] 	at sun.reflect.GeneratedMethodAccessor12.invoke(Unknown Source)
17:39:59 [2020-07-04T21:39:59.147Z] 	at sun.reflect.DelegatingMethodAccessorImpl.invoke(DelegatingMethodAccessorImpl.java:43)
17:39:59 [2020-07-04T21:39:59.147Z] 	at java.lang.reflect.Method.invoke(Method.java:498)
17:39:59 [2020-07-04T21:39:59.147Z] 	at py4j.reflection.MethodInvoker.invoke(MethodInvoker.java:244)
17:39:59 [2020-07-04T21:39:59.147Z] 	at py4j.reflection.ReflectionEngine.invoke(ReflectionEngine.java:357)
17:39:59 [2020-07-04T21:39:59.147Z] 	at py4j.Gateway.invoke(Gateway.java:282)
17:39:59 [2020-07-04T21:39:59.147Z] 	at py4j.commands.AbstractCommand.invokeMethod(AbstractCommand.java:132)
17:39:59 [2020-07-04T21:39:59.147Z] 	at py4j.commands.CallCommand.execute(CallCommand.java:79)
17:39:59 [2020-07-04T21:39:59.147Z] 	at py4j.ClientServerConnection.sendCommand(ClientServerConnection.java:244)
17:39:59 [2020-07-04T21:39:59.147Z] 	at py4j.CallbackClient.sendCommand(CallbackClient.java:384)
17:39:59 [2020-07-04T21:39:59.147Z] 	at py4j.CallbackClient.sendCommand(CallbackClient.java:356)
17:39:59 [2020-07-04T21:39:59.147Z] 	at py4j.reflection.PythonProxyHandler.invoke(PythonProxyHandler.java:106)
17:39:59 [2020-07-04T21:39:59.147Z] 	at com.sun.proxy.$Proxy13.run(Unknown Source)
17:39:59 [2020-07-04T21:39:59.147Z] 	at org.eclipse.ease.lang.python.py4j.internal.Py4jDebugger.execute(Py4jDebugger.java:106)
17:39:59 [2020-07-04T21:39:59.147Z] 	at org.eclipse.ease.lang.python.py4j.internal.Py4jDebuggerEngine.internalExecute(Py4jDebuggerEngine.java:85)
17:39:59 [2020-07-04T21:39:59.147Z] 	at org.eclipse.ease.lang.python.py4j.internal.Py4jScriptEngine.execute(Py4jScriptEngine.java:226)
17:39:59 [2020-07-04T21:39:59.147Z] 	at org.eclipse.ease.AbstractScriptEngine.inject(AbstractScriptEngine.java:226)
17:39:59 [2020-07-04T21:39:59.147Z] 	at org.eclipse.ease.AbstractScriptEngine.run(AbstractScriptEngine.java:277)
17:39:59 [2020-07-04T21:39:59.147Z] 	at org.eclipse.core.internal.jobs.Worker.run(Worker.java:63)
17:39:59 [2020-07-04T21:39:59.147Z] 
17:39:59 [2020-07-04T21:39:59.147Z] 
17:39:59 [2020-07-04T21:39:59.147Z] 	at py4j.Protocol.getReturnValue(Protocol.java:476)
17:39:59 [2020-07-04T21:39:59.147Z] 	at py4j.reflection.PythonProxyHandler.invoke(PythonProxyHandler.java:108)
17:39:59 [2020-07-04T21:39:59.147Z] 	at com.sun.proxy.$Proxy13.run(Unknown Source)
17:39:59 [2020-07-04T21:39:59.147Z] 	at org.eclipse.ease.lang.python.py4j.internal.Py4jDebugger.execute(Py4jDebugger.java:106)
17:39:59 [2020-07-04T21:39:59.147Z] 	at org.eclipse.ease.lang.python.py4j.internal.Py4jDebuggerEngine.internalExecute(Py4jDebuggerEngine.java:85)
17:39:59 [2020-07-04T21:39:59.147Z] 	at org.eclipse.ease.lang.python.py4j.internal.Py4jScriptEngine.execute(Py4jScriptEngine.java:226)
17:39:59 [2020-07-04T21:39:59.147Z] 	at org.eclipse.ease.AbstractScriptEngine.inject(AbstractScriptEngine.java:226)
17:39:59 [2020-07-04T21:39:59.147Z] 	at org.eclipse.ease.AbstractScriptEngine.run(AbstractScriptEngine.java:277)
17:39:59 [2020-07-04T21:39:59.147Z] 	at org.eclipse.core.internal.jobs.Worker.run(Worker.java:63)
17:39:59 [2020-07-04T21:39:59.416Z] Start of script
17:39:59 [2020-07-04T21:39:59.416Z] include file start
17:39:59 [2020-07-04T21:39:59.416Z] include file processed
17:39:59 [2020-07-04T21:39:59.416Z] Result of testMethod = 5
17:39:59 [2020-07-04T21:39:59.416Z] py4j.Py4JException: An exception was raised by the Python Proxy. Return Message: Traceback (most recent call last):
17:39:59 [2020-07-04T21:39:59.416Z]   File "/home/jenkins/agent/workspace/ease.verify.core.target.2019-03/tests/org.eclipse.ease.lang.python.py4j.test/target/work/plugins/py4j-python_0.10.8.1-bnd-2odeag/src/py4j/clientserver.py", line 581, in _call_proxy
17:39:59 [2020-07-04T21:39:59.416Z]     return_value = getattr(self.pool[obj_id], method)(*params)
17:39:59 [2020-07-04T21:39:59.416Z]   File "<...>", line 424, in run
17:39:59 [2020-07-04T21:39:59.416Z]   File "/usr/lib64/python2.7/bdb.py", line 400, in run
17:39:59 [2020-07-04T21:39:59.416Z]     exec cmd in globals, locals
17:39:59 [2020-07-04T21:39:59.416Z]   File "__ref_L/Debug Test/Main.py_lithpnndbq", line 23, in <module>
17:39:59 [2020-07-04T21:39:59.416Z]   File "__ref_L/Debug Test/Main.py_lithpnndbq", line 23, in <module>
17:39:59 [2020-07-04T21:39:59.416Z]   File "<...>", line 231, in trace_dispatch
17:39:59 [2020-07-04T21:39:59.416Z]   File "/usr/lib64/python2.7/bdb.py", line 49, in trace_dispatch
17:39:59 [2020-07-04T21:39:59.416Z]     return self.dispatch_line(frame)
17:39:59 [2020-07-04T21:39:59.416Z]   File "/usr/lib64/python2.7/bdb.py", line 67, in dispatch_line
17:39:59 [2020-07-04T21:39:59.416Z]     self.user_line(frame)
17:39:59 [2020-07-04T21:39:59.416Z]   File "<...>", line 241, in user_line
17:39:59 [2020-07-04T21:39:59.416Z]   File "<...>", line 296, in dispatch
17:39:59 [2020-07-04T21:39:59.416Z]   File "/home/jenkins/agent/workspace/ease.verify.core.target.2019-03/tests/org.eclipse.ease.lang.python.py4j.test/target/work/plugins/py4j-python_0.10.8.1-bnd-2odeag/src/py4j/java_gateway.py", line 1286, in __call__
17:39:59 [2020-07-04T21:39:59.416Z]     answer, self.gateway_client, self.target_id, self.name)
17:39:59 [2020-07-04T21:39:59.416Z]   File "/home/jenkins/agent/workspace/ease.verify.core.target.2019-03/tests/org.eclipse.ease.lang.python.py4j.test/target/work/plugins/py4j-python_0.10.8.1-bnd-2odeag/src/py4j/protocol.py", line 328, in get_return_value
17:39:59 [2020-07-04T21:39:59.416Z]     format(target_id, ".", name), value)
17:39:59 [2020-07-04T21:39:59.416Z] Py4JJavaError: An error occurred while calling o0.traceDispatch.
17:39:59 [2020-07-04T21:39:59.416Z] : org.eclipse.ease.ExitException: 
17:39:59 [2020-07-04T21:39:59.416Z] 	at org.eclipse.ease.debugging.AbstractEaseDebugger.handleEventsInSuspendedState(AbstractEaseDebugger.java:329)
17:39:59 [2020-07-04T21:39:59.416Z] 	at org.eclipse.ease.debugging.AbstractEaseDebugger.suspend(AbstractEaseDebugger.java:255)
17:39:59 [2020-07-04T21:39:59.416Z] 	at org.eclipse.ease.lang.python.py4j.internal.Py4jDebugger.suspend(Py4jDebugger.java:87)
17:39:59 [2020-07-04T21:39:59.416Z] 	at org.eclipse.ease.debugging.AbstractEaseDebugger.processLine(AbstractEaseDebugger.java:490)
17:39:59 [2020-07-04T21:39:59.416Z] 	at org.eclipse.ease.lang.python.debugger.PythonDebugger.traceDispatch(PythonDebugger.java:178)
17:39:59 [2020-07-04T21:39:59.416Z] 	at sun.reflect.GeneratedMethodAccessor12.invoke(Unknown Source)
17:39:59 [2020-07-04T21:39:59.416Z] 	at sun.reflect.DelegatingMethodAccessorImpl.invoke(DelegatingMethodAccessorImpl.java:43)
17:39:59 [2020-07-04T21:39:59.416Z] 	at java.lang.reflect.Method.invoke(Method.java:498)
17:39:59 [2020-07-04T21:39:59.416Z] 	at py4j.reflection.MethodInvoker.invoke(MethodInvoker.java:244)
17:39:59 [2020-07-04T21:39:59.416Z] 	at py4j.reflection.ReflectionEngine.invoke(ReflectionEngine.java:357)
17:39:59 [2020-07-04T21:39:59.416Z] 	at py4j.Gateway.invoke(Gateway.java:282)
17:39:59 [2020-07-04T21:39:59.416Z] 	at py4j.commands.AbstractCommand.invokeMethod(AbstractCommand.java:132)
17:39:59 [2020-07-04T21:39:59.416Z] 	at py4j.commands.CallCommand.execute(CallCommand.java:79)
17:39:59 [2020-07-04T21:39:59.416Z] 	at py4j.ClientServerConnection.sendCommand(ClientServerConnection.java:244)
17:39:59 [2020-07-04T21:39:59.416Z] 	at py4j.CallbackClient.sendCommand(CallbackClient.java:384)
17:39:59 [2020-07-04T21:39:59.416Z] 	at py4j.CallbackClient.sendCommand(CallbackClient.java:356)
17:39:59 [2020-07-04T21:39:59.416Z] 	at py4j.reflection.PythonProxyHandler.invoke(PythonProxyHandler.java:106)
17:39:59 [2020-07-04T21:39:59.416Z] 	at com.sun.proxy.$Proxy13.run(Unknown Source)
17:39:59 [2020-07-04T21:39:59.416Z] 	at org.eclipse.ease.lang.python.py4j.internal.Py4jDebugger.execute(Py4jDebugger.java:106)
17:39:59 [2020-07-04T21:39:59.416Z] 	at org.eclipse.ease.lang.python.py4j.internal.Py4jDebuggerEngine.internalExecute(Py4jDebuggerEngine.java:85)
17:39:59 [2020-07-04T21:39:59.416Z] 	at org.eclipse.ease.lang.python.py4j.internal.Py4jScriptEngine.execute(Py4jScriptEngine.java:226)
17:39:59 [2020-07-04T21:39:59.416Z] 	at org.eclipse.ease.AbstractScriptEngine.inject(AbstractScriptEngine.java:226)
17:39:59 [2020-07-04T21:39:59.416Z] 	at org.eclipse.ease.AbstractScriptEngine.run(AbstractScriptEngine.java:277)
17:39:59 [2020-07-04T21:39:59.416Z] 	at org.eclipse.core.internal.jobs.Worker.run(Worker.java:63)
17:39:59 [2020-07-04T21:39:59.416Z] 
17:39:59 [2020-07-04T21:39:59.416Z] 
17:39:59 [2020-07-04T21:39:59.416Z] 	at py4j.Protocol.getReturnValue(Protocol.java:476)
17:39:59 [2020-07-04T21:39:59.416Z] 	at py4j.reflection.PythonProxyHandler.invoke(PythonProxyHandler.java:108)
17:39:59 [2020-07-04T21:39:59.416Z] 	at com.sun.proxy.$Proxy13.run(Unknown Source)
17:39:59 [2020-07-04T21:39:59.416Z] 	at org.eclipse.ease.lang.python.py4j.internal.Py4jDebugger.execute(Py4jDebugger.java:106)
17:39:59 [2020-07-04T21:39:59.416Z] 	at org.eclipse.ease.lang.python.py4j.internal.Py4jDebuggerEngine.internalExecute(Py4jDebuggerEngine.java:85)
17:39:59 [2020-07-04T21:39:59.416Z] 	at org.eclipse.ease.lang.python.py4j.internal.Py4jScriptEngine.execute(Py4jScriptEngine.java:226)
17:39:59 [2020-07-04T21:39:59.416Z] 	at org.eclipse.ease.AbstractScriptEngine.inject(AbstractScriptEngine.java:226)
17:39:59 [2020-07-04T21:39:59.416Z] 	at org.eclipse.ease.AbstractScriptEngine.run(AbstractScriptEngine.java:277)
17:39:59 [2020-07-04T21:39:59.416Z] 	at org.eclipse.core.internal.jobs.Worker.run(Worker.java:63)
17:39:59 [2020-07-04T21:39:59.672Z] Start of script
17:39:59 [2020-07-04T21:39:59.672Z] include file start
17:39:59 [2020-07-04T21:39:59.672Z] include file processed
17:39:59 [2020-07-04T21:39:59.672Z] Result of testMethod = 5
17:39:59 [2020-07-04T21:39:59.672Z] End of script
17:39:59 [2020-07-04T21:39:59.927Z] Start of script
17:39:59 [2020-07-04T21:39:59.927Z] include file start
17:39:59 [2020-07-04T21:39:59.927Z] include file processed
17:39:59 [2020-07-04T21:39:59.927Z] Result of testMethod = 5
17:39:59 [2020-07-04T21:39:59.927Z] End of script
17:40:00 [2020-07-04T21:40:00.182Z] Start of script
17:40:00 [2020-07-04T21:40:00.182Z] include file start
17:40:00 [2020-07-04T21:40:00.182Z] include file processed
17:40:00 [2020-07-04T21:40:00.182Z] Result of testMethod = 5
17:40:00 [2020-07-04T21:40:00.182Z] End of script
17:40:00 [2020-07-04T21:40:00.438Z] Start of script
17:40:00 [2020-07-04T21:40:00.438Z] include file start
17:40:00 [2020-07-04T21:40:00.438Z] include file processed
17:40:00 [2020-07-04T21:40:00.438Z] Result of testMethod = 5
17:40:00 [2020-07-04T21:40:00.438Z] End of script
17:40:00 [2020-07-04T21:40:00.694Z] Start of script
17:40:00 [2020-07-04T21:40:00.694Z] include file start
17:40:00 [2020-07-04T21:40:00.694Z] include file processed
17:40:00 [2020-07-04T21:40:00.694Z] Result of testMethod = 5
17:40:00 [2020-07-04T21:40:00.694Z] py4j.Py4JException: An exception was raised by the Python Proxy. Return Message: Traceback (most recent call last):
17:40:00 [2020-07-04T21:40:00.694Z]   File "/home/jenkins/agent/workspace/ease.verify.core.target.2019-03/tests/org.eclipse.ease.lang.python.py4j.test/target/work/plugins/py4j-python_0.10.8.1-bnd-2odeag/src/py4j/clientserver.py", line 581, in _call_proxy
17:40:00 [2020-07-04T21:40:00.694Z]     return_value = getattr(self.pool[obj_id], method)(*params)
17:40:00 [2020-07-04T21:40:00.694Z]   File "<...>", line 424, in run
17:40:00 [2020-07-04T21:40:00.694Z]   File "/usr/lib64/python2.7/bdb.py", line 400, in run
17:40:00 [2020-07-04T21:40:00.694Z]     exec cmd in globals, locals
17:40:00 [2020-07-04T21:40:00.694Z]   File "__ref_L/Debug Test/Main.py_epitcxvsmb", line 23, in <module>
17:40:00 [2020-07-04T21:40:00.694Z]   File "__ref_L/Debug Test/Main.py_epitcxvsmb", line 23, in <module>
17:40:00 [2020-07-04T21:40:00.694Z]   File "<...>", line 231, in trace_dispatch
17:40:00 [2020-07-04T21:40:00.694Z]   File "/usr/lib64/python2.7/bdb.py", line 49, in trace_dispatch
17:40:00 [2020-07-04T21:40:00.694Z]     return self.dispatch_line(frame)
17:40:00 [2020-07-04T21:40:00.694Z]   File "/usr/lib64/python2.7/bdb.py", line 67, in dispatch_line
17:40:00 [2020-07-04T21:40:00.694Z]     self.user_line(frame)
17:40:00 [2020-07-04T21:40:00.694Z]   File "<...>", line 241, in user_line
17:40:00 [2020-07-04T21:40:00.694Z]   File "<...>", line 296, in dispatch
17:40:00 [2020-07-04T21:40:00.694Z]   File "/home/jenkins/agent/workspace/ease.verify.core.target.2019-03/tests/org.eclipse.ease.lang.python.py4j.test/target/work/plugins/py4j-python_0.10.8.1-bnd-2odeag/src/py4j/java_gateway.py", line 1286, in __call__
17:40:00 [2020-07-04T21:40:00.694Z]     answer, self.gateway_client, self.target_id, self.name)
17:40:00 [2020-07-04T21:40:00.694Z]   File "/home/jenkins/agent/workspace/ease.verify.core.target.2019-03/tests/org.eclipse.ease.lang.python.py4j.test/target/work/plugins/py4j-python_0.10.8.1-bnd-2odeag/src/py4j/protocol.py", line 328, in get_return_value
17:40:00 [2020-07-04T21:40:00.694Z]     format(target_id, ".", name), value)
17:40:00 [2020-07-04T21:40:00.694Z] Py4JJavaError: An error occurred while calling o0.traceDispatch.
17:40:00 [2020-07-04T21:40:00.694Z] : org.eclipse.ease.ExitException: 
17:40:00 [2020-07-04T21:40:00.695Z] 	at org.eclipse.ease.debugging.AbstractEaseDebugger.handleEventsInSuspendedState(AbstractEaseDebugger.java:329)
17:40:00 [2020-07-04T21:40:00.695Z] 	at org.eclipse.ease.debugging.AbstractEaseDebugger.suspend(AbstractEaseDebugger.java:255)
17:40:00 [2020-07-04T21:40:00.695Z] 	at org.eclipse.ease.lang.python.py4j.internal.Py4jDebugger.suspend(Py4jDebugger.java:87)
17:40:00 [2020-07-04T21:40:00.695Z] 	at org.eclipse.ease.debugging.AbstractEaseDebugger.processLine(AbstractEaseDebugger.java:490)
17:40:00 [2020-07-04T21:40:00.695Z] 	at org.eclipse.ease.lang.python.debugger.PythonDebugger.traceDispatch(PythonDebugger.java:178)
17:40:00 [2020-07-04T21:40:00.695Z] 	at sun.reflect.GeneratedMethodAccessor12.invoke(Unknown Source)
17:40:00 [2020-07-04T21:40:00.695Z] 	at sun.reflect.DelegatingMethodAccessorImpl.invoke(DelegatingMethodAccessorImpl.java:43)
17:40:00 [2020-07-04T21:40:00.695Z] 	at java.lang.reflect.Method.invoke(Method.java:498)
17:40:00 [2020-07-04T21:40:00.695Z] 	at py4j.reflection.MethodInvoker.invoke(MethodInvoker.java:244)
17:40:00 [2020-07-04T21:40:00.695Z] 	at py4j.reflection.ReflectionEngine.invoke(ReflectionEngine.java:357)
17:40:00 [2020-07-04T21:40:00.695Z] 	at py4j.Gateway.invoke(Gateway.java:282)
17:40:00 [2020-07-04T21:40:00.695Z] 	at py4j.commands.AbstractCommand.invokeMethod(AbstractCommand.java:132)
17:40:00 [2020-07-04T21:40:00.695Z] 	at py4j.commands.CallCommand.execute(CallCommand.java:79)
17:40:00 [2020-07-04T21:40:00.695Z] 	at py4j.ClientServerConnection.sendCommand(ClientServerConnection.java:244)
17:40:00 [2020-07-04T21:40:00.695Z] 	at py4j.CallbackClient.sendCommand(CallbackClient.java:384)
17:40:00 [2020-07-04T21:40:00.695Z] 	at py4j.CallbackClient.sendCommand(CallbackClient.java:356)
17:40:00 [2020-07-04T21:40:00.695Z] 	at py4j.reflection.PythonProxyHandler.invoke(PythonProxyHandler.java:106)
17:40:00 [2020-07-04T21:40:00.695Z] 	at com.sun.proxy.$Proxy13.run(Unknown Source)
17:40:00 [2020-07-04T21:40:00.695Z] 	at org.eclipse.ease.lang.python.py4j.internal.Py4jDebugger.execute(Py4jDebugger.java:106)
17:40:00 [2020-07-04T21:40:00.695Z] 	at org.eclipse.ease.lang.python.py4j.internal.Py4jDebuggerEngine.internalExecute(Py4jDebuggerEngine.java:85)
17:40:00 [2020-07-04T21:40:00.695Z] 	at org.eclipse.ease.lang.python.py4j.internal.Py4jScriptEngine.execute(Py4jScriptEngine.java:226)
17:40:00 [2020-07-04T21:40:00.695Z] 	at org.eclipse.ease.AbstractScriptEngine.inject(AbstractScriptEngine.java:226)
17:40:00 [2020-07-04T21:40:00.695Z] 	at org.eclipse.ease.AbstractScriptEngine.run(AbstractScriptEngine.java:277)
17:40:00 [2020-07-04T21:40:00.695Z] 	at org.eclipse.core.internal.jobs.Worker.run(Worker.java:63)
17:40:00 [2020-07-04T21:40:00.695Z] 
17:40:00 [2020-07-04T21:40:00.695Z] 
17:40:00 [2020-07-04T21:40:00.695Z] 	at py4j.Protocol.getReturnValue(Protocol.java:476)
17:40:00 [2020-07-04T21:40:00.695Z] 	at py4j.reflection.PythonProxyHandler.invoke(PythonProxyHandler.java:108)
17:40:00 [2020-07-04T21:40:00.695Z] 	at com.sun.proxy.$Proxy13.run(Unknown Source)
17:40:00 [2020-07-04T21:40:00.695Z] 	at org.eclipse.ease.lang.python.py4j.internal.Py4jDebugger.execute(Py4jDebugger.java:106)
17:40:00 [2020-07-04T21:40:00.695Z] 	at org.eclipse.ease.lang.python.py4j.internal.Py4jDebuggerEngine.internalExecute(Py4jDebuggerEngine.java:85)
17:40:00 [2020-07-04T21:40:00.695Z] 	at org.eclipse.ease.lang.python.py4j.internal.Py4jScriptEngine.execute(Py4jScriptEngine.java:226)
17:40:00 [2020-07-04T21:40:00.695Z] 	at org.eclipse.ease.AbstractScriptEngine.inject(AbstractScriptEngine.java:226)
17:40:00 [2020-07-04T21:40:00.695Z] 	at org.eclipse.ease.AbstractScriptEngine.run(AbstractScriptEngine.java:277)
17:40:00 [2020-07-04T21:40:00.695Z] 	at org.eclipse.core.internal.jobs.Worker.run(Worker.java:63)
17:40:00 [2020-07-04T21:40:00.963Z] Start of script
17:40:00 [2020-07-04T21:40:00.963Z] include file start
17:40:00 [2020-07-04T21:40:00.963Z] include file processed
17:40:00 [2020-07-04T21:40:00.963Z] Result of testMethod = 5
17:40:00 [2020-07-04T21:40:00.963Z] End of script
17:40:01 [2020-07-04T21:40:01.218Z] py4j.Py4JException: An exception was raised by the Python Proxy. Return Message: Traceback (most recent call last):
17:40:01 [2020-07-04T21:40:01.218Z]   File "/home/jenkins/agent/workspace/ease.verify.core.target.2019-03/tests/org.eclipse.ease.lang.python.py4j.test/target/work/plugins/py4j-python_0.10.8.1-bnd-2odeag/src/py4j/clientserver.py", line 581, in _call_proxy
17:40:01 [2020-07-04T21:40:01.218Z]     return_value = getattr(self.pool[obj_id], method)(*params)
17:40:01 [2020-07-04T21:40:01.218Z]   File "<...>", line 424, in run
17:40:01 [2020-07-04T21:40:01.218Z]   File "/usr/lib64/python2.7/bdb.py", line 400, in run
17:40:01 [2020-07-04T21:40:01.218Z]     exec cmd in globals, locals
17:40:01 [2020-07-04T21:40:01.218Z]   File "__ref_L/Debug Test/Main.py_fxlyobmkam", line 1, in <module>
17:40:01 [2020-07-04T21:40:01.218Z]   File "__ref_L/Debug Test/Main.py_fxlyobmkam", line 1, in <module>
17:40:01 [2020-07-04T21:40:01.218Z]   File "<...>", line 231, in trace_dispatch
17:40:01 [2020-07-04T21:40:01.218Z]   File "/usr/lib64/python2.7/bdb.py", line 49, in trace_dispatch
17:40:01 [2020-07-04T21:40:01.218Z]     return self.dispatch_line(frame)
17:40:01 [2020-07-04T21:40:01.218Z]   File "/usr/lib64/python2.7/bdb.py", line 67, in dispatch_line
17:40:01 [2020-07-04T21:40:01.218Z]     self.user_line(frame)
17:40:01 [2020-07-04T21:40:01.218Z]   File "<...>", line 241, in user_line
17:40:01 [2020-07-04T21:40:01.218Z]   File "<...>", line 296, in dispatch
17:40:01 [2020-07-04T21:40:01.218Z]   File "/home/jenkins/agent/workspace/ease.verify.core.target.2019-03/tests/org.eclipse.ease.lang.python.py4j.test/target/work/plugins/py4j-python_0.10.8.1-bnd-2odeag/src/py4j/java_gateway.py", line 1286, in __call__
17:40:01 [2020-07-04T21:40:01.218Z]     answer, self.gateway_client, self.target_id, self.name)
17:40:01 [2020-07-04T21:40:01.218Z]   File "/home/jenkins/agent/workspace/ease.verify.core.target.2019-03/tests/org.eclipse.ease.lang.python.py4j.test/target/work/plugins/py4j-python_0.10.8.1-bnd-2odeag/src/py4j/protocol.py", line 328, in get_return_value
17:40:01 [2020-07-04T21:40:01.218Z]     format(target_id, ".", name), value)
17:40:01 [2020-07-04T21:40:01.218Z] Py4JJavaError: An error occurred while calling o0.traceDispatch.
17:40:01 [2020-07-04T21:40:01.218Z] : org.eclipse.ease.ExitException: 
17:40:01 [2020-07-04T21:40:01.219Z] 	at org.eclipse.ease.debugging.AbstractEaseDebugger.handleEventsInSuspendedState(AbstractEaseDebugger.java:329)
17:40:01 [2020-07-04T21:40:01.219Z] 	at org.eclipse.ease.debugging.AbstractEaseDebugger.suspend(AbstractEaseDebugger.java:255)
17:40:01 [2020-07-04T21:40:01.219Z] 	at org.eclipse.ease.lang.python.py4j.internal.Py4jDebugger.suspend(Py4jDebugger.java:87)
17:40:01 [2020-07-04T21:40:01.219Z] 	at org.eclipse.ease.debugging.AbstractEaseDebugger.processLine(AbstractEaseDebugger.java:490)
17:40:01 [2020-07-04T21:40:01.219Z] 	at org.eclipse.ease.lang.python.debugger.PythonDebugger.traceDispatch(PythonDebugger.java:178)
17:40:01 [2020-07-04T21:40:01.219Z] 	at sun.reflect.GeneratedMethodAccessor12.invoke(Unknown Source)
17:40:01 [2020-07-04T21:40:01.219Z] 	at sun.reflect.DelegatingMethodAccessorImpl.invoke(DelegatingMethodAccessorImpl.java:43)
17:40:01 [2020-07-04T21:40:01.219Z] 	at java.lang.reflect.Method.invoke(Method.java:498)
17:40:01 [2020-07-04T21:40:01.219Z] 	at py4j.reflection.MethodInvoker.invoke(MethodInvoker.java:244)
17:40:01 [2020-07-04T21:40:01.219Z] 	at py4j.reflection.ReflectionEngine.invoke(ReflectionEngine.java:357)
17:40:01 [2020-07-04T21:40:01.219Z] 	at py4j.Gateway.invoke(Gateway.java:282)
17:40:01 [2020-07-04T21:40:01.219Z] 	at py4j.commands.AbstractCommand.invokeMethod(AbstractCommand.java:132)
17:40:01 [2020-07-04T21:40:01.219Z] 	at py4j.commands.CallCommand.execute(CallCommand.java:79)
17:40:01 [2020-07-04T21:40:01.219Z] 	at py4j.ClientServerConnection.sendCommand(ClientServerConnection.java:244)
17:40:01 [2020-07-04T21:40:01.219Z] 	at py4j.CallbackClient.sendCommand(CallbackClient.java:384)
17:40:01 [2020-07-04T21:40:01.219Z] 	at py4j.CallbackClient.sendCommand(CallbackClient.java:356)
17:40:01 [2020-07-04T21:40:01.219Z] 	at py4j.reflection.PythonProxyHandler.invoke(PythonProxyHandler.java:106)
17:40:01 [2020-07-04T21:40:01.219Z] 	at com.sun.proxy.$Proxy13.run(Unknown Source)
17:40:01 [2020-07-04T21:40:01.219Z] 	at org.eclipse.ease.lang.python.py4j.internal.Py4jDebugger.execute(Py4jDebugger.java:106)
17:40:01 [2020-07-04T21:40:01.219Z] 	at org.eclipse.ease.lang.python.py4j.internal.Py4jDebuggerEngine.internalExecute(Py4jDebuggerEngine.java:85)
17:40:01 [2020-07-04T21:40:01.219Z] 	at org.eclipse.ease.lang.python.py4j.internal.Py4jScriptEngine.execute(Py4jScriptEngine.java:226)
17:40:01 [2020-07-04T21:40:01.219Z] 	at org.eclipse.ease.AbstractScriptEngine.inject(AbstractScriptEngine.java:226)
17:40:01 [2020-07-04T21:40:01.219Z] 	at org.eclipse.ease.AbstractScriptEngine.run(AbstractScriptEngine.java:277)
17:40:01 [2020-07-04T21:40:01.219Z] 	at org.eclipse.core.internal.jobs.Worker.run(Worker.java:63)
17:40:01 [2020-07-04T21:40:01.219Z] 
17:40:01 [2020-07-04T21:40:01.219Z] 
17:40:01 [2020-07-04T21:40:01.219Z] 	at py4j.Protocol.getReturnValue(Protocol.java:476)
17:40:01 [2020-07-04T21:40:01.219Z] 	at py4j.reflection.PythonProxyHandler.invoke(PythonProxyHandler.java:108)
17:40:01 [2020-07-04T21:40:01.219Z] 	at com.sun.proxy.$Proxy13.run(Unknown Source)
17:40:01 [2020-07-04T21:40:01.219Z] 	at org.eclipse.ease.lang.python.py4j.internal.Py4jDebugger.execute(Py4jDebugger.java:106)
17:40:01 [2020-07-04T21:40:01.219Z] 	at org.eclipse.ease.lang.python.py4j.internal.Py4jDebuggerEngine.internalExecute(Py4jDebuggerEngine.java:85)
17:40:01 [2020-07-04T21:40:01.219Z] 	at org.eclipse.ease.lang.python.py4j.internal.Py4jScriptEngine.execute(Py4jScriptEngine.java:226)
17:40:01 [2020-07-04T21:40:01.219Z] 	at org.eclipse.ease.AbstractScriptEngine.inject(AbstractScriptEngine.java:226)
17:40:01 [2020-07-04T21:40:01.219Z] 	at org.eclipse.ease.AbstractScriptEngine.run(AbstractScriptEngine.java:277)
17:40:01 [2020-07-04T21:40:01.219Z] 	at org.eclipse.core.internal.jobs.Worker.run(Worker.java:63)
17:40:01 [2020-07-04T21:40:01.473Z] Start of script
17:40:01 [2020-07-04T21:40:01.474Z] include file start
17:40:01 [2020-07-04T21:40:01.474Z] include file processed
17:40:01 [2020-07-04T21:40:01.474Z] Result of testMethod = 5
17:40:01 [2020-07-04T21:40:01.474Z] End of script
17:40:01 [2020-07-04T21:40:01.474Z] Start of script
17:40:01 [2020-07-04T21:40:01.474Z] include file start
17:40:01 [2020-07-04T21:40:01.474Z] include file processed
17:40:01 [2020-07-04T21:40:01.729Z] Result of testMethod = 5
17:40:01 [2020-07-04T21:40:01.729Z] End of script
17:40:01 [2020-07-04T21:40:01.984Z] Start of script
17:40:01 [2020-07-04T21:40:01.984Z] include file start
17:40:01 [2020-07-04T21:40:01.984Z] include file processed
17:40:01 [2020-07-04T21:40:01.984Z] Result of testMethod = 5
17:40:01 [2020-07-04T21:40:01.984Z] End of script
17:40:01 [2020-07-04T21:40:01.984Z] Tests run: 42, Failures: 0, Errors: 0, Skipped: 4, Time elapsed: 10.247 s - in org.eclipse.ease.lang.python.py4j.Py4jDebugTest
17:40:01 [2020-07-04T21:40:01.984Z] resumeOnLastIncludeLine(org.eclipse.ease.lang.python.py4j.Py4jDebugTest) skipped
17:40:01 [2020-07-04T21:40:01.984Z] nativeArrayVariable(org.eclipse.ease.lang.python.py4j.Py4jDebugTest) skipped
17:40:01 [2020-07-04T21:40:01.984Z] stepIntoIncludeCommand(org.eclipse.ease.lang.python.py4j.Py4jDebugTest) skipped
17:40:01 [2020-07-04T21:40:01.984Z] nativeObjectVariable(org.eclipse.ease.lang.python.py4j.Py4jDebugTest) skipped
17:40:01 [2020-07-04T21:40:01.984Z] disconnectProcessInSuspendedState(org.eclipse.ease.lang.python.py4j.Py4jDebugTest)  Time elapsed: 0.421 s
17:40:01 [2020-07-04T21:40:01.984Z] stepReturnIncludeCommand(org.eclipse.ease.lang.python.py4j.Py4jDebugTest)  Time elapsed: 0.209 s
17:40:01 [2020-07-04T21:40:01.984Z] arrayVariableSorting(org.eclipse.ease.lang.python.py4j.Py4jDebugTest)  Time elapsed: 0.308 s
17:40:01 [2020-07-04T21:40:01.984Z] stepOverOnDebugTarget(org.eclipse.ease.lang.python.py4j.Py4jDebugTest)  Time elapsed: 0.308 s
17:40:01 [2020-07-04T21:40:01.984Z] hasDebugTarget(org.eclipse.ease.lang.python.py4j.Py4jDebugTest)  Time elapsed: 0.205 s
17:40:01 [2020-07-04T21:40:01.984Z] disconnectThreadInSuspendedState(org.eclipse.ease.lang.python.py4j.Py4jDebugTest)  Time elapsed: 0.207 s
17:40:01 [2020-07-04T21:40:01.984Z] stepReturnOnDebugTarget(org.eclipse.ease.lang.python.py4j.Py4jDebugTest)  Time elapsed: 0.408 s
17:40:01 [2020-07-04T21:40:01.984Z] nullVariable(org.eclipse.ease.lang.python.py4j.Py4jDebugTest)  Time elapsed: 0.306 s
17:40:01 [2020-07-04T21:40:01.984Z] stepOverOnStackFrame(org.eclipse.ease.lang.python.py4j.Py4jDebugTest)  Time elapsed: 0.307 s
17:40:01 [2020-07-04T21:40:01.984Z] resumeOnDebugTarget(org.eclipse.ease.lang.python.py4j.Py4jDebugTest)  Time elapsed: 0.206 s
17:40:01 [2020-07-04T21:40:01.985Z] modifyVariableKeepingType(org.eclipse.ease.lang.python.py4j.Py4jDebugTest)  Time elapsed: 0.506 s
17:40:01 [2020-07-04T21:40:01.985Z] stepReturnOnStackFrame(org.eclipse.ease.lang.python.py4j.Py4jDebugTest)  Time elapsed: 0.306 s
17:40:01 [2020-07-04T21:40:01.985Z] terminateStackFrameInSuspendedState(org.eclipse.ease.lang.python.py4j.Py4jDebugTest)  Time elapsed: 0.207 s
17:40:01 [2020-07-04T21:40:01.985Z] breakpointLocation(org.eclipse.ease.lang.python.py4j.Py4jDebugTest)  Time elapsed: 0.208 s
17:40:01 [2020-07-04T21:40:01.985Z] stepReturnOnThread(org.eclipse.ease.lang.python.py4j.Py4jDebugTest)  Time elapsed: 0.306 s
17:40:01 [2020-07-04T21:40:01.985Z] javaClassVariable(org.eclipse.ease.lang.python.py4j.Py4jDebugTest)  Time elapsed: 0.309 s
17:40:01 [2020-07-04T21:40:01.985Z] stepIntoOnThread(org.eclipse.ease.lang.python.py4j.Py4jDebugTest)  Time elapsed: 0.307 s
17:40:01 [2020-07-04T21:40:01.985Z] terminateThreadInSuspendedState(org.eclipse.ease.lang.python.py4j.Py4jDebugTest)  Time elapsed: 0.206 s
17:40:01 [2020-07-04T21:40:01.985Z] resumeOnThread(org.eclipse.ease.lang.python.py4j.Py4jDebugTest)  Time elapsed: 0.206 s
17:40:01 [2020-07-04T21:40:01.985Z] stepIntoOnStackFrame(org.eclipse.ease.lang.python.py4j.Py4jDebugTest)  Time elapsed: 0.306 s
17:40:01 [2020-07-04T21:40:01.985Z] terminateProcessInSuspendedState(org.eclipse.ease.lang.python.py4j.Py4jDebugTest)  Time elapsed: 0.206 s
17:40:01 [2020-07-04T21:40:01.985Z] stepOverOnProcess(org.eclipse.ease.lang.python.py4j.Py4jDebugTest)  Time elapsed: 0.306 s
17:40:01 [2020-07-04T21:40:01.985Z] disconnectDebugTargetInSuspendedState(org.eclipse.ease.lang.python.py4j.Py4jDebugTest)  Time elapsed: 0.205 s
17:40:01 [2020-07-04T21:40:01.985Z] stepIntoOnProcess(org.eclipse.ease.lang.python.py4j.Py4jDebugTest)  Time elapsed: 0.307 s
17:40:01 [2020-07-04T21:40:01.985Z] terminatedState(org.eclipse.ease.lang.python.py4j.Py4jDebugTest)  Time elapsed: 0.104 s
17:40:01 [2020-07-04T21:40:01.985Z] stepOverIncludeCommand(org.eclipse.ease.lang.python.py4j.Py4jDebugTest)  Time elapsed: 0.304 s
17:40:01 [2020-07-04T21:40:01.985Z] innerScopeVariableBeforeOuterScopeVariable(org.eclipse.ease.lang.python.py4j.Py4jDebugTest)  Time elapsed: 0.305 s
17:40:01 [2020-07-04T21:40:01.985Z] primitiveStringVariable(org.eclipse.ease.lang.python.py4j.Py4jDebugTest)  Time elapsed: 0.305 s
17:40:01 [2020-07-04T21:40:01.985Z] resumeOnProcess(org.eclipse.ease.lang.python.py4j.Py4jDebugTest)  Time elapsed: 0.204 s
17:40:01 [2020-07-04T21:40:01.985Z] stepIntoOnDebugTarget(org.eclipse.ease.lang.python.py4j.Py4jDebugTest)  Time elapsed: 0.305 s
17:40:01 [2020-07-04T21:40:01.985Z] stepOverOnThread(org.eclipse.ease.lang.python.py4j.Py4jDebugTest)  Time elapsed: 0.305 s
17:40:01 [2020-07-04T21:40:01.985Z] suspendedState(org.eclipse.ease.lang.python.py4j.Py4jDebugTest)  Time elapsed: 0.205 s
17:40:01 [2020-07-04T21:40:01.985Z] primitiveDoubleVariable(org.eclipse.ease.lang.python.py4j.Py4jDebugTest)  Time elapsed: 0.305 s
17:40:01 [2020-07-04T21:40:01.985Z] resumeOnStackFrame(org.eclipse.ease.lang.python.py4j.Py4jDebugTest)  Time elapsed: 0.204 s
17:40:01 [2020-07-04T21:40:01.985Z] terminateDebugTargetInSuspendedState(org.eclipse.ease.lang.python.py4j.Py4jDebugTest)  Time elapsed: 0.205 s
17:40:01 [2020-07-04T21:40:01.985Z] disconnectStackFrameInSuspendedState(org.eclipse.ease.lang.python.py4j.Py4jDebugTest)  Time elapsed: 0.205 s
17:40:01 [2020-07-04T21:40:01.985Z] stepReturnOnProcess(org.eclipse.ease.lang.python.py4j.Py4jDebugTest)  Time elapsed: 0.305 s
17:40:01 [2020-07-04T21:40:01.985Z] evaluateWatchExpression(org.eclipse.ease.lang.python.py4j.Py4jDebugTest)  Time elapsed: 0.207 s
17:40:01 [2020-07-04T21:40:01.985Z] Running org.eclipse.ease.lang.python.py4j.Py4JPep302ModuleLoadingTest
17:40:02 [2020-07-04T21:40:02.240Z] org.eclipse.ease.ScriptExecutionException: Traceback (most recent call last):
17:40:02 [2020-07-04T21:40:02.240Z]   File "<...>", line 1, in <module>
17:40:02 [2020-07-04T21:40:02.240Z]   File "<...>", line 81, in load_module
17:40:02 [2020-07-04T21:40:02.240Z] ImportError: No EASE module named 'eclipse.test.notthere'
17:40:02 [2020-07-04T21:40:02.240Z] 
17:40:02 [2020-07-04T21:40:02.496Z] Tests run: 8, Failures: 0, Errors: 0, Skipped: 0, Time elapsed: 0.439 s - in org.eclipse.ease.lang.python.py4j.Py4JPep302ModuleLoadingTest
17:40:02 [2020-07-04T21:40:02.496Z] loadSimpleModule(org.eclipse.ease.lang.python.py4j.Py4JPep302ModuleLoadingTest)  Time elapsed: 0.059 s
17:40:02 [2020-07-04T21:40:02.496Z] loadModuleWithDependencies(org.eclipse.ease.lang.python.py4j.Py4JPep302ModuleLoadingTest)  Time elapsed: 0.054 s
17:40:02 [2020-07-04T21:40:02.496Z] accessAdvancedModule(org.eclipse.ease.lang.python.py4j.Py4JPep302ModuleLoadingTest)  Time elapsed: 0.054 s
17:40:02 [2020-07-04T21:40:02.496Z] importAs(org.eclipse.ease.lang.python.py4j.Py4JPep302ModuleLoadingTest)  Time elapsed: 0.055 s
17:40:02 [2020-07-04T21:40:02.496Z] fromBasicImportMethod(org.eclipse.ease.lang.python.py4j.Py4JPep302ModuleLoadingTest)  Time elapsed: 0.055 s
17:40:02 [2020-07-04T21:40:02.496Z] loadNotExistingModule(org.eclipse.ease.lang.python.py4j.Py4JPep302ModuleLoadingTest)  Time elapsed: 0.053 s
17:40:02 [2020-07-04T21:40:02.496Z] fromBasicImportAll(org.eclipse.ease.lang.python.py4j.Py4JPep302ModuleLoadingTest)  Time elapsed: 0.056 s
17:40:02 [2020-07-04T21:40:02.496Z] accessModule(org.eclipse.ease.lang.python.py4j.Py4JPep302ModuleLoadingTest)  Time elapsed: 0.053 s
17:40:02 [2020-07-04T21:40:02.496Z] Running org.eclipse.ease.lang.python.py4j.ScriptModeEngineTest
17:40:02 [2020-07-04T21:40:02.496Z] ----------------------------------------------
17:40:02 [2020-07-04T21:40:02.496Z] Starting test: invalidSyntax(org.eclipse.ease.lang.python.py4j.ScriptModeEngineTest)
17:40:02 [2020-07-04T21:40:02.496Z] org.eclipse.ease.ScriptExecutionException: Traceback (most recent call last):
17:40:02 [2020-07-04T21:40:02.496Z]   File "/usr/lib64/python2.7/ast.py", line 37, in parse
17:40:02 [2020-07-04T21:40:02.496Z]     return compile(source, filename, mode, PyCF_ONLY_AST)
17:40:02 [2020-07-04T21:40:02.496Z]   File "<unknown>", line 1
17:40:02 [2020-07-04T21:40:02.496Z]     1++
17:40:02 [2020-07-04T21:40:02.496Z]       ^
17:40:02 [2020-07-04T21:40:02.496Z] SyntaxError: invalid syntax
17:40:02 [2020-07-04T21:40:02.496Z] 
17:40:02 [2020-07-04T21:40:02.752Z] 
17:40:02 [2020-07-04T21:40:02.752Z] Finished test: invalidSyntax(org.eclipse.ease.lang.python.py4j.ScriptModeEngineTest)
17:40:02 [2020-07-04T21:40:02.752Z] ----------------------------------------------
17:40:02 [2020-07-04T21:40:02.752Z] ----------------------------------------------
17:40:02 [2020-07-04T21:40:02.752Z] Starting test: getScriptEngine(org.eclipse.ease.lang.python.py4j.ScriptModeEngineTest)
17:40:04 [2020-07-04T21:40:04.117Z] 2104341624
17:40:04 [2020-07-04T21:40:04.117Z] Finished test: getScriptEngine(org.eclipse.ease.lang.python.py4j.ScriptModeEngineTest)
17:40:04 [2020-07-04T21:40:04.117Z] ----------------------------------------------
17:40:04 [2020-07-04T21:40:04.117Z] ----------------------------------------------
17:40:04 [2020-07-04T21:40:04.117Z] Starting test: incompleteStatement(org.eclipse.ease.lang.python.py4j.ScriptModeEngineTest)
17:40:04 [2020-07-04T21:40:04.117Z] org.eclipse.ease.ScriptExecutionException: Traceback (most recent call last):
17:40:04 [2020-07-04T21:40:04.117Z]   File "/usr/lib64/python2.7/ast.py", line 37, in parse
17:40:04 [2020-07-04T21:40:04.117Z]     return compile(source, filename, mode, PyCF_ONLY_AST)
17:40:04 [2020-07-04T21:40:04.117Z]   File "<unknown>", line 1
17:40:04 [2020-07-04T21:40:04.117Z]     def a():
17:40:04 [2020-07-04T21:40:04.117Z]            ^
17:40:04 [2020-07-04T21:40:04.117Z] SyntaxError: unexpected EOF while parsing
17:40:04 [2020-07-04T21:40:04.117Z] 
17:40:04 [2020-07-04T21:40:04.117Z] 
17:40:04 [2020-07-04T21:40:04.117Z] Finished test: incompleteStatement(org.eclipse.ease.lang.python.py4j.ScriptModeEngineTest)
17:40:04 [2020-07-04T21:40:04.117Z] ----------------------------------------------
17:40:04 [2020-07-04T21:40:04.117Z] ----------------------------------------------
17:40:04 [2020-07-04T21:40:04.117Z] Starting test: multiLineStatement(org.eclipse.ease.lang.python.py4j.ScriptModeEngineTest)
17:40:04 [2020-07-04T21:40:04.117Z] 
17:40:04 [2020-07-04T21:40:04.117Z] Finished test: multiLineStatement(org.eclipse.ease.lang.python.py4j.ScriptModeEngineTest)
17:40:04 [2020-07-04T21:40:04.117Z] ----------------------------------------------
17:40:04 [2020-07-04T21:40:04.117Z] ----------------------------------------------
17:40:04 [2020-07-04T21:40:04.117Z] Starting test: runtimeError(org.eclipse.ease.lang.python.py4j.ScriptModeEngineTest)
17:40:04 [2020-07-04T21:40:04.374Z] org.eclipse.ease.ScriptExecutionException: Traceback (most recent call last):
17:40:04 [2020-07-04T21:40:04.374Z]   File "<...>", line 1, in <module>
17:40:04 [2020-07-04T21:40:04.374Z] NameError: name 'a' is not defined
17:40:04 [2020-07-04T21:40:04.374Z] 
17:40:04 [2020-07-04T21:40:04.374Z] 
17:40:04 [2020-07-04T21:40:04.374Z] Finished test: runtimeError(org.eclipse.ease.lang.python.py4j.ScriptModeEngineTest)
17:40:04 [2020-07-04T21:40:04.374Z] ----------------------------------------------
17:40:04 [2020-07-04T21:40:04.374Z] ----------------------------------------------
17:40:04 [2020-07-04T21:40:04.374Z] Starting test: javaIntArray(org.eclipse.ease.lang.python.py4j.ScriptModeEngineTest)
17:40:04 [2020-07-04T21:40:04.631Z] 
17:40:04 [2020-07-04T21:40:04.631Z] Finished test: javaIntArray(org.eclipse.ease.lang.python.py4j.ScriptModeEngineTest)
17:40:04 [2020-07-04T21:40:04.631Z] ----------------------------------------------
17:40:04 [2020-07-04T21:40:04.631Z] ----------------------------------------------
17:40:04 [2020-07-04T21:40:04.631Z] Starting test: javaDoubleArray(org.eclipse.ease.lang.python.py4j.ScriptModeEngineTest)
17:40:04 [2020-07-04T21:40:04.887Z] 
17:40:04 [2020-07-04T21:40:04.887Z] Finished test: javaDoubleArray(org.eclipse.ease.lang.python.py4j.ScriptModeEngineTest)
17:40:04 [2020-07-04T21:40:04.887Z] ----------------------------------------------
17:40:04 [2020-07-04T21:40:04.887Z] ----------------------------------------------
17:40:04 [2020-07-04T21:40:04.887Z] Starting test: pythonSet(org.eclipse.ease.lang.python.py4j.ScriptModeEngineTest)
17:40:05 [2020-07-04T21:40:05.142Z] 
17:40:05 [2020-07-04T21:40:05.142Z] Finished test: pythonSet(org.eclipse.ease.lang.python.py4j.ScriptModeEngineTest)
17:40:05 [2020-07-04T21:40:05.142Z] ----------------------------------------------
17:40:05 [2020-07-04T21:40:05.142Z] ----------------------------------------------
17:40:05 [2020-07-04T21:40:05.142Z] Starting test: javaStringArray(org.eclipse.ease.lang.python.py4j.ScriptModeEngineTest)
17:40:05 [2020-07-04T21:40:05.142Z] 
17:40:05 [2020-07-04T21:40:05.142Z] Finished test: javaStringArray(org.eclipse.ease.lang.python.py4j.ScriptModeEngineTest)
17:40:05 [2020-07-04T21:40:05.142Z] ----------------------------------------------
17:40:05 [2020-07-04T21:40:05.142Z] ----------------------------------------------
17:40:05 [2020-07-04T21:40:05.142Z] Starting test: javaShortArray(org.eclipse.ease.lang.python.py4j.ScriptModeEngineTest)
17:40:05 [2020-07-04T21:40:05.397Z] 
17:40:05 [2020-07-04T21:40:05.397Z] Finished test: javaShortArray(org.eclipse.ease.lang.python.py4j.ScriptModeEngineTest)
17:40:05 [2020-07-04T21:40:05.397Z] ----------------------------------------------
17:40:05 [2020-07-04T21:40:05.397Z] ----------------------------------------------
17:40:05 [2020-07-04T21:40:05.397Z] Starting test: javaBooleanArray(org.eclipse.ease.lang.python.py4j.ScriptModeEngineTest)
17:40:05 [2020-07-04T21:40:05.653Z] 
17:40:05 [2020-07-04T21:40:05.653Z] Finished test: javaBooleanArray(org.eclipse.ease.lang.python.py4j.ScriptModeEngineTest)
17:40:05 [2020-07-04T21:40:05.653Z] ----------------------------------------------
17:40:05 [2020-07-04T21:40:05.653Z] ----------------------------------------------
17:40:05 [2020-07-04T21:40:05.653Z] Starting test: javaObjectArray(org.eclipse.ease.lang.python.py4j.ScriptModeEngineTest)
17:40:05 [2020-07-04T21:40:05.908Z] 
17:40:05 [2020-07-04T21:40:05.908Z] Finished test: javaObjectArray(org.eclipse.ease.lang.python.py4j.ScriptModeEngineTest)
17:40:05 [2020-07-04T21:40:05.908Z] ----------------------------------------------
17:40:05 [2020-07-04T21:40:05.908Z] ----------------------------------------------
17:40:05 [2020-07-04T21:40:05.908Z] Starting test: javaIntegerArray(org.eclipse.ease.lang.python.py4j.ScriptModeEngineTest)
17:40:06 [2020-07-04T21:40:06.164Z] 
17:40:06 [2020-07-04T21:40:06.164Z] Finished test: javaIntegerArray(org.eclipse.ease.lang.python.py4j.ScriptModeEngineTest)
17:40:06 [2020-07-04T21:40:06.164Z] ----------------------------------------------
17:40:06 [2020-07-04T21:40:06.164Z] ----------------------------------------------
17:40:06 [2020-07-04T21:40:06.164Z] Starting test: javaInteger(org.eclipse.ease.lang.python.py4j.ScriptModeEngineTest)
17:40:06 [2020-07-04T21:40:06.164Z] 
17:40:06 [2020-07-04T21:40:06.164Z] Finished test: javaInteger(org.eclipse.ease.lang.python.py4j.ScriptModeEngineTest)
17:40:06 [2020-07-04T21:40:06.164Z] ----------------------------------------------
17:40:06 [2020-07-04T21:40:06.164Z] ----------------------------------------------
17:40:06 [2020-07-04T21:40:06.164Z] Starting test: javaString(org.eclipse.ease.lang.python.py4j.ScriptModeEngineTest)
17:40:06 [2020-07-04T21:40:06.419Z] 
17:40:06 [2020-07-04T21:40:06.419Z] Finished test: javaString(org.eclipse.ease.lang.python.py4j.ScriptModeEngineTest)
17:40:06 [2020-07-04T21:40:06.419Z] ----------------------------------------------
17:40:06 [2020-07-04T21:40:06.419Z] ----------------------------------------------
17:40:06 [2020-07-04T21:40:06.419Z] Starting test: javaByteArray(org.eclipse.ease.lang.python.py4j.ScriptModeEngineTest)
17:40:06 [2020-07-04T21:40:06.675Z] 
17:40:06 [2020-07-04T21:40:06.675Z] Finished test: javaByteArray(org.eclipse.ease.lang.python.py4j.ScriptModeEngineTest)
17:40:06 [2020-07-04T21:40:06.675Z] ----------------------------------------------
17:40:06 [2020-07-04T21:40:06.675Z] ----------------------------------------------
17:40:06 [2020-07-04T21:40:06.675Z] Starting test: createEclipseClass(org.eclipse.ease.lang.python.py4j.ScriptModeEngineTest)
17:40:06 [2020-07-04T21:40:06.931Z] 
17:40:06 [2020-07-04T21:40:06.931Z] Finished test: createEclipseClass(org.eclipse.ease.lang.python.py4j.ScriptModeEngineTest)
17:40:06 [2020-07-04T21:40:06.931Z] ----------------------------------------------
17:40:06 [2020-07-04T21:40:06.931Z] ----------------------------------------------
17:40:06 [2020-07-04T21:40:06.931Z] Starting test: pythonString(org.eclipse.ease.lang.python.py4j.ScriptModeEngineTest)
17:40:06 [2020-07-04T21:40:06.931Z] 
17:40:06 [2020-07-04T21:40:06.931Z] Finished test: pythonString(org.eclipse.ease.lang.python.py4j.ScriptModeEngineTest)
17:40:06 [2020-07-04T21:40:06.931Z] ----------------------------------------------
17:40:06 [2020-07-04T21:40:06.931Z] ----------------------------------------------
17:40:06 [2020-07-04T21:40:06.931Z] Starting test: varargs(org.eclipse.ease.lang.python.py4j.ScriptModeEngineTest)
17:40:07 [2020-07-04T21:40:07.186Z] 
17:40:07 [2020-07-04T21:40:07.186Z] Finished test: varargs(org.eclipse.ease.lang.python.py4j.ScriptModeEngineTest)
17:40:07 [2020-07-04T21:40:07.186Z] ----------------------------------------------
17:40:07 [2020-07-04T21:40:07.186Z] ----------------------------------------------
17:40:07 [2020-07-04T21:40:07.186Z] Starting test: createJavaType(org.eclipse.ease.lang.python.py4j.ScriptModeEngineTest)
17:40:07 [2020-07-04T21:40:07.442Z] 
17:40:07 [2020-07-04T21:40:07.442Z] Finished test: createJavaType(org.eclipse.ease.lang.python.py4j.ScriptModeEngineTest)
17:40:07 [2020-07-04T21:40:07.442Z] ----------------------------------------------
17:40:07 [2020-07-04T21:40:07.442Z] ----------------------------------------------
17:40:07 [2020-07-04T21:40:07.442Z] Starting test: javaFloatArray(org.eclipse.ease.lang.python.py4j.ScriptModeEngineTest)
17:40:07 [2020-07-04T21:40:07.698Z] 
17:40:07 [2020-07-04T21:40:07.698Z] Finished test: javaFloatArray(org.eclipse.ease.lang.python.py4j.ScriptModeEngineTest)
17:40:07 [2020-07-04T21:40:07.698Z] ----------------------------------------------
17:40:07 [2020-07-04T21:40:07.698Z] ----------------------------------------------
17:40:07 [2020-07-04T21:40:07.698Z] Starting test: implementJavaInterface(org.eclipse.ease.lang.python.py4j.ScriptModeEngineTest)
17:40:07 [2020-07-04T21:40:07.953Z] 
17:40:07 [2020-07-04T21:40:07.953Z] Finished test: implementJavaInterface(org.eclipse.ease.lang.python.py4j.ScriptModeEngineTest)
17:40:07 [2020-07-04T21:40:07.953Z] ----------------------------------------------
17:40:07 [2020-07-04T21:40:07.953Z] ----------------------------------------------
17:40:07 [2020-07-04T21:40:07.953Z] Starting test: pythonDict(org.eclipse.ease.lang.python.py4j.ScriptModeEngineTest)
17:40:07 [2020-07-04T21:40:07.953Z] 
17:40:07 [2020-07-04T21:40:07.953Z] Finished test: pythonDict(org.eclipse.ease.lang.python.py4j.ScriptModeEngineTest)
17:40:07 [2020-07-04T21:40:07.953Z] ----------------------------------------------
17:40:07 [2020-07-04T21:40:07.953Z] ----------------------------------------------
17:40:07 [2020-07-04T21:40:07.953Z] Starting test: pythonList(org.eclipse.ease.lang.python.py4j.ScriptModeEngineTest)
17:40:08 [2020-07-04T21:40:08.209Z] 
17:40:08 [2020-07-04T21:40:08.209Z] Finished test: pythonList(org.eclipse.ease.lang.python.py4j.ScriptModeEngineTest)
17:40:08 [2020-07-04T21:40:08.209Z] ----------------------------------------------
17:40:08 [2020-07-04T21:40:08.209Z] ----------------------------------------------
17:40:08 [2020-07-04T21:40:08.209Z] Starting test: testMultiple(org.eclipse.ease.lang.python.py4j.ScriptModeEngineTest)
17:40:08 [2020-07-04T21:40:08.465Z] 
17:40:08 [2020-07-04T21:40:08.465Z] Finished test: testMultiple(org.eclipse.ease.lang.python.py4j.ScriptModeEngineTest)
17:40:08 [2020-07-04T21:40:08.465Z] ----------------------------------------------
17:40:08 [2020-07-04T21:40:08.465Z] ----------------------------------------------
17:40:08 [2020-07-04T21:40:08.465Z] Starting test: javaLongArray(org.eclipse.ease.lang.python.py4j.ScriptModeEngineTest)
17:40:08 [2020-07-04T21:40:08.721Z] 
17:40:08 [2020-07-04T21:40:08.721Z] Finished test: javaLongArray(org.eclipse.ease.lang.python.py4j.ScriptModeEngineTest)
17:40:08 [2020-07-04T21:40:08.721Z] ----------------------------------------------
17:40:08 [2020-07-04T21:40:08.721Z] ----------------------------------------------
17:40:08 [2020-07-04T21:40:08.721Z] Starting test: createPythonObject(org.eclipse.ease.lang.python.py4j.ScriptModeEngineTest)
17:40:08 [2020-07-04T21:40:08.721Z] 
17:40:08 [2020-07-04T21:40:08.721Z] Finished test: createPythonObject(org.eclipse.ease.lang.python.py4j.ScriptModeEngineTest)
17:40:08 [2020-07-04T21:40:08.721Z] ----------------------------------------------
17:40:08 [2020-07-04T21:40:08.721Z] ----------------------------------------------
17:40:08 [2020-07-04T21:40:08.721Z] Starting test: pythonInteger(org.eclipse.ease.lang.python.py4j.ScriptModeEngineTest)
17:40:08 [2020-07-04T21:40:08.976Z] 
17:40:08 [2020-07-04T21:40:08.976Z] Finished test: pythonInteger(org.eclipse.ease.lang.python.py4j.ScriptModeEngineTest)
17:40:08 [2020-07-04T21:40:08.976Z] ----------------------------------------------
17:40:08 [2020-07-04T21:40:08.976Z] Tests run: 30, Failures: 0, Errors: 0, Skipped: 2, Time elapsed: 6.569 s - in org.eclipse.ease.lang.python.py4j.ScriptModeEngineTest
17:40:08 [2020-07-04T21:40:08.976Z] invalidSyntax(org.eclipse.ease.lang.python.py4j.ScriptModeEngineTest)  Time elapsed: 0.198 s
17:40:08 [2020-07-04T21:40:08.977Z] getScriptEngine(org.eclipse.ease.lang.python.py4j.ScriptModeEngineTest)  Time elapsed: 1.198 s
17:40:08 [2020-07-04T21:40:08.977Z] callExit(org.eclipse.ease.lang.python.py4j.ScriptModeEngineTest) skipped
17:40:08 [2020-07-04T21:40:08.977Z] multiLinesOfCode(org.eclipse.ease.lang.python.py4j.ScriptModeEngineTest) skipped
17:40:08 [2020-07-04T21:40:08.977Z] incompleteStatement(org.eclipse.ease.lang.python.py4j.ScriptModeEngineTest)  Time elapsed: 0.195 s
17:40:08 [2020-07-04T21:40:08.977Z] multiLineStatement(org.eclipse.ease.lang.python.py4j.ScriptModeEngineTest)  Time elapsed: 0.199 s
17:40:08 [2020-07-04T21:40:08.977Z] runtimeError(org.eclipse.ease.lang.python.py4j.ScriptModeEngineTest)  Time elapsed: 0.199 s
17:40:08 [2020-07-04T21:40:08.977Z] javaIntArray(org.eclipse.ease.lang.python.py4j.ScriptModeEngineTest)  Time elapsed: 0.198 s
17:40:08 [2020-07-04T21:40:08.977Z] javaDoubleArray(org.eclipse.ease.lang.python.py4j.ScriptModeEngineTest)  Time elapsed: 0.199 s
17:40:08 [2020-07-04T21:40:08.977Z] pythonSet(org.eclipse.ease.lang.python.py4j.ScriptModeEngineTest)  Time elapsed: 0.201 s
17:40:08 [2020-07-04T21:40:08.977Z] javaStringArray(org.eclipse.ease.lang.python.py4j.ScriptModeEngineTest)  Time elapsed: 0.2 s
17:40:08 [2020-07-04T21:40:08.977Z] javaShortArray(org.eclipse.ease.lang.python.py4j.ScriptModeEngineTest)  Time elapsed: 0.2 s
17:40:08 [2020-07-04T21:40:08.977Z] javaBooleanArray(org.eclipse.ease.lang.python.py4j.ScriptModeEngineTest)  Time elapsed: 0.198 s
17:40:08 [2020-07-04T21:40:08.977Z] javaObjectArray(org.eclipse.ease.lang.python.py4j.ScriptModeEngineTest)  Time elapsed: 0.201 s
17:40:08 [2020-07-04T21:40:08.977Z] javaIntegerArray(org.eclipse.ease.lang.python.py4j.ScriptModeEngineTest)  Time elapsed: 0.202 s
17:40:08 [2020-07-04T21:40:08.977Z] javaInteger(org.eclipse.ease.lang.python.py4j.ScriptModeEngineTest)  Time elapsed: 0.197 s
17:40:08 [2020-07-04T21:40:08.977Z] javaString(org.eclipse.ease.lang.python.py4j.ScriptModeEngineTest)  Time elapsed: 0.209 s
17:40:08 [2020-07-04T21:40:08.977Z] javaByteArray(org.eclipse.ease.lang.python.py4j.ScriptModeEngineTest)  Time elapsed: 0.2 s
17:40:08 [2020-07-04T21:40:08.977Z] createEclipseClass(org.eclipse.ease.lang.python.py4j.ScriptModeEngineTest)  Time elapsed: 0.197 s
17:40:08 [2020-07-04T21:40:08.977Z] pythonString(org.eclipse.ease.lang.python.py4j.ScriptModeEngineTest)  Time elapsed: 0.195 s
17:40:08 [2020-07-04T21:40:08.977Z] varargs(org.eclipse.ease.lang.python.py4j.ScriptModeEngineTest)  Time elapsed: 0.199 s
17:40:08 [2020-07-04T21:40:08.977Z] createJavaType(org.eclipse.ease.lang.python.py4j.ScriptModeEngineTest)  Time elapsed: 0.197 s
17:40:08 [2020-07-04T21:40:08.977Z] javaFloatArray(org.eclipse.ease.lang.python.py4j.ScriptModeEngineTest)  Time elapsed: 0.198 s
17:40:08 [2020-07-04T21:40:08.977Z] implementJavaInterface(org.eclipse.ease.lang.python.py4j.ScriptModeEngineTest)  Time elapsed: 0.195 s
17:40:08 [2020-07-04T21:40:08.977Z] pythonDict(org.eclipse.ease.lang.python.py4j.ScriptModeEngineTest)  Time elapsed: 0.196 s
17:40:08 [2020-07-04T21:40:08.977Z] pythonList(org.eclipse.ease.lang.python.py4j.ScriptModeEngineTest)  Time elapsed: 0.199 s
17:40:08 [2020-07-04T21:40:08.977Z] testMultiple(org.eclipse.ease.lang.python.py4j.ScriptModeEngineTest)  Time elapsed: 0.205 s
17:40:08 [2020-07-04T21:40:08.977Z] javaLongArray(org.eclipse.ease.lang.python.py4j.ScriptModeEngineTest)  Time elapsed: 0.197 s
17:40:08 [2020-07-04T21:40:08.977Z] createPythonObject(org.eclipse.ease.lang.python.py4j.ScriptModeEngineTest)  Time elapsed: 0.197 s
17:40:08 [2020-07-04T21:40:08.977Z] pythonInteger(org.eclipse.ease.lang.python.py4j.ScriptModeEngineTest)  Time elapsed: 0.198 s
17:40:08 [2020-07-04T21:40:08.977Z] Running org.eclipse.ease.lang.python.py4j.StartStopTest
17:40:08 [2020-07-04T21:40:08.977Z] ----------------------------------------------
17:40:08 [2020-07-04T21:40:08.977Z] Starting test: startStop(org.eclipse.ease.lang.python.py4j.StartStopTest)
17:40:09 [2020-07-04T21:40:09.233Z] 
17:40:09 [2020-07-04T21:40:09.233Z] Finished test: startStop(org.eclipse.ease.lang.python.py4j.StartStopTest)
17:40:09 [2020-07-04T21:40:09.233Z] ----------------------------------------------
17:40:09 [2020-07-04T21:40:09.233Z] ----------------------------------------------
17:40:09 [2020-07-04T21:40:09.233Z] Starting test: startStopShellNoBootstrap(org.eclipse.ease.lang.python.py4j.StartStopTest)
17:40:09 [2020-07-04T21:40:09.490Z] 
17:40:09 [2020-07-04T21:40:09.490Z] Finished test: startStopShellNoBootstrap(org.eclipse.ease.lang.python.py4j.StartStopTest)
17:40:09 [2020-07-04T21:40:09.490Z] ----------------------------------------------
17:40:09 [2020-07-04T21:40:09.490Z] ----------------------------------------------
17:40:09 [2020-07-04T21:40:09.490Z] Starting test: multiStartStop(org.eclipse.ease.lang.python.py4j.StartStopTest)
17:40:09 [2020-07-04T21:40:09.745Z] 
17:40:09 [2020-07-04T21:40:09.745Z] Finished test: multiStartStop(org.eclipse.ease.lang.python.py4j.StartStopTest)
17:40:09 [2020-07-04T21:40:09.745Z] ----------------------------------------------
17:40:09 [2020-07-04T21:40:09.745Z] Tests run: 3, Failures: 0, Errors: 0, Skipped: 0, Time elapsed: 0.604 s - in org.eclipse.ease.lang.python.py4j.StartStopTest
17:40:09 [2020-07-04T21:40:09.745Z] startStop(org.eclipse.ease.lang.python.py4j.StartStopTest)  Time elapsed: 0.201 s
17:40:09 [2020-07-04T21:40:09.745Z] startStopShellNoBootstrap(org.eclipse.ease.lang.python.py4j.StartStopTest)  Time elapsed: 0.201 s
17:40:09 [2020-07-04T21:40:09.745Z] multiStartStop(org.eclipse.ease.lang.python.py4j.StartStopTest)  Time elapsed: 0.201 s
17:40:09 [2020-07-04T21:40:09.745Z] 
17:40:09 [2020-07-04T21:40:09.745Z] Results:
17:40:09 [2020-07-04T21:40:09.745Z] 
17:40:09 [2020-07-04T21:40:09.745Z] Tests run: 120, Failures: 0, Errors: 0, Skipped: 13
17:40:09 [2020-07-04T21:40:09.745Z] 
17:40:10 [2020-07-04T21:40:10.307Z] [INFO] All tests passed!
17:40:10 [2020-07-04T21:40:10.307Z] [INFO] 
17:40:10 [2020-07-04T21:40:10.307Z] [INFO] --- maven-install-plugin:2.3.1:install (default-install) @ org.eclipse.ease.lang.python.py4j.test ---
17:40:10 [2020-07-04T21:40:10.307Z] [INFO] Installing /home/jenkins/agent/workspace/ease.verify.core.target.2019-03/tests/org.eclipse.ease.lang.python.py4j.test/target/org.eclipse.ease.lang.python.py4j.test-0.8.0-SNAPSHOT.jar to /home/jenkins/.m2/repository/org/eclipse/ease/org.eclipse.ease.lang.python.py4j.test/0.8.0-SNAPSHOT/org.eclipse.ease.lang.python.py4j.test-0.8.0-SNAPSHOT.jar
17:40:10 [2020-07-04T21:40:10.307Z] [INFO] Installing /home/jenkins/agent/workspace/ease.verify.core.target.2019-03/tests/org.eclipse.ease.lang.python.py4j.test/pom.xml to /home/jenkins/.m2/repository/org/eclipse/ease/org.eclipse.ease.lang.python.py4j.test/0.8.0-SNAPSHOT/org.eclipse.ease.lang.python.py4j.test-0.8.0-SNAPSHOT.pom
17:40:10 [2020-07-04T21:40:10.307Z] [INFO] Installing /home/jenkins/agent/workspace/ease.verify.core.target.2019-03/tests/org.eclipse.ease.lang.python.py4j.test/target/org.eclipse.ease.lang.python.py4j.test-0.8.0-SNAPSHOT-sources.jar to /home/jenkins/.m2/repository/org/eclipse/ease/org.eclipse.ease.lang.python.py4j.test/0.8.0-SNAPSHOT/org.eclipse.ease.lang.python.py4j.test-0.8.0-SNAPSHOT-sources.jar
17:40:10 [2020-07-04T21:40:10.307Z] [INFO] Installing /home/jenkins/agent/workspace/ease.verify.core.target.2019-03/tests/org.eclipse.ease.lang.python.py4j.test/target/p2content.xml to /home/jenkins/.m2/repository/org/eclipse/ease/org.eclipse.ease.lang.python.py4j.test/0.8.0-SNAPSHOT/org.eclipse.ease.lang.python.py4j.test-0.8.0-SNAPSHOT-p2metadata.xml
17:40:10 [2020-07-04T21:40:10.307Z] [INFO] Installing /home/jenkins/agent/workspace/ease.verify.core.target.2019-03/tests/org.eclipse.ease.lang.python.py4j.test/target/p2artifacts.xml to /home/jenkins/.m2/repository/org/eclipse/ease/org.eclipse.ease.lang.python.py4j.test/0.8.0-SNAPSHOT/org.eclipse.ease.lang.python.py4j.test-0.8.0-SNAPSHOT-p2artifacts.xml
17:40:10 [2020-07-04T21:40:10.307Z] [INFO] Installing /home/jenkins/agent/workspace/ease.verify.core.target.2019-03/tests/org.eclipse.ease.lang.python.py4j.test/target/p2content.xml to /home/jenkins/.m2/repository/org/eclipse/ease/org.eclipse.ease.lang.python.py4j.test/0.8.0-SNAPSHOT/org.eclipse.ease.lang.python.py4j.test-0.8.0-SNAPSHOT-p2metadata.xml
17:40:10 [2020-07-04T21:40:10.307Z] [INFO] Installing /home/jenkins/agent/workspace/ease.verify.core.target.2019-03/tests/org.eclipse.ease.lang.python.py4j.test/target/p2artifacts.xml to /home/jenkins/.m2/repository/org/eclipse/ease/org.eclipse.ease.lang.python.py4j.test/0.8.0-SNAPSHOT/org.eclipse.ease.lang.python.py4j.test-0.8.0-SNAPSHOT-p2artifacts.xml
17:40:10 [2020-07-04T21:40:10.307Z] [INFO] 
17:40:10 [2020-07-04T21:40:10.307Z] [INFO] --- tycho-p2-plugin:1.3.0:update-local-index (default-update-local-index) @ org.eclipse.ease.lang.python.py4j.test ---
17:40:10 [2020-07-04T21:40:10.307Z] [INFO] 
17:40:10 [2020-07-04T21:40:10.307Z] [INFO] -----< org.eclipse.ease:org.eclipse.ease.lang.scriptarchive.test >------
17:40:10 [2020-07-04T21:40:10.307Z] [INFO] Building org.eclipse.ease.lang.scriptarchive.test 0.8.0-SNAPSHOT [45/48]
17:40:10 [2020-07-04T21:40:10.307Z] [INFO] ------------------------[ eclipse-test-plugin ]-------------------------
17:40:10 [2020-07-04T21:40:10.307Z] [INFO] 
17:40:10 [2020-07-04T21:40:10.307Z] [INFO] --- maven-clean-plugin:2.5:clean (default-clean) @ org.eclipse.ease.lang.scriptarchive.test ---
17:40:10 [2020-07-04T21:40:10.307Z] [INFO] 
17:40:10 [2020-07-04T21:40:10.307Z] [INFO] --- tycho-packaging-plugin:1.3.0:build-qualifier (default-build-qualifier) @ org.eclipse.ease.lang.scriptarchive.test ---
17:40:10 [2020-07-04T21:40:10.307Z] [INFO] The project's OSGi version is 0.8.0.I201910171213
17:40:10 [2020-07-04T21:40:10.307Z] [INFO] 
17:40:10 [2020-07-04T21:40:10.307Z] [INFO] --- tycho-packaging-plugin:1.3.0:validate-id (default-validate-id) @ org.eclipse.ease.lang.scriptarchive.test ---
17:40:10 [2020-07-04T21:40:10.307Z] [INFO] 
17:40:10 [2020-07-04T21:40:10.307Z] [INFO] --- tycho-packaging-plugin:1.3.0:validate-version (default-validate-version) @ org.eclipse.ease.lang.scriptarchive.test ---
17:40:10 [2020-07-04T21:40:10.307Z] [INFO] 
17:40:10 [2020-07-04T21:40:10.307Z] [INFO] >>> maven-javadoc-plugin:2.9.1:javadoc (build-docs) > generate-sources @ org.eclipse.ease.lang.scriptarchive.test >>>
17:40:10 [2020-07-04T21:40:10.307Z] [INFO] 
17:40:10 [2020-07-04T21:40:10.307Z] [INFO] --- tycho-packaging-plugin:1.3.0:build-qualifier (default-build-qualifier) @ org.eclipse.ease.lang.scriptarchive.test ---
17:40:10 [2020-07-04T21:40:10.307Z] [INFO] The project's OSGi version is 0.8.0.I201910171213
17:40:10 [2020-07-04T21:40:10.307Z] [INFO] 
17:40:10 [2020-07-04T21:40:10.307Z] [INFO] --- tycho-packaging-plugin:1.3.0:validate-id (default-validate-id) @ org.eclipse.ease.lang.scriptarchive.test ---
17:40:10 [2020-07-04T21:40:10.307Z] [INFO] 
17:40:10 [2020-07-04T21:40:10.307Z] [INFO] --- tycho-packaging-plugin:1.3.0:validate-version (default-validate-version) @ org.eclipse.ease.lang.scriptarchive.test ---
17:40:10 [2020-07-04T21:40:10.307Z] [INFO] 
17:40:10 [2020-07-04T21:40:10.307Z] [INFO] <<< maven-javadoc-plugin:2.9.1:javadoc (build-docs) < generate-sources @ org.eclipse.ease.lang.scriptarchive.test <<<
17:40:10 [2020-07-04T21:40:10.307Z] [INFO] 
17:40:10 [2020-07-04T21:40:10.307Z] [INFO] 
17:40:10 [2020-07-04T21:40:10.308Z] [INFO] --- maven-javadoc-plugin:2.9.1:javadoc (build-docs) @ org.eclipse.ease.lang.scriptarchive.test ---
17:40:10 [2020-07-04T21:40:10.308Z] [ERROR] Error fetching link: http://help.eclipse.org/oxygen/topic/org.eclipse.platform.doc.isv/reference/api/package-list. Ignored it.
17:40:11 [2020-07-04T21:40:11.688Z] [INFO] 
17:40:11 [2020-07-04T21:40:11.688Z] Loading source files for package org.eclipse.ease.lang.scriptarchive...
17:40:11 [2020-07-04T21:40:11.688Z] Constructing Javadoc information...
17:40:11 [2020-07-04T21:40:11.688Z] WARNING: Cannot open location "/home/jenkins/agent/workspace/ease.verify.core.target.2019-03/tests/org.eclipse.ease.lang.scriptarchive.test/target/javadoc-bundle-options/package-list"
17:40:11 [2020-07-04T21:40:11.688Z] No plugin definition found, skipping
17:40:11 [2020-07-04T21:40:11.688Z] No plugin definition found, skipping
17:40:11 [2020-07-04T21:40:11.688Z] [WARNING] Javadoc Warnings
17:40:11 [2020-07-04T21:40:11.688Z] [WARNING] Picked up JAVA_TOOL_OPTIONS: -Dmaven.ext.class.path="/home/jenkins/agent/workspace/ease.verify.core.target.2019-03@tmp/withMaven6ec5de10/pipeline-maven-spy.jar" -Dorg.jenkinsci.plugins.pipeline.maven.reportsFolder="/home/jenkins/agent/workspace/ease.verify.core.target.2019-03@tmp/withMaven6ec5de10"
17:40:11 [2020-07-04T21:40:11.688Z] [INFO] 
17:40:11 [2020-07-04T21:40:11.688Z] [INFO] --- build-helper-maven-plugin:1.9.1:add-resource (add_help) @ org.eclipse.ease.lang.scriptarchive.test ---
17:40:11 [2020-07-04T21:40:11.688Z] [INFO] 
17:40:11 [2020-07-04T21:40:11.688Z] [INFO] --- maven-resources-plugin:2.4.3:resources (default-resources) @ org.eclipse.ease.lang.scriptarchive.test ---
17:40:11 [2020-07-04T21:40:11.688Z] [INFO] Using 'UTF-8' encoding to copy filtered resources.
17:40:11 [2020-07-04T21:40:11.689Z] [INFO] skip non existing resourceDirectory /home/jenkins/agent/workspace/ease.verify.core.target.2019-03/tests/org.eclipse.ease.lang.scriptarchive.test/src/main/resources
17:40:11 [2020-07-04T21:40:11.689Z] [INFO] skip non existing resourceDirectory /home/jenkins/agent/workspace/ease.verify.core.target.2019-03/tests/org.eclipse.ease.lang.scriptarchive.test/help
17:40:11 [2020-07-04T21:40:11.689Z] [INFO] 
17:40:11 [2020-07-04T21:40:11.689Z] [INFO] --- tycho-compiler-plugin:1.3.0:compile (default-compile) @ org.eclipse.ease.lang.scriptarchive.test ---
17:40:11 [2020-07-04T21:40:11.689Z] [INFO] Compiling 1 source file to /home/jenkins/agent/workspace/ease.verify.core.target.2019-03/tests/org.eclipse.ease.lang.scriptarchive.test/target/classes
17:40:11 [2020-07-04T21:40:11.689Z] [INFO] 
17:40:11 [2020-07-04T21:40:11.689Z] [INFO] --- maven-resources-plugin:2.4.3:testResources (default-testResources) @ org.eclipse.ease.lang.scriptarchive.test ---
17:40:11 [2020-07-04T21:40:11.689Z] [INFO] Using 'UTF-8' encoding to copy filtered resources.
17:40:11 [2020-07-04T21:40:11.689Z] [INFO] skip non existing resourceDirectory /home/jenkins/agent/workspace/ease.verify.core.target.2019-03/tests/org.eclipse.ease.lang.scriptarchive.test/src/test/resources
17:40:11 [2020-07-04T21:40:11.689Z] [INFO] 
17:40:11 [2020-07-04T21:40:11.689Z] [INFO] --- tycho-source-plugin:1.3.0:plugin-source (plugin-source) @ org.eclipse.ease.lang.scriptarchive.test ---
17:40:11 [2020-07-04T21:40:11.689Z] [INFO] Building jar: /home/jenkins/agent/workspace/ease.verify.core.target.2019-03/tests/org.eclipse.ease.lang.scriptarchive.test/target/org.eclipse.ease.lang.scriptarchive.test-0.8.0-SNAPSHOT-sources.jar
17:40:11 [2020-07-04T21:40:11.689Z] [INFO] 
17:40:11 [2020-07-04T21:40:11.689Z] [INFO] --- target-platform-configuration:1.3.0:target-platform (default-target-platform) @ org.eclipse.ease.lang.scriptarchive.test ---
17:40:11 [2020-07-04T21:40:11.689Z] [INFO] 
17:40:11 [2020-07-04T21:40:11.689Z] [INFO] --- tycho-packaging-plugin:1.3.0:package-plugin (default-package-plugin) @ org.eclipse.ease.lang.scriptarchive.test ---
17:40:11 [2020-07-04T21:40:11.689Z] [INFO] Building jar: /home/jenkins/agent/workspace/ease.verify.core.target.2019-03/tests/org.eclipse.ease.lang.scriptarchive.test/target/org.eclipse.ease.lang.scriptarchive.test-0.8.0-SNAPSHOT.jar
17:40:11 [2020-07-04T21:40:11.689Z] [INFO] 
17:40:11 [2020-07-04T21:40:11.689Z] [INFO] --- tycho-p2-plugin:1.3.0:p2-metadata-default (default-p2-metadata-default) @ org.eclipse.ease.lang.scriptarchive.test ---
17:40:11 [2020-07-04T21:40:11.689Z] [INFO] 
17:40:11 [2020-07-04T21:40:11.689Z] [INFO] --- tycho-source-feature-plugin:1.3.0:source-feature (source-feature) @ org.eclipse.ease.lang.scriptarchive.test ---
17:40:11 [2020-07-04T21:40:11.689Z] [INFO] 
17:40:11 [2020-07-04T21:40:11.689Z] [INFO] --- tycho-p2-plugin:1.3.0:p2-metadata (attached-p2-metadata) @ org.eclipse.ease.lang.scriptarchive.test ---
17:40:11 [2020-07-04T21:40:11.689Z] [INFO] 
17:40:11 [2020-07-04T21:40:11.689Z] [INFO] --- tycho-surefire-plugin:1.3.0:test (default-test) @ org.eclipse.ease.lang.scriptarchive.test ---
17:40:11 [2020-07-04T21:40:11.689Z] [INFO] Expected eclipse log file: /home/jenkins/agent/workspace/ease.verify.core.target.2019-03/tests/org.eclipse.ease.lang.scriptarchive.test/target/work/data/.metadata/.log
17:40:11 [2020-07-04T21:40:11.689Z] [INFO] Command line:
17:40:11 [2020-07-04T21:40:11.689Z] 	[/opt/tools/java/oracle/jdk-8/1.8.0_202/jre/bin/java, -Dosgi.noShutdown=false, -Dosgi.os=linux, -Dosgi.ws=gtk, -Dosgi.arch=x86_64, -Dosgi.clean=true, -jar, /home/jenkins/.m2/repository/p2/osgi/bundle/org.eclipse.equinox.launcher/1.5.700.v20200207-2156/org.eclipse.equinox.launcher-1.5.700.v20200207-2156.jar, -data, /home/jenkins/agent/workspace/ease.verify.core.target.2019-03/tests/org.eclipse.ease.lang.scriptarchive.test/target/work/data, -install, /home/jenkins/agent/workspace/ease.verify.core.target.2019-03/tests/org.eclipse.ease.lang.scriptarchive.test/target/work, -configuration, /home/jenkins/agent/workspace/ease.verify.core.target.2019-03/tests/org.eclipse.ease.lang.scriptarchive.test/target/work/configuration, -application, org.eclipse.tycho.surefire.osgibooter.headlesstest, -testproperties, /home/jenkins/agent/workspace/ease.verify.core.target.2019-03/tests/org.eclipse.ease.lang.scriptarchive.test/target/surefire.properties]
17:40:11 [2020-07-04T21:40:11.689Z] Picked up JAVA_TOOL_OPTIONS: -Dmaven.ext.class.path="/home/jenkins/agent/workspace/ease.verify.core.target.2019-03@tmp/withMaven6ec5de10/pipeline-maven-spy.jar" -Dorg.jenkinsci.plugins.pipeline.maven.reportsFolder="/home/jenkins/agent/workspace/ease.verify.core.target.2019-03@tmp/withMaven6ec5de10" 
17:40:13 [2020-07-04T21:40:13.089Z] Running org.eclipse.ease.lang.scriptarchive.ArchiveEngineTest
17:40:13 [2020-07-04T21:40:13.089Z] We are running from a zip file!
17:40:13 [2020-07-04T21:40:13.345Z] org.eclipse.ease.ScriptExecutionException: SyntaxError: missing ; before statement (workspace://__EASE_ScriptArchive_1/scripts/Master.js#3)
17:40:13 [2020-07-04T21:40:13.345Z] this is an error
17:40:13 [2020-07-04T21:40:13.345Z]        ^
17:40:13 [2020-07-04T21:40:13.345Z] 	at Master.js,workspace://__EASE_ScriptArchive_1/scripts/Master.js
17:40:13 [2020-07-04T21:40:13.345Z] org.eclipse.ease.ScriptExecutionException: SyntaxError: missing ; before statement (workspace://__EASE_ScriptArchive_1/scripts/Master.js#3)
17:40:13 [2020-07-04T21:40:13.345Z] this is an error
17:40:13 [2020-07-04T21:40:13.345Z]        ^
17:40:13 [2020-07-04T21:40:13.345Z] 	at Master.js,workspace://__EASE_ScriptArchive_1/scripts/Master.js
17:40:13 [2020-07-04T21:40:13.345Z] Tests run: 7, Failures: 0, Errors: 0, Skipped: 0, Time elapsed: 0.463 s - in org.eclipse.ease.lang.scriptarchive.ArchiveEngineTest
17:40:13 [2020-07-04T21:40:13.345Z] executeWithManifest(org.eclipse.ease.lang.scriptarchive.ArchiveEngineTest)  Time elapsed: 0.349 s
17:40:13 [2020-07-04T21:40:13.345Z] zipFileRegistration(org.eclipse.ease.lang.scriptarchive.ArchiveEngineTest)  Time elapsed: 0.006 s
17:40:13 [2020-07-04T21:40:13.345Z] engineIdRegistration(org.eclipse.ease.lang.scriptarchive.ArchiveEngineTest)  Time elapsed: 0 s
17:40:13 [2020-07-04T21:40:13.345Z] jarFileRegistration(org.eclipse.ease.lang.scriptarchive.ArchiveEngineTest)  Time elapsed: 0.001 s
17:40:13 [2020-07-04T21:40:13.345Z] sarFileRegistration(org.eclipse.ease.lang.scriptarchive.ArchiveEngineTest)  Time elapsed: 0 s
17:40:13 [2020-07-04T21:40:13.345Z] executeWithErrors(org.eclipse.ease.lang.scriptarchive.ArchiveEngineTest)  Time elapsed: 0.034 s
17:40:13 [2020-07-04T21:40:13.345Z] executeWithIncludes(org.eclipse.ease.lang.scriptarchive.ArchiveEngineTest)  Time elapsed: 0.058 s
17:40:13 [2020-07-04T21:40:13.345Z] 
17:40:13 [2020-07-04T21:40:13.345Z] Results:
17:40:13 [2020-07-04T21:40:13.345Z] 
17:40:13 [2020-07-04T21:40:13.345Z] Tests run: 7, Failures: 0, Errors: 0, Skipped: 0
17:40:13 [2020-07-04T21:40:13.345Z] 
17:40:13 [2020-07-04T21:40:13.907Z] [INFO] All tests passed!
17:40:13 [2020-07-04T21:40:13.907Z] [INFO] 
17:40:13 [2020-07-04T21:40:13.907Z] [INFO] --- maven-install-plugin:2.3.1:install (default-install) @ org.eclipse.ease.lang.scriptarchive.test ---
17:40:13 [2020-07-04T21:40:13.907Z] [INFO] Installing /home/jenkins/agent/workspace/ease.verify.core.target.2019-03/tests/org.eclipse.ease.lang.scriptarchive.test/target/org.eclipse.ease.lang.scriptarchive.test-0.8.0-SNAPSHOT.jar to /home/jenkins/.m2/repository/org/eclipse/ease/org.eclipse.ease.lang.scriptarchive.test/0.8.0-SNAPSHOT/org.eclipse.ease.lang.scriptarchive.test-0.8.0-SNAPSHOT.jar
17:40:13 [2020-07-04T21:40:13.907Z] [INFO] Installing /home/jenkins/agent/workspace/ease.verify.core.target.2019-03/tests/org.eclipse.ease.lang.scriptarchive.test/pom.xml to /home/jenkins/.m2/repository/org/eclipse/ease/org.eclipse.ease.lang.scriptarchive.test/0.8.0-SNAPSHOT/org.eclipse.ease.lang.scriptarchive.test-0.8.0-SNAPSHOT.pom
17:40:13 [2020-07-04T21:40:13.907Z] [INFO] Installing /home/jenkins/agent/workspace/ease.verify.core.target.2019-03/tests/org.eclipse.ease.lang.scriptarchive.test/target/org.eclipse.ease.lang.scriptarchive.test-0.8.0-SNAPSHOT-sources.jar to /home/jenkins/.m2/repository/org/eclipse/ease/org.eclipse.ease.lang.scriptarchive.test/0.8.0-SNAPSHOT/org.eclipse.ease.lang.scriptarchive.test-0.8.0-SNAPSHOT-sources.jar
17:40:13 [2020-07-04T21:40:13.907Z] [INFO] Installing /home/jenkins/agent/workspace/ease.verify.core.target.2019-03/tests/org.eclipse.ease.lang.scriptarchive.test/target/p2content.xml to /home/jenkins/.m2/repository/org/eclipse/ease/org.eclipse.ease.lang.scriptarchive.test/0.8.0-SNAPSHOT/org.eclipse.ease.lang.scriptarchive.test-0.8.0-SNAPSHOT-p2metadata.xml
17:40:13 [2020-07-04T21:40:13.907Z] [INFO] Installing /home/jenkins/agent/workspace/ease.verify.core.target.2019-03/tests/org.eclipse.ease.lang.scriptarchive.test/target/p2artifacts.xml to /home/jenkins/.m2/repository/org/eclipse/ease/org.eclipse.ease.lang.scriptarchive.test/0.8.0-SNAPSHOT/org.eclipse.ease.lang.scriptarchive.test-0.8.0-SNAPSHOT-p2artifacts.xml
17:40:13 [2020-07-04T21:40:13.907Z] [INFO] Installing /home/jenkins/agent/workspace/ease.verify.core.target.2019-03/tests/org.eclipse.ease.lang.scriptarchive.test/target/p2content.xml to /home/jenkins/.m2/repository/org/eclipse/ease/org.eclipse.ease.lang.scriptarchive.test/0.8.0-SNAPSHOT/org.eclipse.ease.lang.scriptarchive.test-0.8.0-SNAPSHOT-p2metadata.xml
17:40:13 [2020-07-04T21:40:13.907Z] [INFO] Installing /home/jenkins/agent/workspace/ease.verify.core.target.2019-03/tests/org.eclipse.ease.lang.scriptarchive.test/target/p2artifacts.xml to /home/jenkins/.m2/repository/org/eclipse/ease/org.eclipse.ease.lang.scriptarchive.test/0.8.0-SNAPSHOT/org.eclipse.ease.lang.scriptarchive.test-0.8.0-SNAPSHOT-p2artifacts.xml
17:40:13 [2020-07-04T21:40:13.908Z] [INFO] 
17:40:13 [2020-07-04T21:40:13.908Z] [INFO] --- tycho-p2-plugin:1.3.0:update-local-index (default-update-local-index) @ org.eclipse.ease.lang.scriptarchive.test ---
17:40:13 [2020-07-04T21:40:13.908Z] [INFO] 
17:40:13 [2020-07-04T21:40:13.908Z] [INFO] --------< org.eclipse.ease:org.eclipse.ease.lang.unittest.test >--------
17:40:13 [2020-07-04T21:40:13.908Z] [INFO] Building org.eclipse.ease.lang.unittest.test 0.8.0-SNAPSHOT      [46/48]
17:40:13 [2020-07-04T21:40:13.908Z] [INFO] ------------------------[ eclipse-test-plugin ]-------------------------
17:40:13 [2020-07-04T21:40:13.908Z] [INFO] 
17:40:13 [2020-07-04T21:40:13.908Z] [INFO] --- maven-clean-plugin:2.5:clean (default-clean) @ org.eclipse.ease.lang.unittest.test ---
17:40:13 [2020-07-04T21:40:13.908Z] [INFO] 
17:40:13 [2020-07-04T21:40:13.908Z] [INFO] --- tycho-packaging-plugin:1.3.0:build-qualifier (default-build-qualifier) @ org.eclipse.ease.lang.unittest.test ---
17:40:13 [2020-07-04T21:40:13.908Z] [INFO] The project's OSGi version is 0.8.0.I201908141044
17:40:13 [2020-07-04T21:40:13.908Z] [INFO] 
17:40:13 [2020-07-04T21:40:13.908Z] [INFO] --- tycho-packaging-plugin:1.3.0:validate-id (default-validate-id) @ org.eclipse.ease.lang.unittest.test ---
17:40:13 [2020-07-04T21:40:13.908Z] [INFO] 
17:40:13 [2020-07-04T21:40:13.908Z] [INFO] --- tycho-packaging-plugin:1.3.0:validate-version (default-validate-version) @ org.eclipse.ease.lang.unittest.test ---
17:40:13 [2020-07-04T21:40:13.908Z] [INFO] 
17:40:13 [2020-07-04T21:40:13.908Z] [INFO] >>> maven-javadoc-plugin:2.9.1:javadoc (build-docs) > generate-sources @ org.eclipse.ease.lang.unittest.test >>>
17:40:13 [2020-07-04T21:40:13.908Z] [INFO] 
17:40:13 [2020-07-04T21:40:13.908Z] [INFO] --- tycho-packaging-plugin:1.3.0:build-qualifier (default-build-qualifier) @ org.eclipse.ease.lang.unittest.test ---
17:40:13 [2020-07-04T21:40:13.908Z] [INFO] The project's OSGi version is 0.8.0.I201908141044
17:40:13 [2020-07-04T21:40:13.908Z] [INFO] 
17:40:13 [2020-07-04T21:40:13.908Z] [INFO] --- tycho-packaging-plugin:1.3.0:validate-id (default-validate-id) @ org.eclipse.ease.lang.unittest.test ---
17:40:13 [2020-07-04T21:40:13.908Z] [INFO] 
17:40:13 [2020-07-04T21:40:13.908Z] [INFO] --- tycho-packaging-plugin:1.3.0:validate-version (default-validate-version) @ org.eclipse.ease.lang.unittest.test ---
17:40:13 [2020-07-04T21:40:13.908Z] [INFO] 
17:40:13 [2020-07-04T21:40:13.908Z] [INFO] <<< maven-javadoc-plugin:2.9.1:javadoc (build-docs) < generate-sources @ org.eclipse.ease.lang.unittest.test <<<
17:40:13 [2020-07-04T21:40:13.908Z] [INFO] 
17:40:13 [2020-07-04T21:40:13.908Z] [INFO] 
17:40:13 [2020-07-04T21:40:13.908Z] [INFO] --- maven-javadoc-plugin:2.9.1:javadoc (build-docs) @ org.eclipse.ease.lang.unittest.test ---
17:40:13 [2020-07-04T21:40:13.908Z] [ERROR] Error fetching link: http://help.eclipse.org/oxygen/topic/org.eclipse.platform.doc.isv/reference/api/package-list. Ignored it.
17:40:15 [2020-07-04T21:40:15.288Z] [INFO] 
17:40:15 [2020-07-04T21:40:15.288Z] Loading source files for package org.eclipse.ease.lang.unittest...
17:40:15 [2020-07-04T21:40:15.288Z] Constructing Javadoc information...
17:40:15 [2020-07-04T21:40:15.288Z] WARNING: Cannot open location "/home/jenkins/agent/workspace/ease.verify.core.target.2019-03/tests/org.eclipse.ease.lang.unittest.test/target/javadoc-bundle-options/package-list"
17:40:15 [2020-07-04T21:40:15.288Z] No plugin definition found, skipping
17:40:15 [2020-07-04T21:40:15.288Z] No plugin definition found, skipping
17:40:15 [2020-07-04T21:40:15.288Z] [WARNING] Javadoc Warnings
17:40:15 [2020-07-04T21:40:15.288Z] [WARNING] Picked up JAVA_TOOL_OPTIONS: -Dmaven.ext.class.path="/home/jenkins/agent/workspace/ease.verify.core.target.2019-03@tmp/withMaven6ec5de10/pipeline-maven-spy.jar" -Dorg.jenkinsci.plugins.pipeline.maven.reportsFolder="/home/jenkins/agent/workspace/ease.verify.core.target.2019-03@tmp/withMaven6ec5de10"
17:40:15 [2020-07-04T21:40:15.288Z] [INFO] 
17:40:15 [2020-07-04T21:40:15.288Z] [INFO] --- build-helper-maven-plugin:1.9.1:add-resource (add_help) @ org.eclipse.ease.lang.unittest.test ---
17:40:15 [2020-07-04T21:40:15.288Z] [INFO] 
17:40:15 [2020-07-04T21:40:15.288Z] [INFO] --- maven-resources-plugin:2.4.3:resources (default-resources) @ org.eclipse.ease.lang.unittest.test ---
17:40:15 [2020-07-04T21:40:15.288Z] [INFO] Using 'UTF-8' encoding to copy filtered resources.
17:40:15 [2020-07-04T21:40:15.288Z] [INFO] skip non existing resourceDirectory /home/jenkins/agent/workspace/ease.verify.core.target.2019-03/tests/org.eclipse.ease.lang.unittest.test/src/main/resources
17:40:15 [2020-07-04T21:40:15.288Z] [INFO] skip non existing resourceDirectory /home/jenkins/agent/workspace/ease.verify.core.target.2019-03/tests/org.eclipse.ease.lang.unittest.test/help
17:40:15 [2020-07-04T21:40:15.288Z] [INFO] 
17:40:15 [2020-07-04T21:40:15.288Z] [INFO] --- tycho-compiler-plugin:1.3.0:compile (default-compile) @ org.eclipse.ease.lang.unittest.test ---
17:40:15 [2020-07-04T21:40:15.288Z] [INFO] Compiling 3 source files to /home/jenkins/agent/workspace/ease.verify.core.target.2019-03/tests/org.eclipse.ease.lang.unittest.test/target/classes
17:40:15 [2020-07-04T21:40:15.288Z] [INFO] 
17:40:15 [2020-07-04T21:40:15.288Z] [INFO] --- maven-resources-plugin:2.4.3:testResources (default-testResources) @ org.eclipse.ease.lang.unittest.test ---
17:40:15 [2020-07-04T21:40:15.288Z] [INFO] Using 'UTF-8' encoding to copy filtered resources.
17:40:15 [2020-07-04T21:40:15.288Z] [INFO] skip non existing resourceDirectory /home/jenkins/agent/workspace/ease.verify.core.target.2019-03/tests/org.eclipse.ease.lang.unittest.test/src/test/resources
17:40:15 [2020-07-04T21:40:15.288Z] [INFO] 
17:40:15 [2020-07-04T21:40:15.288Z] [INFO] --- tycho-source-plugin:1.3.0:plugin-source (plugin-source) @ org.eclipse.ease.lang.unittest.test ---
17:40:15 [2020-07-04T21:40:15.288Z] [WARNING] Bundle-Name header not found in /home/jenkins/agent/workspace/ease.verify.core.target.2019-03/tests/org.eclipse.ease.lang.unittest.test/META-INF/MANIFEST.MF, fallback to Bundle-SymbolicName for source bundle
17:40:15 [2020-07-04T21:40:15.288Z] [WARNING] Bundle-Vendor header not found in /home/jenkins/agent/workspace/ease.verify.core.target.2019-03/tests/org.eclipse.ease.lang.unittest.test/META-INF/MANIFEST.MF, fallback to 'unknown' for source bundle
17:40:15 [2020-07-04T21:40:15.289Z] [INFO] Building jar: /home/jenkins/agent/workspace/ease.verify.core.target.2019-03/tests/org.eclipse.ease.lang.unittest.test/target/org.eclipse.ease.lang.unittest.test-0.8.0-SNAPSHOT-sources.jar
17:40:15 [2020-07-04T21:40:15.289Z] [INFO] 
17:40:15 [2020-07-04T21:40:15.289Z] [INFO] --- target-platform-configuration:1.3.0:target-platform (default-target-platform) @ org.eclipse.ease.lang.unittest.test ---
17:40:15 [2020-07-04T21:40:15.289Z] [INFO] 
17:40:15 [2020-07-04T21:40:15.289Z] [INFO] --- tycho-packaging-plugin:1.3.0:package-plugin (default-package-plugin) @ org.eclipse.ease.lang.unittest.test ---
17:40:15 [2020-07-04T21:40:15.289Z] [INFO] Building jar: /home/jenkins/agent/workspace/ease.verify.core.target.2019-03/tests/org.eclipse.ease.lang.unittest.test/target/org.eclipse.ease.lang.unittest.test-0.8.0-SNAPSHOT.jar
17:40:15 [2020-07-04T21:40:15.289Z] [INFO] 
17:40:15 [2020-07-04T21:40:15.289Z] [INFO] --- tycho-p2-plugin:1.3.0:p2-metadata-default (default-p2-metadata-default) @ org.eclipse.ease.lang.unittest.test ---
17:40:15 [2020-07-04T21:40:15.289Z] [INFO] 
17:40:15 [2020-07-04T21:40:15.289Z] [INFO] --- tycho-source-feature-plugin:1.3.0:source-feature (source-feature) @ org.eclipse.ease.lang.unittest.test ---
17:40:15 [2020-07-04T21:40:15.289Z] [INFO] 
17:40:15 [2020-07-04T21:40:15.289Z] [INFO] --- tycho-p2-plugin:1.3.0:p2-metadata (attached-p2-metadata) @ org.eclipse.ease.lang.unittest.test ---
17:40:15 [2020-07-04T21:40:15.289Z] [INFO] 
17:40:15 [2020-07-04T21:40:15.289Z] [INFO] --- tycho-surefire-plugin:1.3.0:test (default-test) @ org.eclipse.ease.lang.unittest.test ---
17:40:15 [2020-07-04T21:40:15.289Z] [INFO] Expected eclipse log file: /home/jenkins/agent/workspace/ease.verify.core.target.2019-03/tests/org.eclipse.ease.lang.unittest.test/target/work/data/.metadata/.log
17:40:15 [2020-07-04T21:40:15.289Z] [INFO] Command line:
17:40:15 [2020-07-04T21:40:15.289Z] 	[/opt/tools/java/oracle/jdk-8/1.8.0_202/jre/bin/java, -Dosgi.noShutdown=false, -Dosgi.os=linux, -Dosgi.ws=gtk, -Dosgi.arch=x86_64, -Dosgi.clean=true, -jar, /home/jenkins/.m2/repository/p2/osgi/bundle/org.eclipse.equinox.launcher/1.5.700.v20200207-2156/org.eclipse.equinox.launcher-1.5.700.v20200207-2156.jar, -data, /home/jenkins/agent/workspace/ease.verify.core.target.2019-03/tests/org.eclipse.ease.lang.unittest.test/target/work/data, -install, /home/jenkins/agent/workspace/ease.verify.core.target.2019-03/tests/org.eclipse.ease.lang.unittest.test/target/work, -configuration, /home/jenkins/agent/workspace/ease.verify.core.target.2019-03/tests/org.eclipse.ease.lang.unittest.test/target/work/configuration, -application, org.eclipse.tycho.surefire.osgibooter.headlesstest, -testproperties, /home/jenkins/agent/workspace/ease.verify.core.target.2019-03/tests/org.eclipse.ease.lang.unittest.test/target/surefire.properties]
17:40:15 [2020-07-04T21:40:15.289Z] Picked up JAVA_TOOL_OPTIONS: -Dmaven.ext.class.path="/home/jenkins/agent/workspace/ease.verify.core.target.2019-03@tmp/withMaven6ec5de10/pipeline-maven-spy.jar" -Dorg.jenkinsci.plugins.pipeline.maven.reportsFolder="/home/jenkins/agent/workspace/ease.verify.core.target.2019-03@tmp/withMaven6ec5de10" 
17:40:16 [2020-07-04T21:40:16.684Z] Running org.eclipse.ease.lang.unittest.ClassicJavaScriptTest
17:40:18 [2020-07-04T21:40:18.048Z] Tests run: 7, Failures: 0, Errors: 0, Skipped: 0, Time elapsed: 1.211 s - in org.eclipse.ease.lang.unittest.ClassicJavaScriptTest
17:40:18 [2020-07-04T21:40:18.048Z] folderStatus(org.eclipse.ease.lang.unittest.ClassicJavaScriptTest)  Time elapsed: 0.472 s
17:40:18 [2020-07-04T21:40:18.048Z] errorTestStatus(org.eclipse.ease.lang.unittest.ClassicJavaScriptTest)  Time elapsed: 0.16 s
17:40:18 [2020-07-04T21:40:18.048Z] failureTestStatus(org.eclipse.ease.lang.unittest.ClassicJavaScriptTest)  Time elapsed: 0.113 s
17:40:18 [2020-07-04T21:40:18.048Z] verifyOutput(org.eclipse.ease.lang.unittest.ClassicJavaScriptTest)  Time elapsed: 0.108 s
17:40:18 [2020-07-04T21:40:18.048Z] suiteStatus(org.eclipse.ease.lang.unittest.ClassicJavaScriptTest)  Time elapsed: 0.094 s
17:40:18 [2020-07-04T21:40:18.048Z] ignoreTestStatus(org.eclipse.ease.lang.unittest.ClassicJavaScriptTest)  Time elapsed: 0.092 s
17:40:18 [2020-07-04T21:40:18.048Z] passTestStatus(org.eclipse.ease.lang.unittest.ClassicJavaScriptTest)  Time elapsed: 0.097 s
17:40:18 [2020-07-04T21:40:18.048Z] Running org.eclipse.ease.lang.unittest.ModernJavaScriptTest
17:40:18 [2020-07-04T21:40:18.610Z] Tests run: 8, Failures: 0, Errors: 0, Skipped: 0, Time elapsed: 0.595 s - in org.eclipse.ease.lang.unittest.ModernJavaScriptTest
17:40:18 [2020-07-04T21:40:18.610Z] folderStatus(org.eclipse.ease.lang.unittest.ModernJavaScriptTest)  Time elapsed: 0.103 s
17:40:18 [2020-07-04T21:40:18.610Z] verifyOutput(org.eclipse.ease.lang.unittest.ModernJavaScriptTest)  Time elapsed: 0.08 s
17:40:18 [2020-07-04T21:40:18.610Z] suiteStatus(org.eclipse.ease.lang.unittest.ModernJavaScriptTest)  Time elapsed: 0.065 s
17:40:18 [2020-07-04T21:40:18.610Z] ignoreTestStatus(org.eclipse.ease.lang.unittest.ModernJavaScriptTest)  Time elapsed: 0.078 s
17:40:18 [2020-07-04T21:40:18.610Z] ignoreTestClassStatus(org.eclipse.ease.lang.unittest.ModernJavaScriptTest)  Time elapsed: 0.069 s
17:40:18 [2020-07-04T21:40:18.610Z] failureTestClassStatus(org.eclipse.ease.lang.unittest.ModernJavaScriptTest)  Time elapsed: 0.055 s
17:40:18 [2020-07-04T21:40:18.610Z] errorTestClassStatus(org.eclipse.ease.lang.unittest.ModernJavaScriptTest)  Time elapsed: 0.076 s
17:40:18 [2020-07-04T21:40:18.610Z] passTestClassStatus(org.eclipse.ease.lang.unittest.ModernJavaScriptTest)  Time elapsed: 0.067 s
17:40:18 [2020-07-04T21:40:18.610Z] 
17:40:18 [2020-07-04T21:40:18.610Z] Results:
17:40:18 [2020-07-04T21:40:18.610Z] 
17:40:18 [2020-07-04T21:40:18.610Z] Tests run: 15, Failures: 0, Errors: 0, Skipped: 0
17:40:18 [2020-07-04T21:40:18.610Z] 
17:40:19 [2020-07-04T21:40:19.172Z] [INFO] All tests passed!
17:40:19 [2020-07-04T21:40:19.172Z] [INFO] 
17:40:19 [2020-07-04T21:40:19.172Z] [INFO] --- maven-install-plugin:2.3.1:install (default-install) @ org.eclipse.ease.lang.unittest.test ---
17:40:19 [2020-07-04T21:40:19.172Z] [INFO] Installing /home/jenkins/agent/workspace/ease.verify.core.target.2019-03/tests/org.eclipse.ease.lang.unittest.test/target/org.eclipse.ease.lang.unittest.test-0.8.0-SNAPSHOT.jar to /home/jenkins/.m2/repository/org/eclipse/ease/org.eclipse.ease.lang.unittest.test/0.8.0-SNAPSHOT/org.eclipse.ease.lang.unittest.test-0.8.0-SNAPSHOT.jar
17:40:19 [2020-07-04T21:40:19.172Z] [INFO] Installing /home/jenkins/agent/workspace/ease.verify.core.target.2019-03/tests/org.eclipse.ease.lang.unittest.test/pom.xml to /home/jenkins/.m2/repository/org/eclipse/ease/org.eclipse.ease.lang.unittest.test/0.8.0-SNAPSHOT/org.eclipse.ease.lang.unittest.test-0.8.0-SNAPSHOT.pom
17:40:19 [2020-07-04T21:40:19.172Z] [INFO] Installing /home/jenkins/agent/workspace/ease.verify.core.target.2019-03/tests/org.eclipse.ease.lang.unittest.test/target/org.eclipse.ease.lang.unittest.test-0.8.0-SNAPSHOT-sources.jar to /home/jenkins/.m2/repository/org/eclipse/ease/org.eclipse.ease.lang.unittest.test/0.8.0-SNAPSHOT/org.eclipse.ease.lang.unittest.test-0.8.0-SNAPSHOT-sources.jar
17:40:19 [2020-07-04T21:40:19.172Z] [INFO] Installing /home/jenkins/agent/workspace/ease.verify.core.target.2019-03/tests/org.eclipse.ease.lang.unittest.test/target/p2content.xml to /home/jenkins/.m2/repository/org/eclipse/ease/org.eclipse.ease.lang.unittest.test/0.8.0-SNAPSHOT/org.eclipse.ease.lang.unittest.test-0.8.0-SNAPSHOT-p2metadata.xml
17:40:19 [2020-07-04T21:40:19.172Z] [INFO] Installing /home/jenkins/agent/workspace/ease.verify.core.target.2019-03/tests/org.eclipse.ease.lang.unittest.test/target/p2artifacts.xml to /home/jenkins/.m2/repository/org/eclipse/ease/org.eclipse.ease.lang.unittest.test/0.8.0-SNAPSHOT/org.eclipse.ease.lang.unittest.test-0.8.0-SNAPSHOT-p2artifacts.xml
17:40:19 [2020-07-04T21:40:19.172Z] [INFO] Installing /home/jenkins/agent/workspace/ease.verify.core.target.2019-03/tests/org.eclipse.ease.lang.unittest.test/target/p2content.xml to /home/jenkins/.m2/repository/org/eclipse/ease/org.eclipse.ease.lang.unittest.test/0.8.0-SNAPSHOT/org.eclipse.ease.lang.unittest.test-0.8.0-SNAPSHOT-p2metadata.xml
17:40:19 [2020-07-04T21:40:19.172Z] [INFO] Installing /home/jenkins/agent/workspace/ease.verify.core.target.2019-03/tests/org.eclipse.ease.lang.unittest.test/target/p2artifacts.xml to /home/jenkins/.m2/repository/org/eclipse/ease/org.eclipse.ease.lang.unittest.test/0.8.0-SNAPSHOT/org.eclipse.ease.lang.unittest.test-0.8.0-SNAPSHOT-p2artifacts.xml
17:40:19 [2020-07-04T21:40:19.172Z] [INFO] 
17:40:19 [2020-07-04T21:40:19.172Z] [INFO] --- tycho-p2-plugin:1.3.0:update-local-index (default-update-local-index) @ org.eclipse.ease.lang.unittest.test ---
17:40:19 [2020-07-04T21:40:19.172Z] [INFO] 
17:40:19 [2020-07-04T21:40:19.172Z] [INFO] -------------< org.eclipse.ease:org.eclipse.ease.ui.test >--------------
17:40:19 [2020-07-04T21:40:19.172Z] [INFO] Building org.eclipse.ease.ui.test 0.8.0-SNAPSHOT                 [47/48]
17:40:19 [2020-07-04T21:40:19.172Z] [INFO] ------------------------[ eclipse-test-plugin ]-------------------------
17:40:19 [2020-07-04T21:40:19.172Z] [INFO] 
17:40:19 [2020-07-04T21:40:19.172Z] [INFO] --- maven-clean-plugin:2.5:clean (default-clean) @ org.eclipse.ease.ui.test ---
17:40:19 [2020-07-04T21:40:19.172Z] [INFO] 
17:40:19 [2020-07-04T21:40:19.172Z] [INFO] --- tycho-packaging-plugin:1.3.0:build-qualifier (default-build-qualifier) @ org.eclipse.ease.ui.test ---
17:40:19 [2020-07-04T21:40:19.172Z] [INFO] The project's OSGi version is 0.8.0.I201910171213
17:40:19 [2020-07-04T21:40:19.172Z] [INFO] 
17:40:19 [2020-07-04T21:40:19.172Z] [INFO] --- tycho-packaging-plugin:1.3.0:validate-id (default-validate-id) @ org.eclipse.ease.ui.test ---
17:40:19 [2020-07-04T21:40:19.172Z] [INFO] 
17:40:19 [2020-07-04T21:40:19.172Z] [INFO] --- tycho-packaging-plugin:1.3.0:validate-version (default-validate-version) @ org.eclipse.ease.ui.test ---
17:40:19 [2020-07-04T21:40:19.172Z] [INFO] 
17:40:19 [2020-07-04T21:40:19.172Z] [INFO] >>> maven-javadoc-plugin:2.9.1:javadoc (build-docs) > generate-sources @ org.eclipse.ease.ui.test >>>
17:40:19 [2020-07-04T21:40:19.172Z] [INFO] 
17:40:19 [2020-07-04T21:40:19.172Z] [INFO] --- tycho-packaging-plugin:1.3.0:build-qualifier (default-build-qualifier) @ org.eclipse.ease.ui.test ---
17:40:19 [2020-07-04T21:40:19.172Z] [INFO] The project's OSGi version is 0.8.0.I201910171213
17:40:19 [2020-07-04T21:40:19.172Z] [INFO] 
17:40:19 [2020-07-04T21:40:19.172Z] [INFO] --- tycho-packaging-plugin:1.3.0:validate-id (default-validate-id) @ org.eclipse.ease.ui.test ---
17:40:19 [2020-07-04T21:40:19.172Z] [INFO] 
17:40:19 [2020-07-04T21:40:19.172Z] [INFO] --- tycho-packaging-plugin:1.3.0:validate-version (default-validate-version) @ org.eclipse.ease.ui.test ---
17:40:19 [2020-07-04T21:40:19.172Z] [INFO] 
17:40:19 [2020-07-04T21:40:19.172Z] [INFO] <<< maven-javadoc-plugin:2.9.1:javadoc (build-docs) < generate-sources @ org.eclipse.ease.ui.test <<<
17:40:19 [2020-07-04T21:40:19.172Z] [INFO] 
17:40:19 [2020-07-04T21:40:19.172Z] [INFO] 
17:40:19 [2020-07-04T21:40:19.172Z] [INFO] --- maven-javadoc-plugin:2.9.1:javadoc (build-docs) @ org.eclipse.ease.ui.test ---
17:40:19 [2020-07-04T21:40:19.172Z] [ERROR] Error fetching link: http://help.eclipse.org/oxygen/topic/org.eclipse.platform.doc.isv/reference/api/package-list. Ignored it.
17:40:20 [2020-07-04T21:40:20.538Z] [INFO] 
17:40:20 [2020-07-04T21:40:20.538Z] Loading source files for package org.eclipse.ease.ui.completion...
17:40:20 [2020-07-04T21:40:20.538Z] Loading source files for package org.eclipse.ease.ui.completion.provider...
17:40:20 [2020-07-04T21:40:20.538Z] Loading source files for package org.eclipse.ease.ui.completions.java.provider...
17:40:20 [2020-07-04T21:40:20.538Z] Loading source files for package org.eclipse.ease.ui.help.hovers...
17:40:20 [2020-07-04T21:40:20.538Z] Constructing Javadoc information...
17:40:20 [2020-07-04T21:40:20.538Z] WARNING: Cannot open location "/home/jenkins/agent/workspace/ease.verify.core.target.2019-03/tests/org.eclipse.ease.ui.test/target/javadoc-bundle-options/package-list"
17:40:20 [2020-07-04T21:40:20.538Z] [WARNING] Javadoc Warnings
17:40:20 [2020-07-04T21:40:20.538Z] [WARNING] Picked up JAVA_TOOL_OPTIONS: -Dmaven.ext.class.path="/home/jenkins/agent/workspace/ease.verify.core.target.2019-03@tmp/withMaven6ec5de10/pipeline-maven-spy.jar" -Dorg.jenkinsci.plugins.pipeline.maven.reportsFolder="/home/jenkins/agent/workspace/ease.verify.core.target.2019-03@tmp/withMaven6ec5de10"
17:40:20 [2020-07-04T21:40:20.538Z] [INFO] 
17:40:20 [2020-07-04T21:40:20.538Z] [INFO] --- build-helper-maven-plugin:1.9.1:add-resource (add_help) @ org.eclipse.ease.ui.test ---
17:40:20 [2020-07-04T21:40:20.538Z] [INFO] 
17:40:20 [2020-07-04T21:40:20.538Z] [INFO] --- maven-resources-plugin:2.4.3:resources (default-resources) @ org.eclipse.ease.ui.test ---
17:40:20 [2020-07-04T21:40:20.538Z] [INFO] Using 'UTF-8' encoding to copy filtered resources.
17:40:20 [2020-07-04T21:40:20.538Z] [INFO] skip non existing resourceDirectory /home/jenkins/agent/workspace/ease.verify.core.target.2019-03/tests/org.eclipse.ease.ui.test/src/main/resources
17:40:20 [2020-07-04T21:40:20.538Z] [INFO] Copying 2 resources to help
17:40:20 [2020-07-04T21:40:20.538Z] [INFO] 
17:40:20 [2020-07-04T21:40:20.538Z] [INFO] --- tycho-compiler-plugin:1.3.0:compile (default-compile) @ org.eclipse.ease.ui.test ---
17:40:20 [2020-07-04T21:40:20.538Z] [INFO] Compiling 6 source files to /home/jenkins/agent/workspace/ease.verify.core.target.2019-03/tests/org.eclipse.ease.ui.test/target/classes
17:40:20 [2020-07-04T21:40:20.538Z] [INFO] 
17:40:20 [2020-07-04T21:40:20.538Z] [INFO] --- maven-resources-plugin:2.4.3:testResources (default-testResources) @ org.eclipse.ease.ui.test ---
17:40:20 [2020-07-04T21:40:20.538Z] [INFO] Using 'UTF-8' encoding to copy filtered resources.
17:40:20 [2020-07-04T21:40:20.538Z] [INFO] skip non existing resourceDirectory /home/jenkins/agent/workspace/ease.verify.core.target.2019-03/tests/org.eclipse.ease.ui.test/src/test/resources
17:40:20 [2020-07-04T21:40:20.538Z] [INFO] 
17:40:20 [2020-07-04T21:40:20.538Z] [INFO] --- tycho-source-plugin:1.3.0:plugin-source (plugin-source) @ org.eclipse.ease.ui.test ---
17:40:20 [2020-07-04T21:40:20.538Z] [WARNING] Bundle-Vendor header not found in /home/jenkins/agent/workspace/ease.verify.core.target.2019-03/tests/org.eclipse.ease.ui.test/META-INF/MANIFEST.MF, fallback to 'unknown' for source bundle
17:40:20 [2020-07-04T21:40:20.538Z] [INFO] Building jar: /home/jenkins/agent/workspace/ease.verify.core.target.2019-03/tests/org.eclipse.ease.ui.test/target/org.eclipse.ease.ui.test-0.8.0-SNAPSHOT-sources.jar
17:40:20 [2020-07-04T21:40:20.538Z] [INFO] 
17:40:20 [2020-07-04T21:40:20.538Z] [INFO] --- target-platform-configuration:1.3.0:target-platform (default-target-platform) @ org.eclipse.ease.ui.test ---
17:40:20 [2020-07-04T21:40:20.538Z] [INFO] 
17:40:20 [2020-07-04T21:40:20.538Z] [INFO] --- tycho-packaging-plugin:1.3.0:package-plugin (default-package-plugin) @ org.eclipse.ease.ui.test ---
17:40:20 [2020-07-04T21:40:20.538Z] [INFO] Building jar: /home/jenkins/agent/workspace/ease.verify.core.target.2019-03/tests/org.eclipse.ease.ui.test/target/org.eclipse.ease.ui.test-0.8.0-SNAPSHOT.jar
17:40:20 [2020-07-04T21:40:20.538Z] [INFO] 
17:40:20 [2020-07-04T21:40:20.538Z] [INFO] --- tycho-p2-plugin:1.3.0:p2-metadata-default (default-p2-metadata-default) @ org.eclipse.ease.ui.test ---
17:40:20 [2020-07-04T21:40:20.538Z] [INFO] 
17:40:20 [2020-07-04T21:40:20.538Z] [INFO] --- tycho-source-feature-plugin:1.3.0:source-feature (source-feature) @ org.eclipse.ease.ui.test ---
17:40:20 [2020-07-04T21:40:20.538Z] [INFO] 
17:40:20 [2020-07-04T21:40:20.538Z] [INFO] --- tycho-p2-plugin:1.3.0:p2-metadata (attached-p2-metadata) @ org.eclipse.ease.ui.test ---
17:40:20 [2020-07-04T21:40:20.538Z] [INFO] 
17:40:20 [2020-07-04T21:40:20.538Z] [INFO] --- tycho-surefire-plugin:1.3.0:test (default-test) @ org.eclipse.ease.ui.test ---
17:40:20 [2020-07-04T21:40:20.795Z] [INFO] Expected eclipse log file: /home/jenkins/agent/workspace/ease.verify.core.target.2019-03/tests/org.eclipse.ease.ui.test/target/work/data/.metadata/.log
17:40:20 [2020-07-04T21:40:20.795Z] [INFO] Command line:
17:40:20 [2020-07-04T21:40:20.796Z] 	[/opt/tools/java/oracle/jdk-8/1.8.0_202/jre/bin/java, -Dosgi.noShutdown=false, -Dosgi.os=linux, -Dosgi.ws=gtk, -Dosgi.arch=x86_64, -Dosgi.clean=true, -jar, /home/jenkins/.m2/repository/p2/osgi/bundle/org.eclipse.equinox.launcher/1.5.700.v20200207-2156/org.eclipse.equinox.launcher-1.5.700.v20200207-2156.jar, -data, /home/jenkins/agent/workspace/ease.verify.core.target.2019-03/tests/org.eclipse.ease.ui.test/target/work/data, -install, /home/jenkins/agent/workspace/ease.verify.core.target.2019-03/tests/org.eclipse.ease.ui.test/target/work, -configuration, /home/jenkins/agent/workspace/ease.verify.core.target.2019-03/tests/org.eclipse.ease.ui.test/target/work/configuration, -application, org.eclipse.tycho.surefire.osgibooter.headlesstest, -testproperties, /home/jenkins/agent/workspace/ease.verify.core.target.2019-03/tests/org.eclipse.ease.ui.test/target/surefire.properties]
17:40:20 [2020-07-04T21:40:20.796Z] Picked up JAVA_TOOL_OPTIONS: -Dmaven.ext.class.path="/home/jenkins/agent/workspace/ease.verify.core.target.2019-03@tmp/withMaven6ec5de10/pipeline-maven-spy.jar" -Dorg.jenkinsci.plugins.pipeline.maven.reportsFolder="/home/jenkins/agent/workspace/ease.verify.core.target.2019-03@tmp/withMaven6ec5de10" 
17:40:22 [2020-07-04T21:40:22.192Z] Running org.eclipse.ease.ui.help.hovers.ModuleHelpTest
17:40:22 [2020-07-04T21:40:22.192Z] Tests run: 4, Failures: 0, Errors: 0, Skipped: 4, Time elapsed: 0.046 s - in org.eclipse.ease.ui.help.hovers.ModuleHelpTest
17:40:22 [2020-07-04T21:40:22.192Z] getModuleHelpLocation(org.eclipse.ease.ui.help.hovers.ModuleHelpTest) skipped
17:40:22 [2020-07-04T21:40:22.192Z] getModuleHelp(org.eclipse.ease.ui.help.hovers.ModuleHelpTest) skipped
17:40:22 [2020-07-04T21:40:22.192Z] getMethodHelp(org.eclipse.ease.ui.help.hovers.ModuleHelpTest) skipped
17:40:22 [2020-07-04T21:40:22.192Z] getConstantHelp(org.eclipse.ease.ui.help.hovers.ModuleHelpTest) skipped
17:40:22 [2020-07-04T21:40:22.192Z] Running org.eclipse.ease.ui.completion.provider.AbstractFileLocationCompletionProviderTest
17:40:22 [2020-07-04T21:40:22.192Z] Tests run: 8, Failures: 0, Errors: 0, Skipped: 8, Time elapsed: 0.052 s - in org.eclipse.ease.ui.completion.provider.AbstractFileLocationCompletionProviderTest
17:40:22 [2020-07-04T21:40:22.192Z] workspaceProjectProposals(org.eclipse.ease.ui.completion.provider.AbstractFileLocationCompletionProviderTest) skipped
17:40:22 [2020-07-04T21:40:22.192Z] checkOperatingSystem(org.eclipse.ease.ui.completion.provider.AbstractFileLocationCompletionProviderTest) skipped
17:40:22 [2020-07-04T21:40:22.192Z] absoluteRootWorkspaceProposals(org.eclipse.ease.ui.completion.provider.AbstractFileLocationCompletionProviderTest) skipped
17:40:22 [2020-07-04T21:40:22.192Z] workspaceFolderProposals(org.eclipse.ease.ui.completion.provider.AbstractFileLocationCompletionProviderTest) skipped
17:40:22 [2020-07-04T21:40:22.192Z] fileSystemFolderProposals(org.eclipse.ease.ui.completion.provider.AbstractFileLocationCompletionProviderTest) skipped
17:40:22 [2020-07-04T21:40:22.192Z] workspaceProposals(org.eclipse.ease.ui.completion.provider.AbstractFileLocationCompletionProviderTest) skipped
17:40:22 [2020-07-04T21:40:22.192Z] relativeRootWorkspaceProposals(org.eclipse.ease.ui.completion.provider.AbstractFileLocationCompletionProviderTest) skipped
17:40:22 [2020-07-04T21:40:22.192Z] fileSystemRootProposals(org.eclipse.ease.ui.completion.provider.AbstractFileLocationCompletionProviderTest) skipped
17:40:22 [2020-07-04T21:40:22.192Z] Running org.eclipse.ease.ui.completion.CompletionContextTest
17:40:22 [2020-07-04T21:40:22.192Z] Tests run: 9, Failures: 0, Errors: 0, Skipped: 0, Time elapsed: 0.006 s - in org.eclipse.ease.ui.completion.CompletionContextTest
17:40:22 [2020-07-04T21:40:22.192Z] resolveStaticClass(org.eclipse.ease.ui.completion.CompletionContextTest)  Time elapsed: 0.003 s
17:40:22 [2020-07-04T21:40:22.192Z] resolveClassWithFilter(org.eclipse.ease.ui.completion.CompletionContextTest)  Time elapsed: 0 s
17:40:22 [2020-07-04T21:40:22.192Z] simplifyCalls(org.eclipse.ease.ui.completion.CompletionContextTest)  Time elapsed: 0.001 s
17:40:22 [2020-07-04T21:40:22.193Z] resolveClass(org.eclipse.ease.ui.completion.CompletionContextTest)  Time elapsed: 0 s
17:40:22 [2020-07-04T21:40:22.193Z] replaceEscapedStringLiterals(org.eclipse.ease.ui.completion.CompletionContextTest)  Time elapsed: 0 s
17:40:22 [2020-07-04T21:40:22.193Z] replaceSimpleStringLiterals(org.eclipse.ease.ui.completion.CompletionContextTest)  Time elapsed: 0 s
17:40:22 [2020-07-04T21:40:22.193Z] resolveStaticClassWithFilter(org.eclipse.ease.ui.completion.CompletionContextTest)  Time elapsed: 0 s
17:40:22 [2020-07-04T21:40:22.193Z] resolveClassWithParameters(org.eclipse.ease.ui.completion.CompletionContextTest)  Time elapsed: 0 s
17:40:22 [2020-07-04T21:40:22.193Z] replaceMultipleStringLiterals(org.eclipse.ease.ui.completion.CompletionContextTest)  Time elapsed: 0 s
17:40:22 [2020-07-04T21:40:22.193Z] Running org.eclipse.ease.ui.completions.java.provider.JavaPackagesCompletionsProviderTest
17:40:28 [2020-07-04T21:40:28.729Z] Tests run: 4, Failures: 0, Errors: 0, Skipped: 0, Time elapsed: 5.89 s - in org.eclipse.ease.ui.completions.java.provider.JavaPackagesCompletionsProviderTest
17:40:28 [2020-07-04T21:40:28.729Z] containsJavaLangPackageProposal(org.eclipse.ease.ui.completions.java.provider.JavaPackagesCompletionsProviderTest)  Time elapsed: 0.478 s
17:40:28 [2020-07-04T21:40:28.729Z] containsOrgRootPackageProposal(org.eclipse.ease.ui.completions.java.provider.JavaPackagesCompletionsProviderTest)  Time elapsed: 0.007 s
17:40:28 [2020-07-04T21:40:28.729Z] containsJavaRootPackageProposal(org.eclipse.ease.ui.completions.java.provider.JavaPackagesCompletionsProviderTest)  Time elapsed: 0.006 s
17:40:28 [2020-07-04T21:40:28.729Z] containsOrgEclipsePackageProposal(org.eclipse.ease.ui.completions.java.provider.JavaPackagesCompletionsProviderTest)  Time elapsed: 0.061 s
17:40:28 [2020-07-04T21:40:28.729Z] Running org.eclipse.ease.ui.completions.java.provider.JavaClassCompletionsProviderTest
17:40:33 [2020-07-04T21:40:33.978Z] Tests run: 6, Failures: 0, Errors: 0, Skipped: 0, Time elapsed: 5.145 s - in org.eclipse.ease.ui.completions.java.provider.JavaClassCompletionsProviderTest
17:40:33 [2020-07-04T21:40:33.978Z] containsPackageFileCompletion(org.eclipse.ease.ui.completions.java.provider.JavaClassCompletionsProviderTest)  Time elapsed: 0.007 s
17:40:33 [2020-07-04T21:40:33.978Z] containsGlobalFileCompletion(org.eclipse.ease.ui.completions.java.provider.JavaClassCompletionsProviderTest)  Time elapsed: 0.034 s
17:40:33 [2020-07-04T21:40:33.978Z] containsJavaLangPackageProposal(org.eclipse.ease.ui.completions.java.provider.JavaClassCompletionsProviderTest)  Time elapsed: 0.042 s
17:40:33 [2020-07-04T21:40:33.978Z] containsOrgRootPackageProposal(org.eclipse.ease.ui.completions.java.provider.JavaClassCompletionsProviderTest)  Time elapsed: 0.004 s
17:40:33 [2020-07-04T21:40:33.978Z] containsJavaRootPackageProposal(org.eclipse.ease.ui.completions.java.provider.JavaClassCompletionsProviderTest)  Time elapsed: 0.005 s
17:40:33 [2020-07-04T21:40:33.978Z] containsOrgEclipsePackageProposal(org.eclipse.ease.ui.completions.java.provider.JavaClassCompletionsProviderTest)  Time elapsed: 0.047 s
17:40:33 [2020-07-04T21:40:33.978Z] 
17:40:33 [2020-07-04T21:40:33.978Z] Results:
17:40:33 [2020-07-04T21:40:33.978Z] 
17:40:33 [2020-07-04T21:40:33.978Z] Tests run: 31, Failures: 0, Errors: 0, Skipped: 12
17:40:33 [2020-07-04T21:40:33.978Z] 
17:40:34 [2020-07-04T21:40:34.234Z] [INFO] All tests passed!
17:40:34 [2020-07-04T21:40:34.234Z] [INFO] 
17:40:34 [2020-07-04T21:40:34.234Z] [INFO] --- maven-install-plugin:2.3.1:install (default-install) @ org.eclipse.ease.ui.test ---
17:40:34 [2020-07-04T21:40:34.234Z] [INFO] Installing /home/jenkins/agent/workspace/ease.verify.core.target.2019-03/tests/org.eclipse.ease.ui.test/target/org.eclipse.ease.ui.test-0.8.0-SNAPSHOT.jar to /home/jenkins/.m2/repository/org/eclipse/ease/org.eclipse.ease.ui.test/0.8.0-SNAPSHOT/org.eclipse.ease.ui.test-0.8.0-SNAPSHOT.jar
17:40:34 [2020-07-04T21:40:34.235Z] [INFO] Installing /home/jenkins/agent/workspace/ease.verify.core.target.2019-03/tests/org.eclipse.ease.ui.test/pom.xml to /home/jenkins/.m2/repository/org/eclipse/ease/org.eclipse.ease.ui.test/0.8.0-SNAPSHOT/org.eclipse.ease.ui.test-0.8.0-SNAPSHOT.pom
17:40:34 [2020-07-04T21:40:34.235Z] [INFO] Installing /home/jenkins/agent/workspace/ease.verify.core.target.2019-03/tests/org.eclipse.ease.ui.test/target/org.eclipse.ease.ui.test-0.8.0-SNAPSHOT-sources.jar to /home/jenkins/.m2/repository/org/eclipse/ease/org.eclipse.ease.ui.test/0.8.0-SNAPSHOT/org.eclipse.ease.ui.test-0.8.0-SNAPSHOT-sources.jar
17:40:34 [2020-07-04T21:40:34.235Z] [INFO] Installing /home/jenkins/agent/workspace/ease.verify.core.target.2019-03/tests/org.eclipse.ease.ui.test/target/p2content.xml to /home/jenkins/.m2/repository/org/eclipse/ease/org.eclipse.ease.ui.test/0.8.0-SNAPSHOT/org.eclipse.ease.ui.test-0.8.0-SNAPSHOT-p2metadata.xml
17:40:34 [2020-07-04T21:40:34.235Z] [INFO] Installing /home/jenkins/agent/workspace/ease.verify.core.target.2019-03/tests/org.eclipse.ease.ui.test/target/p2artifacts.xml to /home/jenkins/.m2/repository/org/eclipse/ease/org.eclipse.ease.ui.test/0.8.0-SNAPSHOT/org.eclipse.ease.ui.test-0.8.0-SNAPSHOT-p2artifacts.xml
17:40:34 [2020-07-04T21:40:34.235Z] [INFO] Installing /home/jenkins/agent/workspace/ease.verify.core.target.2019-03/tests/org.eclipse.ease.ui.test/target/p2content.xml to /home/jenkins/.m2/repository/org/eclipse/ease/org.eclipse.ease.ui.test/0.8.0-SNAPSHOT/org.eclipse.ease.ui.test-0.8.0-SNAPSHOT-p2metadata.xml
17:40:34 [2020-07-04T21:40:34.235Z] [INFO] Installing /home/jenkins/agent/workspace/ease.verify.core.target.2019-03/tests/org.eclipse.ease.ui.test/target/p2artifacts.xml to /home/jenkins/.m2/repository/org/eclipse/ease/org.eclipse.ease.ui.test/0.8.0-SNAPSHOT/org.eclipse.ease.ui.test-0.8.0-SNAPSHOT-p2artifacts.xml
17:40:34 [2020-07-04T21:40:34.235Z] [INFO] 
17:40:34 [2020-07-04T21:40:34.235Z] [INFO] --- tycho-p2-plugin:1.3.0:update-local-index (default-update-local-index) @ org.eclipse.ease.ui.test ---
17:40:34 [2020-07-04T21:40:34.235Z] [INFO] 
17:40:34 [2020-07-04T21:40:34.235Z] [INFO] ---------------------< org.eclipse.ease:ease.core >---------------------
17:40:34 [2020-07-04T21:40:34.235Z] [INFO] Building EASE (Incubation) 0.4.0-SNAPSHOT                        [48/48]
17:40:34 [2020-07-04T21:40:34.235Z] [INFO] --------------------------------[ pom ]---------------------------------
17:40:34 [2020-07-04T21:40:34.235Z] [INFO] 
17:40:34 [2020-07-04T21:40:34.235Z] [INFO] --- maven-clean-plugin:2.5:clean (default-clean) @ ease.core ---
17:40:34 [2020-07-04T21:40:34.235Z] [INFO] 
17:40:34 [2020-07-04T21:40:34.235Z] [INFO] --- maven-install-plugin:2.4:install (default-install) @ ease.core ---
17:40:34 [2020-07-04T21:40:34.492Z] [INFO] Installing /home/jenkins/agent/workspace/ease.verify.core.target.2019-03/pom.xml to /home/jenkins/.m2/repository/org/eclipse/ease/ease.core/0.4.0-SNAPSHOT/ease.core-0.4.0-SNAPSHOT.pom
17:40:34 [2020-07-04T21:40:34.492Z] [INFO] ------------------------------------------------------------------------
17:40:34 [2020-07-04T21:40:34.492Z] [INFO] Reactor Summary:
17:40:34 [2020-07-04T21:40:34.492Z] [INFO] 
17:40:34 [2020-07-04T21:40:34.492Z] [INFO] org.eclipse.ease.releng 0.8.0-SNAPSHOT ............. SUCCESS [  5.331 s]
17:40:34 [2020-07-04T21:40:34.492Z] [INFO] org.eclipse.ease.classloader 0.8.0-SNAPSHOT ........ SUCCESS [  4.149 s]
17:40:34 [2020-07-04T21:40:34.492Z] [INFO] org.eclipse.ease 0.8.0-SNAPSHOT .................... SUCCESS [  2.510 s]
17:40:34 [2020-07-04T21:40:34.492Z] [INFO] org.eclipse.ease.ui 0.8.0-SNAPSHOT ................. SUCCESS [  2.684 s]
17:40:34 [2020-07-04T21:40:34.492Z] [INFO] org.eclipse.ease.ui.completions.java 0.8.0-SNAPSHOT  SUCCESS [  1.833 s]
17:40:34 [2020-07-04T21:40:34.492Z] [INFO] org.eclipse.ease.ui.scripts 0.8.0-SNAPSHOT ......... SUCCESS [  2.177 s]
17:40:34 [2020-07-04T21:40:34.492Z] [INFO] org.eclipse.ease.lang.javascript 0.8.0-SNAPSHOT .... SUCCESS [  1.383 s]
17:40:34 [2020-07-04T21:40:34.492Z] [INFO] org.eclipse.ease.lang.scriptarchive 0.8.0-SNAPSHOT . SUCCESS [  1.280 s]
17:40:34 [2020-07-04T21:40:34.492Z] [INFO] org.eclipse.ease.lang.python 0.8.0-SNAPSHOT ........ SUCCESS [  1.563 s]
17:40:34 [2020-07-04T21:40:34.492Z] [INFO] org.eclipse.ease.lang.python.py4j 0.8.0-SNAPSHOT ... SUCCESS [  1.404 s]
17:40:34 [2020-07-04T21:40:34.492Z] [INFO] org.eclipse.ease.lang.groovy 0.8.0-SNAPSHOT ........ SUCCESS [  1.333 s]
17:40:34 [2020-07-04T21:40:34.492Z] [INFO] org.eclipse.ease.lang.groovy.interpreter 0.8.0-SNAPSHOT SUCCESS [  1.314 s]
17:40:34 [2020-07-04T21:40:34.492Z] [INFO] org.eclipse.ease.lang.unittest 0.8.0-SNAPSHOT ...... SUCCESS [  1.915 s]
17:40:34 [2020-07-04T21:40:34.492Z] [INFO] org.eclipse.ease.lang.unittest.ui 0.8.0-SNAPSHOT ... SUCCESS [  1.797 s]
17:40:34 [2020-07-04T21:40:34.492Z] [INFO] org.eclipse.ease.lang.ruby 0.8.0-SNAPSHOT .......... SUCCESS [  1.472 s]
17:40:34 [2020-07-04T21:40:34.492Z] [INFO] org.eclipse.ease.lang.ruby.jruby 0.8.0-SNAPSHOT .... SUCCESS [  1.449 s]
17:40:34 [2020-07-04T21:40:34.492Z] [INFO] org.eclipse.ease.lang.javascript.nashorn 0.8.0-SNAPSHOT SUCCESS [  1.356 s]
17:40:34 [2020-07-04T21:40:34.492Z] [INFO] org.eclipse.ease.lang.javascript.rhino 0.8.0-SNAPSHOT SUCCESS [  1.578 s]
17:40:34 [2020-07-04T21:40:34.492Z] [INFO] org.eclipse.ease.lang.python.jython 0.8.0-SNAPSHOT . SUCCESS [  1.540 s]
17:40:34 [2020-07-04T21:40:34.492Z] [INFO] org.eclipse.ease.lang.javascript.ui 0.8.0-SNAPSHOT . SUCCESS [  1.435 s]
17:40:34 [2020-07-04T21:40:34.492Z] [INFO] org.eclipse.ease.lang.jvm.compiled 0.8.0-SNAPSHOT .. SUCCESS [  1.511 s]
17:40:34 [2020-07-04T21:40:34.492Z] [INFO] org.eclipse.ease.lang.scriptarchive.ui 0.8.0-SNAPSHOT SUCCESS [  1.462 s]
17:40:34 [2020-07-04T21:40:34.492Z] [INFO] org.eclipse.ease.help 0.8.0-SNAPSHOT ............... SUCCESS [  0.087 s]
17:40:34 [2020-07-04T21:40:34.492Z] [INFO] org.eclipse.ease.feature 0.8.0-SNAPSHOT ............ SUCCESS [  0.113 s]
17:40:34 [2020-07-04T21:40:34.492Z] [INFO] org.eclipse.ease.ui.feature 0.8.0-SNAPSHOT ......... SUCCESS [  0.168 s]
17:40:34 [2020-07-04T21:40:34.492Z] [INFO] org.eclipse.ease.lang.javascript.feature 0.8.0-SNAPSHOT SUCCESS [  0.087 s]
17:40:34 [2020-07-04T21:40:34.492Z] [INFO] org.eclipse.ease.lang.python.feature 0.8.0-SNAPSHOT  SUCCESS [  0.082 s]
17:40:34 [2020-07-04T21:40:34.492Z] [INFO] org.eclipse.ease.python.jython.feature 0.8.0-SNAPSHOT SUCCESS [  0.092 s]
17:40:34 [2020-07-04T21:40:34.492Z] [INFO] org.eclipse.ease.lang.python.py4j.feature 0.8.0-SNAPSHOT SUCCESS [  0.085 s]
17:40:34 [2020-07-04T21:40:34.492Z] [INFO] org.eclipse.ease.lang.jvm.feature 0.8.0-SNAPSHOT ... SUCCESS [  0.082 s]
17:40:34 [2020-07-04T21:40:34.492Z] [INFO] org.eclipse.ease.lang.groovy.feature 0.8.0-SNAPSHOT  SUCCESS [  0.070 s]
17:40:34 [2020-07-04T21:40:34.492Z] [INFO] org.eclipse.ease.lang.ruby.feature 0.8.0-SNAPSHOT .. SUCCESS [  0.088 s]
17:40:34 [2020-07-04T21:40:34.492Z] [INFO] org.eclipse.ease.lang.scriptarchive.feature 0.8.0-SNAPSHOT SUCCESS [  0.080 s]
17:40:34 [2020-07-04T21:40:34.492Z] [INFO] org.eclipse.ease.lang.unittest.feature 0.8.0-SNAPSHOT SUCCESS [  0.088 s]
17:40:34 [2020-07-04T21:40:34.492Z] [INFO] org.eclipse.ease.releng.target 0.8.0-SNAPSHOT ...... SUCCESS [  0.009 s]
17:40:34 [2020-07-04T21:40:34.492Z] [INFO] org.eclipse.ease.releng.p2 0.8.0-SNAPSHOT .......... SUCCESS [  2.534 s]
17:40:34 [2020-07-04T21:40:34.492Z] [INFO] org.eclipse.ease.testhelper 0.8.0-SNAPSHOT ......... SUCCESS [  1.465 s]
17:40:34 [2020-07-04T21:40:34.492Z] [INFO] org.eclipse.ease.test 0.8.0-SNAPSHOT ............... SUCCESS [ 14.549 s]
17:40:34 [2020-07-04T21:40:34.492Z] [INFO] org.eclipse.ease.lang.javascript.nashorn.test 0.8.0-SNAPSHOT SUCCESS [  3.960 s]
17:40:34 [2020-07-04T21:40:34.492Z] [INFO] org.eclipse.ease.lang.javascript.rhino.test 0.8.0-SNAPSHOT SUCCESS [ 15.193 s]
17:40:34 [2020-07-04T21:40:34.492Z] [INFO] org.eclipse.ease.lang.javascript.test 0.8.0-SNAPSHOT SUCCESS [  3.733 s]
17:40:34 [2020-07-04T21:40:34.492Z] [INFO] org.eclipse.ease.lang.python.test 0.8.0-SNAPSHOT ... SUCCESS [  3.173 s]
17:40:34 [2020-07-04T21:40:34.492Z] [INFO] org.eclipse.ease.lang.python.jython.test 0.8.0-SNAPSHOT SUCCESS [ 16.993 s]
17:40:34 [2020-07-04T21:40:34.492Z] [INFO] org.eclipse.ease.lang.python.py4j.test 0.8.0-SNAPSHOT SUCCESS [ 27.501 s]
17:40:34 [2020-07-04T21:40:34.493Z] [INFO] org.eclipse.ease.lang.scriptarchive.test 0.8.0-SNAPSHOT SUCCESS [  3.708 s]
17:40:34 [2020-07-04T21:40:34.493Z] [INFO] org.eclipse.ease.lang.unittest.test 0.8.0-SNAPSHOT . SUCCESS [  5.214 s]
17:40:34 [2020-07-04T21:40:34.493Z] [INFO] org.eclipse.ease.ui.test 0.8.0-SNAPSHOT ............ SUCCESS [ 15.125 s]
17:40:34 [2020-07-04T21:40:34.493Z] [INFO] EASE (Incubation) 0.4.0-SNAPSHOT ................... SUCCESS [  0.169 s]
17:40:34 [2020-07-04T21:40:34.493Z] [INFO] ------------------------------------------------------------------------
17:40:34 [2020-07-04T21:40:34.493Z] [INFO] BUILD SUCCESS
17:40:34 [2020-07-04T21:40:34.493Z] [INFO] ------------------------------------------------------------------------
17:40:34 [2020-07-04T21:40:34.493Z] [INFO] Total time:  04:55 min
17:40:34 [2020-07-04T21:40:34.493Z] [INFO] Finished at: 2020-07-04T21:40:34Z
17:40:34 [2020-07-04T21:40:34.493Z] [INFO] ------------------------------------------------------------------------
17:40:34 [2020-07-04T21:40:34.493Z] [INFO] [jenkins-event-spy] Generated /home/jenkins/agent/workspace/ease.verify.core.target.2019-03@tmp/withMaven6ec5de10/maven-spy-20200704-213538-3413668757676897282299.log