SuccessConsole Output

Skipping 615 KB.. Full Log
sed: 0.308 s
nativeArrayVariable(org.eclipse.ease.lang.python.jython.debugger.JythonDebugTest)  Time elapsed: 0.308 s
disconnectDebugTargetInSuspendedState(org.eclipse.ease.lang.python.jython.debugger.JythonDebugTest)  Time elapsed: 0.207 s
stepIntoOnProcess(org.eclipse.ease.lang.python.jython.debugger.JythonDebugTest)  Time elapsed: 0.307 s
terminatedState(org.eclipse.ease.lang.python.jython.debugger.JythonDebugTest)  Time elapsed: 0.106 s
stepOverIncludeCommand(org.eclipse.ease.lang.python.jython.debugger.JythonDebugTest)  Time elapsed: 0.307 s
innerScopeVariableBeforeOuterScopeVariable(org.eclipse.ease.lang.python.jython.debugger.JythonDebugTest)  Time elapsed: 0.33 s
stepIntoIncludeCommand(org.eclipse.ease.lang.python.jython.debugger.JythonDebugTest)  Time elapsed: 0.305 s
primitiveStringVariable(org.eclipse.ease.lang.python.jython.debugger.JythonDebugTest)  Time elapsed: 0.307 s
resumeOnProcess(org.eclipse.ease.lang.python.jython.debugger.JythonDebugTest)  Time elapsed: 0.207 s
stepIntoOnDebugTarget(org.eclipse.ease.lang.python.jython.debugger.JythonDebugTest)  Time elapsed: 0.309 s
stepOverOnThread(org.eclipse.ease.lang.python.jython.debugger.JythonDebugTest)  Time elapsed: 0.307 s
suspendedState(org.eclipse.ease.lang.python.jython.debugger.JythonDebugTest)  Time elapsed: 0.299 s
primitiveDoubleVariable(org.eclipse.ease.lang.python.jython.debugger.JythonDebugTest)  Time elapsed: 0.307 s
resumeOnStackFrame(org.eclipse.ease.lang.python.jython.debugger.JythonDebugTest)  Time elapsed: 0.207 s
nativeObjectVariable(org.eclipse.ease.lang.python.jython.debugger.JythonDebugTest)  Time elapsed: 0.308 s
terminateDebugTargetInSuspendedState(org.eclipse.ease.lang.python.jython.debugger.JythonDebugTest)  Time elapsed: 0.206 s
disconnectStackFrameInSuspendedState(org.eclipse.ease.lang.python.jython.debugger.JythonDebugTest)  Time elapsed: 0.207 s
stepReturnOnProcess(org.eclipse.ease.lang.python.jython.debugger.JythonDebugTest)  Time elapsed: 0.308 s
evaluateWatchExpression(org.eclipse.ease.lang.python.jython.debugger.JythonDebugTest)  Time elapsed: 0.21 s

Results:

Tests run: 42, Failures: 0, Errors: 0, Skipped: 0

[INFO] All tests passed!
[INFO] 
[INFO] --- maven-install-plugin:2.3.1:install (default-install) @ org.eclipse.ease.lang.python.jython.test ---
[INFO] Installing /home/jenkins/agent/workspace/ease.verify.core.target.2019-03/tests/org.eclipse.ease.lang.python.jython.test/target/org.eclipse.ease.lang.python.jython.test-0.8.0-SNAPSHOT.jar to /home/jenkins/.m2/repository/org/eclipse/ease/org.eclipse.ease.lang.python.jython.test/0.8.0-SNAPSHOT/org.eclipse.ease.lang.python.jython.test-0.8.0-SNAPSHOT.jar
[INFO] Installing /home/jenkins/agent/workspace/ease.verify.core.target.2019-03/tests/org.eclipse.ease.lang.python.jython.test/pom.xml to /home/jenkins/.m2/repository/org/eclipse/ease/org.eclipse.ease.lang.python.jython.test/0.8.0-SNAPSHOT/org.eclipse.ease.lang.python.jython.test-0.8.0-SNAPSHOT.pom
[INFO] Installing /home/jenkins/agent/workspace/ease.verify.core.target.2019-03/tests/org.eclipse.ease.lang.python.jython.test/target/org.eclipse.ease.lang.python.jython.test-0.8.0-SNAPSHOT-sources.jar to /home/jenkins/.m2/repository/org/eclipse/ease/org.eclipse.ease.lang.python.jython.test/0.8.0-SNAPSHOT/org.eclipse.ease.lang.python.jython.test-0.8.0-SNAPSHOT-sources.jar
[INFO] Installing /home/jenkins/agent/workspace/ease.verify.core.target.2019-03/tests/org.eclipse.ease.lang.python.jython.test/target/p2content.xml to /home/jenkins/.m2/repository/org/eclipse/ease/org.eclipse.ease.lang.python.jython.test/0.8.0-SNAPSHOT/org.eclipse.ease.lang.python.jython.test-0.8.0-SNAPSHOT-p2metadata.xml
[INFO] Installing /home/jenkins/agent/workspace/ease.verify.core.target.2019-03/tests/org.eclipse.ease.lang.python.jython.test/target/p2artifacts.xml to /home/jenkins/.m2/repository/org/eclipse/ease/org.eclipse.ease.lang.python.jython.test/0.8.0-SNAPSHOT/org.eclipse.ease.lang.python.jython.test-0.8.0-SNAPSHOT-p2artifacts.xml
[INFO] Installing /home/jenkins/agent/workspace/ease.verify.core.target.2019-03/tests/org.eclipse.ease.lang.python.jython.test/target/p2content.xml to /home/jenkins/.m2/repository/org/eclipse/ease/org.eclipse.ease.lang.python.jython.test/0.8.0-SNAPSHOT/org.eclipse.ease.lang.python.jython.test-0.8.0-SNAPSHOT-p2metadata.xml
[INFO] Installing /home/jenkins/agent/workspace/ease.verify.core.target.2019-03/tests/org.eclipse.ease.lang.python.jython.test/target/p2artifacts.xml to /home/jenkins/.m2/repository/org/eclipse/ease/org.eclipse.ease.lang.python.jython.test/0.8.0-SNAPSHOT/org.eclipse.ease.lang.python.jython.test-0.8.0-SNAPSHOT-p2artifacts.xml
[INFO] 
[INFO] --- tycho-p2-plugin:1.3.0:update-local-index (default-update-local-index) @ org.eclipse.ease.lang.python.jython.test ---
[INFO] 
[INFO] ------< org.eclipse.ease:org.eclipse.ease.lang.python.py4j.test >-------
[INFO] Building org.eclipse.ease.lang.python.py4j.test 0.8.0-SNAPSHOT   [44/48]
[INFO] ------------------------[ eclipse-test-plugin ]-------------------------
[INFO] 
[INFO] --- maven-clean-plugin:2.5:clean (default-clean) @ org.eclipse.ease.lang.python.py4j.test ---
[INFO] 
[INFO] --- tycho-packaging-plugin:1.3.0:build-qualifier (default-build-qualifier) @ org.eclipse.ease.lang.python.py4j.test ---
[INFO] The project's OSGi version is 0.8.0.I201912021001
[INFO] 
[INFO] --- tycho-packaging-plugin:1.3.0:validate-id (default-validate-id) @ org.eclipse.ease.lang.python.py4j.test ---
[INFO] 
[INFO] --- tycho-packaging-plugin:1.3.0:validate-version (default-validate-version) @ org.eclipse.ease.lang.python.py4j.test ---
[INFO] 
[INFO] >>> maven-javadoc-plugin:2.9.1:javadoc (build-docs) > generate-sources @ org.eclipse.ease.lang.python.py4j.test >>>
[INFO] 
[INFO] --- tycho-packaging-plugin:1.3.0:build-qualifier (default-build-qualifier) @ org.eclipse.ease.lang.python.py4j.test ---
[INFO] The project's OSGi version is 0.8.0.I201912021001
[INFO] 
[INFO] --- tycho-packaging-plugin:1.3.0:validate-id (default-validate-id) @ org.eclipse.ease.lang.python.py4j.test ---
[INFO] 
[INFO] --- tycho-packaging-plugin:1.3.0:validate-version (default-validate-version) @ org.eclipse.ease.lang.python.py4j.test ---
[INFO] 
[INFO] <<< maven-javadoc-plugin:2.9.1:javadoc (build-docs) < generate-sources @ org.eclipse.ease.lang.python.py4j.test <<<
[INFO] 
[INFO] 
[INFO] --- maven-javadoc-plugin:2.9.1:javadoc (build-docs) @ org.eclipse.ease.lang.python.py4j.test ---
[ERROR] Error fetching link: http://help.eclipse.org/oxygen/topic/org.eclipse.platform.doc.isv/reference/api/package-list. Ignored it.
[INFO] 
Loading source files for package org.eclipse.ease.lang.python.py4j...
Loading source files for package org.eclipse.ease.lang.python.py4j.modules...
Constructing Javadoc information...
WARNING: Cannot open location "/home/jenkins/agent/workspace/ease.verify.core.target.2019-03/tests/org.eclipse.ease.lang.python.py4j.test/target/javadoc-bundle-options/package-list"
[WARNING] Javadoc Warnings
[WARNING] Picked up JAVA_TOOL_OPTIONS: -XX:+IgnoreUnrecognizedVMOptions -XX:+UseContainerSupport -XX:+UnlockExperimentalVMOptions -XX:+UseCGroupMemoryLimitForHeap -Dmaven.ext.class.path="/home/jenkins/agent/workspace/ease.verify.core.target.2019-03@tmp/withMavenf4fc2e11/pipeline-maven-spy.jar" -Dorg.jenkinsci.plugins.pipeline.maven.reportsFolder="/home/jenkins/agent/workspace/ease.verify.core.target.2019-03@tmp/withMavenf4fc2e11"
[WARNING] Picked up _JAVA_OPTIONS: -XX:MaxRAMPercentage=64.0
[INFO] 
[INFO] --- build-helper-maven-plugin:1.9.1:add-resource (add_help) @ org.eclipse.ease.lang.python.py4j.test ---
[INFO] 
[INFO] --- maven-resources-plugin:2.4.3:resources (default-resources) @ org.eclipse.ease.lang.python.py4j.test ---
[INFO] Using 'UTF-8' encoding to copy filtered resources.
[INFO] skip non existing resourceDirectory /home/jenkins/agent/workspace/ease.verify.core.target.2019-03/tests/org.eclipse.ease.lang.python.py4j.test/src/main/resources
[INFO] Copying 2 resources to help
[INFO] 
[INFO] --- tycho-compiler-plugin:1.3.0:compile (default-compile) @ org.eclipse.ease.lang.python.py4j.test ---
[INFO] Compiling 10 source files to /home/jenkins/agent/workspace/ease.verify.core.target.2019-03/tests/org.eclipse.ease.lang.python.py4j.test/target/classes
[INFO] 
[INFO] --- maven-resources-plugin:2.4.3:testResources (default-testResources) @ org.eclipse.ease.lang.python.py4j.test ---
[INFO] Using 'UTF-8' encoding to copy filtered resources.
[INFO] skip non existing resourceDirectory /home/jenkins/agent/workspace/ease.verify.core.target.2019-03/tests/org.eclipse.ease.lang.python.py4j.test/src/test/resources
[INFO] 
[INFO] --- tycho-source-plugin:1.3.0:plugin-source (plugin-source) @ org.eclipse.ease.lang.python.py4j.test ---
[INFO] Building jar: /home/jenkins/agent/workspace/ease.verify.core.target.2019-03/tests/org.eclipse.ease.lang.python.py4j.test/target/org.eclipse.ease.lang.python.py4j.test-0.8.0-SNAPSHOT-sources.jar
[INFO] 
[INFO] --- target-platform-configuration:1.3.0:target-platform (default-target-platform) @ org.eclipse.ease.lang.python.py4j.test ---
[INFO] 
[INFO] --- tycho-packaging-plugin:1.3.0:package-plugin (default-package-plugin) @ org.eclipse.ease.lang.python.py4j.test ---
[INFO] Building jar: /home/jenkins/agent/workspace/ease.verify.core.target.2019-03/tests/org.eclipse.ease.lang.python.py4j.test/target/org.eclipse.ease.lang.python.py4j.test-0.8.0-SNAPSHOT.jar
[INFO] 
[INFO] --- tycho-p2-plugin:1.3.0:p2-metadata-default (default-p2-metadata-default) @ org.eclipse.ease.lang.python.py4j.test ---
[INFO] 
[INFO] --- tycho-source-feature-plugin:1.3.0:source-feature (source-feature) @ org.eclipse.ease.lang.python.py4j.test ---
[INFO] 
[INFO] --- tycho-p2-plugin:1.3.0:p2-metadata (attached-p2-metadata) @ org.eclipse.ease.lang.python.py4j.test ---
[INFO] 
[INFO] --- tycho-surefire-plugin:1.3.0:test (default-test) @ org.eclipse.ease.lang.python.py4j.test ---
[INFO] Expected eclipse log file: /home/jenkins/agent/workspace/ease.verify.core.target.2019-03/tests/org.eclipse.ease.lang.python.py4j.test/target/work/data/.metadata/.log
[INFO] Command line:
	[/opt/tools/java/oracle/jdk-8/1.8.0_202/jre/bin/java, -Dosgi.noShutdown=false, -Dosgi.os=linux, -Dosgi.ws=gtk, -Dosgi.arch=x86_64, -Dosgi.clean=true, -jar, /home/jenkins/.m2/repository/p2/osgi/bundle/org.eclipse.equinox.launcher/1.5.700.v20200207-2156/org.eclipse.equinox.launcher-1.5.700.v20200207-2156.jar, -data, /home/jenkins/agent/workspace/ease.verify.core.target.2019-03/tests/org.eclipse.ease.lang.python.py4j.test/target/work/data, -install, /home/jenkins/agent/workspace/ease.verify.core.target.2019-03/tests/org.eclipse.ease.lang.python.py4j.test/target/work, -configuration, /home/jenkins/agent/workspace/ease.verify.core.target.2019-03/tests/org.eclipse.ease.lang.python.py4j.test/target/work/configuration, -application, org.eclipse.tycho.surefire.osgibooter.headlesstest, -testproperties, /home/jenkins/agent/workspace/ease.verify.core.target.2019-03/tests/org.eclipse.ease.lang.python.py4j.test/target/surefire.properties]
Picked up JAVA_TOOL_OPTIONS: -XX:+IgnoreUnrecognizedVMOptions -XX:+UseContainerSupport -XX:+UnlockExperimentalVMOptions -XX:+UseCGroupMemoryLimitForHeap -Dmaven.ext.class.path="/home/jenkins/agent/workspace/ease.verify.core.target.2019-03@tmp/withMavenf4fc2e11/pipeline-maven-spy.jar" -Dorg.jenkinsci.plugins.pipeline.maven.reportsFolder="/home/jenkins/agent/workspace/ease.verify.core.target.2019-03@tmp/withMavenf4fc2e11" 
Picked up _JAVA_OPTIONS: -XX:MaxRAMPercentage=64.0
Running org.eclipse.ease.lang.python.py4j.Py4JEngineTest
Tests run: 3, Failures: 0, Errors: 0, Skipped: 3, Time elapsed: 0.021 s - in org.eclipse.ease.lang.python.py4j.Py4JEngineTest
print(org.eclipse.ease.lang.python.py4j.Py4JEngineTest) skipped
mixedMode(org.eclipse.ease.lang.python.py4j.Py4JEngineTest) skipped
cleanShutdown(org.eclipse.ease.lang.python.py4j.Py4JEngineTest) skipped
Running org.eclipse.ease.lang.python.py4j.ShellModeEngineTest
----------------------------------------------
Starting test: invalidSyntax(org.eclipse.ease.lang.python.py4j.ShellModeEngineTest)
org.eclipse.ease.ScriptExecutionException:   File "<console>", line 1
    1++
      ^
SyntaxError: invalid syntax


Finished test: invalidSyntax(org.eclipse.ease.lang.python.py4j.ShellModeEngineTest)
----------------------------------------------
----------------------------------------------
Starting test: optionalModuleParameters(org.eclipse.ease.lang.python.py4j.ShellModeEngineTest)

Finished test: optionalModuleParameters(org.eclipse.ease.lang.python.py4j.ShellModeEngineTest)
----------------------------------------------
----------------------------------------------
Starting test: getScriptEngine(org.eclipse.ease.lang.python.py4j.ShellModeEngineTest)

Finished test: getScriptEngine(org.eclipse.ease.lang.python.py4j.ShellModeEngineTest)
----------------------------------------------
----------------------------------------------
Starting test: callModuleCode(org.eclipse.ease.lang.python.py4j.ShellModeEngineTest)

Finished test: callModuleCode(org.eclipse.ease.lang.python.py4j.ShellModeEngineTest)
----------------------------------------------
----------------------------------------------
Starting test: incompleteStatement(org.eclipse.ease.lang.python.py4j.ShellModeEngineTest)

Finished test: incompleteStatement(org.eclipse.ease.lang.python.py4j.ShellModeEngineTest)
----------------------------------------------
----------------------------------------------
Starting test: multiLineStatement(org.eclipse.ease.lang.python.py4j.ShellModeEngineTest)

Finished test: multiLineStatement(org.eclipse.ease.lang.python.py4j.ShellModeEngineTest)
----------------------------------------------
----------------------------------------------
Starting test: runtimeError(org.eclipse.ease.lang.python.py4j.ShellModeEngineTest)
org.eclipse.ease.ScriptExecutionException: Traceback (most recent call last):
  File "<console>", line 1, in <module>
NameError: name 'x' is not defined


Finished test: runtimeError(org.eclipse.ease.lang.python.py4j.ShellModeEngineTest)
----------------------------------------------
----------------------------------------------
Starting test: javaIntArray(org.eclipse.ease.lang.python.py4j.ShellModeEngineTest)

Finished test: javaIntArray(org.eclipse.ease.lang.python.py4j.ShellModeEngineTest)
----------------------------------------------
----------------------------------------------
Starting test: javaDoubleArray(org.eclipse.ease.lang.python.py4j.ShellModeEngineTest)

Finished test: javaDoubleArray(org.eclipse.ease.lang.python.py4j.ShellModeEngineTest)
----------------------------------------------
----------------------------------------------
Starting test: pythonSet(org.eclipse.ease.lang.python.py4j.ShellModeEngineTest)

Finished test: pythonSet(org.eclipse.ease.lang.python.py4j.ShellModeEngineTest)
----------------------------------------------
----------------------------------------------
Starting test: javaStringArray(org.eclipse.ease.lang.python.py4j.ShellModeEngineTest)

Finished test: javaStringArray(org.eclipse.ease.lang.python.py4j.ShellModeEngineTest)
----------------------------------------------
----------------------------------------------
Starting test: javaShortArray(org.eclipse.ease.lang.python.py4j.ShellModeEngineTest)

Finished test: javaShortArray(org.eclipse.ease.lang.python.py4j.ShellModeEngineTest)
----------------------------------------------
----------------------------------------------
Starting test: javaBooleanArray(org.eclipse.ease.lang.python.py4j.ShellModeEngineTest)

Finished test: javaBooleanArray(org.eclipse.ease.lang.python.py4j.ShellModeEngineTest)
----------------------------------------------
----------------------------------------------
Starting test: javaObjectArray(org.eclipse.ease.lang.python.py4j.ShellModeEngineTest)

Finished test: javaObjectArray(org.eclipse.ease.lang.python.py4j.ShellModeEngineTest)
----------------------------------------------
----------------------------------------------
Starting test: javaIntegerArray(org.eclipse.ease.lang.python.py4j.ShellModeEngineTest)

Finished test: javaIntegerArray(org.eclipse.ease.lang.python.py4j.ShellModeEngineTest)
----------------------------------------------
----------------------------------------------
Starting test: javaInteger(org.eclipse.ease.lang.python.py4j.ShellModeEngineTest)

Finished test: javaInteger(org.eclipse.ease.lang.python.py4j.ShellModeEngineTest)
----------------------------------------------
----------------------------------------------
Starting test: javaString(org.eclipse.ease.lang.python.py4j.ShellModeEngineTest)

Finished test: javaString(org.eclipse.ease.lang.python.py4j.ShellModeEngineTest)
----------------------------------------------
----------------------------------------------
Starting test: javaByteArray(org.eclipse.ease.lang.python.py4j.ShellModeEngineTest)

Finished test: javaByteArray(org.eclipse.ease.lang.python.py4j.ShellModeEngineTest)
----------------------------------------------
----------------------------------------------
Starting test: createEclipseClass(org.eclipse.ease.lang.python.py4j.ShellModeEngineTest)

Finished test: createEclipseClass(org.eclipse.ease.lang.python.py4j.ShellModeEngineTest)
----------------------------------------------
----------------------------------------------
Starting test: pythonString(org.eclipse.ease.lang.python.py4j.ShellModeEngineTest)

Finished test: pythonString(org.eclipse.ease.lang.python.py4j.ShellModeEngineTest)
----------------------------------------------
----------------------------------------------
Starting test: varargs(org.eclipse.ease.lang.python.py4j.ShellModeEngineTest)

Finished test: varargs(org.eclipse.ease.lang.python.py4j.ShellModeEngineTest)
----------------------------------------------
----------------------------------------------
Starting test: createJavaType(org.eclipse.ease.lang.python.py4j.ShellModeEngineTest)

Finished test: createJavaType(org.eclipse.ease.lang.python.py4j.ShellModeEngineTest)
----------------------------------------------
----------------------------------------------
Starting test: javaFloatArray(org.eclipse.ease.lang.python.py4j.ShellModeEngineTest)

Finished test: javaFloatArray(org.eclipse.ease.lang.python.py4j.ShellModeEngineTest)
----------------------------------------------
----------------------------------------------
Starting test: implementJavaInterface(org.eclipse.ease.lang.python.py4j.ShellModeEngineTest)

Finished test: implementJavaInterface(org.eclipse.ease.lang.python.py4j.ShellModeEngineTest)
----------------------------------------------
----------------------------------------------
Starting test: pythonDict(org.eclipse.ease.lang.python.py4j.ShellModeEngineTest)

Finished test: pythonDict(org.eclipse.ease.lang.python.py4j.ShellModeEngineTest)
----------------------------------------------
----------------------------------------------
Starting test: pythonList(org.eclipse.ease.lang.python.py4j.ShellModeEngineTest)

Finished test: pythonList(org.eclipse.ease.lang.python.py4j.ShellModeEngineTest)
----------------------------------------------
----------------------------------------------
Starting test: testMultiple(org.eclipse.ease.lang.python.py4j.ShellModeEngineTest)

Finished test: testMultiple(org.eclipse.ease.lang.python.py4j.ShellModeEngineTest)
----------------------------------------------
----------------------------------------------
Starting test: javaLongArray(org.eclipse.ease.lang.python.py4j.ShellModeEngineTest)

Finished test: javaLongArray(org.eclipse.ease.lang.python.py4j.ShellModeEngineTest)
----------------------------------------------
----------------------------------------------
Starting test: createPythonObject(org.eclipse.ease.lang.python.py4j.ShellModeEngineTest)

Finished test: createPythonObject(org.eclipse.ease.lang.python.py4j.ShellModeEngineTest)
----------------------------------------------
----------------------------------------------
Starting test: pythonInteger(org.eclipse.ease.lang.python.py4j.ShellModeEngineTest)

Finished test: pythonInteger(org.eclipse.ease.lang.python.py4j.ShellModeEngineTest)
----------------------------------------------
Tests run: 34, Failures: 0, Errors: 0, Skipped: 4, Time elapsed: 7.088 s - in org.eclipse.ease.lang.python.py4j.ShellModeEngineTest
invalidSyntax(org.eclipse.ease.lang.python.py4j.ShellModeEngineTest)  Time elapsed: 0.466 s
print_(org.eclipse.ease.lang.python.py4j.ShellModeEngineTest) skipped
optionalModuleParameters(org.eclipse.ease.lang.python.py4j.ShellModeEngineTest)  Time elapsed: 0.234 s
print_TextNoNewline(org.eclipse.ease.lang.python.py4j.ShellModeEngineTest) skipped
getScriptEngine(org.eclipse.ease.lang.python.py4j.ShellModeEngineTest)  Time elapsed: 0.233 s
print_Text(org.eclipse.ease.lang.python.py4j.ShellModeEngineTest) skipped
callModuleCode(org.eclipse.ease.lang.python.py4j.ShellModeEngineTest)  Time elapsed: 0.229 s
print_NoNewline(org.eclipse.ease.lang.python.py4j.ShellModeEngineTest) skipped
incompleteStatement(org.eclipse.ease.lang.python.py4j.ShellModeEngineTest)  Time elapsed: 0.228 s
multiLineStatement(org.eclipse.ease.lang.python.py4j.ShellModeEngineTest)  Time elapsed: 0.232 s
runtimeError(org.eclipse.ease.lang.python.py4j.ShellModeEngineTest)  Time elapsed: 0.231 s
javaIntArray(org.eclipse.ease.lang.python.py4j.ShellModeEngineTest)  Time elapsed: 0.231 s
javaDoubleArray(org.eclipse.ease.lang.python.py4j.ShellModeEngineTest)  Time elapsed: 0.228 s
pythonSet(org.eclipse.ease.lang.python.py4j.ShellModeEngineTest)  Time elapsed: 0.229 s
javaStringArray(org.eclipse.ease.lang.python.py4j.ShellModeEngineTest)  Time elapsed: 0.227 s
javaShortArray(org.eclipse.ease.lang.python.py4j.ShellModeEngineTest)  Time elapsed: 0.225 s
javaBooleanArray(org.eclipse.ease.lang.python.py4j.ShellModeEngineTest)  Time elapsed: 0.226 s
javaObjectArray(org.eclipse.ease.lang.python.py4j.ShellModeEngineTest)  Time elapsed: 0.252 s
javaIntegerArray(org.eclipse.ease.lang.python.py4j.ShellModeEngineTest)  Time elapsed: 0.229 s
javaInteger(org.eclipse.ease.lang.python.py4j.ShellModeEngineTest)  Time elapsed: 0.226 s
javaString(org.eclipse.ease.lang.python.py4j.ShellModeEngineTest)  Time elapsed: 0.223 s
javaByteArray(org.eclipse.ease.lang.python.py4j.ShellModeEngineTest)  Time elapsed: 0.227 s
createEclipseClass(org.eclipse.ease.lang.python.py4j.ShellModeEngineTest)  Time elapsed: 0.225 s
pythonString(org.eclipse.ease.lang.python.py4j.ShellModeEngineTest)  Time elapsed: 0.222 s
varargs(org.eclipse.ease.lang.python.py4j.ShellModeEngineTest)  Time elapsed: 0.225 s
createJavaType(org.eclipse.ease.lang.python.py4j.ShellModeEngineTest)  Time elapsed: 0.219 s
javaFloatArray(org.eclipse.ease.lang.python.py4j.ShellModeEngineTest)  Time elapsed: 0.226 s
implementJavaInterface(org.eclipse.ease.lang.python.py4j.ShellModeEngineTest)  Time elapsed: 0.223 s
pythonDict(org.eclipse.ease.lang.python.py4j.ShellModeEngineTest)  Time elapsed: 0.223 s
pythonList(org.eclipse.ease.lang.python.py4j.ShellModeEngineTest)  Time elapsed: 0.235 s
testMultiple(org.eclipse.ease.lang.python.py4j.ShellModeEngineTest)  Time elapsed: 0.231 s
javaLongArray(org.eclipse.ease.lang.python.py4j.ShellModeEngineTest)  Time elapsed: 0.23 s
createPythonObject(org.eclipse.ease.lang.python.py4j.ShellModeEngineTest)  Time elapsed: 0.222 s
pythonInteger(org.eclipse.ease.lang.python.py4j.ShellModeEngineTest)  Time elapsed: 0.223 s
Running org.eclipse.ease.lang.python.py4j.Py4jDebugTest
Start of script
include file start
include file processed
Result of testMethod = 5
End of script
Start of script
include file start
include file processed
Result of testMethod = 5
End of script
Start of script
include file start
include file processed
Result of testMethod = 5
py4j.Py4JException: An exception was raised by the Python Proxy. Return Message: Traceback (most recent call last):
  File "/home/jenkins/agent/workspace/ease.verify.core.target.2019-03/tests/org.eclipse.ease.lang.python.py4j.test/target/work/plugins/py4j-python_0.10.8.1-bnd-2odeag/src/py4j/clientserver.py", line 581, in _call_proxy
    return_value = getattr(self.pool[obj_id], method)(*params)
  File "<...>", line 424, in run
  File "/usr/lib64/python2.7/bdb.py", line 400, in run
    exec cmd in globals, locals
  File "__ref_L/Debug Test/Main.py_zubtvyowbb", line 23, in <module>
  File "__ref_L/Debug Test/Main.py_zubtvyowbb", line 23, in <module>
  File "<...>", line 231, in trace_dispatch
  File "/usr/lib64/python2.7/bdb.py", line 49, in trace_dispatch
    return self.dispatch_line(frame)
  File "/usr/lib64/python2.7/bdb.py", line 67, in dispatch_line
    self.user_line(frame)
  File "<...>", line 241, in user_line
  File "<...>", line 296, in dispatch
  File "/home/jenkins/agent/workspace/ease.verify.core.target.2019-03/tests/org.eclipse.ease.lang.python.py4j.test/target/work/plugins/py4j-python_0.10.8.1-bnd-2odeag/src/py4j/java_gateway.py", line 1286, in __call__
    answer, self.gateway_client, self.target_id, self.name)
  File "/home/jenkins/agent/workspace/ease.verify.core.target.2019-03/tests/org.eclipse.ease.lang.python.py4j.test/target/work/plugins/py4j-python_0.10.8.1-bnd-2odeag/src/py4j/protocol.py", line 328, in get_return_value
    format(target_id, ".", name), value)
Py4JJavaError: An error occurred while calling o0.traceDispatch.
: org.eclipse.ease.ExitException: 
	at org.eclipse.ease.debugging.AbstractEaseDebugger.handleEventsInSuspendedState(AbstractEaseDebugger.java:329)
	at org.eclipse.ease.debugging.AbstractEaseDebugger.suspend(AbstractEaseDebugger.java:255)
	at org.eclipse.ease.lang.python.py4j.internal.Py4jDebugger.suspend(Py4jDebugger.java:87)
	at org.eclipse.ease.debugging.AbstractEaseDebugger.processLine(AbstractEaseDebugger.java:490)
	at org.eclipse.ease.lang.python.debugger.PythonDebugger.traceDispatch(PythonDebugger.java:178)
	at sun.reflect.GeneratedMethodAccessor12.invoke(Unknown Source)
	at sun.reflect.DelegatingMethodAccessorImpl.invoke(DelegatingMethodAccessorImpl.java:43)
	at java.lang.reflect.Method.invoke(Method.java:498)
	at py4j.reflection.MethodInvoker.invoke(MethodInvoker.java:244)
	at py4j.reflection.ReflectionEngine.invoke(ReflectionEngine.java:357)
	at py4j.Gateway.invoke(Gateway.java:282)
	at py4j.commands.AbstractCommand.invokeMethod(AbstractCommand.java:132)
	at py4j.commands.CallCommand.execute(CallCommand.java:79)
	at py4j.ClientServerConnection.sendCommand(ClientServerConnection.java:244)
	at py4j.CallbackClient.sendCommand(CallbackClient.java:384)
	at py4j.CallbackClient.sendCommand(CallbackClient.java:356)
	at py4j.reflection.PythonProxyHandler.invoke(PythonProxyHandler.java:106)
	at com.sun.proxy.$Proxy13.run(Unknown Source)
	at org.eclipse.ease.lang.python.py4j.internal.Py4jDebugger.execute(Py4jDebugger.java:106)
	at org.eclipse.ease.lang.python.py4j.internal.Py4jDebuggerEngine.internalExecute(Py4jDebuggerEngine.java:85)
	at org.eclipse.ease.lang.python.py4j.internal.Py4jScriptEngine.execute(Py4jScriptEngine.java:226)
	at org.eclipse.ease.AbstractScriptEngine.inject(AbstractScriptEngine.java:226)
	at org.eclipse.ease.AbstractScriptEngine.run(AbstractScriptEngine.java:277)
	at org.eclipse.core.internal.jobs.Worker.run(Worker.java:63)


	at py4j.Protocol.getReturnValue(Protocol.java:476)
	at py4j.reflection.PythonProxyHandler.invoke(PythonProxyHandler.java:108)
	at com.sun.proxy.$Proxy13.run(Unknown Source)
	at org.eclipse.ease.lang.python.py4j.internal.Py4jDebugger.execute(Py4jDebugger.java:106)
	at org.eclipse.ease.lang.python.py4j.internal.Py4jDebuggerEngine.internalExecute(Py4jDebuggerEngine.java:85)
	at org.eclipse.ease.lang.python.py4j.internal.Py4jScriptEngine.execute(Py4jScriptEngine.java:226)
	at org.eclipse.ease.AbstractScriptEngine.inject(AbstractScriptEngine.java:226)
	at org.eclipse.ease.AbstractScriptEngine.run(AbstractScriptEngine.java:277)
	at org.eclipse.core.internal.jobs.Worker.run(Worker.java:63)
Start of script
include file start
include file processed
Result of testMethod = 5
End of script
Start of script
include file start
include file processed
Result of testMethod = 5
End of script
Start of script
include file start
include file processed
Result of testMethod = 5
End of script
Start of script
include file start
include file processed
Result of testMethod = 5
py4j.Py4JException: An exception was raised by the Python Proxy. Return Message: Traceback (most recent call last):
  File "/home/jenkins/agent/workspace/ease.verify.core.target.2019-03/tests/org.eclipse.ease.lang.python.py4j.test/target/work/plugins/py4j-python_0.10.8.1-bnd-2odeag/src/py4j/clientserver.py", line 581, in _call_proxy
    return_value = getattr(self.pool[obj_id], method)(*params)
  File "<...>", line 424, in run
  File "/usr/lib64/python2.7/bdb.py", line 400, in run
    exec cmd in globals, locals
  File "__ref_L/Debug Test/Main.py_vijajuqskp", line 23, in <module>
  File "__ref_L/Debug Test/Main.py_vijajuqskp", line 23, in <module>
  File "<...>", line 231, in trace_dispatch
  File "/usr/lib64/python2.7/bdb.py", line 49, in trace_dispatch
    return self.dispatch_line(frame)
  File "/usr/lib64/python2.7/bdb.py", line 67, in dispatch_line
    self.user_line(frame)
  File "<...>", line 241, in user_line
  File "<...>", line 296, in dispatch
  File "/home/jenkins/agent/workspace/ease.verify.core.target.2019-03/tests/org.eclipse.ease.lang.python.py4j.test/target/work/plugins/py4j-python_0.10.8.1-bnd-2odeag/src/py4j/java_gateway.py", line 1286, in __call__
    answer, self.gateway_client, self.target_id, self.name)
  File "/home/jenkins/agent/workspace/ease.verify.core.target.2019-03/tests/org.eclipse.ease.lang.python.py4j.test/target/work/plugins/py4j-python_0.10.8.1-bnd-2odeag/src/py4j/protocol.py", line 328, in get_return_value
    format(target_id, ".", name), value)
Py4JJavaError: An error occurred while calling o0.traceDispatch.
: org.eclipse.ease.ExitException: 
	at org.eclipse.ease.debugging.AbstractEaseDebugger.handleEventsInSuspendedState(AbstractEaseDebugger.java:329)
	at org.eclipse.ease.debugging.AbstractEaseDebugger.suspend(AbstractEaseDebugger.java:255)
	at org.eclipse.ease.lang.python.py4j.internal.Py4jDebugger.suspend(Py4jDebugger.java:87)
	at org.eclipse.ease.debugging.AbstractEaseDebugger.processLine(AbstractEaseDebugger.java:490)
	at org.eclipse.ease.lang.python.debugger.PythonDebugger.traceDispatch(PythonDebugger.java:178)
	at sun.reflect.GeneratedMethodAccessor12.invoke(Unknown Source)
	at sun.reflect.DelegatingMethodAccessorImpl.invoke(DelegatingMethodAccessorImpl.java:43)
	at java.lang.reflect.Method.invoke(Method.java:498)
	at py4j.reflection.MethodInvoker.invoke(MethodInvoker.java:244)
	at py4j.reflection.ReflectionEngine.invoke(ReflectionEngine.java:357)
	at py4j.Gateway.invoke(Gateway.java:282)
	at py4j.commands.AbstractCommand.invokeMethod(AbstractCommand.java:132)
	at py4j.commands.CallCommand.execute(CallCommand.java:79)
	at py4j.ClientServerConnection.sendCommand(ClientServerConnection.java:244)
	at py4j.CallbackClient.sendCommand(CallbackClient.java:384)
	at py4j.CallbackClient.sendCommand(CallbackClient.java:356)
	at py4j.reflection.PythonProxyHandler.invoke(PythonProxyHandler.java:106)
	at com.sun.proxy.$Proxy13.run(Unknown Source)
	at org.eclipse.ease.lang.python.py4j.internal.Py4jDebugger.execute(Py4jDebugger.java:106)
	at org.eclipse.ease.lang.python.py4j.internal.Py4jDebuggerEngine.internalExecute(Py4jDebuggerEngine.java:85)
	at org.eclipse.ease.lang.python.py4j.internal.Py4jScriptEngine.execute(Py4jScriptEngine.java:226)
	at org.eclipse.ease.AbstractScriptEngine.inject(AbstractScriptEngine.java:226)
	at org.eclipse.ease.AbstractScriptEngine.run(AbstractScriptEngine.java:277)
	at org.eclipse.core.internal.jobs.Worker.run(Worker.java:63)


	at py4j.Protocol.getReturnValue(Protocol.java:476)
	at py4j.reflection.PythonProxyHandler.invoke(PythonProxyHandler.java:108)
	at com.sun.proxy.$Proxy13.run(Unknown Source)
	at org.eclipse.ease.lang.python.py4j.internal.Py4jDebugger.execute(Py4jDebugger.java:106)
	at org.eclipse.ease.lang.python.py4j.internal.Py4jDebuggerEngine.internalExecute(Py4jDebuggerEngine.java:85)
	at org.eclipse.ease.lang.python.py4j.internal.Py4jScriptEngine.execute(Py4jScriptEngine.java:226)
	at org.eclipse.ease.AbstractScriptEngine.inject(AbstractScriptEngine.java:226)
	at org.eclipse.ease.AbstractScriptEngine.run(AbstractScriptEngine.java:277)
	at org.eclipse.core.internal.jobs.Worker.run(Worker.java:63)
Start of script
include file start
include file processed
Result of testMethod = 5
End of script
Start of script
include file start
include file processed
Result of testMethod = 5
End of script
Start of script
include file start
include file processed
py4j.Py4JException: An exception was raised by the Python Proxy. Return Message: Traceback (most recent call last):
  File "/home/jenkins/agent/workspace/ease.verify.core.target.2019-03/tests/org.eclipse.ease.lang.python.py4j.test/target/work/plugins/py4j-python_0.10.8.1-bnd-2odeag/src/py4j/clientserver.py", line 581, in _call_proxy
    return_value = getattr(self.pool[obj_id], method)(*params)
  File "<...>", line 424, in run
  File "/usr/lib64/python2.7/bdb.py", line 400, in run
    exec cmd in globals, locals
  File "__ref_L/Debug Test/Main.py_njybhsvwwy", line 22, in <module>
  File "__ref_L/Debug Test/Main.py_njybhsvwwy", line 22, in <module>
  File "<...>", line 231, in trace_dispatch
  File "/usr/lib64/python2.7/bdb.py", line 49, in trace_dispatch
    return self.dispatch_line(frame)
  File "/usr/lib64/python2.7/bdb.py", line 67, in dispatch_line
    self.user_line(frame)
  File "<...>", line 241, in user_line
  File "<...>", line 296, in dispatch
  File "/home/jenkins/agent/workspace/ease.verify.core.target.2019-03/tests/org.eclipse.ease.lang.python.py4j.test/target/work/plugins/py4j-python_0.10.8.1-bnd-2odeag/src/py4j/java_gateway.py", line 1286, in __call__
    answer, self.gateway_client, self.target_id, self.name)
  File "/home/jenkins/agent/workspace/ease.verify.core.target.2019-03/tests/org.eclipse.ease.lang.python.py4j.test/target/work/plugins/py4j-python_0.10.8.1-bnd-2odeag/src/py4j/protocol.py", line 328, in get_return_value
    format(target_id, ".", name), value)
Py4JJavaError: An error occurred while calling o0.traceDispatch.
: org.eclipse.ease.ExitException: 
	at org.eclipse.ease.debugging.AbstractEaseDebugger.handleEventsInSuspendedState(AbstractEaseDebugger.java:329)
	at org.eclipse.ease.debugging.AbstractEaseDebugger.suspend(AbstractEaseDebugger.java:255)
	at org.eclipse.ease.lang.python.py4j.internal.Py4jDebugger.suspend(Py4jDebugger.java:87)
	at org.eclipse.ease.debugging.AbstractEaseDebugger.processLine(AbstractEaseDebugger.java:510)
	at org.eclipse.ease.lang.python.debugger.PythonDebugger.traceDispatch(PythonDebugger.java:178)
	at sun.reflect.GeneratedMethodAccessor12.invoke(Unknown Source)
	at sun.reflect.DelegatingMethodAccessorImpl.invoke(DelegatingMethodAccessorImpl.java:43)
	at java.lang.reflect.Method.invoke(Method.java:498)
	at py4j.reflection.MethodInvoker.invoke(MethodInvoker.java:244)
	at py4j.reflection.ReflectionEngine.invoke(ReflectionEngine.java:357)
	at py4j.Gateway.invoke(Gateway.java:282)
	at py4j.commands.AbstractCommand.invokeMethod(AbstractCommand.java:132)
	at py4j.commands.CallCommand.execute(CallCommand.java:79)
	at py4j.ClientServerConnection.sendCommand(ClientServerConnection.java:244)
	at py4j.CallbackClient.sendCommand(CallbackClient.java:384)
	at py4j.CallbackClient.sendCommand(CallbackClient.java:356)
	at py4j.reflection.PythonProxyHandler.invoke(PythonProxyHandler.java:106)
	at com.sun.proxy.$Proxy13.run(Unknown Source)
	at org.eclipse.ease.lang.python.py4j.internal.Py4jDebugger.execute(Py4jDebugger.java:106)
	at org.eclipse.ease.lang.python.py4j.internal.Py4jDebuggerEngine.internalExecute(Py4jDebuggerEngine.java:85)
	at org.eclipse.ease.lang.python.py4j.internal.Py4jScriptEngine.execute(Py4jScriptEngine.java:226)
	at org.eclipse.ease.AbstractScriptEngine.inject(AbstractScriptEngine.java:226)
	at org.eclipse.ease.AbstractScriptEngine.run(AbstractScriptEngine.java:277)
	at org.eclipse.core.internal.jobs.Worker.run(Worker.java:63)


	at py4j.Protocol.getReturnValue(Protocol.java:476)
	at py4j.reflection.PythonProxyHandler.invoke(PythonProxyHandler.java:108)
	at com.sun.proxy.$Proxy13.run(Unknown Source)
	at org.eclipse.ease.lang.python.py4j.internal.Py4jDebugger.execute(Py4jDebugger.java:106)
	at org.eclipse.ease.lang.python.py4j.internal.Py4jDebuggerEngine.internalExecute(Py4jDebuggerEngine.java:85)
	at org.eclipse.ease.lang.python.py4j.internal.Py4jScriptEngine.execute(Py4jScriptEngine.java:226)
	at org.eclipse.ease.AbstractScriptEngine.inject(AbstractScriptEngine.java:226)
	at org.eclipse.ease.AbstractScriptEngine.run(AbstractScriptEngine.java:277)
	at org.eclipse.core.internal.jobs.Worker.run(Worker.java:63)
Start of script
include file start
include file processed
Result of testMethod = 5
End of script
py4j.Py4JException: An exception was raised by the Python Proxy. Return Message: Traceback (most recent call last):
  File "/home/jenkins/agent/workspace/ease.verify.core.target.2019-03/tests/org.eclipse.ease.lang.python.py4j.test/target/work/plugins/py4j-python_0.10.8.1-bnd-2odeag/src/py4j/clientserver.py", line 581, in _call_proxy
    return_value = getattr(self.pool[obj_id], method)(*params)
  File "<...>", line 424, in run
  File "/usr/lib64/python2.7/bdb.py", line 400, in run
    exec cmd in globals, locals
  File "__ref_L/Debug Test/Main.py_tdaxkojflt", line 1, in <module>
  File "__ref_L/Debug Test/Main.py_tdaxkojflt", line 1, in <module>
  File "<...>", line 231, in trace_dispatch
  File "/usr/lib64/python2.7/bdb.py", line 49, in trace_dispatch
    return self.dispatch_line(frame)
  File "/usr/lib64/python2.7/bdb.py", line 67, in dispatch_line
    self.user_line(frame)
  File "<...>", line 241, in user_line
  File "<...>", line 296, in dispatch
  File "/home/jenkins/agent/workspace/ease.verify.core.target.2019-03/tests/org.eclipse.ease.lang.python.py4j.test/target/work/plugins/py4j-python_0.10.8.1-bnd-2odeag/src/py4j/java_gateway.py", line 1286, in __call__
    answer, self.gateway_client, self.target_id, self.name)
  File "/home/jenkins/agent/workspace/ease.verify.core.target.2019-03/tests/org.eclipse.ease.lang.python.py4j.test/target/work/plugins/py4j-python_0.10.8.1-bnd-2odeag/src/py4j/protocol.py", line 328, in get_return_value
    format(target_id, ".", name), value)
Py4JJavaError: An error occurred while calling o0.traceDispatch.
: org.eclipse.ease.ExitException: 
	at org.eclipse.ease.debugging.AbstractEaseDebugger.handleEventsInSuspendedState(AbstractEaseDebugger.java:329)
	at org.eclipse.ease.debugging.AbstractEaseDebugger.suspend(AbstractEaseDebugger.java:255)
	at org.eclipse.ease.lang.python.py4j.internal.Py4jDebugger.suspend(Py4jDebugger.java:87)
	at org.eclipse.ease.debugging.AbstractEaseDebugger.processLine(AbstractEaseDebugger.java:490)
	at org.eclipse.ease.lang.python.debugger.PythonDebugger.traceDispatch(PythonDebugger.java:178)
	at sun.reflect.GeneratedMethodAccessor12.invoke(Unknown Source)
	at sun.reflect.DelegatingMethodAccessorImpl.invoke(DelegatingMethodAccessorImpl.java:43)
	at java.lang.reflect.Method.invoke(Method.java:498)
	at py4j.reflection.MethodInvoker.invoke(MethodInvoker.java:244)
	at py4j.reflection.ReflectionEngine.invoke(ReflectionEngine.java:357)
	at py4j.Gateway.invoke(Gateway.java:282)
	at py4j.commands.AbstractCommand.invokeMethod(AbstractCommand.java:132)
	at py4j.commands.CallCommand.execute(CallCommand.java:79)
	at py4j.ClientServerConnection.sendCommand(ClientServerConnection.java:244)
	at py4j.CallbackClient.sendCommand(CallbackClient.java:384)
	at py4j.CallbackClient.sendCommand(CallbackClient.java:356)
	at py4j.reflection.PythonProxyHandler.invoke(PythonProxyHandler.java:106)
	at com.sun.proxy.$Proxy13.run(Unknown Source)
	at org.eclipse.ease.lang.python.py4j.internal.Py4jDebugger.execute(Py4jDebugger.java:106)
	at org.eclipse.ease.lang.python.py4j.internal.Py4jDebuggerEngine.internalExecute(Py4jDebuggerEngine.java:85)
	at org.eclipse.ease.lang.python.py4j.internal.Py4jScriptEngine.execute(Py4jScriptEngine.java:226)
	at org.eclipse.ease.AbstractScriptEngine.inject(AbstractScriptEngine.java:226)
	at org.eclipse.ease.AbstractScriptEngine.run(AbstractScriptEngine.java:277)
	at org.eclipse.core.internal.jobs.Worker.run(Worker.java:63)


	at py4j.Protocol.getReturnValue(Protocol.java:476)
	at py4j.reflection.PythonProxyHandler.invoke(PythonProxyHandler.java:108)
	at com.sun.proxy.$Proxy13.run(Unknown Source)
	at org.eclipse.ease.lang.python.py4j.internal.Py4jDebugger.execute(Py4jDebugger.java:106)
	at org.eclipse.ease.lang.python.py4j.internal.Py4jDebuggerEngine.internalExecute(Py4jDebuggerEngine.java:85)
	at org.eclipse.ease.lang.python.py4j.internal.Py4jScriptEngine.execute(Py4jScriptEngine.java:226)
	at org.eclipse.ease.AbstractScriptEngine.inject(AbstractScriptEngine.java:226)
	at org.eclipse.ease.AbstractScriptEngine.run(AbstractScriptEngine.java:277)
	at org.eclipse.core.internal.jobs.Worker.run(Worker.java:63)
Start of script
include file start
include file processed
Result of testMethod = 5
End of script
Start of script
include file start
include file processed
Result of testMethod = 5
End of script
Start of script
include file start
include file processed
Result of testMethod = 5
py4j.Py4JException: An exception was raised by the Python Proxy. Return Message: Traceback (most recent call last):
  File "/home/jenkins/agent/workspace/ease.verify.core.target.2019-03/tests/org.eclipse.ease.lang.python.py4j.test/target/work/plugins/py4j-python_0.10.8.1-bnd-2odeag/src/py4j/clientserver.py", line 581, in _call_proxy
    return_value = getattr(self.pool[obj_id], method)(*params)
  File "<...>", line 424, in run
  File "/usr/lib64/python2.7/bdb.py", line 400, in run
    exec cmd in globals, locals
  File "__ref_L/Debug Test/Main.py_nuihzhxglw", line 23, in <module>
  File "__ref_L/Debug Test/Main.py_nuihzhxglw", line 23, in <module>
  File "<...>", line 231, in trace_dispatch
  File "/usr/lib64/python2.7/bdb.py", line 49, in trace_dispatch
    return self.dispatch_line(frame)
  File "/usr/lib64/python2.7/bdb.py", line 67, in dispatch_line
    self.user_line(frame)
  File "<...>", line 241, in user_line
  File "<...>", line 296, in dispatch
  File "/home/jenkins/agent/workspace/ease.verify.core.target.2019-03/tests/org.eclipse.ease.lang.python.py4j.test/target/work/plugins/py4j-python_0.10.8.1-bnd-2odeag/src/py4j/java_gateway.py", line 1286, in __call__
    answer, self.gateway_client, self.target_id, self.name)
  File "/home/jenkins/agent/workspace/ease.verify.core.target.2019-03/tests/org.eclipse.ease.lang.python.py4j.test/target/work/plugins/py4j-python_0.10.8.1-bnd-2odeag/src/py4j/protocol.py", line 328, in get_return_value
    format(target_id, ".", name), value)
Py4JJavaError: An error occurred while calling o0.traceDispatch.
: org.eclipse.ease.ExitException: 
	at org.eclipse.ease.debugging.AbstractEaseDebugger.handleEventsInSuspendedState(AbstractEaseDebugger.java:329)
	at org.eclipse.ease.debugging.AbstractEaseDebugger.suspend(AbstractEaseDebugger.java:255)
	at org.eclipse.ease.lang.python.py4j.internal.Py4jDebugger.suspend(Py4jDebugger.java:87)
	at org.eclipse.ease.debugging.AbstractEaseDebugger.processLine(AbstractEaseDebugger.java:490)
	at org.eclipse.ease.lang.python.debugger.PythonDebugger.traceDispatch(PythonDebugger.java:178)
	at sun.reflect.GeneratedMethodAccessor12.invoke(Unknown Source)
	at sun.reflect.DelegatingMethodAccessorImpl.invoke(DelegatingMethodAccessorImpl.java:43)
	at java.lang.reflect.Method.invoke(Method.java:498)
	at py4j.reflection.MethodInvoker.invoke(MethodInvoker.java:244)
	at py4j.reflection.ReflectionEngine.invoke(ReflectionEngine.java:357)
	at py4j.Gateway.invoke(Gateway.java:282)
	at py4j.commands.AbstractCommand.invokeMethod(AbstractCommand.java:132)
	at py4j.commands.CallCommand.execute(CallCommand.java:79)
	at py4j.ClientServerConnection.sendCommand(ClientServerConnection.java:244)
	at py4j.CallbackClient.sendCommand(CallbackClient.java:384)
	at py4j.CallbackClient.sendCommand(CallbackClient.java:356)
	at py4j.reflection.PythonProxyHandler.invoke(PythonProxyHandler.java:106)
	at com.sun.proxy.$Proxy13.run(Unknown Source)
	at org.eclipse.ease.lang.python.py4j.internal.Py4jDebugger.execute(Py4jDebugger.java:106)
	at org.eclipse.ease.lang.python.py4j.internal.Py4jDebuggerEngine.internalExecute(Py4jDebuggerEngine.java:85)
	at org.eclipse.ease.lang.python.py4j.internal.Py4jScriptEngine.execute(Py4jScriptEngine.java:226)
	at org.eclipse.ease.AbstractScriptEngine.inject(AbstractScriptEngine.java:226)
	at org.eclipse.ease.AbstractScriptEngine.run(AbstractScriptEngine.java:277)
	at org.eclipse.core.internal.jobs.Worker.run(Worker.java:63)


	at py4j.Protocol.getReturnValue(Protocol.java:476)
	at py4j.reflection.PythonProxyHandler.invoke(PythonProxyHandler.java:108)
	at com.sun.proxy.$Proxy13.run(Unknown Source)
	at org.eclipse.ease.lang.python.py4j.internal.Py4jDebugger.execute(Py4jDebugger.java:106)
	at org.eclipse.ease.lang.python.py4j.internal.Py4jDebuggerEngine.internalExecute(Py4jDebuggerEngine.java:85)
	at org.eclipse.ease.lang.python.py4j.internal.Py4jScriptEngine.execute(Py4jScriptEngine.java:226)
	at org.eclipse.ease.AbstractScriptEngine.inject(AbstractScriptEngine.java:226)
	at org.eclipse.ease.AbstractScriptEngine.run(AbstractScriptEngine.java:277)
	at org.eclipse.core.internal.jobs.Worker.run(Worker.java:63)
Start of script
include file start
include file processed
Result of testMethod = 5
End of script
py4j.Py4JException: An exception was raised by the Python Proxy. Return Message: Traceback (most recent call last):
  File "/home/jenkins/agent/workspace/ease.verify.core.target.2019-03/tests/org.eclipse.ease.lang.python.py4j.test/target/work/plugins/py4j-python_0.10.8.1-bnd-2odeag/src/py4j/clientserver.py", line 581, in _call_proxy
    return_value = getattr(self.pool[obj_id], method)(*params)
  File "<...>", line 424, in run
  File "/usr/lib64/python2.7/bdb.py", line 400, in run
    exec cmd in globals, locals
  File "__ref_L/Debug Test/Main.py_hxrjcocyyg", line 1, in <module>
  File "__ref_L/Debug Test/Main.py_hxrjcocyyg", line 1, in <module>
  File "<...>", line 231, in trace_dispatch
  File "/usr/lib64/python2.7/bdb.py", line 49, in trace_dispatch
    return self.dispatch_line(frame)
  File "/usr/lib64/python2.7/bdb.py", line 67, in dispatch_line
    self.user_line(frame)
  File "<...>", line 241, in user_line
  File "<...>", line 296, in dispatch
  File "/home/jenkins/agent/workspace/ease.verify.core.target.2019-03/tests/org.eclipse.ease.lang.python.py4j.test/target/work/plugins/py4j-python_0.10.8.1-bnd-2odeag/src/py4j/java_gateway.py", line 1286, in __call__
    answer, self.gateway_client, self.target_id, self.name)
  File "/home/jenkins/agent/workspace/ease.verify.core.target.2019-03/tests/org.eclipse.ease.lang.python.py4j.test/target/work/plugins/py4j-python_0.10.8.1-bnd-2odeag/src/py4j/protocol.py", line 328, in get_return_value
    format(target_id, ".", name), value)
Py4JJavaError: An error occurred while calling o0.traceDispatch.
: org.eclipse.ease.ExitException: 
	at org.eclipse.ease.debugging.AbstractEaseDebugger.handleEventsInSuspendedState(AbstractEaseDebugger.java:329)
	at org.eclipse.ease.debugging.AbstractEaseDebugger.suspend(AbstractEaseDebugger.java:255)
	at org.eclipse.ease.lang.python.py4j.internal.Py4jDebugger.suspend(Py4jDebugger.java:87)
	at org.eclipse.ease.debugging.AbstractEaseDebugger.processLine(AbstractEaseDebugger.java:490)
	at org.eclipse.ease.lang.python.debugger.PythonDebugger.traceDispatch(PythonDebugger.java:178)
	at sun.reflect.GeneratedMethodAccessor12.invoke(Unknown Source)
	at sun.reflect.DelegatingMethodAccessorImpl.invoke(DelegatingMethodAccessorImpl.java:43)
	at java.lang.reflect.Method.invoke(Method.java:498)
	at py4j.reflection.MethodInvoker.invoke(MethodInvoker.java:244)
	at py4j.reflection.ReflectionEngine.invoke(ReflectionEngine.java:357)
	at py4j.Gateway.invoke(Gateway.java:282)
	at py4j.commands.AbstractCommand.invokeMethod(AbstractCommand.java:132)
	at py4j.commands.CallCommand.execute(CallCommand.java:79)
	at py4j.ClientServerConnection.sendCommand(ClientServerConnection.java:244)
	at py4j.CallbackClient.sendCommand(CallbackClient.java:384)
	at py4j.CallbackClient.sendCommand(CallbackClient.java:356)
	at py4j.reflection.PythonProxyHandler.invoke(PythonProxyHandler.java:106)
	at com.sun.proxy.$Proxy13.run(Unknown Source)
	at org.eclipse.ease.lang.python.py4j.internal.Py4jDebugger.execute(Py4jDebugger.java:106)
	at org.eclipse.ease.lang.python.py4j.internal.Py4jDebuggerEngine.internalExecute(Py4jDebuggerEngine.java:85)
	at org.eclipse.ease.lang.python.py4j.internal.Py4jScriptEngine.execute(Py4jScriptEngine.java:226)
	at org.eclipse.ease.AbstractScriptEngine.inject(AbstractScriptEngine.java:226)
	at org.eclipse.ease.AbstractScriptEngine.run(AbstractScriptEngine.java:277)
	at org.eclipse.core.internal.jobs.Worker.run(Worker.java:63)


	at py4j.Protocol.getReturnValue(Protocol.java:476)
	at py4j.reflection.PythonProxyHandler.invoke(PythonProxyHandler.java:108)
	at com.sun.proxy.$Proxy13.run(Unknown Source)
	at org.eclipse.ease.lang.python.py4j.internal.Py4jDebugger.execute(Py4jDebugger.java:106)
	at org.eclipse.ease.lang.python.py4j.internal.Py4jDebuggerEngine.internalExecute(Py4jDebuggerEngine.java:85)
	at org.eclipse.ease.lang.python.py4j.internal.Py4jScriptEngine.execute(Py4jScriptEngine.java:226)
	at org.eclipse.ease.AbstractScriptEngine.inject(AbstractScriptEngine.java:226)
	at org.eclipse.ease.AbstractScriptEngine.run(AbstractScriptEngine.java:277)
	at org.eclipse.core.internal.jobs.Worker.run(Worker.java:63)
Start of script
include file start
include file processed
Result of testMethod = 5
End of script
Start of script
include file start
include file processed
Result of testMethod = 5
End of script
py4j.Py4JException: An exception was raised by the Python Proxy. Return Message: Traceback (most recent call last):
  File "/home/jenkins/agent/workspace/ease.verify.core.target.2019-03/tests/org.eclipse.ease.lang.python.py4j.test/target/work/plugins/py4j-python_0.10.8.1-bnd-2odeag/src/py4j/clientserver.py", line 581, in _call_proxy
    return_value = getattr(self.pool[obj_id], method)(*params)
  File "<...>", line 424, in run
  File "/usr/lib64/python2.7/bdb.py", line 400, in run
    exec cmd in globals, locals
  File "__ref_L/Debug Test/Main.py_dvslzfbpnj", line 1, in <module>
  File "__ref_L/Debug Test/Main.py_dvslzfbpnj", line 1, in <module>
  File "<...>", line 231, in trace_dispatch
  File "/usr/lib64/python2.7/bdb.py", line 49, in trace_dispatch
    return self.dispatch_line(frame)
  File "/usr/lib64/python2.7/bdb.py", line 67, in dispatch_line
    self.user_line(frame)
  File "<...>", line 241, in user_line
  File "<...>", line 296, in dispatch
  File "/home/jenkins/agent/workspace/ease.verify.core.target.2019-03/tests/org.eclipse.ease.lang.python.py4j.test/target/work/plugins/py4j-python_0.10.8.1-bnd-2odeag/src/py4j/java_gateway.py", line 1286, in __call__
    answer, self.gateway_client, self.target_id, self.name)
  File "/home/jenkins/agent/workspace/ease.verify.core.target.2019-03/tests/org.eclipse.ease.lang.python.py4j.test/target/work/plugins/py4j-python_0.10.8.1-bnd-2odeag/src/py4j/protocol.py", line 328, in get_return_value
    format(target_id, ".", name), value)
Py4JJavaError: An error occurred while calling o0.traceDispatch.
: org.eclipse.ease.ExitException: 
	at org.eclipse.ease.debugging.AbstractEaseDebugger.handleEventsInSuspendedState(AbstractEaseDebugger.java:329)
	at org.eclipse.ease.debugging.AbstractEaseDebugger.suspend(AbstractEaseDebugger.java:255)
	at org.eclipse.ease.lang.python.py4j.internal.Py4jDebugger.suspend(Py4jDebugger.java:87)
	at org.eclipse.ease.debugging.AbstractEaseDebugger.processLine(AbstractEaseDebugger.java:490)
	at org.eclipse.ease.lang.python.debugger.PythonDebugger.traceDispatch(PythonDebugger.java:178)
	at sun.reflect.GeneratedMethodAccessor12.invoke(Unknown Source)
	at sun.reflect.DelegatingMethodAccessorImpl.invoke(DelegatingMethodAccessorImpl.java:43)
	at java.lang.reflect.Method.invoke(Method.java:498)
	at py4j.reflection.MethodInvoker.invoke(MethodInvoker.java:244)
	at py4j.reflection.ReflectionEngine.invoke(ReflectionEngine.java:357)
	at py4j.Gateway.invoke(Gateway.java:282)
	at py4j.commands.AbstractCommand.invokeMethod(AbstractCommand.java:132)
	at py4j.commands.CallCommand.execute(CallCommand.java:79)
	at py4j.ClientServerConnection.sendCommand(ClientServerConnection.java:244)
	at py4j.CallbackClient.sendCommand(CallbackClient.java:384)
	at py4j.CallbackClient.sendCommand(CallbackClient.java:356)
	at py4j.reflection.PythonProxyHandler.invoke(PythonProxyHandler.java:106)
	at com.sun.proxy.$Proxy13.run(Unknown Source)
	at org.eclipse.ease.lang.python.py4j.internal.Py4jDebugger.execute(Py4jDebugger.java:106)
	at org.eclipse.ease.lang.python.py4j.internal.Py4jDebuggerEngine.internalExecute(Py4jDebuggerEngine.java:85)
	at org.eclipse.ease.lang.python.py4j.internal.Py4jScriptEngine.execute(Py4jScriptEngine.java:226)
	at org.eclipse.ease.AbstractScriptEngine.inject(AbstractScriptEngine.java:226)
	at org.eclipse.ease.AbstractScriptEngine.run(AbstractScriptEngine.java:277)
	at org.eclipse.core.internal.jobs.Worker.run(Worker.java:63)


	at py4j.Protocol.getReturnValue(Protocol.java:476)
	at py4j.reflection.PythonProxyHandler.invoke(PythonProxyHandler.java:108)
	at com.sun.proxy.$Proxy13.run(Unknown Source)
	at org.eclipse.ease.lang.python.py4j.internal.Py4jDebugger.execute(Py4jDebugger.java:106)
	at org.eclipse.ease.lang.python.py4j.internal.Py4jDebuggerEngine.internalExecute(Py4jDebuggerEngine.java:85)
	at org.eclipse.ease.lang.python.py4j.internal.Py4jScriptEngine.execute(Py4jScriptEngine.java:226)
	at org.eclipse.ease.AbstractScriptEngine.inject(AbstractScriptEngine.java:226)
	at org.eclipse.ease.AbstractScriptEngine.run(AbstractScriptEngine.java:277)
	at org.eclipse.core.internal.jobs.Worker.run(Worker.java:63)
Start of script
include file start
include file processed
Result of testMethod = 5
End of script
Start of script
include file start
include file processed
Result of testMethod = 5
End of script
Start of script
include file start
include file processed
Result of testMethod = 5
End of script
Start of script
include file start
include file processed
Result of testMethod = 5
End of script
Start of script
include file start
include file processed
Result of testMethod = 5
End of script
Start of script
include file start
include file processed
py4j.Py4JException: An exception was raised by the Python Proxy. Return Message: Traceback (most recent call last):
  File "/home/jenkins/agent/workspace/ease.verify.core.target.2019-03/tests/org.eclipse.ease.lang.python.py4j.test/target/work/plugins/py4j-python_0.10.8.1-bnd-2odeag/src/py4j/clientserver.py", line 581, in _call_proxy
    return_value = getattr(self.pool[obj_id], method)(*params)
  File "<...>", line 424, in run
  File "/usr/lib64/python2.7/bdb.py", line 400, in run
    exec cmd in globals, locals
  File "__ref_L/Debug Test/Main.py_wtbtzfkyys", line 21, in <module>
  File "__ref_L/Debug Test/Main.py_wtbtzfkyys", line 18, in testMethod
  File "__ref_L/Debug Test/Main.py_wtbtzfkyys", line 18, in testMethod
  File "<...>", line 231, in trace_dispatch
  File "/usr/lib64/python2.7/bdb.py", line 49, in trace_dispatch
    return self.dispatch_line(frame)
  File "/usr/lib64/python2.7/bdb.py", line 67, in dispatch_line
    self.user_line(frame)
  File "<...>", line 241, in user_line
  File "<...>", line 296, in dispatch
  File "/home/jenkins/agent/workspace/ease.verify.core.target.2019-03/tests/org.eclipse.ease.lang.python.py4j.test/target/work/plugins/py4j-python_0.10.8.1-bnd-2odeag/src/py4j/java_gateway.py", line 1286, in __call__
    answer, self.gateway_client, self.target_id, self.name)
  File "/home/jenkins/agent/workspace/ease.verify.core.target.2019-03/tests/org.eclipse.ease.lang.python.py4j.test/target/work/plugins/py4j-python_0.10.8.1-bnd-2odeag/src/py4j/protocol.py", line 328, in get_return_value
    format(target_id, ".", name), value)
Py4JJavaError: An error occurred while calling o0.traceDispatch.
: org.eclipse.ease.ExitException: 
	at org.eclipse.ease.debugging.AbstractEaseDebugger.handleEventsInSuspendedState(AbstractEaseDebugger.java:329)
	at org.eclipse.ease.debugging.AbstractEaseDebugger.suspend(AbstractEaseDebugger.java:255)
	at org.eclipse.ease.lang.python.py4j.internal.Py4jDebugger.suspend(Py4jDebugger.java:87)
	at org.eclipse.ease.debugging.AbstractEaseDebugger.processLine(AbstractEaseDebugger.java:490)
	at org.eclipse.ease.lang.python.debugger.PythonDebugger.traceDispatch(PythonDebugger.java:178)
	at sun.reflect.GeneratedMethodAccessor12.invoke(Unknown Source)
	at sun.reflect.DelegatingMethodAccessorImpl.invoke(DelegatingMethodAccessorImpl.java:43)
	at java.lang.reflect.Method.invoke(Method.java:498)
	at py4j.reflection.MethodInvoker.invoke(MethodInvoker.java:244)
	at py4j.reflection.ReflectionEngine.invoke(ReflectionEngine.java:357)
	at py4j.Gateway.invoke(Gateway.java:282)
	at py4j.commands.AbstractCommand.invokeMethod(AbstractCommand.java:132)
	at py4j.commands.CallCommand.execute(CallCommand.java:79)
	at py4j.ClientServerConnection.sendCommand(ClientServerConnection.java:244)
	at py4j.CallbackClient.sendCommand(CallbackClient.java:384)
	at py4j.CallbackClient.sendCommand(CallbackClient.java:356)
	at py4j.reflection.PythonProxyHandler.invoke(PythonProxyHandler.java:106)
	at com.sun.proxy.$Proxy13.run(Unknown Source)
	at org.eclipse.ease.lang.python.py4j.internal.Py4jDebugger.execute(Py4jDebugger.java:106)
	at org.eclipse.ease.lang.python.py4j.internal.Py4jDebuggerEngine.internalExecute(Py4jDebuggerEngine.java:85)
	at org.eclipse.ease.lang.python.py4j.internal.Py4jScriptEngine.execute(Py4jScriptEngine.java:226)
	at org.eclipse.ease.AbstractScriptEngine.inject(AbstractScriptEngine.java:226)
	at org.eclipse.ease.AbstractScriptEngine.run(AbstractScriptEngine.java:277)
	at org.eclipse.core.internal.jobs.Worker.run(Worker.java:63)


	at py4j.Protocol.getReturnValue(Protocol.java:476)
	at py4j.reflection.PythonProxyHandler.invoke(PythonProxyHandler.java:108)
	at com.sun.proxy.$Proxy13.run(Unknown Source)
	at org.eclipse.ease.lang.python.py4j.internal.Py4jDebugger.execute(Py4jDebugger.java:106)
	at org.eclipse.ease.lang.python.py4j.internal.Py4jDebuggerEngine.internalExecute(Py4jDebuggerEngine.java:85)
	at org.eclipse.ease.lang.python.py4j.internal.Py4jScriptEngine.execute(Py4jScriptEngine.java:226)
	at org.eclipse.ease.AbstractScriptEngine.inject(AbstractScriptEngine.java:226)
	at org.eclipse.ease.AbstractScriptEngine.run(AbstractScriptEngine.java:277)
	at org.eclipse.core.internal.jobs.Worker.run(Worker.java:63)
Start of script
include file start
include file processed
Result of testMethod = 5
py4j.Py4JException: An exception was raised by the Python Proxy. Return Message: Traceback (most recent call last):
  File "/home/jenkins/agent/workspace/ease.verify.core.target.2019-03/tests/org.eclipse.ease.lang.python.py4j.test/target/work/plugins/py4j-python_0.10.8.1-bnd-2odeag/src/py4j/clientserver.py", line 581, in _call_proxy
    return_value = getattr(self.pool[obj_id], method)(*params)
  File "<...>", line 424, in run
  File "/usr/lib64/python2.7/bdb.py", line 400, in run
    exec cmd in globals, locals
  File "__ref_L/Debug Test/Main.py_mamzwsibmz", line 23, in <module>
  File "__ref_L/Debug Test/Main.py_mamzwsibmz", line 23, in <module>
  File "<...>", line 231, in trace_dispatch
  File "/usr/lib64/python2.7/bdb.py", line 49, in trace_dispatch
    return self.dispatch_line(frame)
  File "/usr/lib64/python2.7/bdb.py", line 67, in dispatch_line
    self.user_line(frame)
  File "<...>", line 241, in user_line
  File "<...>", line 296, in dispatch
  File "/home/jenkins/agent/workspace/ease.verify.core.target.2019-03/tests/org.eclipse.ease.lang.python.py4j.test/target/work/plugins/py4j-python_0.10.8.1-bnd-2odeag/src/py4j/java_gateway.py", line 1286, in __call__
    answer, self.gateway_client, self.target_id, self.name)
  File "/home/jenkins/agent/workspace/ease.verify.core.target.2019-03/tests/org.eclipse.ease.lang.python.py4j.test/target/work/plugins/py4j-python_0.10.8.1-bnd-2odeag/src/py4j/protocol.py", line 328, in get_return_value
    format(target_id, ".", name), value)
Py4JJavaError: An error occurred while calling o0.traceDispatch.
: org.eclipse.ease.ExitException: 
	at org.eclipse.ease.debugging.AbstractEaseDebugger.handleEventsInSuspendedState(AbstractEaseDebugger.java:329)
	at org.eclipse.ease.debugging.AbstractEaseDebugger.suspend(AbstractEaseDebugger.java:255)
	at org.eclipse.ease.lang.python.py4j.internal.Py4jDebugger.suspend(Py4jDebugger.java:87)
	at org.eclipse.ease.debugging.AbstractEaseDebugger.processLine(AbstractEaseDebugger.java:490)
	at org.eclipse.ease.lang.python.debugger.PythonDebugger.traceDispatch(PythonDebugger.java:178)
	at sun.reflect.GeneratedMethodAccessor12.invoke(Unknown Source)
	at sun.reflect.DelegatingMethodAccessorImpl.invoke(DelegatingMethodAccessorImpl.java:43)
	at java.lang.reflect.Method.invoke(Method.java:498)
	at py4j.reflection.MethodInvoker.invoke(MethodInvoker.java:244)
	at py4j.reflection.ReflectionEngine.invoke(ReflectionEngine.java:357)
	at py4j.Gateway.invoke(Gateway.java:282)
	at py4j.commands.AbstractCommand.invokeMethod(AbstractCommand.java:132)
	at py4j.commands.CallCommand.execute(CallCommand.java:79)
	at py4j.ClientServerConnection.sendCommand(ClientServerConnection.java:244)
	at py4j.CallbackClient.sendCommand(CallbackClient.java:384)
	at py4j.CallbackClient.sendCommand(CallbackClient.java:356)
	at py4j.reflection.PythonProxyHandler.invoke(PythonProxyHandler.java:106)
	at com.sun.proxy.$Proxy13.run(Unknown Source)
	at org.eclipse.ease.lang.python.py4j.internal.Py4jDebugger.execute(Py4jDebugger.java:106)
	at org.eclipse.ease.lang.python.py4j.internal.Py4jDebuggerEngine.internalExecute(Py4jDebuggerEngine.java:85)
	at org.eclipse.ease.lang.python.py4j.internal.Py4jScriptEngine.execute(Py4jScriptEngine.java:226)
	at org.eclipse.ease.AbstractScriptEngine.inject(AbstractScriptEngine.java:226)
	at org.eclipse.ease.AbstractScriptEngine.run(AbstractScriptEngine.java:277)
	at org.eclipse.core.internal.jobs.Worker.run(Worker.java:63)


	at py4j.Protocol.getReturnValue(Protocol.java:476)
	at py4j.reflection.PythonProxyHandler.invoke(PythonProxyHandler.java:108)
	at com.sun.proxy.$Proxy13.run(Unknown Source)
	at org.eclipse.ease.lang.python.py4j.internal.Py4jDebugger.execute(Py4jDebugger.java:106)
	at org.eclipse.ease.lang.python.py4j.internal.Py4jDebuggerEngine.internalExecute(Py4jDebuggerEngine.java:85)
	at org.eclipse.ease.lang.python.py4j.internal.Py4jScriptEngine.execute(Py4jScriptEngine.java:226)
	at org.eclipse.ease.AbstractScriptEngine.inject(AbstractScriptEngine.java:226)
	at org.eclipse.ease.AbstractScriptEngine.run(AbstractScriptEngine.java:277)
	at org.eclipse.core.internal.jobs.Worker.run(Worker.java:63)
Start of script
include file start
include file processed
Result of testMethod = 5
End of script
Start of script
include file start
include file processed
Result of testMethod = 5
End of script
Start of script
include file start
include file processed
Result of testMethod = 5
End of script
Start of script
include file start
include file processed
Result of testMethod = 5
End of script
Start of script
include file start
include file processed
Result of testMethod = 5
py4j.Py4JException: An exception was raised by the Python Proxy. Return Message: Traceback (most recent call last):
  File "/home/jenkins/agent/workspace/ease.verify.core.target.2019-03/tests/org.eclipse.ease.lang.python.py4j.test/target/work/plugins/py4j-python_0.10.8.1-bnd-2odeag/src/py4j/clientserver.py", line 581, in _call_proxy
    return_value = getattr(self.pool[obj_id], method)(*params)
  File "<...>", line 424, in run
  File "/usr/lib64/python2.7/bdb.py", line 400, in run
    exec cmd in globals, locals
  File "__ref_L/Debug Test/Main.py_slipyxxqox", line 23, in <module>
  File "__ref_L/Debug Test/Main.py_slipyxxqox", line 23, in <module>
  File "<...>", line 231, in trace_dispatch
  File "/usr/lib64/python2.7/bdb.py", line 49, in trace_dispatch
    return self.dispatch_line(frame)
  File "/usr/lib64/python2.7/bdb.py", line 67, in dispatch_line
    self.user_line(frame)
  File "<...>", line 241, in user_line
  File "<...>", line 296, in dispatch
  File "/home/jenkins/agent/workspace/ease.verify.core.target.2019-03/tests/org.eclipse.ease.lang.python.py4j.test/target/work/plugins/py4j-python_0.10.8.1-bnd-2odeag/src/py4j/java_gateway.py", line 1286, in __call__
    answer, self.gateway_client, self.target_id, self.name)
  File "/home/jenkins/agent/workspace/ease.verify.core.target.2019-03/tests/org.eclipse.ease.lang.python.py4j.test/target/work/plugins/py4j-python_0.10.8.1-bnd-2odeag/src/py4j/protocol.py", line 328, in get_return_value
    format(target_id, ".", name), value)
Py4JJavaError: An error occurred while calling o0.traceDispatch.
: org.eclipse.ease.ExitException: 
	at org.eclipse.ease.debugging.AbstractEaseDebugger.handleEventsInSuspendedState(AbstractEaseDebugger.java:329)
	at org.eclipse.ease.debugging.AbstractEaseDebugger.suspend(AbstractEaseDebugger.java:255)
	at org.eclipse.ease.lang.python.py4j.internal.Py4jDebugger.suspend(Py4jDebugger.java:87)
	at org.eclipse.ease.debugging.AbstractEaseDebugger.processLine(AbstractEaseDebugger.java:490)
	at org.eclipse.ease.lang.python.debugger.PythonDebugger.traceDispatch(PythonDebugger.java:178)
	at sun.reflect.GeneratedMethodAccessor12.invoke(Unknown Source)
	at sun.reflect.DelegatingMethodAccessorImpl.invoke(DelegatingMethodAccessorImpl.java:43)
	at java.lang.reflect.Method.invoke(Method.java:498)
	at py4j.reflection.MethodInvoker.invoke(MethodInvoker.java:244)
	at py4j.reflection.ReflectionEngine.invoke(ReflectionEngine.java:357)
	at py4j.Gateway.invoke(Gateway.java:282)
	at py4j.commands.AbstractCommand.invokeMethod(AbstractCommand.java:132)
	at py4j.commands.CallCommand.execute(CallCommand.java:79)
	at py4j.ClientServerConnection.sendCommand(ClientServerConnection.java:244)
	at py4j.CallbackClient.sendCommand(CallbackClient.java:384)
	at py4j.CallbackClient.sendCommand(CallbackClient.java:356)
	at py4j.reflection.PythonProxyHandler.invoke(PythonProxyHandler.java:106)
	at com.sun.proxy.$Proxy13.run(Unknown Source)
	at org.eclipse.ease.lang.python.py4j.internal.Py4jDebugger.execute(Py4jDebugger.java:106)
	at org.eclipse.ease.lang.python.py4j.internal.Py4jDebuggerEngine.internalExecute(Py4jDebuggerEngine.java:85)
	at org.eclipse.ease.lang.python.py4j.internal.Py4jScriptEngine.execute(Py4jScriptEngine.java:226)
	at org.eclipse.ease.AbstractScriptEngine.inject(AbstractScriptEngine.java:226)
	at org.eclipse.ease.AbstractScriptEngine.run(AbstractScriptEngine.java:277)
	at org.eclipse.core.internal.jobs.Worker.run(Worker.java:63)


	at py4j.Protocol.getReturnValue(Protocol.java:476)
	at py4j.reflection.PythonProxyHandler.invoke(PythonProxyHandler.java:108)
	at com.sun.proxy.$Proxy13.run(Unknown Source)
	at org.eclipse.ease.lang.python.py4j.internal.Py4jDebugger.execute(Py4jDebugger.java:106)
	at org.eclipse.ease.lang.python.py4j.internal.Py4jDebuggerEngine.internalExecute(Py4jDebuggerEngine.java:85)
	at org.eclipse.ease.lang.python.py4j.internal.Py4jScriptEngine.execute(Py4jScriptEngine.java:226)
	at org.eclipse.ease.AbstractScriptEngine.inject(AbstractScriptEngine.java:226)
	at org.eclipse.ease.AbstractScriptEngine.run(AbstractScriptEngine.java:277)
	at org.eclipse.core.internal.jobs.Worker.run(Worker.java:63)
Start of script
include file start
include file processed
Result of testMethod = 5
End of script
py4j.Py4JException: An exception was raised by the Python Proxy. Return Message: Traceback (most recent call last):
  File "/home/jenkins/agent/workspace/ease.verify.core.target.2019-03/tests/org.eclipse.ease.lang.python.py4j.test/target/work/plugins/py4j-python_0.10.8.1-bnd-2odeag/src/py4j/clientserver.py", line 581, in _call_proxy
    return_value = getattr(self.pool[obj_id], method)(*params)
  File "<...>", line 424, in run
  File "/usr/lib64/python2.7/bdb.py", line 400, in run
    exec cmd in globals, locals
  File "__ref_L/Debug Test/Main.py_udsixqhrov", line 1, in <module>
  File "__ref_L/Debug Test/Main.py_udsixqhrov", line 1, in <module>
  File "<...>", line 231, in trace_dispatch
  File "/usr/lib64/python2.7/bdb.py", line 49, in trace_dispatch
    return self.dispatch_line(frame)
  File "/usr/lib64/python2.7/bdb.py", line 67, in dispatch_line
    self.user_line(frame)
  File "<...>", line 241, in user_line
  File "<...>", line 296, in dispatch
  File "/home/jenkins/agent/workspace/ease.verify.core.target.2019-03/tests/org.eclipse.ease.lang.python.py4j.test/target/work/plugins/py4j-python_0.10.8.1-bnd-2odeag/src/py4j/java_gateway.py", line 1286, in __call__
    answer, self.gateway_client, self.target_id, self.name)
  File "/home/jenkins/agent/workspace/ease.verify.core.target.2019-03/tests/org.eclipse.ease.lang.python.py4j.test/target/work/plugins/py4j-python_0.10.8.1-bnd-2odeag/src/py4j/protocol.py", line 328, in get_return_value
    format(target_id, ".", name), value)
Py4JJavaError: An error occurred while calling o0.traceDispatch.
: org.eclipse.ease.ExitException: 
	at org.eclipse.ease.debugging.AbstractEaseDebugger.handleEventsInSuspendedState(AbstractEaseDebugger.java:329)
	at org.eclipse.ease.debugging.AbstractEaseDebugger.suspend(AbstractEaseDebugger.java:255)
	at org.eclipse.ease.lang.python.py4j.internal.Py4jDebugger.suspend(Py4jDebugger.java:87)
	at org.eclipse.ease.debugging.AbstractEaseDebugger.processLine(AbstractEaseDebugger.java:490)
	at org.eclipse.ease.lang.python.debugger.PythonDebugger.traceDispatch(PythonDebugger.java:178)
	at sun.reflect.GeneratedMethodAccessor12.invoke(Unknown Source)
	at sun.reflect.DelegatingMethodAccessorImpl.invoke(DelegatingMethodAccessorImpl.java:43)
	at java.lang.reflect.Method.invoke(Method.java:498)
	at py4j.reflection.MethodInvoker.invoke(MethodInvoker.java:244)
	at py4j.reflection.ReflectionEngine.invoke(ReflectionEngine.java:357)
	at py4j.Gateway.invoke(Gateway.java:282)
	at py4j.commands.AbstractCommand.invokeMethod(AbstractCommand.java:132)
	at py4j.commands.CallCommand.execute(CallCommand.java:79)
	at py4j.ClientServerConnection.sendCommand(ClientServerConnection.java:244)
	at py4j.CallbackClient.sendCommand(CallbackClient.java:384)
	at py4j.CallbackClient.sendCommand(CallbackClient.java:356)
	at py4j.reflection.PythonProxyHandler.invoke(PythonProxyHandler.java:106)
	at com.sun.proxy.$Proxy13.run(Unknown Source)
	at org.eclipse.ease.lang.python.py4j.internal.Py4jDebugger.execute(Py4jDebugger.java:106)
	at org.eclipse.ease.lang.python.py4j.internal.Py4jDebuggerEngine.internalExecute(Py4jDebuggerEngine.java:85)
	at org.eclipse.ease.lang.python.py4j.internal.Py4jScriptEngine.execute(Py4jScriptEngine.java:226)
	at org.eclipse.ease.AbstractScriptEngine.inject(AbstractScriptEngine.java:226)
	at org.eclipse.ease.AbstractScriptEngine.run(AbstractScriptEngine.java:277)
	at org.eclipse.core.internal.jobs.Worker.run(Worker.java:63)


	at py4j.Protocol.getReturnValue(Protocol.java:476)
	at py4j.reflection.PythonProxyHandler.invoke(PythonProxyHandler.java:108)
	at com.sun.proxy.$Proxy13.run(Unknown Source)
	at org.eclipse.ease.lang.python.py4j.internal.Py4jDebugger.execute(Py4jDebugger.java:106)
	at org.eclipse.ease.lang.python.py4j.internal.Py4jDebuggerEngine.internalExecute(Py4jDebuggerEngine.java:85)
	at org.eclipse.ease.lang.python.py4j.internal.Py4jScriptEngine.execute(Py4jScriptEngine.java:226)
	at org.eclipse.ease.AbstractScriptEngine.inject(AbstractScriptEngine.java:226)
	at org.eclipse.ease.AbstractScriptEngine.run(AbstractScriptEngine.java:277)
	at org.eclipse.core.internal.jobs.Worker.run(Worker.java:63)
Start of script
include file start
include file processed
Result of testMethod = 5
End of script
Start of script
include file start
include file processed
Result of testMethod = 5
End of script
Start of script
include file start
include file processed
Result of testMethod = 5
End of script
Tests run: 42, Failures: 0, Errors: 0, Skipped: 4, Time elapsed: 14.71 s - in org.eclipse.ease.lang.python.py4j.Py4jDebugTest
resumeOnLastIncludeLine(org.eclipse.ease.lang.python.py4j.Py4jDebugTest) skipped
nativeArrayVariable(org.eclipse.ease.lang.python.py4j.Py4jDebugTest) skipped
stepIntoIncludeCommand(org.eclipse.ease.lang.python.py4j.Py4jDebugTest) skipped
nativeObjectVariable(org.eclipse.ease.lang.python.py4j.Py4jDebugTest) skipped
disconnectProcessInSuspendedState(org.eclipse.ease.lang.python.py4j.Py4jDebugTest)  Time elapsed: 0.442 s
stepReturnIncludeCommand(org.eclipse.ease.lang.python.py4j.Py4jDebugTest)  Time elapsed: 0.312 s
arrayVariableSorting(org.eclipse.ease.lang.python.py4j.Py4jDebugTest)  Time elapsed: 0.445 s
stepOverOnDebugTarget(org.eclipse.ease.lang.python.py4j.Py4jDebugTest)  Time elapsed: 0.411 s
hasDebugTarget(org.eclipse.ease.lang.python.py4j.Py4jDebugTest)  Time elapsed: 0.245 s
disconnectThreadInSuspendedState(org.eclipse.ease.lang.python.py4j.Py4jDebugTest)  Time elapsed: 0.31 s
stepReturnOnDebugTarget(org.eclipse.ease.lang.python.py4j.Py4jDebugTest)  Time elapsed: 0.411 s
nullVariable(org.eclipse.ease.lang.python.py4j.Py4jDebugTest)  Time elapsed: 0.432 s
stepOverOnStackFrame(org.eclipse.ease.lang.python.py4j.Py4jDebugTest)  Time elapsed: 0.41 s
resumeOnDebugTarget(org.eclipse.ease.lang.python.py4j.Py4jDebugTest)  Time elapsed: 0.349 s
modifyVariableKeepingType(org.eclipse.ease.lang.python.py4j.Py4jDebugTest)  Time elapsed: 0.632 s
stepReturnOnStackFrame(org.eclipse.ease.lang.python.py4j.Py4jDebugTest)  Time elapsed: 0.409 s
terminateStackFrameInSuspendedState(org.eclipse.ease.lang.python.py4j.Py4jDebugTest)  Time elapsed: 0.335 s
breakpointLocation(org.eclipse.ease.lang.python.py4j.Py4jDebugTest)  Time elapsed: 0.333 s
stepReturnOnThread(org.eclipse.ease.lang.python.py4j.Py4jDebugTest)  Time elapsed: 0.409 s
javaClassVariable(org.eclipse.ease.lang.python.py4j.Py4jDebugTest)  Time elapsed: 0.452 s
stepIntoOnThread(org.eclipse.ease.lang.python.py4j.Py4jDebugTest)  Time elapsed: 0.447 s
terminateThreadInSuspendedState(org.eclipse.ease.lang.python.py4j.Py4jDebugTest)  Time elapsed: 0.334 s
resumeOnThread(org.eclipse.ease.lang.python.py4j.Py4jDebugTest)  Time elapsed: 0.308 s
stepIntoOnStackFrame(org.eclipse.ease.lang.python.py4j.Py4jDebugTest)  Time elapsed: 0.434 s
terminateProcessInSuspendedState(org.eclipse.ease.lang.python.py4j.Py4jDebugTest)  Time elapsed: 0.349 s
stepOverOnProcess(org.eclipse.ease.lang.python.py4j.Py4jDebugTest)  Time elapsed: 0.409 s
disconnectDebugTargetInSuspendedState(org.eclipse.ease.lang.python.py4j.Py4jDebugTest)  Time elapsed: 0.308 s
stepIntoOnProcess(org.eclipse.ease.lang.python.py4j.Py4jDebugTest)  Time elapsed: 0.85 s
terminatedState(org.eclipse.ease.lang.python.py4j.Py4jDebugTest)  Time elapsed: 0.209 s
stepOverIncludeCommand(org.eclipse.ease.lang.python.py4j.Py4jDebugTest)  Time elapsed: 0.406 s
innerScopeVariableBeforeOuterScopeVariable(org.eclipse.ease.lang.python.py4j.Py4jDebugTest)  Time elapsed: 0.407 s
primitiveStringVariable(org.eclipse.ease.lang.python.py4j.Py4jDebugTest)  Time elapsed: 0.436 s
resumeOnProcess(org.eclipse.ease.lang.python.py4j.Py4jDebugTest)  Time elapsed: 0.306 s
stepIntoOnDebugTarget(org.eclipse.ease.lang.python.py4j.Py4jDebugTest)  Time elapsed: 0.409 s
stepOverOnThread(org.eclipse.ease.lang.python.py4j.Py4jDebugTest)  Time elapsed: 0.445 s
suspendedState(org.eclipse.ease.lang.python.py4j.Py4jDebugTest)  Time elapsed: 0.306 s
primitiveDoubleVariable(org.eclipse.ease.lang.python.py4j.Py4jDebugTest)  Time elapsed: 0.407 s
resumeOnStackFrame(org.eclipse.ease.lang.python.py4j.Py4jDebugTest)  Time elapsed: 0.334 s
terminateDebugTargetInSuspendedState(org.eclipse.ease.lang.python.py4j.Py4jDebugTest)  Time elapsed: 0.206 s
disconnectStackFrameInSuspendedState(org.eclipse.ease.lang.python.py4j.Py4jDebugTest)  Time elapsed: 0.306 s
stepReturnOnProcess(org.eclipse.ease.lang.python.py4j.Py4jDebugTest)  Time elapsed: 0.407 s
evaluateWatchExpression(org.eclipse.ease.lang.python.py4j.Py4jDebugTest)  Time elapsed: 0.343 s
Running org.eclipse.ease.lang.python.py4j.Py4JPep302ModuleLoadingTest
org.eclipse.ease.ScriptExecutionException: Traceback (most recent call last):
  File "<...>", line 1, in <module>
  File "<...>", line 81, in load_module
ImportError: No EASE module named 'eclipse.test.notthere'

Tests run: 8, Failures: 0, Errors: 0, Skipped: 0, Time elapsed: 0.632 s - in org.eclipse.ease.lang.python.py4j.Py4JPep302ModuleLoadingTest
loadSimpleModule(org.eclipse.ease.lang.python.py4j.Py4JPep302ModuleLoadingTest)  Time elapsed: 0.088 s
loadModuleWithDependencies(org.eclipse.ease.lang.python.py4j.Py4JPep302ModuleLoadingTest)  Time elapsed: 0.079 s
accessAdvancedModule(org.eclipse.ease.lang.python.py4j.Py4JPep302ModuleLoadingTest)  Time elapsed: 0.081 s
importAs(org.eclipse.ease.lang.python.py4j.Py4JPep302ModuleLoadingTest)  Time elapsed: 0.077 s
fromBasicImportMethod(org.eclipse.ease.lang.python.py4j.Py4JPep302ModuleLoadingTest)  Time elapsed: 0.08 s
loadNotExistingModule(org.eclipse.ease.lang.python.py4j.Py4JPep302ModuleLoadingTest)  Time elapsed: 0.072 s
fromBasicImportAll(org.eclipse.ease.lang.python.py4j.Py4JPep302ModuleLoadingTest)  Time elapsed: 0.078 s
accessModule(org.eclipse.ease.lang.python.py4j.Py4JPep302ModuleLoadingTest)  Time elapsed: 0.077 s
Running org.eclipse.ease.lang.python.py4j.ScriptModeEngineTest
----------------------------------------------
Starting test: invalidSyntax(org.eclipse.ease.lang.python.py4j.ScriptModeEngineTest)
org.eclipse.ease.ScriptExecutionException: Traceback (most recent call last):
  File "/usr/lib64/python2.7/ast.py", line 37, in parse
    return compile(source, filename, mode, PyCF_ONLY_AST)
  File "<unknown>", line 1
    1++
      ^
SyntaxError: invalid syntax


Finished test: invalidSyntax(org.eclipse.ease.lang.python.py4j.ScriptModeEngineTest)
----------------------------------------------
----------------------------------------------
Starting test: getScriptEngine(org.eclipse.ease.lang.python.py4j.ScriptModeEngineTest)
2082088261
Finished test: getScriptEngine(org.eclipse.ease.lang.python.py4j.ScriptModeEngineTest)
----------------------------------------------
----------------------------------------------
Starting test: incompleteStatement(org.eclipse.ease.lang.python.py4j.ScriptModeEngineTest)
org.eclipse.ease.ScriptExecutionException: Traceback (most recent call last):
  File "/usr/lib64/python2.7/ast.py", line 37, in parse
    return compile(source, filename, mode, PyCF_ONLY_AST)
  File "<unknown>", line 1
    def a():
           ^
SyntaxError: unexpected EOF while parsing


Finished test: incompleteStatement(org.eclipse.ease.lang.python.py4j.ScriptModeEngineTest)
----------------------------------------------
----------------------------------------------
Starting test: multiLineStatement(org.eclipse.ease.lang.python.py4j.ScriptModeEngineTest)

Finished test: multiLineStatement(org.eclipse.ease.lang.python.py4j.ScriptModeEngineTest)
----------------------------------------------
----------------------------------------------
Starting test: runtimeError(org.eclipse.ease.lang.python.py4j.ScriptModeEngineTest)
org.eclipse.ease.ScriptExecutionException: Traceback (most recent call last):
  File "<...>", line 1, in <module>
NameError: name 'a' is not defined


Finished test: runtimeError(org.eclipse.ease.lang.python.py4j.ScriptModeEngineTest)
----------------------------------------------
----------------------------------------------
Starting test: javaIntArray(org.eclipse.ease.lang.python.py4j.ScriptModeEngineTest)

Finished test: javaIntArray(org.eclipse.ease.lang.python.py4j.ScriptModeEngineTest)
----------------------------------------------
----------------------------------------------
Starting test: javaDoubleArray(org.eclipse.ease.lang.python.py4j.ScriptModeEngineTest)

Finished test: javaDoubleArray(org.eclipse.ease.lang.python.py4j.ScriptModeEngineTest)
----------------------------------------------
----------------------------------------------
Starting test: pythonSet(org.eclipse.ease.lang.python.py4j.ScriptModeEngineTest)

Finished test: pythonSet(org.eclipse.ease.lang.python.py4j.ScriptModeEngineTest)
----------------------------------------------
----------------------------------------------
Starting test: javaStringArray(org.eclipse.ease.lang.python.py4j.ScriptModeEngineTest)

Finished test: javaStringArray(org.eclipse.ease.lang.python.py4j.ScriptModeEngineTest)
----------------------------------------------
----------------------------------------------
Starting test: javaShortArray(org.eclipse.ease.lang.python.py4j.ScriptModeEngineTest)

Finished test: javaShortArray(org.eclipse.ease.lang.python.py4j.ScriptModeEngineTest)
----------------------------------------------
----------------------------------------------
Starting test: javaBooleanArray(org.eclipse.ease.lang.python.py4j.ScriptModeEngineTest)

Finished test: javaBooleanArray(org.eclipse.ease.lang.python.py4j.ScriptModeEngineTest)
----------------------------------------------
----------------------------------------------
Starting test: javaObjectArray(org.eclipse.ease.lang.python.py4j.ScriptModeEngineTest)

Finished test: javaObjectArray(org.eclipse.ease.lang.python.py4j.ScriptModeEngineTest)
----------------------------------------------
----------------------------------------------
Starting test: javaIntegerArray(org.eclipse.ease.lang.python.py4j.ScriptModeEngineTest)

Finished test: javaIntegerArray(org.eclipse.ease.lang.python.py4j.ScriptModeEngineTest)
----------------------------------------------
----------------------------------------------
Starting test: javaInteger(org.eclipse.ease.lang.python.py4j.ScriptModeEngineTest)

Finished test: javaInteger(org.eclipse.ease.lang.python.py4j.ScriptModeEngineTest)
----------------------------------------------
----------------------------------------------
Starting test: javaString(org.eclipse.ease.lang.python.py4j.ScriptModeEngineTest)

Finished test: javaString(org.eclipse.ease.lang.python.py4j.ScriptModeEngineTest)
----------------------------------------------
----------------------------------------------
Starting test: javaByteArray(org.eclipse.ease.lang.python.py4j.ScriptModeEngineTest)

Finished test: javaByteArray(org.eclipse.ease.lang.python.py4j.ScriptModeEngineTest)
----------------------------------------------
----------------------------------------------
Starting test: createEclipseClass(org.eclipse.ease.lang.python.py4j.ScriptModeEngineTest)

Finished test: createEclipseClass(org.eclipse.ease.lang.python.py4j.ScriptModeEngineTest)
----------------------------------------------
----------------------------------------------
Starting test: pythonString(org.eclipse.ease.lang.python.py4j.ScriptModeEngineTest)

Finished test: pythonString(org.eclipse.ease.lang.python.py4j.ScriptModeEngineTest)
----------------------------------------------
----------------------------------------------
Starting test: varargs(org.eclipse.ease.lang.python.py4j.ScriptModeEngineTest)

Finished test: varargs(org.eclipse.ease.lang.python.py4j.ScriptModeEngineTest)
----------------------------------------------
----------------------------------------------
Starting test: createJavaType(org.eclipse.ease.lang.python.py4j.ScriptModeEngineTest)

Finished test: createJavaType(org.eclipse.ease.lang.python.py4j.ScriptModeEngineTest)
----------------------------------------------
----------------------------------------------
Starting test: javaFloatArray(org.eclipse.ease.lang.python.py4j.ScriptModeEngineTest)

Finished test: javaFloatArray(org.eclipse.ease.lang.python.py4j.ScriptModeEngineTest)
----------------------------------------------
----------------------------------------------
Starting test: implementJavaInterface(org.eclipse.ease.lang.python.py4j.ScriptModeEngineTest)

Finished test: implementJavaInterface(org.eclipse.ease.lang.python.py4j.ScriptModeEngineTest)
----------------------------------------------
----------------------------------------------
Starting test: pythonDict(org.eclipse.ease.lang.python.py4j.ScriptModeEngineTest)

Finished test: pythonDict(org.eclipse.ease.lang.python.py4j.ScriptModeEngineTest)
----------------------------------------------
----------------------------------------------
Starting test: pythonList(org.eclipse.ease.lang.python.py4j.ScriptModeEngineTest)

Finished test: pythonList(org.eclipse.ease.lang.python.py4j.ScriptModeEngineTest)
----------------------------------------------
----------------------------------------------
Starting test: testMultiple(org.eclipse.ease.lang.python.py4j.ScriptModeEngineTest)

Finished test: testMultiple(org.eclipse.ease.lang.python.py4j.ScriptModeEngineTest)
----------------------------------------------
----------------------------------------------
Starting test: javaLongArray(org.eclipse.ease.lang.python.py4j.ScriptModeEngineTest)

Finished test: javaLongArray(org.eclipse.ease.lang.python.py4j.ScriptModeEngineTest)
----------------------------------------------
----------------------------------------------
Starting test: createPythonObject(org.eclipse.ease.lang.python.py4j.ScriptModeEngineTest)

Finished test: createPythonObject(org.eclipse.ease.lang.python.py4j.ScriptModeEngineTest)
----------------------------------------------
----------------------------------------------
Starting test: pythonInteger(org.eclipse.ease.lang.python.py4j.ScriptModeEngineTest)

Finished test: pythonInteger(org.eclipse.ease.lang.python.py4j.ScriptModeEngineTest)
----------------------------------------------
Tests run: 30, Failures: 0, Errors: 0, Skipped: 2, Time elapsed: 7.244 s - in org.eclipse.ease.lang.python.py4j.ScriptModeEngineTest
invalidSyntax(org.eclipse.ease.lang.python.py4j.ScriptModeEngineTest)  Time elapsed: 0.223 s
getScriptEngine(org.eclipse.ease.lang.python.py4j.ScriptModeEngineTest)  Time elapsed: 1.223 s
callExit(org.eclipse.ease.lang.python.py4j.ScriptModeEngineTest) skipped
multiLinesOfCode(org.eclipse.ease.lang.python.py4j.ScriptModeEngineTest) skipped
incompleteStatement(org.eclipse.ease.lang.python.py4j.ScriptModeEngineTest)  Time elapsed: 0.221 s
multiLineStatement(org.eclipse.ease.lang.python.py4j.ScriptModeEngineTest)  Time elapsed: 0.222 s
runtimeError(org.eclipse.ease.lang.python.py4j.ScriptModeEngineTest)  Time elapsed: 0.216 s
javaIntArray(org.eclipse.ease.lang.python.py4j.ScriptModeEngineTest)  Time elapsed: 0.222 s
javaDoubleArray(org.eclipse.ease.lang.python.py4j.ScriptModeEngineTest)  Time elapsed: 0.219 s
pythonSet(org.eclipse.ease.lang.python.py4j.ScriptModeEngineTest)  Time elapsed: 0.222 s
javaStringArray(org.eclipse.ease.lang.python.py4j.ScriptModeEngineTest)  Time elapsed: 0.236 s
javaShortArray(org.eclipse.ease.lang.python.py4j.ScriptModeEngineTest)  Time elapsed: 0.229 s
javaBooleanArray(org.eclipse.ease.lang.python.py4j.ScriptModeEngineTest)  Time elapsed: 0.222 s
javaObjectArray(org.eclipse.ease.lang.python.py4j.ScriptModeEngineTest)  Time elapsed: 0.225 s
javaIntegerArray(org.eclipse.ease.lang.python.py4j.ScriptModeEngineTest)  Time elapsed: 0.222 s
javaInteger(org.eclipse.ease.lang.python.py4j.ScriptModeEngineTest)  Time elapsed: 0.222 s
javaString(org.eclipse.ease.lang.python.py4j.ScriptModeEngineTest)  Time elapsed: 0.219 s
javaByteArray(org.eclipse.ease.lang.python.py4j.ScriptModeEngineTest)  Time elapsed: 0.236 s
createEclipseClass(org.eclipse.ease.lang.python.py4j.ScriptModeEngineTest)  Time elapsed: 0.222 s
pythonString(org.eclipse.ease.lang.python.py4j.ScriptModeEngineTest)  Time elapsed: 0.226 s
varargs(org.eclipse.ease.lang.python.py4j.ScriptModeEngineTest)  Time elapsed: 0.219 s
createJavaType(org.eclipse.ease.lang.python.py4j.ScriptModeEngineTest)  Time elapsed: 0.222 s
javaFloatArray(org.eclipse.ease.lang.python.py4j.ScriptModeEngineTest)  Time elapsed: 0.219 s
implementJavaInterface(org.eclipse.ease.lang.python.py4j.ScriptModeEngineTest)  Time elapsed: 0.225 s
pythonDict(org.eclipse.ease.lang.python.py4j.ScriptModeEngineTest)  Time elapsed: 0.216 s
pythonList(org.eclipse.ease.lang.python.py4j.ScriptModeEngineTest)  Time elapsed: 0.226 s
testMultiple(org.eclipse.ease.lang.python.py4j.ScriptModeEngineTest)  Time elapsed: 0.229 s
javaLongArray(org.eclipse.ease.lang.python.py4j.ScriptModeEngineTest)  Time elapsed: 0.219 s
createPythonObject(org.eclipse.ease.lang.python.py4j.ScriptModeEngineTest)  Time elapsed: 0.219 s
pythonInteger(org.eclipse.ease.lang.python.py4j.ScriptModeEngineTest)  Time elapsed: 0.218 s
Running org.eclipse.ease.lang.python.py4j.StartStopTest
----------------------------------------------
Starting test: startStop(org.eclipse.ease.lang.python.py4j.StartStopTest)

Finished test: startStop(org.eclipse.ease.lang.python.py4j.StartStopTest)
----------------------------------------------
----------------------------------------------
Starting test: startStopShellNoBootstrap(org.eclipse.ease.lang.python.py4j.StartStopTest)

Finished test: startStopShellNoBootstrap(org.eclipse.ease.lang.python.py4j.StartStopTest)
----------------------------------------------
----------------------------------------------
Starting test: multiStartStop(org.eclipse.ease.lang.python.py4j.StartStopTest)

Finished test: multiStartStop(org.eclipse.ease.lang.python.py4j.StartStopTest)
----------------------------------------------
Tests run: 3, Failures: 0, Errors: 0, Skipped: 0, Time elapsed: 0.606 s - in org.eclipse.ease.lang.python.py4j.StartStopTest
startStop(org.eclipse.ease.lang.python.py4j.StartStopTest)  Time elapsed: 0.202 s
startStopShellNoBootstrap(org.eclipse.ease.lang.python.py4j.StartStopTest)  Time elapsed: 0.201 s
multiStartStop(org.eclipse.ease.lang.python.py4j.StartStopTest)  Time elapsed: 0.201 s

Results:

Tests run: 120, Failures: 0, Errors: 0, Skipped: 13

[INFO] All tests passed!
[INFO] 
[INFO] --- maven-install-plugin:2.3.1:install (default-install) @ org.eclipse.ease.lang.python.py4j.test ---
[INFO] Installing /home/jenkins/agent/workspace/ease.verify.core.target.2019-03/tests/org.eclipse.ease.lang.python.py4j.test/target/org.eclipse.ease.lang.python.py4j.test-0.8.0-SNAPSHOT.jar to /home/jenkins/.m2/repository/org/eclipse/ease/org.eclipse.ease.lang.python.py4j.test/0.8.0-SNAPSHOT/org.eclipse.ease.lang.python.py4j.test-0.8.0-SNAPSHOT.jar
[INFO] Installing /home/jenkins/agent/workspace/ease.verify.core.target.2019-03/tests/org.eclipse.ease.lang.python.py4j.test/pom.xml to /home/jenkins/.m2/repository/org/eclipse/ease/org.eclipse.ease.lang.python.py4j.test/0.8.0-SNAPSHOT/org.eclipse.ease.lang.python.py4j.test-0.8.0-SNAPSHOT.pom
[INFO] Installing /home/jenkins/agent/workspace/ease.verify.core.target.2019-03/tests/org.eclipse.ease.lang.python.py4j.test/target/org.eclipse.ease.lang.python.py4j.test-0.8.0-SNAPSHOT-sources.jar to /home/jenkins/.m2/repository/org/eclipse/ease/org.eclipse.ease.lang.python.py4j.test/0.8.0-SNAPSHOT/org.eclipse.ease.lang.python.py4j.test-0.8.0-SNAPSHOT-sources.jar
[INFO] Installing /home/jenkins/agent/workspace/ease.verify.core.target.2019-03/tests/org.eclipse.ease.lang.python.py4j.test/target/p2content.xml to /home/jenkins/.m2/repository/org/eclipse/ease/org.eclipse.ease.lang.python.py4j.test/0.8.0-SNAPSHOT/org.eclipse.ease.lang.python.py4j.test-0.8.0-SNAPSHOT-p2metadata.xml
[INFO] Installing /home/jenkins/agent/workspace/ease.verify.core.target.2019-03/tests/org.eclipse.ease.lang.python.py4j.test/target/p2artifacts.xml to /home/jenkins/.m2/repository/org/eclipse/ease/org.eclipse.ease.lang.python.py4j.test/0.8.0-SNAPSHOT/org.eclipse.ease.lang.python.py4j.test-0.8.0-SNAPSHOT-p2artifacts.xml
[INFO] Installing /home/jenkins/agent/workspace/ease.verify.core.target.2019-03/tests/org.eclipse.ease.lang.python.py4j.test/target/p2content.xml to /home/jenkins/.m2/repository/org/eclipse/ease/org.eclipse.ease.lang.python.py4j.test/0.8.0-SNAPSHOT/org.eclipse.ease.lang.python.py4j.test-0.8.0-SNAPSHOT-p2metadata.xml
[INFO] Installing /home/jenkins/agent/workspace/ease.verify.core.target.2019-03/tests/org.eclipse.ease.lang.python.py4j.test/target/p2artifacts.xml to /home/jenkins/.m2/repository/org/eclipse/ease/org.eclipse.ease.lang.python.py4j.test/0.8.0-SNAPSHOT/org.eclipse.ease.lang.python.py4j.test-0.8.0-SNAPSHOT-p2artifacts.xml
[INFO] 
[INFO] --- tycho-p2-plugin:1.3.0:update-local-index (default-update-local-index) @ org.eclipse.ease.lang.python.py4j.test ---
[INFO] 
[INFO] -----< org.eclipse.ease:org.eclipse.ease.lang.scriptarchive.test >------
[INFO] Building org.eclipse.ease.lang.scriptarchive.test 0.8.0-SNAPSHOT [45/48]
[INFO] ------------------------[ eclipse-test-plugin ]-------------------------
[INFO] 
[INFO] --- maven-clean-plugin:2.5:clean (default-clean) @ org.eclipse.ease.lang.scriptarchive.test ---
[INFO] 
[INFO] --- tycho-packaging-plugin:1.3.0:build-qualifier (default-build-qualifier) @ org.eclipse.ease.lang.scriptarchive.test ---
[INFO] The project's OSGi version is 0.8.0.I201910171213
[INFO] 
[INFO] --- tycho-packaging-plugin:1.3.0:validate-id (default-validate-id) @ org.eclipse.ease.lang.scriptarchive.test ---
[INFO] 
[INFO] --- tycho-packaging-plugin:1.3.0:validate-version (default-validate-version) @ org.eclipse.ease.lang.scriptarchive.test ---
[INFO] 
[INFO] >>> maven-javadoc-plugin:2.9.1:javadoc (build-docs) > generate-sources @ org.eclipse.ease.lang.scriptarchive.test >>>
[INFO] 
[INFO] --- tycho-packaging-plugin:1.3.0:build-qualifier (default-build-qualifier) @ org.eclipse.ease.lang.scriptarchive.test ---
[INFO] The project's OSGi version is 0.8.0.I201910171213
[INFO] 
[INFO] --- tycho-packaging-plugin:1.3.0:validate-id (default-validate-id) @ org.eclipse.ease.lang.scriptarchive.test ---
[INFO] 
[INFO] --- tycho-packaging-plugin:1.3.0:validate-version (default-validate-version) @ org.eclipse.ease.lang.scriptarchive.test ---
[INFO] 
[INFO] <<< maven-javadoc-plugin:2.9.1:javadoc (build-docs) < generate-sources @ org.eclipse.ease.lang.scriptarchive.test <<<
[INFO] 
[INFO] 
[INFO] --- maven-javadoc-plugin:2.9.1:javadoc (build-docs) @ org.eclipse.ease.lang.scriptarchive.test ---
[ERROR] Error fetching link: http://help.eclipse.org/oxygen/topic/org.eclipse.platform.doc.isv/reference/api/package-list. Ignored it.
[INFO] 
Loading source files for package org.eclipse.ease.lang.scriptarchive...
Constructing Javadoc information...
WARNING: Cannot open location "/home/jenkins/agent/workspace/ease.verify.core.target.2019-03/tests/org.eclipse.ease.lang.scriptarchive.test/target/javadoc-bundle-options/package-list"
No plugin definition found, skipping
No plugin definition found, skipping
[WARNING] Javadoc Warnings
[WARNING] Picked up JAVA_TOOL_OPTIONS: -XX:+IgnoreUnrecognizedVMOptions -XX:+UseContainerSupport -XX:+UnlockExperimentalVMOptions -XX:+UseCGroupMemoryLimitForHeap -Dmaven.ext.class.path="/home/jenkins/agent/workspace/ease.verify.core.target.2019-03@tmp/withMavenf4fc2e11/pipeline-maven-spy.jar" -Dorg.jenkinsci.plugins.pipeline.maven.reportsFolder="/home/jenkins/agent/workspace/ease.verify.core.target.2019-03@tmp/withMavenf4fc2e11"
[WARNING] Picked up _JAVA_OPTIONS: -XX:MaxRAMPercentage=64.0
[INFO] 
[INFO] --- build-helper-maven-plugin:1.9.1:add-resource (add_help) @ org.eclipse.ease.lang.scriptarchive.test ---
[INFO] 
[INFO] --- maven-resources-plugin:2.4.3:resources (default-resources) @ org.eclipse.ease.lang.scriptarchive.test ---
[INFO] Using 'UTF-8' encoding to copy filtered resources.
[INFO] skip non existing resourceDirectory /home/jenkins/agent/workspace/ease.verify.core.target.2019-03/tests/org.eclipse.ease.lang.scriptarchive.test/src/main/resources
[INFO] skip non existing resourceDirectory /home/jenkins/agent/workspace/ease.verify.core.target.2019-03/tests/org.eclipse.ease.lang.scriptarchive.test/help
[INFO] 
[INFO] --- tycho-compiler-plugin:1.3.0:compile (default-compile) @ org.eclipse.ease.lang.scriptarchive.test ---
[INFO] Compiling 1 source file to /home/jenkins/agent/workspace/ease.verify.core.target.2019-03/tests/org.eclipse.ease.lang.scriptarchive.test/target/classes
[INFO] 
[INFO] --- maven-resources-plugin:2.4.3:testResources (default-testResources) @ org.eclipse.ease.lang.scriptarchive.test ---
[INFO] Using 'UTF-8' encoding to copy filtered resources.
[INFO] skip non existing resourceDirectory /home/jenkins/agent/workspace/ease.verify.core.target.2019-03/tests/org.eclipse.ease.lang.scriptarchive.test/src/test/resources
[INFO] 
[INFO] --- tycho-source-plugin:1.3.0:plugin-source (plugin-source) @ org.eclipse.ease.lang.scriptarchive.test ---
[INFO] Building jar: /home/jenkins/agent/workspace/ease.verify.core.target.2019-03/tests/org.eclipse.ease.lang.scriptarchive.test/target/org.eclipse.ease.lang.scriptarchive.test-0.8.0-SNAPSHOT-sources.jar
[INFO] 
[INFO] --- target-platform-configuration:1.3.0:target-platform (default-target-platform) @ org.eclipse.ease.lang.scriptarchive.test ---
[INFO] 
[INFO] --- tycho-packaging-plugin:1.3.0:package-plugin (default-package-plugin) @ org.eclipse.ease.lang.scriptarchive.test ---
[INFO] Building jar: /home/jenkins/agent/workspace/ease.verify.core.target.2019-03/tests/org.eclipse.ease.lang.scriptarchive.test/target/org.eclipse.ease.lang.scriptarchive.test-0.8.0-SNAPSHOT.jar
[INFO] 
[INFO] --- tycho-p2-plugin:1.3.0:p2-metadata-default (default-p2-metadata-default) @ org.eclipse.ease.lang.scriptarchive.test ---
[INFO] 
[INFO] --- tycho-source-feature-plugin:1.3.0:source-feature (source-feature) @ org.eclipse.ease.lang.scriptarchive.test ---
[INFO] 
[INFO] --- tycho-p2-plugin:1.3.0:p2-metadata (attached-p2-metadata) @ org.eclipse.ease.lang.scriptarchive.test ---
[INFO] 
[INFO] --- tycho-surefire-plugin:1.3.0:test (default-test) @ org.eclipse.ease.lang.scriptarchive.test ---
[INFO] Expected eclipse log file: /home/jenkins/agent/workspace/ease.verify.core.target.2019-03/tests/org.eclipse.ease.lang.scriptarchive.test/target/work/data/.metadata/.log
[INFO] Command line:
	[/opt/tools/java/oracle/jdk-8/1.8.0_202/jre/bin/java, -Dosgi.noShutdown=false, -Dosgi.os=linux, -Dosgi.ws=gtk, -Dosgi.arch=x86_64, -Dosgi.clean=true, -jar, /home/jenkins/.m2/repository/p2/osgi/bundle/org.eclipse.equinox.launcher/1.5.700.v20200207-2156/org.eclipse.equinox.launcher-1.5.700.v20200207-2156.jar, -data, /home/jenkins/agent/workspace/ease.verify.core.target.2019-03/tests/org.eclipse.ease.lang.scriptarchive.test/target/work/data, -install, /home/jenkins/agent/workspace/ease.verify.core.target.2019-03/tests/org.eclipse.ease.lang.scriptarchive.test/target/work, -configuration, /home/jenkins/agent/workspace/ease.verify.core.target.2019-03/tests/org.eclipse.ease.lang.scriptarchive.test/target/work/configuration, -application, org.eclipse.tycho.surefire.osgibooter.headlesstest, -testproperties, /home/jenkins/agent/workspace/ease.verify.core.target.2019-03/tests/org.eclipse.ease.lang.scriptarchive.test/target/surefire.properties]
Picked up JAVA_TOOL_OPTIONS: -XX:+IgnoreUnrecognizedVMOptions -XX:+UseContainerSupport -XX:+UnlockExperimentalVMOptions -XX:+UseCGroupMemoryLimitForHeap -Dmaven.ext.class.path="/home/jenkins/agent/workspace/ease.verify.core.target.2019-03@tmp/withMavenf4fc2e11/pipeline-maven-spy.jar" -Dorg.jenkinsci.plugins.pipeline.maven.reportsFolder="/home/jenkins/agent/workspace/ease.verify.core.target.2019-03@tmp/withMavenf4fc2e11" 
Picked up _JAVA_OPTIONS: -XX:MaxRAMPercentage=64.0
Running org.eclipse.ease.lang.scriptarchive.ArchiveEngineTest
We are running from a zip file!
org.eclipse.ease.ScriptExecutionException: SyntaxError: missing ; before statement (workspace://__EASE_ScriptArchive_1/scripts/Master.js#3)
this is an error
       ^
	at Master.js,workspace://__EASE_ScriptArchive_1/scripts/Master.js
org.eclipse.ease.ScriptExecutionException: SyntaxError: missing ; before statement (workspace://__EASE_ScriptArchive_1/scripts/Master.js#3)
this is an error
       ^
	at Master.js,workspace://__EASE_ScriptArchive_1/scripts/Master.js
Tests run: 7, Failures: 0, Errors: 0, Skipped: 0, Time elapsed: 0.624 s - in org.eclipse.ease.lang.scriptarchive.ArchiveEngineTest
executeWithManifest(org.eclipse.ease.lang.scriptarchive.ArchiveEngineTest)  Time elapsed: 0.489 s
zipFileRegistration(org.eclipse.ease.lang.scriptarchive.ArchiveEngineTest)  Time elapsed: 0.008 s
engineIdRegistration(org.eclipse.ease.lang.scriptarchive.ArchiveEngineTest)  Time elapsed: 0.001 s
jarFileRegistration(org.eclipse.ease.lang.scriptarchive.ArchiveEngineTest)  Time elapsed: 0 s
sarFileRegistration(org.eclipse.ease.lang.scriptarchive.ArchiveEngineTest)  Time elapsed: 0 s
executeWithErrors(org.eclipse.ease.lang.scriptarchive.ArchiveEngineTest)  Time elapsed: 0.067 s
executeWithIncludes(org.eclipse.ease.lang.scriptarchive.ArchiveEngineTest)  Time elapsed: 0.038 s

Results:

Tests run: 7, Failures: 0, Errors: 0, Skipped: 0

[INFO] All tests passed!
[INFO] 
[INFO] --- maven-install-plugin:2.3.1:install (default-install) @ org.eclipse.ease.lang.scriptarchive.test ---
[INFO] Installing /home/jenkins/agent/workspace/ease.verify.core.target.2019-03/tests/org.eclipse.ease.lang.scriptarchive.test/target/org.eclipse.ease.lang.scriptarchive.test-0.8.0-SNAPSHOT.jar to /home/jenkins/.m2/repository/org/eclipse/ease/org.eclipse.ease.lang.scriptarchive.test/0.8.0-SNAPSHOT/org.eclipse.ease.lang.scriptarchive.test-0.8.0-SNAPSHOT.jar
[INFO] Installing /home/jenkins/agent/workspace/ease.verify.core.target.2019-03/tests/org.eclipse.ease.lang.scriptarchive.test/pom.xml to /home/jenkins/.m2/repository/org/eclipse/ease/org.eclipse.ease.lang.scriptarchive.test/0.8.0-SNAPSHOT/org.eclipse.ease.lang.scriptarchive.test-0.8.0-SNAPSHOT.pom
[INFO] Installing /home/jenkins/agent/workspace/ease.verify.core.target.2019-03/tests/org.eclipse.ease.lang.scriptarchive.test/target/org.eclipse.ease.lang.scriptarchive.test-0.8.0-SNAPSHOT-sources.jar to /home/jenkins/.m2/repository/org/eclipse/ease/org.eclipse.ease.lang.scriptarchive.test/0.8.0-SNAPSHOT/org.eclipse.ease.lang.scriptarchive.test-0.8.0-SNAPSHOT-sources.jar
[INFO] Installing /home/jenkins/agent/workspace/ease.verify.core.target.2019-03/tests/org.eclipse.ease.lang.scriptarchive.test/target/p2content.xml to /home/jenkins/.m2/repository/org/eclipse/ease/org.eclipse.ease.lang.scriptarchive.test/0.8.0-SNAPSHOT/org.eclipse.ease.lang.scriptarchive.test-0.8.0-SNAPSHOT-p2metadata.xml
[INFO] Installing /home/jenkins/agent/workspace/ease.verify.core.target.2019-03/tests/org.eclipse.ease.lang.scriptarchive.test/target/p2artifacts.xml to /home/jenkins/.m2/repository/org/eclipse/ease/org.eclipse.ease.lang.scriptarchive.test/0.8.0-SNAPSHOT/org.eclipse.ease.lang.scriptarchive.test-0.8.0-SNAPSHOT-p2artifacts.xml
[INFO] Installing /home/jenkins/agent/workspace/ease.verify.core.target.2019-03/tests/org.eclipse.ease.lang.scriptarchive.test/target/p2content.xml to /home/jenkins/.m2/repository/org/eclipse/ease/org.eclipse.ease.lang.scriptarchive.test/0.8.0-SNAPSHOT/org.eclipse.ease.lang.scriptarchive.test-0.8.0-SNAPSHOT-p2metadata.xml
[INFO] Installing /home/jenkins/agent/workspace/ease.verify.core.target.2019-03/tests/org.eclipse.ease.lang.scriptarchive.test/target/p2artifacts.xml to /home/jenkins/.m2/repository/org/eclipse/ease/org.eclipse.ease.lang.scriptarchive.test/0.8.0-SNAPSHOT/org.eclipse.ease.lang.scriptarchive.test-0.8.0-SNAPSHOT-p2artifacts.xml
[INFO] 
[INFO] --- tycho-p2-plugin:1.3.0:update-local-index (default-update-local-index) @ org.eclipse.ease.lang.scriptarchive.test ---
[INFO] 
[INFO] --------< org.eclipse.ease:org.eclipse.ease.lang.unittest.test >--------
[INFO] Building org.eclipse.ease.lang.unittest.test 0.8.0-SNAPSHOT      [46/48]
[INFO] ------------------------[ eclipse-test-plugin ]-------------------------
[INFO] 
[INFO] --- maven-clean-plugin:2.5:clean (default-clean) @ org.eclipse.ease.lang.unittest.test ---
[INFO] 
[INFO] --- tycho-packaging-plugin:1.3.0:build-qualifier (default-build-qualifier) @ org.eclipse.ease.lang.unittest.test ---
[INFO] The project's OSGi version is 0.8.0.I201908141044
[INFO] 
[INFO] --- tycho-packaging-plugin:1.3.0:validate-id (default-validate-id) @ org.eclipse.ease.lang.unittest.test ---
[INFO] 
[INFO] --- tycho-packaging-plugin:1.3.0:validate-version (default-validate-version) @ org.eclipse.ease.lang.unittest.test ---
[INFO] 
[INFO] >>> maven-javadoc-plugin:2.9.1:javadoc (build-docs) > generate-sources @ org.eclipse.ease.lang.unittest.test >>>
[INFO] 
[INFO] --- tycho-packaging-plugin:1.3.0:build-qualifier (default-build-qualifier) @ org.eclipse.ease.lang.unittest.test ---
[INFO] The project's OSGi version is 0.8.0.I201908141044
[INFO] 
[INFO] --- tycho-packaging-plugin:1.3.0:validate-id (default-validate-id) @ org.eclipse.ease.lang.unittest.test ---
[INFO] 
[INFO] --- tycho-packaging-plugin:1.3.0:validate-version (default-validate-version) @ org.eclipse.ease.lang.unittest.test ---
[INFO] 
[INFO] <<< maven-javadoc-plugin:2.9.1:javadoc (build-docs) < generate-sources @ org.eclipse.ease.lang.unittest.test <<<
[INFO] 
[INFO] 
[INFO] --- maven-javadoc-plugin:2.9.1:javadoc (build-docs) @ org.eclipse.ease.lang.unittest.test ---
[ERROR] Error fetching link: http://help.eclipse.org/oxygen/topic/org.eclipse.platform.doc.isv/reference/api/package-list. Ignored it.
[INFO] 
Loading source files for package org.eclipse.ease.lang.unittest...
Constructing Javadoc information...
WARNING: Cannot open location "/home/jenkins/agent/workspace/ease.verify.core.target.2019-03/tests/org.eclipse.ease.lang.unittest.test/target/javadoc-bundle-options/package-list"
No plugin definition found, skipping
No plugin definition found, skipping
[WARNING] Javadoc Warnings
[WARNING] Picked up JAVA_TOOL_OPTIONS: -XX:+IgnoreUnrecognizedVMOptions -XX:+UseContainerSupport -XX:+UnlockExperimentalVMOptions -XX:+UseCGroupMemoryLimitForHeap -Dmaven.ext.class.path="/home/jenkins/agent/workspace/ease.verify.core.target.2019-03@tmp/withMavenf4fc2e11/pipeline-maven-spy.jar" -Dorg.jenkinsci.plugins.pipeline.maven.reportsFolder="/home/jenkins/agent/workspace/ease.verify.core.target.2019-03@tmp/withMavenf4fc2e11"
[WARNING] Picked up _JAVA_OPTIONS: -XX:MaxRAMPercentage=64.0
[INFO] 
[INFO] --- build-helper-maven-plugin:1.9.1:add-resource (add_help) @ org.eclipse.ease.lang.unittest.test ---
[INFO] 
[INFO] --- maven-resources-plugin:2.4.3:resources (default-resources) @ org.eclipse.ease.lang.unittest.test ---
[INFO] Using 'UTF-8' encoding to copy filtered resources.
[INFO] skip non existing resourceDirectory /home/jenkins/agent/workspace/ease.verify.core.target.2019-03/tests/org.eclipse.ease.lang.unittest.test/src/main/resources
[INFO] skip non existing resourceDirectory /home/jenkins/agent/workspace/ease.verify.core.target.2019-03/tests/org.eclipse.ease.lang.unittest.test/help
[INFO] 
[INFO] --- tycho-compiler-plugin:1.3.0:compile (default-compile) @ org.eclipse.ease.lang.unittest.test ---
[INFO] Compiling 3 source files to /home/jenkins/agent/workspace/ease.verify.core.target.2019-03/tests/org.eclipse.ease.lang.unittest.test/target/classes
[INFO] 
[INFO] --- maven-resources-plugin:2.4.3:testResources (default-testResources) @ org.eclipse.ease.lang.unittest.test ---
[INFO] Using 'UTF-8' encoding to copy filtered resources.
[INFO] skip non existing resourceDirectory /home/jenkins/agent/workspace/ease.verify.core.target.2019-03/tests/org.eclipse.ease.lang.unittest.test/src/test/resources
[INFO] 
[INFO] --- tycho-source-plugin:1.3.0:plugin-source (plugin-source) @ org.eclipse.ease.lang.unittest.test ---
[WARNING] Bundle-Name header not found in /home/jenkins/agent/workspace/ease.verify.core.target.2019-03/tests/org.eclipse.ease.lang.unittest.test/META-INF/MANIFEST.MF, fallback to Bundle-SymbolicName for source bundle
[WARNING] Bundle-Vendor header not found in /home/jenkins/agent/workspace/ease.verify.core.target.2019-03/tests/org.eclipse.ease.lang.unittest.test/META-INF/MANIFEST.MF, fallback to 'unknown' for source bundle
[INFO] Building jar: /home/jenkins/agent/workspace/ease.verify.core.target.2019-03/tests/org.eclipse.ease.lang.unittest.test/target/org.eclipse.ease.lang.unittest.test-0.8.0-SNAPSHOT-sources.jar
[INFO] 
[INFO] --- target-platform-configuration:1.3.0:target-platform (default-target-platform) @ org.eclipse.ease.lang.unittest.test ---
[INFO] 
[INFO] --- tycho-packaging-plugin:1.3.0:package-plugin (default-package-plugin) @ org.eclipse.ease.lang.unittest.test ---
[INFO] Building jar: /home/jenkins/agent/workspace/ease.verify.core.target.2019-03/tests/org.eclipse.ease.lang.unittest.test/target/org.eclipse.ease.lang.unittest.test-0.8.0-SNAPSHOT.jar
[INFO] 
[INFO] --- tycho-p2-plugin:1.3.0:p2-metadata-default (default-p2-metadata-default) @ org.eclipse.ease.lang.unittest.test ---
[INFO] 
[INFO] --- tycho-source-feature-plugin:1.3.0:source-feature (source-feature) @ org.eclipse.ease.lang.unittest.test ---
[INFO] 
[INFO] --- tycho-p2-plugin:1.3.0:p2-metadata (attached-p2-metadata) @ org.eclipse.ease.lang.unittest.test ---
[INFO] 
[INFO] --- tycho-surefire-plugin:1.3.0:test (default-test) @ org.eclipse.ease.lang.unittest.test ---
[INFO] Expected eclipse log file: /home/jenkins/agent/workspace/ease.verify.core.target.2019-03/tests/org.eclipse.ease.lang.unittest.test/target/work/data/.metadata/.log
[INFO] Command line:
	[/opt/tools/java/oracle/jdk-8/1.8.0_202/jre/bin/java, -Dosgi.noShutdown=false, -Dosgi.os=linux, -Dosgi.ws=gtk, -Dosgi.arch=x86_64, -Dosgi.clean=true, -jar, /home/jenkins/.m2/repository/p2/osgi/bundle/org.eclipse.equinox.launcher/1.5.700.v20200207-2156/org.eclipse.equinox.launcher-1.5.700.v20200207-2156.jar, -data, /home/jenkins/agent/workspace/ease.verify.core.target.2019-03/tests/org.eclipse.ease.lang.unittest.test/target/work/data, -install, /home/jenkins/agent/workspace/ease.verify.core.target.2019-03/tests/org.eclipse.ease.lang.unittest.test/target/work, -configuration, /home/jenkins/agent/workspace/ease.verify.core.target.2019-03/tests/org.eclipse.ease.lang.unittest.test/target/work/configuration, -application, org.eclipse.tycho.surefire.osgibooter.headlesstest, -testproperties, /home/jenkins/agent/workspace/ease.verify.core.target.2019-03/tests/org.eclipse.ease.lang.unittest.test/target/surefire.properties]
Picked up JAVA_TOOL_OPTIONS: -XX:+IgnoreUnrecognizedVMOptions -XX:+UseContainerSupport -XX:+UnlockExperimentalVMOptions -XX:+UseCGroupMemoryLimitForHeap -Dmaven.ext.class.path="/home/jenkins/agent/workspace/ease.verify.core.target.2019-03@tmp/withMavenf4fc2e11/pipeline-maven-spy.jar" -Dorg.jenkinsci.plugins.pipeline.maven.reportsFolder="/home/jenkins/agent/workspace/ease.verify.core.target.2019-03@tmp/withMavenf4fc2e11" 
Picked up _JAVA_OPTIONS: -XX:MaxRAMPercentage=64.0
Running org.eclipse.ease.lang.unittest.ClassicJavaScriptTest
Tests run: 7, Failures: 0, Errors: 0, Skipped: 0, Time elapsed: 1.465 s - in org.eclipse.ease.lang.unittest.ClassicJavaScriptTest
folderStatus(org.eclipse.ease.lang.unittest.ClassicJavaScriptTest)  Time elapsed: 0.619 s
errorTestStatus(org.eclipse.ease.lang.unittest.ClassicJavaScriptTest)  Time elapsed: 0.181 s
failureTestStatus(org.eclipse.ease.lang.unittest.ClassicJavaScriptTest)  Time elapsed: 0.112 s
verifyOutput(org.eclipse.ease.lang.unittest.ClassicJavaScriptTest)  Time elapsed: 0.147 s
suiteStatus(org.eclipse.ease.lang.unittest.ClassicJavaScriptTest)  Time elapsed: 0.084 s
ignoreTestStatus(org.eclipse.ease.lang.unittest.ClassicJavaScriptTest)  Time elapsed: 0.113 s
passTestStatus(org.eclipse.ease.lang.unittest.ClassicJavaScriptTest)  Time elapsed: 0.103 s
Running org.eclipse.ease.lang.unittest.ModernJavaScriptTest
Tests run: 8, Failures: 0, Errors: 0, Skipped: 0, Time elapsed: 0.886 s - in org.eclipse.ease.lang.unittest.ModernJavaScriptTest
folderStatus(org.eclipse.ease.lang.unittest.ModernJavaScriptTest)  Time elapsed: 0.153 s
verifyOutput(org.eclipse.ease.lang.unittest.ModernJavaScriptTest)  Time elapsed: 0.104 s
suiteStatus(org.eclipse.ease.lang.unittest.ModernJavaScriptTest)  Time elapsed: 0.106 s
ignoreTestStatus(org.eclipse.ease.lang.unittest.ModernJavaScriptTest)  Time elapsed: 0.128 s
ignoreTestClassStatus(org.eclipse.ease.lang.unittest.ModernJavaScriptTest)  Time elapsed: 0.093 s
failureTestClassStatus(org.eclipse.ease.lang.unittest.ModernJavaScriptTest)  Time elapsed: 0.1 s
errorTestClassStatus(org.eclipse.ease.lang.unittest.ModernJavaScriptTest)  Time elapsed: 0.078 s
passTestClassStatus(org.eclipse.ease.lang.unittest.ModernJavaScriptTest)  Time elapsed: 0.122 s

Results:

Tests run: 15, Failures: 0, Errors: 0, Skipped: 0

[INFO] All tests passed!
[INFO] 
[INFO] --- maven-install-plugin:2.3.1:install (default-install) @ org.eclipse.ease.lang.unittest.test ---
[INFO] Installing /home/jenkins/agent/workspace/ease.verify.core.target.2019-03/tests/org.eclipse.ease.lang.unittest.test/target/org.eclipse.ease.lang.unittest.test-0.8.0-SNAPSHOT.jar to /home/jenkins/.m2/repository/org/eclipse/ease/org.eclipse.ease.lang.unittest.test/0.8.0-SNAPSHOT/org.eclipse.ease.lang.unittest.test-0.8.0-SNAPSHOT.jar
[INFO] Installing /home/jenkins/agent/workspace/ease.verify.core.target.2019-03/tests/org.eclipse.ease.lang.unittest.test/pom.xml to /home/jenkins/.m2/repository/org/eclipse/ease/org.eclipse.ease.lang.unittest.test/0.8.0-SNAPSHOT/org.eclipse.ease.lang.unittest.test-0.8.0-SNAPSHOT.pom
[INFO] Installing /home/jenkins/agent/workspace/ease.verify.core.target.2019-03/tests/org.eclipse.ease.lang.unittest.test/target/org.eclipse.ease.lang.unittest.test-0.8.0-SNAPSHOT-sources.jar to /home/jenkins/.m2/repository/org/eclipse/ease/org.eclipse.ease.lang.unittest.test/0.8.0-SNAPSHOT/org.eclipse.ease.lang.unittest.test-0.8.0-SNAPSHOT-sources.jar
[INFO] Installing /home/jenkins/agent/workspace/ease.verify.core.target.2019-03/tests/org.eclipse.ease.lang.unittest.test/target/p2content.xml to /home/jenkins/.m2/repository/org/eclipse/ease/org.eclipse.ease.lang.unittest.test/0.8.0-SNAPSHOT/org.eclipse.ease.lang.unittest.test-0.8.0-SNAPSHOT-p2metadata.xml
[INFO] Installing /home/jenkins/agent/workspace/ease.verify.core.target.2019-03/tests/org.eclipse.ease.lang.unittest.test/target/p2artifacts.xml to /home/jenkins/.m2/repository/org/eclipse/ease/org.eclipse.ease.lang.unittest.test/0.8.0-SNAPSHOT/org.eclipse.ease.lang.unittest.test-0.8.0-SNAPSHOT-p2artifacts.xml
[INFO] Installing /home/jenkins/agent/workspace/ease.verify.core.target.2019-03/tests/org.eclipse.ease.lang.unittest.test/target/p2content.xml to /home/jenkins/.m2/repository/org/eclipse/ease/org.eclipse.ease.lang.unittest.test/0.8.0-SNAPSHOT/org.eclipse.ease.lang.unittest.test-0.8.0-SNAPSHOT-p2metadata.xml
[INFO] Installing /home/jenkins/agent/workspace/ease.verify.core.target.2019-03/tests/org.eclipse.ease.lang.unittest.test/target/p2artifacts.xml to /home/jenkins/.m2/repository/org/eclipse/ease/org.eclipse.ease.lang.unittest.test/0.8.0-SNAPSHOT/org.eclipse.ease.lang.unittest.test-0.8.0-SNAPSHOT-p2artifacts.xml
[INFO] 
[INFO] --- tycho-p2-plugin:1.3.0:update-local-index (default-update-local-index) @ org.eclipse.ease.lang.unittest.test ---
[INFO] 
[INFO] -------------< org.eclipse.ease:org.eclipse.ease.ui.test >--------------
[INFO] Building org.eclipse.ease.ui.test 0.8.0-SNAPSHOT                 [47/48]
[INFO] ------------------------[ eclipse-test-plugin ]-------------------------
[INFO] 
[INFO] --- maven-clean-plugin:2.5:clean (default-clean) @ org.eclipse.ease.ui.test ---
[INFO] 
[INFO] --- tycho-packaging-plugin:1.3.0:build-qualifier (default-build-qualifier) @ org.eclipse.ease.ui.test ---
[INFO] The project's OSGi version is 0.8.0.I201910171213
[INFO] 
[INFO] --- tycho-packaging-plugin:1.3.0:validate-id (default-validate-id) @ org.eclipse.ease.ui.test ---
[INFO] 
[INFO] --- tycho-packaging-plugin:1.3.0:validate-version (default-validate-version) @ org.eclipse.ease.ui.test ---
[INFO] 
[INFO] >>> maven-javadoc-plugin:2.9.1:javadoc (build-docs) > generate-sources @ org.eclipse.ease.ui.test >>>
[INFO] 
[INFO] --- tycho-packaging-plugin:1.3.0:build-qualifier (default-build-qualifier) @ org.eclipse.ease.ui.test ---
[INFO] The project's OSGi version is 0.8.0.I201910171213
[INFO] 
[INFO] --- tycho-packaging-plugin:1.3.0:validate-id (default-validate-id) @ org.eclipse.ease.ui.test ---
[INFO] 
[INFO] --- tycho-packaging-plugin:1.3.0:validate-version (default-validate-version) @ org.eclipse.ease.ui.test ---
[INFO] 
[INFO] <<< maven-javadoc-plugin:2.9.1:javadoc (build-docs) < generate-sources @ org.eclipse.ease.ui.test <<<
[INFO] 
[INFO] 
[INFO] --- maven-javadoc-plugin:2.9.1:javadoc (build-docs) @ org.eclipse.ease.ui.test ---
[ERROR] Error fetching link: http://help.eclipse.org/oxygen/topic/org.eclipse.platform.doc.isv/reference/api/package-list. Ignored it.
[INFO] 
Loading source files for package org.eclipse.ease.ui.completion...
Loading source files for package org.eclipse.ease.ui.completion.provider...
Loading source files for package org.eclipse.ease.ui.completions.java.provider...
Loading source files for package org.eclipse.ease.ui.help.hovers...
Constructing Javadoc information...
WARNING: Cannot open location "/home/jenkins/agent/workspace/ease.verify.core.target.2019-03/tests/org.eclipse.ease.ui.test/target/javadoc-bundle-options/package-list"
[WARNING] Javadoc Warnings
[WARNING] Picked up JAVA_TOOL_OPTIONS: -XX:+IgnoreUnrecognizedVMOptions -XX:+UseContainerSupport -XX:+UnlockExperimentalVMOptions -XX:+UseCGroupMemoryLimitForHeap -Dmaven.ext.class.path="/home/jenkins/agent/workspace/ease.verify.core.target.2019-03@tmp/withMavenf4fc2e11/pipeline-maven-spy.jar" -Dorg.jenkinsci.plugins.pipeline.maven.reportsFolder="/home/jenkins/agent/workspace/ease.verify.core.target.2019-03@tmp/withMavenf4fc2e11"
[WARNING] Picked up _JAVA_OPTIONS: -XX:MaxRAMPercentage=64.0
[INFO] 
[INFO] --- build-helper-maven-plugin:1.9.1:add-resource (add_help) @ org.eclipse.ease.ui.test ---
[INFO] 
[INFO] --- maven-resources-plugin:2.4.3:resources (default-resources) @ org.eclipse.ease.ui.test ---
[INFO] Using 'UTF-8' encoding to copy filtered resources.
[INFO] skip non existing resourceDirectory /home/jenkins/agent/workspace/ease.verify.core.target.2019-03/tests/org.eclipse.ease.ui.test/src/main/resources
[INFO] Copying 2 resources to help
[INFO] 
[INFO] --- tycho-compiler-plugin:1.3.0:compile (default-compile) @ org.eclipse.ease.ui.test ---
[INFO] Compiling 6 source files to /home/jenkins/agent/workspace/ease.verify.core.target.2019-03/tests/org.eclipse.ease.ui.test/target/classes
[INFO] 
[INFO] --- maven-resources-plugin:2.4.3:testResources (default-testResources) @ org.eclipse.ease.ui.test ---
[INFO] Using 'UTF-8' encoding to copy filtered resources.
[INFO] skip non existing resourceDirectory /home/jenkins/agent/workspace/ease.verify.core.target.2019-03/tests/org.eclipse.ease.ui.test/src/test/resources
[INFO] 
[INFO] --- tycho-source-plugin:1.3.0:plugin-source (plugin-source) @ org.eclipse.ease.ui.test ---
[WARNING] Bundle-Vendor header not found in /home/jenkins/agent/workspace/ease.verify.core.target.2019-03/tests/org.eclipse.ease.ui.test/META-INF/MANIFEST.MF, fallback to 'unknown' for source bundle
[INFO] Building jar: /home/jenkins/agent/workspace/ease.verify.core.target.2019-03/tests/org.eclipse.ease.ui.test/target/org.eclipse.ease.ui.test-0.8.0-SNAPSHOT-sources.jar
[INFO] 
[INFO] --- target-platform-configuration:1.3.0:target-platform (default-target-platform) @ org.eclipse.ease.ui.test ---
[INFO] 
[INFO] --- tycho-packaging-plugin:1.3.0:package-plugin (default-package-plugin) @ org.eclipse.ease.ui.test ---
[INFO] Building jar: /home/jenkins/agent/workspace/ease.verify.core.target.2019-03/tests/org.eclipse.ease.ui.test/target/org.eclipse.ease.ui.test-0.8.0-SNAPSHOT.jar
[INFO] 
[INFO] --- tycho-p2-plugin:1.3.0:p2-metadata-default (default-p2-metadata-default) @ org.eclipse.ease.ui.test ---
[INFO] 
[INFO] --- tycho-source-feature-plugin:1.3.0:source-feature (source-feature) @ org.eclipse.ease.ui.test ---
[INFO] 
[INFO] --- tycho-p2-plugin:1.3.0:p2-metadata (attached-p2-metadata) @ org.eclipse.ease.ui.test ---
[INFO] 
[INFO] --- tycho-surefire-plugin:1.3.0:test (default-test) @ org.eclipse.ease.ui.test ---
[INFO] Expected eclipse log file: /home/jenkins/agent/workspace/ease.verify.core.target.2019-03/tests/org.eclipse.ease.ui.test/target/work/data/.metadata/.log
[INFO] Command line:
	[/opt/tools/java/oracle/jdk-8/1.8.0_202/jre/bin/java, -Dosgi.noShutdown=false, -Dosgi.os=linux, -Dosgi.ws=gtk, -Dosgi.arch=x86_64, -Dosgi.clean=true, -jar, /home/jenkins/.m2/repository/p2/osgi/bundle/org.eclipse.equinox.launcher/1.5.700.v20200207-2156/org.eclipse.equinox.launcher-1.5.700.v20200207-2156.jar, -data, /home/jenkins/agent/workspace/ease.verify.core.target.2019-03/tests/org.eclipse.ease.ui.test/target/work/data, -install, /home/jenkins/agent/workspace/ease.verify.core.target.2019-03/tests/org.eclipse.ease.ui.test/target/work, -configuration, /home/jenkins/agent/workspace/ease.verify.core.target.2019-03/tests/org.eclipse.ease.ui.test/target/work/configuration, -application, org.eclipse.tycho.surefire.osgibooter.headlesstest, -testproperties, /home/jenkins/agent/workspace/ease.verify.core.target.2019-03/tests/org.eclipse.ease.ui.test/target/surefire.properties]
Picked up JAVA_TOOL_OPTIONS: -XX:+IgnoreUnrecognizedVMOptions -XX:+UseContainerSupport -XX:+UnlockExperimentalVMOptions -XX:+UseCGroupMemoryLimitForHeap -Dmaven.ext.class.path="/home/jenkins/agent/workspace/ease.verify.core.target.2019-03@tmp/withMavenf4fc2e11/pipeline-maven-spy.jar" -Dorg.jenkinsci.plugins.pipeline.maven.reportsFolder="/home/jenkins/agent/workspace/ease.verify.core.target.2019-03@tmp/withMavenf4fc2e11" 
Picked up _JAVA_OPTIONS: -XX:MaxRAMPercentage=64.0
Running org.eclipse.ease.ui.help.hovers.ModuleHelpTest
Tests run: 4, Failures: 0, Errors: 0, Skipped: 4, Time elapsed: 0.021 s - in org.eclipse.ease.ui.help.hovers.ModuleHelpTest
getModuleHelpLocation(org.eclipse.ease.ui.help.hovers.ModuleHelpTest) skipped
getModuleHelp(org.eclipse.ease.ui.help.hovers.ModuleHelpTest) skipped
getMethodHelp(org.eclipse.ease.ui.help.hovers.ModuleHelpTest) skipped
getConstantHelp(org.eclipse.ease.ui.help.hovers.ModuleHelpTest) skipped
Running org.eclipse.ease.ui.completion.provider.AbstractFileLocationCompletionProviderTest
Tests run: 8, Failures: 0, Errors: 0, Skipped: 8, Time elapsed: 0.094 s - in org.eclipse.ease.ui.completion.provider.AbstractFileLocationCompletionProviderTest
workspaceProjectProposals(org.eclipse.ease.ui.completion.provider.AbstractFileLocationCompletionProviderTest) skipped
checkOperatingSystem(org.eclipse.ease.ui.completion.provider.AbstractFileLocationCompletionProviderTest) skipped
absoluteRootWorkspaceProposals(org.eclipse.ease.ui.completion.provider.AbstractFileLocationCompletionProviderTest) skipped
workspaceFolderProposals(org.eclipse.ease.ui.completion.provider.AbstractFileLocationCompletionProviderTest) skipped
fileSystemFolderProposals(org.eclipse.ease.ui.completion.provider.AbstractFileLocationCompletionProviderTest) skipped
workspaceProposals(org.eclipse.ease.ui.completion.provider.AbstractFileLocationCompletionProviderTest) skipped
relativeRootWorkspaceProposals(org.eclipse.ease.ui.completion.provider.AbstractFileLocationCompletionProviderTest) skipped
fileSystemRootProposals(org.eclipse.ease.ui.completion.provider.AbstractFileLocationCompletionProviderTest) skipped
Running org.eclipse.ease.ui.completion.CompletionContextTest
Tests run: 9, Failures: 0, Errors: 0, Skipped: 0, Time elapsed: 0.008 s - in org.eclipse.ease.ui.completion.CompletionContextTest
resolveStaticClass(org.eclipse.ease.ui.completion.CompletionContextTest)  Time elapsed: 0.004 s
resolveClassWithFilter(org.eclipse.ease.ui.completion.CompletionContextTest)  Time elapsed: 0 s
simplifyCalls(org.eclipse.ease.ui.completion.CompletionContextTest)  Time elapsed: 0.001 s
resolveClass(org.eclipse.ease.ui.completion.CompletionContextTest)  Time elapsed: 0 s
replaceEscapedStringLiterals(org.eclipse.ease.ui.completion.CompletionContextTest)  Time elapsed: 0 s
replaceSimpleStringLiterals(org.eclipse.ease.ui.completion.CompletionContextTest)  Time elapsed: 0 s
resolveStaticClassWithFilter(org.eclipse.ease.ui.completion.CompletionContextTest)  Time elapsed: 0 s
resolveClassWithParameters(org.eclipse.ease.ui.completion.CompletionContextTest)  Time elapsed: 0 s
replaceMultipleStringLiterals(org.eclipse.ease.ui.completion.CompletionContextTest)  Time elapsed: 0 s
Running org.eclipse.ease.ui.completions.java.provider.JavaPackagesCompletionsProviderTest
Tests run: 4, Failures: 0, Errors: 0, Skipped: 0, Time elapsed: 6.217 s - in org.eclipse.ease.ui.completions.java.provider.JavaPackagesCompletionsProviderTest
containsJavaLangPackageProposal(org.eclipse.ease.ui.completions.java.provider.JavaPackagesCompletionsProviderTest)  Time elapsed: 0.694 s
containsOrgRootPackageProposal(org.eclipse.ease.ui.completions.java.provider.JavaPackagesCompletionsProviderTest)  Time elapsed: 0.009 s
containsJavaRootPackageProposal(org.eclipse.ease.ui.completions.java.provider.JavaPackagesCompletionsProviderTest)  Time elapsed: 0.007 s
containsOrgEclipsePackageProposal(org.eclipse.ease.ui.completions.java.provider.JavaPackagesCompletionsProviderTest)  Time elapsed: 0.062 s
Running org.eclipse.ease.ui.completions.java.provider.JavaClassCompletionsProviderTest
Tests run: 6, Failures: 0, Errors: 0, Skipped: 0, Time elapsed: 5.188 s - in org.eclipse.ease.ui.completions.java.provider.JavaClassCompletionsProviderTest
containsPackageFileCompletion(org.eclipse.ease.ui.completions.java.provider.JavaClassCompletionsProviderTest)  Time elapsed: 0.012 s
containsGlobalFileCompletion(org.eclipse.ease.ui.completions.java.provider.JavaClassCompletionsProviderTest)  Time elapsed: 0.048 s
containsJavaLangPackageProposal(org.eclipse.ease.ui.completions.java.provider.JavaClassCompletionsProviderTest)  Time elapsed: 0.056 s
containsOrgRootPackageProposal(org.eclipse.ease.ui.completions.java.provider.JavaClassCompletionsProviderTest)  Time elapsed: 0.006 s
containsJavaRootPackageProposal(org.eclipse.ease.ui.completions.java.provider.JavaClassCompletionsProviderTest)  Time elapsed: 0.006 s
containsOrgEclipsePackageProposal(org.eclipse.ease.ui.completions.java.provider.JavaClassCompletionsProviderTest)  Time elapsed: 0.052 s

Results:

Tests run: 31, Failures: 0, Errors: 0, Skipped: 12

[INFO] All tests passed!
[INFO] 
[INFO] --- maven-install-plugin:2.3.1:install (default-install) @ org.eclipse.ease.ui.test ---
[INFO] Installing /home/jenkins/agent/workspace/ease.verify.core.target.2019-03/tests/org.eclipse.ease.ui.test/target/org.eclipse.ease.ui.test-0.8.0-SNAPSHOT.jar to /home/jenkins/.m2/repository/org/eclipse/ease/org.eclipse.ease.ui.test/0.8.0-SNAPSHOT/org.eclipse.ease.ui.test-0.8.0-SNAPSHOT.jar
[INFO] Installing /home/jenkins/agent/workspace/ease.verify.core.target.2019-03/tests/org.eclipse.ease.ui.test/pom.xml to /home/jenkins/.m2/repository/org/eclipse/ease/org.eclipse.ease.ui.test/0.8.0-SNAPSHOT/org.eclipse.ease.ui.test-0.8.0-SNAPSHOT.pom
[INFO] Installing /home/jenkins/agent/workspace/ease.verify.core.target.2019-03/tests/org.eclipse.ease.ui.test/target/org.eclipse.ease.ui.test-0.8.0-SNAPSHOT-sources.jar to /home/jenkins/.m2/repository/org/eclipse/ease/org.eclipse.ease.ui.test/0.8.0-SNAPSHOT/org.eclipse.ease.ui.test-0.8.0-SNAPSHOT-sources.jar
[INFO] Installing /home/jenkins/agent/workspace/ease.verify.core.target.2019-03/tests/org.eclipse.ease.ui.test/target/p2content.xml to /home/jenkins/.m2/repository/org/eclipse/ease/org.eclipse.ease.ui.test/0.8.0-SNAPSHOT/org.eclipse.ease.ui.test-0.8.0-SNAPSHOT-p2metadata.xml
[INFO] Installing /home/jenkins/agent/workspace/ease.verify.core.target.2019-03/tests/org.eclipse.ease.ui.test/target/p2artifacts.xml to /home/jenkins/.m2/repository/org/eclipse/ease/org.eclipse.ease.ui.test/0.8.0-SNAPSHOT/org.eclipse.ease.ui.test-0.8.0-SNAPSHOT-p2artifacts.xml
[INFO] Installing /home/jenkins/agent/workspace/ease.verify.core.target.2019-03/tests/org.eclipse.ease.ui.test/target/p2content.xml to /home/jenkins/.m2/repository/org/eclipse/ease/org.eclipse.ease.ui.test/0.8.0-SNAPSHOT/org.eclipse.ease.ui.test-0.8.0-SNAPSHOT-p2metadata.xml
[INFO] Installing /home/jenkins/agent/workspace/ease.verify.core.target.2019-03/tests/org.eclipse.ease.ui.test/target/p2artifacts.xml to /home/jenkins/.m2/repository/org/eclipse/ease/org.eclipse.ease.ui.test/0.8.0-SNAPSHOT/org.eclipse.ease.ui.test-0.8.0-SNAPSHOT-p2artifacts.xml
[INFO] 
[INFO] --- tycho-p2-plugin:1.3.0:update-local-index (default-update-local-index) @ org.eclipse.ease.ui.test ---
[INFO] 
[INFO] ---------------------< org.eclipse.ease:ease.core >---------------------
[INFO] Building EASE (Incubation) 0.4.0-SNAPSHOT                        [48/48]
[INFO] --------------------------------[ pom ]---------------------------------
[INFO] 
[INFO] --- maven-clean-plugin:2.5:clean (default-clean) @ ease.core ---
[INFO] 
[INFO] --- maven-install-plugin:2.4:install (default-install) @ ease.core ---
[INFO] Installing /home/jenkins/agent/workspace/ease.verify.core.target.2019-03/pom.xml to /home/jenkins/.m2/repository/org/eclipse/ease/ease.core/0.4.0-SNAPSHOT/ease.core-0.4.0-SNAPSHOT.pom
[INFO] ------------------------------------------------------------------------
[INFO] Reactor Summary:
[INFO] 
[INFO] org.eclipse.ease.releng 0.8.0-SNAPSHOT ............. SUCCESS [  7.603 s]
[INFO] org.eclipse.ease.classloader 0.8.0-SNAPSHOT ........ SUCCESS [  5.771 s]
[INFO] org.eclipse.ease 0.8.0-SNAPSHOT .................... SUCCESS [  3.175 s]
[INFO] org.eclipse.ease.ui 0.8.0-SNAPSHOT ................. SUCCESS [  4.565 s]
[INFO] org.eclipse.ease.ui.completions.java 0.8.0-SNAPSHOT  SUCCESS [  2.892 s]
[INFO] org.eclipse.ease.ui.scripts 0.8.0-SNAPSHOT ......... SUCCESS [  3.221 s]
[INFO] org.eclipse.ease.lang.javascript 0.8.0-SNAPSHOT .... SUCCESS [  1.726 s]
[INFO] org.eclipse.ease.lang.scriptarchive 0.8.0-SNAPSHOT . SUCCESS [  1.725 s]
[INFO] org.eclipse.ease.lang.python 0.8.0-SNAPSHOT ........ SUCCESS [  1.969 s]
[INFO] org.eclipse.ease.lang.python.py4j 0.8.0-SNAPSHOT ... SUCCESS [  6.887 s]
[INFO] org.eclipse.ease.lang.groovy 0.8.0-SNAPSHOT ........ SUCCESS [  1.766 s]
[INFO] org.eclipse.ease.lang.groovy.interpreter 0.8.0-SNAPSHOT SUCCESS [  1.832 s]
[INFO] org.eclipse.ease.lang.unittest 0.8.0-SNAPSHOT ...... SUCCESS [  2.570 s]
[INFO] org.eclipse.ease.lang.unittest.ui 0.8.0-SNAPSHOT ... SUCCESS [  3.026 s]
[INFO] org.eclipse.ease.lang.ruby 0.8.0-SNAPSHOT .......... SUCCESS [  1.794 s]
[INFO] org.eclipse.ease.lang.ruby.jruby 0.8.0-SNAPSHOT .... SUCCESS [  1.874 s]
[INFO] org.eclipse.ease.lang.javascript.nashorn 0.8.0-SNAPSHOT SUCCESS [  4.466 s]
[INFO] org.eclipse.ease.lang.javascript.rhino 0.8.0-SNAPSHOT SUCCESS [  2.275 s]
[INFO] org.eclipse.ease.lang.python.jython 0.8.0-SNAPSHOT . SUCCESS [  2.153 s]
[INFO] org.eclipse.ease.lang.javascript.ui 0.8.0-SNAPSHOT . SUCCESS [  1.941 s]
[INFO] org.eclipse.ease.lang.jvm.compiled 0.8.0-SNAPSHOT .. SUCCESS [  1.802 s]
[INFO] org.eclipse.ease.lang.scriptarchive.ui 0.8.0-SNAPSHOT SUCCESS [  2.110 s]
[INFO] org.eclipse.ease.help 0.8.0-SNAPSHOT ............... SUCCESS [  0.123 s]
[INFO] org.eclipse.ease.feature 0.8.0-SNAPSHOT ............ SUCCESS [  0.204 s]
[INFO] org.eclipse.ease.ui.feature 0.8.0-SNAPSHOT ......... SUCCESS [  0.225 s]
[INFO] org.eclipse.ease.lang.javascript.feature 0.8.0-SNAPSHOT SUCCESS [  0.250 s]
[INFO] org.eclipse.ease.lang.python.feature 0.8.0-SNAPSHOT  SUCCESS [  0.101 s]
[INFO] org.eclipse.ease.python.jython.feature 0.8.0-SNAPSHOT SUCCESS [  0.154 s]
[INFO] org.eclipse.ease.lang.python.py4j.feature 0.8.0-SNAPSHOT SUCCESS [  0.098 s]
[INFO] org.eclipse.ease.lang.jvm.feature 0.8.0-SNAPSHOT ... SUCCESS [  0.125 s]
[INFO] org.eclipse.ease.lang.groovy.feature 0.8.0-SNAPSHOT  SUCCESS [  0.113 s]
[INFO] org.eclipse.ease.lang.ruby.feature 0.8.0-SNAPSHOT .. SUCCESS [  0.127 s]
[INFO] org.eclipse.ease.lang.scriptarchive.feature 0.8.0-SNAPSHOT SUCCESS [  0.160 s]
[INFO] org.eclipse.ease.lang.unittest.feature 0.8.0-SNAPSHOT SUCCESS [  0.111 s]
[INFO] org.eclipse.ease.releng.target 0.8.0-SNAPSHOT ...... SUCCESS [  0.012 s]
[INFO] org.eclipse.ease.releng.p2 0.8.0-SNAPSHOT .......... SUCCESS [  4.158 s]
[INFO] org.eclipse.ease.testhelper 0.8.0-SNAPSHOT ......... SUCCESS [  2.023 s]
[INFO] org.eclipse.ease.test 0.8.0-SNAPSHOT ............... SUCCESS [ 20.808 s]
[INFO] org.eclipse.ease.lang.javascript.nashorn.test 0.8.0-SNAPSHOT SUCCESS [  5.268 s]
[INFO] org.eclipse.ease.lang.javascript.rhino.test 0.8.0-SNAPSHOT SUCCESS [ 18.291 s]
[INFO] org.eclipse.ease.lang.javascript.test 0.8.0-SNAPSHOT SUCCESS [  4.661 s]
[INFO] org.eclipse.ease.lang.python.test 0.8.0-SNAPSHOT ... SUCCESS [  4.299 s]
[INFO] org.eclipse.ease.lang.python.jython.test 0.8.0-SNAPSHOT SUCCESS [ 19.611 s]
[INFO] org.eclipse.ease.lang.python.py4j.test 0.8.0-SNAPSHOT SUCCESS [ 34.711 s]
[INFO] org.eclipse.ease.lang.scriptarchive.test 0.8.0-SNAPSHOT SUCCESS [  5.229 s]
[INFO] org.eclipse.ease.lang.unittest.test 0.8.0-SNAPSHOT . SUCCESS [  7.225 s]
[INFO] org.eclipse.ease.ui.test 0.8.0-SNAPSHOT ............ SUCCESS [ 16.883 s]
[INFO] EASE (Incubation) 0.4.0-SNAPSHOT ................... SUCCESS [  0.729 s]
[INFO] ------------------------------------------------------------------------
[INFO] BUILD SUCCESS
[INFO] ------------------------------------------------------------------------
[INFO] Total time:  06:47 min
[INFO] Finished at: 2020-06-13T21:42:17Z
[INFO] ------------------------------------------------------------------------
[INFO] [jenkins-event-spy] Generated /home/jenkins/agent/workspace/ease.verify.core.target.2019-03@tmp/withMavenf4fc2e11/maven-spy-20200613-213529-7167384996231266153822.log