FailedConsole Output

Skipping 804 KB.. Full Log
lipse.e4.emf.xpath_0.2.200.v20180828-0227.jar.pack.gz from http://download.eclipse.org/releases/2019-03/201903201000/plugins/ (21.21kB)
[INFO] Fetching org.eclipse.e4.emf.xpath_0.2.200.v20180828-0227.jar.pack.gz from http://download.eclipse.org/releases/2019-03/201903201000/plugins/ (21.21kB)
[INFO] Fetching org.eclipse.emf.ecore_2.17.0.v20190116-0940.jar.pack.gz from http://download.eclipse.org/releases/2019-03/201903201000/plugins/ (485.2kB)
[INFO] Fetching org.eclipse.emf.ecore_2.17.0.v20190116-0940.jar.pack.gz from http://download.eclipse.org/releases/2019-03/201903201000/plugins/ (485.2kB)
[INFO] Fetching org.eclipse.e4.ui.bindings_0.12.400.v20190131-1604.jar.pack.gz from http://download.eclipse.org/releases/2019-03/201903201000/plugins/ (23.06kB)
[INFO] Fetching org.eclipse.e4.ui.bindings_0.12.400.v20190131-1604.jar.pack.gz from http://download.eclipse.org/releases/2019-03/201903201000/plugins/ (23.06kB)
[INFO] Fetching org.eclipse.swt_3.110.0.v20190305-0602.jar.pack.gz from http://download.eclipse.org/releases/2019-03/201903201000/plugins/ (16.04kB)
[INFO] Fetching org.eclipse.swt_3.110.0.v20190305-0602.jar.pack.gz from http://download.eclipse.org/releases/2019-03/201903201000/plugins/ (16.04kB)
[INFO] Fetching org.eclipse.jface_3.15.100.v20190222-1334.jar.pack.gz from http://download.eclipse.org/releases/2019-03/201903201000/plugins/ (357kB)
[INFO] Fetching org.eclipse.jface_3.15.100.v20190222-1334.jar.pack.gz from http://download.eclipse.org/releases/2019-03/201903201000/plugins/ (357kB)
[INFO] Fetching org.eclipse.e4.ui.css.core_0.12.500.v20190211-2017.jar.pack.gz from http://download.eclipse.org/releases/2019-03/201903201000/plugins/ (64.15kB)
[INFO] Fetching org.eclipse.e4.ui.css.core_0.12.500.v20190211-2017.jar.pack.gz from http://download.eclipse.org/releases/2019-03/201903201000/plugins/ (64.15kB)
[INFO] Fetching org.eclipse.e4.ui.css.swt_0.13.400.v20190223-1254.jar.pack.gz from http://download.eclipse.org/releases/2019-03/201903201000/plugins/ (79.76kB)
[INFO] Fetching org.eclipse.e4.ui.css.swt_0.13.400.v20190223-1254.jar.pack.gz from http://download.eclipse.org/releases/2019-03/201903201000/plugins/ (79.76kB)
[INFO] Fetching org.eclipse.e4.ui.css.swt.theme_0.12.200.v20190212-2214.jar.pack.gz from http://download.eclipse.org/releases/2019-03/201903201000/plugins/ (16.85kB)
[INFO] Fetching org.eclipse.e4.ui.css.swt.theme_0.12.200.v20190212-2214.jar.pack.gz from http://download.eclipse.org/releases/2019-03/201903201000/plugins/ (16.85kB)
[INFO] Fetching org.eclipse.e4.ui.di_1.2.500.v20190214-1316.jar.pack.gz from http://download.eclipse.org/releases/2019-03/201903201000/plugins/ (9.97kB)
[INFO] Fetching org.eclipse.e4.ui.di_1.2.500.v20190214-1316.jar.pack.gz from http://download.eclipse.org/releases/2019-03/201903201000/plugins/ (9.97kB)
[INFO] Fetching org.eclipse.e4.ui.model.workbench_2.1.300.v20190213-1544.jar.pack.gz from http://download.eclipse.org/releases/2019-03/201903201000/plugins/ (107.89kB)
[INFO] Fetching org.eclipse.e4.ui.model.workbench_2.1.300.v20190213-1544.jar.pack.gz from http://download.eclipse.org/releases/2019-03/201903201000/plugins/ (107.89kB)
[INFO] Fetching org.eclipse.e4.ui.services_1.3.400.v20190212-2214.jar.pack.gz from http://download.eclipse.org/releases/2019-03/201903201000/plugins/ (13.3kB)
[INFO] Fetching org.eclipse.e4.ui.services_1.3.400.v20190212-2214.jar.pack.gz from http://download.eclipse.org/releases/2019-03/201903201000/plugins/ (13.3kB)
[INFO] Fetching org.eclipse.equinox.event_1.5.0.v20181008-1938.jar.pack.gz from http://download.eclipse.org/releases/2019-03/201903201000/plugins/ (16.82kB)
[INFO] Fetching org.eclipse.equinox.event_1.5.0.v20181008-1938.jar.pack.gz from http://download.eclipse.org/releases/2019-03/201903201000/plugins/ (16.82kB)
[INFO] Fetching org.eclipse.e4.ui.widgets_1.2.300.v20180920-1522.jar.pack.gz from http://download.eclipse.org/releases/2019-03/201903201000/plugins/ (9.49kB)
[INFO] Fetching org.eclipse.e4.ui.widgets_1.2.300.v20180920-1522.jar.pack.gz from http://download.eclipse.org/releases/2019-03/201903201000/plugins/ (9.49kB)
[INFO] Fetching org.eclipse.e4.ui.workbench_1.9.0.v20190220-1356.jar.pack.gz from http://download.eclipse.org/releases/2019-03/201903201000/plugins/ (86.77kB)
[INFO] Fetching org.eclipse.e4.ui.workbench_1.9.0.v20190220-1356.jar.pack.gz from http://download.eclipse.org/releases/2019-03/201903201000/plugins/ (86.77kB)
[INFO] Fetching org.eclipse.emf.ecore.xmi_2.15.0.v20180706-1146.jar.pack.gz from http://download.eclipse.org/releases/2019-03/201903201000/plugins/ (84.2kB)
[INFO] Fetching org.eclipse.emf.ecore.xmi_2.15.0.v20180706-1146.jar.pack.gz from http://download.eclipse.org/releases/2019-03/201903201000/plugins/ (84.2kB)
[INFO] Fetching org.eclipse.emf.ecore.change_2.13.0.v20180706-1146.jar.pack.gz from http://download.eclipse.org/releases/2019-03/201903201000/plugins/ (51.1kB)
[INFO] Fetching org.eclipse.emf.ecore.change_2.13.0.v20180706-1146.jar.pack.gz from http://download.eclipse.org/releases/2019-03/201903201000/plugins/ (51.1kB)
[INFO] Fetching org.eclipse.e4.ui.workbench.addons.swt_1.3.400.v20190224-1542.jar.pack.gz from http://download.eclipse.org/releases/2019-03/201903201000/plugins/ (51.85kB)
[INFO] Fetching org.eclipse.e4.ui.workbench.addons.swt_1.3.400.v20190224-1542.jar.pack.gz from http://download.eclipse.org/releases/2019-03/201903201000/plugins/ (51.85kB)
[INFO] Fetching org.eclipse.e4.ui.workbench.renderers.swt_0.14.500.v20190220-1002.jar.pack.gz from http://download.eclipse.org/releases/2019-03/201903201000/plugins/ (93.84kB)
[INFO] Fetching org.eclipse.e4.ui.workbench.renderers.swt_0.14.500.v20190220-1002.jar.pack.gz from http://download.eclipse.org/releases/2019-03/201903201000/plugins/ (93.84kB)
[INFO] Fetching org.eclipse.e4.ui.workbench.swt_0.14.500.v20190214-0851.jar.pack.gz from http://download.eclipse.org/releases/2019-03/201903201000/plugins/ (71.13kB)
[INFO] Fetching org.eclipse.e4.ui.workbench.swt_0.14.500.v20190214-0851.jar.pack.gz from http://download.eclipse.org/releases/2019-03/201903201000/plugins/ (71.13kB)
[INFO] Fetching org.eclipse.jface.databinding_1.8.500.v20190218-2049.jar.pack.gz from http://download.eclipse.org/releases/2019-03/201903201000/plugins/ (69.07kB)
[INFO] Fetching org.eclipse.jface.databinding_1.8.500.v20190218-2049.jar.pack.gz from http://download.eclipse.org/releases/2019-03/201903201000/plugins/ (69.07kB)
[INFO] Fetching org.eclipse.e4.ui.workbench3_0.15.0.v20181213-1706.jar.pack.gz from http://download.eclipse.org/releases/2019-03/201903201000/plugins/ (13.09kB)
[INFO] Fetching org.eclipse.e4.ui.workbench3_0.15.0.v20181213-1706.jar.pack.gz from http://download.eclipse.org/releases/2019-03/201903201000/plugins/ (13.09kB)
[INFO] Fetching org.eclipse.ecf.filetransfer_5.0.100.v20180301-0132.jar.pack.gz from http://download.eclipse.org/releases/2019-03/201903201000/plugins/ (20.38kB)
[INFO] Fetching org.eclipse.ecf.filetransfer_5.0.100.v20180301-0132.jar.pack.gz from http://download.eclipse.org/releases/2019-03/201903201000/plugins/ (20.38kB)
[INFO] Fetching org.junit_4.12.0.v201504281640.jar.pack.gz from http://download.eclipse.org/releases/2019-03/201903201000/plugins/ (283.72kB)
[INFO] Fetching org.junit_4.12.0.v201504281640.jar.pack.gz from http://download.eclipse.org/releases/2019-03/201903201000/plugins/ (283.72kB)
[INFO] Fetching org.eclipse.ui.workbench_3.113.0.v20190219-1432.jar.pack.gz from http://download.eclipse.org/releases/2019-03/201903201000/plugins/ (1,018.38kB)
[INFO] Fetching org.eclipse.ui.workbench_3.113.0.v20190219-1432.jar.pack.gz from http://download.eclipse.org/releases/2019-03/201903201000/plugins/ (1,018.38kB)
[INFO] Fetching org.eclipse.equinox.p2.engine_2.6.200.v20190215-2242.jar.pack.gz from http://download.eclipse.org/releases/2019-03/201903201000/plugins/ (74.79kB)
[INFO] Fetching org.eclipse.equinox.p2.engine_2.6.200.v20190215-2242.jar.pack.gz from http://download.eclipse.org/releases/2019-03/201903201000/plugins/ (74.79kB)
[INFO] Fetching org.eclipse.ui.views.properties.tabbed_3.8.400.v20190215-1230.jar.pack.gz from http://download.eclipse.org/releases/2019-03/201903201000/plugins/ (40.7kB)
[INFO] Fetching org.eclipse.ui.views.properties.tabbed_3.8.400.v20190215-1230.jar.pack.gz from http://download.eclipse.org/releases/2019-03/201903201000/plugins/ (40.7kB)
[INFO] Fetching org.eclipse.ecf_3.9.3.v20181012-2016.jar.pack.gz from http://download.eclipse.org/releases/2019-03/201903201000/plugins/ (48.13kB)
[INFO] Fetching org.eclipse.ecf_3.9.3.v20181012-2016.jar.pack.gz from http://download.eclipse.org/releases/2019-03/201903201000/plugins/ (48.13kB)
[INFO] Fetching org.eclipse.ecf.identity_3.9.1.v20180810-0833.jar.pack.gz from http://download.eclipse.org/releases/2019-03/201903201000/plugins/ (27.19kB)
[INFO] Fetching org.eclipse.ecf.identity_3.9.1.v20180810-0833.jar.pack.gz from http://download.eclipse.org/releases/2019-03/201903201000/plugins/ (27.19kB)
[INFO] Fetching org.eclipse.equinox.concurrent_1.1.200.v20180827-1235.jar.pack.gz from http://download.eclipse.org/releases/2019-03/201903201000/plugins/ (12.22kB)
[INFO] Fetching org.eclipse.equinox.concurrent_1.1.200.v20180827-1235.jar.pack.gz from http://download.eclipse.org/releases/2019-03/201903201000/plugins/ (12.22kB)
[INFO] Fetching org.eclipse.emf.common_2.15.0.v20181220-0846.jar.pack.gz from http://download.eclipse.org/releases/2019-03/201903201000/plugins/ (115.27kB)
[INFO] Fetching org.eclipse.emf.common_2.15.0.v20181220-0846.jar.pack.gz from http://download.eclipse.org/releases/2019-03/201903201000/plugins/ (115.27kB)
[INFO] Fetching org.eclipse.equinox.bidi_1.1.300.v20190218-1259.jar.pack.gz from http://download.eclipse.org/releases/2019-03/201903201000/plugins/ (23.16kB)
[INFO] Fetching org.eclipse.equinox.bidi_1.1.300.v20190218-1259.jar.pack.gz from http://download.eclipse.org/releases/2019-03/201903201000/plugins/ (23.16kB)
[INFO] Fetching org.eclipse.equinox.launcher_1.5.300.v20190213-1655.jar.pack.gz from http://download.eclipse.org/releases/2019-03/201903201000/plugins/ (29.93kB)
[INFO] Fetching org.eclipse.equinox.launcher_1.5.300.v20190213-1655.jar.pack.gz from http://download.eclipse.org/releases/2019-03/201903201000/plugins/ (29.93kB)
[INFO] Fetching org.eclipse.equinox.p2.core_2.6.0.v20190215-2242.jar.pack.gz from http://download.eclipse.org/releases/2019-03/201903201000/plugins/ (31.98kB)
[INFO] Fetching org.eclipse.equinox.p2.core_2.6.0.v20190215-2242.jar.pack.gz from http://download.eclipse.org/releases/2019-03/201903201000/plugins/ (31.98kB)
[INFO] Fetching org.eclipse.equinox.p2.metadata_2.4.300.v20190215-2242.jar.pack.gz from http://download.eclipse.org/releases/2019-03/201903201000/plugins/ (108kB)
[INFO] Fetching org.eclipse.equinox.p2.metadata_2.4.300.v20190215-2242.jar.pack.gz from http://download.eclipse.org/releases/2019-03/201903201000/plugins/ (108kB)
[INFO] Fetching org.eclipse.equinox.p2.metadata.repository_1.3.100.v20180822-1302.jar.pack.gz from http://download.eclipse.org/releases/2019-03/201903201000/plugins/ (51.01kB)
[INFO] Fetching org.eclipse.equinox.p2.metadata.repository_1.3.100.v20180822-1302.jar.pack.gz from http://download.eclipse.org/releases/2019-03/201903201000/plugins/ (51.01kB)
[INFO] Fetching org.eclipse.equinox.p2.repository_2.4.300.v20190215-2242.jar.pack.gz from http://download.eclipse.org/releases/2019-03/201903201000/plugins/ (55.15kB)
[INFO] Fetching org.eclipse.equinox.p2.repository_2.4.300.v20190215-2242.jar.pack.gz from http://download.eclipse.org/releases/2019-03/201903201000/plugins/ (55.15kB)
[INFO] Fetching org.eclipse.ltk.core.refactoring_3.10.0.v20190216-1303.jar.pack.gz from http://download.eclipse.org/releases/2019-03/201903201000/plugins/ (107.69kB)
[INFO] Fetching org.eclipse.ltk.core.refactoring_3.10.0.v20190216-1303.jar.pack.gz from http://download.eclipse.org/releases/2019-03/201903201000/plugins/ (107.69kB)
[INFO] Fetching org.eclipse.ltk.ui.refactoring_3.9.300.v20190216-1303.jar.pack.gz from http://download.eclipse.org/releases/2019-03/201903201000/plugins/ (181.37kB)
[INFO] Fetching org.eclipse.ltk.ui.refactoring_3.9.300.v20190216-1303.jar.pack.gz from http://download.eclipse.org/releases/2019-03/201903201000/plugins/ (181.37kB)
[INFO] Fetching org.eclipse.ui.navigator_3.7.400.v20190218-2049.jar.pack.gz from http://download.eclipse.org/releases/2019-03/201903201000/plugins/ (134.85kB)
[INFO] Fetching org.eclipse.ui.navigator_3.7.400.v20190218-2049.jar.pack.gz from http://download.eclipse.org/releases/2019-03/201903201000/plugins/ (134.85kB)
[INFO] Fetching org.eclipse.team.core_3.8.500.v20190216-2155.jar.pack.gz from http://download.eclipse.org/releases/2019-03/201903201000/plugins/ (126.16kB)
[INFO] Fetching org.eclipse.team.core_3.8.500.v20190216-2155.jar.pack.gz from http://download.eclipse.org/releases/2019-03/201903201000/plugins/ (126.16kB)
[INFO] Fetching org.eclipse.team.ui_3.8.400.v20190216-2155.jar.pack.gz from http://download.eclipse.org/releases/2019-03/201903201000/plugins/ (492.78kB)
[INFO] Fetching org.eclipse.team.ui_3.8.400.v20190216-2155.jar.pack.gz from http://download.eclipse.org/releases/2019-03/201903201000/plugins/ (492.78kB)
[INFO] Fetching org.eclipse.swt.gtk.linux.x86_64_3.110.0.v20190305-0602.jar.pack.gz from http://download.eclipse.org/releases/2019-03/201903201000/plugins/ (1,004.13kB)
[INFO] Fetching org.eclipse.swt.gtk.linux.x86_64_3.110.0.v20190305-0602.jar.pack.gz from http://download.eclipse.org/releases/2019-03/201903201000/plugins/ (1,004.13kB)
[INFO] Fetching org.eclipse.ui.ide.application_1.3.200.v20190212-2214.jar.pack.gz from http://download.eclipse.org/releases/2019-03/201903201000/plugins/ (54.18kB)
[INFO] Fetching org.eclipse.ui.ide.application_1.3.200.v20190212-2214.jar.pack.gz from http://download.eclipse.org/releases/2019-03/201903201000/plugins/ (54.18kB)
[INFO] Fetching org.eclipse.ui.navigator.resources_3.6.400.v20190222-1251.jar.pack.gz from http://download.eclipse.org/releases/2019-03/201903201000/plugins/ (69.45kB)
[INFO] Fetching org.eclipse.ui.navigator.resources_3.6.400.v20190222-1251.jar.pack.gz from http://download.eclipse.org/releases/2019-03/201903201000/plugins/ (69.45kB)
[INFO] Fetching org.eclipse.urischeme_1.0.200.v20190219-1659.jar.pack.gz from http://download.eclipse.org/releases/2019-03/201903201000/plugins/ (21.67kB)
[INFO] Fetching org.eclipse.urischeme_1.0.200.v20190219-1659.jar.pack.gz from http://download.eclipse.org/releases/2019-03/201903201000/plugins/ (21.67kB)
[WARNING] The following locally built units have been used to resolve project dependencies:
[WARNING]   org.eclipse.ease.ui/0.8.0.I202003230858
[WARNING]   org.eclipse.ease.ui.scripts/0.8.0.I202003161005
[WARNING]   org.eclipse.ease/0.8.0.I202006040906
[WARNING]   org.eclipse.ease.classloader/0.8.0.I201910171213
[INFO] Resolving class path of MavenProject: org.eclipse.ease:org.eclipse.ease.test:0.8.0-SNAPSHOT @ /home/jenkins/agent/workspace/ease.verify.core.target.2019-03/tests/org.eclipse.ease.test/pom.xml
[INFO] Computing target platform for MavenProject: org.eclipse.ease:org.eclipse.ease.lang.javascript.nashorn.test:0.8.0-SNAPSHOT @ /home/jenkins/agent/workspace/ease.verify.core.target.2019-03/tests/org.eclipse.ease.lang.javascript.nashorn.test/pom.xml
[INFO] Resolving dependencies of MavenProject: org.eclipse.ease:org.eclipse.ease.lang.javascript.nashorn.test:0.8.0-SNAPSHOT @ /home/jenkins/agent/workspace/ease.verify.core.target.2019-03/tests/org.eclipse.ease.lang.javascript.nashorn.test/pom.xml
[WARNING] The following locally built units have been used to resolve project dependencies:
[WARNING]   org.eclipse.ease.lang.javascript/0.8.0.I201912121852
[WARNING]   org.eclipse.ease.ui/0.8.0.I202003230858
[WARNING]   org.eclipse.ease/0.8.0.I202006040906
[WARNING]   org.eclipse.ease.lang.javascript.nashorn/0.8.0.I201910171213
[WARNING]   org.eclipse.ease.testhelper/0.8.0.I202003020926
[WARNING]   org.eclipse.ease.classloader/0.8.0.I201910171213
[INFO] Resolving class path of MavenProject: org.eclipse.ease:org.eclipse.ease.lang.javascript.nashorn.test:0.8.0-SNAPSHOT @ /home/jenkins/agent/workspace/ease.verify.core.target.2019-03/tests/org.eclipse.ease.lang.javascript.nashorn.test/pom.xml
[INFO] Computing target platform for MavenProject: org.eclipse.ease:org.eclipse.ease.lang.javascript.rhino.test:0.8.0-SNAPSHOT @ /home/jenkins/agent/workspace/ease.verify.core.target.2019-03/tests/org.eclipse.ease.lang.javascript.rhino.test/pom.xml
[INFO] Resolving dependencies of MavenProject: org.eclipse.ease:org.eclipse.ease.lang.javascript.rhino.test:0.8.0-SNAPSHOT @ /home/jenkins/agent/workspace/ease.verify.core.target.2019-03/tests/org.eclipse.ease.lang.javascript.rhino.test/pom.xml
[INFO] Fetching com.google.guava_21.0.0.v20170206-1425.jar from http://download.eclipse.org/releases/2019-03/201903201000/plugins/ (2.55MB)
[INFO] Fetching com.google.guava_21.0.0.v20170206-1425.jar from http://download.eclipse.org/releases/2019-03/201903201000/plugins/ (2.55MB)
[INFO] Fetching org.mozilla.javascript_1.7.5.v201504281450.jar.pack.gz from http://download.eclipse.org/releases/2019-03/201903201000/plugins/ (430.37kB)
[INFO] Fetching org.mozilla.javascript_1.7.5.v201504281450.jar.pack.gz from http://download.eclipse.org/releases/2019-03/201903201000/plugins/ (430.37kB)
[INFO] Fetching org.eclipse.wst.jsdt.ui_2.0.301.v201710051729.jar.pack.gz from http://download.eclipse.org/releases/2019-03/201903201000/plugins/ (2.32MB)
[INFO] Fetching org.eclipse.wst.jsdt.ui_2.0.301.v201710051729.jar.pack.gz from http://download.eclipse.org/releases/2019-03/201903201000/plugins/ (2.32MB)
[INFO] Fetching org.eclipse.wst.jsdt.debug.ui_1.0.600.v201605311817.jar.pack.gz from http://download.eclipse.org/releases/2019-03/201903201000/plugins/ (82.19kB)
[INFO] Fetching org.eclipse.wst.jsdt.debug.ui_1.0.600.v201605311817.jar.pack.gz from http://download.eclipse.org/releases/2019-03/201903201000/plugins/ (82.19kB)
[INFO] Fetching org.eclipse.search_3.11.500.v20190218-2126.jar.pack.gz from http://download.eclipse.org/releases/2019-03/201903201000/plugins/ (216.52kB)
[INFO] Fetching org.eclipse.search_3.11.500.v20190218-2126.jar.pack.gz from http://download.eclipse.org/releases/2019-03/201903201000/plugins/ (216.52kB)
[INFO] Fetching org.eclipse.wst.common.core_1.3.0.v201811122154.jar.pack.gz from http://download.eclipse.org/releases/2019-03/201903201000/plugins/ (24.03kB)
[INFO] Fetching org.eclipse.wst.common.core_1.3.0.v201811122154.jar.pack.gz from http://download.eclipse.org/releases/2019-03/201903201000/plugins/ (24.03kB)
[INFO] Fetching org.eclipse.wst.common.environment_1.0.400.v201810290944.jar.pack.gz from http://download.eclipse.org/releases/2019-03/201903201000/plugins/ (20.09kB)
[INFO] Fetching org.eclipse.wst.common.environment_1.0.400.v201810290944.jar.pack.gz from http://download.eclipse.org/releases/2019-03/201903201000/plugins/ (20.09kB)
[INFO] Fetching org.eclipse.wst.common.frameworks_1.2.201.v201707201954.jar.pack.gz from http://download.eclipse.org/releases/2019-03/201903201000/plugins/ (43.29kB)
[INFO] Fetching org.eclipse.wst.common.frameworks_1.2.201.v201707201954.jar.pack.gz from http://download.eclipse.org/releases/2019-03/201903201000/plugins/ (43.29kB)
[INFO] Fetching org.eclipse.wst.common.project.facet.core_1.4.400.v201808012032.jar.pack.gz from http://download.eclipse.org/releases/2019-03/201903201000/plugins/ (120.05kB)
[INFO] Fetching org.eclipse.wst.common.project.facet.core_1.4.400.v201808012032.jar.pack.gz from http://download.eclipse.org/releases/2019-03/201903201000/plugins/ (120.05kB)
[INFO] Fetching org.eclipse.wst.jsdt.core_2.0.302.v201804042202.jar.pack.gz from http://download.eclipse.org/releases/2019-03/201903201000/plugins/ (1.2MB)
[INFO] Fetching org.eclipse.wst.jsdt.core_2.0.302.v201804042202.jar.pack.gz from http://download.eclipse.org/releases/2019-03/201903201000/plugins/ (1.2MB)
[INFO] Fetching org.eclipse.wst.validation_1.2.701.v201810290944.jar.pack.gz from http://download.eclipse.org/releases/2019-03/201903201000/plugins/ (134.47kB)
[INFO] Fetching org.eclipse.wst.validation_1.2.701.v201810290944.jar.pack.gz from http://download.eclipse.org/releases/2019-03/201903201000/plugins/ (134.47kB)
[INFO] Fetching org.eclipse.wst.jsdt.debug.core_3.2.200.v201610211901.jar.pack.gz from http://download.eclipse.org/releases/2019-03/201903201000/plugins/ (52.39kB)
[INFO] Fetching org.eclipse.wst.jsdt.debug.core_3.2.200.v201610211901.jar.pack.gz from http://download.eclipse.org/releases/2019-03/201903201000/plugins/ (52.39kB)
[INFO] Fetching org.eclipse.wst.jsdt.manipulation_1.0.601.v201602241911.jar.pack.gz from http://download.eclipse.org/releases/2019-03/201903201000/plugins/ (21.41kB)
[INFO] Fetching org.eclipse.wst.jsdt.manipulation_1.0.601.v201602241911.jar.pack.gz from http://download.eclipse.org/releases/2019-03/201903201000/plugins/ (21.41kB)
[WARNING] The following locally built units have been used to resolve project dependencies:
[WARNING]   org.eclipse.ease.lang.javascript/0.8.0.I201912121852
[WARNING]   org.eclipse.ease.ui/0.8.0.I202003230858
[WARNING]   org.eclipse.ease.lang.javascript.rhino/0.8.0.I202003021730
[WARNING]   org.eclipse.ease/0.8.0.I202006040906
[WARNING]   org.eclipse.ease.testhelper/0.8.0.I202003020926
[WARNING]   org.eclipse.ease.classloader/0.8.0.I201910171213
[INFO] Resolving class path of MavenProject: org.eclipse.ease:org.eclipse.ease.lang.javascript.rhino.test:0.8.0-SNAPSHOT @ /home/jenkins/agent/workspace/ease.verify.core.target.2019-03/tests/org.eclipse.ease.lang.javascript.rhino.test/pom.xml
[INFO] Computing target platform for MavenProject: org.eclipse.ease:org.eclipse.ease.lang.javascript.test:0.8.0-SNAPSHOT @ /home/jenkins/agent/workspace/ease.verify.core.target.2019-03/tests/org.eclipse.ease.lang.javascript.test/pom.xml
[INFO] Resolving dependencies of MavenProject: org.eclipse.ease:org.eclipse.ease.lang.javascript.test:0.8.0-SNAPSHOT @ /home/jenkins/agent/workspace/ease.verify.core.target.2019-03/tests/org.eclipse.ease.lang.javascript.test/pom.xml
[WARNING] The following locally built units have been used to resolve project dependencies:
[WARNING]   org.eclipse.ease.lang.javascript/0.8.0.I201912121852
[WARNING]   org.eclipse.ease.ui/0.8.0.I202003230858
[WARNING]   org.eclipse.ease.lang.javascript.rhino/0.8.0.I202003021730
[WARNING]   org.eclipse.ease/0.8.0.I202006040906
[WARNING]   org.eclipse.ease.classloader/0.8.0.I201910171213
[INFO] Resolving class path of MavenProject: org.eclipse.ease:org.eclipse.ease.lang.javascript.test:0.8.0-SNAPSHOT @ /home/jenkins/agent/workspace/ease.verify.core.target.2019-03/tests/org.eclipse.ease.lang.javascript.test/pom.xml
[INFO] Computing target platform for MavenProject: org.eclipse.ease:org.eclipse.ease.lang.python.test:0.8.0-SNAPSHOT @ /home/jenkins/agent/workspace/ease.verify.core.target.2019-03/tests/org.eclipse.ease.lang.python.test/pom.xml
[INFO] Resolving dependencies of MavenProject: org.eclipse.ease:org.eclipse.ease.lang.python.test:0.8.0-SNAPSHOT @ /home/jenkins/agent/workspace/ease.verify.core.target.2019-03/tests/org.eclipse.ease.lang.python.test/pom.xml
[WARNING] The following locally built units have been used to resolve project dependencies:
[WARNING]   org.eclipse.ease.ui/0.8.0.I202003230858
[WARNING]   org.eclipse.ease/0.8.0.I202006040906
[WARNING]   org.eclipse.ease.lang.python/0.8.0.I202006051411
[WARNING]   org.eclipse.ease.classloader/0.8.0.I201910171213
[INFO] Resolving class path of MavenProject: org.eclipse.ease:org.eclipse.ease.lang.python.test:0.8.0-SNAPSHOT @ /home/jenkins/agent/workspace/ease.verify.core.target.2019-03/tests/org.eclipse.ease.lang.python.test/pom.xml
[INFO] Computing target platform for MavenProject: org.eclipse.ease:org.eclipse.ease.lang.python.jython.test:0.8.0-SNAPSHOT @ /home/jenkins/agent/workspace/ease.verify.core.target.2019-03/tests/org.eclipse.ease.lang.python.jython.test/pom.xml
[INFO] Resolving dependencies of MavenProject: org.eclipse.ease:org.eclipse.ease.lang.python.jython.test:0.8.0-SNAPSHOT @ /home/jenkins/agent/workspace/ease.verify.core.target.2019-03/tests/org.eclipse.ease.lang.python.jython.test/pom.xml
[WARNING] The following locally built units have been used to resolve project dependencies:
[WARNING]   org.eclipse.ease.ui/0.8.0.I202003230858
[WARNING]   org.eclipse.ease/0.8.0.I202006040906
[WARNING]   org.eclipse.ease.lang.python.jython/0.8.0.I201911262145
[WARNING]   org.eclipse.ease.testhelper/0.8.0.I202003020926
[WARNING]   org.eclipse.ease.lang.python/0.8.0.I202006051411
[WARNING]   org.eclipse.ease.classloader/0.8.0.I201910171213
[INFO] Resolving class path of MavenProject: org.eclipse.ease:org.eclipse.ease.lang.python.jython.test:0.8.0-SNAPSHOT @ /home/jenkins/agent/workspace/ease.verify.core.target.2019-03/tests/org.eclipse.ease.lang.python.jython.test/pom.xml
[INFO] Computing target platform for MavenProject: org.eclipse.ease:org.eclipse.ease.lang.python.py4j.test:0.8.0-SNAPSHOT @ /home/jenkins/agent/workspace/ease.verify.core.target.2019-03/tests/org.eclipse.ease.lang.python.py4j.test/pom.xml
[INFO] Resolving dependencies of MavenProject: org.eclipse.ease:org.eclipse.ease.lang.python.py4j.test:0.8.0-SNAPSHOT @ /home/jenkins/agent/workspace/ease.verify.core.target.2019-03/tests/org.eclipse.ease.lang.python.py4j.test/pom.xml
[INFO] Fetching py4j-java_0.10.4.bnd-LoVopg.jar from https://dl.bintray.com/py4j/py4j-eclipse/0.10.4/plugins/ (112.34kB)
[INFO] Fetching py4j-java_0.10.4.bnd-LoVopg.jar from https://dl.bintray.com/py4j/py4j-eclipse/0.10.4/plugins/ (112.34kB)
[INFO] Fetching py4j-python_0.10.4.bnd-2odeag.jar from https://dl.bintray.com/py4j/py4j-eclipse/0.10.4/plugins/ (74.83kB)
[INFO] Fetching py4j-python_0.10.4.bnd-2odeag.jar from https://dl.bintray.com/py4j/py4j-eclipse/0.10.4/plugins/ (74.83kB)
[WARNING] The following locally built units have been used to resolve project dependencies:
[WARNING]   org.eclipse.ease.ui/0.8.0.I202003230858
[WARNING]   org.eclipse.ease.lang.python.py4j/0.8.0.I202002261020
[WARNING]   org.eclipse.ease/0.8.0.I202006040906
[WARNING]   org.eclipse.ease.testhelper/0.8.0.I202003020926
[WARNING]   org.eclipse.ease.lang.python/0.8.0.I202006051411
[WARNING]   org.eclipse.ease.classloader/0.8.0.I201910171213
[INFO] Resolving class path of MavenProject: org.eclipse.ease:org.eclipse.ease.lang.python.py4j.test:0.8.0-SNAPSHOT @ /home/jenkins/agent/workspace/ease.verify.core.target.2019-03/tests/org.eclipse.ease.lang.python.py4j.test/pom.xml
[INFO] Computing target platform for MavenProject: org.eclipse.ease:org.eclipse.ease.lang.scriptarchive.test:0.8.0-SNAPSHOT @ /home/jenkins/agent/workspace/ease.verify.core.target.2019-03/tests/org.eclipse.ease.lang.scriptarchive.test/pom.xml
[INFO] Resolving dependencies of MavenProject: org.eclipse.ease:org.eclipse.ease.lang.scriptarchive.test:0.8.0-SNAPSHOT @ /home/jenkins/agent/workspace/ease.verify.core.target.2019-03/tests/org.eclipse.ease.lang.scriptarchive.test/pom.xml
[WARNING] The following locally built units have been used to resolve project dependencies:
[WARNING]   org.eclipse.ease.lang.javascript/0.8.0.I201912121852
[WARNING]   org.eclipse.ease.ui/0.8.0.I202003230858
[WARNING]   org.eclipse.ease.lang.javascript.rhino/0.8.0.I202003021730
[WARNING]   org.eclipse.ease/0.8.0.I202006040906
[WARNING]   org.eclipse.ease.lang.scriptarchive/0.8.0.I201910171213
[WARNING]   org.eclipse.ease.classloader/0.8.0.I201910171213
[INFO] Resolving class path of MavenProject: org.eclipse.ease:org.eclipse.ease.lang.scriptarchive.test:0.8.0-SNAPSHOT @ /home/jenkins/agent/workspace/ease.verify.core.target.2019-03/tests/org.eclipse.ease.lang.scriptarchive.test/pom.xml
[INFO] Computing target platform for MavenProject: org.eclipse.ease:org.eclipse.ease.ui.test:0.8.0-SNAPSHOT @ /home/jenkins/agent/workspace/ease.verify.core.target.2019-03/tests/org.eclipse.ease.ui.test/pom.xml
[INFO] Resolving dependencies of MavenProject: org.eclipse.ease:org.eclipse.ease.ui.test:0.8.0-SNAPSHOT @ /home/jenkins/agent/workspace/ease.verify.core.target.2019-03/tests/org.eclipse.ease.ui.test/pom.xml
[INFO] Fetching org.apache.lucene.analyzers-common_7.5.0.v20181003-1532.jar.pack.gz from http://download.eclipse.org/releases/2019-03/201903201000/plugins/ (692.97kB)
[INFO] Fetching org.apache.lucene.analyzers-common_7.5.0.v20181003-1532.jar.pack.gz from http://download.eclipse.org/releases/2019-03/201903201000/plugins/ (692.97kB)
[INFO] Fetching org.apache.lucene.core_7.5.0.v20181003-1532.jar.pack.gz from http://download.eclipse.org/releases/2019-03/201903201000/plugins/ (899.59kB)
[INFO] Fetching org.apache.lucene.core_7.5.0.v20181003-1532.jar.pack.gz from http://download.eclipse.org/releases/2019-03/201903201000/plugins/ (899.59kB)
[INFO] Fetching org.apache.lucene.analyzers-smartcn_7.5.0.v20181003-1532.jar.pack.gz from http://download.eclipse.org/releases/2019-03/201903201000/plugins/ (3.42MB)
[INFO] Fetching org.apache.lucene.analyzers-smartcn_7.5.0.v20181003-1532.jar.pack.gz from http://download.eclipse.org/releases/2019-03/201903201000/plugins/ (3.42MB)
[INFO] Fetching org.eclipse.jdt.ui_3.17.0.v20190304-0658.jar.pack.gz from http://download.eclipse.org/releases/2019-03/201903201000/plugins/ (4MB)
[INFO] Fetching org.eclipse.jdt.ui_3.17.0.v20190304-0658.jar.pack.gz from http://download.eclipse.org/releases/2019-03/201903201000/plugins/ (4MB)
[INFO] Fetching org.eclipse.jdt.core_3.17.0.v20190306-2240.jar from http://download.eclipse.org/releases/2019-03/201903201000/plugins/ (6.6MB)
[INFO] Fetching org.eclipse.jdt.core_3.17.0.v20190306-2240.jar from http://download.eclipse.org/releases/2019-03/201903201000/plugins/ (6.6MB)
[INFO] Fetching org.objectweb.asm_7.0.0.v20181030-2244.jar.pack.gz from http://download.eclipse.org/releases/2019-03/201903201000/plugins/ (58.69kB)
[INFO] Fetching org.objectweb.asm_7.0.0.v20181030-2244.jar.pack.gz from http://download.eclipse.org/releases/2019-03/201903201000/plugins/ (58.69kB)
[INFO] Fetching org.eclipse.help.ui_4.1.400.v20190218-1039.jar.pack.gz from http://download.eclipse.org/releases/2019-03/201903201000/plugins/ (149.4kB)
[INFO] Fetching org.eclipse.help.ui_4.1.400.v20190218-1039.jar.pack.gz from http://download.eclipse.org/releases/2019-03/201903201000/plugins/ (149.4kB)
[INFO] Fetching org.eclipse.help.webapp_3.9.400.v20190212-1458.jar.pack.gz from http://download.eclipse.org/releases/2019-03/201903201000/plugins/ (242.1kB)
[INFO] Fetching org.eclipse.help.webapp_3.9.400.v20190212-1458.jar.pack.gz from http://download.eclipse.org/releases/2019-03/201903201000/plugins/ (242.1kB)
[INFO] Fetching org.eclipse.equinox.http.jetty_3.7.0.v20190305-2216.jar.pack.gz from http://download.eclipse.org/releases/2019-03/201903201000/plugins/ (16.63kB)
[INFO] Fetching org.eclipse.equinox.http.jetty_3.7.0.v20190305-2216.jar.pack.gz from http://download.eclipse.org/releases/2019-03/201903201000/plugins/ (16.63kB)
[INFO] Fetching org.eclipse.ui.browser_3.6.300.v20180828-0837.jar.pack.gz from http://download.eclipse.org/releases/2019-03/201903201000/plugins/ (97.35kB)
[INFO] Fetching org.eclipse.ui.browser_3.6.300.v20180828-0837.jar.pack.gz from http://download.eclipse.org/releases/2019-03/201903201000/plugins/ (97.35kB)
[INFO] Fetching org.eclipse.equinox.http.servlet_1.6.0.v20190305-2225.jar.pack.gz from http://download.eclipse.org/releases/2019-03/201903201000/plugins/ (76.28kB)
[INFO] Fetching org.eclipse.equinox.http.servlet_1.6.0.v20190305-2225.jar.pack.gz from http://download.eclipse.org/releases/2019-03/201903201000/plugins/ (76.28kB)
[INFO] Fetching org.eclipse.jetty.http_9.4.15.v20190215.jar from http://download.eclipse.org/releases/2019-03/201903201000/plugins/ (211.68kB)
[INFO] Fetching org.eclipse.jetty.http_9.4.15.v20190215.jar from http://download.eclipse.org/releases/2019-03/201903201000/plugins/ (211.68kB)
[INFO] Fetching org.eclipse.jetty.server_9.4.15.v20190215.jar from http://download.eclipse.org/releases/2019-03/201903201000/plugins/ (656.68kB)
[INFO] Fetching org.eclipse.jetty.server_9.4.15.v20190215.jar from http://download.eclipse.org/releases/2019-03/201903201000/plugins/ (656.68kB)
[INFO] Fetching org.eclipse.jetty.servlet_9.4.15.v20190215.jar from http://download.eclipse.org/releases/2019-03/201903201000/plugins/ (127.96kB)
[INFO] Fetching org.eclipse.jetty.servlet_9.4.15.v20190215.jar from http://download.eclipse.org/releases/2019-03/201903201000/plugins/ (127.96kB)
[INFO] Fetching org.eclipse.jetty.util_9.4.15.v20190215.jar from http://download.eclipse.org/releases/2019-03/201903201000/plugins/ (532.25kB)
[INFO] Fetching org.eclipse.jetty.util_9.4.15.v20190215.jar from http://download.eclipse.org/releases/2019-03/201903201000/plugins/ (532.25kB)
[INFO] Fetching org.eclipse.equinox.jsp.jasper_1.1.200.v20190214-1948.jar.pack.gz from http://download.eclipse.org/releases/2019-03/201903201000/plugins/ (14.66kB)
[INFO] Fetching org.eclipse.equinox.jsp.jasper_1.1.200.v20190214-1948.jar.pack.gz from http://download.eclipse.org/releases/2019-03/201903201000/plugins/ (14.66kB)
[INFO] Fetching org.eclipse.equinox.jsp.jasper.registry_1.1.200.v20190214-1948.jar.pack.gz from http://download.eclipse.org/releases/2019-03/201903201000/plugins/ (8.7kB)
[INFO] Fetching org.eclipse.equinox.jsp.jasper.registry_1.1.200.v20190214-1948.jar.pack.gz from http://download.eclipse.org/releases/2019-03/201903201000/plugins/ (8.7kB)
[INFO] Fetching org.eclipse.help.base_4.2.500.v20190307-0500.jar.pack.gz from http://download.eclipse.org/releases/2019-03/201903201000/plugins/ (162.49kB)
[INFO] Fetching org.eclipse.help.base_4.2.500.v20190307-0500.jar.pack.gz from http://download.eclipse.org/releases/2019-03/201903201000/plugins/ (162.49kB)
[INFO] Fetching org.eclipse.jdt.core.manipulation_1.11.100.v20190301-1946.jar.pack.gz from http://download.eclipse.org/releases/2019-03/201903201000/plugins/ (266.38kB)
[INFO] Fetching org.eclipse.jdt.core.manipulation_1.11.100.v20190301-1946.jar.pack.gz from http://download.eclipse.org/releases/2019-03/201903201000/plugins/ (266.38kB)
[INFO] Fetching org.eclipse.jdt.launching_3.13.0.v20190222-0937.jar.pack.gz from http://download.eclipse.org/releases/2019-03/201903201000/plugins/ (271.05kB)
[INFO] Fetching org.eclipse.jdt.launching_3.13.0.v20190222-0937.jar.pack.gz from http://download.eclipse.org/releases/2019-03/201903201000/plugins/ (271.05kB)
[INFO] Fetching org.eclipse.jdt.debug_3.12.200.v20190218-2230.jar.pack.gz from http://download.eclipse.org/releases/2019-03/201903201000/plugins/ (928.19kB)
[INFO] Fetching org.eclipse.jdt.debug_3.12.200.v20190218-2230.jar.pack.gz from http://download.eclipse.org/releases/2019-03/201903201000/plugins/ (928.19kB)
[INFO] Fetching org.eclipse.jetty.io_9.4.15.v20190215.jar from http://download.eclipse.org/releases/2019-03/201903201000/plugins/ (162.03kB)
[INFO] Fetching org.eclipse.jetty.io_9.4.15.v20190215.jar from http://download.eclipse.org/releases/2019-03/201903201000/plugins/ (162.03kB)
[INFO] Fetching org.eclipse.jetty.security_9.4.15.v20190215.jar from http://download.eclipse.org/releases/2019-03/201903201000/plugins/ (123.46kB)
[INFO] Fetching org.eclipse.jetty.security_9.4.15.v20190215.jar from http://download.eclipse.org/releases/2019-03/201903201000/plugins/ (123.46kB)
[WARNING] The following locally built units have been used to resolve project dependencies:
[WARNING]   org.eclipse.ease.ui/0.8.0.I202003230858
[WARNING]   org.eclipse.ease.ui.completions.java/0.8.0.I201910171213
[WARNING]   org.eclipse.ease/0.8.0.I202006040906
[WARNING]   org.eclipse.ease.classloader/0.8.0.I201910171213
[INFO] Resolving class path of MavenProject: org.eclipse.ease:org.eclipse.ease.ui.test:0.8.0-SNAPSHOT @ /home/jenkins/agent/workspace/ease.verify.core.target.2019-03/tests/org.eclipse.ease.ui.test/pom.xml
[WARNING] The project org.eclipse.ease:org.eclipse.ease.releng:pom:0.8.0-SNAPSHOT uses prerequisites which is only intended for maven-plugin projects but not for non maven-plugin projects. For such purposes you should use the maven-enforcer-plugin. See https://maven.apache.org/enforcer/enforcer-rules/requireMavenVersion.html
[WARNING] [jenkins-event-spy] Unexpected Maven project file name 'target-tests-pom.xml', problems may occur
[INFO] ------------------------------------------------------------------------
[INFO] Reactor Build Order:
[INFO] 
[INFO] org.eclipse.ease.releng                                            [pom]
[INFO] org.eclipse.ease.releng.target               [eclipse-target-definition]
[INFO] org.eclipse.ease.test                              [eclipse-test-plugin]
[INFO] org.eclipse.ease.lang.javascript.nashorn.test      [eclipse-test-plugin]
[INFO] org.eclipse.ease.lang.javascript.rhino.test        [eclipse-test-plugin]
[INFO] org.eclipse.ease.lang.javascript.test              [eclipse-test-plugin]
[INFO] org.eclipse.ease.lang.python.test                  [eclipse-test-plugin]
[INFO] org.eclipse.ease.lang.python.jython.test           [eclipse-test-plugin]
[INFO] org.eclipse.ease.lang.python.py4j.test             [eclipse-test-plugin]
[INFO] org.eclipse.ease.lang.scriptarchive.test           [eclipse-test-plugin]
[INFO] org.eclipse.ease.ui.test                           [eclipse-test-plugin]
[WARNING] [jenkins-event-spy] Unexpected Maven project file name 'target-tests-pom.xml', problems may occur
[INFO] 
[INFO] --------------< org.eclipse.ease:org.eclipse.ease.releng >--------------
[INFO] Building org.eclipse.ease.releng 0.8.0-SNAPSHOT                   [1/11]
[INFO] --------------------------------[ pom ]---------------------------------
[WARNING] [jenkins-event-spy] Unexpected Maven project file name 'target-tests-pom.xml', problems may occur
[INFO] 
[INFO] ----------< org.eclipse.ease:org.eclipse.ease.releng.target >-----------
[INFO] Building org.eclipse.ease.releng.target 0.8.0-SNAPSHOT            [2/11]
[INFO] ---------------------[ eclipse-target-definition ]----------------------
[INFO] 
[INFO] --- tycho-source-plugin:1.3.0:plugin-source (plugin-source) @ org.eclipse.ease.releng.target ---
[INFO] 
[INFO] --- tycho-packaging-plugin:1.3.0:package-target-definition (default-package-target-definition) @ org.eclipse.ease.releng.target ---
[INFO] 
[INFO] --- tycho-source-feature-plugin:1.3.0:source-feature (source-feature) @ org.eclipse.ease.releng.target ---
[INFO] 
[INFO] --- tycho-p2-plugin:1.3.0:p2-metadata (attached-p2-metadata) @ org.eclipse.ease.releng.target ---
[INFO] 
[INFO] ---------------< org.eclipse.ease:org.eclipse.ease.test >---------------
[INFO] Building org.eclipse.ease.test 0.8.0-SNAPSHOT                     [3/11]
[INFO] ------------------------[ eclipse-test-plugin ]-------------------------
[INFO] 
[INFO] --- tycho-packaging-plugin:1.3.0:build-qualifier (default-build-qualifier) @ org.eclipse.ease.test ---
[INFO] The project's OSGi version is 0.8.0.I201910171213
[INFO] 
[INFO] --- tycho-packaging-plugin:1.3.0:validate-id (default-validate-id) @ org.eclipse.ease.test ---
[INFO] 
[INFO] --- tycho-packaging-plugin:1.3.0:validate-version (default-validate-version) @ org.eclipse.ease.test ---
[INFO] 
[INFO] --- maven-resources-plugin:2.4.3:resources (default-resources) @ org.eclipse.ease.test ---
[INFO] Using 'UTF-8' encoding to copy filtered resources.
[INFO] skip non existing resourceDirectory /home/jenkins/agent/workspace/ease.verify.core.target.2019-03/tests/org.eclipse.ease.test/src/main/resources
[INFO] 
[INFO] --- tycho-compiler-plugin:1.3.0:compile (default-compile) @ org.eclipse.ease.test ---
[INFO] Nothing to compile - all classes are up to date
[INFO] 
[INFO] --- maven-resources-plugin:2.4.3:testResources (default-testResources) @ org.eclipse.ease.test ---
[INFO] Using 'UTF-8' encoding to copy filtered resources.
[INFO] skip non existing resourceDirectory /home/jenkins/agent/workspace/ease.verify.core.target.2019-03/tests/org.eclipse.ease.test/src/test/resources
[INFO] 
[INFO] --- tycho-source-plugin:1.3.0:plugin-source (plugin-source) @ org.eclipse.ease.test ---
[INFO] Building jar: /home/jenkins/agent/workspace/ease.verify.core.target.2019-03/tests/org.eclipse.ease.test/target/org.eclipse.ease.test-0.8.0-SNAPSHOT-sources.jar
[INFO] 
[INFO] --- target-platform-configuration:1.3.0:target-platform (default-target-platform) @ org.eclipse.ease.test ---
[INFO] 
[INFO] --- tycho-packaging-plugin:1.3.0:package-plugin (default-package-plugin) @ org.eclipse.ease.test ---
[INFO] Building jar: /home/jenkins/agent/workspace/ease.verify.core.target.2019-03/tests/org.eclipse.ease.test/target/org.eclipse.ease.test-0.8.0-SNAPSHOT.jar
[INFO] 
[INFO] --- tycho-p2-plugin:1.3.0:p2-metadata-default (default-p2-metadata-default) @ org.eclipse.ease.test ---
[INFO] 
[INFO] --- tycho-source-feature-plugin:1.3.0:source-feature (source-feature) @ org.eclipse.ease.test ---
[INFO] 
[INFO] --- tycho-p2-plugin:1.3.0:p2-metadata (attached-p2-metadata) @ org.eclipse.ease.test ---
[INFO] 
[INFO] --- tycho-surefire-plugin:1.3.0:test (default-test) @ org.eclipse.ease.test ---
[INFO] Expected eclipse log file: /home/jenkins/agent/workspace/ease.verify.core.target.2019-03/tests/org.eclipse.ease.test/target/work/data/.metadata/.log
[INFO] Command line:
	[/opt/tools/java/oracle/jdk-8/1.8.0_202/jre/bin/java, -Dosgi.noShutdown=false, -Dosgi.os=linux, -Dosgi.ws=gtk, -Dosgi.arch=x86_64, -Dosgi.clean=true, -jar, /home/jenkins/.m2/repository/p2/osgi/bundle/org.eclipse.equinox.launcher/1.5.300.v20190213-1655/org.eclipse.equinox.launcher-1.5.300.v20190213-1655.jar, -data, /home/jenkins/agent/workspace/ease.verify.core.target.2019-03/tests/org.eclipse.ease.test/target/work/data, -install, /home/jenkins/agent/workspace/ease.verify.core.target.2019-03/tests/org.eclipse.ease.test/target/work, -configuration, /home/jenkins/agent/workspace/ease.verify.core.target.2019-03/tests/org.eclipse.ease.test/target/work/configuration, -application, org.eclipse.tycho.surefire.osgibooter.headlesstest, -testproperties, /home/jenkins/agent/workspace/ease.verify.core.target.2019-03/tests/org.eclipse.ease.test/target/surefire.properties]
Picked up JAVA_TOOL_OPTIONS: -XX:+IgnoreUnrecognizedVMOptions -XX:+UseContainerSupport -XX:+UnlockExperimentalVMOptions -XX:+UseCGroupMemoryLimitForHeap -Dmaven.ext.class.path="/home/jenkins/agent/workspace/ease.verify.core.target.2019-03@tmp/withMavene6284ffb/pipeline-maven-spy.jar" -Dorg.jenkinsci.plugins.pipeline.maven.reportsFolder="/home/jenkins/agent/workspace/ease.verify.core.target.2019-03@tmp/withMavene6284ffb" 
Picked up _JAVA_OPTIONS: -XX:MaxRAMPercentage=64.0
Running org.eclipse.ease.tools.StringToolsTest
Tests run: 8, Failures: 0, Errors: 0, Skipped: 0, Time elapsed: 0.021 s - in org.eclipse.ease.tools.StringToolsTest
parseArgumentsNull(org.eclipse.ease.tools.StringToolsTest)  Time elapsed: 0.002 s
parseArgumentsQuotedSingle(org.eclipse.ease.tools.StringToolsTest)  Time elapsed: 0.001 s
parseArgumentsEmpty(org.eclipse.ease.tools.StringToolsTest)  Time elapsed: 0 s
parseArgumentsMixedMultiple(org.eclipse.ease.tools.StringToolsTest)  Time elapsed: 0 s
parseArgumentsMixedMultipleLines(org.eclipse.ease.tools.StringToolsTest)  Time elapsed: 0.001 s
parseArgumentsNonQuotedMultiple(org.eclipse.ease.tools.StringToolsTest)  Time elapsed: 0 s
parseArgumentsNonQuotedSingle(org.eclipse.ease.tools.StringToolsTest)  Time elapsed: 0 s
parseArgumentsQuotedMultiple(org.eclipse.ease.tools.StringToolsTest)  Time elapsed: 0 s
Running org.eclipse.ease.tools.ResourceToolsTest
Tests run: 47, Failures: 0, Errors: 0, Skipped: 0, Time elapsed: 0.23 s - in org.eclipse.ease.tools.ResourceToolsTest
resolveScriptLocation(org.eclipse.ease.tools.ResourceToolsTest)  Time elapsed: 0.185 s
getWorkspaceInputStream(org.eclipse.ease.tools.ResourceToolsTest)  Time elapsed: 0 s
resolvePlatformURI(org.eclipse.ease.tools.ResourceToolsTest)  Time elapsed: 0.001 s
resolveScriptLocationWithSpacesInPath(org.eclipse.ease.tools.ResourceToolsTest)  Time elapsed: 0.002 s
resolveURL(org.eclipse.ease.tools.ResourceToolsTest)  Time elapsed: 0.002 s
invalidIsAbsolute(org.eclipse.ease.tools.ResourceToolsTest)  Time elapsed: 0 s
getFilesystemInputStream(org.eclipse.ease.tools.ResourceToolsTest)  Time elapsed: 0 s
toRelativeLocationInWorkspace(org.eclipse.ease.tools.ResourceToolsTest)  Time elapsed: 0.001 s
checkOperatingSystem(org.eclipse.ease.tools.ResourceToolsTest)  Time elapsed: 0 s
inputStreamToString(org.eclipse.ease.tools.ResourceToolsTest)  Time elapsed: 0 s
fileSystemToAbsoluteLocationOnLinux(org.eclipse.ease.tools.ResourceToolsTest)  Time elapsed: 0 s
exists(org.eclipse.ease.tools.ResourceToolsTest)  Time elapsed: 0 s
resolveRelativeInWorkspace(org.eclipse.ease.tools.ResourceToolsTest)  Time elapsed: 0 s
isFile(org.eclipse.ease.tools.ResourceToolsTest)  Time elapsed: 0 s
invalidToFile(org.eclipse.ease.tools.ResourceToolsTest)  Time elapsed: 0 s
resolveAbsoluteInFileSystem(org.eclipse.ease.tools.ResourceToolsTest)  Time elapsed: 0.001 s
resolveWindowsRoot(org.eclipse.ease.tools.ResourceToolsTest)  Time elapsed: 0 s
resolveRelativeInFileSystemOnWindows(org.eclipse.ease.tools.ResourceToolsTest)  Time elapsed: 0 s
isAbsoluteFileSystemPathOnWindows(org.eclipse.ease.tools.ResourceToolsTest)  Time elapsed: 0 s
readerToString(org.eclipse.ease.tools.ResourceToolsTest)  Time elapsed: 0.001 s
workspaceFileToString(org.eclipse.ease.tools.ResourceToolsTest)  Time elapsed: 0 s
toFile(org.eclipse.ease.tools.ResourceToolsTest)  Time elapsed: 0 s
toProjectRelativeLocation(org.eclipse.ease.tools.ResourceToolsTest)  Time elapsed: 0 s
getInvalidInputStream(org.eclipse.ease.tools.ResourceToolsTest)  Time elapsed: 0.005 s
resolveRelativeInFileSystemOnLinux(org.eclipse.ease.tools.ResourceToolsTest)  Time elapsed: 0.001 s
isFolder(org.eclipse.ease.tools.ResourceToolsTest)  Time elapsed: 0 s
fileSystemToAbsoluteLocationOnWindows(org.eclipse.ease.tools.ResourceToolsTest)  Time elapsed: 0 s
isAbsoluteWorkspacePath(org.eclipse.ease.tools.ResourceToolsTest)  Time elapsed: 0 s
isAbsoluteFileSystemPathOnLinux(org.eclipse.ease.tools.ResourceToolsTest)  Time elapsed: 0 s
resolveInvalid(org.eclipse.ease.tools.ResourceToolsTest)  Time elapsed: 0 s
resolveAbsoluteInFileSystemOnWindows(org.eclipse.ease.tools.ResourceToolsTest)  Time elapsed: 0 s
resolveScriptLocationWithSpacesInDomain(org.eclipse.ease.tools.ResourceToolsTest)  Time elapsed: 0.004 s
resolveRelativefromWorkspaceToFilesystem(org.eclipse.ease.tools.ResourceToolsTest)  Time elapsed: 0 s
resolveRelativeWithoutBaseFile(org.eclipse.ease.tools.ResourceToolsTest)  Time elapsed: 0 s
resolveInWorkspace(org.eclipse.ease.tools.ResourceToolsTest)  Time elapsed: 0 s
resolveScriptLocationWithSpecialCharactersInPath(org.eclipse.ease.tools.ResourceToolsTest)  Time elapsed: 0.001 s
filesystemFileToString(org.eclipse.ease.tools.ResourceToolsTest)  Time elapsed: 0 s
createURI(org.eclipse.ease.tools.ResourceToolsTest)  Time elapsed: 0 s
uriToAbsoluteLocation(org.eclipse.ease.tools.ResourceToolsTest)  Time elapsed: 0 s
createFolder(org.eclipse.ease.tools.ResourceToolsTest)  Time elapsed: 0.003 s
workspaceToAbsoluteLocation(org.eclipse.ease.tools.ResourceToolsTest)  Time elapsed: 0 s
resolveAbsoluteInFileSystemOnLinux(org.eclipse.ease.tools.ResourceToolsTest)  Time elapsed: 0 s
invalidToString(org.eclipse.ease.tools.ResourceToolsTest)  Time elapsed: 0 s
resolveRelativeURIs(org.eclipse.ease.tools.ResourceToolsTest)  Time elapsed: 0.001 s
resolveRelativeInFileSystem(org.eclipse.ease.tools.ResourceToolsTest)  Time elapsed: 0 s
resolveScriptLocationWithSpecialCharactersInDomain(org.eclipse.ease.tools.ResourceToolsTest)  Time elapsed: 0.003 s
isAbsoluteURL(org.eclipse.ease.tools.ResourceToolsTest)  Time elapsed: 0 s
Running org.eclipse.ease.tools.RunnableWithResultTest
Tests run: 2, Failures: 0, Errors: 0, Skipped: 0, Time elapsed: 0.001 s - in org.eclipse.ease.tools.RunnableWithResultTest
testException(org.eclipse.ease.tools.RunnableWithResultTest)  Time elapsed: 0 s
testResult(org.eclipse.ease.tools.RunnableWithResultTest)  Time elapsed: 0 s
Running org.eclipse.ease.ScriptTest
Tests run: 13, Failures: 0, Errors: 0, Skipped: 0, Time elapsed: 0.01 s - in org.eclipse.ease.ScriptTest
codeFromScriptable(org.eclipse.ease.ScriptTest)  Time elapsed: 0.005 s
codeFromFilesystemFile(org.eclipse.ease.ScriptTest)  Time elapsed: 0.002 s
getCodeStream(org.eclipse.ease.ScriptTest)  Time elapsed: 0 s
getFile(org.eclipse.ease.ScriptTest)  Time elapsed: 0 s
codeFromStringBuilder(org.eclipse.ease.ScriptTest)  Time elapsed: 0 s
getResult(org.eclipse.ease.ScriptTest)  Time elapsed: 0 s
getException(org.eclipse.ease.ScriptTest)  Time elapsed: 0 s
codeFromWorkspaceFile(org.eclipse.ease.ScriptTest)  Time elapsed: 0 s
codeFromInputStream(org.eclipse.ease.ScriptTest)  Time elapsed: 0 s
getTitle(org.eclipse.ease.ScriptTest)  Time elapsed: 0 s
getCommand(org.eclipse.ease.ScriptTest)  Time elapsed: 0 s
codeFromReader(org.eclipse.ease.ScriptTest)  Time elapsed: 0.001 s
codeFromString(org.eclipse.ease.ScriptTest)  Time elapsed: 0 s
Running org.eclipse.ease.AbstractScriptEngineTest
testorg.eclipse.ease.ScriptExecutionException: Engine got terminated
java.lang.RuntimeException: ERROR
	at org.eclipse.ease.AbstractScriptEngineTest$MockedScriptEngine.execute(AbstractScriptEngineTest.java:73)
	at org.eclipse.ease.AbstractScriptEngine.inject(AbstractScriptEngine.java:226)
	at org.eclipse.ease.AbstractScriptEngine.run(AbstractScriptEngine.java:277)
	at org.eclipse.core.internal.jobs.Worker.run(Worker.java:63)
1Tests run: 17, Failures: 0, Errors: 0, Skipped: 0, Time elapsed: 6.949 s - in org.eclipse.ease.AbstractScriptEngineTest
extractEmptyArguments(org.eclipse.ease.AbstractScriptEngineTest)  Time elapsed: 0.002 s
setNotNullOutputStream(org.eclipse.ease.AbstractScriptEngineTest)  Time elapsed: 0 s
terminateViaMonitorCancellation(org.eclipse.ease.AbstractScriptEngineTest)  Time elapsed: 1.13 s
inject(org.eclipse.ease.AbstractScriptEngineTest)  Time elapsed: 0.001 s
extractArguments(org.eclipse.ease.AbstractScriptEngineTest)  Time elapsed: 0 s
executeSync(org.eclipse.ease.AbstractScriptEngineTest)  Time elapsed: 1.001 s
setNotNullErrorStream(org.eclipse.ease.AbstractScriptEngineTest)  Time elapsed: 0.001 s
setNullErrorStream(org.eclipse.ease.AbstractScriptEngineTest)  Time elapsed: 0 s
isJob(org.eclipse.ease.AbstractScriptEngineTest)  Time elapsed: 0 s
streamsAvailable(org.eclipse.ease.AbstractScriptEngineTest)  Time elapsed: 0 s
executeValidCodeAndTerminate(org.eclipse.ease.AbstractScriptEngineTest)  Time elapsed: 1.001 s
setNullOutputStream(org.eclipse.ease.AbstractScriptEngineTest)  Time elapsed: 0 s
terminateMultipleTimes(org.eclipse.ease.AbstractScriptEngineTest)  Time elapsed: 0.602 s
engineTerminatesWhenIdle(org.eclipse.ease.AbstractScriptEngineTest)  Time elapsed: 0.001 s
terminateViaTerminateMethod(org.eclipse.ease.AbstractScriptEngineTest)  Time elapsed: 1.202 s
terminateViaMethodCallback(org.eclipse.ease.AbstractScriptEngineTest)  Time elapsed: 1.002 s
executeErrorCodeAndTerminate(org.eclipse.ease.AbstractScriptEngineTest)  Time elapsed: 1.002 s
Running org.eclipse.ease.adapters.ScriptableAdapterTest
Tests run: 5, Failures: 0, Errors: 0, Skipped: 0, Time elapsed: 0.008 s - in org.eclipse.ease.adapters.ScriptableAdapterTest
adaptURI(org.eclipse.ease.adapters.ScriptableAdapterTest)  Time elapsed: 0.007 s
adaptURL(org.eclipse.ease.adapters.ScriptableAdapterTest)  Time elapsed: 0 s
adaptWorkspaceFile(org.eclipse.ease.adapters.ScriptableAdapterTest)  Time elapsed: 0 s
getAdapterList(org.eclipse.ease.adapters.ScriptableAdapterTest)  Time elapsed: 0 s
adaptFilesystemFile(org.eclipse.ease.adapters.ScriptableAdapterTest)  Time elapsed: 0 s
Running org.eclipse.ease.AbstractCodeFactoryTest
Tests run: 1, Failures: 0, Errors: 0, Skipped: 0, Time elapsed: 0.078 s - in org.eclipse.ease.AbstractCodeFactoryTest
createNewKeywordHeader(org.eclipse.ease.AbstractCodeFactoryTest)  Time elapsed: 0.078 s
Running org.eclipse.ease.sign.VerifySignatureTest
Tests run: 1, Failures: 0, Errors: 0, Skipped: 0, Time elapsed: 0.008 s - in org.eclipse.ease.sign.VerifySignatureTest
testWithNonCodeParserScriptType(org.eclipse.ease.sign.VerifySignatureTest)  Time elapsed: 0.007 s
Running org.eclipse.ease.sign.SignatureHelperTest
Tests run: 1, Failures: 0, Errors: 0, Skipped: 0, Time elapsed: 0.01 s - in org.eclipse.ease.sign.SignatureHelperTest
certificateTest(org.eclipse.ease.sign.SignatureHelperTest)  Time elapsed: 0.01 s
Running org.eclipse.ease.ScriptResultTest
Tests run: 4, Failures: 0, Errors: 0, Skipped: 0, Time elapsed: 0.001 s - in org.eclipse.ease.ScriptResultTest
hasException(org.eclipse.ease.ScriptResultTest)  Time elapsed: 0 s
getResult(org.eclipse.ease.ScriptResultTest)  Time elapsed: 0 s
getException(org.eclipse.ease.ScriptResultTest)  Time elapsed: 0 s
isReady(org.eclipse.ease.ScriptResultTest)  Time elapsed: 0 s
Running org.eclipse.ease.AbstractCodeParserTest
Tests run: 5, Failures: 0, Errors: 0, Skipped: 0, Time elapsed: 0.002 s - in org.eclipse.ease.AbstractCodeParserTest
parseCode(org.eclipse.ease.AbstractCodeParserTest)  Time elapsed: 0 s
parseLineHeader(org.eclipse.ease.AbstractCodeParserTest)  Time elapsed: 0 s
parseBlockAfterWhitespace(org.eclipse.ease.AbstractCodeParserTest)  Time elapsed: 0 s
parseEmpty(org.eclipse.ease.AbstractCodeParserTest)  Time elapsed: 0 s
parseBlockHeader(org.eclipse.ease.AbstractCodeParserTest)  Time elapsed: 0 s
Running org.eclipse.ease.AbstractReplScriptEngineTest
testorg.eclipse.ease.ScriptExecutionException: Engine got terminated
java.lang.RuntimeException: ERROR
	at org.eclipse.ease.AbstractReplScriptEngineTest$MockedScriptEngine.execute(AbstractReplScriptEngineTest.java:61)
	at org.eclipse.ease.AbstractScriptEngine.inject(AbstractScriptEngine.java:226)
	at org.eclipse.ease.AbstractScriptEngine.run(AbstractScriptEngine.java:277)
	at org.eclipse.core.internal.jobs.Worker.run(Worker.java:63)
Hello worldHello world1Tests run: 20, Failures: 0, Errors: 0, Skipped: 0, Time elapsed: 7.756 s - in org.eclipse.ease.AbstractReplScriptEngineTest
terminateOnIdleAfterSchedule(org.eclipse.ease.AbstractReplScriptEngineTest)  Time elapsed: 1.024 s
terminateEngine(org.eclipse.ease.AbstractReplScriptEngineTest)  Time elapsed: 1.001 s
keepRunningOnIdle(org.eclipse.ease.AbstractReplScriptEngineTest)  Time elapsed: 1.001 s
extractEmptyArguments(org.eclipse.ease.AbstractReplScriptEngineTest)  Time elapsed: 0.001 s
setNotNullOutputStream(org.eclipse.ease.AbstractReplScriptEngineTest)  Time elapsed: 0 s
terminateViaMonitorCancellation(org.eclipse.ease.AbstractReplScriptEngineTest)  Time elapsed: 1.202 s
inject(org.eclipse.ease.AbstractReplScriptEngineTest)  Time elapsed: 0.001 s
extractArguments(org.eclipse.ease.AbstractReplScriptEngineTest)  Time elapsed: 0 s
executeSync(org.eclipse.ease.AbstractReplScriptEngineTest)  Time elapsed: 0.001 s
setNotNullErrorStream(org.eclipse.ease.AbstractReplScriptEngineTest)  Time elapsed: 0.001 s
setNullErrorStream(org.eclipse.ease.AbstractReplScriptEngineTest)  Time elapsed: 0 s
isJob(org.eclipse.ease.AbstractReplScriptEngineTest)  Time elapsed: 0 s
streamsAvailable(org.eclipse.ease.AbstractReplScriptEngineTest)  Time elapsed: 0 s
executeValidCodeAndTerminate(org.eclipse.ease.AbstractReplScriptEngineTest)  Time elapsed: 1.002 s
setNullOutputStream(org.eclipse.ease.AbstractReplScriptEngineTest)  Time elapsed: 0 s
terminateMultipleTimes(org.eclipse.ease.AbstractReplScriptEngineTest)  Time elapsed: 0.302 s
engineTerminatesWhenIdle(org.eclipse.ease.AbstractReplScriptEngineTest)  Time elapsed: 1.001 s
terminateViaTerminateMethod(org.eclipse.ease.AbstractReplScriptEngineTest)  Time elapsed: 0.202 s
terminateViaMethodCallback(org.eclipse.ease.AbstractReplScriptEngineTest)  Time elapsed: 0.001 s
executeErrorCodeAndTerminate(org.eclipse.ease.AbstractReplScriptEngineTest)  Time elapsed: 1.002 s

Results:

Tests run: 124, Failures: 0, Errors: 0, Skipped: 0

[INFO] All tests passed!
[INFO] 
[INFO] ---< org.eclipse.ease:org.eclipse.ease.lang.javascript.nashorn.test >---
[INFO] Building org.eclipse.ease.lang.javascript.nashorn.test 0.8.0-SNAPSHOT [4/11]
[INFO] ------------------------[ eclipse-test-plugin ]-------------------------
[INFO] 
[INFO] --- tycho-packaging-plugin:1.3.0:build-qualifier (default-build-qualifier) @ org.eclipse.ease.lang.javascript.nashorn.test ---
[INFO] The project's OSGi version is 0.8.0.I201910171213
[INFO] 
[INFO] --- tycho-packaging-plugin:1.3.0:validate-id (default-validate-id) @ org.eclipse.ease.lang.javascript.nashorn.test ---
[INFO] 
[INFO] --- tycho-packaging-plugin:1.3.0:validate-version (default-validate-version) @ org.eclipse.ease.lang.javascript.nashorn.test ---
[INFO] 
[INFO] --- maven-resources-plugin:2.4.3:resources (default-resources) @ org.eclipse.ease.lang.javascript.nashorn.test ---
[INFO] Using 'UTF-8' encoding to copy filtered resources.
[INFO] skip non existing resourceDirectory /home/jenkins/agent/workspace/ease.verify.core.target.2019-03/tests/org.eclipse.ease.lang.javascript.nashorn.test/src/main/resources
[INFO] 
[INFO] --- tycho-compiler-plugin:1.3.0:compile (default-compile) @ org.eclipse.ease.lang.javascript.nashorn.test ---
[INFO] Nothing to compile - all classes are up to date
[INFO] 
[INFO] --- maven-resources-plugin:2.4.3:testResources (default-testResources) @ org.eclipse.ease.lang.javascript.nashorn.test ---
[INFO] Using 'UTF-8' encoding to copy filtered resources.
[INFO] skip non existing resourceDirectory /home/jenkins/agent/workspace/ease.verify.core.target.2019-03/tests/org.eclipse.ease.lang.javascript.nashorn.test/src/test/resources
[INFO] 
[INFO] --- tycho-source-plugin:1.3.0:plugin-source (plugin-source) @ org.eclipse.ease.lang.javascript.nashorn.test ---
[WARNING] Bundle-Vendor header not found in /home/jenkins/agent/workspace/ease.verify.core.target.2019-03/tests/org.eclipse.ease.lang.javascript.nashorn.test/META-INF/MANIFEST.MF, fallback to 'unknown' for source bundle
[INFO] Building jar: /home/jenkins/agent/workspace/ease.verify.core.target.2019-03/tests/org.eclipse.ease.lang.javascript.nashorn.test/target/org.eclipse.ease.lang.javascript.nashorn.test-0.8.0-SNAPSHOT-sources.jar
[INFO] 
[INFO] --- target-platform-configuration:1.3.0:target-platform (default-target-platform) @ org.eclipse.ease.lang.javascript.nashorn.test ---
[INFO] 
[INFO] --- tycho-packaging-plugin:1.3.0:package-plugin (default-package-plugin) @ org.eclipse.ease.lang.javascript.nashorn.test ---
[INFO] Building jar: /home/jenkins/agent/workspace/ease.verify.core.target.2019-03/tests/org.eclipse.ease.lang.javascript.nashorn.test/target/org.eclipse.ease.lang.javascript.nashorn.test-0.8.0-SNAPSHOT.jar
[INFO] 
[INFO] --- tycho-p2-plugin:1.3.0:p2-metadata-default (default-p2-metadata-default) @ org.eclipse.ease.lang.javascript.nashorn.test ---
[INFO] 
[INFO] --- tycho-source-feature-plugin:1.3.0:source-feature (source-feature) @ org.eclipse.ease.lang.javascript.nashorn.test ---
[INFO] 
[INFO] --- tycho-p2-plugin:1.3.0:p2-metadata (attached-p2-metadata) @ org.eclipse.ease.lang.javascript.nashorn.test ---
[INFO] 
[INFO] --- tycho-surefire-plugin:1.3.0:test (default-test) @ org.eclipse.ease.lang.javascript.nashorn.test ---
[INFO] Expected eclipse log file: /home/jenkins/agent/workspace/ease.verify.core.target.2019-03/tests/org.eclipse.ease.lang.javascript.nashorn.test/target/work/data/.metadata/.log
[INFO] Command line:
	[/opt/tools/java/oracle/jdk-8/1.8.0_202/jre/bin/java, -Dosgi.noShutdown=false, -Dosgi.os=linux, -Dosgi.ws=gtk, -Dosgi.arch=x86_64, -Dosgi.clean=true, -jar, /home/jenkins/.m2/repository/p2/osgi/bundle/org.eclipse.equinox.launcher/1.5.300.v20190213-1655/org.eclipse.equinox.launcher-1.5.300.v20190213-1655.jar, -data, /home/jenkins/agent/workspace/ease.verify.core.target.2019-03/tests/org.eclipse.ease.lang.javascript.nashorn.test/target/work/data, -install, /home/jenkins/agent/workspace/ease.verify.core.target.2019-03/tests/org.eclipse.ease.lang.javascript.nashorn.test/target/work, -configuration, /home/jenkins/agent/workspace/ease.verify.core.target.2019-03/tests/org.eclipse.ease.lang.javascript.nashorn.test/target/work/configuration, -application, org.eclipse.tycho.surefire.osgibooter.headlesstest, -testproperties, /home/jenkins/agent/workspace/ease.verify.core.target.2019-03/tests/org.eclipse.ease.lang.javascript.nashorn.test/target/surefire.properties]
Picked up JAVA_TOOL_OPTIONS: -XX:+IgnoreUnrecognizedVMOptions -XX:+UseContainerSupport -XX:+UnlockExperimentalVMOptions -XX:+UseCGroupMemoryLimitForHeap -Dmaven.ext.class.path="/home/jenkins/agent/workspace/ease.verify.core.target.2019-03@tmp/withMavene6284ffb/pipeline-maven-spy.jar" -Dorg.jenkinsci.plugins.pipeline.maven.reportsFolder="/home/jenkins/agent/workspace/ease.verify.core.target.2019-03@tmp/withMavene6284ffb" 
Picked up _JAVA_OPTIONS: -XX:MaxRAMPercentage=64.0
Running org.eclipse.ease.lang.javascript.nashorn.NashornEnvironmentTest
Tests run: 5, Failures: 0, Errors: 0, Skipped: 0, Time elapsed: 0.905 s - in org.eclipse.ease.lang.javascript.nashorn.NashornEnvironmentTest
reloadEnvironment(org.eclipse.ease.lang.javascript.nashorn.NashornEnvironmentTest)  Time elapsed: 0.603 s
bootstrappedEnvironment(org.eclipse.ease.lang.javascript.nashorn.NashornEnvironmentTest)  Time elapsed: 0.061 s
postMethodCallback(org.eclipse.ease.lang.javascript.nashorn.NashornEnvironmentTest)  Time elapsed: 0.13 s
preMethodCallback(org.eclipse.ease.lang.javascript.nashorn.NashornEnvironmentTest)  Time elapsed: 0.05 s
reloadFunctionDefinitions(org.eclipse.ease.lang.javascript.nashorn.NashornEnvironmentTest)  Time elapsed: 0.042 s

Results:

Tests run: 5, Failures: 0, Errors: 0, Skipped: 0

[INFO] All tests passed!
[INFO] 
[INFO] ----< org.eclipse.ease:org.eclipse.ease.lang.javascript.rhino.test >----
[INFO] Building org.eclipse.ease.lang.javascript.rhino.test 0.8.0-SNAPSHOT [5/11]
[INFO] ------------------------[ eclipse-test-plugin ]-------------------------
[INFO] 
[INFO] --- tycho-packaging-plugin:1.3.0:build-qualifier (default-build-qualifier) @ org.eclipse.ease.lang.javascript.rhino.test ---
[INFO] The project's OSGi version is 0.8.0.I201911291239
[INFO] 
[INFO] --- tycho-packaging-plugin:1.3.0:validate-id (default-validate-id) @ org.eclipse.ease.lang.javascript.rhino.test ---
[INFO] 
[INFO] --- tycho-packaging-plugin:1.3.0:validate-version (default-validate-version) @ org.eclipse.ease.lang.javascript.rhino.test ---
[INFO] 
[INFO] --- maven-resources-plugin:2.4.3:resources (default-resources) @ org.eclipse.ease.lang.javascript.rhino.test ---
[INFO] Using 'UTF-8' encoding to copy filtered resources.
[INFO] skip non existing resourceDirectory /home/jenkins/agent/workspace/ease.verify.core.target.2019-03/tests/org.eclipse.ease.lang.javascript.rhino.test/src/main/resources
[INFO] 
[INFO] --- tycho-compiler-plugin:1.3.0:compile (default-compile) @ org.eclipse.ease.lang.javascript.rhino.test ---
[INFO] Nothing to compile - all classes are up to date
[INFO] 
[INFO] --- maven-resources-plugin:2.4.3:testResources (default-testResources) @ org.eclipse.ease.lang.javascript.rhino.test ---
[INFO] Using 'UTF-8' encoding to copy filtered resources.
[INFO] skip non existing resourceDirectory /home/jenkins/agent/workspace/ease.verify.core.target.2019-03/tests/org.eclipse.ease.lang.javascript.rhino.test/src/test/resources
[INFO] 
[INFO] --- tycho-source-plugin:1.3.0:plugin-source (plugin-source) @ org.eclipse.ease.lang.javascript.rhino.test ---
[WARNING] Bundle-Vendor header not found in /home/jenkins/agent/workspace/ease.verify.core.target.2019-03/tests/org.eclipse.ease.lang.javascript.rhino.test/META-INF/MANIFEST.MF, fallback to 'unknown' for source bundle
[INFO] Building jar: /home/jenkins/agent/workspace/ease.verify.core.target.2019-03/tests/org.eclipse.ease.lang.javascript.rhino.test/target/org.eclipse.ease.lang.javascript.rhino.test-0.8.0-SNAPSHOT-sources.jar
[INFO] 
[INFO] --- target-platform-configuration:1.3.0:target-platform (default-target-platform) @ org.eclipse.ease.lang.javascript.rhino.test ---
[INFO] 
[INFO] --- tycho-packaging-plugin:1.3.0:package-plugin (default-package-plugin) @ org.eclipse.ease.lang.javascript.rhino.test ---
[INFO] Building jar: /home/jenkins/agent/workspace/ease.verify.core.target.2019-03/tests/org.eclipse.ease.lang.javascript.rhino.test/target/org.eclipse.ease.lang.javascript.rhino.test-0.8.0-SNAPSHOT.jar
[INFO] 
[INFO] --- tycho-p2-plugin:1.3.0:p2-metadata-default (default-p2-metadata-default) @ org.eclipse.ease.lang.javascript.rhino.test ---
[INFO] 
[INFO] --- tycho-source-feature-plugin:1.3.0:source-feature (source-feature) @ org.eclipse.ease.lang.javascript.rhino.test ---
[INFO] 
[INFO] --- tycho-p2-plugin:1.3.0:p2-metadata (attached-p2-metadata) @ org.eclipse.ease.lang.javascript.rhino.test ---
[INFO] 
[INFO] --- tycho-surefire-plugin:1.3.0:test (default-test) @ org.eclipse.ease.lang.javascript.rhino.test ---
[INFO] Expected eclipse log file: /home/jenkins/agent/workspace/ease.verify.core.target.2019-03/tests/org.eclipse.ease.lang.javascript.rhino.test/target/work/data/.metadata/.log
[INFO] Command line:
	[/opt/tools/java/oracle/jdk-8/1.8.0_202/jre/bin/java, -Dosgi.noShutdown=false, -Dosgi.os=linux, -Dosgi.ws=gtk, -Dosgi.arch=x86_64, -Dosgi.clean=true, -jar, /home/jenkins/.m2/repository/p2/osgi/bundle/org.eclipse.equinox.launcher/1.5.300.v20190213-1655/org.eclipse.equinox.launcher-1.5.300.v20190213-1655.jar, -data, /home/jenkins/agent/workspace/ease.verify.core.target.2019-03/tests/org.eclipse.ease.lang.javascript.rhino.test/target/work/data, -install, /home/jenkins/agent/workspace/ease.verify.core.target.2019-03/tests/org.eclipse.ease.lang.javascript.rhino.test/target/work, -configuration, /home/jenkins/agent/workspace/ease.verify.core.target.2019-03/tests/org.eclipse.ease.lang.javascript.rhino.test/target/work/configuration, -application, org.eclipse.tycho.surefire.osgibooter.headlesstest, -testproperties, /home/jenkins/agent/workspace/ease.verify.core.target.2019-03/tests/org.eclipse.ease.lang.javascript.rhino.test/target/surefire.properties]
Picked up JAVA_TOOL_OPTIONS: -XX:+IgnoreUnrecognizedVMOptions -XX:+UseContainerSupport -XX:+UnlockExperimentalVMOptions -XX:+UseCGroupMemoryLimitForHeap -Dmaven.ext.class.path="/home/jenkins/agent/workspace/ease.verify.core.target.2019-03@tmp/withMavene6284ffb/pipeline-maven-spy.jar" -Dorg.jenkinsci.plugins.pipeline.maven.reportsFolder="/home/jenkins/agent/workspace/ease.verify.core.target.2019-03@tmp/withMavene6284ffb" 
Picked up _JAVA_OPTIONS: -XX:MaxRAMPercentage=64.0
Running org.eclipse.ease.lang.javascript.rhino.RhinoDebuggerEngineTest
org.eclipse.ease.ScriptExecutionException: JavaError: NotThere cannot be found by org.mozilla.javascript_1.7.5.v201504281450

Java Stacktrace:
java.lang.ClassNotFoundException: NotThere cannot be found by org.mozilla.javascript_1.7.5.v201504281450
	at org.eclipse.osgi.internal.loader.BundleLoader.findClassInternal(BundleLoader.java:511)
	at org.eclipse.osgi.internal.loader.BundleLoader.findClass(BundleLoader.java:422)
	at org.eclipse.osgi.internal.loader.BundleLoader.findClass(BundleLoader.java:414)
	at org.eclipse.osgi.internal.loader.ModuleClassLoader.loadClass(ModuleClassLoader.java:153)
	at java.lang.ClassLoader.loadClass(ClassLoader.java:357)
	at java.lang.Class.forName0(Native Method)
	at java.lang.Class.forName(Class.java:264)
	at sun.reflect.NativeMethodAccessorImpl.invoke0(Native Method)
	at sun.reflect.NativeMethodAccessorImpl.invoke(NativeMethodAccessorImpl.java:62)
	at sun.reflect.DelegatingMethodAccessorImpl.invoke(DelegatingMethodAccessorImpl.java:43)
	at java.lang.reflect.Method.invoke(Method.java:498)
	at org.mozilla.javascript.MemberBox.invoke(MemberBox.java:126)
	at org.mozilla.javascript.NativeJavaMethod.call(NativeJavaMethod.java:225)
	at org.mozilla.javascript.Interpreter.interpretLoop(Interpreter.java:1473)
	at org.mozilla.javascript.Interpreter.interpret(Interpreter.java:815)
	at org.mozilla.javascript.InterpretedFunction.call(InterpretedFunction.java:109)
	at org.mozilla.javascript.ContextFactory.doTopCall(ContextFactory.java:394)
	at org.mozilla.javascript.ScriptRuntime.doTopCall(ScriptRuntime.java:3091)
	at org.mozilla.javascript.InterpretedFunction.exec(InterpretedFunction.java:120)
	at org.mozilla.javascript.Context.evaluateReader(Context.java:1110)
	at org.eclipse.ease.lang.javascript.rhino.RhinoScriptEngine.internalExecute(RhinoScriptEngine.java:222)
	at org.eclipse.ease.lang.javascript.rhino.RhinoScriptEngine.execute(RhinoScriptEngine.java:201)
	at org.eclipse.ease.AbstractScriptEngine.inject(AbstractScriptEngine.java:226)
	at org.eclipse.ease.AbstractScriptEngine.run(AbstractScriptEngine.java:277)
	at org.eclipse.core.internal.jobs.Worker.run(Worker.java:63)
org.eclipse.ease.ScriptExecutionException: TypeError: Cannot call method "foobar" of undefined
org.eclipse.ease.ScriptExecutionException: ScriptException: test
org.eclipse.ease.ScriptExecutionException: JavaError: java.lang.Exception

Java Stacktrace:
java.lang.Exception
	at sun.reflect.NativeConstructorAccessorImpl.newInstance0(Native Method)
	at sun.reflect.NativeConstructorAccessorImpl.newInstance(NativeConstructorAccessorImpl.java:62)
	at sun.reflect.DelegatingConstructorAccessorImpl.newInstance(DelegatingConstructorAccessorImpl.java:45)
	at java.lang.reflect.Constructor.newInstance(Constructor.java:423)
	at org.mozilla.javascript.MemberBox.newInstance(MemberBox.java:159)
	at org.mozilla.javascript.NativeJavaClass.constructInternal(NativeJavaClass.java:266)
	at org.mozilla.javascript.NativeJavaClass.constructSpecific(NativeJavaClass.java:205)
	at org.mozilla.javascript.NativeJavaClass.construct(NativeJavaClass.java:166)
	at org.mozilla.javascript.Interpreter.interpretLoop(Interpreter.java:1519)
	at org.mozilla.javascript.Interpreter.interpret(Interpreter.java:815)
	at org.mozilla.javascript.InterpretedFunction.call(InterpretedFunction.java:109)
	at org.mozilla.javascript.ContextFactory.doTopCall(ContextFactory.java:394)
	at org.mozilla.javascript.ScriptRuntime.doTopCall(ScriptRuntime.java:3091)
	at org.mozilla.javascript.InterpretedFunction.exec(InterpretedFunction.java:120)
	at org.mozilla.javascript.Context.evaluateReader(Context.java:1110)
	at org.eclipse.ease.lang.javascript.rhino.RhinoScriptEngine.internalExecute(RhinoScriptEngine.java:222)
	at org.eclipse.ease.lang.javascript.rhino.RhinoScriptEngine.execute(RhinoScriptEngine.java:201)
	at org.eclipse.ease.AbstractScriptEngine.inject(AbstractScriptEngine.java:226)
	at org.eclipse.ease.AbstractScriptEngine.run(AbstractScriptEngine.java:277)
	at org.eclipse.core.internal.jobs.Worker.run(Worker.java:63)
org.eclipse.ease.ScriptExecutionException: ScriptException: JavaScript
org.eclipse.ease.ScriptExecutionException: SyntaxError: unterminated string literal (#1)
'asdf
    ^
	at <unknown source>:1
Tests run: 12, Failures: 0, Errors: 0, Skipped: 0, Time elapsed: 0.647 s - in org.eclipse.ease.lang.javascript.rhino.RhinoDebuggerEngineTest
getExceptionStackTrace(org.eclipse.ease.lang.javascript.rhino.RhinoDebuggerEngineTest)  Time elapsed: 0.297 s
causeWrappedException(org.eclipse.ease.lang.javascript.rhino.RhinoDebuggerEngineTest)  Time elapsed: 0.077 s
optionalModuleParameters(org.eclipse.ease.lang.javascript.rhino.RhinoDebuggerEngineTest)  Time elapsed: 0.02 s
simpleScriptCode(org.eclipse.ease.lang.javascript.rhino.RhinoDebuggerEngineTest)  Time elapsed: 0.019 s
causeRuntimeErrorException(org.eclipse.ease.lang.javascript.rhino.RhinoDebuggerEngineTest)  Time elapsed: 0.018 s
callModuleCode(org.eclipse.ease.lang.javascript.rhino.RhinoDebuggerEngineTest)  Time elapsed: 0.024 s
throwJavaClass(org.eclipse.ease.lang.javascript.rhino.RhinoDebuggerEngineTest)  Time elapsed: 0.017 s
throwJavaException(org.eclipse.ease.lang.javascript.rhino.RhinoDebuggerEngineTest)  Time elapsed: 0.04 s
accessJavaClasses(org.eclipse.ease.lang.javascript.rhino.RhinoDebuggerEngineTest)  Time elapsed: 0.016 s
accessEclipseClasses(org.eclipse.ease.lang.javascript.rhino.RhinoDebuggerEngineTest)  Time elapsed: 0.016 s
throwJavaScriptException(org.eclipse.ease.lang.javascript.rhino.RhinoDebuggerEngineTest)  Time elapsed: 0.065 s
causeSyntaxErrorException(org.eclipse.ease.lang.javascript.rhino.RhinoDebuggerEngineTest)  Time elapsed: 0.016 s
Running org.eclipse.ease.lang.javascript.rhino.RhinoDebugTest
Start of script
include file start
Include file processed
line after include file
Result of testMethod = 5
End of script
Start of script
include file start
Include file processed
line after include file
Result of testMethod = 5
End of script
Start of script
include file start
Include file processed
line after include file
Result of testMethod = 5
Start of script
include file start
Include file processed
line after include file
Result of testMethod = 5
End of script
Start of script
include file start
Include file processed
line after include file
Result of testMethod = 5
End of script
Start of script
include file start
Include file processed
line after include file
Result of testMethod = 5
End of script
Start of script
include file start
Include file processed
line after include file
Result of testMethod = 5
Start of script
include file start
Include file processed
line after include file
Result of testMethod = 5
End of script
Start of script
include file start
Include file processed
line after include file
Result of testMethod = 5
End of script
Start of script
include file start
Include file processed
line after include file
Start of script
include file start
Include file processed
line after include file
Result of testMethod = 5
End of script
Start of script
include file start
Include file processed
line after include file
Result of testMethod = 5
End of script
Start of script
include file start
Include file processed
line after include file
Result of testMethod = 5
End of script
Start of script
include file start
Include file processed
line after include file
Result of testMethod = 5
End of script
Start of script
include file start
Include file processed
line after include file
Result of testMethod = 5
Start of script
include file start
Include file processed
line after include file
Result of testMethod = 5
End of script
Start of script
include file start
Include file processed
line after include file
Result of testMethod = 5
End of script
Start of script
include file start
Include file processed
line after include file
Result of testMethod = 5
End of script
Start of script
include file start
Include file processed
line after include file
Result of testMethod = 5
End of script
Start of script
include file start
Include file processed
line after include file
Result of testMethod = 5
Start of script
include file start
Include file processed
line after include file
Result of testMethod = 5
End of script
Start of script
include file start
Include file processed
line after include file
Result of testMethod = 5
End of script
Start of script
include file start
Include file processed
line after include file
Result of testMethod = 5
End of script
Start of script
include file start
Include file processed
line after include file
Result of testMethod = 5
End of script
Start of script
include file start
Include file processed
line after include file
Start of script
include file start
Include file processed
line after include file
Result of testMethod = 5
End of script
Start of script
include file start
Include file processed
line after include file
Result of testMethod = 5
Start of script
include file start
Include file processed
line after include file
Result of testMethod = 5
End of script
Start of script
include file start
Include file processed
line after include file
Result of testMethod = 5
End of script
Start of script
include file start
Include file processed
line after include file
Result of testMethod = 5
End of script
Start of script
include file start
Include file processed
line after include file
Result of testMethod = 5
End of script
Start of script
include file start
Include file processed
line after include file
Result of testMethod = 5
Start of script
include file start
Include file processed
line after include file
Result of testMethod = 5
End of script
Start of script
include file start
Include file processed
line after include file
Result of testMethod = 5
Start of script
include file start
Include file processed
line after include file
Result of testMethod = 5
End of script
Start of script
include file start
Include file processed
line after include file
Result of testMethod = 5
End of script
Start of script
include file start
Include file processed
line after include file
Result of testMethod = 5
End of script
Tests run: 42, Failures: 0, Errors: 0, Skipped: 0, Time elapsed: 11.63 s - in org.eclipse.ease.lang.javascript.rhino.RhinoDebugTest
disconnectProcessInSuspendedState(org.eclipse.ease.lang.javascript.rhino.RhinoDebugTest)  Time elapsed: 0.319 s
stepReturnIncludeCommand(org.eclipse.ease.lang.javascript.rhino.RhinoDebugTest)  Time elapsed: 0.248 s
arrayVariableSorting(org.eclipse.ease.lang.javascript.rhino.RhinoDebugTest)  Time elapsed: 0.314 s
stepOverOnDebugTarget(org.eclipse.ease.lang.javascript.rhino.RhinoDebugTest)  Time elapsed: 0.311 s
hasDebugTarget(org.eclipse.ease.lang.javascript.rhino.RhinoDebugTest)  Time elapsed: 0.105 s
disconnectThreadInSuspendedState(org.eclipse.ease.lang.javascript.rhino.RhinoDebugTest)  Time elapsed: 0.208 s
stepReturnOnDebugTarget(org.eclipse.ease.lang.javascript.rhino.RhinoDebugTest)  Time elapsed: 0.309 s
nullVariable(org.eclipse.ease.lang.javascript.rhino.RhinoDebugTest)  Time elapsed: 0.309 s
stepOverOnStackFrame(org.eclipse.ease.lang.javascript.rhino.RhinoDebugTest)  Time elapsed: 0.334 s
resumeOnDebugTarget(org.eclipse.ease.lang.javascript.rhino.RhinoDebugTest)  Time elapsed: 0.21 s
modifyVariableKeepingType(org.eclipse.ease.lang.javascript.rhino.RhinoDebugTest)  Time elapsed: 0.409 s
resumeOnLastIncludeLine(org.eclipse.ease.lang.javascript.rhino.RhinoDebugTest)  Time elapsed: 0.248 s
stepReturnOnStackFrame(org.eclipse.ease.lang.javascript.rhino.RhinoDebugTest)  Time elapsed: 0.308 s
terminateStackFrameInSuspendedState(org.eclipse.ease.lang.javascript.rhino.RhinoDebugTest)  Time elapsed: 0.208 s
breakpointLocation(org.eclipse.ease.lang.javascript.rhino.RhinoDebugTest)  Time elapsed: 0.215 s
stepReturnOnThread(org.eclipse.ease.lang.javascript.rhino.RhinoDebugTest)  Time elapsed: 0.308 s
javaClassVariable(org.eclipse.ease.lang.javascript.rhino.RhinoDebugTest)  Time elapsed: 0.362 s
stepIntoOnThread(org.eclipse.ease.lang.javascript.rhino.RhinoDebugTest)  Time elapsed: 0.308 s
terminateThreadInSuspendedState(org.eclipse.ease.lang.javascript.rhino.RhinoDebugTest)  Time elapsed: 0.207 s
resumeOnThread(org.eclipse.ease.lang.javascript.rhino.RhinoDebugTest)  Time elapsed: 0.206 s
stepIntoOnStackFrame(org.eclipse.ease.lang.javascript.rhino.RhinoDebugTest)  Time elapsed: 0.308 s
terminateProcessInSuspendedState(org.eclipse.ease.lang.javascript.rhino.RhinoDebugTest)  Time elapsed: 0.207 s
stepOverOnProcess(org.eclipse.ease.lang.javascript.rhino.RhinoDebugTest)  Time elapsed: 0.308 s
nativeArrayVariable(org.eclipse.ease.lang.javascript.rhino.RhinoDebugTest)  Time elapsed: 0.307 s
disconnectDebugTargetInSuspendedState(org.eclipse.ease.lang.javascript.rhino.RhinoDebugTest)  Time elapsed: 0.229 s
stepIntoOnProcess(org.eclipse.ease.lang.javascript.rhino.RhinoDebugTest)  Time elapsed: 0.307 s
terminatedState(org.eclipse.ease.lang.javascript.rhino.RhinoDebugTest)  Time elapsed: 0.124 s
stepOverIncludeCommand(org.eclipse.ease.lang.javascript.rhino.RhinoDebugTest)  Time elapsed: 0.305 s
innerScopeVariableBeforeOuterScopeVariable(org.eclipse.ease.lang.javascript.rhino.RhinoDebugTest)  Time elapsed: 0.337 s
stepIntoIncludeCommand(org.eclipse.ease.lang.javascript.rhino.RhinoDebugTest)  Time elapsed: 0.305 s
primitiveStringVariable(org.eclipse.ease.lang.javascript.rhino.RhinoDebugTest)  Time elapsed: 0.307 s
resumeOnProcess(org.eclipse.ease.lang.javascript.rhino.RhinoDebugTest)  Time elapsed: 0.263 s
stepIntoOnDebugTarget(org.eclipse.ease.lang.javascript.rhino.RhinoDebugTest)  Time elapsed: 0.306 s
stepOverOnThread(org.eclipse.ease.lang.javascript.rhino.RhinoDebugTest)  Time elapsed: 0.306 s
suspendedState(org.eclipse.ease.lang.javascript.rhino.RhinoDebugTest)  Time elapsed: 0.228 s
primitiveDoubleVariable(org.eclipse.ease.lang.javascript.rhino.RhinoDebugTest)  Time elapsed: 0.344 s
resumeOnStackFrame(org.eclipse.ease.lang.javascript.rhino.RhinoDebugTest)  Time elapsed: 0.444 s
nativeObjectVariable(org.eclipse.ease.lang.javascript.rhino.RhinoDebugTest)  Time elapsed: 0.307 s
terminateDebugTargetInSuspendedState(org.eclipse.ease.lang.javascript.rhino.RhinoDebugTest)  Time elapsed: 0.206 s
disconnectStackFrameInSuspendedState(org.eclipse.ease.lang.javascript.rhino.RhinoDebugTest)  Time elapsed: 0.206 s
stepReturnOnProcess(org.eclipse.ease.lang.javascript.rhino.RhinoDebugTest)  Time elapsed: 0.306 s
evaluateWatchExpression(org.eclipse.ease.lang.javascript.rhino.RhinoDebugTest)  Time elapsed: 0.209 s
Running org.eclipse.ease.lang.javascript.rhino.RhinoEnvironmentTest
Tests run: 5, Failures: 0, Errors: 0, Skipped: 0, Time elapsed: 0.136 s - in org.eclipse.ease.lang.javascript.rhino.RhinoEnvironmentTest
reloadEnvironment(org.eclipse.ease.lang.javascript.rhino.RhinoEnvironmentTest)  Time elapsed: 0.047 s
bootstrappedEnvironment(org.eclipse.ease.lang.javascript.rhino.RhinoEnvironmentTest)  Time elapsed: 0.012 s
postMethodCallback(org.eclipse.ease.lang.javascript.rhino.RhinoEnvironmentTest)  Time elapsed: 0.017 s
preMethodCallback(org.eclipse.ease.lang.javascript.rhino.RhinoEnvironmentTest)  Time elapsed: 0.013 s
reloadFunctionDefinitions(org.eclipse.ease.lang.javascript.rhino.RhinoEnvironmentTest)  Time elapsed: 0.046 s
Running org.eclipse.ease.lang.javascript.rhino.RhinoScriptEngineTest
org.eclipse.ease.ScriptExecutionException: JavaError: NotThere cannot be found by org.mozilla.javascript_1.7.5.v201504281450
	at <unknown source>

Java Stacktrace:
java.lang.ClassNotFoundException: NotThere cannot be found by org.mozilla.javascript_1.7.5.v201504281450
	at org.eclipse.osgi.internal.loader.BundleLoader.findClassInternal(BundleLoader.java:511)
	at org.eclipse.osgi.internal.loader.BundleLoader.findClass(BundleLoader.java:422)
	at org.eclipse.osgi.internal.loader.BundleLoader.findClass(BundleLoader.java:414)
	at org.eclipse.osgi.internal.loader.ModuleClassLoader.loadClass(ModuleClassLoader.java:153)
	at java.lang.ClassLoader.loadClass(ClassLoader.java:357)
	at java.lang.Class.forName0(Native Method)
	at java.lang.Class.forName(Class.java:264)
	at sun.reflect.NativeMethodAccessorImpl.invoke0(Native Method)
	at sun.reflect.NativeMethodAccessorImpl.invoke(NativeMethodAccessorImpl.java:62)
	at sun.reflect.DelegatingMethodAccessorImpl.invoke(DelegatingMethodAccessorImpl.java:43)
	at java.lang.reflect.Method.invoke(Method.java:498)
	at org.mozilla.javascript.MemberBox.invoke(MemberBox.java:126)
	at org.mozilla.javascript.NativeJavaMethod.call(NativeJavaMethod.java:225)
	at org.mozilla.javascript.optimizer.OptRuntime.call1(OptRuntime.java:32)
	at org.mozilla.javascript.gen.c_27._c_script_0(Unknown Source)
	at org.mozilla.javascript.gen.c_27.call(Unknown Source)
	at org.mozilla.javascript.ContextFactory.doTopCall(ContextFactory.java:394)
	at org.mozilla.javascript.ScriptRuntime.doTopCall(ScriptRuntime.java:3091)
	at org.mozilla.javascript.gen.c_27.call(Unknown Source)
	at org.mozilla.javascript.gen.c_27.exec(Unknown Source)
	at org.mozilla.javascript.Context.evaluateReader(Context.java:1110)
	at org.eclipse.ease.lang.javascript.rhino.RhinoScriptEngine.internalExecute(RhinoScriptEngine.java:222)
	at org.eclipse.ease.lang.javascript.rhino.RhinoScriptEngine.execute(RhinoScriptEngine.java:201)
	at org.eclipse.ease.AbstractScriptEngine.inject(AbstractScriptEngine.java:226)
	at org.eclipse.ease.AbstractScriptEngine.run(AbstractScriptEngine.java:277)
	at org.eclipse.core.internal.jobs.Worker.run(Worker.java:63)
org.eclipse.ease.ScriptExecutionException: TypeError: Cannot call method "foobar" of undefined
	at <unknown source>
org.eclipse.ease.ScriptExecutionException: ScriptException: test
	at <unknown source>
org.eclipse.ease.ScriptExecutionException: JavaError: java.lang.Exception
	at <unknown source>

Java Stacktrace:
java.lang.Exception
	at sun.reflect.NativeConstructorAccessorImpl.newInstance0(Native Method)
	at sun.reflect.NativeConstructorAccessorImpl.newInstance(NativeConstructorAccessorImpl.java:62)
	at sun.reflect.DelegatingConstructorAccessorImpl.newInstance(DelegatingConstructorAccessorImpl.java:45)
	at java.lang.reflect.Constructor.newInstance(Constructor.java:423)
	at org.mozilla.javascript.MemberBox.newInstance(MemberBox.java:159)
	at org.mozilla.javascript.NativeJavaClass.constructInternal(NativeJavaClass.java:266)
	at org.mozilla.javascript.NativeJavaClass.constructSpecific(NativeJavaClass.java:205)
	at org.mozilla.javascript.NativeJavaClass.construct(NativeJavaClass.java:166)
	at org.mozilla.javascript.ScriptRuntime.newObject(ScriptRuntime.java:2349)
	at org.mozilla.javascript.gen.c_45._c_script_0(Unknown Source)
	at org.mozilla.javascript.gen.c_45.call(Unknown Source)
	at org.mozilla.javascript.ContextFactory.doTopCall(ContextFactory.java:394)
	at org.mozilla.javascript.ScriptRuntime.doTopCall(ScriptRuntime.java:3091)
	at org.mozilla.javascript.gen.c_45.call(Unknown Source)
	at org.mozilla.javascript.gen.c_45.exec(Unknown Source)
	at org.mozilla.javascript.Context.evaluateReader(Context.java:1110)
	at org.eclipse.ease.lang.javascript.rhino.RhinoScriptEngine.internalExecute(RhinoScriptEngine.java:222)
	at org.eclipse.ease.lang.javascript.rhino.RhinoScriptEngine.execute(RhinoScriptEngine.java:201)
	at org.eclipse.ease.AbstractScriptEngine.inject(AbstractScriptEngine.java:226)
	at org.eclipse.ease.AbstractScriptEngine.run(AbstractScriptEngine.java:277)
	at org.eclipse.core.internal.jobs.Worker.run(Worker.java:63)
org.eclipse.ease.ScriptExecutionException: ScriptException: JavaScript
	at <unknown source>
org.eclipse.ease.ScriptExecutionException: SyntaxError: unterminated string literal (#1)
'asdf
    ^
	at <unknown source>
Tests run: 11, Failures: 0, Errors: 0, Skipped: 0, Time elapsed: 0.119 s - in org.eclipse.ease.lang.javascript.rhino.RhinoScriptEngineTest
causeWrappedException(org.eclipse.ease.lang.javascript.rhino.RhinoScriptEngineTest)  Time elapsed: 0.01 s
optionalModuleParameters(org.eclipse.ease.lang.javascript.rhino.RhinoScriptEngineTest)  Time elapsed: 0.008 s
simpleScriptCode(org.eclipse.ease.lang.javascript.rhino.RhinoScriptEngineTest)  Time elapsed: 0.007 s
causeRuntimeErrorException(org.eclipse.ease.lang.javascript.rhino.RhinoScriptEngineTest)  Time elapsed: 0.009 s
callModuleCode(org.eclipse.ease.lang.javascript.rhino.RhinoScriptEngineTest)  Time elapsed: 0.008 s
throwJavaClass(org.eclipse.ease.lang.javascript.rhino.RhinoScriptEngineTest)  Time elapsed: 0.008 s
throwJavaException(org.eclipse.ease.lang.javascript.rhino.RhinoScriptEngineTest)  Time elapsed: 0.039 s
accessJavaClasses(org.eclipse.ease.lang.javascript.rhino.RhinoScriptEngineTest)  Time elapsed: 0.007 s
accessEclipseClasses(org.eclipse.ease.lang.javascript.rhino.RhinoScriptEngineTest)  Time elapsed: 0.007 s
throwJavaScriptException(org.eclipse.ease.lang.javascript.rhino.RhinoScriptEngineTest)  Time elapsed: 0.007 s
causeSyntaxErrorException(org.eclipse.ease.lang.javascript.rhino.RhinoScriptEngineTest)  Time elapsed: 0.007 s

Results:

Tests run: 70, Failures: 0, Errors: 0, Skipped: 0

[INFO] All tests passed!
[INFO] 
[INFO] -------< org.eclipse.ease:org.eclipse.ease.lang.javascript.test >-------
[INFO] Building org.eclipse.ease.lang.javascript.test 0.8.0-SNAPSHOT     [6/11]
[INFO] ------------------------[ eclipse-test-plugin ]-------------------------
[INFO] 
[INFO] --- tycho-packaging-plugin:1.3.0:build-qualifier (default-build-qualifier) @ org.eclipse.ease.lang.javascript.test ---
[INFO] The project's OSGi version is 0.8.0.I201910171213
[INFO] 
[INFO] --- tycho-packaging-plugin:1.3.0:validate-id (default-validate-id) @ org.eclipse.ease.lang.javascript.test ---
[INFO] 
[INFO] --- tycho-packaging-plugin:1.3.0:validate-version (default-validate-version) @ org.eclipse.ease.lang.javascript.test ---
[INFO] 
[INFO] --- maven-resources-plugin:2.4.3:resources (default-resources) @ org.eclipse.ease.lang.javascript.test ---
[INFO] Using 'UTF-8' encoding to copy filtered resources.
[INFO] skip non existing resourceDirectory /home/jenkins/agent/workspace/ease.verify.core.target.2019-03/tests/org.eclipse.ease.lang.javascript.test/src/main/resources
[INFO] 
[INFO] --- tycho-compiler-plugin:1.3.0:compile (default-compile) @ org.eclipse.ease.lang.javascript.test ---
[INFO] Nothing to compile - all classes are up to date
[INFO] 
[INFO] --- maven-resources-plugin:2.4.3:testResources (default-testResources) @ org.eclipse.ease.lang.javascript.test ---
[INFO] Using 'UTF-8' encoding to copy filtered resources.
[INFO] skip non existing resourceDirectory /home/jenkins/agent/workspace/ease.verify.core.target.2019-03/tests/org.eclipse.ease.lang.javascript.test/src/test/resources
[INFO] 
[INFO] --- tycho-source-plugin:1.3.0:plugin-source (plugin-source) @ org.eclipse.ease.lang.javascript.test ---
[WARNING] Bundle-Vendor header not found in /home/jenkins/agent/workspace/ease.verify.core.target.2019-03/tests/org.eclipse.ease.lang.javascript.test/META-INF/MANIFEST.MF, fallback to 'unknown' for source bundle
[INFO] Building jar: /home/jenkins/agent/workspace/ease.verify.core.target.2019-03/tests/org.eclipse.ease.lang.javascript.test/target/org.eclipse.ease.lang.javascript.test-0.8.0-SNAPSHOT-sources.jar
[INFO] 
[INFO] --- target-platform-configuration:1.3.0:target-platform (default-target-platform) @ org.eclipse.ease.lang.javascript.test ---
[INFO] 
[INFO] --- tycho-packaging-plugin:1.3.0:package-plugin (default-package-plugin) @ org.eclipse.ease.lang.javascript.test ---
[INFO] Building jar: /home/jenkins/agent/workspace/ease.verify.core.target.2019-03/tests/org.eclipse.ease.lang.javascript.test/target/org.eclipse.ease.lang.javascript.test-0.8.0-SNAPSHOT.jar
[INFO] 
[INFO] --- tycho-p2-plugin:1.3.0:p2-metadata-default (default-p2-metadata-default) @ org.eclipse.ease.lang.javascript.test ---
[INFO] 
[INFO] --- tycho-source-feature-plugin:1.3.0:source-feature (source-feature) @ org.eclipse.ease.lang.javascript.test ---
[INFO] 
[INFO] --- tycho-p2-plugin:1.3.0:p2-metadata (attached-p2-metadata) @ org.eclipse.ease.lang.javascript.test ---
[INFO] 
[INFO] --- tycho-surefire-plugin:1.3.0:test (default-test) @ org.eclipse.ease.lang.javascript.test ---
[INFO] Expected eclipse log file: /home/jenkins/agent/workspace/ease.verify.core.target.2019-03/tests/org.eclipse.ease.lang.javascript.test/target/work/data/.metadata/.log
[INFO] Command line:
	[/opt/tools/java/oracle/jdk-8/1.8.0_202/jre/bin/java, -Dosgi.noShutdown=false, -Dosgi.os=linux, -Dosgi.ws=gtk, -Dosgi.arch=x86_64, -Dosgi.clean=true, -jar, /home/jenkins/.m2/repository/p2/osgi/bundle/org.eclipse.equinox.launcher/1.5.300.v20190213-1655/org.eclipse.equinox.launcher-1.5.300.v20190213-1655.jar, -data, /home/jenkins/agent/workspace/ease.verify.core.target.2019-03/tests/org.eclipse.ease.lang.javascript.test/target/work/data, -install, /home/jenkins/agent/workspace/ease.verify.core.target.2019-03/tests/org.eclipse.ease.lang.javascript.test/target/work, -configuration, /home/jenkins/agent/workspace/ease.verify.core.target.2019-03/tests/org.eclipse.ease.lang.javascript.test/target/work/configuration, -application, org.eclipse.tycho.surefire.osgibooter.headlesstest, -testproperties, /home/jenkins/agent/workspace/ease.verify.core.target.2019-03/tests/org.eclipse.ease.lang.javascript.test/target/surefire.properties]
Picked up JAVA_TOOL_OPTIONS: -XX:+IgnoreUnrecognizedVMOptions -XX:+UseContainerSupport -XX:+UnlockExperimentalVMOptions -XX:+UseCGroupMemoryLimitForHeap -Dmaven.ext.class.path="/home/jenkins/agent/workspace/ease.verify.core.target.2019-03@tmp/withMavene6284ffb/pipeline-maven-spy.jar" -Dorg.jenkinsci.plugins.pipeline.maven.reportsFolder="/home/jenkins/agent/workspace/ease.verify.core.target.2019-03@tmp/withMavene6284ffb" 
Picked up _JAVA_OPTIONS: -XX:MaxRAMPercentage=64.0
Running org.eclipse.ease.lang.javascript.JavaScriptCodeFactoryTest
Tests run: 1, Failures: 0, Errors: 0, Skipped: 0, Time elapsed: 0.074 s - in org.eclipse.ease.lang.javascript.JavaScriptCodeFactoryTest
testCommentCreator(org.eclipse.ease.lang.javascript.JavaScriptCodeFactoryTest)  Time elapsed: 0.009 s
Running org.eclipse.ease.lang.javascript.JavaScriptCompletionContextTest
Tests run: 8, Failures: 0, Errors: 0, Skipped: 0, Time elapsed: 0.231 s - in org.eclipse.ease.lang.javascript.JavaScriptCompletionContextTest
verifyStaticClassTypes(org.eclipse.ease.lang.javascript.JavaScriptCompletionContextTest)  Time elapsed: 0.006 s
verifyClassInstanceTypes(org.eclipse.ease.lang.javascript.JavaScriptCompletionContextTest)  Time elapsed: 0.01 s
verifyTypesForScriptEngine(org.eclipse.ease.lang.javascript.JavaScriptCompletionContextTest)  Time elapsed: 0.205 s
verifyPackageTypes(org.eclipse.ease.lang.javascript.JavaScriptCompletionContextTest)  Time elapsed: 0.001 s
definedVariableTypes(org.eclipse.ease.lang.javascript.JavaScriptCompletionContextTest)  Time elapsed: 0.001 s
verifyStringLiteralTypes(org.eclipse.ease.lang.javascript.JavaScriptCompletionContextTest)  Time elapsed: 0 s
verifyUnknownTypes(org.eclipse.ease.lang.javascript.JavaScriptCompletionContextTest)  Time elapsed: 0 s
verifyNoneTypes(org.eclipse.ease.lang.javascript.JavaScriptCompletionContextTest)  Time elapsed: 0 s

Results:

Tests run: 9, Failures: 0, Errors: 0, Skipped: 0

[INFO] All tests passed!
[INFO] 
[INFO] ---------< org.eclipse.ease:org.eclipse.ease.lang.python.test >---------
[INFO] Building org.eclipse.ease.lang.python.test 0.8.0-SNAPSHOT         [7/11]
[INFO] ------------------------[ eclipse-test-plugin ]-------------------------
[INFO] 
[INFO] --- tycho-packaging-plugin:1.3.0:build-qualifier (default-build-qualifier) @ org.eclipse.ease.lang.python.test ---
[INFO] The project's OSGi version is 0.8.0.I201910171213
[INFO] 
[INFO] --- tycho-packaging-plugin:1.3.0:validate-id (default-validate-id) @ org.eclipse.ease.lang.python.test ---
[INFO] 
[INFO] --- tycho-packaging-plugin:1.3.0:validate-version (default-validate-version) @ org.eclipse.ease.lang.python.test ---
[INFO] 
[INFO] --- maven-resources-plugin:2.4.3:resources (default-resources) @ org.eclipse.ease.lang.python.test ---
[INFO] Using 'UTF-8' encoding to copy filtered resources.
[INFO] skip non existing resourceDirectory /home/jenkins/agent/workspace/ease.verify.core.target.2019-03/tests/org.eclipse.ease.lang.python.test/src/main/resources
[INFO] 
[INFO] --- tycho-compiler-plugin:1.3.0:compile (default-compile) @ org.eclipse.ease.lang.python.test ---
[INFO] Nothing to compile - all classes are up to date
[INFO] 
[INFO] --- maven-resources-plugin:2.4.3:testResources (default-testResources) @ org.eclipse.ease.lang.python.test ---
[INFO] Using 'UTF-8' encoding to copy filtered resources.
[INFO] skip non existing resourceDirectory /home/jenkins/agent/workspace/ease.verify.core.target.2019-03/tests/org.eclipse.ease.lang.python.test/src/test/resources
[INFO] 
[INFO] --- tycho-source-plugin:1.3.0:plugin-source (plugin-source) @ org.eclipse.ease.lang.python.test ---
[WARNING] Bundle-Vendor header not found in /home/jenkins/agent/workspace/ease.verify.core.target.2019-03/tests/org.eclipse.ease.lang.python.test/META-INF/MANIFEST.MF, fallback to 'unknown' for source bundle
[INFO] Building jar: /home/jenkins/agent/workspace/ease.verify.core.target.2019-03/tests/org.eclipse.ease.lang.python.test/target/org.eclipse.ease.lang.python.test-0.8.0-SNAPSHOT-sources.jar
[INFO] 
[INFO] --- target-platform-configuration:1.3.0:target-platform (default-target-platform) @ org.eclipse.ease.lang.python.test ---
[INFO] 
[INFO] --- tycho-packaging-plugin:1.3.0:package-plugin (default-package-plugin) @ org.eclipse.ease.lang.python.test ---
[INFO] Building jar: /home/jenkins/agent/workspace/ease.verify.core.target.2019-03/tests/org.eclipse.ease.lang.python.test/target/org.eclipse.ease.lang.python.test-0.8.0-SNAPSHOT.jar
[INFO] 
[INFO] --- tycho-p2-plugin:1.3.0:p2-metadata-default (default-p2-metadata-default) @ org.eclipse.ease.lang.python.test ---
[INFO] 
[INFO] --- tycho-source-feature-plugin:1.3.0:source-feature (source-feature) @ org.eclipse.ease.lang.python.test ---
[INFO] 
[INFO] --- tycho-p2-plugin:1.3.0:p2-metadata (attached-p2-metadata) @ org.eclipse.ease.lang.python.test ---
[INFO] 
[INFO] --- tycho-surefire-plugin:1.3.0:test (default-test) @ org.eclipse.ease.lang.python.test ---
[INFO] Expected eclipse log file: /home/jenkins/agent/workspace/ease.verify.core.target.2019-03/tests/org.eclipse.ease.lang.python.test/target/work/data/.metadata/.log
[INFO] Command line:
	[/opt/tools/java/oracle/jdk-8/1.8.0_202/jre/bin/java, -Dosgi.noShutdown=false, -Dosgi.os=linux, -Dosgi.ws=gtk, -Dosgi.arch=x86_64, -Dosgi.clean=true, -jar, /home/jenkins/.m2/repository/p2/osgi/bundle/org.eclipse.equinox.launcher/1.5.300.v20190213-1655/org.eclipse.equinox.launcher-1.5.300.v20190213-1655.jar, -data, /home/jenkins/agent/workspace/ease.verify.core.target.2019-03/tests/org.eclipse.ease.lang.python.test/target/work/data, -install, /home/jenkins/agent/workspace/ease.verify.core.target.2019-03/tests/org.eclipse.ease.lang.python.test/target/work, -configuration, /home/jenkins/agent/workspace/ease.verify.core.target.2019-03/tests/org.eclipse.ease.lang.python.test/target/work/configuration, -application, org.eclipse.tycho.surefire.osgibooter.headlesstest, -testproperties, /home/jenkins/agent/workspace/ease.verify.core.target.2019-03/tests/org.eclipse.ease.lang.python.test/target/surefire.properties]
Picked up JAVA_TOOL_OPTIONS: -XX:+IgnoreUnrecognizedVMOptions -XX:+UseContainerSupport -XX:+UnlockExperimentalVMOptions -XX:+UseCGroupMemoryLimitForHeap -Dmaven.ext.class.path="/home/jenkins/agent/workspace/ease.verify.core.target.2019-03@tmp/withMavene6284ffb/pipeline-maven-spy.jar" -Dorg.jenkinsci.plugins.pipeline.maven.reportsFolder="/home/jenkins/agent/workspace/ease.verify.core.target.2019-03@tmp/withMavene6284ffb" 
Picked up _JAVA_OPTIONS: -XX:MaxRAMPercentage=64.0
Running org.eclipse.ease.lang.python.PythonCodeFactoryTest
Tests run: 1, Failures: 0, Errors: 0, Skipped: 0, Time elapsed: 0.046 s - in org.eclipse.ease.lang.python.PythonCodeFactoryTest
testCommentCreator(org.eclipse.ease.lang.python.PythonCodeFactoryTest)  Time elapsed: 0.008 s

Results:

Tests run: 1, Failures: 0, Errors: 0, Skipped: 0

[INFO] All tests passed!
[INFO] 
[INFO] -----< org.eclipse.ease:org.eclipse.ease.lang.python.jython.test >------
[INFO] Building org.eclipse.ease.lang.python.jython.test 0.8.0-SNAPSHOT  [8/11]
[INFO] ------------------------[ eclipse-test-plugin ]-------------------------
[INFO] 
[INFO] --- tycho-packaging-plugin:1.3.0:build-qualifier (default-build-qualifier) @ org.eclipse.ease.lang.python.jython.test ---
[INFO] The project's OSGi version is 0.8.0.I201911291239
[INFO] 
[INFO] --- tycho-packaging-plugin:1.3.0:validate-id (default-validate-id) @ org.eclipse.ease.lang.python.jython.test ---
[INFO] 
[INFO] --- tycho-packaging-plugin:1.3.0:validate-version (default-validate-version) @ org.eclipse.ease.lang.python.jython.test ---
[INFO] 
[INFO] --- maven-resources-plugin:2.4.3:resources (default-resources) @ org.eclipse.ease.lang.python.jython.test ---
[INFO] Using 'UTF-8' encoding to copy filtered resources.
[INFO] skip non existing resourceDirectory /home/jenkins/agent/workspace/ease.verify.core.target.2019-03/tests/org.eclipse.ease.lang.python.jython.test/src/main/resources
[INFO] 
[INFO] --- tycho-compiler-plugin:1.3.0:compile (default-compile) @ org.eclipse.ease.lang.python.jython.test ---
[INFO] Nothing to compile - all classes are up to date
[INFO] 
[INFO] --- maven-resources-plugin:2.4.3:testResources (default-testResources) @ org.eclipse.ease.lang.python.jython.test ---
[INFO] Using 'UTF-8' encoding to copy filtered resources.
[INFO] skip non existing resourceDirectory /home/jenkins/agent/workspace/ease.verify.core.target.2019-03/tests/org.eclipse.ease.lang.python.jython.test/src/test/resources
[INFO] 
[INFO] --- tycho-source-plugin:1.3.0:plugin-source (plugin-source) @ org.eclipse.ease.lang.python.jython.test ---
[WARNING] Bundle-Vendor header not found in /home/jenkins/agent/workspace/ease.verify.core.target.2019-03/tests/org.eclipse.ease.lang.python.jython.test/META-INF/MANIFEST.MF, fallback to 'unknown' for source bundle
[INFO] Building jar: /home/jenkins/agent/workspace/ease.verify.core.target.2019-03/tests/org.eclipse.ease.lang.python.jython.test/target/org.eclipse.ease.lang.python.jython.test-0.8.0-SNAPSHOT-sources.jar
[INFO] 
[INFO] --- target-platform-configuration:1.3.0:target-platform (default-target-platform) @ org.eclipse.ease.lang.python.jython.test ---
[INFO] 
[INFO] --- tycho-packaging-plugin:1.3.0:package-plugin (default-package-plugin) @ org.eclipse.ease.lang.python.jython.test ---
[INFO] Building jar: /home/jenkins/agent/workspace/ease.verify.core.target.2019-03/tests/org.eclipse.ease.lang.python.jython.test/target/org.eclipse.ease.lang.python.jython.test-0.8.0-SNAPSHOT.jar
[INFO] 
[INFO] --- tycho-p2-plugin:1.3.0:p2-metadata-default (default-p2-metadata-default) @ org.eclipse.ease.lang.python.jython.test ---
[INFO] 
[INFO] --- tycho-source-feature-plugin:1.3.0:source-feature (source-feature) @ org.eclipse.ease.lang.python.jython.test ---
[INFO] 
[INFO] --- tycho-p2-plugin:1.3.0:p2-metadata (attached-p2-metadata) @ org.eclipse.ease.lang.python.jython.test ---
[INFO] 
[INFO] --- tycho-surefire-plugin:1.3.0:test (default-test) @ org.eclipse.ease.lang.python.jython.test ---
[INFO] Expected eclipse log file: /home/jenkins/agent/workspace/ease.verify.core.target.2019-03/tests/org.eclipse.ease.lang.python.jython.test/target/work/data/.metadata/.log
[INFO] Command line:
	[/opt/tools/java/oracle/jdk-8/1.8.0_202/jre/bin/java, -Dosgi.noShutdown=false, -Dosgi.os=linux, -Dosgi.ws=gtk, -Dosgi.arch=x86_64, -Dosgi.clean=true, -jar, /home/jenkins/.m2/repository/p2/osgi/bundle/org.eclipse.equinox.launcher/1.5.300.v20190213-1655/org.eclipse.equinox.launcher-1.5.300.v20190213-1655.jar, -data, /home/jenkins/agent/workspace/ease.verify.core.target.2019-03/tests/org.eclipse.ease.lang.python.jython.test/target/work/data, -install, /home/jenkins/agent/workspace/ease.verify.core.target.2019-03/tests/org.eclipse.ease.lang.python.jython.test/target/work, -configuration, /home/jenkins/agent/workspace/ease.verify.core.target.2019-03/tests/org.eclipse.ease.lang.python.jython.test/target/work/configuration, -application, org.eclipse.tycho.surefire.osgibooter.headlesstest, -testproperties, /home/jenkins/agent/workspace/ease.verify.core.target.2019-03/tests/org.eclipse.ease.lang.python.jython.test/target/surefire.properties]
Picked up JAVA_TOOL_OPTIONS: -XX:+IgnoreUnrecognizedVMOptions -XX:+UseContainerSupport -XX:+UnlockExperimentalVMOptions -XX:+UseCGroupMemoryLimitForHeap -Dmaven.ext.class.path="/home/jenkins/agent/workspace/ease.verify.core.target.2019-03@tmp/withMavene6284ffb/pipeline-maven-spy.jar" -Dorg.jenkinsci.plugins.pipeline.maven.reportsFolder="/home/jenkins/agent/workspace/ease.verify.core.target.2019-03@tmp/withMavene6284ffb" 
Picked up _JAVA_OPTIONS: -XX:MaxRAMPercentage=64.0
Running org.eclipse.ease.lang.python.jython.debugger.JythonDebugTest
Start of script
include file start
include file processed
Result of testMethod = 5
End of script
Start of script
include file start
include file processed
Result of testMethod = 5
End of script
Start of script
include file start
include file processed
Result of testMethod = 5
Traceback (most recent call last):
  File "(none)", line 184, in run
  File "__ref_L/Debug Test/Main.py_zqvrorkcpm", line 23, in <module>
  File "(none)", line 161, in trace_dispatch
org.eclipse.ease.ExitException: 

org.eclipse.ease.ExitException: org.eclipse.ease.ExitException: 
Start of script
include file start
include file processed
Result of testMethod = 5
End of script
Start of script
include file start
include file processed
Result of testMethod = 5
End of script
Start of script
include file start
include file processed
Result of testMethod = 5
End of script
Start of script
include file start
include file processed
Result of testMethod = 5
Traceback (most recent call last):
  File "(none)", line 184, in run
  File "__ref_L/Debug Test/Main.py_knmrtxzrtt", line 23, in <module>
  File "(none)", line 161, in trace_dispatch
org.eclipse.ease.ExitException: 

org.eclipse.ease.ExitException: org.eclipse.ease.ExitException: 
Start of script
include file start
include file processed
Result of testMethod = 5
End of script
Start of script
include file start
include file processed
Result of testMethod = 5
End of script
Start of script
include file start
include file processed
Traceback (most recent call last):
  File "(none)", line 184, in run
  File "__ref_L/Debug Test/Main.py_jmzhvdrluw", line 22, in <module>
  File "(none)", line 161, in trace_dispatch
org.eclipse.ease.ExitException: 

org.eclipse.ease.ExitException: org.eclipse.ease.ExitException: 
Start of script
include file start
include file processed
Result of testMethod = 5
End of script
Start of script
include file start
include file processed
Result of testMethod = 5
End of script
Traceback (most recent call last):
  File "(none)", line 184, in run
  File "__ref_L/Debug Test/Main.py_fqoennaxkd", line 1, in <module>
  File "(none)", line 161, in trace_dispatch
org.eclipse.ease.ExitException: 

org.eclipse.ease.ExitException: org.eclipse.ease.ExitException: 
Start of script
include file start
include file processed
Result of testMethod = 5
End of script
Start of script
include file start
include file processed
Result of testMethod = 5
End of script
Start of script
include file start
include file processed
Result of testMethod = 5
Traceback (most recent call last):
  File "(none)", line 184, in run
  File "__ref_L/Debug Test/Main.py_bwhuychkjl", line 23, in <module>
  File "(none)", line 161, in trace_dispatch
org.eclipse.ease.ExitException: 

org.eclipse.ease.ExitException: org.eclipse.ease.ExitException: 
Start of script
include file start
include file processed
Result of testMethod = 5
End of script
Traceback (most recent call last):
  File "(none)", line 184, in run
  File "__ref_L/Debug Test/Main.py_igxpwpktvn", line 1, in <module>
  File "(none)", line 161, in trace_dispatch
org.eclipse.ease.ExitException: 

org.eclipse.ease.ExitException: org.eclipse.ease.ExitException: 
Start of script
include file start
include file processed
Result of testMethod = 5
End of script
Start of script
include file start
include file processed
Result of testMethod = 5
End of script
Traceback (most recent call last):
  File "(none)", line 184, in run
  File "__ref_L/Debug Test/Main.py_sbugkmcgsr", line 1, in <module>
  File "(none)", line 161, in trace_dispatch
org.eclipse.ease.ExitException: 

org.eclipse.ease.ExitException: org.eclipse.ease.ExitException: 
Start of script
include file start
include file processed
Result of testMethod = 5
End of script
Start of script
include file start
include file processed
Result of testMethod = 5
Traceback (most recent call last):
  File "(none)", line 184, in run
  File "__ref_L/Debug Test/Main.py_bgijzeixhk", line 23, in <module>
  File "(none)", line 161, in trace_dispatch
org.eclipse.ease.ExitException: 

org.eclipse.ease.ExitException: org.eclipse.ease.ExitException: 
Start of script
include file start
include file processed
Result of testMethod = 5
End of script
Start of script
include file start
include file processed
Result of testMethod = 5
End of script
Start of script
include file start
include file processed
Result of testMethod = 5
End of script
Start of script
include file start
include file processed
Result of testMethod = 5
End of script
Start of script
include file start
include file processed
Traceback (most recent call last):
  File "(none)", line 184, in run
  File "__ref_L/Debug Test/Main.py_bmwushnhri", line 21, in <module>
  File "__ref_L/Debug Test/Main.py_bmwushnhri", line 18, in testMethod
  File "(none)", line 161, in trace_dispatch
org.eclipse.ease.ExitException: 

org.eclipse.ease.ExitException: org.eclipse.ease.ExitException: 
Start of script
include file start
include file processed
Result of testMethod = 5
End of script
Start of script
include file start
include file processed
Result of testMethod = 5
Traceback (most recent call last):
  File "(none)", line 184, in run
  File "__ref_L/Debug Test/Main.py_nrqmtssiab", line 23, in <module>
  File "(none)", line 161, in trace_dispatch
org.eclipse.ease.ExitException: 

org.eclipse.ease.ExitException: org.eclipse.ease.ExitException: 
Start of script
include file start
include file processed
Result of testMethod = 5
End of script
Start of script
include file start
include file processed
Result of testMethod = 5
End of script
Start of script
include file start
include file processed
Result of testMethod = 5
End of script
Start of script
include file start
include file processed
Result of testMethod = 5
End of script
Start of script
include file start
include file processed
Result of testMethod = 5
Traceback (most recent call last):
  File "(none)", line 184, in run
  File "__ref_L/Debug Test/Main.py_jjddbwrrgf", line 23, in <module>
  File "(none)", line 161, in trace_dispatch
org.eclipse.ease.ExitException: 

org.eclipse.ease.ExitException: org.eclipse.ease.ExitException: 
Start of script
include file start
include file processed
Result of testMethod = 5
End of script
Start of script
include file start
include file processed
Result of testMethod = 5
Traceback (most recent call last):
  File "(none)", line 184, in run
  File "__ref_L/Debug Test/Main.py_njcyhxcsgo", line 23, in <module>
  File "(none)", line 161, in trace_dispatch
org.eclipse.ease.ExitException: 

org.eclipse.ease.ExitException: org.eclipse.ease.ExitException: 
Traceback (most recent call last):
  File "(none)", line 184, in run
  File "__ref_L/Debug Test/Main.py_xufwbxtsbn", line 1, in <module>
  File "(none)", line 161, in trace_dispatch
org.eclipse.ease.ExitException: 

org.eclipse.ease.ExitException: org.eclipse.ease.ExitException: 
Start of script
include file start
include file processed
Result of testMethod = 5
End of script
Start of script
include file start
include file processed
Result of testMethod = 5
End of script
Start of script
include file start
include file processed
Result of testMethod = 5
End of script
Tests run: 42, Failures: 1, Errors: 0, Skipped: 0, Time elapsed: 12.915 s <<< FAILURE! - in org.eclipse.ease.lang.python.jython.debugger.JythonDebugTest
disconnectProcessInSuspendedState(org.eclipse.ease.lang.python.jython.debugger.JythonDebugTest)  Time elapsed: 1.864 s  <<< FAILURE!
java.lang.AssertionError: expected:<1> but was:<0>

stepReturnIncludeCommand(org.eclipse.ease.lang.python.jython.debugger.JythonDebugTest)  Time elapsed: 0.314 s
arrayVariableSorting(org.eclipse.ease.lang.python.jython.debugger.JythonDebugTest)  Time elapsed: 0.313 s
stepOverOnDebugTarget(org.eclipse.ease.lang.python.jython.debugger.JythonDebugTest)  Time elapsed: 0.311 s
hasDebugTarget(org.eclipse.ease.lang.python.jython.debugger.JythonDebugTest)  Time elapsed: 0.107 s
disconnectThreadInSuspendedState(org.eclipse.ease.lang.python.jython.debugger.JythonDebugTest)  Time elapsed: 0.208 s
stepReturnOnDebugTarget(org.eclipse.ease.lang.python.jython.debugger.JythonDebugTest)  Time elapsed: 0.311 s
nullVariable(org.eclipse.ease.lang.python.jython.debugger.JythonDebugTest)  Time elapsed: 0.308 s
stepOverOnStackFrame(org.eclipse.ease.lang.python.jython.debugger.JythonDebugTest)  Time elapsed: 0.334 s
resumeOnDebugTarget(org.eclipse.ease.lang.python.jython.debugger.JythonDebugTest)  Time elapsed: 0.241 s
modifyVariableKeepingType(org.eclipse.ease.lang.python.jython.debugger.JythonDebugTest)  Time elapsed: 0.506 s
resumeOnLastIncludeLine(org.eclipse.ease.lang.python.jython.debugger.JythonDebugTest)  Time elapsed: 0.208 s
stepReturnOnStackFrame(org.eclipse.ease.lang.python.jython.debugger.JythonDebugTest)  Time elapsed: 0.308 s
terminateStackFrameInSuspendedState(org.eclipse.ease.lang.python.jython.debugger.JythonDebugTest)  Time elapsed: 0.208 s
breakpointLocation(org.eclipse.ease.lang.python.jython.debugger.JythonDebugTest)  Time elapsed: 0.209 s
stepReturnOnThread(org.eclipse.ease.lang.python.jython.debugger.JythonDebugTest)  Time elapsed: 0.309 s
javaClassVariable(org.eclipse.ease.lang.python.jython.debugger.JythonDebugTest)  Time elapsed: 0.311 s
stepIntoOnThread(org.eclipse.ease.lang.python.jython.debugger.JythonDebugTest)  Time elapsed: 0.308 s
terminateThreadInSuspendedState(org.eclipse.ease.lang.python.jython.debugger.JythonDebugTest)  Time elapsed: 0.208 s
resumeOnThread(org.eclipse.ease.lang.python.jython.debugger.JythonDebugTest)  Time elapsed: 0.208 s
stepIntoOnStackFrame(org.eclipse.ease.lang.python.jython.debugger.JythonDebugTest)  Time elapsed: 0.309 s
terminateProcessInSuspendedState(org.eclipse.ease.lang.python.jython.debugger.JythonDebugTest)  Time elapsed: 0.208 s
stepOverOnProcess(org.eclipse.ease.lang.python.jython.debugger.JythonDebugTest)  Time elapsed: 0.308 s
nativeArrayVariable(org.eclipse.ease.lang.python.jython.debugger.JythonDebugTest)  Time elapsed: 0.308 s
disconnectDebugTargetInSuspendedState(org.eclipse.ease.lang.python.jython.debugger.JythonDebugTest)  Time elapsed: 0.208 s
stepIntoOnProcess(org.eclipse.ease.lang.python.jython.debugger.JythonDebugTest)  Time elapsed: 0.307 s
terminatedState(org.eclipse.ease.lang.python.jython.debugger.JythonDebugTest)  Time elapsed: 0.106 s
stepOverIncludeCommand(org.eclipse.ease.lang.python.jython.debugger.JythonDebugTest)  Time elapsed: 0.306 s
innerScopeVariableBeforeOuterScopeVariable(org.eclipse.ease.lang.python.jython.debugger.JythonDebugTest)  Time elapsed: 0.307 s
stepIntoIncludeCommand(org.eclipse.ease.lang.python.jython.debugger.JythonDebugTest)  Time elapsed: 0.306 s
primitiveStringVariable(org.eclipse.ease.lang.python.jython.debugger.JythonDebugTest)  Time elapsed: 0.308 s
resumeOnProcess(org.eclipse.ease.lang.python.jython.debugger.JythonDebugTest)  Time elapsed: 0.206 s
stepIntoOnDebugTarget(org.eclipse.ease.lang.python.jython.debugger.JythonDebugTest)  Time elapsed: 0.309 s
stepOverOnThread(org.eclipse.ease.lang.python.jython.debugger.JythonDebugTest)  Time elapsed: 0.31 s
suspendedState(org.eclipse.ease.lang.python.jython.debugger.JythonDebugTest)  Time elapsed: 0.233 s
primitiveDoubleVariable(org.eclipse.ease.lang.python.jython.debugger.JythonDebugTest)  Time elapsed: 0.306 s
resumeOnStackFrame(org.eclipse.ease.lang.python.jython.debugger.JythonDebugTest)  Time elapsed: 0.207 s
nativeObjectVariable(org.eclipse.ease.lang.python.jython.debugger.JythonDebugTest)  Time elapsed: 0.306 s
terminateDebugTargetInSuspendedState(org.eclipse.ease.lang.python.jython.debugger.JythonDebugTest)  Time elapsed: 0.206 s
disconnectStackFrameInSuspendedState(org.eclipse.ease.lang.python.jython.debugger.JythonDebugTest)  Time elapsed: 0.208 s
stepReturnOnProcess(org.eclipse.ease.lang.python.jython.debugger.JythonDebugTest)  Time elapsed: 0.307 s
evaluateWatchExpression(org.eclipse.ease.lang.python.jython.debugger.JythonDebugTest)  Time elapsed: 0.211 s

Results:

Failures: 
  JythonDebugTest>AbstractDebugTest.disconnectProcessInSuspendedState:523->AbstractDebugTest.disconnectTestTemplate:513 expected:<1> but was:<0>

Tests run: 42, Failures: 1, Errors: 0, Skipped: 0

[INFO] ------------------------------------------------------------------------
[INFO] Reactor Summary for org.eclipse.ease.releng 0.8.0-SNAPSHOT:
[INFO] 
[INFO] org.eclipse.ease.releng ............................ SUCCESS [  0.003 s]
[INFO] org.eclipse.ease.releng.target ..................... SUCCESS [  0.163 s]
[INFO] org.eclipse.ease.test .............................. SUCCESS [ 18.293 s]
[INFO] org.eclipse.ease.lang.javascript.nashorn.test ...... SUCCESS [  3.233 s]
[INFO] org.eclipse.ease.lang.javascript.rhino.test ........ SUCCESS [ 15.094 s]
[INFO] org.eclipse.ease.lang.javascript.test .............. SUCCESS [  2.729 s]
[INFO] org.eclipse.ease.lang.python.test .................. SUCCESS [  2.300 s]
[INFO] org.eclipse.ease.lang.python.jython.test ........... FAILURE [ 16.412 s]
[INFO] org.eclipse.ease.lang.python.py4j.test ............. SKIPPED
[INFO] org.eclipse.ease.lang.scriptarchive.test ........... SKIPPED
[INFO] org.eclipse.ease.ui.test ........................... SKIPPED
[INFO] ------------------------------------------------------------------------
[INFO] BUILD FAILURE
[INFO] ------------------------------------------------------------------------
[INFO] Total time:  02:04 min
[INFO] Finished at: 2020-06-13T21:44:26Z
[INFO] ------------------------------------------------------------------------
[WARNING] [jenkins-event-spy] Unexpected Maven project file name 'target-tests-pom.xml', problems may occur
[INFO] [jenkins-event-spy] Generated /home/jenkins/agent/workspace/ease.verify.core.target.2019-03@tmp/withMavene6284ffb/maven-spy-20200613-214222-113788261480797681159.log
[ERROR] Failed to execute goal org.eclipse.tycho:tycho-surefire-plugin:1.3.0:test (default-test) on project org.eclipse.ease.lang.python.jython.test: There are test failures.
[ERROR] 
[ERROR] Please refer to /home/jenkins/agent/workspace/ease.verify.core.target.2019-03/tests/org.eclipse.ease.lang.python.jython.test/target/surefire-reports for the individual test results.
[ERROR] -> [Help 1]
[ERROR] 
[ERROR] To see the full stack trace of the errors, re-run Maven with the -e switch.
[ERROR] Re-run Maven using the -X switch to enable full debug logging.
[ERROR] 
[ERROR] For more information about the errors and possible solutions, please read the following articles:
[ERROR] [Help 1] http://cwiki.apache.org/confluence/display/MAVEN/MojoFailureException
[ERROR] 
[ERROR] After correcting the problems, you can resume the build with the command
[ERROR]   mvn <args> -rf :org.eclipse.ease.lang.python.jython.test
[Pipeline] }
[withMaven] Publishers: Pipeline Graph Publisher: 2 ms
[Pipeline] // withMaven
[Pipeline] }
[Pipeline] // stage
[Pipeline] stage
[Pipeline] { (Declarative: Post Actions)
[Pipeline] archiveArtifacts
Archiving artifacts
[Pipeline] emailext
Sending email to: christian.pontesegger@web.de
[Pipeline] }
[Pipeline] // stage
[Pipeline] }
[Pipeline] // timeout
[Pipeline] }
[Pipeline] // timestamps
[Pipeline] }
[Pipeline] // node
[Pipeline] End of Pipeline
ERROR: script returned exit code 1
Finished: FAILURE