Console Output

Skipping 1,099 KB.. Full Log
T22:40:58.329Z]   File "(none)", line 161, in trace_dispatch
17:40:58 [2021-12-25T22:40:58.329Z] 	at org.eclipse.ease.debugging.AbstractEaseDebugger.handleEventsInSuspendedState(AbstractEaseDebugger.java:331)
17:40:58 [2021-12-25T22:40:58.329Z] 	at org.eclipse.ease.debugging.AbstractEaseDebugger.suspend(AbstractEaseDebugger.java:257)
17:40:58 [2021-12-25T22:40:58.329Z] 	at org.eclipse.ease.debugging.AbstractEaseDebugger.processLine(AbstractEaseDebugger.java:492)
17:40:58 [2021-12-25T22:40:58.330Z] 	at org.eclipse.ease.lang.python.debugger.PythonDebugger.traceDispatch(PythonDebugger.java:179)
17:40:58 [2021-12-25T22:40:58.330Z] 	at org.eclipse.ease.lang.python.jython.debugger.JythonDebugger.traceDispatch(JythonDebugger.java:46)
17:40:58 [2021-12-25T22:40:58.330Z] 	at jdk.internal.reflect.GeneratedMethodAccessor25.invoke(Unknown Source)
17:40:58 [2021-12-25T22:40:58.330Z] 	at java.base/jdk.internal.reflect.DelegatingMethodAccessorImpl.invoke(DelegatingMethodAccessorImpl.java:43)
17:40:58 [2021-12-25T22:40:58.330Z] 	at java.base/java.lang.reflect.Method.invoke(Method.java:564)
17:40:58 [2021-12-25T22:40:58.330Z] 
17:40:58 [2021-12-25T22:40:58.330Z] org.eclipse.ease.ScriptEngineCancellationException: org.eclipse.ease.ScriptEngineCancellationException: Terminated on user request
17:40:58 [2021-12-25T22:40:58.586Z] Start of script
17:40:58 [2021-12-25T22:40:58.586Z] include file start
17:40:58 [2021-12-25T22:40:58.586Z] include file processed
17:40:58 [2021-12-25T22:40:58.586Z] Result of testMethod = 5
17:40:58 [2021-12-25T22:40:58.586Z] End of script
17:40:58 [2021-12-25T22:40:58.843Z] Start of script
17:40:58 [2021-12-25T22:40:58.843Z] include file start
17:40:58 [2021-12-25T22:40:58.843Z] include file processed
17:40:58 [2021-12-25T22:40:58.843Z] Result of testMethod = 5
17:40:58 [2021-12-25T22:40:58.843Z] End of script
17:40:59 [2021-12-25T22:40:59.099Z] Start of script
17:40:59 [2021-12-25T22:40:59.099Z] include file start
17:40:59 [2021-12-25T22:40:59.099Z] include file processed
17:40:59 [2021-12-25T22:40:59.099Z] Result of testMethod = 5
17:40:59 [2021-12-25T22:40:59.099Z] End of script
17:40:59 [2021-12-25T22:40:59.356Z] Tests run: 41, Failures: 0, Errors: 0, Skipped: 0, Time elapsed: 14.488 s - in org.eclipse.ease.lang.python.jython.debugger.JythonDebugTest
17:40:59 [2021-12-25T22:40:59.356Z] disconnectProcessInSuspendedState  Time elapsed: 3.55 s
17:40:59 [2021-12-25T22:40:59.356Z] stepReturnIncludeCommand  Time elapsed: 0.214 s
17:40:59 [2021-12-25T22:40:59.356Z] arrayVariableSorting  Time elapsed: 0.308 s
17:40:59 [2021-12-25T22:40:59.356Z] stepOverOnDebugTarget  Time elapsed: 0.307 s
17:40:59 [2021-12-25T22:40:59.356Z] disconnectThreadInSuspendedState  Time elapsed: 0.207 s
17:40:59 [2021-12-25T22:40:59.356Z] stepReturnOnDebugTarget  Time elapsed: 0.311 s
17:40:59 [2021-12-25T22:40:59.356Z] nullVariable  Time elapsed: 0.427 s
17:40:59 [2021-12-25T22:40:59.356Z] stepOverOnStackFrame  Time elapsed: 0.306 s
17:40:59 [2021-12-25T22:40:59.356Z] resumeOnDebugTarget  Time elapsed: 0.205 s
17:40:59 [2021-12-25T22:40:59.356Z] modifyVariableKeepingType  Time elapsed: 0.507 s
17:40:59 [2021-12-25T22:40:59.356Z] resumeOnLastIncludeLine  Time elapsed: 0.205 s
17:40:59 [2021-12-25T22:40:59.356Z] stepReturnOnStackFrame  Time elapsed: 0.308 s
17:40:59 [2021-12-25T22:40:59.356Z] terminateStackFrameInSuspendedState  Time elapsed: 0.206 s
17:40:59 [2021-12-25T22:40:59.356Z] breakpointLocation  Time elapsed: 0.206 s
17:40:59 [2021-12-25T22:40:59.356Z] stepReturnOnThread  Time elapsed: 0.306 s
17:40:59 [2021-12-25T22:40:59.356Z] javaClassVariable  Time elapsed: 0.308 s
17:40:59 [2021-12-25T22:40:59.356Z] stepIntoOnThread  Time elapsed: 0.306 s
17:40:59 [2021-12-25T22:40:59.356Z] terminateThreadInSuspendedState  Time elapsed: 0.205 s
17:40:59 [2021-12-25T22:40:59.356Z] resumeOnThread  Time elapsed: 0.205 s
17:40:59 [2021-12-25T22:40:59.356Z] stepIntoOnStackFrame  Time elapsed: 0.305 s
17:40:59 [2021-12-25T22:40:59.356Z] terminateProcessInSuspendedState  Time elapsed: 0.206 s
17:40:59 [2021-12-25T22:40:59.356Z] stepOverOnProcess  Time elapsed: 0.306 s
17:40:59 [2021-12-25T22:40:59.356Z] nativeArrayVariable  Time elapsed: 0.305 s
17:40:59 [2021-12-25T22:40:59.356Z] disconnectDebugTargetInSuspendedState  Time elapsed: 0.206 s
17:40:59 [2021-12-25T22:40:59.356Z] stepIntoOnProcess  Time elapsed: 0.307 s
17:40:59 [2021-12-25T22:40:59.356Z] terminatedState  Time elapsed: 0.105 s
17:40:59 [2021-12-25T22:40:59.356Z] stepOverIncludeCommand  Time elapsed: 0.305 s
17:40:59 [2021-12-25T22:40:59.356Z] innerScopeVariableBeforeOuterScopeVariable  Time elapsed: 0.304 s
17:40:59 [2021-12-25T22:40:59.356Z] stepIntoIncludeCommand  Time elapsed: 0.305 s
17:40:59 [2021-12-25T22:40:59.356Z] primitiveStringVariable  Time elapsed: 0.305 s
17:40:59 [2021-12-25T22:40:59.356Z] resumeOnProcess  Time elapsed: 0.204 s
17:40:59 [2021-12-25T22:40:59.356Z] stepIntoOnDebugTarget  Time elapsed: 0.306 s
17:40:59 [2021-12-25T22:40:59.356Z] stepOverOnThread  Time elapsed: 0.307 s
17:40:59 [2021-12-25T22:40:59.356Z] suspendedState  Time elapsed: 0.204 s
17:40:59 [2021-12-25T22:40:59.356Z] primitiveDoubleVariable  Time elapsed: 0.306 s
17:40:59 [2021-12-25T22:40:59.356Z] resumeOnStackFrame  Time elapsed: 0.332 s
17:40:59 [2021-12-25T22:40:59.356Z] nativeObjectVariable  Time elapsed: 0.305 s
17:40:59 [2021-12-25T22:40:59.356Z] terminateDebugTargetInSuspendedState  Time elapsed: 0.205 s
17:40:59 [2021-12-25T22:40:59.356Z] disconnectStackFrameInSuspendedState  Time elapsed: 0.205 s
17:40:59 [2021-12-25T22:40:59.356Z] stepReturnOnProcess  Time elapsed: 0.306 s
17:40:59 [2021-12-25T22:40:59.356Z] evaluateWatchExpression  Time elapsed: 0.225 s
17:40:59 [2021-12-25T22:40:59.356Z] 
17:40:59 [2021-12-25T22:40:59.356Z] Results:
17:40:59 [2021-12-25T22:40:59.356Z] 
17:40:59 [2021-12-25T22:40:59.356Z] Tests run: 41, Failures: 0, Errors: 0, Skipped: 0
17:40:59 [2021-12-25T22:40:59.356Z] 
17:40:59 [2021-12-25T22:40:59.356Z] [INFO] All tests passed!
17:40:59 [2021-12-25T22:40:59.356Z] [INFO] 
17:40:59 [2021-12-25T22:40:59.356Z] [INFO] --- maven-pmd-plugin:3.15.0:pmd (pmd-integration) @ org.eclipse.ease.lang.python.jython.test ---
17:40:59 [2021-12-25T22:40:59.356Z] [INFO] PMD version: 6.38.0
17:40:59 [2021-12-25T22:40:59.640Z] [WARNING] Could not find class org.eclipse.ease.lang.python.jython.debugger.JythonDebugTest, due to: java.lang.IncompatibleClassChangeError: class net.sourceforge.pmd.lang.java.typeresolution.visitors.PMDASMVisitor has interface org.objectweb.asm.ClassVisitor as super class
17:40:59 [2021-12-25T22:40:59.641Z] [INFO] 
17:40:59 [2021-12-25T22:40:59.641Z] [INFO] --- maven-pmd-plugin:3.15.0:cpd (pmd-integration) @ org.eclipse.ease.lang.python.jython.test ---
17:40:59 [2021-12-25T22:40:59.641Z] [INFO] PMD version: 6.38.0
17:40:59 [2021-12-25T22:40:59.641Z] [INFO] 
17:40:59 [2021-12-25T22:40:59.641Z] [INFO] --- spotbugs-maven-plugin:4.1.4:spotbugs (spotbugs-integration) @ org.eclipse.ease.lang.python.jython.test ---
17:40:59 [2021-12-25T22:40:59.641Z] [INFO] Fork Value is false
17:40:59 [2021-12-25T22:40:59.641Z]      [java] JVM args ignored when same JVM is used.
17:41:02 [2021-12-25T22:41:02.440Z] [INFO] Done SpotBugs Analysis....
17:41:02 [2021-12-25T22:41:02.440Z] [INFO] 
17:41:02 [2021-12-25T22:41:02.440Z] [INFO] --- maven-checkstyle-plugin:3.1.1:check (checkstyle-integration) @ org.eclipse.ease.lang.python.jython.test ---
17:41:02 [2021-12-25T22:41:02.440Z] [INFO] You have 0 Checkstyle violations.
17:41:02 [2021-12-25T22:41:02.440Z] [INFO] 
17:41:02 [2021-12-25T22:41:02.440Z] [INFO] --- maven-install-plugin:2.3.1:install (default-install) @ org.eclipse.ease.lang.python.jython.test ---
17:41:02 [2021-12-25T22:41:02.440Z] [INFO] Installing /home/jenkins/agent/workspace/ease.verify.core.target.2019-03/tests/org.eclipse.ease.lang.python.jython.test/target/org.eclipse.ease.lang.python.jython.test-0.9.0-SNAPSHOT.jar to /home/jenkins/.m2/repository/org/eclipse/ease/org.eclipse.ease.lang.python.jython.test/0.9.0-SNAPSHOT/org.eclipse.ease.lang.python.jython.test-0.9.0-SNAPSHOT.jar
17:41:02 [2021-12-25T22:41:02.440Z] [INFO] Installing /home/jenkins/agent/workspace/ease.verify.core.target.2019-03/tests/org.eclipse.ease.lang.python.jython.test/pom.xml to /home/jenkins/.m2/repository/org/eclipse/ease/org.eclipse.ease.lang.python.jython.test/0.9.0-SNAPSHOT/org.eclipse.ease.lang.python.jython.test-0.9.0-SNAPSHOT.pom
17:41:02 [2021-12-25T22:41:02.440Z] [INFO] Installing /home/jenkins/agent/workspace/ease.verify.core.target.2019-03/tests/org.eclipse.ease.lang.python.jython.test/target/p2content.xml to /home/jenkins/.m2/repository/org/eclipse/ease/org.eclipse.ease.lang.python.jython.test/0.9.0-SNAPSHOT/org.eclipse.ease.lang.python.jython.test-0.9.0-SNAPSHOT-p2metadata.xml
17:41:02 [2021-12-25T22:41:02.440Z] [INFO] Installing /home/jenkins/agent/workspace/ease.verify.core.target.2019-03/tests/org.eclipse.ease.lang.python.jython.test/target/p2artifacts.xml to /home/jenkins/.m2/repository/org/eclipse/ease/org.eclipse.ease.lang.python.jython.test/0.9.0-SNAPSHOT/org.eclipse.ease.lang.python.jython.test-0.9.0-SNAPSHOT-p2artifacts.xml
17:41:02 [2021-12-25T22:41:02.440Z] [INFO] 
17:41:02 [2021-12-25T22:41:02.440Z] [INFO] --- tycho-p2-plugin:2.2.0:update-local-index (default-update-local-index) @ org.eclipse.ease.lang.python.jython.test ---
17:41:02 [2021-12-25T22:41:02.440Z] [INFO] 
17:41:02 [2021-12-25T22:41:02.440Z] [INFO] -----< org.eclipse.ease:org.eclipse.ease.lang.scriptarchive.test >------
17:41:02 [2021-12-25T22:41:02.440Z] [INFO] Building org.eclipse.ease.lang.scriptarchive.test 0.9.0-SNAPSHOT [43/49]
17:41:02 [2021-12-25T22:41:02.440Z] [INFO] ------------------------[ eclipse-test-plugin ]-------------------------
17:41:02 [2021-12-25T22:41:02.440Z] [INFO] 
17:41:02 [2021-12-25T22:41:02.440Z] [INFO] --- maven-clean-plugin:2.5:clean (default-clean) @ org.eclipse.ease.lang.scriptarchive.test ---
17:41:02 [2021-12-25T22:41:02.440Z] [INFO] 
17:41:02 [2021-12-25T22:41:02.440Z] [INFO] --- tycho-packaging-plugin:2.2.0:build-qualifier (default-build-qualifier) @ org.eclipse.ease.lang.scriptarchive.test ---
17:41:02 [2021-12-25T22:41:02.441Z] [INFO] The project's OSGi version is 0.9.0.I202106220815
17:41:02 [2021-12-25T22:41:02.441Z] [INFO] 
17:41:02 [2021-12-25T22:41:02.441Z] [INFO] --- tycho-packaging-plugin:2.2.0:validate-id (default-validate-id) @ org.eclipse.ease.lang.scriptarchive.test ---
17:41:02 [2021-12-25T22:41:02.441Z] [INFO] 
17:41:02 [2021-12-25T22:41:02.441Z] [INFO] --- tycho-packaging-plugin:2.2.0:validate-version (default-validate-version) @ org.eclipse.ease.lang.scriptarchive.test ---
17:41:02 [2021-12-25T22:41:02.441Z] [INFO] 
17:41:02 [2021-12-25T22:41:02.441Z] [INFO] --- maven-resources-plugin:2.4.3:resources (default-resources) @ org.eclipse.ease.lang.scriptarchive.test ---
17:41:02 [2021-12-25T22:41:02.441Z] [INFO] Using 'UTF-8' encoding to copy filtered resources.
17:41:02 [2021-12-25T22:41:02.441Z] [INFO] skip non existing resourceDirectory /home/jenkins/agent/workspace/ease.verify.core.target.2019-03/tests/org.eclipse.ease.lang.scriptarchive.test/src/main/resources
17:41:02 [2021-12-25T22:41:02.441Z] [INFO] 
17:41:02 [2021-12-25T22:41:02.441Z] [INFO] --- tycho-compiler-plugin:2.2.0:compile (default-compile) @ org.eclipse.ease.lang.scriptarchive.test ---
17:41:02 [2021-12-25T22:41:02.441Z] [INFO] Compiling 1 source file to /home/jenkins/agent/workspace/ease.verify.core.target.2019-03/tests/org.eclipse.ease.lang.scriptarchive.test/target/classes
17:41:02 [2021-12-25T22:41:02.441Z] [INFO] 
17:41:02 [2021-12-25T22:41:02.441Z] [INFO] --- maven-resources-plugin:2.4.3:testResources (default-testResources) @ org.eclipse.ease.lang.scriptarchive.test ---
17:41:02 [2021-12-25T22:41:02.441Z] [INFO] Using 'UTF-8' encoding to copy filtered resources.
17:41:02 [2021-12-25T22:41:02.441Z] [INFO] skip non existing resourceDirectory /home/jenkins/agent/workspace/ease.verify.core.target.2019-03/tests/org.eclipse.ease.lang.scriptarchive.test/src/test/resources
17:41:02 [2021-12-25T22:41:02.441Z] [INFO] 
17:41:02 [2021-12-25T22:41:02.441Z] [INFO] --- target-platform-configuration:2.2.0:target-platform (default-target-platform) @ org.eclipse.ease.lang.scriptarchive.test ---
17:41:02 [2021-12-25T22:41:02.441Z] [INFO] 
17:41:02 [2021-12-25T22:41:02.441Z] [INFO] --- tycho-packaging-plugin:2.2.0:package-plugin (default-package-plugin) @ org.eclipse.ease.lang.scriptarchive.test ---
17:41:02 [2021-12-25T22:41:02.441Z] [INFO] Building jar: /home/jenkins/agent/workspace/ease.verify.core.target.2019-03/tests/org.eclipse.ease.lang.scriptarchive.test/target/org.eclipse.ease.lang.scriptarchive.test-0.9.0-SNAPSHOT.jar
17:41:02 [2021-12-25T22:41:02.441Z] [INFO] 
17:41:02 [2021-12-25T22:41:02.441Z] [INFO] --- tycho-p2-plugin:2.2.0:p2-metadata-default (default-p2-metadata-default) @ org.eclipse.ease.lang.scriptarchive.test ---
17:41:02 [2021-12-25T22:41:02.441Z] [INFO] 
17:41:02 [2021-12-25T22:41:02.441Z] [INFO] --- jacoco-maven-plugin:0.8.6:prepare-agent (jacoco-initialize) @ org.eclipse.ease.lang.scriptarchive.test ---
17:41:02 [2021-12-25T22:41:02.441Z] [INFO] tycho.testArgLine set to -javaagent:/home/jenkins/.m2/repository/org/jacoco/org.jacoco.agent/0.8.6/org.jacoco.agent-0.8.6-runtime.jar=destfile=/home/jenkins/agent/workspace/ease.verify.core.target.2019-03/tests/org.eclipse.ease.lang.scriptarchive.test/target/jacoco.exec,output=file
17:41:02 [2021-12-25T22:41:02.441Z] [INFO] 
17:41:02 [2021-12-25T22:41:02.442Z] [INFO] --- tycho-surefire-plugin:2.2.0:test (default-test) @ org.eclipse.ease.lang.scriptarchive.test ---
17:41:02 [2021-12-25T22:41:02.442Z] [INFO] Executing Test Runtime with timeout 0, logs (if any) will be placed at: /home/jenkins/agent/workspace/ease.verify.core.target.2019-03/tests/org.eclipse.ease.lang.scriptarchive.test/target/work/data/.metadata/.log
17:41:02 [2021-12-25T22:41:02.442Z] [INFO] Command line:
17:41:02 [2021-12-25T22:41:02.442Z] 	[/opt/tools/java/openjdk/jdk-15/15.0.2+7/bin/java, -Dosgi.noShutdown=false, -Dosgi.os=linux, -Dosgi.ws=gtk, -Dosgi.arch=x86_64, -javaagent:/home/jenkins/.m2/repository/org/jacoco/org.jacoco.agent/0.8.6/org.jacoco.agent-0.8.6-runtime.jar=destfile=/home/jenkins/agent/workspace/ease.verify.core.target.2019-03/tests/org.eclipse.ease.lang.scriptarchive.test/target/jacoco.exec,output=file, -Dosgi.clean=true, -jar, /home/jenkins/.m2/repository/p2/osgi/bundle/org.eclipse.equinox.launcher/1.6.300.v20210813-1054/org.eclipse.equinox.launcher-1.6.300.v20210813-1054.jar, -data, /home/jenkins/agent/workspace/ease.verify.core.target.2019-03/tests/org.eclipse.ease.lang.scriptarchive.test/target/work/data, -install, /home/jenkins/agent/workspace/ease.verify.core.target.2019-03/tests/org.eclipse.ease.lang.scriptarchive.test/target/work, -configuration, /home/jenkins/agent/workspace/ease.verify.core.target.2019-03/tests/org.eclipse.ease.lang.scriptarchive.test/target/work/configuration, -application, org.eclipse.tycho.surefire.osgibooter.headlesstest, -testproperties, /home/jenkins/agent/workspace/ease.verify.core.target.2019-03/tests/org.eclipse.ease.lang.scriptarchive.test/target/surefire.properties]
17:41:02 [2021-12-25T22:41:02.442Z] Picked up JAVA_TOOL_OPTIONS: -Dmaven.ext.class.path="/home/jenkins/agent/workspace/ease.verify.core.target.2019-03@tmp/withMaven8615b88a/pipeline-maven-spy.jar" -Dorg.jenkinsci.plugins.pipeline.maven.reportsFolder="/home/jenkins/agent/workspace/ease.verify.core.target.2019-03@tmp/withMaven8615b88a" 
17:41:05 [2021-12-25T22:41:05.740Z] Running org.eclipse.ease.lang.scriptarchive.ArchiveEngineTest
17:41:05 [2021-12-25T22:41:05.740Z] We are running from a zip file!
17:41:05 [2021-12-25T22:41:05.996Z] org.eclipse.ease.ScriptExecutionException: SyntaxError: missing ; before statement (workspace://__EASE_ScriptArchive_1/scripts/Master.js#3)
17:41:05 [2021-12-25T22:41:05.996Z] this is an error
17:41:05 [2021-12-25T22:41:05.996Z]        ^
17:41:05 [2021-12-25T22:41:05.996Z] 	at Master.js,workspace://__EASE_ScriptArchive_1/scripts/Master.js
17:41:05 [2021-12-25T22:41:05.996Z] org.eclipse.ease.ScriptExecutionException: SyntaxError: missing ; before statement (workspace://__EASE_ScriptArchive_1/scripts/Master.js#3)
17:41:05 [2021-12-25T22:41:05.997Z] this is an error
17:41:05 [2021-12-25T22:41:05.997Z]        ^
17:41:05 [2021-12-25T22:41:05.997Z] 	at Master.js,workspace://__EASE_ScriptArchive_1/scripts/Master.js
17:41:05 [2021-12-25T22:41:05.997Z] Tests run: 7, Failures: 0, Errors: 0, Skipped: 0, Time elapsed: 0.819 s - in org.eclipse.ease.lang.scriptarchive.ArchiveEngineTest
17:41:05 [2021-12-25T22:41:05.997Z] executeWithManifest  Time elapsed: 0.641 s
17:41:05 [2021-12-25T22:41:05.997Z] zipFileRegistration  Time elapsed: 0.01 s
17:41:05 [2021-12-25T22:41:05.997Z] engineIdRegistration  Time elapsed: 0 s
17:41:05 [2021-12-25T22:41:05.997Z] jarFileRegistration  Time elapsed: 0.001 s
17:41:05 [2021-12-25T22:41:05.997Z] sarFileRegistration  Time elapsed: 0.001 s
17:41:05 [2021-12-25T22:41:05.997Z] executeWithErrors  Time elapsed: 0.066 s
17:41:05 [2021-12-25T22:41:05.997Z] executeWithIncludes  Time elapsed: 0.064 s
17:41:05 [2021-12-25T22:41:05.997Z] 
17:41:05 [2021-12-25T22:41:05.997Z] Results:
17:41:05 [2021-12-25T22:41:05.997Z] 
17:41:05 [2021-12-25T22:41:05.997Z] Tests run: 7, Failures: 0, Errors: 0, Skipped: 0
17:41:05 [2021-12-25T22:41:05.997Z] 
17:41:06 [2021-12-25T22:41:06.253Z] [INFO] All tests passed!
17:41:06 [2021-12-25T22:41:06.253Z] [INFO] 
17:41:06 [2021-12-25T22:41:06.253Z] [INFO] --- maven-pmd-plugin:3.15.0:pmd (pmd-integration) @ org.eclipse.ease.lang.scriptarchive.test ---
17:41:06 [2021-12-25T22:41:06.253Z] [INFO] PMD version: 6.38.0
17:41:06 [2021-12-25T22:41:06.562Z] [WARNING] Could not find class org.eclipse.ease.lang.scriptarchive.ArchiveEngineTest, due to: java.lang.IncompatibleClassChangeError: class net.sourceforge.pmd.lang.java.typeresolution.visitors.PMDASMVisitor has interface org.objectweb.asm.ClassVisitor as super class
17:41:06 [2021-12-25T22:41:06.562Z] [INFO] 
17:41:06 [2021-12-25T22:41:06.562Z] [INFO] --- maven-pmd-plugin:3.15.0:cpd (pmd-integration) @ org.eclipse.ease.lang.scriptarchive.test ---
17:41:06 [2021-12-25T22:41:06.562Z] [INFO] PMD version: 6.38.0
17:41:06 [2021-12-25T22:41:06.562Z] [INFO] 
17:41:06 [2021-12-25T22:41:06.562Z] [INFO] --- spotbugs-maven-plugin:4.1.4:spotbugs (spotbugs-integration) @ org.eclipse.ease.lang.scriptarchive.test ---
17:41:06 [2021-12-25T22:41:06.562Z] [INFO] Fork Value is false
17:41:06 [2021-12-25T22:41:06.562Z]      [java] JVM args ignored when same JVM is used.
17:41:09 [2021-12-25T22:41:09.140Z] [INFO] Done SpotBugs Analysis....
17:41:09 [2021-12-25T22:41:09.140Z] [INFO] 
17:41:09 [2021-12-25T22:41:09.140Z] [INFO] --- maven-checkstyle-plugin:3.1.1:check (checkstyle-integration) @ org.eclipse.ease.lang.scriptarchive.test ---
17:41:09 [2021-12-25T22:41:09.140Z] [INFO] You have 0 Checkstyle violations.
17:41:09 [2021-12-25T22:41:09.140Z] [INFO] 
17:41:09 [2021-12-25T22:41:09.140Z] [INFO] --- maven-install-plugin:2.3.1:install (default-install) @ org.eclipse.ease.lang.scriptarchive.test ---
17:41:09 [2021-12-25T22:41:09.140Z] [INFO] Installing /home/jenkins/agent/workspace/ease.verify.core.target.2019-03/tests/org.eclipse.ease.lang.scriptarchive.test/target/org.eclipse.ease.lang.scriptarchive.test-0.9.0-SNAPSHOT.jar to /home/jenkins/.m2/repository/org/eclipse/ease/org.eclipse.ease.lang.scriptarchive.test/0.9.0-SNAPSHOT/org.eclipse.ease.lang.scriptarchive.test-0.9.0-SNAPSHOT.jar
17:41:09 [2021-12-25T22:41:09.141Z] [INFO] Installing /home/jenkins/agent/workspace/ease.verify.core.target.2019-03/tests/org.eclipse.ease.lang.scriptarchive.test/pom.xml to /home/jenkins/.m2/repository/org/eclipse/ease/org.eclipse.ease.lang.scriptarchive.test/0.9.0-SNAPSHOT/org.eclipse.ease.lang.scriptarchive.test-0.9.0-SNAPSHOT.pom
17:41:09 [2021-12-25T22:41:09.141Z] [INFO] Installing /home/jenkins/agent/workspace/ease.verify.core.target.2019-03/tests/org.eclipse.ease.lang.scriptarchive.test/target/p2content.xml to /home/jenkins/.m2/repository/org/eclipse/ease/org.eclipse.ease.lang.scriptarchive.test/0.9.0-SNAPSHOT/org.eclipse.ease.lang.scriptarchive.test-0.9.0-SNAPSHOT-p2metadata.xml
17:41:09 [2021-12-25T22:41:09.141Z] [INFO] Installing /home/jenkins/agent/workspace/ease.verify.core.target.2019-03/tests/org.eclipse.ease.lang.scriptarchive.test/target/p2artifacts.xml to /home/jenkins/.m2/repository/org/eclipse/ease/org.eclipse.ease.lang.scriptarchive.test/0.9.0-SNAPSHOT/org.eclipse.ease.lang.scriptarchive.test-0.9.0-SNAPSHOT-p2artifacts.xml
17:41:09 [2021-12-25T22:41:09.141Z] [INFO] 
17:41:09 [2021-12-25T22:41:09.141Z] [INFO] --- tycho-p2-plugin:2.2.0:update-local-index (default-update-local-index) @ org.eclipse.ease.lang.scriptarchive.test ---
17:41:09 [2021-12-25T22:41:09.141Z] [INFO] 
17:41:09 [2021-12-25T22:41:09.141Z] [INFO] --------< org.eclipse.ease:org.eclipse.ease.lang.unittest.test >--------
17:41:09 [2021-12-25T22:41:09.141Z] [INFO] Building org.eclipse.ease.lang.unittest.test 0.9.0-SNAPSHOT      [44/49]
17:41:09 [2021-12-25T22:41:09.141Z] [INFO] ------------------------[ eclipse-test-plugin ]-------------------------
17:41:09 [2021-12-25T22:41:09.141Z] [INFO] 
17:41:09 [2021-12-25T22:41:09.141Z] [INFO] --- maven-clean-plugin:2.5:clean (default-clean) @ org.eclipse.ease.lang.unittest.test ---
17:41:09 [2021-12-25T22:41:09.141Z] [INFO] 
17:41:09 [2021-12-25T22:41:09.141Z] [INFO] --- tycho-packaging-plugin:2.2.0:build-qualifier (default-build-qualifier) @ org.eclipse.ease.lang.unittest.test ---
17:41:09 [2021-12-25T22:41:09.141Z] [INFO] The project's OSGi version is 0.9.0.I202111240844
17:41:09 [2021-12-25T22:41:09.141Z] [INFO] 
17:41:09 [2021-12-25T22:41:09.141Z] [INFO] --- tycho-packaging-plugin:2.2.0:validate-id (default-validate-id) @ org.eclipse.ease.lang.unittest.test ---
17:41:09 [2021-12-25T22:41:09.141Z] [INFO] 
17:41:09 [2021-12-25T22:41:09.141Z] [INFO] --- tycho-packaging-plugin:2.2.0:validate-version (default-validate-version) @ org.eclipse.ease.lang.unittest.test ---
17:41:09 [2021-12-25T22:41:09.141Z] [INFO] 
17:41:09 [2021-12-25T22:41:09.141Z] [INFO] --- maven-resources-plugin:2.4.3:resources (default-resources) @ org.eclipse.ease.lang.unittest.test ---
17:41:09 [2021-12-25T22:41:09.141Z] [INFO] Using 'UTF-8' encoding to copy filtered resources.
17:41:09 [2021-12-25T22:41:09.141Z] [INFO] skip non existing resourceDirectory /home/jenkins/agent/workspace/ease.verify.core.target.2019-03/tests/org.eclipse.ease.lang.unittest.test/src/main/resources
17:41:09 [2021-12-25T22:41:09.141Z] [INFO] 
17:41:09 [2021-12-25T22:41:09.141Z] [INFO] --- tycho-compiler-plugin:2.2.0:compile (default-compile) @ org.eclipse.ease.lang.unittest.test ---
17:41:09 [2021-12-25T22:41:09.141Z] [INFO] Compiling 8 source files to /home/jenkins/agent/workspace/ease.verify.core.target.2019-03/tests/org.eclipse.ease.lang.unittest.test/target/classes
17:41:09 [2021-12-25T22:41:09.141Z] [INFO] 
17:41:09 [2021-12-25T22:41:09.141Z] [INFO] --- maven-resources-plugin:2.4.3:testResources (default-testResources) @ org.eclipse.ease.lang.unittest.test ---
17:41:09 [2021-12-25T22:41:09.142Z] [INFO] Using 'UTF-8' encoding to copy filtered resources.
17:41:09 [2021-12-25T22:41:09.142Z] [INFO] skip non existing resourceDirectory /home/jenkins/agent/workspace/ease.verify.core.target.2019-03/tests/org.eclipse.ease.lang.unittest.test/src/test/resources
17:41:09 [2021-12-25T22:41:09.142Z] [INFO] 
17:41:09 [2021-12-25T22:41:09.142Z] [INFO] --- target-platform-configuration:2.2.0:target-platform (default-target-platform) @ org.eclipse.ease.lang.unittest.test ---
17:41:09 [2021-12-25T22:41:09.142Z] [INFO] 
17:41:09 [2021-12-25T22:41:09.142Z] [INFO] --- tycho-packaging-plugin:2.2.0:package-plugin (default-package-plugin) @ org.eclipse.ease.lang.unittest.test ---
17:41:09 [2021-12-25T22:41:09.142Z] [INFO] Building jar: /home/jenkins/agent/workspace/ease.verify.core.target.2019-03/tests/org.eclipse.ease.lang.unittest.test/target/org.eclipse.ease.lang.unittest.test-0.9.0-SNAPSHOT.jar
17:41:09 [2021-12-25T22:41:09.142Z] [INFO] 
17:41:09 [2021-12-25T22:41:09.142Z] [INFO] --- tycho-p2-plugin:2.2.0:p2-metadata-default (default-p2-metadata-default) @ org.eclipse.ease.lang.unittest.test ---
17:41:09 [2021-12-25T22:41:09.142Z] [INFO] 
17:41:09 [2021-12-25T22:41:09.142Z] [INFO] --- jacoco-maven-plugin:0.8.6:prepare-agent (jacoco-initialize) @ org.eclipse.ease.lang.unittest.test ---
17:41:09 [2021-12-25T22:41:09.142Z] [INFO] tycho.testArgLine set to -javaagent:/home/jenkins/.m2/repository/org/jacoco/org.jacoco.agent/0.8.6/org.jacoco.agent-0.8.6-runtime.jar=destfile=/home/jenkins/agent/workspace/ease.verify.core.target.2019-03/tests/org.eclipse.ease.lang.unittest.test/target/jacoco.exec,output=file
17:41:09 [2021-12-25T22:41:09.142Z] [INFO] 
17:41:09 [2021-12-25T22:41:09.142Z] [INFO] --- tycho-surefire-plugin:2.2.0:test (default-test) @ org.eclipse.ease.lang.unittest.test ---
17:41:09 [2021-12-25T22:41:09.142Z] [INFO] Executing Test Runtime with timeout 0, logs (if any) will be placed at: /home/jenkins/agent/workspace/ease.verify.core.target.2019-03/tests/org.eclipse.ease.lang.unittest.test/target/work/data/.metadata/.log
17:41:09 [2021-12-25T22:41:09.142Z] [INFO] Command line:
17:41:09 [2021-12-25T22:41:09.142Z] 	[/opt/tools/java/openjdk/jdk-15/15.0.2+7/bin/java, -Dosgi.noShutdown=false, -Dosgi.os=linux, -Dosgi.ws=gtk, -Dosgi.arch=x86_64, -javaagent:/home/jenkins/.m2/repository/org/jacoco/org.jacoco.agent/0.8.6/org.jacoco.agent-0.8.6-runtime.jar=destfile=/home/jenkins/agent/workspace/ease.verify.core.target.2019-03/tests/org.eclipse.ease.lang.unittest.test/target/jacoco.exec,output=file, -Dosgi.clean=true, -jar, /home/jenkins/.m2/repository/p2/osgi/bundle/org.eclipse.equinox.launcher/1.6.300.v20210813-1054/org.eclipse.equinox.launcher-1.6.300.v20210813-1054.jar, -data, /home/jenkins/agent/workspace/ease.verify.core.target.2019-03/tests/org.eclipse.ease.lang.unittest.test/target/work/data, -install, /home/jenkins/agent/workspace/ease.verify.core.target.2019-03/tests/org.eclipse.ease.lang.unittest.test/target/work, -configuration, /home/jenkins/agent/workspace/ease.verify.core.target.2019-03/tests/org.eclipse.ease.lang.unittest.test/target/work/configuration, -application, org.eclipse.tycho.surefire.osgibooter.headlesstest, -testproperties, /home/jenkins/agent/workspace/ease.verify.core.target.2019-03/tests/org.eclipse.ease.lang.unittest.test/target/surefire.properties]
17:41:09 [2021-12-25T22:41:09.142Z] Picked up JAVA_TOOL_OPTIONS: -Dmaven.ext.class.path="/home/jenkins/agent/workspace/ease.verify.core.target.2019-03@tmp/withMaven8615b88a/pipeline-maven-spy.jar" -Dorg.jenkinsci.plugins.pipeline.maven.reportsFolder="/home/jenkins/agent/workspace/ease.verify.core.target.2019-03@tmp/withMaven8615b88a" 
17:41:12 [2021-12-25T22:41:12.449Z] Running org.eclipse.ease.lang.unittest.ClassicJavaScriptTest
17:41:14 [2021-12-25T22:41:14.370Z] Tests run: 7, Failures: 0, Errors: 0, Skipped: 0, Time elapsed: 1.988 s - in org.eclipse.ease.lang.unittest.ClassicJavaScriptTest
17:41:14 [2021-12-25T22:41:14.370Z] folderStatus  Time elapsed: 0.878 s
17:41:14 [2021-12-25T22:41:14.370Z] errorTestStatus  Time elapsed: 0.208 s
17:41:14 [2021-12-25T22:41:14.370Z] failureTestStatus  Time elapsed: 0.172 s
17:41:14 [2021-12-25T22:41:14.370Z] verifyOutput  Time elapsed: 0.181 s
17:41:14 [2021-12-25T22:41:14.370Z] suiteStatus  Time elapsed: 0.19 s
17:41:14 [2021-12-25T22:41:14.370Z] ignoreTestStatus  Time elapsed: 0.125 s
17:41:14 [2021-12-25T22:41:14.370Z] passTestStatus  Time elapsed: 0.12 s
17:41:14 [2021-12-25T22:41:14.370Z] Running org.eclipse.ease.lang.unittest.ModernJavaScriptTest
17:41:15 [2021-12-25T22:41:15.306Z] Tests run: 8, Failures: 0, Errors: 0, Skipped: 0, Time elapsed: 0.952 s - in org.eclipse.ease.lang.unittest.ModernJavaScriptTest
17:41:15 [2021-12-25T22:41:15.306Z] folderStatus  Time elapsed: 0.139 s
17:41:15 [2021-12-25T22:41:15.306Z] verifyOutput  Time elapsed: 0.124 s
17:41:15 [2021-12-25T22:41:15.306Z] suiteStatus  Time elapsed: 0.106 s
17:41:15 [2021-12-25T22:41:15.306Z] ignoreTestStatus  Time elapsed: 0.134 s
17:41:15 [2021-12-25T22:41:15.306Z] ignoreTestClassStatus  Time elapsed: 0.106 s
17:41:15 [2021-12-25T22:41:15.306Z] failureTestClassStatus  Time elapsed: 0.112 s
17:41:15 [2021-12-25T22:41:15.306Z] errorTestClassStatus  Time elapsed: 0.114 s
17:41:15 [2021-12-25T22:41:15.306Z] passTestClassStatus  Time elapsed: 0.112 s
17:41:15 [2021-12-25T22:41:15.306Z] Running org.eclipse.ease.lang.unittest.runtime.impl.TestTest
17:41:16 [2021-12-25T22:41:16.236Z] Tests run: 30, Failures: 0, Errors: 0, Skipped: 0, Time elapsed: 0.944 s - in org.eclipse.ease.lang.unittest.runtime.impl.TestTest
17:41:16 [2021-12-25T22:41:16.236Z] reset_clears_results  Time elapsed: 0.001 s
17:41:16 [2021-12-25T22:41:16.236Z] hasError_is_false_when_no_error_exists  Time elapsed: 0.001 s
17:41:16 [2021-12-25T22:41:16.236Z] getDuration_is_0_for_not_executed_test  Time elapsed: 0.001 s
17:41:16 [2021-12-25T22:41:16.236Z] getStatus_is_DISABLED_when_1_result_is_disabled  Time elapsed: 0 s
17:41:16 [2021-12-25T22:41:16.236Z] reset_clears_status  Time elapsed: 0 s
17:41:16 [2021-12-25T22:41:16.236Z] getResults_FAILURE_returns_only_matching_results  Time elapsed: 0.001 s
17:41:16 [2021-12-25T22:41:16.236Z] isDisabled_is_false_for_finished_test  Time elapsed: 0 s
17:41:16 [2021-12-25T22:41:16.236Z] getStatus_is_DISABLED_when_entity_status_is_disabled  Time elapsed: 0 s
17:41:16 [2021-12-25T22:41:16.236Z] getStatus_is_status_of_worst_result  Time elapsed: 0.001 s
17:41:16 [2021-12-25T22:41:16.236Z] getEstimatedDuration_is_minus_1_by_default  Time elapsed: 0 s
17:41:16 [2021-12-25T22:41:16.236Z] getDuration_returns_current_execution_time_for_running_test  Time elapsed: 0.201 s
17:41:16 [2021-12-25T22:41:16.236Z] setDisabled_marks_test_as_disabled  Time elapsed: 0.001 s
17:41:16 [2021-12-25T22:41:16.236Z] getStatus_is_entity_status_if_it_is_the_worst_status  Time elapsed: 0 s
17:41:16 [2021-12-25T22:41:16.236Z] reset_clears_timestamps  Time elapsed: 0 s
17:41:16 [2021-12-25T22:41:16.236Z] getResource_returns_parent_resource  Time elapsed: 0.005 s
17:41:16 [2021-12-25T22:41:16.236Z] isDisabled_is_true_when_1_result_is_DISABLED  Time elapsed: 0.001 s
17:41:16 [2021-12-25T22:41:16.236Z] getFullPath_returns_test_name  Time elapsed: 0 s
17:41:16 [2021-12-25T22:41:16.236Z] getDuration_returns_execution_time_for_completed_test  Time elapsed: 0.101 s
17:41:16 [2021-12-25T22:41:16.236Z] addError_adds_error_result  Time elapsed: 0.365 s
17:41:16 [2021-12-25T22:41:16.236Z] getFullPath_returns_parent_path_and_test_name  Time elapsed: 0 s
17:41:16 [2021-12-25T22:41:16.236Z] reset_clears_metadata  Time elapsed: 0.001 s
17:41:16 [2021-12-25T22:41:16.236Z] getRoot_returns_root_element  Time elapsed: 0 s
17:41:16 [2021-12-25T22:41:16.236Z] hasError_is_true_when_error_exists  Time elapsed: 0.001 s
17:41:16 [2021-12-25T22:41:16.236Z] setEntityStatus_FINISHED_sets_end_timestamp  Time elapsed: 0.001 s
17:41:16 [2021-12-25T22:41:16.236Z] getWorstResult_returns_worst_execution_result  Time elapsed: 0 s
17:41:16 [2021-12-25T22:41:16.236Z] getTestSuite_returns_master_suite  Time elapsed: 0.001 s
17:41:16 [2021-12-25T22:41:16.236Z] isDisabled_is_true_when_status_is_DISABLED  Time elapsed: 0 s
17:41:16 [2021-12-25T22:41:16.236Z] setEntityStatus_RUNNING_sets_start_timestamp  Time elapsed: 0 s
17:41:16 [2021-12-25T22:41:16.237Z] setEndTimestamp_verifies_duration_limit  Time elapsed: 0.021 s
17:41:16 [2021-12-25T22:41:16.237Z] setStackTrace_stores_a_clone_of_the_trace  Time elapsed: 0.237 s
17:41:16 [2021-12-25T22:41:16.237Z] Running org.eclipse.ease.lang.unittest.runtime.impl.TestEntityTest
17:41:16 [2021-12-25T22:41:16.493Z] Tests run: 28, Failures: 0, Errors: 0, Skipped: 0, Time elapsed: 0.312 s - in org.eclipse.ease.lang.unittest.runtime.impl.TestEntityTest
17:41:16 [2021-12-25T22:41:16.493Z] reset_clears_results  Time elapsed: 0 s
17:41:16 [2021-12-25T22:41:16.493Z] hasError_is_false_when_no_error_exists  Time elapsed: 0 s
17:41:16 [2021-12-25T22:41:16.493Z] getDuration_is_0_for_not_executed_test  Time elapsed: 0 s
17:41:16 [2021-12-25T22:41:16.493Z] getStatus_is_DISABLED_when_1_result_is_disabled  Time elapsed: 0 s
17:41:16 [2021-12-25T22:41:16.493Z] reset_clears_status  Time elapsed: 0 s
17:41:16 [2021-12-25T22:41:16.493Z] getResults_FAILURE_returns_only_matching_results  Time elapsed: 0 s
17:41:16 [2021-12-25T22:41:16.493Z] isDisabled_is_false_for_finished_test  Time elapsed: 0 s
17:41:16 [2021-12-25T22:41:16.493Z] getStatus_is_DISABLED_when_entity_status_is_disabled  Time elapsed: 0.001 s
17:41:16 [2021-12-25T22:41:16.493Z] getStatus_is_status_of_worst_result  Time elapsed: 0 s
17:41:16 [2021-12-25T22:41:16.493Z] getEstimatedDuration_is_minus_1_by_default  Time elapsed: 0 s
17:41:16 [2021-12-25T22:41:16.493Z] getDuration_returns_current_execution_time_for_running_test  Time elapsed: 0.201 s
17:41:16 [2021-12-25T22:41:16.493Z] setDisabled_marks_test_as_disabled  Time elapsed: 0.001 s
17:41:16 [2021-12-25T22:41:16.493Z] getStatus_is_entity_status_if_it_is_the_worst_status  Time elapsed: 0 s
17:41:16 [2021-12-25T22:41:16.493Z] reset_clears_timestamps  Time elapsed: 0.001 s
17:41:16 [2021-12-25T22:41:16.493Z] getResource_returns_parent_resource  Time elapsed: 0 s
17:41:16 [2021-12-25T22:41:16.493Z] isDisabled_is_true_when_1_result_is_DISABLED  Time elapsed: 0.001 s
17:41:16 [2021-12-25T22:41:16.493Z] getFullPath_returns_test_name  Time elapsed: 0 s
17:41:16 [2021-12-25T22:41:16.493Z] getDuration_returns_execution_time_for_completed_test  Time elapsed: 0.101 s
17:41:16 [2021-12-25T22:41:16.493Z] addError_adds_error_result  Time elapsed: 0.001 s
17:41:16 [2021-12-25T22:41:16.493Z] getFullPath_returns_parent_path_and_test_name  Time elapsed: 0 s
17:41:16 [2021-12-25T22:41:16.493Z] reset_clears_metadata  Time elapsed: 0.001 s
17:41:16 [2021-12-25T22:41:16.493Z] getRoot_returns_root_element  Time elapsed: 0 s
17:41:16 [2021-12-25T22:41:16.493Z] hasError_is_true_when_error_exists  Time elapsed: 0 s
17:41:16 [2021-12-25T22:41:16.493Z] setEntityStatus_FINISHED_sets_end_timestamp  Time elapsed: 0 s
17:41:16 [2021-12-25T22:41:16.493Z] getWorstResult_returns_worst_execution_result  Time elapsed: 0 s
17:41:16 [2021-12-25T22:41:16.494Z] getTestSuite_returns_master_suite  Time elapsed: 0 s
17:41:16 [2021-12-25T22:41:16.494Z] isDisabled_is_true_when_status_is_DISABLED  Time elapsed: 0 s
17:41:16 [2021-12-25T22:41:16.494Z] setEntityStatus_RUNNING_sets_start_timestamp  Time elapsed: 0 s
17:41:16 [2021-12-25T22:41:16.494Z] Running org.eclipse.ease.lang.unittest.runtime.impl.TestFileTest
17:41:17 [2021-12-25T22:41:17.056Z] Tests run: 43, Failures: 0, Errors: 0, Skipped: 2, Time elapsed: 0.438 s - in org.eclipse.ease.lang.unittest.runtime.impl.TestFileTest
17:41:17 [2021-12-25T22:41:17.056Z] reset_clears_results  Time elapsed: 0.001 s
17:41:17 [2021-12-25T22:41:17.056Z] hasError_is_false_when_no_error_exists  Time elapsed: 0 s
17:41:17 [2021-12-25T22:41:17.056Z] getDuration_is_0_for_not_executed_test  Time elapsed: 0 s
17:41:17 [2021-12-25T22:41:17.056Z] getStatus_is_DISABLED_when_1_result_is_disabled  Time elapsed: 0 s
17:41:17 [2021-12-25T22:41:17.056Z] reset_clears_status  Time elapsed: 0 s
17:41:17 [2021-12-25T22:41:17.056Z] getResults_FAILURE_returns_only_matching_results  Time elapsed: 0.001 s
17:41:17 [2021-12-25T22:41:17.056Z] isDisabled_is_false_for_finished_test  Time elapsed: 0 s
17:41:17 [2021-12-25T22:41:17.056Z] getStatus_is_DISABLED_when_entity_status_is_disabled  Time elapsed: 0 s
17:41:17 [2021-12-25T22:41:17.056Z] getStatus_is_status_of_worst_result  Time elapsed: 0.001 s
17:41:17 [2021-12-25T22:41:17.056Z] getEstimatedDuration_is_minus_1_by_default  Time elapsed: 0 s
17:41:17 [2021-12-25T22:41:17.056Z] getDuration_returns_current_execution_time_for_running_test  Time elapsed: 0.201 s
17:41:17 [2021-12-25T22:41:17.056Z] setDisabled_marks_test_as_disabled  Time elapsed: 0.001 s
17:41:17 [2021-12-25T22:41:17.056Z] getStatus_is_entity_status_if_it_is_the_worst_status  Time elapsed: 0 s
17:41:17 [2021-12-25T22:41:17.056Z] reset_clears_timestamps  Time elapsed: 0.001 s
17:41:17 [2021-12-25T22:41:17.056Z] isDisabled_is_true_when_1_result_is_DISABLED  Time elapsed: 0 s
17:41:17 [2021-12-25T22:41:17.056Z] getFullPath_returns_test_name  Time elapsed: 0.001 s
17:41:17 [2021-12-25T22:41:17.056Z] getDuration_returns_execution_time_for_completed_test  Time elapsed: 0.1 s
17:41:17 [2021-12-25T22:41:17.056Z] addError_adds_error_result  Time elapsed: 0 s
17:41:17 [2021-12-25T22:41:17.056Z] getFullPath_returns_parent_path_and_test_name  Time elapsed: 0 s
17:41:17 [2021-12-25T22:41:17.056Z] reset_clears_metadata  Time elapsed: 0 s
17:41:17 [2021-12-25T22:41:17.056Z] getRoot_returns_root_element  Time elapsed: 0.001 s
17:41:17 [2021-12-25T22:41:17.056Z] hasError_is_true_when_error_exists  Time elapsed: 0 s
17:41:17 [2021-12-25T22:41:17.056Z] setEntityStatus_FINISHED_sets_end_timestamp  Time elapsed: 0 s
17:41:17 [2021-12-25T22:41:17.056Z] getWorstResult_returns_worst_execution_result  Time elapsed: 0.001 s
17:41:17 [2021-12-25T22:41:17.056Z] getTestSuite_returns_master_suite  Time elapsed: 0 s
17:41:17 [2021-12-25T22:41:17.056Z] isDisabled_is_true_when_status_is_DISABLED  Time elapsed: 0 s
17:41:17 [2021-12-25T22:41:17.056Z] setEntityStatus_RUNNING_sets_start_timestamp  Time elapsed: 0.001 s
17:41:17 [2021-12-25T22:41:17.056Z] hasError_queries_children_for_error_status  Time elapsed: 0 s
17:41:17 [2021-12-25T22:41:17.056Z] setTerminated_terminates_children_too  Time elapsed: 0 s
17:41:17 [2021-12-25T22:41:17.056Z] getTest_is_null_when_child_test_does_not_exist  Time elapsed: 0 s
17:41:17 [2021-12-25T22:41:17.056Z] getTest_returns_child_with_matching_name  Time elapsed: 0 s
17:41:17 [2021-12-25T22:41:17.056Z] getEstimatedDuration_sums_child_estimations  Time elapsed: 0 s
17:41:17 [2021-12-25T22:41:17.056Z] reset_deletes_children_of_type_ITest  Time elapsed: 0 s
17:41:17 [2021-12-25T22:41:17.056Z] getResource_returns_parent_resource skipped
17:41:17 [2021-12-25T22:41:17.057Z] getStatus_returns_worst_child_status  Time elapsed: 0 s
17:41:17 [2021-12-25T22:41:17.057Z] getChildContainers_returns_only_containers  Time elapsed: 0 s
17:41:17 [2021-12-25T22:41:17.057Z] getStatus_returns_entity_status  Time elapsed: 0 s
17:41:17 [2021-12-25T22:41:17.057Z] getEstimatedDuration_is_0_for_disabled_status  Time elapsed: 0 s
17:41:17 [2021-12-25T22:41:17.057Z] run_adds_error_when_no_engine_is_found  Time elapsed: 0.012 s
17:41:17 [2021-12-25T22:41:17.057Z] reset_removes_error_markers_from_files  Time elapsed: 0.079 s
17:41:17 [2021-12-25T22:41:17.057Z] reset_disables_TestFile_when_set_in_suite_description  Time elapsed: 0.028 s
17:41:17 [2021-12-25T22:41:17.057Z] run_does_not_execute_disabled_tests  Time elapsed: 0.001 s
17:41:17 [2021-12-25T22:41:17.057Z] run_executes_each_child skipped
17:41:17 [2021-12-25T22:41:17.057Z] Running org.eclipse.ease.lang.unittest.runtime.impl.TestContainerTest
17:41:17 [2021-12-25T22:41:17.313Z] Tests run: 38, Failures: 0, Errors: 0, Skipped: 1, Time elapsed: 0.315 s - in org.eclipse.ease.lang.unittest.runtime.impl.TestContainerTest
17:41:17 [2021-12-25T22:41:17.313Z] reset_clears_results  Time elapsed: 0 s
17:41:17 [2021-12-25T22:41:17.313Z] hasError_is_false_when_no_error_exists  Time elapsed: 0.001 s
17:41:17 [2021-12-25T22:41:17.313Z] getDuration_is_0_for_not_executed_test  Time elapsed: 0 s
17:41:17 [2021-12-25T22:41:17.313Z] getStatus_is_DISABLED_when_1_result_is_disabled  Time elapsed: 0 s
17:41:17 [2021-12-25T22:41:17.313Z] reset_clears_status  Time elapsed: 0.001 s
17:41:17 [2021-12-25T22:41:17.313Z] getResults_FAILURE_returns_only_matching_results  Time elapsed: 0 s
17:41:17 [2021-12-25T22:41:17.313Z] isDisabled_is_false_for_finished_test  Time elapsed: 0 s
17:41:17 [2021-12-25T22:41:17.313Z] getStatus_is_DISABLED_when_entity_status_is_disabled  Time elapsed: 0.001 s
17:41:17 [2021-12-25T22:41:17.313Z] getStatus_is_status_of_worst_result  Time elapsed: 0 s
17:41:17 [2021-12-25T22:41:17.313Z] getEstimatedDuration_is_minus_1_by_default  Time elapsed: 0 s
17:41:17 [2021-12-25T22:41:17.313Z] getDuration_returns_current_execution_time_for_running_test  Time elapsed: 0.201 s
17:41:17 [2021-12-25T22:41:17.313Z] setDisabled_marks_test_as_disabled  Time elapsed: 0.001 s
17:41:17 [2021-12-25T22:41:17.313Z] getStatus_is_entity_status_if_it_is_the_worst_status  Time elapsed: 0 s
17:41:17 [2021-12-25T22:41:17.313Z] reset_clears_timestamps  Time elapsed: 0 s
17:41:17 [2021-12-25T22:41:17.313Z] isDisabled_is_true_when_1_result_is_DISABLED  Time elapsed: 0.001 s
17:41:17 [2021-12-25T22:41:17.313Z] getFullPath_returns_test_name  Time elapsed: 0 s
17:41:17 [2021-12-25T22:41:17.313Z] getDuration_returns_execution_time_for_completed_test  Time elapsed: 0.101 s
17:41:17 [2021-12-25T22:41:17.313Z] addError_adds_error_result  Time elapsed: 0.001 s
17:41:17 [2021-12-25T22:41:17.313Z] getFullPath_returns_parent_path_and_test_name  Time elapsed: 0.001 s
17:41:17 [2021-12-25T22:41:17.313Z] reset_clears_metadata  Time elapsed: 0 s
17:41:17 [2021-12-25T22:41:17.313Z] getRoot_returns_root_element  Time elapsed: 0 s
17:41:17 [2021-12-25T22:41:17.313Z] hasError_is_true_when_error_exists  Time elapsed: 0 s
17:41:17 [2021-12-25T22:41:17.313Z] setEntityStatus_FINISHED_sets_end_timestamp  Time elapsed: 0 s
17:41:17 [2021-12-25T22:41:17.313Z] getWorstResult_returns_worst_execution_result  Time elapsed: 0 s
17:41:17 [2021-12-25T22:41:17.313Z] getTestSuite_returns_master_suite  Time elapsed: 0.001 s
17:41:17 [2021-12-25T22:41:17.313Z] isDisabled_is_true_when_status_is_DISABLED  Time elapsed: 0 s
17:41:17 [2021-12-25T22:41:17.313Z] setEntityStatus_RUNNING_sets_start_timestamp  Time elapsed: 0 s
17:41:17 [2021-12-25T22:41:17.314Z] hasError_queries_children_for_error_status  Time elapsed: 0 s
17:41:17 [2021-12-25T22:41:17.314Z] setTerminated_terminates_children_too  Time elapsed: 0 s
17:41:17 [2021-12-25T22:41:17.314Z] getTest_is_null_when_child_test_does_not_exist  Time elapsed: 0 s
17:41:17 [2021-12-25T22:41:17.314Z] getTest_returns_child_with_matching_name  Time elapsed: 0 s
17:41:17 [2021-12-25T22:41:17.314Z] getEstimatedDuration_sums_child_estimations  Time elapsed: 0.001 s
17:41:17 [2021-12-25T22:41:17.314Z] reset_deletes_children_of_type_ITest  Time elapsed: 0 s
17:41:17 [2021-12-25T22:41:17.314Z] getResource_returns_parent_resource skipped
17:41:17 [2021-12-25T22:41:17.314Z] getStatus_returns_worst_child_status  Time elapsed: 0 s
17:41:17 [2021-12-25T22:41:17.314Z] getChildContainers_returns_only_containers  Time elapsed: 0.001 s
17:41:17 [2021-12-25T22:41:17.314Z] getStatus_returns_entity_status  Time elapsed: 0 s
17:41:17 [2021-12-25T22:41:17.314Z] run_executes_each_child  Time elapsed: 0.001 s
17:41:17 [2021-12-25T22:41:17.314Z] Running org.eclipse.ease.lang.unittest.adapters.HeadlessResultAdapterTest
17:41:17 [2021-12-25T22:41:17.314Z] Tests run: 7, Failures: 0, Errors: 0, Skipped: 0, Time elapsed: 0.041 s - in org.eclipse.ease.lang.unittest.adapters.HeadlessResultAdapterTest
17:41:17 [2021-12-25T22:41:17.314Z] getAdapter_declines_to_adapt_generic_object  Time elapsed: 0.001 s
17:41:17 [2021-12-25T22:41:17.314Z] getAdapter_adapts_testsuite_with_failures_to_100  Time elapsed: 0.035 s
17:41:17 [2021-12-25T22:41:17.314Z] adapter_can_be_called_via_adapter_framework  Time elapsed: 0.001 s
17:41:17 [2021-12-25T22:41:17.314Z] getAdapter_adapts_testsuite_with_errors_to_200  Time elapsed: 0 s
17:41:17 [2021-12-25T22:41:17.314Z] getAdapterList_returns_only_ITestSuite  Time elapsed: 0.001 s
17:41:17 [2021-12-25T22:41:17.314Z] getAdapter_adapts_testsuite_with_no_errors_to_0  Time elapsed: 0.001 s
17:41:17 [2021-12-25T22:41:17.314Z] getAdapter_declines_to_adapt_to_Boolean  Time elapsed: 0 s
17:41:17 [2021-12-25T22:41:17.314Z] 
17:41:17 [2021-12-25T22:41:17.314Z] Results:
17:41:17 [2021-12-25T22:41:17.314Z] 
17:41:17 [2021-12-25T22:41:17.314Z] Tests run: 161, Failures: 0, Errors: 0, Skipped: 3
17:41:17 [2021-12-25T22:41:17.314Z] 
17:41:17 [2021-12-25T22:41:17.570Z] [INFO] All tests passed!
17:41:17 [2021-12-25T22:41:17.570Z] [INFO] 
17:41:17 [2021-12-25T22:41:17.570Z] [INFO] --- maven-pmd-plugin:3.15.0:pmd (pmd-integration) @ org.eclipse.ease.lang.unittest.test ---
17:41:17 [2021-12-25T22:41:17.570Z] [INFO] PMD version: 6.38.0
17:41:17 [2021-12-25T22:41:17.840Z] [WARNING] Could not find class org.eclipse.ease.lang.unittest.ClassicJavaScriptTest, due to: java.lang.IncompatibleClassChangeError: class net.sourceforge.pmd.lang.java.typeresolution.visitors.PMDASMVisitor has interface org.objectweb.asm.ClassVisitor as super class
17:41:17 [2021-12-25T22:41:17.840Z] [WARNING] Could not find class org.eclipse.ease.lang.unittest.ModernJavaScriptTest, due to: java.lang.IncompatibleClassChangeError: class net.sourceforge.pmd.lang.java.typeresolution.visitors.PMDASMVisitor has interface org.objectweb.asm.ClassVisitor as super class
17:41:17 [2021-12-25T22:41:17.840Z] [WARNING] Could not find class org.eclipse.ease.lang.unittest.adapters.HeadlessResultAdapterTest, due to: java.lang.IncompatibleClassChangeError: class net.sourceforge.pmd.lang.java.typeresolution.visitors.PMDASMVisitor has interface org.objectweb.asm.ClassVisitor as super class
17:41:17 [2021-12-25T22:41:17.841Z] [WARNING] Could not find class org.eclipse.ease.lang.unittest.TestBase, due to: java.lang.IncompatibleClassChangeError: class net.sourceforge.pmd.lang.java.typeresolution.visitors.PMDASMVisitor has interface org.objectweb.asm.ClassVisitor as super class
17:41:18 [2021-12-25T22:41:18.097Z] [WARNING] Could not find class org.eclipse.ease.lang.unittest.runtime.impl.TestContainerTest, due to: java.lang.IncompatibleClassChangeError: class net.sourceforge.pmd.lang.java.typeresolution.visitors.PMDASMVisitor has interface org.objectweb.asm.ClassVisitor as super class
17:41:18 [2021-12-25T22:41:18.097Z] [WARNING] Could not find class org.eclipse.ease.lang.unittest.runtime.impl.TestEntityTest, due to: java.lang.IncompatibleClassChangeError: class net.sourceforge.pmd.lang.java.typeresolution.visitors.PMDASMVisitor has interface org.objectweb.asm.ClassVisitor as super class
17:41:18 [2021-12-25T22:41:18.097Z] [WARNING] Could not find class org.eclipse.ease.lang.unittest.runtime.impl.TestFileTest, due to: java.lang.IncompatibleClassChangeError: class net.sourceforge.pmd.lang.java.typeresolution.visitors.PMDASMVisitor has interface org.objectweb.asm.ClassVisitor as super class
17:41:18 [2021-12-25T22:41:18.097Z] [WARNING] Could not find class org.eclipse.ease.lang.unittest.runtime.impl.TestTest, due to: java.lang.IncompatibleClassChangeError: class net.sourceforge.pmd.lang.java.typeresolution.visitors.PMDASMVisitor has interface org.objectweb.asm.ClassVisitor as super class
17:41:18 [2021-12-25T22:41:18.353Z] [INFO] 
17:41:18 [2021-12-25T22:41:18.353Z] [INFO] --- maven-pmd-plugin:3.15.0:cpd (pmd-integration) @ org.eclipse.ease.lang.unittest.test ---
17:41:18 [2021-12-25T22:41:18.353Z] [INFO] PMD version: 6.38.0
17:41:18 [2021-12-25T22:41:18.353Z] [INFO] 
17:41:18 [2021-12-25T22:41:18.354Z] [INFO] --- spotbugs-maven-plugin:4.1.4:spotbugs (spotbugs-integration) @ org.eclipse.ease.lang.unittest.test ---
17:41:18 [2021-12-25T22:41:18.354Z] [INFO] Fork Value is false
17:41:18 [2021-12-25T22:41:18.354Z]      [java] JVM args ignored when same JVM is used.
17:41:21 [2021-12-25T22:41:21.643Z] [INFO] Done SpotBugs Analysis....
17:41:21 [2021-12-25T22:41:21.643Z] [INFO] 
17:41:21 [2021-12-25T22:41:21.643Z] [INFO] --- maven-checkstyle-plugin:3.1.1:check (checkstyle-integration) @ org.eclipse.ease.lang.unittest.test ---
17:41:21 [2021-12-25T22:41:21.643Z] [INFO] You have 0 Checkstyle violations.
17:41:21 [2021-12-25T22:41:21.643Z] [INFO] 
17:41:21 [2021-12-25T22:41:21.643Z] [INFO] --- maven-install-plugin:2.3.1:install (default-install) @ org.eclipse.ease.lang.unittest.test ---
17:41:21 [2021-12-25T22:41:21.643Z] [INFO] Installing /home/jenkins/agent/workspace/ease.verify.core.target.2019-03/tests/org.eclipse.ease.lang.unittest.test/target/org.eclipse.ease.lang.unittest.test-0.9.0-SNAPSHOT.jar to /home/jenkins/.m2/repository/org/eclipse/ease/org.eclipse.ease.lang.unittest.test/0.9.0-SNAPSHOT/org.eclipse.ease.lang.unittest.test-0.9.0-SNAPSHOT.jar
17:41:21 [2021-12-25T22:41:21.643Z] [INFO] Installing /home/jenkins/agent/workspace/ease.verify.core.target.2019-03/tests/org.eclipse.ease.lang.unittest.test/pom.xml to /home/jenkins/.m2/repository/org/eclipse/ease/org.eclipse.ease.lang.unittest.test/0.9.0-SNAPSHOT/org.eclipse.ease.lang.unittest.test-0.9.0-SNAPSHOT.pom
17:41:21 [2021-12-25T22:41:21.643Z] [INFO] Installing /home/jenkins/agent/workspace/ease.verify.core.target.2019-03/tests/org.eclipse.ease.lang.unittest.test/target/p2content.xml to /home/jenkins/.m2/repository/org/eclipse/ease/org.eclipse.ease.lang.unittest.test/0.9.0-SNAPSHOT/org.eclipse.ease.lang.unittest.test-0.9.0-SNAPSHOT-p2metadata.xml
17:41:21 [2021-12-25T22:41:21.643Z] [INFO] Installing /home/jenkins/agent/workspace/ease.verify.core.target.2019-03/tests/org.eclipse.ease.lang.unittest.test/target/p2artifacts.xml to /home/jenkins/.m2/repository/org/eclipse/ease/org.eclipse.ease.lang.unittest.test/0.9.0-SNAPSHOT/org.eclipse.ease.lang.unittest.test-0.9.0-SNAPSHOT-p2artifacts.xml
17:41:21 [2021-12-25T22:41:21.643Z] [INFO] 
17:41:21 [2021-12-25T22:41:21.643Z] [INFO] --- tycho-p2-plugin:2.2.0:update-local-index (default-update-local-index) @ org.eclipse.ease.lang.unittest.test ---
17:41:21 [2021-12-25T22:41:21.643Z] [INFO] 
17:41:21 [2021-12-25T22:41:21.643Z] [INFO] ---------< org.eclipse.ease:org.eclipse.ease.ui.scripts.test >----------
17:41:21 [2021-12-25T22:41:21.643Z] [INFO] Building org.eclipse.ease.ui.scripts.test 0.9.0-SNAPSHOT         [45/49]
17:41:21 [2021-12-25T22:41:21.643Z] [INFO] ------------------------[ eclipse-test-plugin ]-------------------------
17:41:21 [2021-12-25T22:41:21.644Z] [INFO] 
17:41:21 [2021-12-25T22:41:21.644Z] [INFO] --- maven-clean-plugin:2.5:clean (default-clean) @ org.eclipse.ease.ui.scripts.test ---
17:41:21 [2021-12-25T22:41:21.644Z] [INFO] 
17:41:21 [2021-12-25T22:41:21.644Z] [INFO] --- tycho-packaging-plugin:2.2.0:build-qualifier (default-build-qualifier) @ org.eclipse.ease.ui.scripts.test ---
17:41:21 [2021-12-25T22:41:21.644Z] [INFO] The project's OSGi version is 0.9.0.I202106220815
17:41:21 [2021-12-25T22:41:21.644Z] [INFO] 
17:41:21 [2021-12-25T22:41:21.644Z] [INFO] --- tycho-packaging-plugin:2.2.0:validate-id (default-validate-id) @ org.eclipse.ease.ui.scripts.test ---
17:41:21 [2021-12-25T22:41:21.644Z] [INFO] 
17:41:21 [2021-12-25T22:41:21.644Z] [INFO] --- tycho-packaging-plugin:2.2.0:validate-version (default-validate-version) @ org.eclipse.ease.ui.scripts.test ---
17:41:21 [2021-12-25T22:41:21.644Z] [INFO] 
17:41:21 [2021-12-25T22:41:21.644Z] [INFO] --- maven-resources-plugin:2.4.3:resources (default-resources) @ org.eclipse.ease.ui.scripts.test ---
17:41:21 [2021-12-25T22:41:21.644Z] [INFO] Using 'UTF-8' encoding to copy filtered resources.
17:41:21 [2021-12-25T22:41:21.644Z] [INFO] skip non existing resourceDirectory /home/jenkins/agent/workspace/ease.verify.core.target.2019-03/tests/org.eclipse.ease.ui.scripts.test/src/main/resources
17:41:21 [2021-12-25T22:41:21.644Z] [INFO] 
17:41:21 [2021-12-25T22:41:21.644Z] [INFO] --- tycho-compiler-plugin:2.2.0:compile (default-compile) @ org.eclipse.ease.ui.scripts.test ---
17:41:21 [2021-12-25T22:41:21.644Z] [INFO] Compiling 1 source file to /home/jenkins/agent/workspace/ease.verify.core.target.2019-03/tests/org.eclipse.ease.ui.scripts.test/target/classes
17:41:21 [2021-12-25T22:41:21.644Z] [INFO] 
17:41:21 [2021-12-25T22:41:21.644Z] [INFO] --- maven-resources-plugin:2.4.3:testResources (default-testResources) @ org.eclipse.ease.ui.scripts.test ---
17:41:21 [2021-12-25T22:41:21.644Z] [INFO] Using 'UTF-8' encoding to copy filtered resources.
17:41:21 [2021-12-25T22:41:21.644Z] [INFO] skip non existing resourceDirectory /home/jenkins/agent/workspace/ease.verify.core.target.2019-03/tests/org.eclipse.ease.ui.scripts.test/src/test/resources
17:41:21 [2021-12-25T22:41:21.644Z] [INFO] 
17:41:21 [2021-12-25T22:41:21.644Z] [INFO] --- target-platform-configuration:2.2.0:target-platform (default-target-platform) @ org.eclipse.ease.ui.scripts.test ---
17:41:21 [2021-12-25T22:41:21.644Z] [INFO] 
17:41:21 [2021-12-25T22:41:21.644Z] [INFO] --- tycho-packaging-plugin:2.2.0:package-plugin (default-package-plugin) @ org.eclipse.ease.ui.scripts.test ---
17:41:21 [2021-12-25T22:41:21.644Z] [INFO] Building jar: /home/jenkins/agent/workspace/ease.verify.core.target.2019-03/tests/org.eclipse.ease.ui.scripts.test/target/org.eclipse.ease.ui.scripts.test-0.9.0-SNAPSHOT.jar
17:41:21 [2021-12-25T22:41:21.644Z] [INFO] 
17:41:21 [2021-12-25T22:41:21.644Z] [INFO] --- tycho-p2-plugin:2.2.0:p2-metadata-default (default-p2-metadata-default) @ org.eclipse.ease.ui.scripts.test ---
17:41:21 [2021-12-25T22:41:21.644Z] [INFO] 
17:41:21 [2021-12-25T22:41:21.644Z] [INFO] --- jacoco-maven-plugin:0.8.6:prepare-agent (jacoco-initialize) @ org.eclipse.ease.ui.scripts.test ---
17:41:21 [2021-12-25T22:41:21.645Z] [INFO] tycho.testArgLine set to -javaagent:/home/jenkins/.m2/repository/org/jacoco/org.jacoco.agent/0.8.6/org.jacoco.agent-0.8.6-runtime.jar=destfile=/home/jenkins/agent/workspace/ease.verify.core.target.2019-03/tests/org.eclipse.ease.ui.scripts.test/target/jacoco.exec,output=file
17:41:21 [2021-12-25T22:41:21.645Z] [INFO] 
17:41:21 [2021-12-25T22:41:21.645Z] [INFO] --- tycho-surefire-plugin:2.2.0:test (default-test) @ org.eclipse.ease.ui.scripts.test ---
17:41:21 [2021-12-25T22:41:21.645Z] [INFO] Executing Test Runtime with timeout 0, logs (if any) will be placed at: /home/jenkins/agent/workspace/ease.verify.core.target.2019-03/tests/org.eclipse.ease.ui.scripts.test/target/work/data/.metadata/.log
17:41:21 [2021-12-25T22:41:21.645Z] [INFO] Command line:
17:41:21 [2021-12-25T22:41:21.645Z] 	[/opt/tools/java/openjdk/jdk-15/15.0.2+7/bin/java, -Dosgi.noShutdown=false, -Dosgi.os=linux, -Dosgi.ws=gtk, -Dosgi.arch=x86_64, -javaagent:/home/jenkins/.m2/repository/org/jacoco/org.jacoco.agent/0.8.6/org.jacoco.agent-0.8.6-runtime.jar=destfile=/home/jenkins/agent/workspace/ease.verify.core.target.2019-03/tests/org.eclipse.ease.ui.scripts.test/target/jacoco.exec,output=file, -Dosgi.clean=true, -jar, /home/jenkins/.m2/repository/p2/osgi/bundle/org.eclipse.equinox.launcher/1.6.300.v20210813-1054/org.eclipse.equinox.launcher-1.6.300.v20210813-1054.jar, -data, /home/jenkins/agent/workspace/ease.verify.core.target.2019-03/tests/org.eclipse.ease.ui.scripts.test/target/work/data, -install, /home/jenkins/agent/workspace/ease.verify.core.target.2019-03/tests/org.eclipse.ease.ui.scripts.test/target/work, -configuration, /home/jenkins/agent/workspace/ease.verify.core.target.2019-03/tests/org.eclipse.ease.ui.scripts.test/target/work/configuration, -application, org.eclipse.tycho.surefire.osgibooter.headlesstest, -testproperties, /home/jenkins/agent/workspace/ease.verify.core.target.2019-03/tests/org.eclipse.ease.ui.scripts.test/target/surefire.properties]
17:41:21 [2021-12-25T22:41:21.645Z] Picked up JAVA_TOOL_OPTIONS: -Dmaven.ext.class.path="/home/jenkins/agent/workspace/ease.verify.core.target.2019-03@tmp/withMaven8615b88a/pipeline-maven-spy.jar" -Dorg.jenkinsci.plugins.pipeline.maven.reportsFolder="/home/jenkins/agent/workspace/ease.verify.core.target.2019-03@tmp/withMaven8615b88a" 
17:41:24 [2021-12-25T22:41:24.168Z] Running org.eclipse.ease.ui.scripts.expressions.definitions.ExpressionFactoryTest
17:41:24 [2021-12-25T22:41:24.168Z] Tests run: 14, Failures: 0, Errors: 0, Skipped: 0, Time elapsed: 0.077 s - in org.eclipse.ease.ui.scripts.expressions.definitions.ExpressionFactoryTest
17:41:24 [2021-12-25T22:41:24.168Z] loadClassWithExpression  Time elapsed: 0.021 s
17:41:24 [2021-12-25T22:41:24.168Z] createWithExpression  Time elapsed: 0 s
17:41:24 [2021-12-25T22:41:24.168Z] createReferenceExpression  Time elapsed: 0.001 s
17:41:24 [2021-12-25T22:41:24.168Z] loadClassReferenceExpression  Time elapsed: 0.001 s
17:41:24 [2021-12-25T22:41:24.168Z] loadClassTestExpression  Time elapsed: 0.002 s
17:41:24 [2021-12-25T22:41:24.168Z] createEqualsExpression  Time elapsed: 0.002 s
17:41:24 [2021-12-25T22:41:24.168Z] loadClassCountExpression  Time elapsed: 0.001 s
17:41:24 [2021-12-25T22:41:24.168Z] loadClassOrExpression  Time elapsed: 0.001 s
17:41:24 [2021-12-25T22:41:24.168Z] createTestExpression  Time elapsed: 0.004 s
17:41:24 [2021-12-25T22:41:24.168Z] createOrExpression  Time elapsed: 0.028 s
17:41:24 [2021-12-25T22:41:24.168Z] loadClassAndExpression  Time elapsed: 0.001 s
17:41:24 [2021-12-25T22:41:24.168Z] createAndExpression  Time elapsed: 0 s
17:41:24 [2021-12-25T22:41:24.168Z] loadClassEqualsExpression  Time elapsed: 0 s
17:41:24 [2021-12-25T22:41:24.168Z] createCountExpression  Time elapsed: 0 s
17:41:24 [2021-12-25T22:41:24.168Z] 
17:41:24 [2021-12-25T22:41:24.168Z] Results:
17:41:24 [2021-12-25T22:41:24.168Z] 
17:41:24 [2021-12-25T22:41:24.168Z] Tests run: 14, Failures: 0, Errors: 0, Skipped: 0
17:41:24 [2021-12-25T22:41:24.168Z] 
17:41:24 [2021-12-25T22:41:24.424Z] [INFO] All tests passed!
17:41:24 [2021-12-25T22:41:24.424Z] [INFO] 
17:41:24 [2021-12-25T22:41:24.424Z] [INFO] --- maven-pmd-plugin:3.15.0:pmd (pmd-integration) @ org.eclipse.ease.ui.scripts.test ---
17:41:24 [2021-12-25T22:41:24.424Z] [INFO] PMD version: 6.38.0
17:41:24 [2021-12-25T22:41:24.424Z] [WARNING] Could not find class org.eclipse.ease.ui.scripts.expressions.definitions.ExpressionFactoryTest, due to: java.lang.IncompatibleClassChangeError: class net.sourceforge.pmd.lang.java.typeresolution.visitors.PMDASMVisitor has interface org.objectweb.asm.ClassVisitor as super class
17:41:24 [2021-12-25T22:41:24.424Z] [INFO] 
17:41:24 [2021-12-25T22:41:24.424Z] [INFO] --- maven-pmd-plugin:3.15.0:cpd (pmd-integration) @ org.eclipse.ease.ui.scripts.test ---
17:41:24 [2021-12-25T22:41:24.424Z] [INFO] PMD version: 6.38.0
17:41:24 [2021-12-25T22:41:24.424Z] [INFO] 
17:41:24 [2021-12-25T22:41:24.424Z] [INFO] --- spotbugs-maven-plugin:4.1.4:spotbugs (spotbugs-integration) @ org.eclipse.ease.ui.scripts.test ---
17:41:24 [2021-12-25T22:41:24.681Z] [INFO] Fork Value is false
17:41:24 [2021-12-25T22:41:24.681Z]      [java] JVM args ignored when same JVM is used.
17:41:26 [2021-12-25T22:41:26.051Z] [INFO] Done SpotBugs Analysis....
17:41:26 [2021-12-25T22:41:26.051Z] [INFO] 
17:41:26 [2021-12-25T22:41:26.051Z] [INFO] --- maven-checkstyle-plugin:3.1.1:check (checkstyle-integration) @ org.eclipse.ease.ui.scripts.test ---
17:41:26 [2021-12-25T22:41:26.051Z] [INFO] You have 0 Checkstyle violations.
17:41:26 [2021-12-25T22:41:26.051Z] [INFO] 
17:41:26 [2021-12-25T22:41:26.051Z] [INFO] --- maven-install-plugin:2.3.1:install (default-install) @ org.eclipse.ease.ui.scripts.test ---
17:41:26 [2021-12-25T22:41:26.051Z] [INFO] Installing /home/jenkins/agent/workspace/ease.verify.core.target.2019-03/tests/org.eclipse.ease.ui.scripts.test/target/org.eclipse.ease.ui.scripts.test-0.9.0-SNAPSHOT.jar to /home/jenkins/.m2/repository/org/eclipse/ease/org.eclipse.ease.ui.scripts.test/0.9.0-SNAPSHOT/org.eclipse.ease.ui.scripts.test-0.9.0-SNAPSHOT.jar
17:41:26 [2021-12-25T22:41:26.051Z] [INFO] Installing /home/jenkins/agent/workspace/ease.verify.core.target.2019-03/tests/org.eclipse.ease.ui.scripts.test/pom.xml to /home/jenkins/.m2/repository/org/eclipse/ease/org.eclipse.ease.ui.scripts.test/0.9.0-SNAPSHOT/org.eclipse.ease.ui.scripts.test-0.9.0-SNAPSHOT.pom
17:41:26 [2021-12-25T22:41:26.051Z] [INFO] Installing /home/jenkins/agent/workspace/ease.verify.core.target.2019-03/tests/org.eclipse.ease.ui.scripts.test/target/p2content.xml to /home/jenkins/.m2/repository/org/eclipse/ease/org.eclipse.ease.ui.scripts.test/0.9.0-SNAPSHOT/org.eclipse.ease.ui.scripts.test-0.9.0-SNAPSHOT-p2metadata.xml
17:41:26 [2021-12-25T22:41:26.051Z] [INFO] Installing /home/jenkins/agent/workspace/ease.verify.core.target.2019-03/tests/org.eclipse.ease.ui.scripts.test/target/p2artifacts.xml to /home/jenkins/.m2/repository/org/eclipse/ease/org.eclipse.ease.ui.scripts.test/0.9.0-SNAPSHOT/org.eclipse.ease.ui.scripts.test-0.9.0-SNAPSHOT-p2artifacts.xml
17:41:26 [2021-12-25T22:41:26.051Z] [INFO] 
17:41:26 [2021-12-25T22:41:26.051Z] [INFO] --- tycho-p2-plugin:2.2.0:update-local-index (default-update-local-index) @ org.eclipse.ease.ui.scripts.test ---
17:41:26 [2021-12-25T22:41:26.051Z] [INFO] 
17:41:26 [2021-12-25T22:41:26.051Z] [INFO] -------------< org.eclipse.ease:org.eclipse.ease.ui.test >--------------
17:41:26 [2021-12-25T22:41:26.051Z] [INFO] Building org.eclipse.ease.ui.test 0.9.0-SNAPSHOT                 [46/49]
17:41:26 [2021-12-25T22:41:26.051Z] [INFO] ------------------------[ eclipse-test-plugin ]-------------------------
17:41:26 [2021-12-25T22:41:26.051Z] [INFO] 
17:41:26 [2021-12-25T22:41:26.051Z] [INFO] --- maven-clean-plugin:2.5:clean (default-clean) @ org.eclipse.ease.ui.test ---
17:41:26 [2021-12-25T22:41:26.051Z] [INFO] 
17:41:26 [2021-12-25T22:41:26.052Z] [INFO] --- tycho-packaging-plugin:2.2.0:build-qualifier (default-build-qualifier) @ org.eclipse.ease.ui.test ---
17:41:26 [2021-12-25T22:41:26.052Z] [INFO] The project's OSGi version is 0.9.0.I202110141644
17:41:26 [2021-12-25T22:41:26.052Z] [INFO] 
17:41:26 [2021-12-25T22:41:26.052Z] [INFO] --- tycho-packaging-plugin:2.2.0:validate-id (default-validate-id) @ org.eclipse.ease.ui.test ---
17:41:26 [2021-12-25T22:41:26.052Z] [INFO] 
17:41:26 [2021-12-25T22:41:26.052Z] [INFO] --- tycho-packaging-plugin:2.2.0:validate-version (default-validate-version) @ org.eclipse.ease.ui.test ---
17:41:26 [2021-12-25T22:41:26.052Z] [INFO] 
17:41:26 [2021-12-25T22:41:26.052Z] [INFO] --- maven-resources-plugin:2.4.3:resources (default-resources) @ org.eclipse.ease.ui.test ---
17:41:26 [2021-12-25T22:41:26.052Z] [INFO] Using 'UTF-8' encoding to copy filtered resources.
17:41:26 [2021-12-25T22:41:26.052Z] [INFO] skip non existing resourceDirectory /home/jenkins/agent/workspace/ease.verify.core.target.2019-03/tests/org.eclipse.ease.ui.test/src/main/resources
17:41:26 [2021-12-25T22:41:26.052Z] [INFO] 
17:41:26 [2021-12-25T22:41:26.052Z] [INFO] --- tycho-compiler-plugin:2.2.0:compile (default-compile) @ org.eclipse.ease.ui.test ---
17:41:26 [2021-12-25T22:41:26.052Z] [INFO] Compiling 25 source files to /home/jenkins/agent/workspace/ease.verify.core.target.2019-03/tests/org.eclipse.ease.ui.test/target/classes
17:41:26 [2021-12-25T22:41:26.640Z] [INFO] 
17:41:26 [2021-12-25T22:41:26.640Z] [INFO] --- maven-resources-plugin:2.4.3:testResources (default-testResources) @ org.eclipse.ease.ui.test ---
17:41:26 [2021-12-25T22:41:26.640Z] [INFO] Using 'UTF-8' encoding to copy filtered resources.
17:41:26 [2021-12-25T22:41:26.640Z] [INFO] skip non existing resourceDirectory /home/jenkins/agent/workspace/ease.verify.core.target.2019-03/tests/org.eclipse.ease.ui.test/src/test/resources
17:41:26 [2021-12-25T22:41:26.640Z] [INFO] 
17:41:26 [2021-12-25T22:41:26.640Z] [INFO] --- target-platform-configuration:2.2.0:target-platform (default-target-platform) @ org.eclipse.ease.ui.test ---
17:41:26 [2021-12-25T22:41:26.640Z] [INFO] 
17:41:26 [2021-12-25T22:41:26.640Z] [INFO] --- tycho-packaging-plugin:2.2.0:package-plugin (default-package-plugin) @ org.eclipse.ease.ui.test ---
17:41:26 [2021-12-25T22:41:26.640Z] [INFO] Building jar: /home/jenkins/agent/workspace/ease.verify.core.target.2019-03/tests/org.eclipse.ease.ui.test/target/org.eclipse.ease.ui.test-0.9.0-SNAPSHOT.jar
17:41:26 [2021-12-25T22:41:26.640Z] [INFO] 
17:41:26 [2021-12-25T22:41:26.641Z] [INFO] --- tycho-p2-plugin:2.2.0:p2-metadata-default (default-p2-metadata-default) @ org.eclipse.ease.ui.test ---
17:41:26 [2021-12-25T22:41:26.641Z] [INFO] 
17:41:26 [2021-12-25T22:41:26.641Z] [INFO] --- jacoco-maven-plugin:0.8.6:prepare-agent (jacoco-initialize) @ org.eclipse.ease.ui.test ---
17:41:26 [2021-12-25T22:41:26.641Z] [INFO] tycho.testArgLine set to -javaagent:/home/jenkins/.m2/repository/org/jacoco/org.jacoco.agent/0.8.6/org.jacoco.agent-0.8.6-runtime.jar=destfile=/home/jenkins/agent/workspace/ease.verify.core.target.2019-03/tests/org.eclipse.ease.ui.test/target/jacoco.exec,output=file
17:41:26 [2021-12-25T22:41:26.641Z] [INFO] 
17:41:26 [2021-12-25T22:41:26.641Z] [INFO] --- tycho-surefire-plugin:2.2.0:test (default-test) @ org.eclipse.ease.ui.test ---
17:41:26 [2021-12-25T22:41:26.641Z] [INFO] Executing Test Runtime with timeout 0, logs (if any) will be placed at: /home/jenkins/agent/workspace/ease.verify.core.target.2019-03/tests/org.eclipse.ease.ui.test/target/work/data/.metadata/.log
17:41:26 [2021-12-25T22:41:26.641Z] [INFO] Command line:
17:41:26 [2021-12-25T22:41:26.641Z] 	[/opt/tools/java/openjdk/jdk-15/15.0.2+7/bin/java, -Dosgi.noShutdown=false, -Dosgi.os=linux, -Dosgi.ws=gtk, -Dosgi.arch=x86_64, -javaagent:/home/jenkins/.m2/repository/org/jacoco/org.jacoco.agent/0.8.6/org.jacoco.agent-0.8.6-runtime.jar=destfile=/home/jenkins/agent/workspace/ease.verify.core.target.2019-03/tests/org.eclipse.ease.ui.test/target/jacoco.exec,output=file, -Dosgi.clean=true, -jar, /home/jenkins/.m2/repository/p2/osgi/bundle/org.eclipse.equinox.launcher/1.6.300.v20210813-1054/org.eclipse.equinox.launcher-1.6.300.v20210813-1054.jar, -data, /home/jenkins/agent/workspace/ease.verify.core.target.2019-03/tests/org.eclipse.ease.ui.test/target/work/data, -install, /home/jenkins/agent/workspace/ease.verify.core.target.2019-03/tests/org.eclipse.ease.ui.test/target/work, -configuration, /home/jenkins/agent/workspace/ease.verify.core.target.2019-03/tests/org.eclipse.ease.ui.test/target/work/configuration, -application, org.eclipse.tycho.surefire.osgibooter.headlesstest, -testproperties, /home/jenkins/agent/workspace/ease.verify.core.target.2019-03/tests/org.eclipse.ease.ui.test/target/surefire.properties]
17:41:26 [2021-12-25T22:41:26.641Z] Picked up JAVA_TOOL_OPTIONS: -Dmaven.ext.class.path="/home/jenkins/agent/workspace/ease.verify.core.target.2019-03@tmp/withMaven8615b88a/pipeline-maven-spy.jar" -Dorg.jenkinsci.plugins.pipeline.maven.reportsFolder="/home/jenkins/agent/workspace/ease.verify.core.target.2019-03@tmp/withMaven8615b88a" 
17:41:29 [2021-12-25T22:41:29.992Z] Running org.eclipse.ease.ui.completion.ScriptCompletionProposalTest
17:41:29 [2021-12-25T22:41:29.992Z] Tests run: 8, Failures: 0, Errors: 0, Skipped: 0, Time elapsed: 0.056 s - in org.eclipse.ease.ui.completion.ScriptCompletionProposalTest
17:41:29 [2021-12-25T22:41:29.992Z] getCursorPosition_equals_end_of_inserted_text  Time elapsed: 0.02 s
17:41:29 [2021-12-25T22:41:29.992Z] getCursorPosition_equals_end_of_appended_text  Time elapsed: 0 s
17:41:29 [2021-12-25T22:41:29.992Z] compareTo_lists_higher_priority_first  Time elapsed: 0.001 s
17:41:29 [2021-12-25T22:41:29.992Z] getContent_inserts_replacement_text  Time elapsed: 0.002 s
17:41:29 [2021-12-25T22:41:29.992Z] getCursorPosition_equals_end_of_set_text  Time elapsed: 0 s
17:41:29 [2021-12-25T22:41:29.992Z] getContent_sets_replacement_text  Time elapsed: 0 s
17:41:29 [2021-12-25T22:41:29.992Z] compareTo_lists_same_prio_in_alphabetic_order  Time elapsed: 0 s
17:41:29 [2021-12-25T22:41:29.992Z] getContent_appends_replacement_text  Time elapsed: 0.001 s
17:41:29 [2021-12-25T22:41:29.992Z] Running org.eclipse.ease.ui.completion.provider.AbstractFileLocationCompletionProviderTest
17:41:30 [2021-12-25T22:41:30.248Z] Tests run: 22, Failures: 0, Errors: 0, Skipped: 0, Time elapsed: 0.123 s - in org.eclipse.ease.ui.completion.provider.AbstractFileLocationCompletionProviderTest
17:41:30 [2021-12-25T22:41:30.248Z] getProposals_does_not_contain_back_proposal_for_project  Time elapsed: 0.093 s
17:41:30 [2021-12-25T22:41:30.248Z] getProposals_does_not_contain_project_root_with_file_resource  Time elapsed: 0.001 s
17:41:30 [2021-12-25T22:41:30.248Z] getProposals_contains_project_root_files_for_project_root  Time elapsed: 0 s
17:41:30 [2021-12-25T22:41:30.248Z] getProposals_contains_files_for_workspace_folder  Time elapsed: 0 s
17:41:30 [2021-12-25T22:41:30.248Z] getProposals_contains_back_for_workspace_folder  Time elapsed: 0.001 s
17:41:30 [2021-12-25T22:41:30.248Z] getProposals_contains_root_file_systems  Time elapsed: 0.001 s
17:41:30 [2021-12-25T22:41:30.248Z] getProposals_contains_files_for_project  Time elapsed: 0 s
17:41:30 [2021-12-25T22:41:30.249Z] back_proposal_contains_correct_replacement_string_for_absolute_workspace_folder_link  Time elapsed: 0.001 s
17:41:30 [2021-12-25T22:41:30.249Z] getProposals_does_not_contain_project_root_without_resource  Time elapsed: 0 s
17:41:30 [2021-12-25T22:41:30.249Z] getProposals_contains_project_root_with_workspace_resource  Time elapsed: 0 s
17:41:30 [2021-12-25T22:41:30.249Z] getProposals_contains_back_for_project_folder  Time elapsed: 0.001 s
17:41:30 [2021-12-25T22:41:30.249Z] getProposals_contains_project_root_folders_for_workspace_project_with_back_path  Time elapsed: 0 s
17:41:30 [2021-12-25T22:41:30.249Z] getProposals_contains_projects_for_workspace_root  Time elapsed: 0.001 s
17:41:30 [2021-12-25T22:41:30.249Z] getProposals_contains_project_root_folders_for_workspace_project  Time elapsed: 0 s
17:41:30 [2021-12-25T22:41:30.249Z] getProposals_contains_filesystem_root  Time elapsed: 0.001 s
17:41:30 [2021-12-25T22:41:30.249Z] getProposals_contains_files_for_project_folder  Time elapsed: 0.001 s
17:41:30 [2021-12-25T22:41:30.249Z] getProposals_contains_workspace_root  Time elapsed: 0 s
17:41:30 [2021-12-25T22:41:30.249Z] getProposals_does_not_contain_back_proposal  Time elapsed: 0.001 s
17:41:30 [2021-12-25T22:41:30.249Z] getProposals_contains_files_for_filesystem  Time elapsed: 0 s
17:41:30 [2021-12-25T22:41:30.249Z] getProposals_contains_project_root_files_for_workspace_project  Time elapsed: 0 s
17:41:30 [2021-12-25T22:41:30.249Z] getProposals_contains_back_for_filesystem  Time elapsed: 0 s
17:41:30 [2021-12-25T22:41:30.249Z] back_proposal_contains_correct_replacement_string_for_relative_workspace_folder_link  Time elapsed: 0 s
17:41:30 [2021-12-25T22:41:30.249Z] Running org.eclipse.ease.ui.completion.provider.LoadedModuleCompletionProviderTest
17:41:30 [2021-12-25T22:41:30.249Z] Tests run: 15, Failures: 0, Errors: 0, Skipped: 0, Time elapsed: 0.112 s - in org.eclipse.ease.ui.completion.provider.LoadedModuleCompletionProviderTest
17:41:30 [2021-12-25T22:41:30.249Z] method_proposal_contains_opening_bracket_when_method_has_mandatory_parameters  Time elapsed: 0.038 s
17:41:30 [2021-12-25T22:41:30.249Z] method_proposal_contains_full_method_call_when_method_has_only_optional_parameters  Time elapsed: 0.002 s
17:41:30 [2021-12-25T22:41:30.249Z] getProposals_contains_constant_methods  Time elapsed: 0.002 s
17:41:30 [2021-12-25T22:41:30.249Z] getProposals_contains_module_methods  Time elapsed: 0.02 s
17:41:30 [2021-12-25T22:41:30.249Z] isActive_equals_false{String}[1]  Time elapsed: 0.012 s
17:41:30 [2021-12-25T22:41:30.249Z] isActive_equals_false{String}[2]  Time elapsed: 0.001 s
17:41:30 [2021-12-25T22:41:30.249Z] isActive_equals_false{String}[3]  Time elapsed: 0.001 s
17:41:30 [2021-12-25T22:41:30.249Z] isActive_equals_false{String}[4]  Time elapsed: 0.001 s
17:41:30 [2021-12-25T22:41:30.249Z] isActive_equals_true{String}[1]  Time elapsed: 0 s
17:41:30 [2021-12-25T22:41:30.249Z] isActive_equals_true{String}[2]  Time elapsed: 0 s
17:41:30 [2021-12-25T22:41:30.249Z] isActive_equals_true{String}[3]  Time elapsed: 0.001 s
17:41:30 [2021-12-25T22:41:30.249Z] isActive_equals_true{String}[4]  Time elapsed: 0 s
17:41:30 [2021-12-25T22:41:30.249Z] isActive_equals_true{String}[5]  Time elapsed: 0 s
17:41:30 [2021-12-25T22:41:30.249Z] isActive_equals_true{String}[6]  Time elapsed: 0 s
17:41:30 [2021-12-25T22:41:30.249Z] method_proposal_contains_full_method_call_when_method_has_no_parameters  Time elapsed: 0.002 s
17:41:30 [2021-12-25T22:41:30.249Z] Running org.eclipse.ease.ui.completion.provider.LocationResolverTest
17:41:30 [2021-12-25T22:41:30.249Z] Tests run: 1, Failures: 0, Errors: 0, Skipped: 0, Time elapsed: 0 s - in org.eclipse.ease.ui.completion.provider.LocationResolverTest
17:41:30 [2021-12-25T22:41:30.249Z] getParentString_has_no_trailing_slashes  Time elapsed: 0 s
17:41:30 [2021-12-25T22:41:30.249Z] Running org.eclipse.ease.ui.completion.provider.LoadModuleCompletionProviderTest
17:41:30 [2021-12-25T22:41:30.840Z] Tests run: 12, Failures: 0, Errors: 0, Skipped: 0, Time elapsed: 0.48 s - in org.eclipse.ease.ui.completion.provider.LoadModuleCompletionProviderTest
17:41:30 [2021-12-25T22:41:30.840Z] getProposals_contains_root_entry_with_absolute_filter  Time elapsed: 0.464 s
17:41:30 [2021-12-25T22:41:30.840Z] getProposals_contains_root_entry_with_relative_filter  Time elapsed: 0.001 s
17:41:30 [2021-12-25T22:41:30.840Z] getProposals_contains_category_with_relative_filter  Time elapsed: 0 s
17:41:30 [2021-12-25T22:41:30.840Z] getProposals_does_not_contain_root_entry_on_filter_mismatch  Time elapsed: 0 s
17:41:30 [2021-12-25T22:41:30.840Z] isActive_equals_false{String}[1]  Time elapsed: 0.002 s
17:41:30 [2021-12-25T22:41:30.840Z] isActive_equals_false{String}[2]  Time elapsed: 0.001 s
17:41:30 [2021-12-25T22:41:30.840Z] isActive_equals_false{String}[3]  Time elapsed: 0.001 s
17:41:30 [2021-12-25T22:41:30.840Z] getProposals_contains_root_entry  Time elapsed: 0.001 s
17:41:30 [2021-12-25T22:41:30.840Z] isActive_equals_true{String}[1]  Time elapsed: 0.001 s
17:41:30 [2021-12-25T22:41:30.840Z] isActive_equals_true{String}[2]  Time elapsed: 0.001 s
17:41:30 [2021-12-25T22:41:30.840Z] getProposals_contains_child_entry_with_absolute_filter  Time elapsed: 0.001 s
17:41:30 [2021-12-25T22:41:30.840Z] getProposals_does_not_contain_entry_on_completed_input  Time elapsed: 0.001 s
17:41:30 [2021-12-25T22:41:30.840Z] Running org.eclipse.ease.ui.completion.provider.AbstractCompletionProviderTest
17:41:30 [2021-12-25T22:41:30.840Z] Tests run: 16, Failures: 0, Errors: 0, Skipped: 0, Time elapsed: 0.03 s - in org.eclipse.ease.ui.completion.provider.AbstractCompletionProviderTest
17:41:30 [2021-12-25T22:41:30.840Z] isStringParameter_equals_true{String}[1]  Time elapsed: 0.001 s
17:41:30 [2021-12-25T22:41:30.840Z] isStringParameter_equals_true{String}[2]  Time elapsed: 0.001 s
17:41:30 [2021-12-25T22:41:30.840Z] isStringParameter_equals_true{String}[3]  Time elapsed: 0.001 s
17:41:30 [2021-12-25T22:41:30.840Z] isStringParameter_equals_true{String}[4]  Time elapsed: 0.001 s
17:41:30 [2021-12-25T22:41:30.840Z] isMethodParameter_equals_true  Time elapsed: 0.001 s
17:41:30 [2021-12-25T22:41:30.840Z] isMethodParameter_equals_true_for_2nd_parameter  Time elapsed: 0.001 s
17:41:30 [2021-12-25T22:41:30.840Z] isValid_equals_false_for_invalid_context  Time elapsed: 0.016 s
17:41:30 [2021-12-25T22:41:30.840Z] isStringParameter_equals_false{String}[1]  Time elapsed: 0.001 s
17:41:30 [2021-12-25T22:41:30.840Z] isStringParameter_equals_false{String}[2]  Time elapsed: 0.001 s
17:41:30 [2021-12-25T22:41:30.840Z] isStringParameter_equals_false{String}[3]  Time elapsed: 0 s
17:41:30 [2021-12-25T22:41:30.840Z] isStringParameter_equals_false{String}[4]  Time elapsed: 0 s
17:41:30 [2021-12-25T22:41:30.840Z] isStringParameter_equals_false{String}[5]  Time elapsed: 0.001 s
17:41:30 [2021-12-25T22:41:30.840Z] isMethodParameter_equals_false_when_no_method_is_detected  Time elapsed: 0 s
17:41:30 [2021-12-25T22:41:30.840Z] isValid_equals_true_for_valid_context  Time elapsed: 0.001 s
17:41:30 [2021-12-25T22:41:30.840Z] isMethodParameter_equals_false_for_wrong_method_name  Time elapsed: 0 s
17:41:30 [2021-12-25T22:41:30.840Z] isMethodParameter_equals_false_for_wrong_parameter_index  Time elapsed: 0.001 s
17:41:30 [2021-12-25T22:41:30.840Z] Running org.eclipse.ease.ui.completion.provider.AbstractPathCompletionProviderTest
17:41:30 [2021-12-25T22:41:30.840Z] Tests run: 11, Failures: 0, Errors: 0, Skipped: 0, Time elapsed: 0.003 s - in org.eclipse.ease.ui.completion.provider.AbstractPathCompletionProviderTest
17:41:30 [2021-12-25T22:41:30.841Z] filter_keeps_only_lower_level_on_matching_filter  Time elapsed: 0 s
17:41:30 [2021-12-25T22:41:30.841Z] filter_removes_nothing_if_context_is_empty  Time elapsed: 0.001 s
17:41:30 [2021-12-25T22:41:30.841Z] getPathsFromElements_is_empty_for_root_elements_only  Time elapsed: 0 s
17:41:30 [2021-12-25T22:41:30.841Z] filter_keeps_only_1st_level_on_empty_filter  Time elapsed: 0 s
17:41:30 [2021-12-25T22:41:30.841Z] filter_keeps_only_1st_level_on_matching_filter  Time elapsed: 0 s
17:41:30 [2021-12-25T22:41:30.841Z] getPathsFromElements_is_empty_for_empty_element  Time elapsed: 0 s
17:41:30 [2021-12-25T22:41:30.841Z] filter_removes_mismatches_on_same_level  Time elapsed: 0 s
17:41:30 [2021-12-25T22:41:30.841Z] filter_matches_next_level  Time elapsed: 0 s
17:41:30 [2021-12-25T22:41:30.841Z] filter_matches_relative_paths  Time elapsed: 0.001 s
17:41:30 [2021-12-25T22:41:30.841Z] getPathsFromElements_contains_parent_paths  Time elapsed: 0 s
17:41:30 [2021-12-25T22:41:30.841Z] getPathsFromElements_contains_all_hierarchies  Time elapsed: 0 s
17:41:30 [2021-12-25T22:41:30.841Z] Running org.eclipse.ease.ui.completion.provider.VariablesCompletionProviderTest
17:41:30 [2021-12-25T22:41:30.841Z] Tests run: 18, Failures: 0, Errors: 0, Skipped: 0, Time elapsed: 0.022 s - in org.eclipse.ease.ui.completion.provider.VariablesCompletionProviderTest
17:41:30 [2021-12-25T22:41:30.841Z] prepareProposals_instance_contains_integer_variable  Time elapsed: 0.002 s
17:41:30 [2021-12-25T22:41:30.841Z] prepareProposals_instance_contains_string_variable  Time elapsed: 0.001 s
17:41:30 [2021-12-25T22:41:30.841Z] prepareProposals_instance_contains_string_variable_for_filter_input_case_insensitive  Time elapsed: 0.001 s
17:41:30 [2021-12-25T22:41:30.841Z] prepareProposals_instance_contains_string_variable_for_filter_input  Time elapsed: 0 s
17:41:30 [2021-12-25T22:41:30.841Z] prepareProposals_does_not_contain_internal_variable  Time elapsed: 0 s
17:41:30 [2021-12-25T22:41:30.841Z] isActive_equals_false{String}[1]  Time elapsed: 0.001 s
17:41:30 [2021-12-25T22:41:30.841Z] isActive_equals_false{String}[2]  Time elapsed: 0.001 s
17:41:30 [2021-12-25T22:41:30.841Z] isActive_equals_false{String}[3]  Time elapsed: 0 s
17:41:30 [2021-12-25T22:41:30.841Z] isActive_equals_false{String}[4]  Time elapsed: 0.001 s
17:41:30 [2021-12-25T22:41:30.841Z] isActive_equals_false{String}[5]  Time elapsed: 0 s
17:41:30 [2021-12-25T22:41:30.841Z] isActive_equals_true{String}[1]  Time elapsed: 0.001 s
17:41:30 [2021-12-25T22:41:30.841Z] isActive_equals_true{String}[2]  Time elapsed: 0.001 s
17:41:30 [2021-12-25T22:41:30.841Z] isActive_equals_true{String}[3]  Time elapsed: 0 s
17:41:30 [2021-12-25T22:41:30.841Z] isActive_equals_true{String}[4]  Time elapsed: 0.001 s
17:41:30 [2021-12-25T22:41:30.841Z] isActive_equals_true{String}[5]  Time elapsed: 0.001 s
17:41:30 [2021-12-25T22:41:30.841Z] isActive_equals_true{String}[6]  Time elapsed: 0.002 s
17:41:30 [2021-12-25T22:41:30.841Z] isActive_equals_true{String}[7]  Time elapsed: 0.001 s
17:41:30 [2021-12-25T22:41:30.841Z] isActive_equals_true{String}[8]  Time elapsed: 0.001 s
17:41:30 [2021-12-25T22:41:30.841Z] Running org.eclipse.ease.ui.completion.tokenizer.TokenListTest
17:41:30 [2021-12-25T22:41:30.841Z] Tests run: 1, Failures: 0, Errors: 0, Skipped: 0, Time elapsed: 0 s - in org.eclipse.ease.ui.completion.tokenizer.TokenListTest
17:41:30 [2021-12-25T22:41:30.841Z] new_TokenList_is_empty  Time elapsed: 0 s
17:41:30 [2021-12-25T22:41:30.841Z] Running org.eclipse.ease.ui.completion.tokenizer.InputTokenizerTest
17:41:30 [2021-12-25T22:41:30.841Z] Tests run: 68, Failures: 0, Errors: 0, Skipped: 0, Time elapsed: 0.034 s - in org.eclipse.ease.ui.completion.tokenizer.InputTokenizerTest
17:41:30 [2021-12-25T22:41:30.841Z] getTokens_detects_method_chaining  Time elapsed: 0.003 s
17:41:30 [2021-12-25T22:41:30.841Z] isDelimiter_equals_true{String}[1]  Time elapsed: 0 s
17:41:30 [2021-12-25T22:41:30.841Z] isDelimiter_equals_true{String}[2]  Time elapsed: 0 s
17:41:30 [2021-12-25T22:41:30.841Z] isDelimiter_equals_true{String}[3]  Time elapsed: 0 s
17:41:30 [2021-12-25T22:41:30.841Z] isDelimiter_equals_true{String}[4]  Time elapsed: 0 s
17:41:30 [2021-12-25T22:41:30.841Z] isDelimiter_equals_true{String}[5]  Time elapsed: 0 s
17:41:30 [2021-12-25T22:41:30.841Z] isDelimiter_equals_true{String}[6]  Time elapsed: 0 s
17:41:30 [2021-12-25T22:41:30.841Z] isDelimiter_equals_true{String}[7]  Time elapsed: 0 s
17:41:30 [2021-12-25T22:41:30.841Z] getTokens_detects_package_fragments  Time elapsed: 0 s
17:41:30 [2021-12-25T22:41:30.841Z] getTokens_detects_javascript_method_call  Time elapsed: 0 s
17:41:30 [2021-12-25T22:41:30.841Z] getTokens_detects_incomplete_package  Time elapsed: 0 s
17:41:30 [2021-12-25T22:41:30.841Z] getTokens_detects_module_methods_call_chain  Time elapsed: 0 s
17:41:30 [2021-12-25T22:41:30.841Z] getTokens_splits_string_literal  Time elapsed: 0 s
17:41:30 [2021-12-25T22:41:30.841Z] getTokens_detects_static_method_call  Time elapsed: 0 s
17:41:30 [2021-12-25T22:41:30.841Z] getTokens_detects_method_call_chain  Time elapsed: 0.001 s
17:41:30 [2021-12-25T22:41:30.842Z] getTokens_simplifies_multiply_operations  Time elapsed: 0 s
17:41:30 [2021-12-25T22:41:30.842Z] getTokens_detects_method_call_parameter_prefix  Time elapsed: 0 s
17:41:30 [2021-12-25T22:41:30.842Z] getTokens_detects_method_call_parameters_with_prefix  Time elapsed: 0 s
17:41:30 [2021-12-25T22:41:30.842Z] getTokens_detects_package  Time elapsed: 0 s
17:41:30 [2021-12-25T22:41:30.842Z] getTokens_detects_partial_package  Time elapsed: 0 s
17:41:30 [2021-12-25T22:41:30.842Z] getTokens_simplifies_plus_operations  Time elapsed: 0 s
17:41:30 [2021-12-25T22:41:30.842Z] getTokens_detects_class  Time elapsed: 0 s
17:41:30 [2021-12-25T22:41:30.842Z] getTokens_detects_opened_module_method  Time elapsed: 0 s
17:41:30 [2021-12-25T22:41:30.842Z] getTokens_simplifies_brackets_recursively  Time elapsed: 0 s
17:41:30 [2021-12-25T22:41:30.842Z] getTokens_detects_method_call_parameter  Time elapsed: 0 s
17:41:30 [2021-12-25T22:41:30.842Z] getTokens_simplifies_brackets  Time elapsed: 0 s
17:41:30 [2021-12-25T22:41:30.842Z] getTokens_removes_new_operator  Time elapsed: 0 s
17:41:30 [2021-12-25T22:41:30.842Z] isDelimiter_equals_false{String}[1]  Time elapsed: 0.001 s
17:41:30 [2021-12-25T22:41:30.842Z] isDelimiter_equals_false{String}[2]  Time elapsed: 0 s
17:41:30 [2021-12-25T22:41:30.842Z] isDelimiter_equals_false{String}[3]  Time elapsed: 0.001 s
17:41:30 [2021-12-25T22:41:30.842Z] getTokens_detects_method_call_parameters  Time elapsed: 0 s
17:41:30 [2021-12-25T22:41:30.842Z] getTokens_detects_class_instantiation  Time elapsed: 0 s
17:41:30 [2021-12-25T22:41:30.842Z] getTokens_detects_method_call  Time elapsed: 0 s
17:41:30 [2021-12-25T22:41:30.842Z] getTokens_simplifies_divide_operations  Time elapsed: 0 s
17:41:30 [2021-12-25T22:41:30.842Z] getTokens_removes_left_hand_side_of_assignment  Time elapsed: 0 s
17:41:30 [2021-12-25T22:41:30.842Z] getTokens_detects_javascript_class_instantiation  Time elapsed: 0.001 s
17:41:30 [2021-12-25T22:41:30.842Z] getTokens_simplifies_for_loop  Time elapsed: 0 s
17:41:30 [2021-12-25T22:41:30.842Z] getTokens_detects_resolved_javascript_variable_2  Time elapsed: 0 s
17:41:30 [2021-12-25T22:41:30.842Z] getTokens_simplifies_minus_operations  Time elapsed: 0 s
17:41:30 [2021-12-25T22:41:30.842Z] getTokens_detects_class_instantiation_2  Time elapsed: 0 s
17:41:30 [2021-12-25T22:41:30.842Z] getTokens_detects_class_instantiation_3  Time elapsed: 0 s
17:41:30 [2021-12-25T22:41:30.842Z] getTokens_simplifies_assignments  Time elapsed: 0 s
17:41:30 [2021-12-25T22:41:30.842Z] getTokens_detects_inner_class  Time elapsed: 0 s
17:41:30 [2021-12-25T22:41:30.842Z] getTokens_detects_static_method_call_with_dot_prefix  Time elapsed: 0.001 s
17:41:30 [2021-12-25T22:41:30.842Z] getTokens_detects_class_2  Time elapsed: 0 s
17:41:30 [2021-12-25T22:41:30.842Z] isTextFilter_equals_false{String}[1]  Time elapsed: 0 s
17:41:30 [2021-12-25T22:41:30.842Z] isTextFilter_equals_false{String}[2]  Time elapsed: 0 s
17:41:30 [2021-12-25T22:41:30.842Z] isTextFilter_equals_false{String}[3]  Time elapsed: 0 s
17:41:30 [2021-12-25T22:41:30.842Z] isTextFilter_equals_false{String}[4]  Time elapsed: 0.001 s
17:41:30 [2021-12-25T22:41:30.842Z] isTextFilter_equals_false{String}[5]  Time elapsed: 0 s
17:41:30 [2021-12-25T22:41:30.842Z] getTokens_does_not_split_within_string_literal  Time elapsed: 0 s
17:41:30 [2021-12-25T22:41:30.842Z] getTokens_1  Time elapsed: 0 s
17:41:30 [2021-12-25T22:41:30.842Z] isTextFilter_equals_true{String}[1]  Time elapsed: 0 s
17:41:30 [2021-12-25T22:41:30.842Z] isTextFilter_equals_true{String}[2]  Time elapsed: 0.001 s
17:41:30 [2021-12-25T22:41:30.842Z] getTokens_detects_opened_module_method_with_filter  Time elapsed: 0 s
17:41:30 [2021-12-25T22:41:30.842Z] getTokens_detects_method_call_request_with_filter  Time elapsed: 0.001 s
17:41:30 [2021-12-25T22:41:30.842Z] getTokens_for_empty_input  Time elapsed: 0 s
17:41:30 [2021-12-25T22:41:30.842Z] getTokens_detects_package_with_class_prefix  Time elapsed: 0.001 s
17:41:30 [2021-12-25T22:41:30.842Z] getTokens_detects_module_methods  Time elapsed: 0 s
17:41:30 [2021-12-25T22:41:30.842Z] getTokens_detects_completed_method  Time elapsed: 0 s
17:41:30 [2021-12-25T22:41:30.842Z] getTokens_detects_resolved_javascript_variable_with_method  Time elapsed: 0.001 s
17:41:30 [2021-12-25T22:41:30.842Z] getTokens_detects_resolved_javascript_variable  Time elapsed: 0 s
17:41:30 [2021-12-25T22:41:30.842Z] getTokens_simplifies_string_literal_1  Time elapsed: 0.001 s
17:41:30 [2021-12-25T22:41:30.842Z] getTokens_simplifies_string_literal_2  Time elapsed: 0 s
17:41:30 [2021-12-25T22:41:30.842Z] getTokens_is_empty_after_string_literal  Time elapsed: 0 s
17:41:30 [2021-12-25T22:41:30.842Z] getTokens_detects_static_method_call_chain  Time elapsed: 0 s
17:41:30 [2021-12-25T22:41:30.842Z] getTokens_detects_opened_module_method_with_parameter  Time elapsed: 0.001 s
17:41:30 [2021-12-25T22:41:30.842Z] getTokens_detects_javascript_object_call  Time elapsed: 0 s
17:41:30 [2021-12-25T22:41:30.842Z] Running org.eclipse.ease.ui.completion.tokenizer.BracketMatcherTest
17:41:31 [2021-12-25T22:41:31.099Z] Tests run: 9, Failures: 0, Errors: 0, Skipped: 0, Time elapsed: 0.003 s - in org.eclipse.ease.ui.completion.tokenizer.BracketMatcherTest
17:41:31 [2021-12-25T22:41:31.099Z] getOpenBrackets_returns_open_brackets_only  Time elapsed: 0 s
17:41:31 [2021-12-25T22:41:31.099Z] getBrackets_detects_1  Time elapsed: 0 s
17:41:31 [2021-12-25T22:41:31.099Z] getBrackets_detects_2  Time elapsed: 0.001 s
17:41:31 [2021-12-25T22:41:31.099Z] getBrackets_detects_3  Time elapsed: 0 s
17:41:31 [2021-12-25T22:41:31.099Z] hasOpenBrackets_equals_true  Time elapsed: 0 s
17:41:31 [2021-12-25T22:41:31.099Z] getBrackets_is_empty  Time elapsed: 0 s
17:41:31 [2021-12-25T22:41:31.099Z] hasOpenBrackets_equals_false  Time elapsed: 0.001 s
17:41:31 [2021-12-25T22:41:31.099Z] getBrackets_detects_open_brackets  Time elapsed: 0 s
17:41:31 [2021-12-25T22:41:31.099Z] getBrackets_detects_nested  Time elapsed: 0 s
17:41:31 [2021-12-25T22:41:31.099Z] Running org.eclipse.ease.ui.completion.BasicContextTest
17:41:31 [2021-12-25T22:41:31.099Z] Tests run: 12, Failures: 0, Errors: 0, Skipped: 0, Time elapsed: 0.007 s - in org.eclipse.ease.ui.completion.BasicContextTest
17:41:31 [2021-12-25T22:41:31.099Z] isValid_equals_true  Time elapsed: 0.001 s
17:41:31 [2021-12-25T22:41:31.099Z] getScriptEngine_returns_engine  Time elapsed: 0.001 s
17:41:31 [2021-12-25T22:41:31.099Z] getFilter_removes_string_literal_start  Time elapsed: 0 s
17:41:31 [2021-12-25T22:41:31.099Z] getLoadedModules_detects_modules_from_ScriptEngine  Time elapsed: 0.001 s
17:41:31 [2021-12-25T22:41:31.099Z] getFilter_contains_parameter_prefix  Time elapsed: 0 s
17:41:31 [2021-12-25T22:41:31.099Z] getLoadedModules_contains_environment_on_resource  Time elapsed: 0 s
17:41:31 [2021-12-25T22:41:31.099Z] getLoadedModules_does_not_contain_environment_twice_on_resource  Time elapsed: 0.001 s
17:41:31 [2021-12-25T22:41:31.099Z] getFilter_is_empty  Time elapsed: 0 s
17:41:31 [2021-12-25T22:41:31.099Z] getFilter_keeps_spaces_in_string_literal  Time elapsed: 0 s
17:41:31 [2021-12-25T22:41:31.099Z] getLoadedModules_detects_loadModule_commands  Time elapsed: 0.001 s
17:41:31 [2021-12-25T22:41:31.099Z] getFilter_is_empty_for_empty_input  Time elapsed: 0 s
17:41:31 [2021-12-25T22:41:31.099Z] isInvalid_equals_true  Time elapsed: 0.001 s
17:41:31 [2021-12-25T22:41:31.099Z] Running org.eclipse.ease.ui.completion.CodeCompletionAggregatorTest
17:41:31 [2021-12-25T22:41:31.099Z] Tests run: 4, Failures: 0, Errors: 0, Skipped: 0, Time elapsed: 0.061 s - in org.eclipse.ease.ui.completion.CodeCompletionAggregatorTest
17:41:31 [2021-12-25T22:41:31.099Z] context_for_empty_input  Time elapsed: 0.056 s
17:41:31 [2021-12-25T22:41:31.099Z] context_for_root_package_with_suffix  Time elapsed: 0.001 s
17:41:31 [2021-12-25T22:41:31.099Z] getProposals_contains_proposal_from_local_provider  Time elapsed: 0.003 s
17:41:31 [2021-12-25T22:41:31.099Z] context_for_root_package  Time elapsed: 0.001 s
17:41:31 [2021-12-25T22:41:31.099Z] Running org.eclipse.ease.ui.views.shell.dropins.modules.ModulesStackContentProviderTest
17:41:31 [2021-12-25T22:41:31.099Z] Tests run: 2, Failures: 0, Errors: 0, Skipped: 0, Time elapsed: 0.056 s - in org.eclipse.ease.ui.views.shell.dropins.modules.ModulesStackContentProviderTest
17:41:31 [2021-12-25T22:41:31.099Z] getElements_returns_modules  Time elapsed: 0.055 s
17:41:31 [2021-12-25T22:41:31.099Z] getElements_returns_empty_list_without_environment  Time elapsed: 0.001 s
17:41:31 [2021-12-25T22:41:31.100Z] Running org.eclipse.ease.ui.views.shell.dropins.modules.ModulesStackLabelProviderTest
17:41:31 [2021-12-25T22:41:31.100Z] Tests run: 3, Failures: 0, Errors: 0, Skipped: 0, Time elapsed: 0.09 s - in org.eclipse.ease.ui.views.shell.dropins.modules.ModulesStackLabelProviderTest
17:41:31 [2021-12-25T22:41:31.100Z] getText_null_returns_empty_string  Time elapsed: 0.004 s
17:41:31 [2021-12-25T22:41:31.100Z] getText_returns_definition_name  Time elapsed: 0.086 s
17:41:31 [2021-12-25T22:41:31.100Z] getText_returns_full_class_name_name  Time elapsed: 0 s
17:41:31 [2021-12-25T22:41:31.100Z] Running org.eclipse.ease.ui.views.shell.dropins.variables.VariablesLabelProviderTest
17:41:31 [2021-12-25T22:41:31.355Z] Tests run: 1, Failures: 0, Errors: 0, Skipped: 0, Time elapsed: 0.051 s - in org.eclipse.ease.ui.views.shell.dropins.variables.VariablesLabelProviderTest
17:41:31 [2021-12-25T22:41:31.355Z] getText_returns_variable_name  Time elapsed: 0.051 s
17:41:31 [2021-12-25T22:41:31.356Z] Running org.eclipse.ease.ui.views.shell.dropins.variables.VariablesComparatorTest
17:41:31 [2021-12-25T22:41:31.356Z] Tests run: 1, Failures: 0, Errors: 0, Skipped: 0, Time elapsed: 0.061 s - in org.eclipse.ease.ui.views.shell.dropins.variables.VariablesComparatorTest
17:41:31 [2021-12-25T22:41:31.356Z] lastExecutionResult_comes_before_debugVariable  Time elapsed: 0.061 s
17:41:31 [2021-12-25T22:41:31.356Z] Running org.eclipse.ease.ui.views.shell.dropins.variables.ContentLabelProviderTest
17:41:31 [2021-12-25T22:41:31.356Z] Tests run: 1, Failures: 0, Errors: 0, Skipped: 0, Time elapsed: 0.032 s - in org.eclipse.ease.ui.views.shell.dropins.variables.ContentLabelProviderTest
17:41:31 [2021-12-25T22:41:31.356Z] getText_returns_variable_content  Time elapsed: 0.032 s
17:41:31 [2021-12-25T22:41:31.356Z] Running org.eclipse.ease.ui.views.shell.dropins.variables.VariablesContentProviderTest
17:41:31 [2021-12-25T22:41:31.356Z] Tests run: 5, Failures: 0, Errors: 0, Skipped: 0, Time elapsed: 0.049 s - in org.eclipse.ease.ui.views.shell.dropins.variables.VariablesContentProviderTest
17:41:31 [2021-12-25T22:41:31.356Z] hasChildren_true_when_child_nodes_are_available  Time elapsed: 0 s
17:41:31 [2021-12-25T22:41:31.356Z] getChildren_is_empty_when_no_child_nodes_are_available  Time elapsed: 0 s
17:41:31 [2021-12-25T22:41:31.356Z] getElements_contains_variables_from_engine  Time elapsed: 0.047 s
17:41:31 [2021-12-25T22:41:31.356Z] hasChildren_false_when_no_child_nodes_are_available  Time elapsed: 0 s
17:41:31 [2021-12-25T22:41:31.356Z] getChildren_not_empty_when_child_nodes_are_available  Time elapsed: 0 s
17:41:31 [2021-12-25T22:41:31.356Z] Running org.eclipse.ease.ui.views.shell.dropins.variables.HiddenVariablesFilterTest
17:41:31 [2021-12-25T22:41:31.356Z] Tests run: 3, Failures: 0, Errors: 0, Skipped: 0, Time elapsed: 0.002 s - in org.eclipse.ease.ui.views.shell.dropins.variables.HiddenVariablesFilterTest
17:41:31 [2021-12-25T22:41:31.356Z] select_accepts_unknown_classes  Time elapsed: 0.001 s
17:41:31 [2021-12-25T22:41:31.356Z] select_accepts_script_variables  Time elapsed: 0.001 s
17:41:31 [2021-12-25T22:41:31.356Z] select_declines_hidden_script_variables  Time elapsed: 0 s
17:41:31 [2021-12-25T22:41:31.356Z] Running org.eclipse.ease.ui.help.hovers.ModuleHelpTest
17:41:31 [2021-12-25T22:41:31.356Z] Tests run: 4, Failures: 0, Errors: 0, Skipped: 4, Time elapsed: 0.002 s - in org.eclipse.ease.ui.help.hovers.ModuleHelpTest
17:41:31 [2021-12-25T22:41:31.356Z] getModuleHelpLocation skipped
17:41:31 [2021-12-25T22:41:31.356Z] getModuleHelp skipped
17:41:31 [2021-12-25T22:41:31.356Z] getMethodHelp skipped
17:41:31 [2021-12-25T22:41:31.356Z] getConstantHelp skipped
17:41:31 [2021-12-25T22:41:31.356Z] Running org.eclipse.ease.ui.dnd.ModulesDropHandlerTest
17:41:31 [2021-12-25T22:41:31.356Z] Tests run: 2, Failures: 0, Errors: 0, Skipped: 0, Time elapsed: 0.012 s - in org.eclipse.ease.ui.dnd.ModulesDropHandlerTest
17:41:31 [2021-12-25T22:41:31.356Z] accepts_true_for_ModuleEntry  Time elapsed: 0.011 s
17:41:31 [2021-12-25T22:41:31.356Z] accepts_true_for_ModuleDefinition  Time elapsed: 0.001 s
17:41:31 [2021-12-25T22:41:31.356Z] 
17:41:31 [2021-12-25T22:41:31.356Z] Results:
17:41:31 [2021-12-25T22:41:31.356Z] 
17:41:31 [2021-12-25T22:41:31.356Z] Tests run: 219, Failures: 0, Errors: 0, Skipped: 4
17:41:31 [2021-12-25T22:41:31.356Z] 
17:41:31 [2021-12-25T22:41:31.612Z] [INFO] All tests passed!
17:41:31 [2021-12-25T22:41:31.612Z] [INFO] 
17:41:31 [2021-12-25T22:41:31.612Z] [INFO] --- maven-pmd-plugin:3.15.0:pmd (pmd-integration) @ org.eclipse.ease.ui.test ---
17:41:31 [2021-12-25T22:41:31.612Z] [INFO] PMD version: 6.38.0
17:41:31 [2021-12-25T22:41:31.612Z] [WARNING] Could not find class org.eclipse.ease.ui.completion.CodeCompletionAggregatorTest, due to: java.lang.IncompatibleClassChangeError: class net.sourceforge.pmd.lang.java.typeresolution.visitors.PMDASMVisitor has interface org.objectweb.asm.ClassVisitor as super class
17:41:31 [2021-12-25T22:41:31.613Z] [WARNING] Could not find class org.eclipse.ease.ui.completion.BasicContextTest, due to: java.lang.IncompatibleClassChangeError: class net.sourceforge.pmd.lang.java.typeresolution.visitors.PMDASMVisitor has interface org.objectweb.asm.ClassVisitor as super class
17:41:31 [2021-12-25T22:41:31.869Z] [WARNING] Could not find class org.eclipse.ease.ui.completion.ScriptCompletionProposalTest, due to: java.lang.IncompatibleClassChangeError: class net.sourceforge.pmd.lang.java.typeresolution.visitors.PMDASMVisitor has interface org.objectweb.asm.ClassVisitor as super class
17:41:31 [2021-12-25T22:41:31.869Z] [WARNING] Could not find class org.eclipse.ease.ui.completion.provider.AbstractCompletionProviderTest, due to: java.lang.IncompatibleClassChangeError: class net.sourceforge.pmd.lang.java.typeresolution.visitors.PMDASMVisitor has interface org.objectweb.asm.ClassVisitor as super class
17:41:31 [2021-12-25T22:41:31.869Z] [WARNING] Could not find class org.eclipse.ease.ui.completion.provider.AbstractPathCompletionProviderTest, due to: java.lang.IncompatibleClassChangeError: class net.sourceforge.pmd.lang.java.typeresolution.visitors.PMDASMVisitor has interface org.objectweb.asm.ClassVisitor as super class
17:41:31 [2021-12-25T22:41:31.869Z] [WARNING] Could not find class org.eclipse.ease.ui.completion.provider.LoadModuleCompletionProviderTest, due to: java.lang.IncompatibleClassChangeError: class net.sourceforge.pmd.lang.java.typeresolution.visitors.PMDASMVisitor has interface org.objectweb.asm.ClassVisitor as super class
17:41:32 [2021-12-25T22:41:32.140Z] [WARNING] Could not find class org.eclipse.ease.ui.completion.provider.LoadedModuleCompletionProviderTest, due to: java.lang.IncompatibleClassChangeError: class net.sourceforge.pmd.lang.java.typeresolution.visitors.PMDASMVisitor has interface org.objectweb.asm.ClassVisitor as super class
17:41:32 [2021-12-25T22:41:32.140Z] [WARNING] Could not find class org.eclipse.ease.ui.completion.provider.LocationResolverTest, due to: java.lang.IncompatibleClassChangeError: class net.sourceforge.pmd.lang.java.typeresolution.visitors.PMDASMVisitor has interface org.objectweb.asm.ClassVisitor as super class
17:41:32 [2021-12-25T22:41:32.140Z] [WARNING] Could not find class org.eclipse.ease.ui.completion.provider.VariablesCompletionProviderTest, due to: java.lang.IncompatibleClassChangeError: class net.sourceforge.pmd.lang.java.typeresolution.visitors.PMDASMVisitor has interface org.objectweb.asm.ClassVisitor as super class
17:41:32 [2021-12-25T22:41:32.140Z] [WARNING] Could not find class org.eclipse.ease.ui.completion.tokenizer.BracketMatcherTest, due to: java.lang.IncompatibleClassChangeError: class net.sourceforge.pmd.lang.java.typeresolution.visitors.PMDASMVisitor has interface org.objectweb.asm.ClassVisitor as super class
17:41:32 [2021-12-25T22:41:32.140Z] [WARNING] Could not find class org.eclipse.ease.ui.completion.tokenizer.TokenListTest, due to: java.lang.IncompatibleClassChangeError: class net.sourceforge.pmd.lang.java.typeresolution.visitors.PMDASMVisitor has interface org.objectweb.asm.ClassVisitor as super class
17:41:32 [2021-12-25T22:41:32.141Z] [WARNING] Could not find class org.eclipse.ease.ui.dnd.ModulesDropHandlerTest, due to: java.lang.IncompatibleClassChangeError: class net.sourceforge.pmd.lang.java.typeresolution.visitors.PMDASMVisitor has interface org.objectweb.asm.ClassVisitor as super class
17:41:32 [2021-12-25T22:41:32.141Z] [WARNING] Could not find class org.eclipse.ease.ui.help.hovers.ModuleHelpTest, due to: java.lang.IncompatibleClassChangeError: class net.sourceforge.pmd.lang.java.typeresolution.visitors.PMDASMVisitor has interface org.objectweb.asm.ClassVisitor as super class
17:41:32 [2021-12-25T22:41:32.141Z] [WARNING] Could not find class org.eclipse.ease.ui.help.hovers.SampleModule, due to: java.lang.IncompatibleClassChangeError: class net.sourceforge.pmd.lang.java.typeresolution.visitors.PMDASMVisitor has interface org.objectweb.asm.ClassVisitor as super class
17:41:32 [2021-12-25T22:41:32.141Z] [WARNING] Could not find class org.eclipse.ease.ui.test.RootModule, due to: java.lang.IncompatibleClassChangeError: class net.sourceforge.pmd.lang.java.typeresolution.visitors.PMDASMVisitor has interface org.objectweb.asm.ClassVisitor as super class
17:41:32 [2021-12-25T22:41:32.141Z] [WARNING] Could not find class org.eclipse.ease.ui.test.SubModule, due to: java.lang.IncompatibleClassChangeError: class net.sourceforge.pmd.lang.java.typeresolution.visitors.PMDASMVisitor has interface org.objectweb.asm.ClassVisitor as super class
17:41:32 [2021-12-25T22:41:32.141Z] [WARNING] Could not find class org.eclipse.ease.ui.views.shell.dropins.modules.ModulesStackContentProviderTest, due to: java.lang.IncompatibleClassChangeError: class net.sourceforge.pmd.lang.java.typeresolution.visitors.PMDASMVisitor has interface org.objectweb.asm.ClassVisitor as super class
17:41:32 [2021-12-25T22:41:32.397Z] [WARNING] Could not find class org.eclipse.ease.ui.views.shell.dropins.modules.ModulesStackLabelProviderTest, due to: java.lang.IncompatibleClassChangeError: class net.sourceforge.pmd.lang.java.typeresolution.visitors.PMDASMVisitor has interface org.objectweb.asm.ClassVisitor as super class
17:41:32 [2021-12-25T22:41:32.397Z] [WARNING] Could not find class org.eclipse.ease.ui.views.shell.dropins.variables.ContentLabelProviderTest, due to: java.lang.IncompatibleClassChangeError: class net.sourceforge.pmd.lang.java.typeresolution.visitors.PMDASMVisitor has interface org.objectweb.asm.ClassVisitor as super class
17:41:32 [2021-12-25T22:41:32.397Z] [WARNING] Could not find class org.eclipse.ease.ui.views.shell.dropins.variables.HiddenVariablesFilterTest, due to: java.lang.IncompatibleClassChangeError: class net.sourceforge.pmd.lang.java.typeresolution.visitors.PMDASMVisitor has interface org.objectweb.asm.ClassVisitor as super class
17:41:32 [2021-12-25T22:41:32.398Z] [WARNING] Could not find class org.eclipse.ease.ui.views.shell.dropins.variables.VariablesComparatorTest, due to: java.lang.IncompatibleClassChangeError: class net.sourceforge.pmd.lang.java.typeresolution.visitors.PMDASMVisitor has interface org.objectweb.asm.ClassVisitor as super class
17:41:32 [2021-12-25T22:41:32.398Z] [WARNING] Could not find class org.eclipse.ease.ui.views.shell.dropins.variables.VariablesContentProviderTest, due to: java.lang.IncompatibleClassChangeError: class net.sourceforge.pmd.lang.java.typeresolution.visitors.PMDASMVisitor has interface org.objectweb.asm.ClassVisitor as super class
17:41:32 [2021-12-25T22:41:32.398Z] [WARNING] Could not find class org.eclipse.ease.ui.views.shell.dropins.variables.VariablesLabelProviderTest, due to: java.lang.IncompatibleClassChangeError: class net.sourceforge.pmd.lang.java.typeresolution.visitors.PMDASMVisitor has interface org.objectweb.asm.ClassVisitor as super class
17:41:32 [2021-12-25T22:41:32.398Z] [WARNING] There are 2 PMD processing errors:
17:41:32 [2021-12-25T22:41:32.398Z] [WARNING] /home/jenkins/agent/workspace/ease.verify.core.target.2019-03/tests/org.eclipse.ease.ui.test/src/org/eclipse/ease/ui/completion/provider/AbstractFileLocationCompletionProviderTest.java: PMDException: Error while processing /home/jenkins/agent/workspace/ease.verify.core.target.2019-03/tests/org.eclipse.ease.ui.test/src/org/eclipse/ease/ui/completion/provider/AbstractFileLocationCompletionProviderTest.java
17:41:32 [2021-12-25T22:41:32.398Z] /home/jenkins/agent/workspace/ease.verify.core.target.2019-03/tests/org.eclipse.ease.ui.test/src/org/eclipse/ease/ui/completion/tokenizer/InputTokenizerTest.java: PMDException: Error while processing /home/jenkins/agent/workspace/ease.verify.core.target.2019-03/tests/org.eclipse.ease.ui.test/src/org/eclipse/ease/ui/completion/tokenizer/InputTokenizerTest.java
17:41:32 [2021-12-25T22:41:32.398Z] [INFO] 
17:41:32 [2021-12-25T22:41:32.398Z] [INFO] --- maven-pmd-plugin:3.15.0:cpd (pmd-integration) @ org.eclipse.ease.ui.test ---
17:41:32 [2021-12-25T22:41:32.398Z] [INFO] PMD version: 6.38.0
17:41:32 [2021-12-25T22:41:32.398Z] [INFO] 
17:41:32 [2021-12-25T22:41:32.398Z] [INFO] --- spotbugs-maven-plugin:4.1.4:spotbugs (spotbugs-integration) @ org.eclipse.ease.ui.test ---
17:41:32 [2021-12-25T22:41:32.398Z] [INFO] Fork Value is false
17:41:32 [2021-12-25T22:41:32.398Z]      [java] JVM args ignored when same JVM is used.
17:41:35 [2021-12-25T22:41:35.726Z] [INFO] Done SpotBugs Analysis....
17:41:35 [2021-12-25T22:41:35.726Z] [INFO] 
17:41:35 [2021-12-25T22:41:35.726Z] [INFO] --- maven-checkstyle-plugin:3.1.1:check (checkstyle-integration) @ org.eclipse.ease.ui.test ---
17:41:35 [2021-12-25T22:41:35.726Z] [INFO] You have 0 Checkstyle violations.
17:41:35 [2021-12-25T22:41:35.726Z] [INFO] 
17:41:35 [2021-12-25T22:41:35.726Z] [INFO] --- maven-install-plugin:2.3.1:install (default-install) @ org.eclipse.ease.ui.test ---
17:41:35 [2021-12-25T22:41:35.726Z] [INFO] Installing /home/jenkins/agent/workspace/ease.verify.core.target.2019-03/tests/org.eclipse.ease.ui.test/target/org.eclipse.ease.ui.test-0.9.0-SNAPSHOT.jar to /home/jenkins/.m2/repository/org/eclipse/ease/org.eclipse.ease.ui.test/0.9.0-SNAPSHOT/org.eclipse.ease.ui.test-0.9.0-SNAPSHOT.jar
17:41:35 [2021-12-25T22:41:35.727Z] [INFO] Installing /home/jenkins/agent/workspace/ease.verify.core.target.2019-03/tests/org.eclipse.ease.ui.test/pom.xml to /home/jenkins/.m2/repository/org/eclipse/ease/org.eclipse.ease.ui.test/0.9.0-SNAPSHOT/org.eclipse.ease.ui.test-0.9.0-SNAPSHOT.pom
17:41:35 [2021-12-25T22:41:35.727Z] [INFO] Installing /home/jenkins/agent/workspace/ease.verify.core.target.2019-03/tests/org.eclipse.ease.ui.test/target/p2content.xml to /home/jenkins/.m2/repository/org/eclipse/ease/org.eclipse.ease.ui.test/0.9.0-SNAPSHOT/org.eclipse.ease.ui.test-0.9.0-SNAPSHOT-p2metadata.xml
17:41:35 [2021-12-25T22:41:35.727Z] [INFO] Installing /home/jenkins/agent/workspace/ease.verify.core.target.2019-03/tests/org.eclipse.ease.ui.test/target/p2artifacts.xml to /home/jenkins/.m2/repository/org/eclipse/ease/org.eclipse.ease.ui.test/0.9.0-SNAPSHOT/org.eclipse.ease.ui.test-0.9.0-SNAPSHOT-p2artifacts.xml
17:41:35 [2021-12-25T22:41:35.727Z] [INFO] 
17:41:35 [2021-12-25T22:41:35.727Z] [INFO] --- tycho-p2-plugin:2.2.0:update-local-index (default-update-local-index) @ org.eclipse.ease.ui.test ---
17:41:35 [2021-12-25T22:41:35.727Z] [INFO] 
17:41:35 [2021-12-25T22:41:35.727Z] [INFO] -----< org.eclipse.ease:org.eclipse.ease.ui.completions.java.test >-----
17:41:35 [2021-12-25T22:41:35.727Z] [INFO] Building org.eclipse.ease.ui.completions.java.test 0.9.0-SNAPSHOT [47/49]
17:41:35 [2021-12-25T22:41:35.727Z] [INFO] ------------------------[ eclipse-test-plugin ]-------------------------
17:41:35 [2021-12-25T22:41:35.727Z] [INFO] 
17:41:35 [2021-12-25T22:41:35.727Z] [INFO] --- maven-clean-plugin:2.5:clean (default-clean) @ org.eclipse.ease.ui.completions.java.test ---
17:41:35 [2021-12-25T22:41:35.727Z] [INFO] 
17:41:35 [2021-12-25T22:41:35.727Z] [INFO] --- tycho-packaging-plugin:2.2.0:build-qualifier (default-build-qualifier) @ org.eclipse.ease.ui.completions.java.test ---
17:41:35 [2021-12-25T22:41:35.727Z] [INFO] The project's OSGi version is 0.9.0.I202110141644
17:41:35 [2021-12-25T22:41:35.727Z] [INFO] 
17:41:35 [2021-12-25T22:41:35.727Z] [INFO] --- tycho-packaging-plugin:2.2.0:validate-id (default-validate-id) @ org.eclipse.ease.ui.completions.java.test ---
17:41:35 [2021-12-25T22:41:35.727Z] [INFO] 
17:41:35 [2021-12-25T22:41:35.727Z] [INFO] --- tycho-packaging-plugin:2.2.0:validate-version (default-validate-version) @ org.eclipse.ease.ui.completions.java.test ---
17:41:35 [2021-12-25T22:41:35.727Z] [INFO] 
17:41:35 [2021-12-25T22:41:35.727Z] [INFO] --- maven-resources-plugin:2.4.3:resources (default-resources) @ org.eclipse.ease.ui.completions.java.test ---
17:41:35 [2021-12-25T22:41:35.727Z] [INFO] Using 'UTF-8' encoding to copy filtered resources.
17:41:35 [2021-12-25T22:41:35.727Z] [INFO] skip non existing resourceDirectory /home/jenkins/agent/workspace/ease.verify.core.target.2019-03/tests/org.eclipse.ease.ui.completions.java.test/src/main/resources
17:41:35 [2021-12-25T22:41:35.727Z] [INFO] 
17:41:35 [2021-12-25T22:41:35.727Z] [INFO] --- tycho-compiler-plugin:2.2.0:compile (default-compile) @ org.eclipse.ease.ui.completions.java.test ---
17:41:35 [2021-12-25T22:41:35.727Z] [INFO] Compiling 4 source files to /home/jenkins/agent/workspace/ease.verify.core.target.2019-03/tests/org.eclipse.ease.ui.completions.java.test/target/classes
17:41:36 [2021-12-25T22:41:36.040Z] [INFO] 
17:41:36 [2021-12-25T22:41:36.040Z] [INFO] --- maven-resources-plugin:2.4.3:testResources (default-testResources) @ org.eclipse.ease.ui.completions.java.test ---
17:41:36 [2021-12-25T22:41:36.040Z] [INFO] Using 'UTF-8' encoding to copy filtered resources.
17:41:36 [2021-12-25T22:41:36.040Z] [INFO] skip non existing resourceDirectory /home/jenkins/agent/workspace/ease.verify.core.target.2019-03/tests/org.eclipse.ease.ui.completions.java.test/src/test/resources
17:41:36 [2021-12-25T22:41:36.040Z] [INFO] 
17:41:36 [2021-12-25T22:41:36.040Z] [INFO] --- target-platform-configuration:2.2.0:target-platform (default-target-platform) @ org.eclipse.ease.ui.completions.java.test ---
17:41:36 [2021-12-25T22:41:36.040Z] [INFO] 
17:41:36 [2021-12-25T22:41:36.040Z] [INFO] --- tycho-packaging-plugin:2.2.0:package-plugin (default-package-plugin) @ org.eclipse.ease.ui.completions.java.test ---
17:41:36 [2021-12-25T22:41:36.040Z] [INFO] Building jar: /home/jenkins/agent/workspace/ease.verify.core.target.2019-03/tests/org.eclipse.ease.ui.completions.java.test/target/org.eclipse.ease.ui.completions.java.test-0.9.0-SNAPSHOT.jar
17:41:36 [2021-12-25T22:41:36.040Z] [INFO] 
17:41:36 [2021-12-25T22:41:36.040Z] [INFO] --- tycho-p2-plugin:2.2.0:p2-metadata-default (default-p2-metadata-default) @ org.eclipse.ease.ui.completions.java.test ---
17:41:36 [2021-12-25T22:41:36.040Z] [INFO] 
17:41:36 [2021-12-25T22:41:36.040Z] [INFO] --- jacoco-maven-plugin:0.8.6:prepare-agent (jacoco-initialize) @ org.eclipse.ease.ui.completions.java.test ---
17:41:36 [2021-12-25T22:41:36.041Z] [INFO] tycho.testArgLine set to -javaagent:/home/jenkins/.m2/repository/org/jacoco/org.jacoco.agent/0.8.6/org.jacoco.agent-0.8.6-runtime.jar=destfile=/home/jenkins/agent/workspace/ease.verify.core.target.2019-03/tests/org.eclipse.ease.ui.completions.java.test/target/jacoco.exec,output=file
17:41:36 [2021-12-25T22:41:36.041Z] [INFO] 
17:41:36 [2021-12-25T22:41:36.041Z] [INFO] --- tycho-surefire-plugin:2.2.0:test (default-test) @ org.eclipse.ease.ui.completions.java.test ---
17:41:36 [2021-12-25T22:41:36.041Z] [INFO] Executing Test Runtime with timeout 0, logs (if any) will be placed at: /home/jenkins/agent/workspace/ease.verify.core.target.2019-03/tests/org.eclipse.ease.ui.completions.java.test/target/work/data/.metadata/.log
17:41:36 [2021-12-25T22:41:36.041Z] [INFO] Command line:
17:41:36 [2021-12-25T22:41:36.041Z] 	[/opt/tools/java/openjdk/jdk-15/15.0.2+7/bin/java, -Dosgi.noShutdown=false, -Dosgi.os=linux, -Dosgi.ws=gtk, -Dosgi.arch=x86_64, -javaagent:/home/jenkins/.m2/repository/org/jacoco/org.jacoco.agent/0.8.6/org.jacoco.agent-0.8.6-runtime.jar=destfile=/home/jenkins/agent/workspace/ease.verify.core.target.2019-03/tests/org.eclipse.ease.ui.completions.java.test/target/jacoco.exec,output=file, -Dosgi.clean=true, -jar, /home/jenkins/.m2/repository/p2/osgi/bundle/org.eclipse.equinox.launcher/1.6.300.v20210813-1054/org.eclipse.equinox.launcher-1.6.300.v20210813-1054.jar, -data, /home/jenkins/agent/workspace/ease.verify.core.target.2019-03/tests/org.eclipse.ease.ui.completions.java.test/target/work/data, -install, /home/jenkins/agent/workspace/ease.verify.core.target.2019-03/tests/org.eclipse.ease.ui.completions.java.test/target/work, -configuration, /home/jenkins/agent/workspace/ease.verify.core.target.2019-03/tests/org.eclipse.ease.ui.completions.java.test/target/work/configuration, -application, org.eclipse.tycho.surefire.osgibooter.headlesstest, -testproperties, /home/jenkins/agent/workspace/ease.verify.core.target.2019-03/tests/org.eclipse.ease.ui.completions.java.test/target/surefire.properties]
17:41:36 [2021-12-25T22:41:36.041Z] Picked up JAVA_TOOL_OPTIONS: -Dmaven.ext.class.path="/home/jenkins/agent/workspace/ease.verify.core.target.2019-03@tmp/withMaven8615b88a/pipeline-maven-spy.jar" -Dorg.jenkinsci.plugins.pipeline.maven.reportsFolder="/home/jenkins/agent/workspace/ease.verify.core.target.2019-03@tmp/withMaven8615b88a" 
17:41:39 [2021-12-25T22:41:39.319Z] Running org.eclipse.ease.ui.completions.java.provider.JavaResourcesTest
17:41:39 [2021-12-25T22:41:39.319Z] Tests run: 5, Failures: 0, Errors: 0, Skipped: 0, Time elapsed: 0.329 s - in org.eclipse.ease.ui.completions.java.provider.JavaResourcesTest
17:41:39 [2021-12-25T22:41:39.319Z] getClasses_with_filter_is_populated  Time elapsed: 0.009 s
17:41:39 [2021-12-25T22:41:39.319Z] getClasses_is_populated  Time elapsed: 0 s
17:41:39 [2021-12-25T22:41:39.319Z] singleton_exists  Time elapsed: 0.001 s
17:41:39 [2021-12-25T22:41:39.319Z] getPackages_is_populated  Time elapsed: 0 s
17:41:39 [2021-12-25T22:41:39.319Z] getClasses_with_filter_contains_File_class  Time elapsed: 0.001 s
17:41:39 [2021-12-25T22:41:39.319Z] Running org.eclipse.ease.ui.completions.java.provider.JavaClassCompletionProviderTest
17:41:39 [2021-12-25T22:41:39.882Z] Tests run: 16, Failures: 0, Errors: 0, Skipped: 0, Time elapsed: 0.721 s - in org.eclipse.ease.ui.completions.java.provider.JavaClassCompletionProviderTest
17:41:39 [2021-12-25T22:41:39.882Z] prepareProposals_instance_contains_class_for_package_context_with_filter  Time elapsed: 0.654 s
17:41:39 [2021-12-25T22:41:39.882Z] prepareProposals_instance_contains_inner_class_for_class_context  Time elapsed: 0.006 s
17:41:39 [2021-12-25T22:41:39.882Z] prepareProposals_instance_contains_class_for_package_context  Time elapsed: 0.003 s
17:41:39 [2021-12-25T22:41:39.882Z] prepareProposals_instance_contains_class_for_partial_context  Time elapsed: 0.002 s
17:41:39 [2021-12-25T22:41:39.882Z] prepareProposals_instance_contains_inner_class_for_class_context_with_filter  Time elapsed: 0 s
17:41:39 [2021-12-25T22:41:39.882Z] prepareProposals_instance_contains_class_for_global_context  Time elapsed: 0.005 s
17:41:39 [2021-12-25T22:41:39.882Z] prepareProposals_does_not_contain_inner_class_for_a_given_inner_class_context  Time elapsed: 0 s
17:41:39 [2021-12-25T22:41:39.882Z] isActive_equals_false{String}[1]  Time elapsed: 0.011 s
17:41:39 [2021-12-25T22:41:39.882Z] isActive_equals_false{String}[2]  Time elapsed: 0 s
17:41:39 [2021-12-25T22:41:39.882Z] isActive_equals_true{String}[1]  Time elapsed: 0 s
17:41:39 [2021-12-25T22:41:39.882Z] isActive_equals_true{String}[2]  Time elapsed: 0 s
17:41:39 [2021-12-25T22:41:39.882Z] isActive_equals_true{String}[3]  Time elapsed: 0 s
17:41:39 [2021-12-25T22:41:39.882Z] isActive_equals_true{String}[4]  Time elapsed: 0 s
17:41:39 [2021-12-25T22:41:39.882Z] isActive_equals_true{String}[5]  Time elapsed: 0.001 s
17:41:39 [2021-12-25T22:41:39.882Z] isActive_equals_true{String}[6]  Time elapsed: 0.001 s
17:41:39 [2021-12-25T22:41:39.882Z] prepareProposals_is_empty_for_exact_class_context  Time elapsed: 0.001 s
17:41:39 [2021-12-25T22:41:39.882Z] Running org.eclipse.ease.ui.completions.java.provider.JavaPackagesCompletionProviderTest
17:41:40 [2021-12-25T22:41:40.139Z] Tests run: 28, Failures: 0, Errors: 0, Skipped: 0, Time elapsed: 0.043 s - in org.eclipse.ease.ui.completions.java.provider.JavaPackagesCompletionProviderTest
17:41:40 [2021-12-25T22:41:40.139Z] proposal_java_preserves_suffix  Time elapsed: 0.003 s
17:41:40 [2021-12-25T22:41:40.139Z] proposal_java_appends_to_prefix  Time elapsed: 0.001 s
17:41:40 [2021-12-25T22:41:40.139Z] prepareProposals_instance_contains_root_package_after_new_keyword  Time elapsed: 0.001 s
17:41:40 [2021-12-25T22:41:40.139Z] proposal_java_replaces_filter  Time elapsed: 0 s
17:41:40 [2021-12-25T22:41:40.139Z] prepareProposals_instance_contains_sub_package  Time elapsed: 0.001 s
17:41:40 [2021-12-25T22:41:40.139Z] prepareProposals_instance_contains_3rd_level  Time elapsed: 0 s
17:41:40 [2021-12-25T22:41:40.139Z] isActive_equals_false{String}[1]  Time elapsed: 0.012 s
17:41:40 [2021-12-25T22:41:40.139Z] isActive_equals_false{String}[2]  Time elapsed: 0 s
17:41:40 [2021-12-25T22:41:40.139Z] isActive_equals_false{String}[3]  Time elapsed: 0 s
17:41:40 [2021-12-25T22:41:40.139Z] isActive_equals_false{String}[4]  Time elapsed: 0.001 s
17:41:40 [2021-12-25T22:41:40.139Z] prepareProposals_contains_root_package{String}[1]  Time elapsed: 0 s
17:41:40 [2021-12-25T22:41:40.139Z] prepareProposals_contains_root_package{String}[2]  Time elapsed: 0 s
17:41:40 [2021-12-25T22:41:40.139Z] prepareProposals_contains_root_package{String}[3]  Time elapsed: 0 s
17:41:40 [2021-12-25T22:41:40.139Z] isActive_equals_true{String}[1]  Time elapsed: 0.001 s
17:41:40 [2021-12-25T22:41:40.139Z] isActive_equals_true{String}[2]  Time elapsed: 0 s
17:41:40 [2021-12-25T22:41:40.139Z] isActive_equals_true{String}[3]  Time elapsed: 0 s
17:41:40 [2021-12-25T22:41:40.139Z] isActive_equals_true{String}[4]  Time elapsed: 0 s
17:41:40 [2021-12-25T22:41:40.139Z] isActive_equals_true{String}[5]  Time elapsed: 0 s
17:41:40 [2021-12-25T22:41:40.139Z] isActive_equals_true{String}[6]  Time elapsed: 0 s
17:41:40 [2021-12-25T22:41:40.139Z] isActive_equals_true{String}[7]  Time elapsed: 0 s
17:41:40 [2021-12-25T22:41:40.139Z] isActive_equals_true{String}[8]  Time elapsed: 0 s
17:41:40 [2021-12-25T22:41:40.139Z] isActive_equals_true{String}[9]  Time elapsed: 0 s
17:41:40 [2021-12-25T22:41:40.139Z] isActive_equals_true{String}[10]  Time elapsed: 0 s
17:41:40 [2021-12-25T22:41:40.139Z] isActive_equals_true{String}[11]  Time elapsed: 0 s
17:41:40 [2021-12-25T22:41:40.139Z] isActive_equals_true{String}[12]  Time elapsed: 0.001 s
17:41:40 [2021-12-25T22:41:40.139Z] isActive_equals_true{String}[13]  Time elapsed: 0.001 s
17:41:40 [2021-12-25T22:41:40.139Z] isActive_equals_true{String}[14]  Time elapsed: 0 s
17:41:40 [2021-12-25T22:41:40.139Z] prepareProposals_is_empty_for_exact_class_context  Time elapsed: 0 s
17:41:40 [2021-12-25T22:41:40.139Z] Running org.eclipse.ease.ui.completions.java.provider.JavaMethodCompletionProviderTest
17:41:40 [2021-12-25T22:41:40.139Z] Tests run: 23, Failures: 0, Errors: 0, Skipped: 0, Time elapsed: 0.059 s - in org.eclipse.ease.ui.completions.java.provider.JavaMethodCompletionProviderTest
17:41:40 [2021-12-25T22:41:40.139Z] prepareProposals_class_does_not_contain_isntance_methods  Time elapsed: 0.017 s
17:41:40 [2021-12-25T22:41:40.139Z] prepareProposals_instance_contains_method_with_filter  Time elapsed: 0 s
17:41:40 [2021-12-25T22:41:40.139Z] prepareProposals_method_contains_instance_methods  Time elapsed: 0.001 s
17:41:40 [2021-12-25T22:41:40.139Z] prepareProposals_instance_contains_instance_methods  Time elapsed: 0.001 s
17:41:40 [2021-12-25T22:41:40.140Z] prepareProposals_class_contains_static_methods  Time elapsed: 0.001 s
17:41:40 [2021-12-25T22:41:40.140Z] proposal_replacement_string_contains_leading_dot  Time elapsed: 0 s
17:41:40 [2021-12-25T22:41:40.140Z] prepareProposals_instance_does_not_contain_static_methods  Time elapsed: 0 s
17:41:40 [2021-12-25T22:41:40.140Z] prepareProposals_class_contains_static_fields  Time elapsed: 0.001 s
17:41:40 [2021-12-25T22:41:40.140Z] prepareProposals_instance_does_not_contain_static_fields  Time elapsed: 0.001 s
17:41:40 [2021-12-25T22:41:40.140Z] prepareProposals_does_not_contain_methods_of_base_class_for_method_context  Time elapsed: 0.001 s
17:41:40 [2021-12-25T22:41:40.140Z] isActive_equals_false{String}[1]  Time elapsed: 0.001 s
17:41:40 [2021-12-25T22:41:40.140Z] isActive_equals_false{String}[2]  Time elapsed: 0.001 s
17:41:40 [2021-12-25T22:41:40.140Z] isActive_equals_false{String}[3]  Time elapsed: 0.001 s
17:41:40 [2021-12-25T22:41:40.140Z] isActive_equals_true{String}[1]  Time elapsed: 0.001 s
17:41:40 [2021-12-25T22:41:40.140Z] isActive_equals_true{String}[2]  Time elapsed: 0.001 s
17:41:40 [2021-12-25T22:41:40.140Z] isActive_equals_true{String}[3]  Time elapsed: 0.001 s
17:41:40 [2021-12-25T22:41:40.140Z] isActive_equals_true{String}[4]  Time elapsed: 0 s
17:41:40 [2021-12-25T22:41:40.140Z] isActive_equals_true{String}[5]  Time elapsed: 0 s
17:41:40 [2021-12-25T22:41:40.140Z] isActive_equals_true{String}[6]  Time elapsed: 0.001 s
17:41:40 [2021-12-25T22:41:40.140Z] isActive_equals_true{String}[7]  Time elapsed: 0 s
17:41:40 [2021-12-25T22:41:40.140Z] isActive_equals_true{String}[8]  Time elapsed: 0 s
17:41:40 [2021-12-25T22:41:40.140Z] isActive_equals_true{String}[9]  Time elapsed: 0 s
17:41:40 [2021-12-25T22:41:40.140Z] isActive_equals_true{String}[10]  Time elapsed: 0.001 s
17:41:40 [2021-12-25T22:41:40.140Z] 
17:41:40 [2021-12-25T22:41:40.140Z] Results:
17:41:40 [2021-12-25T22:41:40.140Z] 
17:41:40 [2021-12-25T22:41:40.140Z] Tests run: 72, Failures: 0, Errors: 0, Skipped: 0
17:41:40 [2021-12-25T22:41:40.140Z] 
17:41:40 [2021-12-25T22:41:40.703Z] [INFO] All tests passed!
17:41:40 [2021-12-25T22:41:40.703Z] [INFO] 
17:41:40 [2021-12-25T22:41:40.703Z] [INFO] --- maven-pmd-plugin:3.15.0:pmd (pmd-integration) @ org.eclipse.ease.ui.completions.java.test ---
17:41:40 [2021-12-25T22:41:40.703Z] [INFO] PMD version: 6.38.0
17:41:40 [2021-12-25T22:41:40.959Z] [WARNING] Could not find class org.eclipse.ease.ui.completions.java.provider.JavaClassCompletionProviderTest, due to: java.lang.IncompatibleClassChangeError: class net.sourceforge.pmd.lang.java.typeresolution.visitors.PMDASMVisitor has interface org.objectweb.asm.ClassVisitor as super class
17:41:40 [2021-12-25T22:41:40.960Z] [WARNING] Could not find class org.eclipse.ease.ui.completions.java.provider.JavaMethodCompletionProviderTest, due to: java.lang.IncompatibleClassChangeError: class net.sourceforge.pmd.lang.java.typeresolution.visitors.PMDASMVisitor has interface org.objectweb.asm.ClassVisitor as super class
17:41:41 [2021-12-25T22:41:41.237Z] [WARNING] Could not find class org.eclipse.ease.ui.completions.java.provider.JavaPackagesCompletionProviderTest, due to: java.lang.IncompatibleClassChangeError: class net.sourceforge.pmd.lang.java.typeresolution.visitors.PMDASMVisitor has interface org.objectweb.asm.ClassVisitor as super class
17:41:41 [2021-12-25T22:41:41.237Z] [WARNING] Could not find class org.eclipse.ease.ui.completions.java.provider.JavaResourcesTest, due to: java.lang.IncompatibleClassChangeError: class net.sourceforge.pmd.lang.java.typeresolution.visitors.PMDASMVisitor has interface org.objectweb.asm.ClassVisitor as super class
17:41:41 [2021-12-25T22:41:41.237Z] [INFO] 
17:41:41 [2021-12-25T22:41:41.237Z] [INFO] --- maven-pmd-plugin:3.15.0:cpd (pmd-integration) @ org.eclipse.ease.ui.completions.java.test ---
17:41:41 [2021-12-25T22:41:41.237Z] [INFO] PMD version: 6.38.0
17:41:41 [2021-12-25T22:41:41.237Z] [INFO] 
17:41:41 [2021-12-25T22:41:41.237Z] [INFO] --- spotbugs-maven-plugin:4.1.4:spotbugs (spotbugs-integration) @ org.eclipse.ease.ui.completions.java.test ---
17:41:41 [2021-12-25T22:41:41.237Z] [INFO] Fork Value is false
17:41:41 [2021-12-25T22:41:41.237Z]      [java] JVM args ignored when same JVM is used.
17:41:43 [2021-12-25T22:41:43.790Z] [INFO] Done SpotBugs Analysis....
17:41:43 [2021-12-25T22:41:43.790Z] [INFO] 
17:41:43 [2021-12-25T22:41:43.790Z] [INFO] --- maven-checkstyle-plugin:3.1.1:check (checkstyle-integration) @ org.eclipse.ease.ui.completions.java.test ---
17:41:43 [2021-12-25T22:41:43.790Z] [INFO] You have 0 Checkstyle violations.
17:41:43 [2021-12-25T22:41:43.790Z] [INFO] 
17:41:43 [2021-12-25T22:41:43.790Z] [INFO] --- maven-install-plugin:2.3.1:install (default-install) @ org.eclipse.ease.ui.completions.java.test ---
17:41:43 [2021-12-25T22:41:43.790Z] [INFO] Installing /home/jenkins/agent/workspace/ease.verify.core.target.2019-03/tests/org.eclipse.ease.ui.completions.java.test/target/org.eclipse.ease.ui.completions.java.test-0.9.0-SNAPSHOT.jar to /home/jenkins/.m2/repository/org/eclipse/ease/org.eclipse.ease.ui.completions.java.test/0.9.0-SNAPSHOT/org.eclipse.ease.ui.completions.java.test-0.9.0-SNAPSHOT.jar
17:41:43 [2021-12-25T22:41:43.790Z] [INFO] Installing /home/jenkins/agent/workspace/ease.verify.core.target.2019-03/tests/org.eclipse.ease.ui.completions.java.test/pom.xml to /home/jenkins/.m2/repository/org/eclipse/ease/org.eclipse.ease.ui.completions.java.test/0.9.0-SNAPSHOT/org.eclipse.ease.ui.completions.java.test-0.9.0-SNAPSHOT.pom
17:41:43 [2021-12-25T22:41:43.791Z] [INFO] Installing /home/jenkins/agent/workspace/ease.verify.core.target.2019-03/tests/org.eclipse.ease.ui.completions.java.test/target/p2content.xml to /home/jenkins/.m2/repository/org/eclipse/ease/org.eclipse.ease.ui.completions.java.test/0.9.0-SNAPSHOT/org.eclipse.ease.ui.completions.java.test-0.9.0-SNAPSHOT-p2metadata.xml
17:41:43 [2021-12-25T22:41:43.791Z] [INFO] Installing /home/jenkins/agent/workspace/ease.verify.core.target.2019-03/tests/org.eclipse.ease.ui.completions.java.test/target/p2artifacts.xml to /home/jenkins/.m2/repository/org/eclipse/ease/org.eclipse.ease.ui.completions.java.test/0.9.0-SNAPSHOT/org.eclipse.ease.ui.completions.java.test-0.9.0-SNAPSHOT-p2artifacts.xml
17:41:43 [2021-12-25T22:41:43.791Z] [INFO] 
17:41:43 [2021-12-25T22:41:43.791Z] [INFO] --- tycho-p2-plugin:2.2.0:update-local-index (default-update-local-index) @ org.eclipse.ease.ui.completions.java.test ---
17:41:43 [2021-12-25T22:41:43.791Z] [INFO] 
17:41:43 [2021-12-25T22:41:43.791Z] [INFO] ---------< org.eclipse.ease:org.eclipse.ease.releng.coverage >----------
17:41:43 [2021-12-25T22:41:43.791Z] [INFO] Building org.eclipse.ease.releng.coverage 0.9.0-SNAPSHOT         [48/49]
17:41:43 [2021-12-25T22:41:43.791Z] [INFO] --------------------------------[ pom ]---------------------------------
17:41:43 [2021-12-25T22:41:43.791Z] [INFO] 
17:41:43 [2021-12-25T22:41:43.791Z] [INFO] --- maven-clean-plugin:2.5:clean (default-clean) @ org.eclipse.ease.releng.coverage ---
17:41:43 [2021-12-25T22:41:43.791Z] [INFO] 
17:41:43 [2021-12-25T22:41:43.791Z] [INFO] --- jacoco-maven-plugin:0.8.6:report-aggregate (default) @ org.eclipse.ease.releng.coverage ---
17:41:43 [2021-12-25T22:41:43.792Z] [INFO] Loading execution data file /home/jenkins/agent/workspace/ease.verify.core.target.2019-03/tests/org.eclipse.ease.test/target/jacoco.exec
17:41:43 [2021-12-25T22:41:43.792Z] [INFO] Loading execution data file /home/jenkins/agent/workspace/ease.verify.core.target.2019-03/tests/org.eclipse.ease.lang.javascript.rhino.test/target/jacoco.exec
17:41:43 [2021-12-25T22:41:43.792Z] [INFO] Loading execution data file /home/jenkins/agent/workspace/ease.verify.core.target.2019-03/tests/org.eclipse.ease.lang.javascript.test/target/jacoco.exec
17:41:44 [2021-12-25T22:41:44.048Z] [INFO] Loading execution data file /home/jenkins/agent/workspace/ease.verify.core.target.2019-03/tests/org.eclipse.ease.lang.python.test/target/jacoco.exec
17:41:44 [2021-12-25T22:41:44.049Z] [INFO] Loading execution data file /home/jenkins/agent/workspace/ease.verify.core.target.2019-03/tests/org.eclipse.ease.lang.python.jython.test/target/jacoco.exec
17:41:44 [2021-12-25T22:41:44.049Z] [INFO] Loading execution data file /home/jenkins/agent/workspace/ease.verify.core.target.2019-03/tests/org.eclipse.ease.lang.scriptarchive.test/target/jacoco.exec
17:41:44 [2021-12-25T22:41:44.049Z] [INFO] Loading execution data file /home/jenkins/agent/workspace/ease.verify.core.target.2019-03/tests/org.eclipse.ease.lang.unittest.test/target/jacoco.exec
17:41:44 [2021-12-25T22:41:44.049Z] [INFO] Loading execution data file /home/jenkins/agent/workspace/ease.verify.core.target.2019-03/tests/org.eclipse.ease.ui.scripts.test/target/jacoco.exec
17:41:44 [2021-12-25T22:41:44.049Z] [INFO] Loading execution data file /home/jenkins/agent/workspace/ease.verify.core.target.2019-03/tests/org.eclipse.ease.ui.test/target/jacoco.exec
17:41:44 [2021-12-25T22:41:44.049Z] [INFO] Loading execution data file /home/jenkins/agent/workspace/ease.verify.core.target.2019-03/tests/org.eclipse.ease.ui.completions.java.test/target/jacoco.exec
17:41:44 [2021-12-25T22:41:44.049Z] [INFO] Analyzed bundle 'org.eclipse.ease' with 105 classes
17:41:44 [2021-12-25T22:41:44.305Z] [INFO] Analyzed bundle 'org.eclipse.ease.classloader' with 1 classes
17:41:44 [2021-12-25T22:41:44.305Z] [INFO] Analyzed bundle 'org.eclipse.ease.ui' with 212 classes
17:41:44 [2021-12-25T22:41:44.561Z] [INFO] Analyzed bundle 'org.eclipse.ease.ui.completions.java' with 14 classes
17:41:44 [2021-12-25T22:41:44.561Z] [INFO] Analyzed bundle 'org.eclipse.ease.ui.scripts' with 157 classes
17:41:44 [2021-12-25T22:41:44.841Z] [INFO] Analyzed bundle 'org.eclipse.ease.help' with 0 classes
17:41:44 [2021-12-25T22:41:44.841Z] [INFO] Analyzed bundle 'org.eclipse.ease.lang.javascript' with 5 classes
17:41:44 [2021-12-25T22:41:44.841Z] [INFO] Analyzed bundle 'org.eclipse.ease.lang.javascript.ui' with 4 classes
17:41:44 [2021-12-25T22:41:44.841Z] [INFO] Analyzed bundle 'org.eclipse.ease.lang.javascript.rhino' with 21 classes
17:41:44 [2021-12-25T22:41:44.841Z] [INFO] Analyzed bundle 'org.eclipse.ease.lang.javascript.nashorn' with 2 classes
17:41:44 [2021-12-25T22:41:44.841Z] [INFO] Analyzed bundle 'org.eclipse.ease.lang.python' with 23 classes
17:41:44 [2021-12-25T22:41:44.841Z] [INFO] Analyzed bundle 'org.eclipse.ease.lang.python.jython' with 13 classes
17:41:44 [2021-12-25T22:41:44.841Z] [INFO] Analyzed bundle 'org.eclipse.ease.lang.python.py4j' with 11 classes
17:41:44 [2021-12-25T22:41:44.841Z] [INFO] Analyzed bundle 'org.eclipse.ease.lang.jvm.compiled' with 2 classes
17:41:44 [2021-12-25T22:41:44.841Z] [INFO] Analyzed bundle 'org.eclipse.ease.lang.groovy' with 3 classes
17:41:44 [2021-12-25T22:41:44.841Z] [INFO] Analyzed bundle 'org.eclipse.ease.lang.groovy.interpreter' with 3 classes
17:41:44 [2021-12-25T22:41:44.841Z] [INFO] Analyzed bundle 'org.eclipse.ease.lang.ruby' with 3 classes
17:41:44 [2021-12-25T22:41:44.841Z] [INFO] Analyzed bundle 'org.eclipse.ease.lang.ruby.jruby' with 2 classes
17:41:44 [2021-12-25T22:41:44.841Z] [INFO] Analyzed bundle 'org.eclipse.ease.lang.scriptarchive' with 3 classes
17:41:44 [2021-12-25T22:41:44.841Z] [INFO] Analyzed bundle 'org.eclipse.ease.lang.scriptarchive.ui' with 8 classes
17:41:45 [2021-12-25T22:41:45.097Z] [INFO] Analyzed bundle 'org.eclipse.ease.lang.unittest' with 51 classes
17:41:45 [2021-12-25T22:41:45.097Z] [INFO] Analyzed bundle 'org.eclipse.ease.lang.unittest.ui' with 79 classes
17:41:45 [2021-12-25T22:41:45.354Z] [INFO] 
17:41:45 [2021-12-25T22:41:45.354Z] [INFO] --- maven-install-plugin:2.4:install (default-install) @ org.eclipse.ease.releng.coverage ---
17:41:45 [2021-12-25T22:41:45.354Z] [INFO] Installing /home/jenkins/agent/workspace/ease.verify.core.target.2019-03/releng/org.eclipse.ease.releng.coverage/pom.xml to /home/jenkins/.m2/repository/org/eclipse/ease/org.eclipse.ease.releng.coverage/0.9.0-SNAPSHOT/org.eclipse.ease.releng.coverage-0.9.0-SNAPSHOT.pom
17:41:45 [2021-12-25T22:41:45.354Z] [INFO] 
17:41:45 [2021-12-25T22:41:45.354Z] [INFO] ---------------------< org.eclipse.ease:ease.core >---------------------
17:41:45 [2021-12-25T22:41:45.354Z] [INFO] Building EASE (Incubation) 0.4.0-SNAPSHOT                        [49/49]
17:41:45 [2021-12-25T22:41:45.354Z] [INFO] --------------------------------[ pom ]---------------------------------
17:41:45 [2021-12-25T22:41:45.354Z] [INFO] 
17:41:45 [2021-12-25T22:41:45.354Z] [INFO] --- maven-clean-plugin:2.5:clean (default-clean) @ ease.core ---
17:41:45 [2021-12-25T22:41:45.354Z] [INFO] 
17:41:45 [2021-12-25T22:41:45.354Z] [INFO] --- maven-install-plugin:2.4:install (default-install) @ ease.core ---
17:41:45 [2021-12-25T22:41:45.354Z] [INFO] Installing /home/jenkins/agent/workspace/ease.verify.core.target.2019-03/pom.xml to /home/jenkins/.m2/repository/org/eclipse/ease/ease.core/0.4.0-SNAPSHOT/ease.core-0.4.0-SNAPSHOT.pom
17:41:45 [2021-12-25T22:41:45.354Z] [INFO] ------------------------------------------------------------------------
17:41:45 [2021-12-25T22:41:45.354Z] [INFO] Reactor Summary:
17:41:45 [2021-12-25T22:41:45.354Z] [INFO] 
17:41:45 [2021-12-25T22:41:45.354Z] [INFO] org.eclipse.ease.classloader 0.9.0-SNAPSHOT ........ SUCCESS [ 23.356 s]
17:41:45 [2021-12-25T22:41:45.354Z] [INFO] org.eclipse.ease 0.9.0-SNAPSHOT .................... SUCCESS [ 14.300 s]
17:41:45 [2021-12-25T22:41:45.354Z] [INFO] org.eclipse.ease.ui 0.9.0-SNAPSHOT ................. SUCCESS [ 17.901 s]
17:41:45 [2021-12-25T22:41:45.354Z] [INFO] org.eclipse.ease.ui.completions.java 0.9.0-SNAPSHOT  SUCCESS [  6.619 s]
17:41:45 [2021-12-25T22:41:45.354Z] [INFO] org.eclipse.ease.ui.scripts 0.9.0-SNAPSHOT ......... SUCCESS [ 14.037 s]
17:41:45 [2021-12-25T22:41:45.354Z] [INFO] org.eclipse.ease.releng 0.9.0-SNAPSHOT ............. SUCCESS [  0.175 s]
17:41:45 [2021-12-25T22:41:45.354Z] [INFO] org.eclipse.ease.lang.javascript 0.9.0-SNAPSHOT .... SUCCESS [  5.064 s]
17:41:45 [2021-12-25T22:41:45.354Z] [INFO] org.eclipse.ease.lang.scriptarchive 0.9.0-SNAPSHOT . SUCCESS [  4.404 s]
17:41:45 [2021-12-25T22:41:45.354Z] [INFO] org.eclipse.ease.lang.python 0.9.0-SNAPSHOT ........ SUCCESS [  6.144 s]
17:41:45 [2021-12-25T22:41:45.354Z] [INFO] org.eclipse.ease.lang.python.py4j 0.9.0-SNAPSHOT ... SUCCESS [  5.616 s]
17:41:45 [2021-12-25T22:41:45.354Z] [INFO] org.eclipse.ease.lang.groovy 0.9.0-SNAPSHOT ........ SUCCESS [  4.213 s]
17:41:45 [2021-12-25T22:41:45.354Z] [INFO] org.eclipse.ease.lang.groovy.interpreter 0.9.0-SNAPSHOT SUCCESS [  4.431 s]
17:41:45 [2021-12-25T22:41:45.354Z] [INFO] org.eclipse.ease.lang.unittest 0.9.0-SNAPSHOT ...... SUCCESS [  9.026 s]
17:41:45 [2021-12-25T22:41:45.354Z] [INFO] org.eclipse.ease.lang.unittest.ui 0.9.0-SNAPSHOT ... SUCCESS [  9.975 s]
17:41:45 [2021-12-25T22:41:45.354Z] [INFO] org.eclipse.ease.lang.ruby 0.9.0-SNAPSHOT .......... SUCCESS [  4.089 s]
17:41:45 [2021-12-25T22:41:45.354Z] [INFO] org.eclipse.ease.lang.ruby.jruby 0.9.0-SNAPSHOT .... SUCCESS [  4.027 s]
17:41:45 [2021-12-25T22:41:45.354Z] [INFO] org.eclipse.ease.lang.javascript.nashorn 0.9.0-SNAPSHOT SUCCESS [  4.477 s]
17:41:45 [2021-12-25T22:41:45.354Z] [INFO] org.eclipse.ease.lang.javascript.rhino 0.9.0-SNAPSHOT SUCCESS [  6.381 s]
17:41:45 [2021-12-25T22:41:45.354Z] [INFO] org.eclipse.ease.lang.python.jython 0.9.0-SNAPSHOT . SUCCESS [  6.088 s]
17:41:45 [2021-12-25T22:41:45.355Z] [INFO] org.eclipse.ease.lang.javascript.ui 0.9.0-SNAPSHOT . SUCCESS [  4.447 s]
17:41:45 [2021-12-25T22:41:45.355Z] [INFO] org.eclipse.ease.lang.jvm.compiled 0.9.0-SNAPSHOT .. SUCCESS [  4.503 s]
17:41:45 [2021-12-25T22:41:45.355Z] [INFO] org.eclipse.ease.lang.scriptarchive.ui 0.9.0-SNAPSHOT SUCCESS [  5.229 s]
17:41:45 [2021-12-25T22:41:45.355Z] [INFO] org.eclipse.ease.help 0.9.0-SNAPSHOT ............... SUCCESS [  7.329 s]
17:41:45 [2021-12-25T22:41:45.355Z] [INFO] org.eclipse.ease.feature 0.9.0-SNAPSHOT ............ SUCCESS [  0.169 s]
17:41:45 [2021-12-25T22:41:45.355Z] [INFO] org.eclipse.ease.ui.feature 0.9.0-SNAPSHOT ......... SUCCESS [  0.131 s]
17:41:45 [2021-12-25T22:41:45.355Z] [INFO] org.eclipse.ease.lang.javascript.feature 0.9.0-SNAPSHOT SUCCESS [  0.090 s]
17:41:45 [2021-12-25T22:41:45.355Z] [INFO] org.eclipse.ease.lang.python.feature 0.9.0-SNAPSHOT  SUCCESS [  0.078 s]
17:41:45 [2021-12-25T22:41:45.355Z] [INFO] org.eclipse.ease.python.jython.feature 0.9.0-SNAPSHOT SUCCESS [  0.093 s]
17:41:45 [2021-12-25T22:41:45.355Z] [INFO] org.eclipse.ease.lang.python.py4j.feature 0.9.0-SNAPSHOT SUCCESS [  0.038 s]
17:41:45 [2021-12-25T22:41:45.355Z] [INFO] org.eclipse.ease.lang.jvm.feature 0.9.0-SNAPSHOT ... SUCCESS [  0.077 s]
17:41:45 [2021-12-25T22:41:45.355Z] [INFO] org.eclipse.ease.lang.groovy.feature 0.9.0-SNAPSHOT  SUCCESS [  0.040 s]
17:41:45 [2021-12-25T22:41:45.355Z] [INFO] org.eclipse.ease.lang.ruby.feature 0.9.0-SNAPSHOT .. SUCCESS [  0.075 s]
17:41:45 [2021-12-25T22:41:45.355Z] [INFO] org.eclipse.ease.lang.scriptarchive.feature 0.9.0-SNAPSHOT SUCCESS [  0.106 s]
17:41:45 [2021-12-25T22:41:45.355Z] [INFO] org.eclipse.ease.lang.unittest.feature 0.9.0-SNAPSHOT SUCCESS [  0.082 s]
17:41:45 [2021-12-25T22:41:45.355Z] [INFO] org.eclipse.ease.releng.target 0.9.0-SNAPSHOT ...... SUCCESS [  0.002 s]
17:41:45 [2021-12-25T22:41:45.355Z] [INFO] org.eclipse.ease.releng.p2 0.9.0-SNAPSHOT .......... SUCCESS [  4.175 s]
17:41:45 [2021-12-25T22:41:45.355Z] [INFO] org.eclipse.ease.testhelper 0.9.0-SNAPSHOT ......... SUCCESS [  5.402 s]
17:41:45 [2021-12-25T22:41:45.355Z] [INFO] org.eclipse.ease.test 0.9.0-SNAPSHOT ............... SUCCESS [ 28.616 s]
17:41:45 [2021-12-25T22:41:45.355Z] [INFO] org.eclipse.ease.lang.javascript.rhino.test 0.9.0-SNAPSHOT SUCCESS [ 19.433 s]
17:41:45 [2021-12-25T22:41:45.355Z] [INFO] org.eclipse.ease.lang.javascript.test 0.9.0-SNAPSHOT SUCCESS [  5.710 s]
17:41:45 [2021-12-25T22:41:45.355Z] [INFO] org.eclipse.ease.lang.python.test 0.9.0-SNAPSHOT ... SUCCESS [  7.467 s]
17:41:45 [2021-12-25T22:41:45.355Z] [INFO] org.eclipse.ease.lang.python.jython.test 0.9.0-SNAPSHOT SUCCESS [ 21.298 s]
17:41:45 [2021-12-25T22:41:45.355Z] [INFO] org.eclipse.ease.lang.scriptarchive.test 0.9.0-SNAPSHOT SUCCESS [  6.770 s]
17:41:45 [2021-12-25T22:41:45.355Z] [INFO] org.eclipse.ease.lang.unittest.test 0.9.0-SNAPSHOT . SUCCESS [ 12.550 s]
17:41:45 [2021-12-25T22:41:45.355Z] [INFO] org.eclipse.ease.ui.scripts.test 0.9.0-SNAPSHOT .... SUCCESS [  4.663 s]
17:41:45 [2021-12-25T22:41:45.355Z] [INFO] org.eclipse.ease.ui.test 0.9.0-SNAPSHOT ............ SUCCESS [  9.564 s]
17:41:45 [2021-12-25T22:41:45.355Z] [INFO] org.eclipse.ease.ui.completions.java.test 0.9.0-SNAPSHOT SUCCESS [  8.168 s]
17:41:45 [2021-12-25T22:41:45.355Z] [INFO] org.eclipse.ease.releng.coverage 0.9.0-SNAPSHOT .... SUCCESS [  1.476 s]
17:41:45 [2021-12-25T22:41:45.355Z] [INFO] EASE (Incubation) 0.4.0-SNAPSHOT ................... SUCCESS [  0.188 s]
17:41:45 [2021-12-25T22:41:45.355Z] [INFO] ------------------------------------------------------------------------
17:41:45 [2021-12-25T22:41:45.355Z] [INFO] BUILD SUCCESS
17:41:45 [2021-12-25T22:41:45.355Z] [INFO] ------------------------------------------------------------------------
17:41:45 [2021-12-25T22:41:45.355Z] [INFO] Total time:  06:21 min
17:41:45 [2021-12-25T22:41:45.355Z] [INFO] Finished at: 2021-12-25T22:41:45Z
17:41:45 [2021-12-25T22:41:45.355Z] [INFO] ------------------------------------------------------------------------
17:41:45 [2021-12-25T22:41:45.355Z] [INFO] [jenkins-event-spy] Generated /home/jenkins/agent/workspace/ease.verify.core.target.2019-03@tmp/withMaven8615b88a/maven-spy-20211225-223523-8786068631941599678609.log