SuccessConsole Output

Skipping 800 KB.. Full Log
79)
17:43:11 [2021-07-24T21:43:11.764Z] 	at org.eclipse.ease.lang.python.jython.debugger.JythonDebugger.traceDispatch(JythonDebugger.java:46)
17:43:11 [2021-07-24T21:43:11.764Z] 	at jdk.internal.reflect.GeneratedMethodAccessor25.invoke(Unknown Source)
17:43:11 [2021-07-24T21:43:11.764Z] 	at java.base/jdk.internal.reflect.DelegatingMethodAccessorImpl.invoke(DelegatingMethodAccessorImpl.java:43)
17:43:11 [2021-07-24T21:43:11.764Z] 	at java.base/java.lang.reflect.Method.invoke(Method.java:564)
17:43:11 [2021-07-24T21:43:11.764Z] 
17:43:11 [2021-07-24T21:43:11.764Z] org.eclipse.ease.ScriptEngineCancellationException: org.eclipse.ease.ScriptEngineCancellationException: Terminated on user request
17:43:11 [2021-07-24T21:43:11.764Z] Start of script
17:43:11 [2021-07-24T21:43:11.764Z] include file start
17:43:11 [2021-07-24T21:43:11.764Z] include file processed
17:43:12 [2021-07-24T21:43:12.022Z] Result of testMethod = 5
17:43:12 [2021-07-24T21:43:12.022Z] End of script
17:43:12 [2021-07-24T21:43:12.022Z] Start of script
17:43:12 [2021-07-24T21:43:12.022Z] include file start
17:43:12 [2021-07-24T21:43:12.022Z] include file processed
17:43:12 [2021-07-24T21:43:12.022Z] Result of testMethod = 5
17:43:12 [2021-07-24T21:43:12.280Z] End of script
17:43:12 [2021-07-24T21:43:12.280Z] Start of script
17:43:12 [2021-07-24T21:43:12.280Z] include file start
17:43:12 [2021-07-24T21:43:12.280Z] include file processed
17:43:12 [2021-07-24T21:43:12.858Z] Traceback (most recent call last):
17:43:12 [2021-07-24T21:43:12.858Z]   File "(none)", line 184, in run
17:43:12 [2021-07-24T21:43:12.858Z]   File "__ref_L/Debug Test/Main.py_bzjsqnxwda", line 22, in <module>
17:43:12 [2021-07-24T21:43:12.858Z]   File "(none)", line 161, in trace_dispatch
17:43:12 [2021-07-24T21:43:12.858Z] 	at org.eclipse.ease.debugging.AbstractEaseDebugger.handleEventsInSuspendedState(AbstractEaseDebugger.java:331)
17:43:12 [2021-07-24T21:43:12.858Z] 	at org.eclipse.ease.debugging.AbstractEaseDebugger.suspend(AbstractEaseDebugger.java:257)
17:43:12 [2021-07-24T21:43:12.858Z] 	at org.eclipse.ease.debugging.AbstractEaseDebugger.processLine(AbstractEaseDebugger.java:512)
17:43:12 [2021-07-24T21:43:12.858Z] 	at org.eclipse.ease.lang.python.debugger.PythonDebugger.traceDispatch(PythonDebugger.java:179)
17:43:12 [2021-07-24T21:43:12.858Z] 	at org.eclipse.ease.lang.python.jython.debugger.JythonDebugger.traceDispatch(JythonDebugger.java:46)
17:43:12 [2021-07-24T21:43:12.858Z] 	at jdk.internal.reflect.GeneratedMethodAccessor25.invoke(Unknown Source)
17:43:12 [2021-07-24T21:43:12.858Z] 	at java.base/jdk.internal.reflect.DelegatingMethodAccessorImpl.invoke(DelegatingMethodAccessorImpl.java:43)
17:43:12 [2021-07-24T21:43:12.858Z] 	at java.base/java.lang.reflect.Method.invoke(Method.java:564)
17:43:12 [2021-07-24T21:43:12.858Z] 
17:43:12 [2021-07-24T21:43:12.858Z] org.eclipse.ease.ScriptEngineCancellationException: org.eclipse.ease.ScriptEngineCancellationException: Terminated on user request
17:43:12 [2021-07-24T21:43:12.858Z] Start of script
17:43:12 [2021-07-24T21:43:12.858Z] include file start
17:43:12 [2021-07-24T21:43:12.858Z] include file processed
17:43:12 [2021-07-24T21:43:12.858Z] Result of testMethod = 5
17:43:12 [2021-07-24T21:43:12.858Z] End of script
17:43:13 [2021-07-24T21:43:13.118Z] Start of script
17:43:13 [2021-07-24T21:43:13.118Z] include file start
17:43:13 [2021-07-24T21:43:13.118Z] include file processed
17:43:13 [2021-07-24T21:43:13.118Z] Result of testMethod = 5
17:43:13 [2021-07-24T21:43:13.118Z] End of script
17:43:13 [2021-07-24T21:43:13.377Z] Traceback (most recent call last):
17:43:13 [2021-07-24T21:43:13.377Z]   File "(none)", line 184, in run
17:43:13 [2021-07-24T21:43:13.377Z]   File "__ref_L/Debug Test/Main.py_qaffrjdnwx", line 1, in <module>
17:43:13 [2021-07-24T21:43:13.377Z]   File "(none)", line 161, in trace_dispatch
17:43:13 [2021-07-24T21:43:13.377Z] 	at org.eclipse.ease.debugging.AbstractEaseDebugger.handleEventsInSuspendedState(AbstractEaseDebugger.java:331)
17:43:13 [2021-07-24T21:43:13.377Z] 	at org.eclipse.ease.debugging.AbstractEaseDebugger.suspend(AbstractEaseDebugger.java:257)
17:43:13 [2021-07-24T21:43:13.377Z] 	at org.eclipse.ease.debugging.AbstractEaseDebugger.processLine(AbstractEaseDebugger.java:492)
17:43:13 [2021-07-24T21:43:13.377Z] 	at org.eclipse.ease.lang.python.debugger.PythonDebugger.traceDispatch(PythonDebugger.java:179)
17:43:13 [2021-07-24T21:43:13.377Z] 	at org.eclipse.ease.lang.python.jython.debugger.JythonDebugger.traceDispatch(JythonDebugger.java:46)
17:43:13 [2021-07-24T21:43:13.377Z] 	at jdk.internal.reflect.GeneratedMethodAccessor25.invoke(Unknown Source)
17:43:13 [2021-07-24T21:43:13.377Z] 	at java.base/jdk.internal.reflect.DelegatingMethodAccessorImpl.invoke(DelegatingMethodAccessorImpl.java:43)
17:43:13 [2021-07-24T21:43:13.377Z] 	at java.base/java.lang.reflect.Method.invoke(Method.java:564)
17:43:13 [2021-07-24T21:43:13.377Z] 
17:43:13 [2021-07-24T21:43:13.377Z] org.eclipse.ease.ScriptEngineCancellationException: org.eclipse.ease.ScriptEngineCancellationException: Terminated on user request
17:43:13 [2021-07-24T21:43:13.644Z] Start of script
17:43:13 [2021-07-24T21:43:13.644Z] include file start
17:43:13 [2021-07-24T21:43:13.644Z] include file processed
17:43:13 [2021-07-24T21:43:13.645Z] Result of testMethod = 5
17:43:13 [2021-07-24T21:43:13.645Z] End of script
17:43:13 [2021-07-24T21:43:13.645Z] Start of script
17:43:13 [2021-07-24T21:43:13.907Z] include file start
17:43:13 [2021-07-24T21:43:13.907Z] include file processed
17:43:13 [2021-07-24T21:43:13.907Z] Result of testMethod = 5
17:43:13 [2021-07-24T21:43:13.907Z] End of script
17:43:14 [2021-07-24T21:43:14.166Z] Start of script
17:43:14 [2021-07-24T21:43:14.166Z] include file start
17:43:14 [2021-07-24T21:43:14.166Z] include file processed
17:43:14 [2021-07-24T21:43:14.166Z] Result of testMethod = 5
17:43:14 [2021-07-24T21:43:14.166Z] Traceback (most recent call last):
17:43:14 [2021-07-24T21:43:14.166Z]   File "(none)", line 184, in run
17:43:14 [2021-07-24T21:43:14.166Z]   File "__ref_L/Debug Test/Main.py_pssxycrnpt", line 23, in <module>
17:43:14 [2021-07-24T21:43:14.166Z]   File "(none)", line 161, in trace_dispatch
17:43:14 [2021-07-24T21:43:14.166Z] 	at org.eclipse.ease.debugging.AbstractEaseDebugger.handleEventsInSuspendedState(AbstractEaseDebugger.java:331)
17:43:14 [2021-07-24T21:43:14.166Z] 	at org.eclipse.ease.debugging.AbstractEaseDebugger.suspend(AbstractEaseDebugger.java:257)
17:43:14 [2021-07-24T21:43:14.166Z] 	at org.eclipse.ease.debugging.AbstractEaseDebugger.processLine(AbstractEaseDebugger.java:492)
17:43:14 [2021-07-24T21:43:14.166Z] 	at org.eclipse.ease.lang.python.debugger.PythonDebugger.traceDispatch(PythonDebugger.java:179)
17:43:14 [2021-07-24T21:43:14.166Z] 	at org.eclipse.ease.lang.python.jython.debugger.JythonDebugger.traceDispatch(JythonDebugger.java:46)
17:43:14 [2021-07-24T21:43:14.166Z] 	at jdk.internal.reflect.GeneratedMethodAccessor25.invoke(Unknown Source)
17:43:14 [2021-07-24T21:43:14.166Z] 	at java.base/jdk.internal.reflect.DelegatingMethodAccessorImpl.invoke(DelegatingMethodAccessorImpl.java:43)
17:43:14 [2021-07-24T21:43:14.166Z] 	at java.base/java.lang.reflect.Method.invoke(Method.java:564)
17:43:14 [2021-07-24T21:43:14.166Z] 
17:43:14 [2021-07-24T21:43:14.166Z] org.eclipse.ease.ScriptEngineCancellationException: org.eclipse.ease.ScriptEngineCancellationException: Terminated on user request
17:43:14 [2021-07-24T21:43:14.424Z] Start of script
17:43:14 [2021-07-24T21:43:14.424Z] include file start
17:43:14 [2021-07-24T21:43:14.424Z] include file processed
17:43:14 [2021-07-24T21:43:14.424Z] Result of testMethod = 5
17:43:14 [2021-07-24T21:43:14.424Z] End of script
17:43:14 [2021-07-24T21:43:14.683Z] Traceback (most recent call last):
17:43:14 [2021-07-24T21:43:14.683Z]   File "(none)", line 184, in run
17:43:14 [2021-07-24T21:43:14.683Z]   File "__ref_L/Debug Test/Main.py_gjeuqsgdrp", line 1, in <module>
17:43:14 [2021-07-24T21:43:14.683Z]   File "(none)", line 161, in trace_dispatch
17:43:14 [2021-07-24T21:43:14.684Z] 	at org.eclipse.ease.debugging.AbstractEaseDebugger.handleEventsInSuspendedState(AbstractEaseDebugger.java:331)
17:43:14 [2021-07-24T21:43:14.684Z] 	at org.eclipse.ease.debugging.AbstractEaseDebugger.suspend(AbstractEaseDebugger.java:257)
17:43:14 [2021-07-24T21:43:14.684Z] 	at org.eclipse.ease.debugging.AbstractEaseDebugger.processLine(AbstractEaseDebugger.java:492)
17:43:14 [2021-07-24T21:43:14.684Z] 	at org.eclipse.ease.lang.python.debugger.PythonDebugger.traceDispatch(PythonDebugger.java:179)
17:43:14 [2021-07-24T21:43:14.684Z] 	at org.eclipse.ease.lang.python.jython.debugger.JythonDebugger.traceDispatch(JythonDebugger.java:46)
17:43:14 [2021-07-24T21:43:14.684Z] 	at jdk.internal.reflect.GeneratedMethodAccessor25.invoke(Unknown Source)
17:43:14 [2021-07-24T21:43:14.684Z] 	at java.base/jdk.internal.reflect.DelegatingMethodAccessorImpl.invoke(DelegatingMethodAccessorImpl.java:43)
17:43:14 [2021-07-24T21:43:14.684Z] 	at java.base/java.lang.reflect.Method.invoke(Method.java:564)
17:43:14 [2021-07-24T21:43:14.684Z] 
17:43:14 [2021-07-24T21:43:14.684Z] org.eclipse.ease.ScriptEngineCancellationException: org.eclipse.ease.ScriptEngineCancellationException: Terminated on user request
17:43:14 [2021-07-24T21:43:14.971Z] Start of script
17:43:14 [2021-07-24T21:43:14.971Z] include file start
17:43:14 [2021-07-24T21:43:14.971Z] include file processed
17:43:14 [2021-07-24T21:43:14.971Z] Result of testMethod = 5
17:43:14 [2021-07-24T21:43:14.971Z] End of script
17:43:14 [2021-07-24T21:43:14.971Z] Start of script
17:43:15 [2021-07-24T21:43:15.233Z] include file start
17:43:15 [2021-07-24T21:43:15.233Z] include file processed
17:43:15 [2021-07-24T21:43:15.233Z] Result of testMethod = 5
17:43:15 [2021-07-24T21:43:15.233Z] End of script
17:43:15 [2021-07-24T21:43:15.492Z] Traceback (most recent call last):
17:43:15 [2021-07-24T21:43:15.492Z]   File "(none)", line 184, in run
17:43:15 [2021-07-24T21:43:15.492Z]   File "__ref_L/Debug Test/Main.py_cldvhanlgp", line 1, in <module>
17:43:15 [2021-07-24T21:43:15.492Z]   File "(none)", line 161, in trace_dispatch
17:43:15 [2021-07-24T21:43:15.492Z] 	at org.eclipse.ease.debugging.AbstractEaseDebugger.handleEventsInSuspendedState(AbstractEaseDebugger.java:331)
17:43:15 [2021-07-24T21:43:15.492Z] 	at org.eclipse.ease.debugging.AbstractEaseDebugger.suspend(AbstractEaseDebugger.java:257)
17:43:15 [2021-07-24T21:43:15.492Z] 	at org.eclipse.ease.debugging.AbstractEaseDebugger.processLine(AbstractEaseDebugger.java:492)
17:43:15 [2021-07-24T21:43:15.492Z] 	at org.eclipse.ease.lang.python.debugger.PythonDebugger.traceDispatch(PythonDebugger.java:179)
17:43:15 [2021-07-24T21:43:15.492Z] 	at org.eclipse.ease.lang.python.jython.debugger.JythonDebugger.traceDispatch(JythonDebugger.java:46)
17:43:15 [2021-07-24T21:43:15.492Z] 	at jdk.internal.reflect.GeneratedMethodAccessor25.invoke(Unknown Source)
17:43:15 [2021-07-24T21:43:15.492Z] 	at java.base/jdk.internal.reflect.DelegatingMethodAccessorImpl.invoke(DelegatingMethodAccessorImpl.java:43)
17:43:15 [2021-07-24T21:43:15.492Z] 	at java.base/java.lang.reflect.Method.invoke(Method.java:564)
17:43:15 [2021-07-24T21:43:15.492Z] 
17:43:15 [2021-07-24T21:43:15.492Z] org.eclipse.ease.ScriptEngineCancellationException: org.eclipse.ease.ScriptEngineCancellationException: Terminated on user request
17:43:15 [2021-07-24T21:43:15.492Z] Start of script
17:43:15 [2021-07-24T21:43:15.492Z] include file start
17:43:15 [2021-07-24T21:43:15.492Z] include file processed
17:43:15 [2021-07-24T21:43:15.751Z] Result of testMethod = 5
17:43:15 [2021-07-24T21:43:15.751Z] End of script
17:43:16 [2021-07-24T21:43:16.008Z] Start of script
17:43:16 [2021-07-24T21:43:16.008Z] include file start
17:43:16 [2021-07-24T21:43:16.008Z] include file processed
17:43:16 [2021-07-24T21:43:16.008Z] Result of testMethod = 5
17:43:16 [2021-07-24T21:43:16.009Z] Traceback (most recent call last):
17:43:16 [2021-07-24T21:43:16.009Z]   File "(none)", line 184, in run
17:43:16 [2021-07-24T21:43:16.009Z]   File "__ref_L/Debug Test/Main.py_onhaugtrzy", line 23, in <module>
17:43:16 [2021-07-24T21:43:16.009Z]   File "(none)", line 161, in trace_dispatch
17:43:16 [2021-07-24T21:43:16.009Z] 	at org.eclipse.ease.debugging.AbstractEaseDebugger.handleEventsInSuspendedState(AbstractEaseDebugger.java:331)
17:43:16 [2021-07-24T21:43:16.009Z] 	at org.eclipse.ease.debugging.AbstractEaseDebugger.suspend(AbstractEaseDebugger.java:257)
17:43:16 [2021-07-24T21:43:16.009Z] 	at org.eclipse.ease.debugging.AbstractEaseDebugger.processLine(AbstractEaseDebugger.java:492)
17:43:16 [2021-07-24T21:43:16.009Z] 	at org.eclipse.ease.lang.python.debugger.PythonDebugger.traceDispatch(PythonDebugger.java:179)
17:43:16 [2021-07-24T21:43:16.009Z] 	at org.eclipse.ease.lang.python.jython.debugger.JythonDebugger.traceDispatch(JythonDebugger.java:46)
17:43:16 [2021-07-24T21:43:16.009Z] 	at jdk.internal.reflect.GeneratedMethodAccessor25.invoke(Unknown Source)
17:43:16 [2021-07-24T21:43:16.009Z] 	at java.base/jdk.internal.reflect.DelegatingMethodAccessorImpl.invoke(DelegatingMethodAccessorImpl.java:43)
17:43:16 [2021-07-24T21:43:16.009Z] 	at java.base/java.lang.reflect.Method.invoke(Method.java:564)
17:43:16 [2021-07-24T21:43:16.009Z] 
17:43:16 [2021-07-24T21:43:16.009Z] org.eclipse.ease.ScriptEngineCancellationException: org.eclipse.ease.ScriptEngineCancellationException: Terminated on user request
17:43:16 [2021-07-24T21:43:16.268Z] Start of script
17:43:16 [2021-07-24T21:43:16.268Z] include file start
17:43:16 [2021-07-24T21:43:16.268Z] include file processed
17:43:16 [2021-07-24T21:43:16.268Z] Result of testMethod = 5
17:43:16 [2021-07-24T21:43:16.268Z] End of script
17:43:16 [2021-07-24T21:43:16.526Z] Start of script
17:43:16 [2021-07-24T21:43:16.526Z] include file start
17:43:16 [2021-07-24T21:43:16.526Z] include file processed
17:43:16 [2021-07-24T21:43:16.526Z] Result of testMethod = 5
17:43:16 [2021-07-24T21:43:16.526Z] End of script
17:43:16 [2021-07-24T21:43:16.783Z] Start of script
17:43:16 [2021-07-24T21:43:16.783Z] include file start
17:43:16 [2021-07-24T21:43:16.783Z] include file processed
17:43:16 [2021-07-24T21:43:16.783Z] Result of testMethod = 5
17:43:16 [2021-07-24T21:43:16.783Z] End of script
17:43:16 [2021-07-24T21:43:16.783Z] Start of script
17:43:16 [2021-07-24T21:43:16.783Z] include file start
17:43:16 [2021-07-24T21:43:16.783Z] include file processed
17:43:17 [2021-07-24T21:43:17.042Z] Result of testMethod = 5
17:43:17 [2021-07-24T21:43:17.042Z] End of script
17:43:17 [2021-07-24T21:43:17.042Z] Start of script
17:43:17 [2021-07-24T21:43:17.042Z] include file start
17:43:17 [2021-07-24T21:43:17.042Z] include file processed
17:43:17 [2021-07-24T21:43:17.301Z] Traceback (most recent call last):
17:43:17 [2021-07-24T21:43:17.301Z]   File "(none)", line 184, in run
17:43:17 [2021-07-24T21:43:17.301Z]   File "__ref_L/Debug Test/Main.py_oenmfrhfpq", line 21, in <module>
17:43:17 [2021-07-24T21:43:17.301Z]   File "__ref_L/Debug Test/Main.py_oenmfrhfpq", line 18, in testMethod
17:43:17 [2021-07-24T21:43:17.301Z]   File "(none)", line 161, in trace_dispatch
17:43:17 [2021-07-24T21:43:17.301Z] 	at org.eclipse.ease.debugging.AbstractEaseDebugger.handleEventsInSuspendedState(AbstractEaseDebugger.java:331)
17:43:17 [2021-07-24T21:43:17.301Z] 	at org.eclipse.ease.debugging.AbstractEaseDebugger.suspend(AbstractEaseDebugger.java:257)
17:43:17 [2021-07-24T21:43:17.301Z] 	at org.eclipse.ease.debugging.AbstractEaseDebugger.processLine(AbstractEaseDebugger.java:492)
17:43:17 [2021-07-24T21:43:17.301Z] 	at org.eclipse.ease.lang.python.debugger.PythonDebugger.traceDispatch(PythonDebugger.java:179)
17:43:17 [2021-07-24T21:43:17.301Z] 	at org.eclipse.ease.lang.python.jython.debugger.JythonDebugger.traceDispatch(JythonDebugger.java:46)
17:43:17 [2021-07-24T21:43:17.301Z] 	at jdk.internal.reflect.GeneratedMethodAccessor25.invoke(Unknown Source)
17:43:17 [2021-07-24T21:43:17.301Z] 	at java.base/jdk.internal.reflect.DelegatingMethodAccessorImpl.invoke(DelegatingMethodAccessorImpl.java:43)
17:43:17 [2021-07-24T21:43:17.301Z] 	at java.base/java.lang.reflect.Method.invoke(Method.java:564)
17:43:17 [2021-07-24T21:43:17.301Z] 
17:43:17 [2021-07-24T21:43:17.301Z] org.eclipse.ease.ScriptEngineCancellationException: org.eclipse.ease.ScriptEngineCancellationException: Terminated on user request
17:43:17 [2021-07-24T21:43:17.559Z] Start of script
17:43:17 [2021-07-24T21:43:17.559Z] include file start
17:43:17 [2021-07-24T21:43:17.559Z] include file processed
17:43:17 [2021-07-24T21:43:17.559Z] Result of testMethod = 5
17:43:17 [2021-07-24T21:43:17.559Z] End of script
17:43:17 [2021-07-24T21:43:17.817Z] Start of script
17:43:17 [2021-07-24T21:43:17.817Z] include file start
17:43:17 [2021-07-24T21:43:17.817Z] include file processed
17:43:17 [2021-07-24T21:43:17.817Z] Result of testMethod = 5
17:43:17 [2021-07-24T21:43:17.817Z] Traceback (most recent call last):
17:43:17 [2021-07-24T21:43:17.817Z]   File "(none)", line 184, in run
17:43:17 [2021-07-24T21:43:17.817Z]   File "__ref_L/Debug Test/Main.py_jmfewtrexa", line 23, in <module>
17:43:17 [2021-07-24T21:43:17.818Z]   File "(none)", line 161, in trace_dispatch
17:43:17 [2021-07-24T21:43:17.818Z] 	at org.eclipse.ease.debugging.AbstractEaseDebugger.handleEventsInSuspendedState(AbstractEaseDebugger.java:331)
17:43:17 [2021-07-24T21:43:17.818Z] 	at org.eclipse.ease.debugging.AbstractEaseDebugger.suspend(AbstractEaseDebugger.java:257)
17:43:17 [2021-07-24T21:43:17.818Z] 	at org.eclipse.ease.debugging.AbstractEaseDebugger.processLine(AbstractEaseDebugger.java:492)
17:43:17 [2021-07-24T21:43:17.818Z] 	at org.eclipse.ease.lang.python.debugger.PythonDebugger.traceDispatch(PythonDebugger.java:179)
17:43:17 [2021-07-24T21:43:17.818Z] 	at org.eclipse.ease.lang.python.jython.debugger.JythonDebugger.traceDispatch(JythonDebugger.java:46)
17:43:17 [2021-07-24T21:43:17.818Z] 	at jdk.internal.reflect.GeneratedMethodAccessor25.invoke(Unknown Source)
17:43:17 [2021-07-24T21:43:17.818Z] 	at java.base/jdk.internal.reflect.DelegatingMethodAccessorImpl.invoke(DelegatingMethodAccessorImpl.java:43)
17:43:17 [2021-07-24T21:43:17.818Z] 	at java.base/java.lang.reflect.Method.invoke(Method.java:564)
17:43:17 [2021-07-24T21:43:17.818Z] 
17:43:17 [2021-07-24T21:43:17.818Z] org.eclipse.ease.ScriptEngineCancellationException: org.eclipse.ease.ScriptEngineCancellationException: Terminated on user request
17:43:18 [2021-07-24T21:43:18.077Z] Start of script
17:43:18 [2021-07-24T21:43:18.077Z] include file start
17:43:18 [2021-07-24T21:43:18.077Z] include file processed
17:43:18 [2021-07-24T21:43:18.077Z] Result of testMethod = 5
17:43:18 [2021-07-24T21:43:18.335Z] End of script
17:43:18 [2021-07-24T21:43:18.335Z] Start of script
17:43:18 [2021-07-24T21:43:18.335Z] include file start
17:43:18 [2021-07-24T21:43:18.335Z] include file processed
17:43:18 [2021-07-24T21:43:18.593Z] Result of testMethod = 5
17:43:18 [2021-07-24T21:43:18.593Z] End of script
17:43:18 [2021-07-24T21:43:18.593Z] Start of script
17:43:18 [2021-07-24T21:43:18.593Z] include file start
17:43:18 [2021-07-24T21:43:18.593Z] include file processed
17:43:18 [2021-07-24T21:43:18.852Z] Result of testMethod = 5
17:43:18 [2021-07-24T21:43:18.852Z] End of script
17:43:19 [2021-07-24T21:43:19.115Z] Start of script
17:43:19 [2021-07-24T21:43:19.115Z] include file start
17:43:19 [2021-07-24T21:43:19.115Z] include file processed
17:43:19 [2021-07-24T21:43:19.115Z] Result of testMethod = 5
17:43:19 [2021-07-24T21:43:19.115Z] End of script
17:43:19 [2021-07-24T21:43:19.115Z] Start of script
17:43:19 [2021-07-24T21:43:19.115Z] include file start
17:43:19 [2021-07-24T21:43:19.115Z] include file processed
17:43:19 [2021-07-24T21:43:19.115Z] Result of testMethod = 5
17:43:19 [2021-07-24T21:43:19.374Z] Traceback (most recent call last):
17:43:19 [2021-07-24T21:43:19.374Z]   File "(none)", line 184, in run
17:43:19 [2021-07-24T21:43:19.374Z]   File "__ref_L/Debug Test/Main.py_godkqfaklm", line 23, in <module>
17:43:19 [2021-07-24T21:43:19.374Z]   File "(none)", line 161, in trace_dispatch
17:43:19 [2021-07-24T21:43:19.374Z] 	at org.eclipse.ease.debugging.AbstractEaseDebugger.handleEventsInSuspendedState(AbstractEaseDebugger.java:331)
17:43:19 [2021-07-24T21:43:19.374Z] 	at org.eclipse.ease.debugging.AbstractEaseDebugger.suspend(AbstractEaseDebugger.java:257)
17:43:19 [2021-07-24T21:43:19.374Z] 	at org.eclipse.ease.debugging.AbstractEaseDebugger.processLine(AbstractEaseDebugger.java:492)
17:43:19 [2021-07-24T21:43:19.374Z] 	at org.eclipse.ease.lang.python.debugger.PythonDebugger.traceDispatch(PythonDebugger.java:179)
17:43:19 [2021-07-24T21:43:19.374Z] 	at org.eclipse.ease.lang.python.jython.debugger.JythonDebugger.traceDispatch(JythonDebugger.java:46)
17:43:19 [2021-07-24T21:43:19.374Z] 	at jdk.internal.reflect.GeneratedMethodAccessor25.invoke(Unknown Source)
17:43:19 [2021-07-24T21:43:19.374Z] 	at java.base/jdk.internal.reflect.DelegatingMethodAccessorImpl.invoke(DelegatingMethodAccessorImpl.java:43)
17:43:19 [2021-07-24T21:43:19.374Z] 	at java.base/java.lang.reflect.Method.invoke(Method.java:564)
17:43:19 [2021-07-24T21:43:19.374Z] 
17:43:19 [2021-07-24T21:43:19.374Z] org.eclipse.ease.ScriptEngineCancellationException: org.eclipse.ease.ScriptEngineCancellationException: Terminated on user request
17:43:19 [2021-07-24T21:43:19.633Z] Start of script
17:43:19 [2021-07-24T21:43:19.633Z] include file start
17:43:19 [2021-07-24T21:43:19.633Z] include file processed
17:43:19 [2021-07-24T21:43:19.633Z] Result of testMethod = 5
17:43:19 [2021-07-24T21:43:19.633Z] End of script
17:43:19 [2021-07-24T21:43:19.633Z] Start of script
17:43:19 [2021-07-24T21:43:19.633Z] include file start
17:43:19 [2021-07-24T21:43:19.633Z] include file processed
17:43:19 [2021-07-24T21:43:19.633Z] Result of testMethod = 5
17:43:19 [2021-07-24T21:43:19.891Z] Traceback (most recent call last):
17:43:19 [2021-07-24T21:43:19.891Z]   File "(none)", line 184, in run
17:43:19 [2021-07-24T21:43:19.891Z]   File "__ref_L/Debug Test/Main.py_woqccqidek", line 23, in <module>
17:43:19 [2021-07-24T21:43:19.891Z]   File "(none)", line 161, in trace_dispatch
17:43:19 [2021-07-24T21:43:19.891Z] 	at org.eclipse.ease.debugging.AbstractEaseDebugger.handleEventsInSuspendedState(AbstractEaseDebugger.java:331)
17:43:19 [2021-07-24T21:43:19.891Z] 	at org.eclipse.ease.debugging.AbstractEaseDebugger.suspend(AbstractEaseDebugger.java:257)
17:43:19 [2021-07-24T21:43:19.891Z] 	at org.eclipse.ease.debugging.AbstractEaseDebugger.processLine(AbstractEaseDebugger.java:492)
17:43:19 [2021-07-24T21:43:19.891Z] 	at org.eclipse.ease.lang.python.debugger.PythonDebugger.traceDispatch(PythonDebugger.java:179)
17:43:19 [2021-07-24T21:43:19.891Z] 	at org.eclipse.ease.lang.python.jython.debugger.JythonDebugger.traceDispatch(JythonDebugger.java:46)
17:43:19 [2021-07-24T21:43:19.891Z] 	at jdk.internal.reflect.GeneratedMethodAccessor25.invoke(Unknown Source)
17:43:19 [2021-07-24T21:43:19.891Z] 	at java.base/jdk.internal.reflect.DelegatingMethodAccessorImpl.invoke(DelegatingMethodAccessorImpl.java:43)
17:43:19 [2021-07-24T21:43:19.891Z] 	at java.base/java.lang.reflect.Method.invoke(Method.java:564)
17:43:19 [2021-07-24T21:43:19.891Z] 
17:43:19 [2021-07-24T21:43:19.891Z] org.eclipse.ease.ScriptEngineCancellationException: org.eclipse.ease.ScriptEngineCancellationException: Terminated on user request
17:43:20 [2021-07-24T21:43:20.149Z] Traceback (most recent call last):
17:43:20 [2021-07-24T21:43:20.149Z]   File "(none)", line 184, in run
17:43:20 [2021-07-24T21:43:20.149Z]   File "__ref_L/Debug Test/Main.py_oosknnbbbr", line 1, in <module>
17:43:20 [2021-07-24T21:43:20.149Z]   File "(none)", line 161, in trace_dispatch
17:43:20 [2021-07-24T21:43:20.149Z] 	at org.eclipse.ease.debugging.AbstractEaseDebugger.handleEventsInSuspendedState(AbstractEaseDebugger.java:331)
17:43:20 [2021-07-24T21:43:20.149Z] 	at org.eclipse.ease.debugging.AbstractEaseDebugger.suspend(AbstractEaseDebugger.java:257)
17:43:20 [2021-07-24T21:43:20.150Z] 	at org.eclipse.ease.debugging.AbstractEaseDebugger.processLine(AbstractEaseDebugger.java:492)
17:43:20 [2021-07-24T21:43:20.150Z] 	at org.eclipse.ease.lang.python.debugger.PythonDebugger.traceDispatch(PythonDebugger.java:179)
17:43:20 [2021-07-24T21:43:20.150Z] 	at org.eclipse.ease.lang.python.jython.debugger.JythonDebugger.traceDispatch(JythonDebugger.java:46)
17:43:20 [2021-07-24T21:43:20.150Z] 	at jdk.internal.reflect.GeneratedMethodAccessor25.invoke(Unknown Source)
17:43:20 [2021-07-24T21:43:20.150Z] 	at java.base/jdk.internal.reflect.DelegatingMethodAccessorImpl.invoke(DelegatingMethodAccessorImpl.java:43)
17:43:20 [2021-07-24T21:43:20.150Z] 	at java.base/java.lang.reflect.Method.invoke(Method.java:564)
17:43:20 [2021-07-24T21:43:20.150Z] 
17:43:20 [2021-07-24T21:43:20.150Z] org.eclipse.ease.ScriptEngineCancellationException: org.eclipse.ease.ScriptEngineCancellationException: Terminated on user request
17:43:20 [2021-07-24T21:43:20.408Z] Start of script
17:43:20 [2021-07-24T21:43:20.408Z] include file start
17:43:20 [2021-07-24T21:43:20.408Z] include file processed
17:43:20 [2021-07-24T21:43:20.408Z] Result of testMethod = 5
17:43:20 [2021-07-24T21:43:20.408Z] End of script
17:43:20 [2021-07-24T21:43:20.408Z] Start of script
17:43:20 [2021-07-24T21:43:20.408Z] include file start
17:43:20 [2021-07-24T21:43:20.408Z] include file processed
17:43:20 [2021-07-24T21:43:20.666Z] Result of testMethod = 5
17:43:20 [2021-07-24T21:43:20.666Z] End of script
17:43:20 [2021-07-24T21:43:20.666Z] Start of script
17:43:20 [2021-07-24T21:43:20.925Z] include file start
17:43:20 [2021-07-24T21:43:20.925Z] include file processed
17:43:20 [2021-07-24T21:43:20.925Z] Result of testMethod = 5
17:43:20 [2021-07-24T21:43:20.925Z] End of script
17:43:21 [2021-07-24T21:43:21.183Z] Tests run: 42, Failures: 0, Errors: 0, Skipped: 0, Time elapsed: 15.089 s - in org.eclipse.ease.lang.python.jython.debugger.JythonDebugTest
17:43:21 [2021-07-24T21:43:21.183Z] disconnectProcessInSuspendedState  Time elapsed: 3.998 s
17:43:21 [2021-07-24T21:43:21.183Z] stepReturnIncludeCommand  Time elapsed: 0.212 s
17:43:21 [2021-07-24T21:43:21.183Z] arrayVariableSorting  Time elapsed: 0.31 s
17:43:21 [2021-07-24T21:43:21.183Z] stepOverOnDebugTarget  Time elapsed: 0.308 s
17:43:21 [2021-07-24T21:43:21.183Z] hasDebugTarget  Time elapsed: 0.105 s
17:43:21 [2021-07-24T21:43:21.183Z] disconnectThreadInSuspendedState  Time elapsed: 0.211 s
17:43:21 [2021-07-24T21:43:21.183Z] stepReturnOnDebugTarget  Time elapsed: 0.31 s
17:43:21 [2021-07-24T21:43:21.183Z] nullVariable  Time elapsed: 0.308 s
17:43:21 [2021-07-24T21:43:21.183Z] stepOverOnStackFrame  Time elapsed: 0.307 s
17:43:21 [2021-07-24T21:43:21.183Z] resumeOnDebugTarget  Time elapsed: 0.207 s
17:43:21 [2021-07-24T21:43:21.183Z] modifyVariableKeepingType  Time elapsed: 0.508 s
17:43:21 [2021-07-24T21:43:21.183Z] resumeOnLastIncludeLine  Time elapsed: 0.207 s
17:43:21 [2021-07-24T21:43:21.183Z] stepReturnOnStackFrame  Time elapsed: 0.306 s
17:43:21 [2021-07-24T21:43:21.183Z] terminateStackFrameInSuspendedState  Time elapsed: 0.205 s
17:43:21 [2021-07-24T21:43:21.183Z] breakpointLocation  Time elapsed: 0.206 s
17:43:21 [2021-07-24T21:43:21.183Z] stepReturnOnThread  Time elapsed: 0.308 s
17:43:21 [2021-07-24T21:43:21.183Z] javaClassVariable  Time elapsed: 0.309 s
17:43:21 [2021-07-24T21:43:21.183Z] stepIntoOnThread  Time elapsed: 0.307 s
17:43:21 [2021-07-24T21:43:21.183Z] terminateThreadInSuspendedState  Time elapsed: 0.208 s
17:43:21 [2021-07-24T21:43:21.183Z] resumeOnThread  Time elapsed: 0.209 s
17:43:21 [2021-07-24T21:43:21.183Z] stepIntoOnStackFrame  Time elapsed: 0.31 s
17:43:21 [2021-07-24T21:43:21.183Z] terminateProcessInSuspendedState  Time elapsed: 0.207 s
17:43:21 [2021-07-24T21:43:21.183Z] stepOverOnProcess  Time elapsed: 0.305 s
17:43:21 [2021-07-24T21:43:21.183Z] nativeArrayVariable  Time elapsed: 0.305 s
17:43:21 [2021-07-24T21:43:21.183Z] disconnectDebugTargetInSuspendedState  Time elapsed: 0.205 s
17:43:21 [2021-07-24T21:43:21.183Z] stepIntoOnProcess  Time elapsed: 0.305 s
17:43:21 [2021-07-24T21:43:21.183Z] terminatedState  Time elapsed: 0.103 s
17:43:21 [2021-07-24T21:43:21.183Z] stepOverIncludeCommand  Time elapsed: 0.304 s
17:43:21 [2021-07-24T21:43:21.183Z] innerScopeVariableBeforeOuterScopeVariable  Time elapsed: 0.304 s
17:43:21 [2021-07-24T21:43:21.183Z] stepIntoIncludeCommand  Time elapsed: 0.305 s
17:43:21 [2021-07-24T21:43:21.183Z] primitiveStringVariable  Time elapsed: 0.305 s
17:43:21 [2021-07-24T21:43:21.183Z] resumeOnProcess  Time elapsed: 0.322 s
17:43:21 [2021-07-24T21:43:21.183Z] stepIntoOnDebugTarget  Time elapsed: 0.307 s
17:43:21 [2021-07-24T21:43:21.184Z] stepOverOnThread  Time elapsed: 0.307 s
17:43:21 [2021-07-24T21:43:21.184Z] suspendedState  Time elapsed: 0.206 s
17:43:21 [2021-07-24T21:43:21.184Z] primitiveDoubleVariable  Time elapsed: 0.321 s
17:43:21 [2021-07-24T21:43:21.184Z] resumeOnStackFrame  Time elapsed: 0.205 s
17:43:21 [2021-07-24T21:43:21.184Z] nativeObjectVariable  Time elapsed: 0.305 s
17:43:21 [2021-07-24T21:43:21.184Z] terminateDebugTargetInSuspendedState  Time elapsed: 0.205 s
17:43:21 [2021-07-24T21:43:21.184Z] disconnectStackFrameInSuspendedState  Time elapsed: 0.205 s
17:43:21 [2021-07-24T21:43:21.184Z] stepReturnOnProcess  Time elapsed: 0.305 s
17:43:21 [2021-07-24T21:43:21.184Z] evaluateWatchExpression  Time elapsed: 0.369 s
17:43:21 [2021-07-24T21:43:21.184Z] 
17:43:21 [2021-07-24T21:43:21.184Z] Results:
17:43:21 [2021-07-24T21:43:21.184Z] 
17:43:21 [2021-07-24T21:43:21.184Z] Tests run: 42, Failures: 0, Errors: 0, Skipped: 0
17:43:21 [2021-07-24T21:43:21.184Z] 
17:43:21 [2021-07-24T21:43:21.450Z] [INFO] All tests passed!
17:43:21 [2021-07-24T21:43:21.450Z] [INFO] 
17:43:21 [2021-07-24T21:43:21.450Z] [INFO] --- maven-pmd-plugin:3.14.0:pmd (pmd-integration) @ org.eclipse.ease.lang.python.jython.test ---
17:43:21 [2021-07-24T21:43:21.450Z] [WARNING] Unable to exclude rules [JUnit5TestShouldBePackagePrivate] from ruleset reference category/java/bestpractices.xml; perhaps the rule name is misspelled or the rule doesn't exist anymore?
17:43:21 [2021-07-24T21:43:21.450Z] [WARNING] Unable to exclude rules [JUnit5TestShouldBePackagePrivate] from ruleset reference category/java/bestpractices.xml; perhaps the rule name is misspelled or the rule doesn't exist anymore?
17:43:21 [2021-07-24T21:43:21.717Z] [INFO] 
17:43:21 [2021-07-24T21:43:21.717Z] [INFO] --- maven-pmd-plugin:3.14.0:cpd (pmd-integration) @ org.eclipse.ease.lang.python.jython.test ---
17:43:21 [2021-07-24T21:43:21.717Z] [INFO] 
17:43:21 [2021-07-24T21:43:21.717Z] [INFO] --- spotbugs-maven-plugin:4.1.4:spotbugs (spotbugs-integration) @ org.eclipse.ease.lang.python.jython.test ---
17:43:21 [2021-07-24T21:43:21.717Z] [INFO] Fork Value is false
17:43:21 [2021-07-24T21:43:21.717Z]      [java] JVM args ignored when same JVM is used.
17:43:25 [2021-07-24T21:43:25.123Z] [INFO] Done SpotBugs Analysis....
17:43:25 [2021-07-24T21:43:25.123Z] [INFO] 
17:43:25 [2021-07-24T21:43:25.123Z] [INFO] --- maven-checkstyle-plugin:3.1.1:check (checkstyle-integration) @ org.eclipse.ease.lang.python.jython.test ---
17:43:25 [2021-07-24T21:43:25.123Z] [INFO] You have 0 Checkstyle violations.
17:43:25 [2021-07-24T21:43:25.123Z] [INFO] 
17:43:25 [2021-07-24T21:43:25.123Z] [INFO] --- maven-install-plugin:2.3.1:install (default-install) @ org.eclipse.ease.lang.python.jython.test ---
17:43:25 [2021-07-24T21:43:25.123Z] [INFO] Installing /home/jenkins/agent/workspace/ease.verify.core.target.2019-03/tests/org.eclipse.ease.lang.python.jython.test/target/org.eclipse.ease.lang.python.jython.test-0.9.0-SNAPSHOT.jar to /home/jenkins/.m2/repository/org/eclipse/ease/org.eclipse.ease.lang.python.jython.test/0.9.0-SNAPSHOT/org.eclipse.ease.lang.python.jython.test-0.9.0-SNAPSHOT.jar
17:43:25 [2021-07-24T21:43:25.123Z] [INFO] Installing /home/jenkins/agent/workspace/ease.verify.core.target.2019-03/tests/org.eclipse.ease.lang.python.jython.test/pom.xml to /home/jenkins/.m2/repository/org/eclipse/ease/org.eclipse.ease.lang.python.jython.test/0.9.0-SNAPSHOT/org.eclipse.ease.lang.python.jython.test-0.9.0-SNAPSHOT.pom
17:43:25 [2021-07-24T21:43:25.124Z] [INFO] Installing /home/jenkins/agent/workspace/ease.verify.core.target.2019-03/tests/org.eclipse.ease.lang.python.jython.test/target/p2content.xml to /home/jenkins/.m2/repository/org/eclipse/ease/org.eclipse.ease.lang.python.jython.test/0.9.0-SNAPSHOT/org.eclipse.ease.lang.python.jython.test-0.9.0-SNAPSHOT-p2metadata.xml
17:43:25 [2021-07-24T21:43:25.124Z] [INFO] Installing /home/jenkins/agent/workspace/ease.verify.core.target.2019-03/tests/org.eclipse.ease.lang.python.jython.test/target/p2artifacts.xml to /home/jenkins/.m2/repository/org/eclipse/ease/org.eclipse.ease.lang.python.jython.test/0.9.0-SNAPSHOT/org.eclipse.ease.lang.python.jython.test-0.9.0-SNAPSHOT-p2artifacts.xml
17:43:25 [2021-07-24T21:43:25.124Z] [INFO] 
17:43:25 [2021-07-24T21:43:25.124Z] [INFO] --- tycho-p2-plugin:2.2.0:update-local-index (default-update-local-index) @ org.eclipse.ease.lang.python.jython.test ---
17:43:25 [2021-07-24T21:43:25.124Z] [INFO] 
17:43:25 [2021-07-24T21:43:25.124Z] [INFO] -----< org.eclipse.ease:org.eclipse.ease.lang.scriptarchive.test >------
17:43:25 [2021-07-24T21:43:25.124Z] [INFO] Building org.eclipse.ease.lang.scriptarchive.test 0.9.0-SNAPSHOT [43/49]
17:43:25 [2021-07-24T21:43:25.124Z] [INFO] ------------------------[ eclipse-test-plugin ]-------------------------
17:43:25 [2021-07-24T21:43:25.124Z] [INFO] 
17:43:25 [2021-07-24T21:43:25.124Z] [INFO] --- maven-clean-plugin:2.5:clean (default-clean) @ org.eclipse.ease.lang.scriptarchive.test ---
17:43:25 [2021-07-24T21:43:25.124Z] [INFO] 
17:43:25 [2021-07-24T21:43:25.124Z] [INFO] --- tycho-packaging-plugin:2.2.0:build-qualifier (default-build-qualifier) @ org.eclipse.ease.lang.scriptarchive.test ---
17:43:25 [2021-07-24T21:43:25.124Z] [INFO] The project's OSGi version is 0.9.0.I202106220815
17:43:25 [2021-07-24T21:43:25.124Z] [INFO] 
17:43:25 [2021-07-24T21:43:25.124Z] [INFO] --- tycho-packaging-plugin:2.2.0:validate-id (default-validate-id) @ org.eclipse.ease.lang.scriptarchive.test ---
17:43:25 [2021-07-24T21:43:25.124Z] [INFO] 
17:43:25 [2021-07-24T21:43:25.124Z] [INFO] --- tycho-packaging-plugin:2.2.0:validate-version (default-validate-version) @ org.eclipse.ease.lang.scriptarchive.test ---
17:43:25 [2021-07-24T21:43:25.124Z] [INFO] 
17:43:25 [2021-07-24T21:43:25.124Z] [INFO] --- maven-resources-plugin:2.4.3:resources (default-resources) @ org.eclipse.ease.lang.scriptarchive.test ---
17:43:25 [2021-07-24T21:43:25.124Z] [INFO] Using 'UTF-8' encoding to copy filtered resources.
17:43:25 [2021-07-24T21:43:25.124Z] [INFO] skip non existing resourceDirectory /home/jenkins/agent/workspace/ease.verify.core.target.2019-03/tests/org.eclipse.ease.lang.scriptarchive.test/src/main/resources
17:43:25 [2021-07-24T21:43:25.124Z] [INFO] 
17:43:25 [2021-07-24T21:43:25.125Z] [INFO] --- tycho-compiler-plugin:2.2.0:compile (default-compile) @ org.eclipse.ease.lang.scriptarchive.test ---
17:43:25 [2021-07-24T21:43:25.125Z] [INFO] Compiling 1 source file to /home/jenkins/agent/workspace/ease.verify.core.target.2019-03/tests/org.eclipse.ease.lang.scriptarchive.test/target/classes
17:43:25 [2021-07-24T21:43:25.125Z] [INFO] 
17:43:25 [2021-07-24T21:43:25.125Z] [INFO] --- maven-resources-plugin:2.4.3:testResources (default-testResources) @ org.eclipse.ease.lang.scriptarchive.test ---
17:43:25 [2021-07-24T21:43:25.125Z] [INFO] Using 'UTF-8' encoding to copy filtered resources.
17:43:25 [2021-07-24T21:43:25.125Z] [INFO] skip non existing resourceDirectory /home/jenkins/agent/workspace/ease.verify.core.target.2019-03/tests/org.eclipse.ease.lang.scriptarchive.test/src/test/resources
17:43:25 [2021-07-24T21:43:25.125Z] [INFO] 
17:43:25 [2021-07-24T21:43:25.125Z] [INFO] --- target-platform-configuration:2.2.0:target-platform (default-target-platform) @ org.eclipse.ease.lang.scriptarchive.test ---
17:43:25 [2021-07-24T21:43:25.125Z] [INFO] 
17:43:25 [2021-07-24T21:43:25.125Z] [INFO] --- tycho-packaging-plugin:2.2.0:package-plugin (default-package-plugin) @ org.eclipse.ease.lang.scriptarchive.test ---
17:43:25 [2021-07-24T21:43:25.125Z] [INFO] Building jar: /home/jenkins/agent/workspace/ease.verify.core.target.2019-03/tests/org.eclipse.ease.lang.scriptarchive.test/target/org.eclipse.ease.lang.scriptarchive.test-0.9.0-SNAPSHOT.jar
17:43:25 [2021-07-24T21:43:25.125Z] [INFO] 
17:43:25 [2021-07-24T21:43:25.125Z] [INFO] --- tycho-p2-plugin:2.2.0:p2-metadata-default (default-p2-metadata-default) @ org.eclipse.ease.lang.scriptarchive.test ---
17:43:25 [2021-07-24T21:43:25.125Z] [INFO] 
17:43:25 [2021-07-24T21:43:25.125Z] [INFO] --- jacoco-maven-plugin:0.8.6:prepare-agent (jacoco-initialize) @ org.eclipse.ease.lang.scriptarchive.test ---
17:43:25 [2021-07-24T21:43:25.125Z] [INFO] tycho.testArgLine set to -javaagent:/home/jenkins/.m2/repository/org/jacoco/org.jacoco.agent/0.8.6/org.jacoco.agent-0.8.6-runtime.jar=destfile=/home/jenkins/agent/workspace/ease.verify.core.target.2019-03/tests/org.eclipse.ease.lang.scriptarchive.test/target/jacoco.exec,output=file
17:43:25 [2021-07-24T21:43:25.125Z] [INFO] 
17:43:25 [2021-07-24T21:43:25.125Z] [INFO] --- tycho-surefire-plugin:2.2.0:test (default-test) @ org.eclipse.ease.lang.scriptarchive.test ---
17:43:25 [2021-07-24T21:43:25.125Z] [INFO] Executing Test Runtime with timeout 0, logs (if any) will be placed at: /home/jenkins/agent/workspace/ease.verify.core.target.2019-03/tests/org.eclipse.ease.lang.scriptarchive.test/target/work/data/.metadata/.log
17:43:25 [2021-07-24T21:43:25.125Z] [INFO] Command line:
17:43:25 [2021-07-24T21:43:25.126Z] 	[/opt/tools/java/openjdk/jdk-15/15.0.2+7/bin/java, -Dosgi.noShutdown=false, -Dosgi.os=linux, -Dosgi.ws=gtk, -Dosgi.arch=x86_64, -javaagent:/home/jenkins/.m2/repository/org/jacoco/org.jacoco.agent/0.8.6/org.jacoco.agent-0.8.6-runtime.jar=destfile=/home/jenkins/agent/workspace/ease.verify.core.target.2019-03/tests/org.eclipse.ease.lang.scriptarchive.test/target/jacoco.exec,output=file, -Dosgi.clean=true, -jar, /home/jenkins/.m2/repository/p2/osgi/bundle/org.eclipse.equinox.launcher/1.6.200.v20210416-2027/org.eclipse.equinox.launcher-1.6.200.v20210416-2027.jar, -data, /home/jenkins/agent/workspace/ease.verify.core.target.2019-03/tests/org.eclipse.ease.lang.scriptarchive.test/target/work/data, -install, /home/jenkins/agent/workspace/ease.verify.core.target.2019-03/tests/org.eclipse.ease.lang.scriptarchive.test/target/work, -configuration, /home/jenkins/agent/workspace/ease.verify.core.target.2019-03/tests/org.eclipse.ease.lang.scriptarchive.test/target/work/configuration, -application, org.eclipse.tycho.surefire.osgibooter.headlesstest, -testproperties, /home/jenkins/agent/workspace/ease.verify.core.target.2019-03/tests/org.eclipse.ease.lang.scriptarchive.test/target/surefire.properties]
17:43:25 [2021-07-24T21:43:25.126Z] Picked up JAVA_TOOL_OPTIONS: -Dmaven.ext.class.path="/home/jenkins/agent/workspace/ease.verify.core.target.2019-03@tmp/withMaven2d072e6e/pipeline-maven-spy.jar" -Dorg.jenkinsci.plugins.pipeline.maven.reportsFolder="/home/jenkins/agent/workspace/ease.verify.core.target.2019-03@tmp/withMaven2d072e6e" 
17:43:29 [2021-07-24T21:43:29.406Z] Running org.eclipse.ease.lang.scriptarchive.ArchiveEngineTest
17:43:29 [2021-07-24T21:43:29.665Z] We are running from a zip file!
17:43:29 [2021-07-24T21:43:29.665Z] org.eclipse.ease.ScriptExecutionException: SyntaxError: missing ; before statement (workspace://__EASE_ScriptArchive_1/scripts/Master.js#3)
17:43:29 [2021-07-24T21:43:29.665Z] this is an error
17:43:29 [2021-07-24T21:43:29.665Z]        ^
17:43:29 [2021-07-24T21:43:29.665Z] 	at Master.js,workspace://__EASE_ScriptArchive_1/scripts/Master.js
17:43:29 [2021-07-24T21:43:29.666Z] org.eclipse.ease.ScriptExecutionException: SyntaxError: missing ; before statement (workspace://__EASE_ScriptArchive_1/scripts/Master.js#3)
17:43:29 [2021-07-24T21:43:29.666Z] this is an error
17:43:29 [2021-07-24T21:43:29.666Z]        ^
17:43:29 [2021-07-24T21:43:29.666Z] 	at Master.js,workspace://__EASE_ScriptArchive_1/scripts/Master.js
17:43:29 [2021-07-24T21:43:29.924Z] Tests run: 7, Failures: 0, Errors: 0, Skipped: 0, Time elapsed: 1.007 s - in org.eclipse.ease.lang.scriptarchive.ArchiveEngineTest
17:43:29 [2021-07-24T21:43:29.924Z] executeWithManifest  Time elapsed: 0.796 s
17:43:29 [2021-07-24T21:43:29.924Z] zipFileRegistration  Time elapsed: 0.011 s
17:43:29 [2021-07-24T21:43:29.924Z] engineIdRegistration  Time elapsed: 0 s
17:43:29 [2021-07-24T21:43:29.924Z] jarFileRegistration  Time elapsed: 0 s
17:43:29 [2021-07-24T21:43:29.924Z] sarFileRegistration  Time elapsed: 0.022 s
17:43:29 [2021-07-24T21:43:29.924Z] executeWithErrors  Time elapsed: 0.067 s
17:43:29 [2021-07-24T21:43:29.924Z] executeWithIncludes  Time elapsed: 0.092 s
17:43:29 [2021-07-24T21:43:29.924Z] 
17:43:29 [2021-07-24T21:43:29.924Z] Results:
17:43:29 [2021-07-24T21:43:29.924Z] 
17:43:29 [2021-07-24T21:43:29.924Z] Tests run: 7, Failures: 0, Errors: 0, Skipped: 0
17:43:29 [2021-07-24T21:43:29.924Z] 
17:43:30 [2021-07-24T21:43:30.204Z] [INFO] All tests passed!
17:43:30 [2021-07-24T21:43:30.204Z] [INFO] 
17:43:30 [2021-07-24T21:43:30.204Z] [INFO] --- maven-pmd-plugin:3.14.0:pmd (pmd-integration) @ org.eclipse.ease.lang.scriptarchive.test ---
17:43:30 [2021-07-24T21:43:30.204Z] [WARNING] Unable to exclude rules [JUnit5TestShouldBePackagePrivate] from ruleset reference category/java/bestpractices.xml; perhaps the rule name is misspelled or the rule doesn't exist anymore?
17:43:30 [2021-07-24T21:43:30.204Z] [WARNING] Unable to exclude rules [JUnit5TestShouldBePackagePrivate] from ruleset reference category/java/bestpractices.xml; perhaps the rule name is misspelled or the rule doesn't exist anymore?
17:43:30 [2021-07-24T21:43:30.463Z] [INFO] 
17:43:30 [2021-07-24T21:43:30.463Z] [INFO] --- maven-pmd-plugin:3.14.0:cpd (pmd-integration) @ org.eclipse.ease.lang.scriptarchive.test ---
17:43:30 [2021-07-24T21:43:30.463Z] [INFO] 
17:43:30 [2021-07-24T21:43:30.463Z] [INFO] --- spotbugs-maven-plugin:4.1.4:spotbugs (spotbugs-integration) @ org.eclipse.ease.lang.scriptarchive.test ---
17:43:30 [2021-07-24T21:43:30.463Z] [INFO] Fork Value is false
17:43:30 [2021-07-24T21:43:30.463Z]      [java] JVM args ignored when same JVM is used.
17:43:33 [2021-07-24T21:43:33.813Z] [INFO] Done SpotBugs Analysis....
17:43:33 [2021-07-24T21:43:33.813Z] [INFO] 
17:43:33 [2021-07-24T21:43:33.813Z] [INFO] --- maven-checkstyle-plugin:3.1.1:check (checkstyle-integration) @ org.eclipse.ease.lang.scriptarchive.test ---
17:43:33 [2021-07-24T21:43:33.813Z] [INFO] You have 0 Checkstyle violations.
17:43:33 [2021-07-24T21:43:33.813Z] [INFO] 
17:43:33 [2021-07-24T21:43:33.813Z] [INFO] --- maven-install-plugin:2.3.1:install (default-install) @ org.eclipse.ease.lang.scriptarchive.test ---
17:43:33 [2021-07-24T21:43:33.813Z] [INFO] Installing /home/jenkins/agent/workspace/ease.verify.core.target.2019-03/tests/org.eclipse.ease.lang.scriptarchive.test/target/org.eclipse.ease.lang.scriptarchive.test-0.9.0-SNAPSHOT.jar to /home/jenkins/.m2/repository/org/eclipse/ease/org.eclipse.ease.lang.scriptarchive.test/0.9.0-SNAPSHOT/org.eclipse.ease.lang.scriptarchive.test-0.9.0-SNAPSHOT.jar
17:43:33 [2021-07-24T21:43:33.813Z] [INFO] Installing /home/jenkins/agent/workspace/ease.verify.core.target.2019-03/tests/org.eclipse.ease.lang.scriptarchive.test/pom.xml to /home/jenkins/.m2/repository/org/eclipse/ease/org.eclipse.ease.lang.scriptarchive.test/0.9.0-SNAPSHOT/org.eclipse.ease.lang.scriptarchive.test-0.9.0-SNAPSHOT.pom
17:43:33 [2021-07-24T21:43:33.813Z] [INFO] Installing /home/jenkins/agent/workspace/ease.verify.core.target.2019-03/tests/org.eclipse.ease.lang.scriptarchive.test/target/p2content.xml to /home/jenkins/.m2/repository/org/eclipse/ease/org.eclipse.ease.lang.scriptarchive.test/0.9.0-SNAPSHOT/org.eclipse.ease.lang.scriptarchive.test-0.9.0-SNAPSHOT-p2metadata.xml
17:43:33 [2021-07-24T21:43:33.813Z] [INFO] Installing /home/jenkins/agent/workspace/ease.verify.core.target.2019-03/tests/org.eclipse.ease.lang.scriptarchive.test/target/p2artifacts.xml to /home/jenkins/.m2/repository/org/eclipse/ease/org.eclipse.ease.lang.scriptarchive.test/0.9.0-SNAPSHOT/org.eclipse.ease.lang.scriptarchive.test-0.9.0-SNAPSHOT-p2artifacts.xml
17:43:33 [2021-07-24T21:43:33.813Z] [INFO] 
17:43:33 [2021-07-24T21:43:33.813Z] [INFO] --- tycho-p2-plugin:2.2.0:update-local-index (default-update-local-index) @ org.eclipse.ease.lang.scriptarchive.test ---
17:43:33 [2021-07-24T21:43:33.814Z] [INFO] 
17:43:33 [2021-07-24T21:43:33.814Z] [INFO] --------< org.eclipse.ease:org.eclipse.ease.lang.unittest.test >--------
17:43:33 [2021-07-24T21:43:33.814Z] [INFO] Building org.eclipse.ease.lang.unittest.test 0.9.0-SNAPSHOT      [44/49]
17:43:33 [2021-07-24T21:43:33.814Z] [INFO] ------------------------[ eclipse-test-plugin ]-------------------------
17:43:33 [2021-07-24T21:43:33.814Z] [INFO] 
17:43:33 [2021-07-24T21:43:33.814Z] [INFO] --- maven-clean-plugin:2.5:clean (default-clean) @ org.eclipse.ease.lang.unittest.test ---
17:43:33 [2021-07-24T21:43:33.814Z] [INFO] 
17:43:33 [2021-07-24T21:43:33.814Z] [INFO] --- tycho-packaging-plugin:2.2.0:build-qualifier (default-build-qualifier) @ org.eclipse.ease.lang.unittest.test ---
17:43:33 [2021-07-24T21:43:33.814Z] [INFO] The project's OSGi version is 0.9.0.I202106220815
17:43:33 [2021-07-24T21:43:33.814Z] [INFO] 
17:43:33 [2021-07-24T21:43:33.814Z] [INFO] --- tycho-packaging-plugin:2.2.0:validate-id (default-validate-id) @ org.eclipse.ease.lang.unittest.test ---
17:43:33 [2021-07-24T21:43:33.814Z] [INFO] 
17:43:33 [2021-07-24T21:43:33.814Z] [INFO] --- tycho-packaging-plugin:2.2.0:validate-version (default-validate-version) @ org.eclipse.ease.lang.unittest.test ---
17:43:33 [2021-07-24T21:43:33.814Z] [INFO] 
17:43:33 [2021-07-24T21:43:33.814Z] [INFO] --- maven-resources-plugin:2.4.3:resources (default-resources) @ org.eclipse.ease.lang.unittest.test ---
17:43:33 [2021-07-24T21:43:33.814Z] [INFO] Using 'UTF-8' encoding to copy filtered resources.
17:43:33 [2021-07-24T21:43:33.814Z] [INFO] skip non existing resourceDirectory /home/jenkins/agent/workspace/ease.verify.core.target.2019-03/tests/org.eclipse.ease.lang.unittest.test/src/main/resources
17:43:33 [2021-07-24T21:43:33.814Z] [INFO] 
17:43:33 [2021-07-24T21:43:33.814Z] [INFO] --- tycho-compiler-plugin:2.2.0:compile (default-compile) @ org.eclipse.ease.lang.unittest.test ---
17:43:33 [2021-07-24T21:43:33.814Z] [INFO] Compiling 3 source files to /home/jenkins/agent/workspace/ease.verify.core.target.2019-03/tests/org.eclipse.ease.lang.unittest.test/target/classes
17:43:34 [2021-07-24T21:43:34.072Z] [INFO] 
17:43:34 [2021-07-24T21:43:34.072Z] [INFO] --- maven-resources-plugin:2.4.3:testResources (default-testResources) @ org.eclipse.ease.lang.unittest.test ---
17:43:34 [2021-07-24T21:43:34.073Z] [INFO] Using 'UTF-8' encoding to copy filtered resources.
17:43:34 [2021-07-24T21:43:34.073Z] [INFO] skip non existing resourceDirectory /home/jenkins/agent/workspace/ease.verify.core.target.2019-03/tests/org.eclipse.ease.lang.unittest.test/src/test/resources
17:43:34 [2021-07-24T21:43:34.073Z] [INFO] 
17:43:34 [2021-07-24T21:43:34.073Z] [INFO] --- target-platform-configuration:2.2.0:target-platform (default-target-platform) @ org.eclipse.ease.lang.unittest.test ---
17:43:34 [2021-07-24T21:43:34.073Z] [INFO] 
17:43:34 [2021-07-24T21:43:34.073Z] [INFO] --- tycho-packaging-plugin:2.2.0:package-plugin (default-package-plugin) @ org.eclipse.ease.lang.unittest.test ---
17:43:34 [2021-07-24T21:43:34.073Z] [INFO] Building jar: /home/jenkins/agent/workspace/ease.verify.core.target.2019-03/tests/org.eclipse.ease.lang.unittest.test/target/org.eclipse.ease.lang.unittest.test-0.9.0-SNAPSHOT.jar
17:43:34 [2021-07-24T21:43:34.073Z] [INFO] 
17:43:34 [2021-07-24T21:43:34.073Z] [INFO] --- tycho-p2-plugin:2.2.0:p2-metadata-default (default-p2-metadata-default) @ org.eclipse.ease.lang.unittest.test ---
17:43:34 [2021-07-24T21:43:34.073Z] [INFO] 
17:43:34 [2021-07-24T21:43:34.073Z] [INFO] --- tycho-surefire-plugin:2.2.0:test (default-test) @ org.eclipse.ease.lang.unittest.test ---
17:43:34 [2021-07-24T21:43:34.073Z] [INFO] Executing Test Runtime with timeout 0, logs (if any) will be placed at: /home/jenkins/agent/workspace/ease.verify.core.target.2019-03/tests/org.eclipse.ease.lang.unittest.test/target/work/data/.metadata/.log
17:43:34 [2021-07-24T21:43:34.073Z] [INFO] Command line:
17:43:34 [2021-07-24T21:43:34.073Z] 	[/opt/tools/java/openjdk/jdk-15/15.0.2+7/bin/java, -Dosgi.noShutdown=false, -Dosgi.os=linux, -Dosgi.ws=gtk, -Dosgi.arch=x86_64, -Dosgi.clean=true, -jar, /home/jenkins/.m2/repository/p2/osgi/bundle/org.eclipse.equinox.launcher/1.6.200.v20210416-2027/org.eclipse.equinox.launcher-1.6.200.v20210416-2027.jar, -data, /home/jenkins/agent/workspace/ease.verify.core.target.2019-03/tests/org.eclipse.ease.lang.unittest.test/target/work/data, -install, /home/jenkins/agent/workspace/ease.verify.core.target.2019-03/tests/org.eclipse.ease.lang.unittest.test/target/work, -configuration, /home/jenkins/agent/workspace/ease.verify.core.target.2019-03/tests/org.eclipse.ease.lang.unittest.test/target/work/configuration, -application, org.eclipse.tycho.surefire.osgibooter.headlesstest, -testproperties, /home/jenkins/agent/workspace/ease.verify.core.target.2019-03/tests/org.eclipse.ease.lang.unittest.test/target/surefire.properties]
17:43:34 [2021-07-24T21:43:34.403Z] Picked up JAVA_TOOL_OPTIONS: -Dmaven.ext.class.path="/home/jenkins/agent/workspace/ease.verify.core.target.2019-03@tmp/withMaven2d072e6e/pipeline-maven-spy.jar" -Dorg.jenkinsci.plugins.pipeline.maven.reportsFolder="/home/jenkins/agent/workspace/ease.verify.core.target.2019-03@tmp/withMaven2d072e6e" 
17:43:36 [2021-07-24T21:43:36.383Z] Jul 24, 2021 9:43:36 PM org.junit.platform.launcher.core.DefaultLauncher handleThrowable
17:43:36 [2021-07-24T21:43:36.383Z] WARNING: TestEngine with ID 'junit-vintage' failed to discover tests
17:43:36 [2021-07-24T21:43:36.383Z] java.lang.NoClassDefFoundError: org/junit/runners/model/RunnerBuilder
17:43:36 [2021-07-24T21:43:36.383Z] 	at org.junit.vintage.engine.discovery.VintageDiscoverer.<init>(VintageDiscoverer.java:48)
17:43:36 [2021-07-24T21:43:36.383Z] 	at org.junit.vintage.engine.VintageTestEngine.discover(VintageTestEngine.java:65)
17:43:36 [2021-07-24T21:43:36.383Z] 	at org.junit.platform.launcher.core.DefaultLauncher.discoverEngineRoot(DefaultLauncher.java:130)
17:43:36 [2021-07-24T21:43:36.383Z] 	at org.junit.platform.launcher.core.DefaultLauncher.discoverRoot(DefaultLauncher.java:117)
17:43:36 [2021-07-24T21:43:36.383Z] 	at org.junit.platform.launcher.core.DefaultLauncher.discover(DefaultLauncher.java:82)
17:43:36 [2021-07-24T21:43:36.383Z] 	at org.apache.maven.surefire.junitplatform.TestPlanScannerFilter.accept(TestPlanScannerFilter.java:56)
17:43:36 [2021-07-24T21:43:36.383Z] 	at org.apache.maven.surefire.util.DefaultScanResult.applyFilter(DefaultScanResult.java:102)
17:43:36 [2021-07-24T21:43:36.383Z] 	at org.apache.maven.surefire.junitplatform.JUnitPlatformProvider.scanClasspath(JUnitPlatformProvider.java:143)
17:43:36 [2021-07-24T21:43:36.383Z] 	at org.apache.maven.surefire.junitplatform.JUnitPlatformProvider.invoke(JUnitPlatformProvider.java:124)
17:43:36 [2021-07-24T21:43:36.383Z] 	at java.base/jdk.internal.reflect.NativeMethodAccessorImpl.invoke0(Native Method)
17:43:36 [2021-07-24T21:43:36.383Z] 	at java.base/jdk.internal.reflect.NativeMethodAccessorImpl.invoke(NativeMethodAccessorImpl.java:64)
17:43:36 [2021-07-24T21:43:36.383Z] 	at java.base/jdk.internal.reflect.DelegatingMethodAccessorImpl.invoke(DelegatingMethodAccessorImpl.java:43)
17:43:36 [2021-07-24T21:43:36.383Z] 	at java.base/java.lang.reflect.Method.invoke(Method.java:564)
17:43:36 [2021-07-24T21:43:36.383Z] 	at org.apache.maven.surefire.util.ReflectionUtils.invokeMethodWithArray2(ReflectionUtils.java:206)
17:43:36 [2021-07-24T21:43:36.383Z] 	at org.apache.maven.surefire.booter.ProviderFactory$ProviderProxy.invoke(ProviderFactory.java:161)
17:43:36 [2021-07-24T21:43:36.383Z] 	at org.apache.maven.surefire.booter.ProviderFactory.invokeProvider(ProviderFactory.java:84)
17:43:36 [2021-07-24T21:43:36.383Z] 	at org.eclipse.tycho.surefire.osgibooter.OsgiSurefireBooter.run(OsgiSurefireBooter.java:116)
17:43:36 [2021-07-24T21:43:36.383Z] 	at org.eclipse.tycho.surefire.osgibooter.HeadlessTestApplication.start(HeadlessTestApplication.java:23)
17:43:36 [2021-07-24T21:43:36.383Z] 	at org.eclipse.equinox.internal.app.EclipseAppHandle.run(EclipseAppHandle.java:203)
17:43:36 [2021-07-24T21:43:36.383Z] 	at org.eclipse.core.runtime.internal.adaptor.EclipseAppLauncher.runApplication(EclipseAppLauncher.java:134)
17:43:36 [2021-07-24T21:43:36.383Z] 	at org.eclipse.core.runtime.internal.adaptor.EclipseAppLauncher.start(EclipseAppLauncher.java:104)
17:43:36 [2021-07-24T21:43:36.383Z] 	at org.eclipse.core.runtime.adaptor.EclipseStarter.run(EclipseStarter.java:401)
17:43:36 [2021-07-24T21:43:36.383Z] 	at org.eclipse.core.runtime.adaptor.EclipseStarter.run(EclipseStarter.java:255)
17:43:36 [2021-07-24T21:43:36.383Z] 	at java.base/jdk.internal.reflect.NativeMethodAccessorImpl.invoke0(Native Method)
17:43:36 [2021-07-24T21:43:36.383Z] 	at java.base/jdk.internal.reflect.NativeMethodAccessorImpl.invoke(NativeMethodAccessorImpl.java:64)
17:43:36 [2021-07-24T21:43:36.383Z] 	at java.base/jdk.internal.reflect.DelegatingMethodAccessorImpl.invoke(DelegatingMethodAccessorImpl.java:43)
17:43:36 [2021-07-24T21:43:36.383Z] 	at java.base/java.lang.reflect.Method.invoke(Method.java:564)
17:43:36 [2021-07-24T21:43:36.383Z] 	at org.eclipse.equinox.launcher.Main.invokeFramework(Main.java:654)
17:43:36 [2021-07-24T21:43:36.383Z] 	at org.eclipse.equinox.launcher.Main.basicRun(Main.java:591)
17:43:36 [2021-07-24T21:43:36.383Z] 	at org.eclipse.equinox.launcher.Main.run(Main.java:1462)
17:43:36 [2021-07-24T21:43:36.383Z] 	at org.eclipse.equinox.launcher.Main.main(Main.java:1435)
17:43:36 [2021-07-24T21:43:36.384Z] Caused by: java.lang.ClassNotFoundException: org.junit.runners.model.RunnerBuilder cannot be found by org.eclipse.tycho.surefire.osgibooter_2.2.0
17:43:36 [2021-07-24T21:43:36.384Z] 	at org.eclipse.osgi.internal.loader.BundleLoader.findClass(BundleLoader.java:519)
17:43:36 [2021-07-24T21:43:36.384Z] 	at org.eclipse.osgi.internal.loader.ModuleClassLoader.loadClass(ModuleClassLoader.java:170)
17:43:36 [2021-07-24T21:43:36.384Z] 	at java.base/java.lang.ClassLoader.loadClass(ClassLoader.java:522)
17:43:36 [2021-07-24T21:43:36.384Z] 	... 31 more
17:43:36 [2021-07-24T21:43:36.384Z] 
17:43:36 [2021-07-24T21:43:36.642Z] Jul 24, 2021 9:43:36 PM org.junit.platform.launcher.core.DefaultLauncher handleThrowable
17:43:36 [2021-07-24T21:43:36.642Z] WARNING: TestEngine with ID 'junit-vintage' failed to discover tests
17:43:36 [2021-07-24T21:43:36.642Z] java.lang.NoClassDefFoundError: org/junit/runners/model/RunnerBuilder
17:43:36 [2021-07-24T21:43:36.642Z] 	at org.junit.vintage.engine.discovery.VintageDiscoverer.<init>(VintageDiscoverer.java:48)
17:43:36 [2021-07-24T21:43:36.643Z] 	at org.junit.vintage.engine.VintageTestEngine.discover(VintageTestEngine.java:65)
17:43:36 [2021-07-24T21:43:36.643Z] 	at org.junit.platform.launcher.core.DefaultLauncher.discoverEngineRoot(DefaultLauncher.java:130)
17:43:36 [2021-07-24T21:43:36.643Z] 	at org.junit.platform.launcher.core.DefaultLauncher.discoverRoot(DefaultLauncher.java:117)
17:43:36 [2021-07-24T21:43:36.643Z] 	at org.junit.platform.launcher.core.DefaultLauncher.discover(DefaultLauncher.java:82)
17:43:36 [2021-07-24T21:43:36.643Z] 	at org.apache.maven.surefire.junitplatform.TestPlanScannerFilter.accept(TestPlanScannerFilter.java:56)
17:43:36 [2021-07-24T21:43:36.643Z] 	at org.apache.maven.surefire.util.DefaultScanResult.applyFilter(DefaultScanResult.java:102)
17:43:36 [2021-07-24T21:43:36.643Z] 	at org.apache.maven.surefire.junitplatform.JUnitPlatformProvider.scanClasspath(JUnitPlatformProvider.java:143)
17:43:36 [2021-07-24T21:43:36.643Z] 	at org.apache.maven.surefire.junitplatform.JUnitPlatformProvider.invoke(JUnitPlatformProvider.java:124)
17:43:36 [2021-07-24T21:43:36.643Z] 	at java.base/jdk.internal.reflect.NativeMethodAccessorImpl.invoke0(Native Method)
17:43:36 [2021-07-24T21:43:36.643Z] 	at java.base/jdk.internal.reflect.NativeMethodAccessorImpl.invoke(NativeMethodAccessorImpl.java:64)
17:43:36 [2021-07-24T21:43:36.643Z] 	at java.base/jdk.internal.reflect.DelegatingMethodAccessorImpl.invoke(DelegatingMethodAccessorImpl.java:43)
17:43:36 [2021-07-24T21:43:36.643Z] 	at java.base/java.lang.reflect.Method.invoke(Method.java:564)
17:43:36 [2021-07-24T21:43:36.643Z] 	at org.apache.maven.surefire.util.ReflectionUtils.invokeMethodWithArray2(ReflectionUtils.java:206)
17:43:36 [2021-07-24T21:43:36.643Z] 	at org.apache.maven.surefire.booter.ProviderFactory$ProviderProxy.invoke(ProviderFactory.java:161)
17:43:36 [2021-07-24T21:43:36.643Z] 	at org.apache.maven.surefire.booter.ProviderFactory.invokeProvider(ProviderFactory.java:84)
17:43:36 [2021-07-24T21:43:36.643Z] 	at org.eclipse.tycho.surefire.osgibooter.OsgiSurefireBooter.run(OsgiSurefireBooter.java:116)
17:43:36 [2021-07-24T21:43:36.643Z] 	at org.eclipse.tycho.surefire.osgibooter.HeadlessTestApplication.start(HeadlessTestApplication.java:23)
17:43:36 [2021-07-24T21:43:36.643Z] 	at org.eclipse.equinox.internal.app.EclipseAppHandle.run(EclipseAppHandle.java:203)
17:43:36 [2021-07-24T21:43:36.643Z] 	at org.eclipse.core.runtime.internal.adaptor.EclipseAppLauncher.runApplication(EclipseAppLauncher.java:134)
17:43:36 [2021-07-24T21:43:36.643Z] 	at org.eclipse.core.runtime.internal.adaptor.EclipseAppLauncher.start(EclipseAppLauncher.java:104)
17:43:36 [2021-07-24T21:43:36.643Z] 	at org.eclipse.core.runtime.adaptor.EclipseStarter.run(EclipseStarter.java:401)
17:43:36 [2021-07-24T21:43:36.643Z] 	at org.eclipse.core.runtime.adaptor.EclipseStarter.run(EclipseStarter.java:255)
17:43:36 [2021-07-24T21:43:36.643Z] 	at java.base/jdk.internal.reflect.NativeMethodAccessorImpl.invoke0(Native Method)
17:43:36 [2021-07-24T21:43:36.643Z] 	at java.base/jdk.internal.reflect.NativeMethodAccessorImpl.invoke(NativeMethodAccessorImpl.java:64)
17:43:36 [2021-07-24T21:43:36.643Z] 	at java.base/jdk.internal.reflect.DelegatingMethodAccessorImpl.invoke(DelegatingMethodAccessorImpl.java:43)
17:43:36 [2021-07-24T21:43:36.643Z] 	at java.base/java.lang.reflect.Method.invoke(Method.java:564)
17:43:36 [2021-07-24T21:43:36.643Z] 	at org.eclipse.equinox.launcher.Main.invokeFramework(Main.java:654)
17:43:36 [2021-07-24T21:43:36.643Z] 	at org.eclipse.equinox.launcher.Main.basicRun(Main.java:591)
17:43:36 [2021-07-24T21:43:36.643Z] 	at org.eclipse.equinox.launcher.Main.run(Main.java:1462)
17:43:36 [2021-07-24T21:43:36.643Z] 	at org.eclipse.equinox.launcher.Main.main(Main.java:1435)
17:43:36 [2021-07-24T21:43:36.643Z] Caused by: java.lang.ClassNotFoundException: org.junit.runners.model.RunnerBuilder cannot be found by org.eclipse.tycho.surefire.osgibooter_2.2.0
17:43:36 [2021-07-24T21:43:36.643Z] 	at org.eclipse.osgi.internal.loader.BundleLoader.findClass(BundleLoader.java:519)
17:43:36 [2021-07-24T21:43:36.643Z] 	at org.eclipse.osgi.internal.loader.ModuleClassLoader.loadClass(ModuleClassLoader.java:170)
17:43:36 [2021-07-24T21:43:36.643Z] 	at java.base/java.lang.ClassLoader.loadClass(ClassLoader.java:522)
17:43:36 [2021-07-24T21:43:36.643Z] 	... 31 more
17:43:36 [2021-07-24T21:43:36.643Z] 
17:43:36 [2021-07-24T21:43:36.643Z] Jul 24, 2021 9:43:36 PM org.junit.platform.launcher.core.DefaultLauncher handleThrowable
17:43:36 [2021-07-24T21:43:36.644Z] WARNING: TestEngine with ID 'junit-vintage' failed to discover tests
17:43:36 [2021-07-24T21:43:36.644Z] java.lang.NoClassDefFoundError: org/junit/runners/model/RunnerBuilder
17:43:36 [2021-07-24T21:43:36.644Z] 	at org.junit.vintage.engine.discovery.VintageDiscoverer.<init>(VintageDiscoverer.java:48)
17:43:36 [2021-07-24T21:43:36.644Z] 	at org.junit.vintage.engine.VintageTestEngine.discover(VintageTestEngine.java:65)
17:43:36 [2021-07-24T21:43:36.644Z] 	at org.junit.platform.launcher.core.DefaultLauncher.discoverEngineRoot(DefaultLauncher.java:130)
17:43:36 [2021-07-24T21:43:36.644Z] 	at org.junit.platform.launcher.core.DefaultLauncher.discoverRoot(DefaultLauncher.java:117)
17:43:36 [2021-07-24T21:43:36.644Z] 	at org.junit.platform.launcher.core.DefaultLauncher.discover(DefaultLauncher.java:82)
17:43:36 [2021-07-24T21:43:36.644Z] 	at org.apache.maven.surefire.junitplatform.TestPlanScannerFilter.accept(TestPlanScannerFilter.java:56)
17:43:36 [2021-07-24T21:43:36.644Z] 	at org.apache.maven.surefire.util.DefaultScanResult.applyFilter(DefaultScanResult.java:102)
17:43:36 [2021-07-24T21:43:36.644Z] 	at org.apache.maven.surefire.junitplatform.JUnitPlatformProvider.scanClasspath(JUnitPlatformProvider.java:143)
17:43:36 [2021-07-24T21:43:36.644Z] 	at org.apache.maven.surefire.junitplatform.JUnitPlatformProvider.invoke(JUnitPlatformProvider.java:124)
17:43:36 [2021-07-24T21:43:36.644Z] 	at java.base/jdk.internal.reflect.NativeMethodAccessorImpl.invoke0(Native Method)
17:43:36 [2021-07-24T21:43:36.644Z] 	at java.base/jdk.internal.reflect.NativeMethodAccessorImpl.invoke(NativeMethodAccessorImpl.java:64)
17:43:36 [2021-07-24T21:43:36.644Z] 	at java.base/jdk.internal.reflect.DelegatingMethodAccessorImpl.invoke(DelegatingMethodAccessorImpl.java:43)
17:43:36 [2021-07-24T21:43:36.644Z] 	at java.base/java.lang.reflect.Method.invoke(Method.java:564)
17:43:36 [2021-07-24T21:43:36.644Z] 	at org.apache.maven.surefire.util.ReflectionUtils.invokeMethodWithArray2(ReflectionUtils.java:206)
17:43:36 [2021-07-24T21:43:36.644Z] 	at org.apache.maven.surefire.booter.ProviderFactory$ProviderProxy.invoke(ProviderFactory.java:161)
17:43:36 [2021-07-24T21:43:36.644Z] 	at org.apache.maven.surefire.booter.ProviderFactory.invokeProvider(ProviderFactory.java:84)
17:43:36 [2021-07-24T21:43:36.644Z] 	at org.eclipse.tycho.surefire.osgibooter.OsgiSurefireBooter.run(OsgiSurefireBooter.java:116)
17:43:36 [2021-07-24T21:43:36.644Z] 	at org.eclipse.tycho.surefire.osgibooter.HeadlessTestApplication.start(HeadlessTestApplication.java:23)
17:43:36 [2021-07-24T21:43:36.644Z] 	at org.eclipse.equinox.internal.app.EclipseAppHandle.run(EclipseAppHandle.java:203)
17:43:36 [2021-07-24T21:43:36.644Z] 	at org.eclipse.core.runtime.internal.adaptor.EclipseAppLauncher.runApplication(EclipseAppLauncher.java:134)
17:43:36 [2021-07-24T21:43:36.644Z] 	at org.eclipse.core.runtime.internal.adaptor.EclipseAppLauncher.start(EclipseAppLauncher.java:104)
17:43:36 [2021-07-24T21:43:36.644Z] 	at org.eclipse.core.runtime.adaptor.EclipseStarter.run(EclipseStarter.java:401)
17:43:36 [2021-07-24T21:43:36.644Z] 	at org.eclipse.core.runtime.adaptor.EclipseStarter.run(EclipseStarter.java:255)
17:43:36 [2021-07-24T21:43:36.644Z] 	at java.base/jdk.internal.reflect.NativeMethodAccessorImpl.invoke0(Native Method)
17:43:36 [2021-07-24T21:43:36.644Z] 	at java.base/jdk.internal.reflect.NativeMethodAccessorImpl.invoke(NativeMethodAccessorImpl.java:64)
17:43:36 [2021-07-24T21:43:36.644Z] 	at java.base/jdk.internal.reflect.DelegatingMethodAccessorImpl.invoke(DelegatingMethodAccessorImpl.java:43)
17:43:36 [2021-07-24T21:43:36.644Z] 	at java.base/java.lang.reflect.Method.invoke(Method.java:564)
17:43:36 [2021-07-24T21:43:36.644Z] 	at org.eclipse.equinox.launcher.Main.invokeFramework(Main.java:654)
17:43:36 [2021-07-24T21:43:36.644Z] 	at org.eclipse.equinox.launcher.Main.basicRun(Main.java:591)
17:43:36 [2021-07-24T21:43:36.644Z] 	at org.eclipse.equinox.launcher.Main.run(Main.java:1462)
17:43:36 [2021-07-24T21:43:36.644Z] 	at org.eclipse.equinox.launcher.Main.main(Main.java:1435)
17:43:36 [2021-07-24T21:43:36.644Z] Caused by: java.lang.ClassNotFoundException: org.junit.runners.model.RunnerBuilder cannot be found by org.eclipse.tycho.surefire.osgibooter_2.2.0
17:43:36 [2021-07-24T21:43:36.644Z] 	at org.eclipse.osgi.internal.loader.BundleLoader.findClass(BundleLoader.java:519)
17:43:36 [2021-07-24T21:43:36.644Z] 	at org.eclipse.osgi.internal.loader.ModuleClassLoader.loadClass(ModuleClassLoader.java:170)
17:43:36 [2021-07-24T21:43:36.644Z] 	at java.base/java.lang.ClassLoader.loadClass(ClassLoader.java:522)
17:43:36 [2021-07-24T21:43:36.645Z] 	... 31 more
17:43:36 [2021-07-24T21:43:36.645Z] 
17:43:36 [2021-07-24T21:43:36.645Z] Jul 24, 2021 9:43:36 PM org.junit.platform.launcher.core.DefaultLauncher handleThrowable
17:43:36 [2021-07-24T21:43:36.645Z] WARNING: TestEngine with ID 'junit-vintage' failed to discover tests
17:43:36 [2021-07-24T21:43:36.645Z] java.lang.NoClassDefFoundError: org/junit/runners/model/RunnerBuilder
17:43:36 [2021-07-24T21:43:36.645Z] 	at org.junit.vintage.engine.discovery.VintageDiscoverer.<init>(VintageDiscoverer.java:48)
17:43:36 [2021-07-24T21:43:36.645Z] 	at org.junit.vintage.engine.VintageTestEngine.discover(VintageTestEngine.java:65)
17:43:36 [2021-07-24T21:43:36.645Z] 	at org.junit.platform.launcher.core.DefaultLauncher.discoverEngineRoot(DefaultLauncher.java:130)
17:43:36 [2021-07-24T21:43:36.645Z] 	at org.junit.platform.launcher.core.DefaultLauncher.discoverRoot(DefaultLauncher.java:117)
17:43:36 [2021-07-24T21:43:36.645Z] 	at org.junit.platform.launcher.core.DefaultLauncher.execute(DefaultLauncher.java:90)
17:43:36 [2021-07-24T21:43:36.645Z] 	at org.apache.maven.surefire.junitplatform.JUnitPlatformProvider.invokeAllTests(JUnitPlatformProvider.java:150)
17:43:36 [2021-07-24T21:43:36.645Z] 	at org.apache.maven.surefire.junitplatform.JUnitPlatformProvider.invoke(JUnitPlatformProvider.java:124)
17:43:36 [2021-07-24T21:43:36.645Z] 	at java.base/jdk.internal.reflect.NativeMethodAccessorImpl.invoke0(Native Method)
17:43:36 [2021-07-24T21:43:36.645Z] 	at java.base/jdk.internal.reflect.NativeMethodAccessorImpl.invoke(NativeMethodAccessorImpl.java:64)
17:43:36 [2021-07-24T21:43:36.645Z] 	at java.base/jdk.internal.reflect.DelegatingMethodAccessorImpl.invoke(DelegatingMethodAccessorImpl.java:43)
17:43:36 [2021-07-24T21:43:36.645Z] 	at java.base/java.lang.reflect.Method.invoke(Method.java:564)
17:43:36 [2021-07-24T21:43:36.645Z] 	at org.apache.maven.surefire.util.ReflectionUtils.invokeMethodWithArray2(ReflectionUtils.java:206)
17:43:36 [2021-07-24T21:43:36.645Z] 	at org.apache.maven.surefire.booter.ProviderFactory$ProviderProxy.invoke(ProviderFactory.java:161)
17:43:36 [2021-07-24T21:43:36.645Z] 	at org.apache.maven.surefire.booter.ProviderFactory.invokeProvider(ProviderFactory.java:84)
17:43:36 [2021-07-24T21:43:36.645Z] 	at org.eclipse.tycho.surefire.osgibooter.OsgiSurefireBooter.run(OsgiSurefireBooter.java:116)
17:43:36 [2021-07-24T21:43:36.645Z] 	at org.eclipse.tycho.surefire.osgibooter.HeadlessTestApplication.start(HeadlessTestApplication.java:23)
17:43:36 [2021-07-24T21:43:36.645Z] 	at org.eclipse.equinox.internal.app.EclipseAppHandle.run(EclipseAppHandle.java:203)
17:43:36 [2021-07-24T21:43:36.645Z] 	at org.eclipse.core.runtime.internal.adaptor.EclipseAppLauncher.runApplication(EclipseAppLauncher.java:134)
17:43:36 [2021-07-24T21:43:36.645Z] 	at org.eclipse.core.runtime.internal.adaptor.EclipseAppLauncher.start(EclipseAppLauncher.java:104)
17:43:36 [2021-07-24T21:43:36.645Z] 	at org.eclipse.core.runtime.adaptor.EclipseStarter.run(EclipseStarter.java:401)
17:43:36 [2021-07-24T21:43:36.645Z] 	at org.eclipse.core.runtime.adaptor.EclipseStarter.run(EclipseStarter.java:255)
17:43:36 [2021-07-24T21:43:36.645Z] 	at java.base/jdk.internal.reflect.NativeMethodAccessorImpl.invoke0(Native Method)
17:43:36 [2021-07-24T21:43:36.645Z] 	at java.base/jdk.internal.reflect.NativeMethodAccessorImpl.invoke(NativeMethodAccessorImpl.java:64)
17:43:36 [2021-07-24T21:43:36.645Z] 	at java.base/jdk.internal.reflect.DelegatingMethodAccessorImpl.invoke(DelegatingMethodAccessorImpl.java:43)
17:43:36 [2021-07-24T21:43:36.645Z] 	at java.base/java.lang.reflect.Method.invoke(Method.java:564)
17:43:36 [2021-07-24T21:43:36.645Z] 	at org.eclipse.equinox.launcher.Main.invokeFramework(Main.java:654)
17:43:36 [2021-07-24T21:43:36.645Z] 	at org.eclipse.equinox.launcher.Main.basicRun(Main.java:591)
17:43:36 [2021-07-24T21:43:36.645Z] 	at org.eclipse.equinox.launcher.Main.run(Main.java:1462)
17:43:36 [2021-07-24T21:43:36.645Z] 	at org.eclipse.equinox.launcher.Main.main(Main.java:1435)
17:43:36 [2021-07-24T21:43:36.645Z] Caused by: java.lang.ClassNotFoundException: org.junit.runners.model.RunnerBuilder cannot be found by org.eclipse.tycho.surefire.osgibooter_2.2.0
17:43:36 [2021-07-24T21:43:36.645Z] 	at org.eclipse.osgi.internal.loader.BundleLoader.findClass(BundleLoader.java:519)
17:43:36 [2021-07-24T21:43:36.645Z] 	at org.eclipse.osgi.internal.loader.ModuleClassLoader.loadClass(ModuleClassLoader.java:170)
17:43:36 [2021-07-24T21:43:36.645Z] 	at java.base/java.lang.ClassLoader.loadClass(ClassLoader.java:522)
17:43:36 [2021-07-24T21:43:36.646Z] 	... 29 more
17:43:36 [2021-07-24T21:43:36.646Z] 
17:43:36 [2021-07-24T21:43:36.646Z] Running org.eclipse.ease.lang.unittest.ClassicJavaScriptTest
17:43:38 [2021-07-24T21:43:38.568Z] Tests run: 7, Failures: 0, Errors: 0, Skipped: 0, Time elapsed: 1.701 s - in org.eclipse.ease.lang.unittest.ClassicJavaScriptTest
17:43:38 [2021-07-24T21:43:38.568Z] folderStatus  Time elapsed: 0.663 s
17:43:38 [2021-07-24T21:43:38.568Z] errorTestStatus  Time elapsed: 0.189 s
17:43:38 [2021-07-24T21:43:38.568Z] failureTestStatus  Time elapsed: 0.182 s
17:43:38 [2021-07-24T21:43:38.568Z] verifyOutput  Time elapsed: 0.181 s
17:43:38 [2021-07-24T21:43:38.569Z] suiteStatus  Time elapsed: 0.143 s
17:43:38 [2021-07-24T21:43:38.569Z] ignoreTestStatus  Time elapsed: 0.171 s
17:43:38 [2021-07-24T21:43:38.569Z] passTestStatus  Time elapsed: 0.125 s
17:43:38 [2021-07-24T21:43:38.569Z] Running org.eclipse.ease.lang.unittest.ModernJavaScriptTest
17:43:39 [2021-07-24T21:43:39.504Z] Tests run: 8, Failures: 0, Errors: 0, Skipped: 0, Time elapsed: 0.994 s - in org.eclipse.ease.lang.unittest.ModernJavaScriptTest
17:43:39 [2021-07-24T21:43:39.504Z] folderStatus  Time elapsed: 0.188 s
17:43:39 [2021-07-24T21:43:39.504Z] verifyOutput  Time elapsed: 0.14 s
17:43:39 [2021-07-24T21:43:39.504Z] suiteStatus  Time elapsed: 0.128 s
17:43:39 [2021-07-24T21:43:39.504Z] ignoreTestStatus  Time elapsed: 0.105 s
17:43:39 [2021-07-24T21:43:39.504Z] ignoreTestClassStatus  Time elapsed: 0.098 s
17:43:39 [2021-07-24T21:43:39.504Z] failureTestClassStatus  Time elapsed: 0.108 s
17:43:39 [2021-07-24T21:43:39.504Z] errorTestClassStatus  Time elapsed: 0.123 s
17:43:39 [2021-07-24T21:43:39.504Z] passTestClassStatus  Time elapsed: 0.102 s
17:43:39 [2021-07-24T21:43:39.504Z] 
17:43:39 [2021-07-24T21:43:39.504Z] Results:
17:43:39 [2021-07-24T21:43:39.504Z] 
17:43:39 [2021-07-24T21:43:39.504Z] Tests run: 15, Failures: 0, Errors: 0, Skipped: 0
17:43:39 [2021-07-24T21:43:39.504Z] 
17:43:39 [2021-07-24T21:43:39.763Z] Job found still running after platform shutdown.  Jobs should be canceled by the plugin that scheduled them during shutdown: org.eclipse.ease.lang.javascript.rhino.debugger.RhinoDebuggerEngine
17:43:39 [2021-07-24T21:43:39.763Z] [INFO] All tests passed!
17:43:39 [2021-07-24T21:43:39.763Z] [INFO] 
17:43:39 [2021-07-24T21:43:39.763Z] [INFO] --- maven-install-plugin:2.3.1:install (default-install) @ org.eclipse.ease.lang.unittest.test ---
17:43:39 [2021-07-24T21:43:39.763Z] [INFO] Installing /home/jenkins/agent/workspace/ease.verify.core.target.2019-03/tests/org.eclipse.ease.lang.unittest.test/target/org.eclipse.ease.lang.unittest.test-0.9.0-SNAPSHOT.jar to /home/jenkins/.m2/repository/org/eclipse/ease/org.eclipse.ease.lang.unittest.test/0.9.0-SNAPSHOT/org.eclipse.ease.lang.unittest.test-0.9.0-SNAPSHOT.jar
17:43:39 [2021-07-24T21:43:39.763Z] [INFO] Installing /home/jenkins/agent/workspace/ease.verify.core.target.2019-03/tests/org.eclipse.ease.lang.unittest.test/pom.xml to /home/jenkins/.m2/repository/org/eclipse/ease/org.eclipse.ease.lang.unittest.test/0.9.0-SNAPSHOT/org.eclipse.ease.lang.unittest.test-0.9.0-SNAPSHOT.pom
17:43:39 [2021-07-24T21:43:39.763Z] [INFO] Installing /home/jenkins/agent/workspace/ease.verify.core.target.2019-03/tests/org.eclipse.ease.lang.unittest.test/target/p2content.xml to /home/jenkins/.m2/repository/org/eclipse/ease/org.eclipse.ease.lang.unittest.test/0.9.0-SNAPSHOT/org.eclipse.ease.lang.unittest.test-0.9.0-SNAPSHOT-p2metadata.xml
17:43:39 [2021-07-24T21:43:39.763Z] [INFO] Installing /home/jenkins/agent/workspace/ease.verify.core.target.2019-03/tests/org.eclipse.ease.lang.unittest.test/target/p2artifacts.xml to /home/jenkins/.m2/repository/org/eclipse/ease/org.eclipse.ease.lang.unittest.test/0.9.0-SNAPSHOT/org.eclipse.ease.lang.unittest.test-0.9.0-SNAPSHOT-p2artifacts.xml
17:43:39 [2021-07-24T21:43:39.763Z] [INFO] 
17:43:39 [2021-07-24T21:43:39.763Z] [INFO] --- tycho-p2-plugin:2.2.0:update-local-index (default-update-local-index) @ org.eclipse.ease.lang.unittest.test ---
17:43:39 [2021-07-24T21:43:39.763Z] [INFO] 
17:43:39 [2021-07-24T21:43:39.763Z] [INFO] ---------< org.eclipse.ease:org.eclipse.ease.ui.scripts.test >----------
17:43:39 [2021-07-24T21:43:39.764Z] [INFO] Building org.eclipse.ease.ui.scripts.test 0.9.0-SNAPSHOT         [45/49]
17:43:39 [2021-07-24T21:43:39.764Z] [INFO] ------------------------[ eclipse-test-plugin ]-------------------------
17:43:39 [2021-07-24T21:43:39.764Z] [INFO] 
17:43:39 [2021-07-24T21:43:39.764Z] [INFO] --- maven-clean-plugin:2.5:clean (default-clean) @ org.eclipse.ease.ui.scripts.test ---
17:43:39 [2021-07-24T21:43:39.764Z] [INFO] 
17:43:39 [2021-07-24T21:43:39.764Z] [INFO] --- tycho-packaging-plugin:2.2.0:build-qualifier (default-build-qualifier) @ org.eclipse.ease.ui.scripts.test ---
17:43:39 [2021-07-24T21:43:39.764Z] [INFO] The project's OSGi version is 0.9.0.I202106220815
17:43:39 [2021-07-24T21:43:39.764Z] [INFO] 
17:43:39 [2021-07-24T21:43:39.764Z] [INFO] --- tycho-packaging-plugin:2.2.0:validate-id (default-validate-id) @ org.eclipse.ease.ui.scripts.test ---
17:43:39 [2021-07-24T21:43:39.764Z] [INFO] 
17:43:39 [2021-07-24T21:43:39.764Z] [INFO] --- tycho-packaging-plugin:2.2.0:validate-version (default-validate-version) @ org.eclipse.ease.ui.scripts.test ---
17:43:39 [2021-07-24T21:43:39.764Z] [INFO] 
17:43:39 [2021-07-24T21:43:39.764Z] [INFO] --- maven-resources-plugin:2.4.3:resources (default-resources) @ org.eclipse.ease.ui.scripts.test ---
17:43:39 [2021-07-24T21:43:39.764Z] [INFO] Using 'UTF-8' encoding to copy filtered resources.
17:43:39 [2021-07-24T21:43:39.764Z] [INFO] skip non existing resourceDirectory /home/jenkins/agent/workspace/ease.verify.core.target.2019-03/tests/org.eclipse.ease.ui.scripts.test/src/main/resources
17:43:39 [2021-07-24T21:43:39.764Z] [INFO] 
17:43:39 [2021-07-24T21:43:39.764Z] [INFO] --- tycho-compiler-plugin:2.2.0:compile (default-compile) @ org.eclipse.ease.ui.scripts.test ---
17:43:39 [2021-07-24T21:43:39.764Z] [INFO] Compiling 1 source file to /home/jenkins/agent/workspace/ease.verify.core.target.2019-03/tests/org.eclipse.ease.ui.scripts.test/target/classes
17:43:40 [2021-07-24T21:43:40.023Z] [INFO] 
17:43:40 [2021-07-24T21:43:40.023Z] [INFO] --- maven-resources-plugin:2.4.3:testResources (default-testResources) @ org.eclipse.ease.ui.scripts.test ---
17:43:40 [2021-07-24T21:43:40.023Z] [INFO] Using 'UTF-8' encoding to copy filtered resources.
17:43:40 [2021-07-24T21:43:40.023Z] [INFO] skip non existing resourceDirectory /home/jenkins/agent/workspace/ease.verify.core.target.2019-03/tests/org.eclipse.ease.ui.scripts.test/src/test/resources
17:43:40 [2021-07-24T21:43:40.023Z] [INFO] 
17:43:40 [2021-07-24T21:43:40.023Z] [INFO] --- target-platform-configuration:2.2.0:target-platform (default-target-platform) @ org.eclipse.ease.ui.scripts.test ---
17:43:40 [2021-07-24T21:43:40.023Z] [INFO] 
17:43:40 [2021-07-24T21:43:40.023Z] [INFO] --- tycho-packaging-plugin:2.2.0:package-plugin (default-package-plugin) @ org.eclipse.ease.ui.scripts.test ---
17:43:40 [2021-07-24T21:43:40.023Z] [INFO] Building jar: /home/jenkins/agent/workspace/ease.verify.core.target.2019-03/tests/org.eclipse.ease.ui.scripts.test/target/org.eclipse.ease.ui.scripts.test-0.9.0-SNAPSHOT.jar
17:43:40 [2021-07-24T21:43:40.023Z] [INFO] 
17:43:40 [2021-07-24T21:43:40.023Z] [INFO] --- tycho-p2-plugin:2.2.0:p2-metadata-default (default-p2-metadata-default) @ org.eclipse.ease.ui.scripts.test ---
17:43:40 [2021-07-24T21:43:40.023Z] [INFO] 
17:43:40 [2021-07-24T21:43:40.023Z] [INFO] --- jacoco-maven-plugin:0.8.6:prepare-agent (jacoco-initialize) @ org.eclipse.ease.ui.scripts.test ---
17:43:40 [2021-07-24T21:43:40.023Z] [INFO] tycho.testArgLine set to -javaagent:/home/jenkins/.m2/repository/org/jacoco/org.jacoco.agent/0.8.6/org.jacoco.agent-0.8.6-runtime.jar=destfile=/home/jenkins/agent/workspace/ease.verify.core.target.2019-03/tests/org.eclipse.ease.ui.scripts.test/target/jacoco.exec,output=file
17:43:40 [2021-07-24T21:43:40.023Z] [INFO] 
17:43:40 [2021-07-24T21:43:40.023Z] [INFO] --- tycho-surefire-plugin:2.2.0:test (default-test) @ org.eclipse.ease.ui.scripts.test ---
17:43:40 [2021-07-24T21:43:40.023Z] [INFO] Executing Test Runtime with timeout 0, logs (if any) will be placed at: /home/jenkins/agent/workspace/ease.verify.core.target.2019-03/tests/org.eclipse.ease.ui.scripts.test/target/work/data/.metadata/.log
17:43:40 [2021-07-24T21:43:40.023Z] [INFO] Command line:
17:43:40 [2021-07-24T21:43:40.024Z] 	[/opt/tools/java/openjdk/jdk-15/15.0.2+7/bin/java, -Dosgi.noShutdown=false, -Dosgi.os=linux, -Dosgi.ws=gtk, -Dosgi.arch=x86_64, -javaagent:/home/jenkins/.m2/repository/org/jacoco/org.jacoco.agent/0.8.6/org.jacoco.agent-0.8.6-runtime.jar=destfile=/home/jenkins/agent/workspace/ease.verify.core.target.2019-03/tests/org.eclipse.ease.ui.scripts.test/target/jacoco.exec,output=file, -Dosgi.clean=true, -jar, /home/jenkins/.m2/repository/p2/osgi/bundle/org.eclipse.equinox.launcher/1.6.200.v20210416-2027/org.eclipse.equinox.launcher-1.6.200.v20210416-2027.jar, -data, /home/jenkins/agent/workspace/ease.verify.core.target.2019-03/tests/org.eclipse.ease.ui.scripts.test/target/work/data, -install, /home/jenkins/agent/workspace/ease.verify.core.target.2019-03/tests/org.eclipse.ease.ui.scripts.test/target/work, -configuration, /home/jenkins/agent/workspace/ease.verify.core.target.2019-03/tests/org.eclipse.ease.ui.scripts.test/target/work/configuration, -application, org.eclipse.tycho.surefire.osgibooter.headlesstest, -testproperties, /home/jenkins/agent/workspace/ease.verify.core.target.2019-03/tests/org.eclipse.ease.ui.scripts.test/target/surefire.properties]
17:43:40 [2021-07-24T21:43:40.024Z] Picked up JAVA_TOOL_OPTIONS: -Dmaven.ext.class.path="/home/jenkins/agent/workspace/ease.verify.core.target.2019-03@tmp/withMaven2d072e6e/pipeline-maven-spy.jar" -Dorg.jenkinsci.plugins.pipeline.maven.reportsFolder="/home/jenkins/agent/workspace/ease.verify.core.target.2019-03@tmp/withMaven2d072e6e" 
17:43:44 [2021-07-24T21:43:44.261Z] Running org.eclipse.ease.ui.scripts.expressions.definitions.ExpressionFactoryTest
17:43:44 [2021-07-24T21:43:44.261Z] Tests run: 14, Failures: 0, Errors: 0, Skipped: 0, Time elapsed: 0.075 s - in org.eclipse.ease.ui.scripts.expressions.definitions.ExpressionFactoryTest
17:43:44 [2021-07-24T21:43:44.261Z] loadClassWithExpression  Time elapsed: 0.033 s
17:43:44 [2021-07-24T21:43:44.261Z] createWithExpression  Time elapsed: 0.001 s
17:43:44 [2021-07-24T21:43:44.261Z] createReferenceExpression  Time elapsed: 0.001 s
17:43:44 [2021-07-24T21:43:44.261Z] loadClassReferenceExpression  Time elapsed: 0.001 s
17:43:44 [2021-07-24T21:43:44.261Z] loadClassTestExpression  Time elapsed: 0.002 s
17:43:44 [2021-07-24T21:43:44.261Z] createEqualsExpression  Time elapsed: 0.002 s
17:43:44 [2021-07-24T21:43:44.261Z] loadClassCountExpression  Time elapsed: 0.001 s
17:43:44 [2021-07-24T21:43:44.261Z] loadClassOrExpression  Time elapsed: 0.001 s
17:43:44 [2021-07-24T21:43:44.261Z] createTestExpression  Time elapsed: 0.003 s
17:43:44 [2021-07-24T21:43:44.261Z] createOrExpression  Time elapsed: 0.002 s
17:43:44 [2021-07-24T21:43:44.261Z] loadClassAndExpression  Time elapsed: 0.001 s
17:43:44 [2021-07-24T21:43:44.261Z] createAndExpression  Time elapsed: 0 s
17:43:44 [2021-07-24T21:43:44.261Z] loadClassEqualsExpression  Time elapsed: 0 s
17:43:44 [2021-07-24T21:43:44.261Z] createCountExpression  Time elapsed: 0.001 s
17:43:44 [2021-07-24T21:43:44.261Z] 
17:43:44 [2021-07-24T21:43:44.261Z] Results:
17:43:44 [2021-07-24T21:43:44.262Z] 
17:43:44 [2021-07-24T21:43:44.262Z] Tests run: 14, Failures: 0, Errors: 0, Skipped: 0
17:43:44 [2021-07-24T21:43:44.262Z] 
17:43:44 [2021-07-24T21:43:44.262Z] [INFO] All tests passed!
17:43:44 [2021-07-24T21:43:44.262Z] [INFO] 
17:43:44 [2021-07-24T21:43:44.262Z] [INFO] --- maven-pmd-plugin:3.14.0:pmd (pmd-integration) @ org.eclipse.ease.ui.scripts.test ---
17:43:44 [2021-07-24T21:43:44.262Z] [WARNING] Unable to exclude rules [JUnit5TestShouldBePackagePrivate] from ruleset reference category/java/bestpractices.xml; perhaps the rule name is misspelled or the rule doesn't exist anymore?
17:43:44 [2021-07-24T21:43:44.262Z] [WARNING] Unable to exclude rules [JUnit5TestShouldBePackagePrivate] from ruleset reference category/java/bestpractices.xml; perhaps the rule name is misspelled or the rule doesn't exist anymore?
17:43:44 [2021-07-24T21:43:44.262Z] [INFO] 
17:43:44 [2021-07-24T21:43:44.262Z] [INFO] --- maven-pmd-plugin:3.14.0:cpd (pmd-integration) @ org.eclipse.ease.ui.scripts.test ---
17:43:44 [2021-07-24T21:43:44.262Z] [INFO] 
17:43:44 [2021-07-24T21:43:44.262Z] [INFO] --- spotbugs-maven-plugin:4.1.4:spotbugs (spotbugs-integration) @ org.eclipse.ease.ui.scripts.test ---
17:43:44 [2021-07-24T21:43:44.262Z] [INFO] Fork Value is false
17:43:44 [2021-07-24T21:43:44.262Z]      [java] JVM args ignored when same JVM is used.
17:43:46 [2021-07-24T21:43:46.807Z] [INFO] Done SpotBugs Analysis....
17:43:46 [2021-07-24T21:43:46.807Z] [INFO] 
17:43:46 [2021-07-24T21:43:46.807Z] [INFO] --- maven-checkstyle-plugin:3.1.1:check (checkstyle-integration) @ org.eclipse.ease.ui.scripts.test ---
17:43:46 [2021-07-24T21:43:46.807Z] [INFO] You have 0 Checkstyle violations.
17:43:46 [2021-07-24T21:43:46.807Z] [INFO] 
17:43:46 [2021-07-24T21:43:46.807Z] [INFO] --- maven-install-plugin:2.3.1:install (default-install) @ org.eclipse.ease.ui.scripts.test ---
17:43:46 [2021-07-24T21:43:46.807Z] [INFO] Installing /home/jenkins/agent/workspace/ease.verify.core.target.2019-03/tests/org.eclipse.ease.ui.scripts.test/target/org.eclipse.ease.ui.scripts.test-0.9.0-SNAPSHOT.jar to /home/jenkins/.m2/repository/org/eclipse/ease/org.eclipse.ease.ui.scripts.test/0.9.0-SNAPSHOT/org.eclipse.ease.ui.scripts.test-0.9.0-SNAPSHOT.jar
17:43:46 [2021-07-24T21:43:46.807Z] [INFO] Installing /home/jenkins/agent/workspace/ease.verify.core.target.2019-03/tests/org.eclipse.ease.ui.scripts.test/pom.xml to /home/jenkins/.m2/repository/org/eclipse/ease/org.eclipse.ease.ui.scripts.test/0.9.0-SNAPSHOT/org.eclipse.ease.ui.scripts.test-0.9.0-SNAPSHOT.pom
17:43:46 [2021-07-24T21:43:46.808Z] [INFO] Installing /home/jenkins/agent/workspace/ease.verify.core.target.2019-03/tests/org.eclipse.ease.ui.scripts.test/target/p2content.xml to /home/jenkins/.m2/repository/org/eclipse/ease/org.eclipse.ease.ui.scripts.test/0.9.0-SNAPSHOT/org.eclipse.ease.ui.scripts.test-0.9.0-SNAPSHOT-p2metadata.xml
17:43:46 [2021-07-24T21:43:46.808Z] [INFO] Installing /home/jenkins/agent/workspace/ease.verify.core.target.2019-03/tests/org.eclipse.ease.ui.scripts.test/target/p2artifacts.xml to /home/jenkins/.m2/repository/org/eclipse/ease/org.eclipse.ease.ui.scripts.test/0.9.0-SNAPSHOT/org.eclipse.ease.ui.scripts.test-0.9.0-SNAPSHOT-p2artifacts.xml
17:43:46 [2021-07-24T21:43:46.808Z] [INFO] 
17:43:46 [2021-07-24T21:43:46.808Z] [INFO] --- tycho-p2-plugin:2.2.0:update-local-index (default-update-local-index) @ org.eclipse.ease.ui.scripts.test ---
17:43:46 [2021-07-24T21:43:46.808Z] [INFO] 
17:43:46 [2021-07-24T21:43:46.808Z] [INFO] -------------< org.eclipse.ease:org.eclipse.ease.ui.test >--------------
17:43:46 [2021-07-24T21:43:46.808Z] [INFO] Building org.eclipse.ease.ui.test 0.9.0-SNAPSHOT                 [46/49]
17:43:46 [2021-07-24T21:43:46.808Z] [INFO] ------------------------[ eclipse-test-plugin ]-------------------------
17:43:46 [2021-07-24T21:43:46.808Z] [INFO] 
17:43:46 [2021-07-24T21:43:46.808Z] [INFO] --- maven-clean-plugin:2.5:clean (default-clean) @ org.eclipse.ease.ui.test ---
17:43:46 [2021-07-24T21:43:46.808Z] [INFO] 
17:43:46 [2021-07-24T21:43:46.808Z] [INFO] --- tycho-packaging-plugin:2.2.0:build-qualifier (default-build-qualifier) @ org.eclipse.ease.ui.test ---
17:43:46 [2021-07-24T21:43:46.808Z] [INFO] The project's OSGi version is 0.9.0.I202107211616
17:43:46 [2021-07-24T21:43:46.808Z] [INFO] 
17:43:46 [2021-07-24T21:43:46.808Z] [INFO] --- tycho-packaging-plugin:2.2.0:validate-id (default-validate-id) @ org.eclipse.ease.ui.test ---
17:43:46 [2021-07-24T21:43:46.808Z] [INFO] 
17:43:46 [2021-07-24T21:43:46.808Z] [INFO] --- tycho-packaging-plugin:2.2.0:validate-version (default-validate-version) @ org.eclipse.ease.ui.test ---
17:43:46 [2021-07-24T21:43:46.808Z] [INFO] 
17:43:46 [2021-07-24T21:43:46.808Z] [INFO] --- maven-resources-plugin:2.4.3:resources (default-resources) @ org.eclipse.ease.ui.test ---
17:43:46 [2021-07-24T21:43:46.808Z] [INFO] Using 'UTF-8' encoding to copy filtered resources.
17:43:46 [2021-07-24T21:43:46.808Z] [INFO] skip non existing resourceDirectory /home/jenkins/agent/workspace/ease.verify.core.target.2019-03/tests/org.eclipse.ease.ui.test/src/main/resources
17:43:46 [2021-07-24T21:43:46.808Z] [INFO] 
17:43:46 [2021-07-24T21:43:46.808Z] [INFO] --- tycho-compiler-plugin:2.2.0:compile (default-compile) @ org.eclipse.ease.ui.test ---
17:43:46 [2021-07-24T21:43:46.808Z] [INFO] Compiling 23 source files to /home/jenkins/agent/workspace/ease.verify.core.target.2019-03/tests/org.eclipse.ease.ui.test/target/classes
17:43:47 [2021-07-24T21:43:47.776Z] [INFO] 
17:43:47 [2021-07-24T21:43:47.776Z] [INFO] --- maven-resources-plugin:2.4.3:testResources (default-testResources) @ org.eclipse.ease.ui.test ---
17:43:47 [2021-07-24T21:43:47.776Z] [INFO] Using 'UTF-8' encoding to copy filtered resources.
17:43:47 [2021-07-24T21:43:47.777Z] [INFO] skip non existing resourceDirectory /home/jenkins/agent/workspace/ease.verify.core.target.2019-03/tests/org.eclipse.ease.ui.test/src/test/resources
17:43:47 [2021-07-24T21:43:47.777Z] [INFO] 
17:43:47 [2021-07-24T21:43:47.777Z] [INFO] --- target-platform-configuration:2.2.0:target-platform (default-target-platform) @ org.eclipse.ease.ui.test ---
17:43:47 [2021-07-24T21:43:47.777Z] [INFO] 
17:43:47 [2021-07-24T21:43:47.777Z] [INFO] --- tycho-packaging-plugin:2.2.0:package-plugin (default-package-plugin) @ org.eclipse.ease.ui.test ---
17:43:47 [2021-07-24T21:43:47.777Z] [INFO] Building jar: /home/jenkins/agent/workspace/ease.verify.core.target.2019-03/tests/org.eclipse.ease.ui.test/target/org.eclipse.ease.ui.test-0.9.0-SNAPSHOT.jar
17:43:47 [2021-07-24T21:43:47.777Z] [INFO] 
17:43:47 [2021-07-24T21:43:47.777Z] [INFO] --- tycho-p2-plugin:2.2.0:p2-metadata-default (default-p2-metadata-default) @ org.eclipse.ease.ui.test ---
17:43:47 [2021-07-24T21:43:47.777Z] [INFO] 
17:43:47 [2021-07-24T21:43:47.777Z] [INFO] --- jacoco-maven-plugin:0.8.6:prepare-agent (jacoco-initialize) @ org.eclipse.ease.ui.test ---
17:43:47 [2021-07-24T21:43:47.777Z] [INFO] tycho.testArgLine set to -javaagent:/home/jenkins/.m2/repository/org/jacoco/org.jacoco.agent/0.8.6/org.jacoco.agent-0.8.6-runtime.jar=destfile=/home/jenkins/agent/workspace/ease.verify.core.target.2019-03/tests/org.eclipse.ease.ui.test/target/jacoco.exec,output=file
17:43:47 [2021-07-24T21:43:47.777Z] [INFO] 
17:43:47 [2021-07-24T21:43:47.777Z] [INFO] --- tycho-surefire-plugin:2.2.0:test (default-test) @ org.eclipse.ease.ui.test ---
17:43:47 [2021-07-24T21:43:47.777Z] [INFO] Executing Test Runtime with timeout 0, logs (if any) will be placed at: /home/jenkins/agent/workspace/ease.verify.core.target.2019-03/tests/org.eclipse.ease.ui.test/target/work/data/.metadata/.log
17:43:47 [2021-07-24T21:43:47.777Z] [INFO] Command line:
17:43:47 [2021-07-24T21:43:47.777Z] 	[/opt/tools/java/openjdk/jdk-15/15.0.2+7/bin/java, -Dosgi.noShutdown=false, -Dosgi.os=linux, -Dosgi.ws=gtk, -Dosgi.arch=x86_64, -javaagent:/home/jenkins/.m2/repository/org/jacoco/org.jacoco.agent/0.8.6/org.jacoco.agent-0.8.6-runtime.jar=destfile=/home/jenkins/agent/workspace/ease.verify.core.target.2019-03/tests/org.eclipse.ease.ui.test/target/jacoco.exec,output=file, -Dosgi.clean=true, -jar, /home/jenkins/.m2/repository/p2/osgi/bundle/org.eclipse.equinox.launcher/1.6.200.v20210416-2027/org.eclipse.equinox.launcher-1.6.200.v20210416-2027.jar, -data, /home/jenkins/agent/workspace/ease.verify.core.target.2019-03/tests/org.eclipse.ease.ui.test/target/work/data, -install, /home/jenkins/agent/workspace/ease.verify.core.target.2019-03/tests/org.eclipse.ease.ui.test/target/work, -configuration, /home/jenkins/agent/workspace/ease.verify.core.target.2019-03/tests/org.eclipse.ease.ui.test/target/work/configuration, -application, org.eclipse.tycho.surefire.osgibooter.headlesstest, -testproperties, /home/jenkins/agent/workspace/ease.verify.core.target.2019-03/tests/org.eclipse.ease.ui.test/target/surefire.properties]
17:43:47 [2021-07-24T21:43:47.777Z] Picked up JAVA_TOOL_OPTIONS: -Dmaven.ext.class.path="/home/jenkins/agent/workspace/ease.verify.core.target.2019-03@tmp/withMaven2d072e6e/pipeline-maven-spy.jar" -Dorg.jenkinsci.plugins.pipeline.maven.reportsFolder="/home/jenkins/agent/workspace/ease.verify.core.target.2019-03@tmp/withMaven2d072e6e" 
17:43:51 [2021-07-24T21:43:51.972Z] Running org.eclipse.ease.ui.completion.ScriptCompletionProposalTest
17:43:51 [2021-07-24T21:43:51.972Z] Tests run: 6, Failures: 0, Errors: 0, Skipped: 0, Time elapsed: 0.046 s - in org.eclipse.ease.ui.completion.ScriptCompletionProposalTest
17:43:51 [2021-07-24T21:43:51.972Z] getCursorPosition_equals_end_of_inserted_text  Time elapsed: 0.026 s
17:43:51 [2021-07-24T21:43:51.972Z] getCursorPosition_equals_end_of_appended_text  Time elapsed: 0.001 s
17:43:51 [2021-07-24T21:43:51.972Z] getContent_inserts_replacement_text  Time elapsed: 0.002 s
17:43:51 [2021-07-24T21:43:51.972Z] getCursorPosition_equals_end_of_set_text  Time elapsed: 0 s
17:43:51 [2021-07-24T21:43:51.972Z] getContent_sets_replacement_text  Time elapsed: 0 s
17:43:51 [2021-07-24T21:43:51.972Z] getContent_appends_replacement_text  Time elapsed: 0 s
17:43:51 [2021-07-24T21:43:51.972Z] Running org.eclipse.ease.ui.completion.provider.AbstractFileLocationCompletionProviderTest
17:43:51 [2021-07-24T21:43:51.972Z] Tests run: 19, Failures: 0, Errors: 0, Skipped: 0, Time elapsed: 0.15 s - in org.eclipse.ease.ui.completion.provider.AbstractFileLocationCompletionProviderTest
17:43:51 [2021-07-24T21:43:51.972Z] getProposals_does_not_contain_project_root_with_file_resource  Time elapsed: 0.101 s
17:43:51 [2021-07-24T21:43:51.972Z] getProposals_contains_project_root_files_for_project_root  Time elapsed: 0.001 s
17:43:51 [2021-07-24T21:43:51.972Z] getProposals_contains_files_for_workspace_folder  Time elapsed: 0.001 s
17:43:51 [2021-07-24T21:43:51.972Z] getProposals_contains_back_for_workspace_folder  Time elapsed: 0.001 s
17:43:51 [2021-07-24T21:43:51.972Z] getProposals_doe_not_contain_back_proposal  Time elapsed: 0 s
17:43:51 [2021-07-24T21:43:51.972Z] getProposals_contains_root_file_systems  Time elapsed: 0 s
17:43:51 [2021-07-24T21:43:51.972Z] getProposals_contains_back_for_project  Time elapsed: 0 s
17:43:51 [2021-07-24T21:43:51.972Z] getProposals_contains_files_for_project  Time elapsed: 0.001 s
17:43:51 [2021-07-24T21:43:51.972Z] getProposals_does_not_contain_project_root_without_resource  Time elapsed: 0 s
17:43:51 [2021-07-24T21:43:51.972Z] getProposals_contains_project_root_with_workspace_resource  Time elapsed: 0 s
17:43:51 [2021-07-24T21:43:51.972Z] getProposals_contains_back_for_project_folder  Time elapsed: 0.001 s
17:43:51 [2021-07-24T21:43:51.972Z] getProposals_contains_projects_for_workspace_root  Time elapsed: 0.013 s
17:43:51 [2021-07-24T21:43:51.972Z] getProposals_contains_project_root_folders_for_workspace_project  Time elapsed: 0.001 s
17:43:51 [2021-07-24T21:43:51.972Z] getProposals_contains_filesystem_root  Time elapsed: 0.001 s
17:43:51 [2021-07-24T21:43:51.973Z] getProposals_contains_files_for_project_folder  Time elapsed: 0.001 s
17:43:51 [2021-07-24T21:43:51.973Z] getProposals_contains_workspace_root  Time elapsed: 0.001 s
17:43:51 [2021-07-24T21:43:51.973Z] getProposals_contains_files_for_filesystem  Time elapsed: 0.001 s
17:43:51 [2021-07-24T21:43:51.973Z] getProposals_contains_project_root_files_for_workspace_project  Time elapsed: 0.001 s
17:43:51 [2021-07-24T21:43:51.973Z] getProposals_contains_back_for_filesystem  Time elapsed: 0.001 s
17:43:51 [2021-07-24T21:43:51.973Z] Running org.eclipse.ease.ui.completion.provider.LoadModuleCompletionProviderTest
17:43:51 [2021-07-24T21:43:51.973Z] Tests run: 8, Failures: 0, Errors: 0, Skipped: 0, Time elapsed: 0.034 s - in org.eclipse.ease.ui.completion.provider.LoadModuleCompletionProviderTest
17:43:51 [2021-07-24T21:43:51.973Z] getProposals_contains_root_entry_with_absolute_filter  Time elapsed: 0.028 s
17:43:51 [2021-07-24T21:43:51.973Z] isActive_equals_true_for_partial_module_name  Time elapsed: 0.002 s
17:43:51 [2021-07-24T21:43:51.973Z] getProposals_contains_root_entry_with_relative_filter  Time elapsed: 0 s
17:43:51 [2021-07-24T21:43:51.973Z] isActive_equals_true_for_wrong_method_parameter  Time elapsed: 0.001 s
17:43:51 [2021-07-24T21:43:51.973Z] isActive_equals_true_for_wrong_method_name  Time elapsed: 0 s
17:43:51 [2021-07-24T21:43:51.973Z] getProposals_does_not_contain_root_entry_on_filter_mismatch  Time elapsed: 0.001 s
17:43:51 [2021-07-24T21:43:51.973Z] isActive_equals_true_for_method  Time elapsed: 0 s
17:43:51 [2021-07-24T21:43:51.973Z] getProposals_contains_root_entry  Time elapsed: 0.001 s
17:43:51 [2021-07-24T21:43:51.973Z] Running org.eclipse.ease.ui.completion.provider.LoadedModuleCompletionProviderTest
17:43:51 [2021-07-24T21:43:51.973Z] Tests run: 12, Failures: 0, Errors: 0, Skipped: 0, Time elapsed: 0.087 s - in org.eclipse.ease.ui.completion.provider.LoadedModuleCompletionProviderTest
17:43:51 [2021-07-24T21:43:51.973Z] getProposals_contains_constant_methods  Time elapsed: 0.013 s
17:43:51 [2021-07-24T21:43:51.973Z] getProposals_contains_module_methods  Time elapsed: 0.002 s
17:43:51 [2021-07-24T21:43:51.973Z] isActive_equals_false{String}[1]  Time elapsed: 0.015 s
17:43:51 [2021-07-24T21:43:51.973Z] isActive_equals_false{String}[2]  Time elapsed: 0 s
17:43:51 [2021-07-24T21:43:51.973Z] isActive_equals_false{String}[3]  Time elapsed: 0.001 s
17:43:51 [2021-07-24T21:43:51.973Z] isActive_equals_false{String}[4]  Time elapsed: 0 s
17:43:51 [2021-07-24T21:43:51.973Z] isActive_equals_true{String}[1]  Time elapsed: 0.001 s
17:43:51 [2021-07-24T21:43:51.973Z] isActive_equals_true{String}[2]  Time elapsed: 0 s
17:43:51 [2021-07-24T21:43:51.973Z] isActive_equals_true{String}[3]  Time elapsed: 0.001 s
17:43:51 [2021-07-24T21:43:51.973Z] isActive_equals_true{String}[4]  Time elapsed: 0 s
17:43:51 [2021-07-24T21:43:51.973Z] isActive_equals_true{String}[5]  Time elapsed: 0.001 s
17:43:51 [2021-07-24T21:43:51.973Z] isActive_equals_true{String}[6]  Time elapsed: 0 s
17:43:51 [2021-07-24T21:43:51.973Z] Running org.eclipse.ease.ui.completion.provider.AbstractCompletionProviderTest
17:43:51 [2021-07-24T21:43:51.973Z] Tests run: 13, Failures: 0, Errors: 0, Skipped: 0, Time elapsed: 0.012 s - in org.eclipse.ease.ui.completion.provider.AbstractCompletionProviderTest
17:43:51 [2021-07-24T21:43:51.973Z] isMethodParameter_equals_false{String}[1]  Time elapsed: 0 s
17:43:51 [2021-07-24T21:43:51.973Z] isMethodParameter_equals_false{String}[2]  Time elapsed: 0 s
17:43:51 [2021-07-24T21:43:51.973Z] isMethodParameter_equals_false{String}[3]  Time elapsed: 0.001 s
17:43:51 [2021-07-24T21:43:51.973Z] isMethodParameter_equals_true{String}[1]  Time elapsed: 0 s
17:43:51 [2021-07-24T21:43:51.973Z] isMethodParameter_equals_true{String}[2]  Time elapsed: 0.001 s
17:43:51 [2021-07-24T21:43:51.973Z] isMethodParameter_equals_true_for_parameter_index{String}[1]  Time elapsed: 0 s
17:43:51 [2021-07-24T21:43:51.973Z] isMethodParameter_equals_true_for_parameter_index{String}[2]  Time elapsed: 0.001 s
17:43:51 [2021-07-24T21:43:51.973Z] isMethodParameter_equals_true_for_parameter_index{String}[3]  Time elapsed: 0.001 s
17:43:51 [2021-07-24T21:43:51.973Z] isMethodParameter_equals_true_for_parameter_index{String}[4]  Time elapsed: 0 s
17:43:51 [2021-07-24T21:43:51.973Z] isMethodParameter_equals_false_for_parameter_index{String}[1]  Time elapsed: 0.001 s
17:43:51 [2021-07-24T21:43:51.973Z] isMethodParameter_equals_false_for_parameter_index{String}[2]  Time elapsed: 0 s
17:43:51 [2021-07-24T21:43:51.973Z] isMethodParameter_equals_false_for_parameter_index{String}[3]  Time elapsed: 0 s
17:43:51 [2021-07-24T21:43:51.974Z] isMethodParameter_equals_false_for_parameter_index{String}[4]  Time elapsed: 0.001 s
17:43:51 [2021-07-24T21:43:51.974Z] Running org.eclipse.ease.ui.completion.provider.AbstractPathCompletionProviderTest
17:43:51 [2021-07-24T21:43:51.974Z] Tests run: 11, Failures: 0, Errors: 0, Skipped: 0, Time elapsed: 0.027 s - in org.eclipse.ease.ui.completion.provider.AbstractPathCompletionProviderTest
17:43:51 [2021-07-24T21:43:51.974Z] filter_keeps_only_lower_level_on_matching_filter  Time elapsed: 0 s
17:43:51 [2021-07-24T21:43:51.974Z] filter_removes_nothing_if_context_is_empty  Time elapsed: 0 s
17:43:51 [2021-07-24T21:43:51.974Z] getPathsFromElements_is_empty_for_root_elements_only  Time elapsed: 0 s
17:43:51 [2021-07-24T21:43:51.974Z] filter_keeps_only_1st_level_on_empty_filter  Time elapsed: 0 s
17:43:51 [2021-07-24T21:43:51.974Z] filter_keeps_only_1st_level_on_matching_filter  Time elapsed: 0 s
17:43:51 [2021-07-24T21:43:51.974Z] getPathsFromElements_is_empty_for_empty_element  Time elapsed: 0 s
17:43:51 [2021-07-24T21:43:51.974Z] filter_removes_mismatches_on_same_level  Time elapsed: 0 s
17:43:51 [2021-07-24T21:43:51.974Z] filter_matches_next_level  Time elapsed: 0 s
17:43:51 [2021-07-24T21:43:51.974Z] filter_matches_relative_paths  Time elapsed: 0 s
17:43:51 [2021-07-24T21:43:51.974Z] getPathsFromElements_contains_parent_paths  Time elapsed: 0.001 s
17:43:51 [2021-07-24T21:43:51.974Z] getPathsFromElements_contains_all_hierarchies  Time elapsed: 0.001 s
17:43:51 [2021-07-24T21:43:51.974Z] Running org.eclipse.ease.ui.completion.provider.VariablesCompletionProviderTest
17:43:52 [2021-07-24T21:43:52.544Z] Tests run: 15, Failures: 0, Errors: 0, Skipped: 0, Time elapsed: 0.564 s - in org.eclipse.ease.ui.completion.provider.VariablesCompletionProviderTest
17:43:52 [2021-07-24T21:43:52.544Z] prepareProposals_instance_contains_integer_variable  Time elapsed: 0.548 s
17:43:52 [2021-07-24T21:43:52.544Z] prepareProposals_instance_contains_string_variable  Time elapsed: 0.001 s
17:43:52 [2021-07-24T21:43:52.544Z] prepareProposals_instance_contains_string_variable_for_filter_input_case_insensitive  Time elapsed: 0.001 s
17:43:52 [2021-07-24T21:43:52.544Z] prepareProposals_instance_contains_string_variable_for_filter_input  Time elapsed: 0.001 s
17:43:52 [2021-07-24T21:43:52.544Z] prepareProposals_does_not_contain_internal_variable  Time elapsed: 0 s
17:43:52 [2021-07-24T21:43:52.544Z] isActive_equals_false{String}[1]  Time elapsed: 0.001 s
17:43:52 [2021-07-24T21:43:52.544Z] isActive_equals_false{String}[2]  Time elapsed: 0.001 s
17:43:52 [2021-07-24T21:43:52.544Z] isActive_equals_true{String}[1]  Time elapsed: 0 s
17:43:52 [2021-07-24T21:43:52.544Z] isActive_equals_true{String}[2]  Time elapsed: 0 s
17:43:52 [2021-07-24T21:43:52.544Z] isActive_equals_true{String}[3]  Time elapsed: 0 s
17:43:52 [2021-07-24T21:43:52.544Z] isActive_equals_true{String}[4]  Time elapsed: 0 s
17:43:52 [2021-07-24T21:43:52.544Z] isActive_equals_true{String}[5]  Time elapsed: 0 s
17:43:52 [2021-07-24T21:43:52.544Z] isActive_equals_true{String}[6]  Time elapsed: 0 s
17:43:52 [2021-07-24T21:43:52.544Z] isActive_equals_true{String}[7]  Time elapsed: 0.001 s
17:43:52 [2021-07-24T21:43:52.544Z] isActive_equals_true{String}[8]  Time elapsed: 0.001 s
17:43:52 [2021-07-24T21:43:52.544Z] Running org.eclipse.ease.ui.completion.BasicContextTest
17:43:52 [2021-07-24T21:43:52.544Z] Tests run: 13, Failures: 0, Errors: 0, Skipped: 0, Time elapsed: 0.008 s - in org.eclipse.ease.ui.completion.BasicContextTest
17:43:52 [2021-07-24T21:43:52.544Z] getScriptEngine_returns_engine  Time elapsed: 0.001 s
17:43:52 [2021-07-24T21:43:52.544Z] getFilter_removes_string_literal_start  Time elapsed: 0.001 s
17:43:52 [2021-07-24T21:43:52.544Z] getLoadedModules_detects_modules_from_ScriptEngine  Time elapsed: 0.001 s
17:43:52 [2021-07-24T21:43:52.544Z] getFilter_contains_parameter_prefix  Time elapsed: 0.001 s
17:43:52 [2021-07-24T21:43:52.544Z] getFilterToken_contains_parameter_prefix  Time elapsed: 0 s
17:43:52 [2021-07-24T21:43:52.544Z] getLoadedModules_contains_environment_on_resource  Time elapsed: 0.001 s
17:43:52 [2021-07-24T21:43:52.544Z] getLoadedModules_does_not_contain_environment_twice_on_resource  Time elapsed: 0 s
17:43:52 [2021-07-24T21:43:52.544Z] getFilter_is_empty  Time elapsed: 0.001 s
17:43:52 [2021-07-24T21:43:52.544Z] getFilter_keeps_spaces_in_string_literal  Time elapsed: 0 s
17:43:52 [2021-07-24T21:43:52.545Z] getLoadedModules_detects_loadModule_commands  Time elapsed: 0.001 s
17:43:52 [2021-07-24T21:43:52.545Z] getFilter_is_empty_for_empty_input  Time elapsed: 0 s
17:43:52 [2021-07-24T21:43:52.545Z] getFilterToken_removes_string_literal_start  Time elapsed: 0 s
17:43:52 [2021-07-24T21:43:52.545Z] getFilterToken_is_empty_for_empty_input  Time elapsed: 0 s
17:43:52 [2021-07-24T21:43:52.545Z] Running org.eclipse.ease.ui.completion.CodeCompletionAggregatorTest
17:43:52 [2021-07-24T21:43:52.545Z] Tests run: 4, Failures: 0, Errors: 0, Skipped: 0, Time elapsed: 0.089 s - in org.eclipse.ease.ui.completion.CodeCompletionAggregatorTest
17:43:52 [2021-07-24T21:43:52.545Z] context_for_empty_input  Time elapsed: 0.055 s
17:43:52 [2021-07-24T21:43:52.545Z] context_for_root_package_with_suffix  Time elapsed: 0.002 s
17:43:52 [2021-07-24T21:43:52.545Z] getProposals_contains_proposal_from_local_provider  Time elapsed: 0.003 s
17:43:52 [2021-07-24T21:43:52.545Z] context_for_root_package  Time elapsed: 0.027 s
17:43:52 [2021-07-24T21:43:52.545Z] Running org.eclipse.ease.ui.completion.tokenizer.BracketMatcherTest
17:43:52 [2021-07-24T21:43:52.545Z] Tests run: 9, Failures: 0, Errors: 0, Skipped: 0, Time elapsed: 0.004 s - in org.eclipse.ease.ui.completion.tokenizer.BracketMatcherTest
17:43:52 [2021-07-24T21:43:52.545Z] getOpenBrackets_returns_open_brackets_only  Time elapsed: 0.001 s
17:43:52 [2021-07-24T21:43:52.545Z] getBrackets_detects_1  Time elapsed: 0 s
17:43:52 [2021-07-24T21:43:52.545Z] getBrackets_detects_2  Time elapsed: 0.001 s
17:43:52 [2021-07-24T21:43:52.545Z] getBrackets_detects_3  Time elapsed: 0 s
17:43:52 [2021-07-24T21:43:52.545Z] hasOpenBrackets_equals_true  Time elapsed: 0 s
17:43:52 [2021-07-24T21:43:52.545Z] getBrackets_is_empty  Time elapsed: 0 s
17:43:52 [2021-07-24T21:43:52.545Z] hasOpenBrackets_equals_false  Time elapsed: 0 s
17:43:52 [2021-07-24T21:43:52.545Z] getBrackets_detects_open_brackets  Time elapsed: 0 s
17:43:52 [2021-07-24T21:43:52.545Z] getBrackets_detects_nested  Time elapsed: 0 s
17:43:52 [2021-07-24T21:43:52.545Z] Running org.eclipse.ease.ui.completion.tokenizer.InputTokenizerTest
17:43:52 [2021-07-24T21:43:52.825Z] Tests run: 46, Failures: 0, Errors: 0, Skipped: 0, Time elapsed: 0.035 s - in org.eclipse.ease.ui.completion.tokenizer.InputTokenizerTest
17:43:52 [2021-07-24T21:43:52.825Z] isDelimiter_equals_true{String}[1]  Time elapsed: 0.001 s
17:43:52 [2021-07-24T21:43:52.825Z] isDelimiter_equals_true{String}[2]  Time elapsed: 0.001 s
17:43:52 [2021-07-24T21:43:52.825Z] isDelimiter_equals_true{String}[3]  Time elapsed: 0 s
17:43:52 [2021-07-24T21:43:52.825Z] isDelimiter_equals_true{String}[4]  Time elapsed: 0 s
17:43:52 [2021-07-24T21:43:52.825Z] isDelimiter_equals_true{String}[5]  Time elapsed: 0 s
17:43:52 [2021-07-24T21:43:52.825Z] getTokens_detects_package_fragments  Time elapsed: 0.001 s
17:43:52 [2021-07-24T21:43:52.825Z] getTokens_detects_javascript_method_call  Time elapsed: 0 s
17:43:52 [2021-07-24T21:43:52.825Z] getTokens_detects_incomplete_package  Time elapsed: 0.001 s
17:43:52 [2021-07-24T21:43:52.825Z] getTokens_detects_static_method_call  Time elapsed: 0.001 s
17:43:52 [2021-07-24T21:43:52.825Z] getTokens_detects_method_call_chain  Time elapsed: 0.001 s
17:43:52 [2021-07-24T21:43:52.825Z] getTokens_detects_method_call_parameter_prefix  Time elapsed: 0 s
17:43:52 [2021-07-24T21:43:52.825Z] getTokens_detects_method_call_parameters_with_prefix  Time elapsed: 0 s
17:43:52 [2021-07-24T21:43:52.825Z] getTokens_detects_package  Time elapsed: 0 s
17:43:52 [2021-07-24T21:43:52.825Z] getTokens_detects_partial_package  Time elapsed: 0 s
17:43:52 [2021-07-24T21:43:52.825Z] getTokens_detects_class  Time elapsed: 0 s
17:43:52 [2021-07-24T21:43:52.825Z] getTokens_detects_method_call_parameter  Time elapsed: 0 s
17:43:52 [2021-07-24T21:43:52.825Z] getTokens_removes_new_operator  Time elapsed: 0 s
17:43:52 [2021-07-24T21:43:52.825Z] isDelimiter_equals_false{String}[1]  Time elapsed: 0 s
17:43:52 [2021-07-24T21:43:52.825Z] isDelimiter_equals_false{String}[2]  Time elapsed: 0 s
17:43:52 [2021-07-24T21:43:52.826Z] isDelimiter_equals_false{String}[3]  Time elapsed: 0 s
17:43:52 [2021-07-24T21:43:52.826Z] getTokens_detects_method_call_parameters  Time elapsed: 0.001 s
17:43:52 [2021-07-24T21:43:52.826Z] getTokens_detects_class_instantiation  Time elapsed: 0 s
17:43:52 [2021-07-24T21:43:52.826Z] getTokens_detects_method_call  Time elapsed: 0 s
17:43:52 [2021-07-24T21:43:52.826Z] getTokens_detects_method_call_request  Time elapsed: 0 s
17:43:52 [2021-07-24T21:43:52.826Z] getTokens_removes_left_hand_side_of_assignment  Time elapsed: 0 s
17:43:52 [2021-07-24T21:43:52.826Z] getTokens_detects_javascript_class_instantiation  Time elapsed: 0 s
17:43:52 [2021-07-24T21:43:52.826Z] getTokens_detects_resolved_javascript_variable_2  Time elapsed: 0.001 s
17:43:52 [2021-07-24T21:43:52.826Z] getTokens_detects_class_instantiation_2  Time elapsed: 0.001 s
17:43:52 [2021-07-24T21:43:52.826Z] getTokens_detects_class_instantiation_3  Time elapsed: 0 s
17:43:52 [2021-07-24T21:43:52.826Z] getTokens_detects_javascript_variable  Time elapsed: 0.001 s
17:43:52 [2021-07-24T21:43:52.826Z] getTokens_detects_class_2  Time elapsed: 0 s
17:43:52 [2021-07-24T21:43:52.826Z] isTextFilter_equals_false{String}[1]  Time elapsed: 0 s
17:43:52 [2021-07-24T21:43:52.826Z] isTextFilter_equals_false{String}[2]  Time elapsed: 0.001 s
17:43:52 [2021-07-24T21:43:52.826Z] isTextFilter_equals_false{String}[3]  Time elapsed: 0.001 s
17:43:52 [2021-07-24T21:43:52.826Z] isTextFilter_equals_false{String}[4]  Time elapsed: 0 s
17:43:52 [2021-07-24T21:43:52.826Z] isTextFilter_equals_false{String}[5]  Time elapsed: 0 s
17:43:52 [2021-07-24T21:43:52.826Z] getTokens_1  Time elapsed: 0.001 s
17:43:52 [2021-07-24T21:43:52.826Z] isTextFilter_equals_true{String}[1]  Time elapsed: 0 s
17:43:52 [2021-07-24T21:43:52.826Z] isTextFilter_equals_true{String}[2]  Time elapsed: 0 s
17:43:52 [2021-07-24T21:43:52.826Z] getTokens_detects_method_call_request_with_filter  Time elapsed: 0.001 s
17:43:52 [2021-07-24T21:43:52.826Z] getTokens_for_empty_input  Time elapsed: 0 s
17:43:52 [2021-07-24T21:43:52.826Z] getTokens_detects_package_with_class_prefix  Time elapsed: 0 s
17:43:52 [2021-07-24T21:43:52.826Z] getTokens_detects_resolved_javascript_variable_with_method  Time elapsed: 0 s
17:43:52 [2021-07-24T21:43:52.826Z] getTokens_detects_resolved_javascript_variable  Time elapsed: 0.001 s
17:43:52 [2021-07-24T21:43:52.826Z] getTokens_detects_static_method_call_chain  Time elapsed: 0.001 s
17:43:52 [2021-07-24T21:43:52.826Z] getTokens_detects_javascript_object_call  Time elapsed: 0 s
17:43:52 [2021-07-24T21:43:52.826Z] Running org.eclipse.ease.ui.views.shell.dropins.variables.VariablesComparatorTest
17:43:52 [2021-07-24T21:43:52.826Z] Tests run: 1, Failures: 0, Errors: 0, Skipped: 0, Time elapsed: 0.207 s - in org.eclipse.ease.ui.views.shell.dropins.variables.VariablesComparatorTest
17:43:52 [2021-07-24T21:43:52.826Z] lastExecutionResult_comes_before_debugVariable  Time elapsed: 0.206 s
17:43:52 [2021-07-24T21:43:52.826Z] Running org.eclipse.ease.ui.views.shell.dropins.variables.ContentLabelProviderTest
17:43:53 [2021-07-24T21:43:53.109Z] Tests run: 1, Failures: 0, Errors: 0, Skipped: 0, Time elapsed: 0.089 s - in org.eclipse.ease.ui.views.shell.dropins.variables.ContentLabelProviderTest
17:43:53 [2021-07-24T21:43:53.109Z] getText_returns_variable_content  Time elapsed: 0.089 s
17:43:53 [2021-07-24T21:43:53.109Z] Running org.eclipse.ease.ui.views.shell.dropins.variables.VariablesLabelProviderTest
17:43:53 [2021-07-24T21:43:53.109Z] Tests run: 1, Failures: 0, Errors: 0, Skipped: 0, Time elapsed: 0.002 s - in org.eclipse.ease.ui.views.shell.dropins.variables.VariablesLabelProviderTest
17:43:53 [2021-07-24T21:43:53.109Z] getText_returns_variable_name  Time elapsed: 0.002 s
17:43:53 [2021-07-24T21:43:53.109Z] Running org.eclipse.ease.ui.views.shell.dropins.variables.VariablesContentProviderTest
17:43:53 [2021-07-24T21:43:53.110Z] Tests run: 5, Failures: 0, Errors: 0, Skipped: 0, Time elapsed: 0.031 s - in org.eclipse.ease.ui.views.shell.dropins.variables.VariablesContentProviderTest
17:43:53 [2021-07-24T21:43:53.110Z] hasChildren_true_when_child_nodes_are_available  Time elapsed: 0.001 s
17:43:53 [2021-07-24T21:43:53.110Z] getChildren_is_empty_when_no_child_nodes_are_available  Time elapsed: 0 s
17:43:53 [2021-07-24T21:43:53.110Z] getElements_contains_variables_from_engine  Time elapsed: 0.028 s
17:43:53 [2021-07-24T21:43:53.110Z] hasChildren_false_when_no_child_nodes_are_available  Time elapsed: 0 s
17:43:53 [2021-07-24T21:43:53.110Z] getChildren_not_empty_when_child_nodes_are_available  Time elapsed: 0.001 s
17:43:53 [2021-07-24T21:43:53.110Z] Running org.eclipse.ease.ui.views.shell.dropins.variables.HiddenVariablesFilterTest
17:43:53 [2021-07-24T21:43:53.110Z] Tests run: 3, Failures: 0, Errors: 0, Skipped: 0, Time elapsed: 0.003 s - in org.eclipse.ease.ui.views.shell.dropins.variables.HiddenVariablesFilterTest
17:43:53 [2021-07-24T21:43:53.110Z] select_accepts_unknown_classes  Time elapsed: 0.001 s
17:43:53 [2021-07-24T21:43:53.110Z] select_accepts_script_variables  Time elapsed: 0 s
17:43:53 [2021-07-24T21:43:53.110Z] select_declines_hidden_script_variables  Time elapsed: 0 s
17:43:53 [2021-07-24T21:43:53.110Z] Running org.eclipse.ease.ui.views.shell.dropins.modules.ModulesStackContentProviderTest
17:43:53 [2021-07-24T21:43:53.110Z] Tests run: 2, Failures: 0, Errors: 0, Skipped: 0, Time elapsed: 0.028 s - in org.eclipse.ease.ui.views.shell.dropins.modules.ModulesStackContentProviderTest
17:43:53 [2021-07-24T21:43:53.110Z] getElements_returns_modules  Time elapsed: 0.028 s
17:43:53 [2021-07-24T21:43:53.110Z] getElements_returns_empty_list_without_environment  Time elapsed: 0 s
17:43:53 [2021-07-24T21:43:53.110Z] Running org.eclipse.ease.ui.views.shell.dropins.modules.ModulesStackLabelProviderTest
17:43:53 [2021-07-24T21:43:53.110Z] Tests run: 3, Failures: 0, Errors: 0, Skipped: 0, Time elapsed: 0.036 s - in org.eclipse.ease.ui.views.shell.dropins.modules.ModulesStackLabelProviderTest
17:43:53 [2021-07-24T21:43:53.110Z] getText_null_returns_empty_string  Time elapsed: 0 s
17:43:53 [2021-07-24T21:43:53.110Z] getText_returns_definition_name  Time elapsed: 0.033 s
17:43:53 [2021-07-24T21:43:53.110Z] getText_returns_full_class_name_name  Time elapsed: 0 s
17:43:53 [2021-07-24T21:43:53.110Z] Running org.eclipse.ease.ui.help.hovers.ModuleHelpTest
17:43:53 [2021-07-24T21:43:53.110Z] Tests run: 4, Failures: 0, Errors: 0, Skipped: 4, Time elapsed: 0.002 s - in org.eclipse.ease.ui.help.hovers.ModuleHelpTest
17:43:53 [2021-07-24T21:43:53.110Z] getModuleHelpLocation skipped
17:43:53 [2021-07-24T21:43:53.110Z] getModuleHelp skipped
17:43:53 [2021-07-24T21:43:53.110Z] getMethodHelp skipped
17:43:53 [2021-07-24T21:43:53.110Z] getConstantHelp skipped
17:43:53 [2021-07-24T21:43:53.110Z] Running org.eclipse.ease.ui.dnd.ModulesDropHandlerTest
17:43:53 [2021-07-24T21:43:53.110Z] Tests run: 2, Failures: 0, Errors: 0, Skipped: 0, Time elapsed: 0.035 s - in org.eclipse.ease.ui.dnd.ModulesDropHandlerTest
17:43:53 [2021-07-24T21:43:53.110Z] accepts_true_for_ModuleEntry  Time elapsed: 0.034 s
17:43:53 [2021-07-24T21:43:53.110Z] accepts_true_for_ModuleDefinition  Time elapsed: 0.001 s
17:43:53 [2021-07-24T21:43:53.110Z] 
17:43:53 [2021-07-24T21:43:53.110Z] Results:
17:43:53 [2021-07-24T21:43:53.110Z] 
17:43:53 [2021-07-24T21:43:53.110Z] Tests run: 178, Failures: 0, Errors: 0, Skipped: 4
17:43:53 [2021-07-24T21:43:53.110Z] 
17:43:53 [2021-07-24T21:43:53.368Z] [INFO] All tests passed!
17:43:53 [2021-07-24T21:43:53.369Z] [INFO] 
17:43:53 [2021-07-24T21:43:53.369Z] [INFO] --- maven-pmd-plugin:3.14.0:pmd (pmd-integration) @ org.eclipse.ease.ui.test ---
17:43:53 [2021-07-24T21:43:53.369Z] [WARNING] Unable to exclude rules [JUnit5TestShouldBePackagePrivate] from ruleset reference category/java/bestpractices.xml; perhaps the rule name is misspelled or the rule doesn't exist anymore?
17:43:53 [2021-07-24T21:43:53.369Z] [WARNING] Unable to exclude rules [JUnit5TestShouldBePackagePrivate] from ruleset reference category/java/bestpractices.xml; perhaps the rule name is misspelled or the rule doesn't exist anymore?
17:43:55 [2021-07-24T21:43:55.052Z] [INFO] 
17:43:55 [2021-07-24T21:43:55.052Z] [INFO] --- maven-pmd-plugin:3.14.0:cpd (pmd-integration) @ org.eclipse.ease.ui.test ---
17:43:55 [2021-07-24T21:43:55.052Z] [INFO] 
17:43:55 [2021-07-24T21:43:55.052Z] [INFO] --- spotbugs-maven-plugin:4.1.4:spotbugs (spotbugs-integration) @ org.eclipse.ease.ui.test ---
17:43:55 [2021-07-24T21:43:55.052Z] [INFO] Fork Value is false
17:43:55 [2021-07-24T21:43:55.052Z]      [java] JVM args ignored when same JVM is used.
17:43:59 [2021-07-24T21:43:59.309Z] [INFO] Done SpotBugs Analysis....
17:43:59 [2021-07-24T21:43:59.309Z] [INFO] 
17:43:59 [2021-07-24T21:43:59.309Z] [INFO] --- maven-checkstyle-plugin:3.1.1:check (checkstyle-integration) @ org.eclipse.ease.ui.test ---
17:43:59 [2021-07-24T21:43:59.309Z] [INFO] You have 0 Checkstyle violations.
17:43:59 [2021-07-24T21:43:59.309Z] [INFO] 
17:43:59 [2021-07-24T21:43:59.309Z] [INFO] --- maven-install-plugin:2.3.1:install (default-install) @ org.eclipse.ease.ui.test ---
17:43:59 [2021-07-24T21:43:59.309Z] [INFO] Installing /home/jenkins/agent/workspace/ease.verify.core.target.2019-03/tests/org.eclipse.ease.ui.test/target/org.eclipse.ease.ui.test-0.9.0-SNAPSHOT.jar to /home/jenkins/.m2/repository/org/eclipse/ease/org.eclipse.ease.ui.test/0.9.0-SNAPSHOT/org.eclipse.ease.ui.test-0.9.0-SNAPSHOT.jar
17:43:59 [2021-07-24T21:43:59.309Z] [INFO] Installing /home/jenkins/agent/workspace/ease.verify.core.target.2019-03/tests/org.eclipse.ease.ui.test/pom.xml to /home/jenkins/.m2/repository/org/eclipse/ease/org.eclipse.ease.ui.test/0.9.0-SNAPSHOT/org.eclipse.ease.ui.test-0.9.0-SNAPSHOT.pom
17:43:59 [2021-07-24T21:43:59.309Z] [INFO] Installing /home/jenkins/agent/workspace/ease.verify.core.target.2019-03/tests/org.eclipse.ease.ui.test/target/p2content.xml to /home/jenkins/.m2/repository/org/eclipse/ease/org.eclipse.ease.ui.test/0.9.0-SNAPSHOT/org.eclipse.ease.ui.test-0.9.0-SNAPSHOT-p2metadata.xml
17:43:59 [2021-07-24T21:43:59.309Z] [INFO] Installing /home/jenkins/agent/workspace/ease.verify.core.target.2019-03/tests/org.eclipse.ease.ui.test/target/p2artifacts.xml to /home/jenkins/.m2/repository/org/eclipse/ease/org.eclipse.ease.ui.test/0.9.0-SNAPSHOT/org.eclipse.ease.ui.test-0.9.0-SNAPSHOT-p2artifacts.xml
17:43:59 [2021-07-24T21:43:59.309Z] [INFO] 
17:43:59 [2021-07-24T21:43:59.309Z] [INFO] --- tycho-p2-plugin:2.2.0:update-local-index (default-update-local-index) @ org.eclipse.ease.ui.test ---
17:43:59 [2021-07-24T21:43:59.309Z] [INFO] 
17:43:59 [2021-07-24T21:43:59.309Z] [INFO] -----< org.eclipse.ease:org.eclipse.ease.ui.completions.java.test >-----
17:43:59 [2021-07-24T21:43:59.309Z] [INFO] Building org.eclipse.ease.ui.completions.java.test 0.9.0-SNAPSHOT [47/49]
17:43:59 [2021-07-24T21:43:59.309Z] [INFO] ------------------------[ eclipse-test-plugin ]-------------------------
17:43:59 [2021-07-24T21:43:59.309Z] [INFO] 
17:43:59 [2021-07-24T21:43:59.309Z] [INFO] --- maven-clean-plugin:2.5:clean (default-clean) @ org.eclipse.ease.ui.completions.java.test ---
17:43:59 [2021-07-24T21:43:59.310Z] [INFO] 
17:43:59 [2021-07-24T21:43:59.310Z] [INFO] --- tycho-packaging-plugin:2.2.0:build-qualifier (default-build-qualifier) @ org.eclipse.ease.ui.completions.java.test ---
17:43:59 [2021-07-24T21:43:59.310Z] [INFO] The project's OSGi version is 0.9.0.I202107211616
17:43:59 [2021-07-24T21:43:59.310Z] [INFO] 
17:43:59 [2021-07-24T21:43:59.310Z] [INFO] --- tycho-packaging-plugin:2.2.0:validate-id (default-validate-id) @ org.eclipse.ease.ui.completions.java.test ---
17:43:59 [2021-07-24T21:43:59.310Z] [INFO] 
17:43:59 [2021-07-24T21:43:59.310Z] [INFO] --- tycho-packaging-plugin:2.2.0:validate-version (default-validate-version) @ org.eclipse.ease.ui.completions.java.test ---
17:43:59 [2021-07-24T21:43:59.310Z] [INFO] 
17:43:59 [2021-07-24T21:43:59.310Z] [INFO] --- maven-resources-plugin:2.4.3:resources (default-resources) @ org.eclipse.ease.ui.completions.java.test ---
17:43:59 [2021-07-24T21:43:59.310Z] [INFO] Using 'UTF-8' encoding to copy filtered resources.
17:43:59 [2021-07-24T21:43:59.310Z] [INFO] skip non existing resourceDirectory /home/jenkins/agent/workspace/ease.verify.core.target.2019-03/tests/org.eclipse.ease.ui.completions.java.test/src/main/resources
17:43:59 [2021-07-24T21:43:59.310Z] [INFO] 
17:43:59 [2021-07-24T21:43:59.310Z] [INFO] --- tycho-compiler-plugin:2.2.0:compile (default-compile) @ org.eclipse.ease.ui.completions.java.test ---
17:43:59 [2021-07-24T21:43:59.310Z] [INFO] Compiling 4 source files to /home/jenkins/agent/workspace/ease.verify.core.target.2019-03/tests/org.eclipse.ease.ui.completions.java.test/target/classes
17:43:59 [2021-07-24T21:43:59.310Z] [INFO] 
17:43:59 [2021-07-24T21:43:59.310Z] [INFO] --- maven-resources-plugin:2.4.3:testResources (default-testResources) @ org.eclipse.ease.ui.completions.java.test ---
17:43:59 [2021-07-24T21:43:59.310Z] [INFO] Using 'UTF-8' encoding to copy filtered resources.
17:43:59 [2021-07-24T21:43:59.310Z] [INFO] skip non existing resourceDirectory /home/jenkins/agent/workspace/ease.verify.core.target.2019-03/tests/org.eclipse.ease.ui.completions.java.test/src/test/resources
17:43:59 [2021-07-24T21:43:59.310Z] [INFO] 
17:43:59 [2021-07-24T21:43:59.310Z] [INFO] --- target-platform-configuration:2.2.0:target-platform (default-target-platform) @ org.eclipse.ease.ui.completions.java.test ---
17:43:59 [2021-07-24T21:43:59.310Z] [INFO] 
17:43:59 [2021-07-24T21:43:59.310Z] [INFO] --- tycho-packaging-plugin:2.2.0:package-plugin (default-package-plugin) @ org.eclipse.ease.ui.completions.java.test ---
17:43:59 [2021-07-24T21:43:59.310Z] [INFO] Building jar: /home/jenkins/agent/workspace/ease.verify.core.target.2019-03/tests/org.eclipse.ease.ui.completions.java.test/target/org.eclipse.ease.ui.completions.java.test-0.9.0-SNAPSHOT.jar
17:43:59 [2021-07-24T21:43:59.311Z] [INFO] 
17:43:59 [2021-07-24T21:43:59.311Z] [INFO] --- tycho-p2-plugin:2.2.0:p2-metadata-default (default-p2-metadata-default) @ org.eclipse.ease.ui.completions.java.test ---
17:43:59 [2021-07-24T21:43:59.311Z] [INFO] 
17:43:59 [2021-07-24T21:43:59.311Z] [INFO] --- jacoco-maven-plugin:0.8.6:prepare-agent (jacoco-initialize) @ org.eclipse.ease.ui.completions.java.test ---
17:43:59 [2021-07-24T21:43:59.311Z] [INFO] tycho.testArgLine set to -javaagent:/home/jenkins/.m2/repository/org/jacoco/org.jacoco.agent/0.8.6/org.jacoco.agent-0.8.6-runtime.jar=destfile=/home/jenkins/agent/workspace/ease.verify.core.target.2019-03/tests/org.eclipse.ease.ui.completions.java.test/target/jacoco.exec,output=file
17:43:59 [2021-07-24T21:43:59.311Z] [INFO] 
17:43:59 [2021-07-24T21:43:59.311Z] [INFO] --- tycho-surefire-plugin:2.2.0:test (default-test) @ org.eclipse.ease.ui.completions.java.test ---
17:43:59 [2021-07-24T21:43:59.311Z] [INFO] Executing Test Runtime with timeout 0, logs (if any) will be placed at: /home/jenkins/agent/workspace/ease.verify.core.target.2019-03/tests/org.eclipse.ease.ui.completions.java.test/target/work/data/.metadata/.log
17:43:59 [2021-07-24T21:43:59.311Z] [INFO] Command line:
17:43:59 [2021-07-24T21:43:59.311Z] 	[/opt/tools/java/openjdk/jdk-15/15.0.2+7/bin/java, -Dosgi.noShutdown=false, -Dosgi.os=linux, -Dosgi.ws=gtk, -Dosgi.arch=x86_64, -javaagent:/home/jenkins/.m2/repository/org/jacoco/org.jacoco.agent/0.8.6/org.jacoco.agent-0.8.6-runtime.jar=destfile=/home/jenkins/agent/workspace/ease.verify.core.target.2019-03/tests/org.eclipse.ease.ui.completions.java.test/target/jacoco.exec,output=file, -Dosgi.clean=true, -jar, /home/jenkins/.m2/repository/p2/osgi/bundle/org.eclipse.equinox.launcher/1.6.200.v20210416-2027/org.eclipse.equinox.launcher-1.6.200.v20210416-2027.jar, -data, /home/jenkins/agent/workspace/ease.verify.core.target.2019-03/tests/org.eclipse.ease.ui.completions.java.test/target/work/data, -install, /home/jenkins/agent/workspace/ease.verify.core.target.2019-03/tests/org.eclipse.ease.ui.completions.java.test/target/work, -configuration, /home/jenkins/agent/workspace/ease.verify.core.target.2019-03/tests/org.eclipse.ease.ui.completions.java.test/target/work/configuration, -application, org.eclipse.tycho.surefire.osgibooter.headlesstest, -testproperties, /home/jenkins/agent/workspace/ease.verify.core.target.2019-03/tests/org.eclipse.ease.ui.completions.java.test/target/surefire.properties]
17:43:59 [2021-07-24T21:43:59.311Z] Picked up JAVA_TOOL_OPTIONS: -Dmaven.ext.class.path="/home/jenkins/agent/workspace/ease.verify.core.target.2019-03@tmp/withMaven2d072e6e/pipeline-maven-spy.jar" -Dorg.jenkinsci.plugins.pipeline.maven.reportsFolder="/home/jenkins/agent/workspace/ease.verify.core.target.2019-03@tmp/withMaven2d072e6e" 
17:44:03 [2021-07-24T21:44:03.710Z] Running org.eclipse.ease.ui.completions.java.provider.JavaResourcesTest
17:44:03 [2021-07-24T21:44:03.710Z] Tests run: 5, Failures: 0, Errors: 0, Skipped: 0, Time elapsed: 0.344 s - in org.eclipse.ease.ui.completions.java.provider.JavaResourcesTest
17:44:03 [2021-07-24T21:44:03.710Z] getClasses_with_filter_is_populated  Time elapsed: 0.013 s
17:44:03 [2021-07-24T21:44:03.710Z] getClasses_is_populated  Time elapsed: 0 s
17:44:03 [2021-07-24T21:44:03.710Z] singleton_exists  Time elapsed: 0 s
17:44:03 [2021-07-24T21:44:03.710Z] getPackages_is_populated  Time elapsed: 0 s
17:44:03 [2021-07-24T21:44:03.710Z] getClasses_with_filter_contains_File_class  Time elapsed: 0.001 s
17:44:03 [2021-07-24T21:44:03.710Z] Running org.eclipse.ease.ui.completions.java.provider.JavaClassCompletionProviderTest
17:44:04 [2021-07-24T21:44:04.645Z] Tests run: 10, Failures: 0, Errors: 0, Skipped: 0, Time elapsed: 0.856 s - in org.eclipse.ease.ui.completions.java.provider.JavaClassCompletionProviderTest
17:44:04 [2021-07-24T21:44:04.645Z] prepareProposals_instance_contains_class_for_package_context  Time elapsed: 0.769 s
17:44:04 [2021-07-24T21:44:04.645Z] prepareProposals_instance_contains_class_for_global_context  Time elapsed: 0.013 s
17:44:04 [2021-07-24T21:44:04.645Z] isActive_equals_false{String}[1]  Time elapsed: 0.017 s
17:44:04 [2021-07-24T21:44:04.645Z] isActive_equals_false{String}[2]  Time elapsed: 0.001 s
17:44:04 [2021-07-24T21:44:04.645Z] isActive_equals_true{String}[1]  Time elapsed: 0 s
17:44:04 [2021-07-24T21:44:04.645Z] isActive_equals_true{String}[2]  Time elapsed: 0 s
17:44:04 [2021-07-24T21:44:04.645Z] isActive_equals_true{String}[3]  Time elapsed: 0.001 s
17:44:04 [2021-07-24T21:44:04.645Z] isActive_equals_true{String}[4]  Time elapsed: 0.001 s
17:44:04 [2021-07-24T21:44:04.645Z] isActive_equals_true{String}[5]  Time elapsed: 0.001 s
17:44:04 [2021-07-24T21:44:04.645Z] isActive_equals_true{String}[6]  Time elapsed: 0 s
17:44:04 [2021-07-24T21:44:04.645Z] Running org.eclipse.ease.ui.completions.java.provider.JavaPackagesCompletionProviderTest
17:44:04 [2021-07-24T21:44:04.645Z] Tests run: 25, Failures: 0, Errors: 0, Skipped: 0, Time elapsed: 0.032 s - in org.eclipse.ease.ui.completions.java.provider.JavaPackagesCompletionProviderTest
17:44:04 [2021-07-24T21:44:04.645Z] proposal_java_preserves_suffix  Time elapsed: 0.003 s
17:44:04 [2021-07-24T21:44:04.645Z] proposal_java_appends_to_prefix  Time elapsed: 0 s
17:44:04 [2021-07-24T21:44:04.645Z] prepareProposals_instance_contains_root_package_after_new_keyword  Time elapsed: 0 s
17:44:04 [2021-07-24T21:44:04.645Z] proposal_java_replaces_filter  Time elapsed: 0 s
17:44:04 [2021-07-24T21:44:04.645Z] prepareProposals_instance_contains_sub_package  Time elapsed: 0.001 s
17:44:04 [2021-07-24T21:44:04.645Z] prepareProposals_instance_contains_3rd_level  Time elapsed: 0.001 s
17:44:04 [2021-07-24T21:44:04.645Z] isActive_equals_false{String}[1]  Time elapsed: 0.001 s
17:44:04 [2021-07-24T21:44:04.645Z] isActive_equals_false{String}[2]  Time elapsed: 0 s
17:44:04 [2021-07-24T21:44:04.645Z] prepareProposals_contains_root_package{String}[1]  Time elapsed: 0 s
17:44:04 [2021-07-24T21:44:04.646Z] prepareProposals_contains_root_package{String}[2]  Time elapsed: 0 s
17:44:04 [2021-07-24T21:44:04.646Z] prepareProposals_contains_root_package{String}[3]  Time elapsed: 0.001 s
17:44:04 [2021-07-24T21:44:04.646Z] isActive_equals_true{String}[1]  Time elapsed: 0 s
17:44:04 [2021-07-24T21:44:04.646Z] isActive_equals_true{String}[2]  Time elapsed: 0 s
17:44:04 [2021-07-24T21:44:04.646Z] isActive_equals_true{String}[3]  Time elapsed: 0.001 s
17:44:04 [2021-07-24T21:44:04.646Z] isActive_equals_true{String}[4]  Time elapsed: 0.001 s
17:44:04 [2021-07-24T21:44:04.646Z] isActive_equals_true{String}[5]  Time elapsed: 0 s
17:44:04 [2021-07-24T21:44:04.646Z] isActive_equals_true{String}[6]  Time elapsed: 0 s
17:44:04 [2021-07-24T21:44:04.646Z] isActive_equals_true{String}[7]  Time elapsed: 0.001 s
17:44:04 [2021-07-24T21:44:04.646Z] isActive_equals_true{String}[8]  Time elapsed: 0.001 s
17:44:04 [2021-07-24T21:44:04.646Z] isActive_equals_true{String}[9]  Time elapsed: 0.001 s
17:44:04 [2021-07-24T21:44:04.646Z] isActive_equals_true{String}[10]  Time elapsed: 0.001 s
17:44:04 [2021-07-24T21:44:04.646Z] isActive_equals_true{String}[11]  Time elapsed: 0.001 s
17:44:04 [2021-07-24T21:44:04.646Z] isActive_equals_true{String}[12]  Time elapsed: 0 s
17:44:04 [2021-07-24T21:44:04.646Z] isActive_equals_true{String}[13]  Time elapsed: 0 s
17:44:04 [2021-07-24T21:44:04.646Z] isActive_equals_true{String}[14]  Time elapsed: 0.001 s
17:44:04 [2021-07-24T21:44:04.646Z] Running org.eclipse.ease.ui.completions.java.provider.JavaMethodCompletionProviderTest
17:44:04 [2021-07-24T21:44:04.646Z] Tests run: 16, Failures: 0, Errors: 0, Skipped: 0, Time elapsed: 0.044 s - in org.eclipse.ease.ui.completions.java.provider.JavaMethodCompletionProviderTest
17:44:04 [2021-07-24T21:44:04.646Z] prepareProposals_class_does_not_contain_isntance_methods  Time elapsed: 0.027 s
17:44:04 [2021-07-24T21:44:04.646Z] prepareProposals_instance_contains_method_with_filter  Time elapsed: 0.001 s
17:44:04 [2021-07-24T21:44:04.646Z] prepareProposals_instance_contains_instance_methods  Time elapsed: 0.001 s
17:44:04 [2021-07-24T21:44:04.646Z] prepareProposals_class_contains_static_methods  Time elapsed: 0.001 s
17:44:04 [2021-07-24T21:44:04.646Z] prepareProposals_instance_does_not_contain_static_methods  Time elapsed: 0.001 s
17:44:04 [2021-07-24T21:44:04.646Z] prepareProposals_class_contains_static_fields  Time elapsed: 0 s
17:44:04 [2021-07-24T21:44:04.646Z] prepareProposals_instance_does_not_contain_static_fields  Time elapsed: 0 s
17:44:04 [2021-07-24T21:44:04.646Z] isActive_equals_false{String}[1]  Time elapsed: 0 s
17:44:04 [2021-07-24T21:44:04.646Z] isActive_equals_false{String}[2]  Time elapsed: 0.001 s
17:44:04 [2021-07-24T21:44:04.646Z] isActive_equals_false{String}[3]  Time elapsed: 0.001 s
17:44:04 [2021-07-24T21:44:04.646Z] isActive_equals_true{String}[1]  Time elapsed: 0 s
17:44:04 [2021-07-24T21:44:04.646Z] isActive_equals_true{String}[2]  Time elapsed: 0 s
17:44:04 [2021-07-24T21:44:04.646Z] isActive_equals_true{String}[3]  Time elapsed: 0 s
17:44:04 [2021-07-24T21:44:04.646Z] isActive_equals_true{String}[4]  Time elapsed: 0 s
17:44:04 [2021-07-24T21:44:04.646Z] isActive_equals_true{String}[5]  Time elapsed: 0.001 s
17:44:04 [2021-07-24T21:44:04.646Z] isActive_equals_true{String}[6]  Time elapsed: 0.001 s
17:44:04 [2021-07-24T21:44:04.646Z] 
17:44:04 [2021-07-24T21:44:04.646Z] Results:
17:44:04 [2021-07-24T21:44:04.646Z] 
17:44:04 [2021-07-24T21:44:04.646Z] Tests run: 56, Failures: 0, Errors: 0, Skipped: 0
17:44:04 [2021-07-24T21:44:04.646Z] 
17:44:05 [2021-07-24T21:44:05.222Z] [INFO] All tests passed!
17:44:05 [2021-07-24T21:44:05.222Z] [INFO] 
17:44:05 [2021-07-24T21:44:05.222Z] [INFO] --- maven-pmd-plugin:3.14.0:pmd (pmd-integration) @ org.eclipse.ease.ui.completions.java.test ---
17:44:05 [2021-07-24T21:44:05.222Z] [WARNING] Unable to exclude rules [JUnit5TestShouldBePackagePrivate] from ruleset reference category/java/bestpractices.xml; perhaps the rule name is misspelled or the rule doesn't exist anymore?
17:44:05 [2021-07-24T21:44:05.223Z] [WARNING] Unable to exclude rules [JUnit5TestShouldBePackagePrivate] from ruleset reference category/java/bestpractices.xml; perhaps the rule name is misspelled or the rule doesn't exist anymore?
17:44:05 [2021-07-24T21:44:05.815Z] [INFO] 
17:44:05 [2021-07-24T21:44:05.815Z] [INFO] --- maven-pmd-plugin:3.14.0:cpd (pmd-integration) @ org.eclipse.ease.ui.completions.java.test ---
17:44:05 [2021-07-24T21:44:05.815Z] [INFO] 
17:44:05 [2021-07-24T21:44:05.815Z] [INFO] --- spotbugs-maven-plugin:4.1.4:spotbugs (spotbugs-integration) @ org.eclipse.ease.ui.completions.java.test ---
17:44:05 [2021-07-24T21:44:05.815Z] [INFO] Fork Value is false
17:44:05 [2021-07-24T21:44:05.815Z]      [java] JVM args ignored when same JVM is used.
17:44:09 [2021-07-24T21:44:09.190Z] [INFO] Done SpotBugs Analysis....
17:44:09 [2021-07-24T21:44:09.190Z] [INFO] 
17:44:09 [2021-07-24T21:44:09.190Z] [INFO] --- maven-checkstyle-plugin:3.1.1:check (checkstyle-integration) @ org.eclipse.ease.ui.completions.java.test ---
17:44:09 [2021-07-24T21:44:09.190Z] [INFO] You have 0 Checkstyle violations.
17:44:09 [2021-07-24T21:44:09.190Z] [INFO] 
17:44:09 [2021-07-24T21:44:09.190Z] [INFO] --- maven-install-plugin:2.3.1:install (default-install) @ org.eclipse.ease.ui.completions.java.test ---
17:44:09 [2021-07-24T21:44:09.190Z] [INFO] Installing /home/jenkins/agent/workspace/ease.verify.core.target.2019-03/tests/org.eclipse.ease.ui.completions.java.test/target/org.eclipse.ease.ui.completions.java.test-0.9.0-SNAPSHOT.jar to /home/jenkins/.m2/repository/org/eclipse/ease/org.eclipse.ease.ui.completions.java.test/0.9.0-SNAPSHOT/org.eclipse.ease.ui.completions.java.test-0.9.0-SNAPSHOT.jar
17:44:09 [2021-07-24T21:44:09.190Z] [INFO] Installing /home/jenkins/agent/workspace/ease.verify.core.target.2019-03/tests/org.eclipse.ease.ui.completions.java.test/pom.xml to /home/jenkins/.m2/repository/org/eclipse/ease/org.eclipse.ease.ui.completions.java.test/0.9.0-SNAPSHOT/org.eclipse.ease.ui.completions.java.test-0.9.0-SNAPSHOT.pom
17:44:09 [2021-07-24T21:44:09.190Z] [INFO] Installing /home/jenkins/agent/workspace/ease.verify.core.target.2019-03/tests/org.eclipse.ease.ui.completions.java.test/target/p2content.xml to /home/jenkins/.m2/repository/org/eclipse/ease/org.eclipse.ease.ui.completions.java.test/0.9.0-SNAPSHOT/org.eclipse.ease.ui.completions.java.test-0.9.0-SNAPSHOT-p2metadata.xml
17:44:09 [2021-07-24T21:44:09.191Z] [INFO] Installing /home/jenkins/agent/workspace/ease.verify.core.target.2019-03/tests/org.eclipse.ease.ui.completions.java.test/target/p2artifacts.xml to /home/jenkins/.m2/repository/org/eclipse/ease/org.eclipse.ease.ui.completions.java.test/0.9.0-SNAPSHOT/org.eclipse.ease.ui.completions.java.test-0.9.0-SNAPSHOT-p2artifacts.xml
17:44:09 [2021-07-24T21:44:09.191Z] [INFO] 
17:44:09 [2021-07-24T21:44:09.191Z] [INFO] --- tycho-p2-plugin:2.2.0:update-local-index (default-update-local-index) @ org.eclipse.ease.ui.completions.java.test ---
17:44:09 [2021-07-24T21:44:09.191Z] [INFO] 
17:44:09 [2021-07-24T21:44:09.191Z] [INFO] ---------< org.eclipse.ease:org.eclipse.ease.releng.coverage >----------
17:44:09 [2021-07-24T21:44:09.191Z] [INFO] Building org.eclipse.ease.releng.coverage 0.9.0-SNAPSHOT         [48/49]
17:44:09 [2021-07-24T21:44:09.191Z] [INFO] --------------------------------[ pom ]---------------------------------
17:44:09 [2021-07-24T21:44:09.191Z] [INFO] 
17:44:09 [2021-07-24T21:44:09.191Z] [INFO] --- maven-clean-plugin:2.5:clean (default-clean) @ org.eclipse.ease.releng.coverage ---
17:44:09 [2021-07-24T21:44:09.191Z] [INFO] 
17:44:09 [2021-07-24T21:44:09.191Z] [INFO] --- jacoco-maven-plugin:0.8.6:report-aggregate (default) @ org.eclipse.ease.releng.coverage ---
17:44:09 [2021-07-24T21:44:09.191Z] [INFO] Loading execution data file /home/jenkins/agent/workspace/ease.verify.core.target.2019-03/tests/org.eclipse.ease.test/target/jacoco.exec
17:44:09 [2021-07-24T21:44:09.191Z] [INFO] Loading execution data file /home/jenkins/agent/workspace/ease.verify.core.target.2019-03/tests/org.eclipse.ease.lang.javascript.rhino.test/target/jacoco.exec
17:44:09 [2021-07-24T21:44:09.191Z] [INFO] Loading execution data file /home/jenkins/agent/workspace/ease.verify.core.target.2019-03/tests/org.eclipse.ease.lang.javascript.test/target/jacoco.exec
17:44:09 [2021-07-24T21:44:09.191Z] [INFO] Loading execution data file /home/jenkins/agent/workspace/ease.verify.core.target.2019-03/tests/org.eclipse.ease.lang.python.test/target/jacoco.exec
17:44:09 [2021-07-24T21:44:09.191Z] [INFO] Loading execution data file /home/jenkins/agent/workspace/ease.verify.core.target.2019-03/tests/org.eclipse.ease.lang.python.jython.test/target/jacoco.exec
17:44:09 [2021-07-24T21:44:09.191Z] [INFO] Loading execution data file /home/jenkins/agent/workspace/ease.verify.core.target.2019-03/tests/org.eclipse.ease.lang.scriptarchive.test/target/jacoco.exec
17:44:09 [2021-07-24T21:44:09.191Z] [INFO] Loading execution data file /home/jenkins/agent/workspace/ease.verify.core.target.2019-03/tests/org.eclipse.ease.ui.scripts.test/target/jacoco.exec
17:44:09 [2021-07-24T21:44:09.191Z] [INFO] Loading execution data file /home/jenkins/agent/workspace/ease.verify.core.target.2019-03/tests/org.eclipse.ease.ui.test/target/jacoco.exec
17:44:09 [2021-07-24T21:44:09.191Z] [INFO] Loading execution data file /home/jenkins/agent/workspace/ease.verify.core.target.2019-03/tests/org.eclipse.ease.ui.completions.java.test/target/jacoco.exec
17:44:09 [2021-07-24T21:44:09.191Z] [INFO] Analyzed bundle 'org.eclipse.ease' with 106 classes
17:44:09 [2021-07-24T21:44:09.460Z] [INFO] Analyzed bundle 'org.eclipse.ease.classloader' with 1 classes
17:44:09 [2021-07-24T21:44:09.719Z] [INFO] Analyzed bundle 'org.eclipse.ease.ui' with 212 classes
17:44:09 [2021-07-24T21:44:09.977Z] [INFO] Analyzed bundle 'org.eclipse.ease.ui.completions.java' with 14 classes
17:44:10 [2021-07-24T21:44:10.236Z] [INFO] Analyzed bundle 'org.eclipse.ease.ui.scripts' with 157 classes
17:44:10 [2021-07-24T21:44:10.236Z] [INFO] Analyzed bundle 'org.eclipse.ease.help' with 0 classes
17:44:10 [2021-07-24T21:44:10.237Z] [INFO] Analyzed bundle 'org.eclipse.ease.lang.javascript' with 5 classes
17:44:10 [2021-07-24T21:44:10.237Z] [INFO] Analyzed bundle 'org.eclipse.ease.lang.javascript.ui' with 4 classes
17:44:10 [2021-07-24T21:44:10.237Z] [INFO] Analyzed bundle 'org.eclipse.ease.lang.javascript.rhino' with 21 classes
17:44:10 [2021-07-24T21:44:10.237Z] [INFO] Analyzed bundle 'org.eclipse.ease.lang.javascript.nashorn' with 2 classes
17:44:10 [2021-07-24T21:44:10.237Z] [INFO] Analyzed bundle 'org.eclipse.ease.lang.python' with 22 classes
17:44:10 [2021-07-24T21:44:10.237Z] [INFO] Analyzed bundle 'org.eclipse.ease.lang.python.jython' with 13 classes
17:44:10 [2021-07-24T21:44:10.237Z] [INFO] Analyzed bundle 'org.eclipse.ease.lang.python.py4j' with 11 classes
17:44:10 [2021-07-24T21:44:10.237Z] [INFO] Analyzed bundle 'org.eclipse.ease.lang.jvm.compiled' with 2 classes
17:44:10 [2021-07-24T21:44:10.237Z] [INFO] Analyzed bundle 'org.eclipse.ease.lang.groovy' with 3 classes
17:44:10 [2021-07-24T21:44:10.237Z] [INFO] Analyzed bundle 'org.eclipse.ease.lang.groovy.interpreter' with 3 classes
17:44:10 [2021-07-24T21:44:10.495Z] [INFO] Analyzed bundle 'org.eclipse.ease.lang.ruby' with 3 classes
17:44:10 [2021-07-24T21:44:10.495Z] [INFO] Analyzed bundle 'org.eclipse.ease.lang.ruby.jruby' with 2 classes
17:44:10 [2021-07-24T21:44:10.495Z] [INFO] Analyzed bundle 'org.eclipse.ease.lang.scriptarchive' with 3 classes
17:44:10 [2021-07-24T21:44:10.495Z] [INFO] Analyzed bundle 'org.eclipse.ease.lang.scriptarchive.ui' with 8 classes
17:44:10 [2021-07-24T21:44:10.495Z] [INFO] Analyzed bundle 'org.eclipse.ease.lang.unittest' with 50 classes
17:44:10 [2021-07-24T21:44:10.495Z] [INFO] Analyzed bundle 'org.eclipse.ease.lang.unittest.ui' with 79 classes
17:44:10 [2021-07-24T21:44:10.753Z] [INFO] 
17:44:10 [2021-07-24T21:44:10.753Z] [INFO] --- maven-install-plugin:2.4:install (default-install) @ org.eclipse.ease.releng.coverage ---
17:44:10 [2021-07-24T21:44:10.753Z] [INFO] Installing /home/jenkins/agent/workspace/ease.verify.core.target.2019-03/releng/org.eclipse.ease.releng.coverage/pom.xml to /home/jenkins/.m2/repository/org/eclipse/ease/org.eclipse.ease.releng.coverage/0.9.0-SNAPSHOT/org.eclipse.ease.releng.coverage-0.9.0-SNAPSHOT.pom
17:44:10 [2021-07-24T21:44:10.753Z] [INFO] 
17:44:10 [2021-07-24T21:44:10.753Z] [INFO] ---------------------< org.eclipse.ease:ease.core >---------------------
17:44:10 [2021-07-24T21:44:10.753Z] [INFO] Building EASE (Incubation) 0.4.0-SNAPSHOT                        [49/49]
17:44:10 [2021-07-24T21:44:10.753Z] [INFO] --------------------------------[ pom ]---------------------------------
17:44:10 [2021-07-24T21:44:10.753Z] [INFO] 
17:44:10 [2021-07-24T21:44:10.754Z] [INFO] --- maven-clean-plugin:2.5:clean (default-clean) @ ease.core ---
17:44:10 [2021-07-24T21:44:10.754Z] [INFO] 
17:44:10 [2021-07-24T21:44:10.754Z] [INFO] --- maven-install-plugin:2.4:install (default-install) @ ease.core ---
17:44:10 [2021-07-24T21:44:10.754Z] [INFO] Installing /home/jenkins/agent/workspace/ease.verify.core.target.2019-03/pom.xml to /home/jenkins/.m2/repository/org/eclipse/ease/ease.core/0.4.0-SNAPSHOT/ease.core-0.4.0-SNAPSHOT.pom
17:44:10 [2021-07-24T21:44:10.754Z] [INFO] ------------------------------------------------------------------------
17:44:10 [2021-07-24T21:44:10.754Z] [INFO] Reactor Summary:
17:44:10 [2021-07-24T21:44:10.754Z] [INFO] 
17:44:10 [2021-07-24T21:44:10.754Z] [INFO] org.eclipse.ease.classloader 0.9.0-SNAPSHOT ........ SUCCESS [ 35.338 s]
17:44:10 [2021-07-24T21:44:10.754Z] [INFO] org.eclipse.ease 0.9.0-SNAPSHOT .................... SUCCESS [ 15.256 s]
17:44:10 [2021-07-24T21:44:10.754Z] [INFO] org.eclipse.ease.ui 0.9.0-SNAPSHOT ................. SUCCESS [ 18.345 s]
17:44:10 [2021-07-24T21:44:10.754Z] [INFO] org.eclipse.ease.ui.completions.java 0.9.0-SNAPSHOT  SUCCESS [  7.386 s]
17:44:10 [2021-07-24T21:44:10.754Z] [INFO] org.eclipse.ease.ui.scripts 0.9.0-SNAPSHOT ......... SUCCESS [ 15.212 s]
17:44:10 [2021-07-24T21:44:10.754Z] [INFO] org.eclipse.ease.releng 0.9.0-SNAPSHOT ............. SUCCESS [  0.328 s]
17:44:10 [2021-07-24T21:44:10.754Z] [INFO] org.eclipse.ease.lang.javascript 0.9.0-SNAPSHOT .... SUCCESS [  4.872 s]
17:44:10 [2021-07-24T21:44:10.754Z] [INFO] org.eclipse.ease.lang.scriptarchive 0.9.0-SNAPSHOT . SUCCESS [  4.562 s]
17:44:10 [2021-07-24T21:44:10.754Z] [INFO] org.eclipse.ease.lang.python 0.9.0-SNAPSHOT ........ SUCCESS [  7.271 s]
17:44:10 [2021-07-24T21:44:10.754Z] [INFO] org.eclipse.ease.lang.python.py4j 0.9.0-SNAPSHOT ... SUCCESS [  6.370 s]
17:44:10 [2021-07-24T21:44:10.754Z] [INFO] org.eclipse.ease.lang.groovy 0.9.0-SNAPSHOT ........ SUCCESS [  4.532 s]
17:44:10 [2021-07-24T21:44:10.754Z] [INFO] org.eclipse.ease.lang.groovy.interpreter 0.9.0-SNAPSHOT SUCCESS [  5.163 s]
17:44:10 [2021-07-24T21:44:10.754Z] [INFO] org.eclipse.ease.lang.unittest 0.9.0-SNAPSHOT ...... SUCCESS [ 10.188 s]
17:44:10 [2021-07-24T21:44:10.754Z] [INFO] org.eclipse.ease.lang.unittest.ui 0.9.0-SNAPSHOT ... SUCCESS [ 11.497 s]
17:44:10 [2021-07-24T21:44:10.754Z] [INFO] org.eclipse.ease.lang.ruby 0.9.0-SNAPSHOT .......... SUCCESS [  5.183 s]
17:44:10 [2021-07-24T21:44:10.754Z] [INFO] org.eclipse.ease.lang.ruby.jruby 0.9.0-SNAPSHOT .... SUCCESS [  5.238 s]
17:44:10 [2021-07-24T21:44:10.754Z] [INFO] org.eclipse.ease.lang.javascript.nashorn 0.9.0-SNAPSHOT SUCCESS [  5.336 s]
17:44:10 [2021-07-24T21:44:10.754Z] [INFO] org.eclipse.ease.lang.javascript.rhino 0.9.0-SNAPSHOT SUCCESS [  7.590 s]
17:44:10 [2021-07-24T21:44:10.754Z] [INFO] org.eclipse.ease.lang.python.jython 0.9.0-SNAPSHOT . SUCCESS [  7.516 s]
17:44:10 [2021-07-24T21:44:10.754Z] [INFO] org.eclipse.ease.lang.javascript.ui 0.9.0-SNAPSHOT . SUCCESS [  5.254 s]
17:44:10 [2021-07-24T21:44:10.754Z] [INFO] org.eclipse.ease.lang.jvm.compiled 0.9.0-SNAPSHOT .. SUCCESS [  5.104 s]
17:44:10 [2021-07-24T21:44:10.754Z] [INFO] org.eclipse.ease.lang.scriptarchive.ui 0.9.0-SNAPSHOT SUCCESS [  5.712 s]
17:44:10 [2021-07-24T21:44:10.754Z] [INFO] org.eclipse.ease.help 0.9.0-SNAPSHOT ............... SUCCESS [  7.652 s]
17:44:10 [2021-07-24T21:44:10.754Z] [INFO] org.eclipse.ease.feature 0.9.0-SNAPSHOT ............ SUCCESS [  0.168 s]
17:44:10 [2021-07-24T21:44:10.754Z] [INFO] org.eclipse.ease.ui.feature 0.9.0-SNAPSHOT ......... SUCCESS [  0.113 s]
17:44:10 [2021-07-24T21:44:10.754Z] [INFO] org.eclipse.ease.lang.javascript.feature 0.9.0-SNAPSHOT SUCCESS [  0.117 s]
17:44:10 [2021-07-24T21:44:10.754Z] [INFO] org.eclipse.ease.lang.python.feature 0.9.0-SNAPSHOT  SUCCESS [  0.088 s]
17:44:10 [2021-07-24T21:44:10.754Z] [INFO] org.eclipse.ease.python.jython.feature 0.9.0-SNAPSHOT SUCCESS [  0.096 s]
17:44:10 [2021-07-24T21:44:10.754Z] [INFO] org.eclipse.ease.lang.python.py4j.feature 0.9.0-SNAPSHOT SUCCESS [  0.121 s]
17:44:10 [2021-07-24T21:44:10.754Z] [INFO] org.eclipse.ease.lang.jvm.feature 0.9.0-SNAPSHOT ... SUCCESS [  0.179 s]
17:44:10 [2021-07-24T21:44:10.754Z] [INFO] org.eclipse.ease.lang.groovy.feature 0.9.0-SNAPSHOT  SUCCESS [  0.091 s]
17:44:10 [2021-07-24T21:44:10.755Z] [INFO] org.eclipse.ease.lang.ruby.feature 0.9.0-SNAPSHOT .. SUCCESS [  0.108 s]
17:44:10 [2021-07-24T21:44:10.755Z] [INFO] org.eclipse.ease.lang.scriptarchive.feature 0.9.0-SNAPSHOT SUCCESS [  0.109 s]
17:44:10 [2021-07-24T21:44:10.755Z] [INFO] org.eclipse.ease.lang.unittest.feature 0.9.0-SNAPSHOT SUCCESS [  0.084 s]
17:44:10 [2021-07-24T21:44:10.755Z] [INFO] org.eclipse.ease.releng.target 0.9.0-SNAPSHOT ...... SUCCESS [  0.004 s]
17:44:10 [2021-07-24T21:44:10.755Z] [INFO] org.eclipse.ease.releng.p2 0.9.0-SNAPSHOT .......... SUCCESS [  4.434 s]
17:44:10 [2021-07-24T21:44:10.755Z] [INFO] org.eclipse.ease.testhelper 0.9.0-SNAPSHOT ......... SUCCESS [  8.093 s]
17:44:10 [2021-07-24T21:44:10.755Z] [INFO] org.eclipse.ease.test 0.9.0-SNAPSHOT ............... SUCCESS [ 34.727 s]
17:44:10 [2021-07-24T21:44:10.755Z] [INFO] org.eclipse.ease.lang.javascript.rhino.test 0.9.0-SNAPSHOT SUCCESS [ 22.276 s]
17:44:10 [2021-07-24T21:44:10.755Z] [INFO] org.eclipse.ease.lang.javascript.test 0.9.0-SNAPSHOT SUCCESS [  7.461 s]
17:44:10 [2021-07-24T21:44:10.755Z] [INFO] org.eclipse.ease.lang.python.test 0.9.0-SNAPSHOT ... SUCCESS [  7.621 s]
17:44:10 [2021-07-24T21:44:10.755Z] [INFO] org.eclipse.ease.lang.python.jython.test 0.9.0-SNAPSHOT SUCCESS [ 23.923 s]
17:44:10 [2021-07-24T21:44:10.755Z] [INFO] org.eclipse.ease.lang.scriptarchive.test 0.9.0-SNAPSHOT SUCCESS [  8.923 s]
17:44:10 [2021-07-24T21:44:10.755Z] [INFO] org.eclipse.ease.lang.unittest.test 0.9.0-SNAPSHOT . SUCCESS [  6.007 s]
17:44:10 [2021-07-24T21:44:10.755Z] [INFO] org.eclipse.ease.ui.scripts.test 0.9.0-SNAPSHOT .... SUCCESS [  6.772 s]
17:44:10 [2021-07-24T21:44:10.755Z] [INFO] org.eclipse.ease.ui.test 0.9.0-SNAPSHOT ............ SUCCESS [ 12.393 s]
17:44:10 [2021-07-24T21:44:10.755Z] [INFO] org.eclipse.ease.ui.completions.java.test 0.9.0-SNAPSHOT SUCCESS [  9.988 s]
17:44:10 [2021-07-24T21:44:10.755Z] [INFO] org.eclipse.ease.releng.coverage 0.9.0-SNAPSHOT .... SUCCESS [  1.782 s]
17:44:10 [2021-07-24T21:44:10.755Z] [INFO] EASE (Incubation) 0.4.0-SNAPSHOT ................... SUCCESS [  0.198 s]
17:44:10 [2021-07-24T21:44:10.755Z] [INFO] ------------------------------------------------------------------------
17:44:10 [2021-07-24T21:44:10.755Z] [INFO] BUILD SUCCESS
17:44:10 [2021-07-24T21:44:10.755Z] [INFO] ------------------------------------------------------------------------
17:44:10 [2021-07-24T21:44:10.755Z] [INFO] Total time:  08:09 min
17:44:10 [2021-07-24T21:44:10.755Z] [INFO] Finished at: 2021-07-24T21:44:10Z
17:44:10 [2021-07-24T21:44:10.755Z] [INFO] ------------------------------------------------------------------------
17:44:10 [2021-07-24T21:44:10.755Z] [INFO] [jenkins-event-spy] Generated /home/jenkins/agent/workspace/ease.verify.core.target.2019-03@tmp/withMaven2d072e6e/maven-spy-20210724-213601-183361709134577838019.log