SuccessConsole Output

Skipping 964 KB.. Full Log
16-2027.jar, -data, /home/jenkins/agent/workspace/ease.verify.core.target.2019-03/tests/org.eclipse.ease.lang.scriptarchive.test/target/work/data, -install, /home/jenkins/agent/workspace/ease.verify.core.target.2019-03/tests/org.eclipse.ease.lang.scriptarchive.test/target/work, -configuration, /home/jenkins/agent/workspace/ease.verify.core.target.2019-03/tests/org.eclipse.ease.lang.scriptarchive.test/target/work/configuration, -application, org.eclipse.tycho.surefire.osgibooter.headlesstest, -testproperties, /home/jenkins/agent/workspace/ease.verify.core.target.2019-03/tests/org.eclipse.ease.lang.scriptarchive.test/target/surefire.properties]
17:44:24 [2021-07-10T21:44:24.679Z] Picked up JAVA_TOOL_OPTIONS: -Dmaven.ext.class.path="/home/jenkins/agent/workspace/ease.verify.core.target.2019-03@tmp/withMaven6748b77a/pipeline-maven-spy.jar" -Dorg.jenkinsci.plugins.pipeline.maven.reportsFolder="/home/jenkins/agent/workspace/ease.verify.core.target.2019-03@tmp/withMaven6748b77a" 
17:44:29 [2021-07-10T21:44:29.999Z] Jul 10, 2021 9:44:29 PM org.junit.platform.launcher.core.DefaultLauncher handleThrowable
17:44:29 [2021-07-10T21:44:29.999Z] WARNING: TestEngine with ID 'junit-vintage' failed to discover tests
17:44:29 [2021-07-10T21:44:29.999Z] java.lang.NoClassDefFoundError: org/junit/runners/model/RunnerBuilder
17:44:29 [2021-07-10T21:44:29.999Z] 	at org.junit.vintage.engine.discovery.VintageDiscoverer.<init>(VintageDiscoverer.java:48)
17:44:29 [2021-07-10T21:44:29.999Z] 	at org.junit.vintage.engine.VintageTestEngine.discover(VintageTestEngine.java:65)
17:44:29 [2021-07-10T21:44:29.999Z] 	at org.junit.platform.launcher.core.DefaultLauncher.discoverEngineRoot(DefaultLauncher.java:130)
17:44:29 [2021-07-10T21:44:29.999Z] 	at org.junit.platform.launcher.core.DefaultLauncher.discoverRoot(DefaultLauncher.java:117)
17:44:29 [2021-07-10T21:44:29.999Z] 	at org.junit.platform.launcher.core.DefaultLauncher.discover(DefaultLauncher.java:82)
17:44:29 [2021-07-10T21:44:29.999Z] 	at org.apache.maven.surefire.junitplatform.TestPlanScannerFilter.accept(TestPlanScannerFilter.java:56)
17:44:29 [2021-07-10T21:44:29.999Z] 	at org.apache.maven.surefire.util.DefaultScanResult.applyFilter(DefaultScanResult.java:102)
17:44:29 [2021-07-10T21:44:29.999Z] 	at org.apache.maven.surefire.junitplatform.JUnitPlatformProvider.scanClasspath(JUnitPlatformProvider.java:143)
17:44:29 [2021-07-10T21:44:29.999Z] 	at org.apache.maven.surefire.junitplatform.JUnitPlatformProvider.invoke(JUnitPlatformProvider.java:124)
17:44:29 [2021-07-10T21:44:29.999Z] 	at java.base/jdk.internal.reflect.NativeMethodAccessorImpl.invoke0(Native Method)
17:44:29 [2021-07-10T21:44:29.999Z] 	at java.base/jdk.internal.reflect.NativeMethodAccessorImpl.invoke(NativeMethodAccessorImpl.java:64)
17:44:29 [2021-07-10T21:44:29.999Z] 	at java.base/jdk.internal.reflect.DelegatingMethodAccessorImpl.invoke(DelegatingMethodAccessorImpl.java:43)
17:44:29 [2021-07-10T21:44:29.999Z] 	at java.base/java.lang.reflect.Method.invoke(Method.java:564)
17:44:29 [2021-07-10T21:44:29.999Z] 	at org.apache.maven.surefire.util.ReflectionUtils.invokeMethodWithArray2(ReflectionUtils.java:206)
17:44:29 [2021-07-10T21:44:29.999Z] 	at org.apache.maven.surefire.booter.ProviderFactory$ProviderProxy.invoke(ProviderFactory.java:161)
17:44:29 [2021-07-10T21:44:29.999Z] 	at org.apache.maven.surefire.booter.ProviderFactory.invokeProvider(ProviderFactory.java:84)
17:44:29 [2021-07-10T21:44:29.999Z] 	at org.eclipse.tycho.surefire.osgibooter.OsgiSurefireBooter.run(OsgiSurefireBooter.java:116)
17:44:29 [2021-07-10T21:44:29.999Z] 	at org.eclipse.tycho.surefire.osgibooter.HeadlessTestApplication.start(HeadlessTestApplication.java:23)
17:44:29 [2021-07-10T21:44:29.999Z] 	at org.eclipse.equinox.internal.app.EclipseAppHandle.run(EclipseAppHandle.java:203)
17:44:29 [2021-07-10T21:44:29.999Z] 	at org.eclipse.core.runtime.internal.adaptor.EclipseAppLauncher.runApplication(EclipseAppLauncher.java:134)
17:44:29 [2021-07-10T21:44:29.999Z] 	at org.eclipse.core.runtime.internal.adaptor.EclipseAppLauncher.start(EclipseAppLauncher.java:104)
17:44:29 [2021-07-10T21:44:29.999Z] 	at org.eclipse.core.runtime.adaptor.EclipseStarter.run(EclipseStarter.java:401)
17:44:29 [2021-07-10T21:44:29.999Z] 	at org.eclipse.core.runtime.adaptor.EclipseStarter.run(EclipseStarter.java:255)
17:44:29 [2021-07-10T21:44:29.999Z] 	at java.base/jdk.internal.reflect.NativeMethodAccessorImpl.invoke0(Native Method)
17:44:29 [2021-07-10T21:44:29.999Z] 	at java.base/jdk.internal.reflect.NativeMethodAccessorImpl.invoke(NativeMethodAccessorImpl.java:64)
17:44:29 [2021-07-10T21:44:29.999Z] 	at java.base/jdk.internal.reflect.DelegatingMethodAccessorImpl.invoke(DelegatingMethodAccessorImpl.java:43)
17:44:29 [2021-07-10T21:44:29.999Z] 	at java.base/java.lang.reflect.Method.invoke(Method.java:564)
17:44:29 [2021-07-10T21:44:29.999Z] 	at org.eclipse.equinox.launcher.Main.invokeFramework(Main.java:654)
17:44:29 [2021-07-10T21:44:29.999Z] 	at org.eclipse.equinox.launcher.Main.basicRun(Main.java:591)
17:44:29 [2021-07-10T21:44:29.999Z] 	at org.eclipse.equinox.launcher.Main.run(Main.java:1462)
17:44:29 [2021-07-10T21:44:29.999Z] 	at org.eclipse.equinox.launcher.Main.main(Main.java:1435)
17:44:29 [2021-07-10T21:44:29.999Z] Caused by: java.lang.ClassNotFoundException: org.junit.runners.model.RunnerBuilder cannot be found by org.eclipse.tycho.surefire.osgibooter_2.2.0
17:44:29 [2021-07-10T21:44:29.999Z] 	at org.eclipse.osgi.internal.loader.BundleLoader.findClass(BundleLoader.java:519)
17:44:29 [2021-07-10T21:44:29.999Z] 	at org.eclipse.osgi.internal.loader.ModuleClassLoader.loadClass(ModuleClassLoader.java:170)
17:44:29 [2021-07-10T21:44:29.999Z] 	at java.base/java.lang.ClassLoader.loadClass(ClassLoader.java:522)
17:44:29 [2021-07-10T21:44:29.999Z] 	... 31 more
17:44:29 [2021-07-10T21:44:29.999Z] 
17:44:29 [2021-07-10T21:44:29.999Z] Jul 10, 2021 9:44:29 PM org.junit.platform.launcher.core.DefaultLauncher handleThrowable
17:44:29 [2021-07-10T21:44:29.999Z] WARNING: TestEngine with ID 'junit-vintage' failed to discover tests
17:44:29 [2021-07-10T21:44:29.999Z] java.lang.NoClassDefFoundError: org/junit/runners/model/RunnerBuilder
17:44:29 [2021-07-10T21:44:29.999Z] 	at org.junit.vintage.engine.discovery.VintageDiscoverer.<init>(VintageDiscoverer.java:48)
17:44:29 [2021-07-10T21:44:29.999Z] 	at org.junit.vintage.engine.VintageTestEngine.discover(VintageTestEngine.java:65)
17:44:29 [2021-07-10T21:44:29.999Z] 	at org.junit.platform.launcher.core.DefaultLauncher.discoverEngineRoot(DefaultLauncher.java:130)
17:44:29 [2021-07-10T21:44:29.999Z] 	at org.junit.platform.launcher.core.DefaultLauncher.discoverRoot(DefaultLauncher.java:117)
17:44:29 [2021-07-10T21:44:29.999Z] 	at org.junit.platform.launcher.core.DefaultLauncher.execute(DefaultLauncher.java:90)
17:44:29 [2021-07-10T21:44:29.999Z] 	at org.apache.maven.surefire.junitplatform.JUnitPlatformProvider.invokeAllTests(JUnitPlatformProvider.java:150)
17:44:29 [2021-07-10T21:44:29.999Z] 	at org.apache.maven.surefire.junitplatform.JUnitPlatformProvider.invoke(JUnitPlatformProvider.java:124)
17:44:29 [2021-07-10T21:44:29.999Z] 	at java.base/jdk.internal.reflect.NativeMethodAccessorImpl.invoke0(Native Method)
17:44:29 [2021-07-10T21:44:29.999Z] 	at java.base/jdk.internal.reflect.NativeMethodAccessorImpl.invoke(NativeMethodAccessorImpl.java:64)
17:44:29 [2021-07-10T21:44:29.999Z] 	at java.base/jdk.internal.reflect.DelegatingMethodAccessorImpl.invoke(DelegatingMethodAccessorImpl.java:43)
17:44:29 [2021-07-10T21:44:29.999Z] 	at java.base/java.lang.reflect.Method.invoke(Method.java:564)
17:44:29 [2021-07-10T21:44:29.999Z] 	at org.apache.maven.surefire.util.ReflectionUtils.invokeMethodWithArray2(ReflectionUtils.java:206)
17:44:29 [2021-07-10T21:44:29.999Z] 	at org.apache.maven.surefire.booter.ProviderFactory$ProviderProxy.invoke(ProviderFactory.java:161)
17:44:29 [2021-07-10T21:44:29.999Z] 	at org.apache.maven.surefire.booter.ProviderFactory.invokeProvider(ProviderFactory.java:84)
17:44:29 [2021-07-10T21:44:29.999Z] 	at org.eclipse.tycho.surefire.osgibooter.OsgiSurefireBooter.run(OsgiSurefireBooter.java:116)
17:44:29 [2021-07-10T21:44:29.999Z] 	at org.eclipse.tycho.surefire.osgibooter.HeadlessTestApplication.start(HeadlessTestApplication.java:23)
17:44:29 [2021-07-10T21:44:29.999Z] 	at org.eclipse.equinox.internal.app.EclipseAppHandle.run(EclipseAppHandle.java:203)
17:44:29 [2021-07-10T21:44:29.999Z] 	at org.eclipse.core.runtime.internal.adaptor.EclipseAppLauncher.runApplication(EclipseAppLauncher.java:134)
17:44:29 [2021-07-10T21:44:29.999Z] 	at org.eclipse.core.runtime.internal.adaptor.EclipseAppLauncher.start(EclipseAppLauncher.java:104)
17:44:29 [2021-07-10T21:44:29.999Z] 	at org.eclipse.core.runtime.adaptor.EclipseStarter.run(EclipseStarter.java:401)
17:44:29 [2021-07-10T21:44:29.999Z] 	at org.eclipse.core.runtime.adaptor.EclipseStarter.run(EclipseStarter.java:255)
17:44:29 [2021-07-10T21:44:29.999Z] 	at java.base/jdk.internal.reflect.NativeMethodAccessorImpl.invoke0(Native Method)
17:44:29 [2021-07-10T21:44:29.999Z] 	at java.base/jdk.internal.reflect.NativeMethodAccessorImpl.invoke(NativeMethodAccessorImpl.java:64)
17:44:29 [2021-07-10T21:44:29.999Z] 	at java.base/jdk.internal.reflect.DelegatingMethodAccessorImpl.invoke(DelegatingMethodAccessorImpl.java:43)
17:44:29 [2021-07-10T21:44:29.999Z] 	at java.base/java.lang.reflect.Method.invoke(Method.java:564)
17:44:29 [2021-07-10T21:44:29.999Z] 	at org.eclipse.equinox.launcher.Main.invokeFramework(Main.java:654)
17:44:29 [2021-07-10T21:44:29.999Z] 	at org.eclipse.equinox.launcher.Main.basicRun(Main.java:591)
17:44:29 [2021-07-10T21:44:29.999Z] 	at org.eclipse.equinox.launcher.Main.run(Main.java:1462)
17:44:29 [2021-07-10T21:44:29.999Z] 	at org.eclipse.equinox.launcher.Main.main(Main.java:1435)
17:44:29 [2021-07-10T21:44:29.999Z] Caused by: java.lang.ClassNotFoundException: org.junit.runners.model.RunnerBuilder cannot be found by org.eclipse.tycho.surefire.osgibooter_2.2.0
17:44:29 [2021-07-10T21:44:29.999Z] 	at org.eclipse.osgi.internal.loader.BundleLoader.findClass(BundleLoader.java:519)
17:44:29 [2021-07-10T21:44:29.999Z] 	at org.eclipse.osgi.internal.loader.ModuleClassLoader.loadClass(ModuleClassLoader.java:170)
17:44:29 [2021-07-10T21:44:29.999Z] 	at java.base/java.lang.ClassLoader.loadClass(ClassLoader.java:522)
17:44:29 [2021-07-10T21:44:29.999Z] 	... 29 more
17:44:29 [2021-07-10T21:44:29.999Z] 
17:44:29 [2021-07-10T21:44:29.999Z] Running org.eclipse.ease.lang.scriptarchive.ArchiveEngineTest
17:44:30 [2021-07-10T21:44:30.270Z] We are running from a zip file!
17:44:30 [2021-07-10T21:44:30.527Z] org.eclipse.ease.ScriptExecutionException: SyntaxError: missing ; before statement (workspace://__EASE_ScriptArchive_1/scripts/Master.js#3)
17:44:30 [2021-07-10T21:44:30.527Z] this is an error
17:44:30 [2021-07-10T21:44:30.527Z]        ^
17:44:30 [2021-07-10T21:44:30.527Z] 	at Master.js,workspace://__EASE_ScriptArchive_1/scripts/Master.js
17:44:30 [2021-07-10T21:44:30.527Z] org.eclipse.ease.ScriptExecutionException: SyntaxError: missing ; before statement (workspace://__EASE_ScriptArchive_1/scripts/Master.js#3)
17:44:30 [2021-07-10T21:44:30.527Z] this is an error
17:44:30 [2021-07-10T21:44:30.527Z]        ^
17:44:30 [2021-07-10T21:44:30.527Z] 	at Master.js,workspace://__EASE_ScriptArchive_1/scripts/Master.js
17:44:30 [2021-07-10T21:44:30.527Z] Tests run: 7, Failures: 0, Errors: 0, Skipped: 0, Time elapsed: 1.294 s - in org.eclipse.ease.lang.scriptarchive.ArchiveEngineTest
17:44:30 [2021-07-10T21:44:30.527Z] executeWithManifest  Time elapsed: 1.068 s
17:44:30 [2021-07-10T21:44:30.527Z] zipFileRegistration  Time elapsed: 0.013 s
17:44:30 [2021-07-10T21:44:30.527Z] engineIdRegistration  Time elapsed: 0 s
17:44:30 [2021-07-10T21:44:30.527Z] jarFileRegistration  Time elapsed: 0 s
17:44:30 [2021-07-10T21:44:30.527Z] sarFileRegistration  Time elapsed: 0.001 s
17:44:30 [2021-07-10T21:44:30.527Z] executeWithErrors  Time elapsed: 0.103 s
17:44:30 [2021-07-10T21:44:30.527Z] executeWithIncludes  Time elapsed: 0.1 s
17:44:30 [2021-07-10T21:44:30.527Z] 
17:44:30 [2021-07-10T21:44:30.527Z] Results:
17:44:30 [2021-07-10T21:44:30.527Z] 
17:44:30 [2021-07-10T21:44:30.527Z] Tests run: 7, Failures: 0, Errors: 0, Skipped: 0
17:44:30 [2021-07-10T21:44:30.527Z] 
17:44:31 [2021-07-10T21:44:31.091Z] [INFO] All tests passed!
17:44:31 [2021-07-10T21:44:31.091Z] [INFO] 
17:44:31 [2021-07-10T21:44:31.091Z] [INFO] --- maven-pmd-plugin:3.14.0:pmd (pmd-integration) @ org.eclipse.ease.lang.scriptarchive.test ---
17:44:31 [2021-07-10T21:44:31.677Z] [INFO] 
17:44:31 [2021-07-10T21:44:31.677Z] [INFO] --- maven-pmd-plugin:3.14.0:cpd (pmd-integration) @ org.eclipse.ease.lang.scriptarchive.test ---
17:44:31 [2021-07-10T21:44:31.677Z] [INFO] 
17:44:31 [2021-07-10T21:44:31.677Z] [INFO] --- spotbugs-maven-plugin:4.1.4:spotbugs (spotbugs-integration) @ org.eclipse.ease.lang.scriptarchive.test ---
17:44:31 [2021-07-10T21:44:31.677Z] [INFO] Fork Value is false
17:44:31 [2021-07-10T21:44:31.677Z]      [java] JVM args ignored when same JVM is used.
17:44:35 [2021-07-10T21:44:35.969Z] [INFO] Done SpotBugs Analysis....
17:44:35 [2021-07-10T21:44:35.969Z] [INFO] 
17:44:35 [2021-07-10T21:44:35.969Z] [INFO] --- maven-checkstyle-plugin:3.1.1:check (checkstyle-integration) @ org.eclipse.ease.lang.scriptarchive.test ---
17:44:35 [2021-07-10T21:44:35.969Z] [INFO] You have 0 Checkstyle violations.
17:44:35 [2021-07-10T21:44:35.969Z] [INFO] 
17:44:35 [2021-07-10T21:44:35.969Z] [INFO] --- maven-install-plugin:2.3.1:install (default-install) @ org.eclipse.ease.lang.scriptarchive.test ---
17:44:35 [2021-07-10T21:44:35.969Z] [INFO] Installing /home/jenkins/agent/workspace/ease.verify.core.target.2019-03/tests/org.eclipse.ease.lang.scriptarchive.test/target/org.eclipse.ease.lang.scriptarchive.test-0.9.0-SNAPSHOT.jar to /home/jenkins/.m2/repository/org/eclipse/ease/org.eclipse.ease.lang.scriptarchive.test/0.9.0-SNAPSHOT/org.eclipse.ease.lang.scriptarchive.test-0.9.0-SNAPSHOT.jar
17:44:35 [2021-07-10T21:44:35.969Z] [INFO] Installing /home/jenkins/agent/workspace/ease.verify.core.target.2019-03/tests/org.eclipse.ease.lang.scriptarchive.test/pom.xml to /home/jenkins/.m2/repository/org/eclipse/ease/org.eclipse.ease.lang.scriptarchive.test/0.9.0-SNAPSHOT/org.eclipse.ease.lang.scriptarchive.test-0.9.0-SNAPSHOT.pom
17:44:35 [2021-07-10T21:44:35.969Z] [INFO] Installing /home/jenkins/agent/workspace/ease.verify.core.target.2019-03/tests/org.eclipse.ease.lang.scriptarchive.test/target/p2content.xml to /home/jenkins/.m2/repository/org/eclipse/ease/org.eclipse.ease.lang.scriptarchive.test/0.9.0-SNAPSHOT/org.eclipse.ease.lang.scriptarchive.test-0.9.0-SNAPSHOT-p2metadata.xml
17:44:35 [2021-07-10T21:44:35.969Z] [INFO] Installing /home/jenkins/agent/workspace/ease.verify.core.target.2019-03/tests/org.eclipse.ease.lang.scriptarchive.test/target/p2artifacts.xml to /home/jenkins/.m2/repository/org/eclipse/ease/org.eclipse.ease.lang.scriptarchive.test/0.9.0-SNAPSHOT/org.eclipse.ease.lang.scriptarchive.test-0.9.0-SNAPSHOT-p2artifacts.xml
17:44:35 [2021-07-10T21:44:35.969Z] [INFO] 
17:44:35 [2021-07-10T21:44:35.969Z] [INFO] --- tycho-p2-plugin:2.2.0:update-local-index (default-update-local-index) @ org.eclipse.ease.lang.scriptarchive.test ---
17:44:35 [2021-07-10T21:44:35.969Z] [INFO] 
17:44:35 [2021-07-10T21:44:35.969Z] [INFO] --------< org.eclipse.ease:org.eclipse.ease.lang.unittest.test >--------
17:44:35 [2021-07-10T21:44:35.969Z] [INFO] Building org.eclipse.ease.lang.unittest.test 0.9.0-SNAPSHOT      [44/48]
17:44:35 [2021-07-10T21:44:35.969Z] [INFO] ------------------------[ eclipse-test-plugin ]-------------------------
17:44:35 [2021-07-10T21:44:35.969Z] [INFO] 
17:44:35 [2021-07-10T21:44:35.969Z] [INFO] --- maven-clean-plugin:2.5:clean (default-clean) @ org.eclipse.ease.lang.unittest.test ---
17:44:35 [2021-07-10T21:44:35.969Z] [INFO] 
17:44:35 [2021-07-10T21:44:35.969Z] [INFO] --- tycho-packaging-plugin:2.2.0:build-qualifier (default-build-qualifier) @ org.eclipse.ease.lang.unittest.test ---
17:44:35 [2021-07-10T21:44:35.969Z] [INFO] The project's OSGi version is 0.9.0.I202106220815
17:44:35 [2021-07-10T21:44:35.969Z] [INFO] 
17:44:35 [2021-07-10T21:44:35.969Z] [INFO] --- tycho-packaging-plugin:2.2.0:validate-id (default-validate-id) @ org.eclipse.ease.lang.unittest.test ---
17:44:35 [2021-07-10T21:44:35.969Z] [INFO] 
17:44:35 [2021-07-10T21:44:35.969Z] [INFO] --- tycho-packaging-plugin:2.2.0:validate-version (default-validate-version) @ org.eclipse.ease.lang.unittest.test ---
17:44:35 [2021-07-10T21:44:35.969Z] [INFO] 
17:44:35 [2021-07-10T21:44:35.969Z] [INFO] --- maven-resources-plugin:2.4.3:resources (default-resources) @ org.eclipse.ease.lang.unittest.test ---
17:44:35 [2021-07-10T21:44:35.969Z] [INFO] Using 'UTF-8' encoding to copy filtered resources.
17:44:35 [2021-07-10T21:44:35.969Z] [INFO] skip non existing resourceDirectory /home/jenkins/agent/workspace/ease.verify.core.target.2019-03/tests/org.eclipse.ease.lang.unittest.test/src/main/resources
17:44:35 [2021-07-10T21:44:35.969Z] [INFO] 
17:44:35 [2021-07-10T21:44:35.969Z] [INFO] --- tycho-compiler-plugin:2.2.0:compile (default-compile) @ org.eclipse.ease.lang.unittest.test ---
17:44:35 [2021-07-10T21:44:35.969Z] [INFO] Compiling 3 source files to /home/jenkins/agent/workspace/ease.verify.core.target.2019-03/tests/org.eclipse.ease.lang.unittest.test/target/classes
17:44:35 [2021-07-10T21:44:35.969Z] [INFO] 
17:44:35 [2021-07-10T21:44:35.969Z] [INFO] --- maven-resources-plugin:2.4.3:testResources (default-testResources) @ org.eclipse.ease.lang.unittest.test ---
17:44:35 [2021-07-10T21:44:35.969Z] [INFO] Using 'UTF-8' encoding to copy filtered resources.
17:44:35 [2021-07-10T21:44:35.969Z] [INFO] skip non existing resourceDirectory /home/jenkins/agent/workspace/ease.verify.core.target.2019-03/tests/org.eclipse.ease.lang.unittest.test/src/test/resources
17:44:35 [2021-07-10T21:44:35.969Z] [INFO] 
17:44:35 [2021-07-10T21:44:35.969Z] [INFO] --- target-platform-configuration:2.2.0:target-platform (default-target-platform) @ org.eclipse.ease.lang.unittest.test ---
17:44:35 [2021-07-10T21:44:35.969Z] [INFO] 
17:44:35 [2021-07-10T21:44:35.970Z] [INFO] --- tycho-packaging-plugin:2.2.0:package-plugin (default-package-plugin) @ org.eclipse.ease.lang.unittest.test ---
17:44:35 [2021-07-10T21:44:35.970Z] [INFO] Building jar: /home/jenkins/agent/workspace/ease.verify.core.target.2019-03/tests/org.eclipse.ease.lang.unittest.test/target/org.eclipse.ease.lang.unittest.test-0.9.0-SNAPSHOT.jar
17:44:35 [2021-07-10T21:44:35.970Z] [INFO] 
17:44:35 [2021-07-10T21:44:35.970Z] [INFO] --- tycho-p2-plugin:2.2.0:p2-metadata-default (default-p2-metadata-default) @ org.eclipse.ease.lang.unittest.test ---
17:44:35 [2021-07-10T21:44:35.970Z] [INFO] 
17:44:35 [2021-07-10T21:44:35.970Z] [INFO] --- tycho-surefire-plugin:2.2.0:test (default-test) @ org.eclipse.ease.lang.unittest.test ---
17:44:35 [2021-07-10T21:44:35.970Z] [INFO] Executing Test Runtime with timeout 0, logs (if any) will be placed at: /home/jenkins/agent/workspace/ease.verify.core.target.2019-03/tests/org.eclipse.ease.lang.unittest.test/target/work/data/.metadata/.log
17:44:35 [2021-07-10T21:44:35.970Z] [INFO] Command line:
17:44:35 [2021-07-10T21:44:35.970Z] 	[/opt/tools/java/openjdk/jdk-15/15.0.2+7/bin/java, -Dosgi.noShutdown=false, -Dosgi.os=linux, -Dosgi.ws=gtk, -Dosgi.arch=x86_64, -Dosgi.clean=true, -jar, /home/jenkins/.m2/repository/p2/osgi/bundle/org.eclipse.equinox.launcher/1.6.200.v20210416-2027/org.eclipse.equinox.launcher-1.6.200.v20210416-2027.jar, -data, /home/jenkins/agent/workspace/ease.verify.core.target.2019-03/tests/org.eclipse.ease.lang.unittest.test/target/work/data, -install, /home/jenkins/agent/workspace/ease.verify.core.target.2019-03/tests/org.eclipse.ease.lang.unittest.test/target/work, -configuration, /home/jenkins/agent/workspace/ease.verify.core.target.2019-03/tests/org.eclipse.ease.lang.unittest.test/target/work/configuration, -application, org.eclipse.tycho.surefire.osgibooter.headlesstest, -testproperties, /home/jenkins/agent/workspace/ease.verify.core.target.2019-03/tests/org.eclipse.ease.lang.unittest.test/target/surefire.properties]
17:44:35 [2021-07-10T21:44:35.970Z] Picked up JAVA_TOOL_OPTIONS: -Dmaven.ext.class.path="/home/jenkins/agent/workspace/ease.verify.core.target.2019-03@tmp/withMaven6748b77a/pipeline-maven-spy.jar" -Dorg.jenkinsci.plugins.pipeline.maven.reportsFolder="/home/jenkins/agent/workspace/ease.verify.core.target.2019-03@tmp/withMaven6748b77a" 
17:44:39 [2021-07-10T21:44:39.320Z] Jul 10, 2021 9:44:38 PM org.junit.platform.launcher.core.DefaultLauncher handleThrowable
17:44:39 [2021-07-10T21:44:39.320Z] WARNING: TestEngine with ID 'junit-vintage' failed to discover tests
17:44:39 [2021-07-10T21:44:39.320Z] java.lang.NoClassDefFoundError: org/junit/runners/model/RunnerBuilder
17:44:39 [2021-07-10T21:44:39.320Z] 	at org.junit.vintage.engine.discovery.VintageDiscoverer.<init>(VintageDiscoverer.java:48)
17:44:39 [2021-07-10T21:44:39.320Z] 	at org.junit.vintage.engine.VintageTestEngine.discover(VintageTestEngine.java:65)
17:44:39 [2021-07-10T21:44:39.320Z] 	at org.junit.platform.launcher.core.DefaultLauncher.discoverEngineRoot(DefaultLauncher.java:130)
17:44:39 [2021-07-10T21:44:39.320Z] 	at org.junit.platform.launcher.core.DefaultLauncher.discoverRoot(DefaultLauncher.java:117)
17:44:39 [2021-07-10T21:44:39.320Z] 	at org.junit.platform.launcher.core.DefaultLauncher.discover(DefaultLauncher.java:82)
17:44:39 [2021-07-10T21:44:39.320Z] 	at org.apache.maven.surefire.junitplatform.TestPlanScannerFilter.accept(TestPlanScannerFilter.java:56)
17:44:39 [2021-07-10T21:44:39.320Z] 	at org.apache.maven.surefire.util.DefaultScanResult.applyFilter(DefaultScanResult.java:102)
17:44:39 [2021-07-10T21:44:39.320Z] 	at org.apache.maven.surefire.junitplatform.JUnitPlatformProvider.scanClasspath(JUnitPlatformProvider.java:143)
17:44:39 [2021-07-10T21:44:39.320Z] 	at org.apache.maven.surefire.junitplatform.JUnitPlatformProvider.invoke(JUnitPlatformProvider.java:124)
17:44:39 [2021-07-10T21:44:39.320Z] 	at java.base/jdk.internal.reflect.NativeMethodAccessorImpl.invoke0(Native Method)
17:44:39 [2021-07-10T21:44:39.320Z] 	at java.base/jdk.internal.reflect.NativeMethodAccessorImpl.invoke(NativeMethodAccessorImpl.java:64)
17:44:39 [2021-07-10T21:44:39.320Z] 	at java.base/jdk.internal.reflect.DelegatingMethodAccessorImpl.invoke(DelegatingMethodAccessorImpl.java:43)
17:44:39 [2021-07-10T21:44:39.320Z] 	at java.base/java.lang.reflect.Method.invoke(Method.java:564)
17:44:39 [2021-07-10T21:44:39.320Z] 	at org.apache.maven.surefire.util.ReflectionUtils.invokeMethodWithArray2(ReflectionUtils.java:206)
17:44:39 [2021-07-10T21:44:39.320Z] 	at org.apache.maven.surefire.booter.ProviderFactory$ProviderProxy.invoke(ProviderFactory.java:161)
17:44:39 [2021-07-10T21:44:39.320Z] 	at org.apache.maven.surefire.booter.ProviderFactory.invokeProvider(ProviderFactory.java:84)
17:44:39 [2021-07-10T21:44:39.320Z] 	at org.eclipse.tycho.surefire.osgibooter.OsgiSurefireBooter.run(OsgiSurefireBooter.java:116)
17:44:39 [2021-07-10T21:44:39.320Z] 	at org.eclipse.tycho.surefire.osgibooter.HeadlessTestApplication.start(HeadlessTestApplication.java:23)
17:44:39 [2021-07-10T21:44:39.320Z] 	at org.eclipse.equinox.internal.app.EclipseAppHandle.run(EclipseAppHandle.java:203)
17:44:39 [2021-07-10T21:44:39.320Z] 	at org.eclipse.core.runtime.internal.adaptor.EclipseAppLauncher.runApplication(EclipseAppLauncher.java:134)
17:44:39 [2021-07-10T21:44:39.320Z] 	at org.eclipse.core.runtime.internal.adaptor.EclipseAppLauncher.start(EclipseAppLauncher.java:104)
17:44:39 [2021-07-10T21:44:39.320Z] 	at org.eclipse.core.runtime.adaptor.EclipseStarter.run(EclipseStarter.java:401)
17:44:39 [2021-07-10T21:44:39.320Z] 	at org.eclipse.core.runtime.adaptor.EclipseStarter.run(EclipseStarter.java:255)
17:44:39 [2021-07-10T21:44:39.320Z] 	at java.base/jdk.internal.reflect.NativeMethodAccessorImpl.invoke0(Native Method)
17:44:39 [2021-07-10T21:44:39.320Z] 	at java.base/jdk.internal.reflect.NativeMethodAccessorImpl.invoke(NativeMethodAccessorImpl.java:64)
17:44:39 [2021-07-10T21:44:39.320Z] 	at java.base/jdk.internal.reflect.DelegatingMethodAccessorImpl.invoke(DelegatingMethodAccessorImpl.java:43)
17:44:39 [2021-07-10T21:44:39.320Z] 	at java.base/java.lang.reflect.Method.invoke(Method.java:564)
17:44:39 [2021-07-10T21:44:39.320Z] 	at org.eclipse.equinox.launcher.Main.invokeFramework(Main.java:654)
17:44:39 [2021-07-10T21:44:39.320Z] 	at org.eclipse.equinox.launcher.Main.basicRun(Main.java:591)
17:44:39 [2021-07-10T21:44:39.320Z] 	at org.eclipse.equinox.launcher.Main.run(Main.java:1462)
17:44:39 [2021-07-10T21:44:39.320Z] 	at org.eclipse.equinox.launcher.Main.main(Main.java:1435)
17:44:39 [2021-07-10T21:44:39.320Z] Caused by: java.lang.ClassNotFoundException: org.junit.runners.model.RunnerBuilder cannot be found by org.eclipse.tycho.surefire.osgibooter_2.2.0
17:44:39 [2021-07-10T21:44:39.320Z] 	at org.eclipse.osgi.internal.loader.BundleLoader.findClass(BundleLoader.java:519)
17:44:39 [2021-07-10T21:44:39.320Z] 	at org.eclipse.osgi.internal.loader.ModuleClassLoader.loadClass(ModuleClassLoader.java:170)
17:44:39 [2021-07-10T21:44:39.320Z] 	at java.base/java.lang.ClassLoader.loadClass(ClassLoader.java:522)
17:44:39 [2021-07-10T21:44:39.320Z] 	... 31 more
17:44:39 [2021-07-10T21:44:39.320Z] 
17:44:39 [2021-07-10T21:44:39.320Z] Jul 10, 2021 9:44:38 PM org.junit.platform.launcher.core.DefaultLauncher handleThrowable
17:44:39 [2021-07-10T21:44:39.320Z] WARNING: TestEngine with ID 'junit-vintage' failed to discover tests
17:44:39 [2021-07-10T21:44:39.320Z] java.lang.NoClassDefFoundError: org/junit/runners/model/RunnerBuilder
17:44:39 [2021-07-10T21:44:39.320Z] 	at org.junit.vintage.engine.discovery.VintageDiscoverer.<init>(VintageDiscoverer.java:48)
17:44:39 [2021-07-10T21:44:39.320Z] 	at org.junit.vintage.engine.VintageTestEngine.discover(VintageTestEngine.java:65)
17:44:39 [2021-07-10T21:44:39.320Z] 	at org.junit.platform.launcher.core.DefaultLauncher.discoverEngineRoot(DefaultLauncher.java:130)
17:44:39 [2021-07-10T21:44:39.320Z] 	at org.junit.platform.launcher.core.DefaultLauncher.discoverRoot(DefaultLauncher.java:117)
17:44:39 [2021-07-10T21:44:39.320Z] 	at org.junit.platform.launcher.core.DefaultLauncher.discover(DefaultLauncher.java:82)
17:44:39 [2021-07-10T21:44:39.320Z] 	at org.apache.maven.surefire.junitplatform.TestPlanScannerFilter.accept(TestPlanScannerFilter.java:56)
17:44:39 [2021-07-10T21:44:39.320Z] 	at org.apache.maven.surefire.util.DefaultScanResult.applyFilter(DefaultScanResult.java:102)
17:44:39 [2021-07-10T21:44:39.320Z] 	at org.apache.maven.surefire.junitplatform.JUnitPlatformProvider.scanClasspath(JUnitPlatformProvider.java:143)
17:44:39 [2021-07-10T21:44:39.320Z] 	at org.apache.maven.surefire.junitplatform.JUnitPlatformProvider.invoke(JUnitPlatformProvider.java:124)
17:44:39 [2021-07-10T21:44:39.320Z] 	at java.base/jdk.internal.reflect.NativeMethodAccessorImpl.invoke0(Native Method)
17:44:39 [2021-07-10T21:44:39.320Z] 	at java.base/jdk.internal.reflect.NativeMethodAccessorImpl.invoke(NativeMethodAccessorImpl.java:64)
17:44:39 [2021-07-10T21:44:39.320Z] 	at java.base/jdk.internal.reflect.DelegatingMethodAccessorImpl.invoke(DelegatingMethodAccessorImpl.java:43)
17:44:39 [2021-07-10T21:44:39.320Z] 	at java.base/java.lang.reflect.Method.invoke(Method.java:564)
17:44:39 [2021-07-10T21:44:39.320Z] 	at org.apache.maven.surefire.util.ReflectionUtils.invokeMethodWithArray2(ReflectionUtils.java:206)
17:44:39 [2021-07-10T21:44:39.320Z] 	at org.apache.maven.surefire.booter.ProviderFactory$ProviderProxy.invoke(ProviderFactory.java:161)
17:44:39 [2021-07-10T21:44:39.320Z] 	at org.apache.maven.surefire.booter.ProviderFactory.invokeProvider(ProviderFactory.java:84)
17:44:39 [2021-07-10T21:44:39.320Z] 	at org.eclipse.tycho.surefire.osgibooter.OsgiSurefireBooter.run(OsgiSurefireBooter.java:116)
17:44:39 [2021-07-10T21:44:39.320Z] 	at org.eclipse.tycho.surefire.osgibooter.HeadlessTestApplication.start(HeadlessTestApplication.java:23)
17:44:39 [2021-07-10T21:44:39.320Z] 	at org.eclipse.equinox.internal.app.EclipseAppHandle.run(EclipseAppHandle.java:203)
17:44:39 [2021-07-10T21:44:39.320Z] 	at org.eclipse.core.runtime.internal.adaptor.EclipseAppLauncher.runApplication(EclipseAppLauncher.java:134)
17:44:39 [2021-07-10T21:44:39.320Z] 	at org.eclipse.core.runtime.internal.adaptor.EclipseAppLauncher.start(EclipseAppLauncher.java:104)
17:44:39 [2021-07-10T21:44:39.320Z] 	at org.eclipse.core.runtime.adaptor.EclipseStarter.run(EclipseStarter.java:401)
17:44:39 [2021-07-10T21:44:39.320Z] 	at org.eclipse.core.runtime.adaptor.EclipseStarter.run(EclipseStarter.java:255)
17:44:39 [2021-07-10T21:44:39.320Z] 	at java.base/jdk.internal.reflect.NativeMethodAccessorImpl.invoke0(Native Method)
17:44:39 [2021-07-10T21:44:39.320Z] 	at java.base/jdk.internal.reflect.NativeMethodAccessorImpl.invoke(NativeMethodAccessorImpl.java:64)
17:44:39 [2021-07-10T21:44:39.320Z] 	at java.base/jdk.internal.reflect.DelegatingMethodAccessorImpl.invoke(DelegatingMethodAccessorImpl.java:43)
17:44:39 [2021-07-10T21:44:39.320Z] 	at java.base/java.lang.reflect.Method.invoke(Method.java:564)
17:44:39 [2021-07-10T21:44:39.320Z] 	at org.eclipse.equinox.launcher.Main.invokeFramework(Main.java:654)
17:44:39 [2021-07-10T21:44:39.320Z] 	at org.eclipse.equinox.launcher.Main.basicRun(Main.java:591)
17:44:39 [2021-07-10T21:44:39.320Z] 	at org.eclipse.equinox.launcher.Main.run(Main.java:1462)
17:44:39 [2021-07-10T21:44:39.320Z] 	at org.eclipse.equinox.launcher.Main.main(Main.java:1435)
17:44:39 [2021-07-10T21:44:39.320Z] Caused by: java.lang.ClassNotFoundException: org.junit.runners.model.RunnerBuilder cannot be found by org.eclipse.tycho.surefire.osgibooter_2.2.0
17:44:39 [2021-07-10T21:44:39.320Z] 	at org.eclipse.osgi.internal.loader.BundleLoader.findClass(BundleLoader.java:519)
17:44:39 [2021-07-10T21:44:39.320Z] 	at org.eclipse.osgi.internal.loader.ModuleClassLoader.loadClass(ModuleClassLoader.java:170)
17:44:39 [2021-07-10T21:44:39.320Z] 	at java.base/java.lang.ClassLoader.loadClass(ClassLoader.java:522)
17:44:39 [2021-07-10T21:44:39.320Z] 	... 31 more
17:44:39 [2021-07-10T21:44:39.320Z] 
17:44:39 [2021-07-10T21:44:39.320Z] Jul 10, 2021 9:44:38 PM org.junit.platform.launcher.core.DefaultLauncher handleThrowable
17:44:39 [2021-07-10T21:44:39.320Z] WARNING: TestEngine with ID 'junit-vintage' failed to discover tests
17:44:39 [2021-07-10T21:44:39.320Z] java.lang.NoClassDefFoundError: org/junit/runners/model/RunnerBuilder
17:44:39 [2021-07-10T21:44:39.320Z] 	at org.junit.vintage.engine.discovery.VintageDiscoverer.<init>(VintageDiscoverer.java:48)
17:44:39 [2021-07-10T21:44:39.320Z] 	at org.junit.vintage.engine.VintageTestEngine.discover(VintageTestEngine.java:65)
17:44:39 [2021-07-10T21:44:39.320Z] 	at org.junit.platform.launcher.core.DefaultLauncher.discoverEngineRoot(DefaultLauncher.java:130)
17:44:39 [2021-07-10T21:44:39.320Z] 	at org.junit.platform.launcher.core.DefaultLauncher.discoverRoot(DefaultLauncher.java:117)
17:44:39 [2021-07-10T21:44:39.320Z] 	at org.junit.platform.launcher.core.DefaultLauncher.discover(DefaultLauncher.java:82)
17:44:39 [2021-07-10T21:44:39.320Z] 	at org.apache.maven.surefire.junitplatform.TestPlanScannerFilter.accept(TestPlanScannerFilter.java:56)
17:44:39 [2021-07-10T21:44:39.320Z] 	at org.apache.maven.surefire.util.DefaultScanResult.applyFilter(DefaultScanResult.java:102)
17:44:39 [2021-07-10T21:44:39.320Z] 	at org.apache.maven.surefire.junitplatform.JUnitPlatformProvider.scanClasspath(JUnitPlatformProvider.java:143)
17:44:39 [2021-07-10T21:44:39.320Z] 	at org.apache.maven.surefire.junitplatform.JUnitPlatformProvider.invoke(JUnitPlatformProvider.java:124)
17:44:39 [2021-07-10T21:44:39.320Z] 	at java.base/jdk.internal.reflect.NativeMethodAccessorImpl.invoke0(Native Method)
17:44:39 [2021-07-10T21:44:39.320Z] 	at java.base/jdk.internal.reflect.NativeMethodAccessorImpl.invoke(NativeMethodAccessorImpl.java:64)
17:44:39 [2021-07-10T21:44:39.320Z] 	at java.base/jdk.internal.reflect.DelegatingMethodAccessorImpl.invoke(DelegatingMethodAccessorImpl.java:43)
17:44:39 [2021-07-10T21:44:39.320Z] 	at java.base/java.lang.reflect.Method.invoke(Method.java:564)
17:44:39 [2021-07-10T21:44:39.320Z] 	at org.apache.maven.surefire.util.ReflectionUtils.invokeMethodWithArray2(ReflectionUtils.java:206)
17:44:39 [2021-07-10T21:44:39.320Z] 	at org.apache.maven.surefire.booter.ProviderFactory$ProviderProxy.invoke(ProviderFactory.java:161)
17:44:39 [2021-07-10T21:44:39.320Z] 	at org.apache.maven.surefire.booter.ProviderFactory.invokeProvider(ProviderFactory.java:84)
17:44:39 [2021-07-10T21:44:39.320Z] 	at org.eclipse.tycho.surefire.osgibooter.OsgiSurefireBooter.run(OsgiSurefireBooter.java:116)
17:44:39 [2021-07-10T21:44:39.320Z] 	at org.eclipse.tycho.surefire.osgibooter.HeadlessTestApplication.start(HeadlessTestApplication.java:23)
17:44:39 [2021-07-10T21:44:39.320Z] 	at org.eclipse.equinox.internal.app.EclipseAppHandle.run(EclipseAppHandle.java:203)
17:44:39 [2021-07-10T21:44:39.320Z] 	at org.eclipse.core.runtime.internal.adaptor.EclipseAppLauncher.runApplication(EclipseAppLauncher.java:134)
17:44:39 [2021-07-10T21:44:39.320Z] 	at org.eclipse.core.runtime.internal.adaptor.EclipseAppLauncher.start(EclipseAppLauncher.java:104)
17:44:39 [2021-07-10T21:44:39.320Z] 	at org.eclipse.core.runtime.adaptor.EclipseStarter.run(EclipseStarter.java:401)
17:44:39 [2021-07-10T21:44:39.320Z] 	at org.eclipse.core.runtime.adaptor.EclipseStarter.run(EclipseStarter.java:255)
17:44:39 [2021-07-10T21:44:39.321Z] 	at java.base/jdk.internal.reflect.NativeMethodAccessorImpl.invoke0(Native Method)
17:44:39 [2021-07-10T21:44:39.321Z] 	at java.base/jdk.internal.reflect.NativeMethodAccessorImpl.invoke(NativeMethodAccessorImpl.java:64)
17:44:39 [2021-07-10T21:44:39.321Z] 	at java.base/jdk.internal.reflect.DelegatingMethodAccessorImpl.invoke(DelegatingMethodAccessorImpl.java:43)
17:44:39 [2021-07-10T21:44:39.321Z] 	at java.base/java.lang.reflect.Method.invoke(Method.java:564)
17:44:39 [2021-07-10T21:44:39.321Z] 	at org.eclipse.equinox.launcher.Main.invokeFramework(Main.java:654)
17:44:39 [2021-07-10T21:44:39.321Z] 	at org.eclipse.equinox.launcher.Main.basicRun(Main.java:591)
17:44:39 [2021-07-10T21:44:39.321Z] 	at org.eclipse.equinox.launcher.Main.run(Main.java:1462)
17:44:39 [2021-07-10T21:44:39.321Z] 	at org.eclipse.equinox.launcher.Main.main(Main.java:1435)
17:44:39 [2021-07-10T21:44:39.321Z] Caused by: java.lang.ClassNotFoundException: org.junit.runners.model.RunnerBuilder cannot be found by org.eclipse.tycho.surefire.osgibooter_2.2.0
17:44:39 [2021-07-10T21:44:39.321Z] 	at org.eclipse.osgi.internal.loader.BundleLoader.findClass(BundleLoader.java:519)
17:44:39 [2021-07-10T21:44:39.321Z] 	at org.eclipse.osgi.internal.loader.ModuleClassLoader.loadClass(ModuleClassLoader.java:170)
17:44:39 [2021-07-10T21:44:39.321Z] 	at java.base/java.lang.ClassLoader.loadClass(ClassLoader.java:522)
17:44:39 [2021-07-10T21:44:39.321Z] 	... 31 more
17:44:39 [2021-07-10T21:44:39.321Z] 
17:44:39 [2021-07-10T21:44:39.321Z] Jul 10, 2021 9:44:38 PM org.junit.platform.launcher.core.DefaultLauncher handleThrowable
17:44:39 [2021-07-10T21:44:39.321Z] WARNING: TestEngine with ID 'junit-vintage' failed to discover tests
17:44:39 [2021-07-10T21:44:39.321Z] java.lang.NoClassDefFoundError: org/junit/runners/model/RunnerBuilder
17:44:39 [2021-07-10T21:44:39.321Z] 	at org.junit.vintage.engine.discovery.VintageDiscoverer.<init>(VintageDiscoverer.java:48)
17:44:39 [2021-07-10T21:44:39.321Z] 	at org.junit.vintage.engine.VintageTestEngine.discover(VintageTestEngine.java:65)
17:44:39 [2021-07-10T21:44:39.321Z] 	at org.junit.platform.launcher.core.DefaultLauncher.discoverEngineRoot(DefaultLauncher.java:130)
17:44:39 [2021-07-10T21:44:39.321Z] 	at org.junit.platform.launcher.core.DefaultLauncher.discoverRoot(DefaultLauncher.java:117)
17:44:39 [2021-07-10T21:44:39.321Z] 	at org.junit.platform.launcher.core.DefaultLauncher.execute(DefaultLauncher.java:90)
17:44:39 [2021-07-10T21:44:39.321Z] 	at org.apache.maven.surefire.junitplatform.JUnitPlatformProvider.invokeAllTests(JUnitPlatformProvider.java:150)
17:44:39 [2021-07-10T21:44:39.321Z] 	at org.apache.maven.surefire.junitplatform.JUnitPlatformProvider.invoke(JUnitPlatformProvider.java:124)
17:44:39 [2021-07-10T21:44:39.321Z] 	at java.base/jdk.internal.reflect.NativeMethodAccessorImpl.invoke0(Native Method)
17:44:39 [2021-07-10T21:44:39.321Z] 	at java.base/jdk.internal.reflect.NativeMethodAccessorImpl.invoke(NativeMethodAccessorImpl.java:64)
17:44:39 [2021-07-10T21:44:39.321Z] 	at java.base/jdk.internal.reflect.DelegatingMethodAccessorImpl.invoke(DelegatingMethodAccessorImpl.java:43)
17:44:39 [2021-07-10T21:44:39.321Z] 	at java.base/java.lang.reflect.Method.invoke(Method.java:564)
17:44:39 [2021-07-10T21:44:39.321Z] 	at org.apache.maven.surefire.util.ReflectionUtils.invokeMethodWithArray2(ReflectionUtils.java:206)
17:44:39 [2021-07-10T21:44:39.321Z] 	at org.apache.maven.surefire.booter.ProviderFactory$ProviderProxy.invoke(ProviderFactory.java:161)
17:44:39 [2021-07-10T21:44:39.321Z] 	at org.apache.maven.surefire.booter.ProviderFactory.invokeProvider(ProviderFactory.java:84)
17:44:39 [2021-07-10T21:44:39.321Z] 	at org.eclipse.tycho.surefire.osgibooter.OsgiSurefireBooter.run(OsgiSurefireBooter.java:116)
17:44:39 [2021-07-10T21:44:39.321Z] 	at org.eclipse.tycho.surefire.osgibooter.HeadlessTestApplication.start(HeadlessTestApplication.java:23)
17:44:39 [2021-07-10T21:44:39.321Z] 	at org.eclipse.equinox.internal.app.EclipseAppHandle.run(EclipseAppHandle.java:203)
17:44:39 [2021-07-10T21:44:39.321Z] 	at org.eclipse.core.runtime.internal.adaptor.EclipseAppLauncher.runApplication(EclipseAppLauncher.java:134)
17:44:39 [2021-07-10T21:44:39.321Z] 	at org.eclipse.core.runtime.internal.adaptor.EclipseAppLauncher.start(EclipseAppLauncher.java:104)
17:44:39 [2021-07-10T21:44:39.321Z] 	at org.eclipse.core.runtime.adaptor.EclipseStarter.run(EclipseStarter.java:401)
17:44:39 [2021-07-10T21:44:39.321Z] 	at org.eclipse.core.runtime.adaptor.EclipseStarter.run(EclipseStarter.java:255)
17:44:39 [2021-07-10T21:44:39.321Z] 	at java.base/jdk.internal.reflect.NativeMethodAccessorImpl.invoke0(Native Method)
17:44:39 [2021-07-10T21:44:39.321Z] 	at java.base/jdk.internal.reflect.NativeMethodAccessorImpl.invoke(NativeMethodAccessorImpl.java:64)
17:44:39 [2021-07-10T21:44:39.321Z] 	at java.base/jdk.internal.reflect.DelegatingMethodAccessorImpl.invoke(DelegatingMethodAccessorImpl.java:43)
17:44:39 [2021-07-10T21:44:39.321Z] 	at java.base/java.lang.reflect.Method.invoke(Method.java:564)
17:44:39 [2021-07-10T21:44:39.321Z] 	at org.eclipse.equinox.launcher.Main.invokeFramework(Main.java:654)
17:44:39 [2021-07-10T21:44:39.321Z] 	at org.eclipse.equinox.launcher.Main.basicRun(Main.java:591)
17:44:39 [2021-07-10T21:44:39.321Z] 	at org.eclipse.equinox.launcher.Main.run(Main.java:1462)
17:44:39 [2021-07-10T21:44:39.321Z] 	at org.eclipse.equinox.launcher.Main.main(Main.java:1435)
17:44:39 [2021-07-10T21:44:39.321Z] Caused by: java.lang.ClassNotFoundException: org.junit.runners.model.RunnerBuilder cannot be found by org.eclipse.tycho.surefire.osgibooter_2.2.0
17:44:39 [2021-07-10T21:44:39.321Z] 	at org.eclipse.osgi.internal.loader.BundleLoader.findClass(BundleLoader.java:519)
17:44:39 [2021-07-10T21:44:39.321Z] 	at org.eclipse.osgi.internal.loader.ModuleClassLoader.loadClass(ModuleClassLoader.java:170)
17:44:39 [2021-07-10T21:44:39.321Z] 	at java.base/java.lang.ClassLoader.loadClass(ClassLoader.java:522)
17:44:39 [2021-07-10T21:44:39.321Z] 	... 29 more
17:44:39 [2021-07-10T21:44:39.321Z] 
17:44:39 [2021-07-10T21:44:39.321Z] Running org.eclipse.ease.lang.unittest.ClassicJavaScriptTest
17:44:41 [2021-07-10T21:44:41.236Z] Tests run: 7, Failures: 0, Errors: 0, Skipped: 0, Time elapsed: 1.976 s - in org.eclipse.ease.lang.unittest.ClassicJavaScriptTest
17:44:41 [2021-07-10T21:44:41.236Z] folderStatus  Time elapsed: 0.964 s
17:44:41 [2021-07-10T21:44:41.236Z] errorTestStatus  Time elapsed: 0.225 s
17:44:41 [2021-07-10T21:44:41.236Z] failureTestStatus  Time elapsed: 0.131 s
17:44:41 [2021-07-10T21:44:41.236Z] verifyOutput  Time elapsed: 0.157 s
17:44:41 [2021-07-10T21:44:41.236Z] suiteStatus  Time elapsed: 0.124 s
17:44:41 [2021-07-10T21:44:41.236Z] ignoreTestStatus  Time elapsed: 0.13 s
17:44:41 [2021-07-10T21:44:41.236Z] passTestStatus  Time elapsed: 0.157 s
17:44:41 [2021-07-10T21:44:41.236Z] Running org.eclipse.ease.lang.unittest.ModernJavaScriptTest
17:44:42 [2021-07-10T21:44:42.168Z] Tests run: 8, Failures: 0, Errors: 0, Skipped: 0, Time elapsed: 1.033 s - in org.eclipse.ease.lang.unittest.ModernJavaScriptTest
17:44:42 [2021-07-10T21:44:42.168Z] folderStatus  Time elapsed: 0.17 s
17:44:42 [2021-07-10T21:44:42.168Z] verifyOutput  Time elapsed: 0.153 s
17:44:42 [2021-07-10T21:44:42.168Z] suiteStatus  Time elapsed: 0.151 s
17:44:42 [2021-07-10T21:44:42.168Z] ignoreTestStatus  Time elapsed: 0.118 s
17:44:42 [2021-07-10T21:44:42.168Z] ignoreTestClassStatus  Time elapsed: 0.113 s
17:44:42 [2021-07-10T21:44:42.168Z] failureTestClassStatus  Time elapsed: 0.1 s
17:44:42 [2021-07-10T21:44:42.168Z] errorTestClassStatus  Time elapsed: 0.121 s
17:44:42 [2021-07-10T21:44:42.168Z] passTestClassStatus  Time elapsed: 0.101 s
17:44:42 [2021-07-10T21:44:42.168Z] 
17:44:42 [2021-07-10T21:44:42.168Z] Results:
17:44:42 [2021-07-10T21:44:42.168Z] 
17:44:42 [2021-07-10T21:44:42.168Z] Tests run: 15, Failures: 0, Errors: 0, Skipped: 0
17:44:42 [2021-07-10T21:44:42.168Z] 
17:44:42 [2021-07-10T21:44:42.426Z] [INFO] All tests passed!
17:44:42 [2021-07-10T21:44:42.426Z] [INFO] 
17:44:42 [2021-07-10T21:44:42.426Z] [INFO] --- maven-install-plugin:2.3.1:install (default-install) @ org.eclipse.ease.lang.unittest.test ---
17:44:42 [2021-07-10T21:44:42.426Z] [INFO] Installing /home/jenkins/agent/workspace/ease.verify.core.target.2019-03/tests/org.eclipse.ease.lang.unittest.test/target/org.eclipse.ease.lang.unittest.test-0.9.0-SNAPSHOT.jar to /home/jenkins/.m2/repository/org/eclipse/ease/org.eclipse.ease.lang.unittest.test/0.9.0-SNAPSHOT/org.eclipse.ease.lang.unittest.test-0.9.0-SNAPSHOT.jar
17:44:42 [2021-07-10T21:44:42.426Z] [INFO] Installing /home/jenkins/agent/workspace/ease.verify.core.target.2019-03/tests/org.eclipse.ease.lang.unittest.test/pom.xml to /home/jenkins/.m2/repository/org/eclipse/ease/org.eclipse.ease.lang.unittest.test/0.9.0-SNAPSHOT/org.eclipse.ease.lang.unittest.test-0.9.0-SNAPSHOT.pom
17:44:42 [2021-07-10T21:44:42.426Z] [INFO] Installing /home/jenkins/agent/workspace/ease.verify.core.target.2019-03/tests/org.eclipse.ease.lang.unittest.test/target/p2content.xml to /home/jenkins/.m2/repository/org/eclipse/ease/org.eclipse.ease.lang.unittest.test/0.9.0-SNAPSHOT/org.eclipse.ease.lang.unittest.test-0.9.0-SNAPSHOT-p2metadata.xml
17:44:42 [2021-07-10T21:44:42.426Z] [INFO] Installing /home/jenkins/agent/workspace/ease.verify.core.target.2019-03/tests/org.eclipse.ease.lang.unittest.test/target/p2artifacts.xml to /home/jenkins/.m2/repository/org/eclipse/ease/org.eclipse.ease.lang.unittest.test/0.9.0-SNAPSHOT/org.eclipse.ease.lang.unittest.test-0.9.0-SNAPSHOT-p2artifacts.xml
17:44:42 [2021-07-10T21:44:42.426Z] [INFO] 
17:44:42 [2021-07-10T21:44:42.426Z] [INFO] --- tycho-p2-plugin:2.2.0:update-local-index (default-update-local-index) @ org.eclipse.ease.lang.unittest.test ---
17:44:42 [2021-07-10T21:44:42.426Z] [INFO] 
17:44:42 [2021-07-10T21:44:42.426Z] [INFO] ---------< org.eclipse.ease:org.eclipse.ease.ui.scripts.test >----------
17:44:42 [2021-07-10T21:44:42.426Z] [INFO] Building org.eclipse.ease.ui.scripts.test 0.9.0-SNAPSHOT         [45/48]
17:44:42 [2021-07-10T21:44:42.426Z] [INFO] ------------------------[ eclipse-test-plugin ]-------------------------
17:44:42 [2021-07-10T21:44:42.426Z] [INFO] 
17:44:42 [2021-07-10T21:44:42.426Z] [INFO] --- maven-clean-plugin:2.5:clean (default-clean) @ org.eclipse.ease.ui.scripts.test ---
17:44:42 [2021-07-10T21:44:42.426Z] [INFO] 
17:44:42 [2021-07-10T21:44:42.426Z] [INFO] --- tycho-packaging-plugin:2.2.0:build-qualifier (default-build-qualifier) @ org.eclipse.ease.ui.scripts.test ---
17:44:42 [2021-07-10T21:44:42.426Z] [INFO] The project's OSGi version is 0.9.0.I202106220815
17:44:42 [2021-07-10T21:44:42.426Z] [INFO] 
17:44:42 [2021-07-10T21:44:42.426Z] [INFO] --- tycho-packaging-plugin:2.2.0:validate-id (default-validate-id) @ org.eclipse.ease.ui.scripts.test ---
17:44:42 [2021-07-10T21:44:42.426Z] [INFO] 
17:44:42 [2021-07-10T21:44:42.426Z] [INFO] --- tycho-packaging-plugin:2.2.0:validate-version (default-validate-version) @ org.eclipse.ease.ui.scripts.test ---
17:44:42 [2021-07-10T21:44:42.426Z] [INFO] 
17:44:42 [2021-07-10T21:44:42.426Z] [INFO] --- maven-resources-plugin:2.4.3:resources (default-resources) @ org.eclipse.ease.ui.scripts.test ---
17:44:42 [2021-07-10T21:44:42.426Z] [INFO] Using 'UTF-8' encoding to copy filtered resources.
17:44:42 [2021-07-10T21:44:42.426Z] [INFO] skip non existing resourceDirectory /home/jenkins/agent/workspace/ease.verify.core.target.2019-03/tests/org.eclipse.ease.ui.scripts.test/src/main/resources
17:44:42 [2021-07-10T21:44:42.426Z] [INFO] 
17:44:42 [2021-07-10T21:44:42.426Z] [INFO] --- tycho-compiler-plugin:2.2.0:compile (default-compile) @ org.eclipse.ease.ui.scripts.test ---
17:44:42 [2021-07-10T21:44:42.426Z] [INFO] Compiling 1 source file to /home/jenkins/agent/workspace/ease.verify.core.target.2019-03/tests/org.eclipse.ease.ui.scripts.test/target/classes
17:44:42 [2021-07-10T21:44:42.684Z] [INFO] 
17:44:42 [2021-07-10T21:44:42.684Z] [INFO] --- maven-resources-plugin:2.4.3:testResources (default-testResources) @ org.eclipse.ease.ui.scripts.test ---
17:44:42 [2021-07-10T21:44:42.684Z] [INFO] Using 'UTF-8' encoding to copy filtered resources.
17:44:42 [2021-07-10T21:44:42.684Z] [INFO] skip non existing resourceDirectory /home/jenkins/agent/workspace/ease.verify.core.target.2019-03/tests/org.eclipse.ease.ui.scripts.test/src/test/resources
17:44:42 [2021-07-10T21:44:42.684Z] [INFO] 
17:44:42 [2021-07-10T21:44:42.684Z] [INFO] --- target-platform-configuration:2.2.0:target-platform (default-target-platform) @ org.eclipse.ease.ui.scripts.test ---
17:44:42 [2021-07-10T21:44:42.684Z] [INFO] 
17:44:42 [2021-07-10T21:44:42.684Z] [INFO] --- tycho-packaging-plugin:2.2.0:package-plugin (default-package-plugin) @ org.eclipse.ease.ui.scripts.test ---
17:44:42 [2021-07-10T21:44:42.684Z] [INFO] Building jar: /home/jenkins/agent/workspace/ease.verify.core.target.2019-03/tests/org.eclipse.ease.ui.scripts.test/target/org.eclipse.ease.ui.scripts.test-0.9.0-SNAPSHOT.jar
17:44:42 [2021-07-10T21:44:42.684Z] [INFO] 
17:44:42 [2021-07-10T21:44:42.684Z] [INFO] --- tycho-p2-plugin:2.2.0:p2-metadata-default (default-p2-metadata-default) @ org.eclipse.ease.ui.scripts.test ---
17:44:42 [2021-07-10T21:44:42.684Z] [INFO] 
17:44:42 [2021-07-10T21:44:42.684Z] [INFO] --- jacoco-maven-plugin:0.8.6:prepare-agent (jacoco-initialize) @ org.eclipse.ease.ui.scripts.test ---
17:44:42 [2021-07-10T21:44:42.684Z] [INFO] tycho.testArgLine set to -javaagent:/home/jenkins/.m2/repository/org/jacoco/org.jacoco.agent/0.8.6/org.jacoco.agent-0.8.6-runtime.jar=destfile=/home/jenkins/agent/workspace/ease.verify.core.target.2019-03/tests/org.eclipse.ease.ui.scripts.test/target/jacoco.exec,output=file
17:44:42 [2021-07-10T21:44:42.684Z] [INFO] 
17:44:42 [2021-07-10T21:44:42.684Z] [INFO] --- tycho-surefire-plugin:2.2.0:test (default-test) @ org.eclipse.ease.ui.scripts.test ---
17:44:42 [2021-07-10T21:44:42.684Z] [INFO] Executing Test Runtime with timeout 0, logs (if any) will be placed at: /home/jenkins/agent/workspace/ease.verify.core.target.2019-03/tests/org.eclipse.ease.ui.scripts.test/target/work/data/.metadata/.log
17:44:42 [2021-07-10T21:44:42.684Z] [INFO] Command line:
17:44:42 [2021-07-10T21:44:42.684Z] 	[/opt/tools/java/openjdk/jdk-15/15.0.2+7/bin/java, -Dosgi.noShutdown=false, -Dosgi.os=linux, -Dosgi.ws=gtk, -Dosgi.arch=x86_64, -javaagent:/home/jenkins/.m2/repository/org/jacoco/org.jacoco.agent/0.8.6/org.jacoco.agent-0.8.6-runtime.jar=destfile=/home/jenkins/agent/workspace/ease.verify.core.target.2019-03/tests/org.eclipse.ease.ui.scripts.test/target/jacoco.exec,output=file, -Dosgi.clean=true, -jar, /home/jenkins/.m2/repository/p2/osgi/bundle/org.eclipse.equinox.launcher/1.6.200.v20210416-2027/org.eclipse.equinox.launcher-1.6.200.v20210416-2027.jar, -data, /home/jenkins/agent/workspace/ease.verify.core.target.2019-03/tests/org.eclipse.ease.ui.scripts.test/target/work/data, -install, /home/jenkins/agent/workspace/ease.verify.core.target.2019-03/tests/org.eclipse.ease.ui.scripts.test/target/work, -configuration, /home/jenkins/agent/workspace/ease.verify.core.target.2019-03/tests/org.eclipse.ease.ui.scripts.test/target/work/configuration, -application, org.eclipse.tycho.surefire.osgibooter.headlesstest, -testproperties, /home/jenkins/agent/workspace/ease.verify.core.target.2019-03/tests/org.eclipse.ease.ui.scripts.test/target/surefire.properties]
17:44:42 [2021-07-10T21:44:42.684Z] Picked up JAVA_TOOL_OPTIONS: -Dmaven.ext.class.path="/home/jenkins/agent/workspace/ease.verify.core.target.2019-03@tmp/withMaven6748b77a/pipeline-maven-spy.jar" -Dorg.jenkinsci.plugins.pipeline.maven.reportsFolder="/home/jenkins/agent/workspace/ease.verify.core.target.2019-03@tmp/withMaven6748b77a" 
17:44:46 [2021-07-10T21:44:46.970Z] Jul 10, 2021 9:44:46 PM org.junit.platform.launcher.core.DefaultLauncher handleThrowable
17:44:46 [2021-07-10T21:44:46.970Z] WARNING: TestEngine with ID 'junit-vintage' failed to discover tests
17:44:46 [2021-07-10T21:44:46.970Z] java.lang.NoClassDefFoundError: org/junit/runners/model/RunnerBuilder
17:44:46 [2021-07-10T21:44:46.970Z] 	at org.junit.vintage.engine.discovery.VintageDiscoverer.<init>(VintageDiscoverer.java:48)
17:44:46 [2021-07-10T21:44:46.970Z] 	at org.junit.vintage.engine.VintageTestEngine.discover(VintageTestEngine.java:65)
17:44:46 [2021-07-10T21:44:46.970Z] 	at org.junit.platform.launcher.core.DefaultLauncher.discoverEngineRoot(DefaultLauncher.java:130)
17:44:46 [2021-07-10T21:44:46.970Z] 	at org.junit.platform.launcher.core.DefaultLauncher.discoverRoot(DefaultLauncher.java:117)
17:44:46 [2021-07-10T21:44:46.970Z] 	at org.junit.platform.launcher.core.DefaultLauncher.discover(DefaultLauncher.java:82)
17:44:46 [2021-07-10T21:44:46.970Z] 	at org.apache.maven.surefire.junitplatform.TestPlanScannerFilter.accept(TestPlanScannerFilter.java:56)
17:44:46 [2021-07-10T21:44:46.970Z] 	at org.apache.maven.surefire.util.DefaultScanResult.applyFilter(DefaultScanResult.java:102)
17:44:46 [2021-07-10T21:44:46.970Z] 	at org.apache.maven.surefire.junitplatform.JUnitPlatformProvider.scanClasspath(JUnitPlatformProvider.java:143)
17:44:46 [2021-07-10T21:44:46.970Z] 	at org.apache.maven.surefire.junitplatform.JUnitPlatformProvider.invoke(JUnitPlatformProvider.java:124)
17:44:46 [2021-07-10T21:44:46.970Z] 	at java.base/jdk.internal.reflect.NativeMethodAccessorImpl.invoke0(Native Method)
17:44:46 [2021-07-10T21:44:46.970Z] 	at java.base/jdk.internal.reflect.NativeMethodAccessorImpl.invoke(NativeMethodAccessorImpl.java:64)
17:44:46 [2021-07-10T21:44:46.970Z] 	at java.base/jdk.internal.reflect.DelegatingMethodAccessorImpl.invoke(DelegatingMethodAccessorImpl.java:43)
17:44:46 [2021-07-10T21:44:46.970Z] 	at java.base/java.lang.reflect.Method.invoke(Method.java:564)
17:44:46 [2021-07-10T21:44:46.970Z] 	at org.apache.maven.surefire.util.ReflectionUtils.invokeMethodWithArray2(ReflectionUtils.java:206)
17:44:46 [2021-07-10T21:44:46.970Z] 	at org.apache.maven.surefire.booter.ProviderFactory$ProviderProxy.invoke(ProviderFactory.java:161)
17:44:46 [2021-07-10T21:44:46.970Z] 	at org.apache.maven.surefire.booter.ProviderFactory.invokeProvider(ProviderFactory.java:84)
17:44:46 [2021-07-10T21:44:46.970Z] 	at org.eclipse.tycho.surefire.osgibooter.OsgiSurefireBooter.run(OsgiSurefireBooter.java:116)
17:44:46 [2021-07-10T21:44:46.970Z] 	at org.eclipse.tycho.surefire.osgibooter.HeadlessTestApplication.start(HeadlessTestApplication.java:23)
17:44:46 [2021-07-10T21:44:46.970Z] 	at org.eclipse.equinox.internal.app.EclipseAppHandle.run(EclipseAppHandle.java:203)
17:44:46 [2021-07-10T21:44:46.970Z] 	at org.eclipse.core.runtime.internal.adaptor.EclipseAppLauncher.runApplication(EclipseAppLauncher.java:134)
17:44:46 [2021-07-10T21:44:46.970Z] 	at org.eclipse.core.runtime.internal.adaptor.EclipseAppLauncher.start(EclipseAppLauncher.java:104)
17:44:46 [2021-07-10T21:44:46.970Z] 	at org.eclipse.core.runtime.adaptor.EclipseStarter.run(EclipseStarter.java:401)
17:44:46 [2021-07-10T21:44:46.970Z] 	at org.eclipse.core.runtime.adaptor.EclipseStarter.run(EclipseStarter.java:255)
17:44:46 [2021-07-10T21:44:46.970Z] 	at java.base/jdk.internal.reflect.NativeMethodAccessorImpl.invoke0(Native Method)
17:44:46 [2021-07-10T21:44:46.970Z] 	at java.base/jdk.internal.reflect.NativeMethodAccessorImpl.invoke(NativeMethodAccessorImpl.java:64)
17:44:46 [2021-07-10T21:44:46.970Z] 	at java.base/jdk.internal.reflect.DelegatingMethodAccessorImpl.invoke(DelegatingMethodAccessorImpl.java:43)
17:44:46 [2021-07-10T21:44:46.970Z] 	at java.base/java.lang.reflect.Method.invoke(Method.java:564)
17:44:46 [2021-07-10T21:44:46.970Z] 	at org.eclipse.equinox.launcher.Main.invokeFramework(Main.java:654)
17:44:46 [2021-07-10T21:44:46.970Z] 	at org.eclipse.equinox.launcher.Main.basicRun(Main.java:591)
17:44:46 [2021-07-10T21:44:46.970Z] 	at org.eclipse.equinox.launcher.Main.run(Main.java:1462)
17:44:46 [2021-07-10T21:44:46.971Z] 	at org.eclipse.equinox.launcher.Main.main(Main.java:1435)
17:44:46 [2021-07-10T21:44:46.971Z] Caused by: java.lang.ClassNotFoundException: org.junit.runners.model.RunnerBuilder cannot be found by org.eclipse.tycho.surefire.osgibooter_2.2.0
17:44:46 [2021-07-10T21:44:46.971Z] 	at org.eclipse.osgi.internal.loader.BundleLoader.findClass(BundleLoader.java:519)
17:44:46 [2021-07-10T21:44:46.971Z] 	at org.eclipse.osgi.internal.loader.ModuleClassLoader.loadClass(ModuleClassLoader.java:170)
17:44:46 [2021-07-10T21:44:46.971Z] 	at java.base/java.lang.ClassLoader.loadClass(ClassLoader.java:522)
17:44:46 [2021-07-10T21:44:46.971Z] 	... 31 more
17:44:46 [2021-07-10T21:44:46.971Z] 
17:44:46 [2021-07-10T21:44:46.971Z] Jul 10, 2021 9:44:46 PM org.junit.platform.launcher.core.DefaultLauncher handleThrowable
17:44:46 [2021-07-10T21:44:46.971Z] WARNING: TestEngine with ID 'junit-vintage' failed to discover tests
17:44:46 [2021-07-10T21:44:46.971Z] java.lang.NoClassDefFoundError: org/junit/runners/model/RunnerBuilder
17:44:46 [2021-07-10T21:44:46.971Z] 	at org.junit.vintage.engine.discovery.VintageDiscoverer.<init>(VintageDiscoverer.java:48)
17:44:46 [2021-07-10T21:44:46.971Z] 	at org.junit.vintage.engine.VintageTestEngine.discover(VintageTestEngine.java:65)
17:44:46 [2021-07-10T21:44:46.971Z] 	at org.junit.platform.launcher.core.DefaultLauncher.discoverEngineRoot(DefaultLauncher.java:130)
17:44:46 [2021-07-10T21:44:46.971Z] 	at org.junit.platform.launcher.core.DefaultLauncher.discoverRoot(DefaultLauncher.java:117)
17:44:46 [2021-07-10T21:44:46.971Z] 	at org.junit.platform.launcher.core.DefaultLauncher.execute(DefaultLauncher.java:90)
17:44:46 [2021-07-10T21:44:46.971Z] 	at org.apache.maven.surefire.junitplatform.JUnitPlatformProvider.invokeAllTests(JUnitPlatformProvider.java:150)
17:44:46 [2021-07-10T21:44:46.971Z] 	at org.apache.maven.surefire.junitplatform.JUnitPlatformProvider.invoke(JUnitPlatformProvider.java:124)
17:44:46 [2021-07-10T21:44:46.971Z] 	at java.base/jdk.internal.reflect.NativeMethodAccessorImpl.invoke0(Native Method)
17:44:46 [2021-07-10T21:44:46.971Z] 	at java.base/jdk.internal.reflect.NativeMethodAccessorImpl.invoke(NativeMethodAccessorImpl.java:64)
17:44:46 [2021-07-10T21:44:46.971Z] 	at java.base/jdk.internal.reflect.DelegatingMethodAccessorImpl.invoke(DelegatingMethodAccessorImpl.java:43)
17:44:46 [2021-07-10T21:44:46.971Z] 	at java.base/java.lang.reflect.Method.invoke(Method.java:564)
17:44:46 [2021-07-10T21:44:46.971Z] 	at org.apache.maven.surefire.util.ReflectionUtils.invokeMethodWithArray2(ReflectionUtils.java:206)
17:44:46 [2021-07-10T21:44:46.971Z] 	at org.apache.maven.surefire.booter.ProviderFactory$ProviderProxy.invoke(ProviderFactory.java:161)
17:44:46 [2021-07-10T21:44:46.971Z] 	at org.apache.maven.surefire.booter.ProviderFactory.invokeProvider(ProviderFactory.java:84)
17:44:46 [2021-07-10T21:44:46.971Z] 	at org.eclipse.tycho.surefire.osgibooter.OsgiSurefireBooter.run(OsgiSurefireBooter.java:116)
17:44:46 [2021-07-10T21:44:46.971Z] 	at org.eclipse.tycho.surefire.osgibooter.HeadlessTestApplication.start(HeadlessTestApplication.java:23)
17:44:46 [2021-07-10T21:44:46.971Z] 	at org.eclipse.equinox.internal.app.EclipseAppHandle.run(EclipseAppHandle.java:203)
17:44:46 [2021-07-10T21:44:46.971Z] 	at org.eclipse.core.runtime.internal.adaptor.EclipseAppLauncher.runApplication(EclipseAppLauncher.java:134)
17:44:46 [2021-07-10T21:44:46.971Z] 	at org.eclipse.core.runtime.internal.adaptor.EclipseAppLauncher.start(EclipseAppLauncher.java:104)
17:44:46 [2021-07-10T21:44:46.971Z] 	at org.eclipse.core.runtime.adaptor.EclipseStarter.run(EclipseStarter.java:401)
17:44:46 [2021-07-10T21:44:46.971Z] 	at org.eclipse.core.runtime.adaptor.EclipseStarter.run(EclipseStarter.java:255)
17:44:46 [2021-07-10T21:44:46.971Z] 	at java.base/jdk.internal.reflect.NativeMethodAccessorImpl.invoke0(Native Method)
17:44:46 [2021-07-10T21:44:46.971Z] 	at java.base/jdk.internal.reflect.NativeMethodAccessorImpl.invoke(NativeMethodAccessorImpl.java:64)
17:44:46 [2021-07-10T21:44:46.971Z] 	at java.base/jdk.internal.reflect.DelegatingMethodAccessorImpl.invoke(DelegatingMethodAccessorImpl.java:43)
17:44:46 [2021-07-10T21:44:46.971Z] 	at java.base/java.lang.reflect.Method.invoke(Method.java:564)
17:44:46 [2021-07-10T21:44:46.971Z] 	at org.eclipse.equinox.launcher.Main.invokeFramework(Main.java:654)
17:44:46 [2021-07-10T21:44:46.971Z] 	at org.eclipse.equinox.launcher.Main.basicRun(Main.java:591)
17:44:46 [2021-07-10T21:44:46.971Z] 	at org.eclipse.equinox.launcher.Main.run(Main.java:1462)
17:44:46 [2021-07-10T21:44:46.971Z] 	at org.eclipse.equinox.launcher.Main.main(Main.java:1435)
17:44:46 [2021-07-10T21:44:46.971Z] Caused by: java.lang.ClassNotFoundException: org.junit.runners.model.RunnerBuilder cannot be found by org.eclipse.tycho.surefire.osgibooter_2.2.0
17:44:46 [2021-07-10T21:44:46.971Z] 	at org.eclipse.osgi.internal.loader.BundleLoader.findClass(BundleLoader.java:519)
17:44:46 [2021-07-10T21:44:46.971Z] 	at org.eclipse.osgi.internal.loader.ModuleClassLoader.loadClass(ModuleClassLoader.java:170)
17:44:46 [2021-07-10T21:44:46.971Z] 	at java.base/java.lang.ClassLoader.loadClass(ClassLoader.java:522)
17:44:46 [2021-07-10T21:44:46.971Z] 	... 29 more
17:44:46 [2021-07-10T21:44:46.971Z] 
17:44:46 [2021-07-10T21:44:46.971Z] Running org.eclipse.ease.ui.scripts.expressions.definitions.ExpressionFactoryTest
17:44:46 [2021-07-10T21:44:46.971Z] Tests run: 14, Failures: 0, Errors: 0, Skipped: 0, Time elapsed: 0.075 s - in org.eclipse.ease.ui.scripts.expressions.definitions.ExpressionFactoryTest
17:44:46 [2021-07-10T21:44:46.971Z] loadClassWithExpression  Time elapsed: 0.044 s
17:44:46 [2021-07-10T21:44:46.971Z] createWithExpression  Time elapsed: 0.001 s
17:44:46 [2021-07-10T21:44:46.971Z] createReferenceExpression  Time elapsed: 0.001 s
17:44:46 [2021-07-10T21:44:46.971Z] loadClassReferenceExpression  Time elapsed: 0 s
17:44:46 [2021-07-10T21:44:46.971Z] loadClassTestExpression  Time elapsed: 0.002 s
17:44:46 [2021-07-10T21:44:46.971Z] createEqualsExpression  Time elapsed: 0.001 s
17:44:46 [2021-07-10T21:44:46.971Z] loadClassCountExpression  Time elapsed: 0.002 s
17:44:46 [2021-07-10T21:44:46.971Z] loadClassOrExpression  Time elapsed: 0.001 s
17:44:46 [2021-07-10T21:44:46.971Z] createTestExpression  Time elapsed: 0.005 s
17:44:46 [2021-07-10T21:44:46.971Z] createOrExpression  Time elapsed: 0.002 s
17:44:46 [2021-07-10T21:44:46.971Z] loadClassAndExpression  Time elapsed: 0.001 s
17:44:46 [2021-07-10T21:44:46.971Z] createAndExpression  Time elapsed: 0.001 s
17:44:46 [2021-07-10T21:44:46.971Z] loadClassEqualsExpression  Time elapsed: 0.001 s
17:44:46 [2021-07-10T21:44:46.971Z] createCountExpression  Time elapsed: 0.001 s
17:44:46 [2021-07-10T21:44:46.971Z] 
17:44:46 [2021-07-10T21:44:46.971Z] Results:
17:44:46 [2021-07-10T21:44:46.971Z] 
17:44:46 [2021-07-10T21:44:46.971Z] Tests run: 14, Failures: 0, Errors: 0, Skipped: 0
17:44:46 [2021-07-10T21:44:46.971Z] 
17:44:47 [2021-07-10T21:44:47.228Z] [INFO] All tests passed!
17:44:47 [2021-07-10T21:44:47.228Z] [INFO] 
17:44:47 [2021-07-10T21:44:47.228Z] [INFO] --- maven-pmd-plugin:3.14.0:pmd (pmd-integration) @ org.eclipse.ease.ui.scripts.test ---
17:44:47 [2021-07-10T21:44:47.791Z] [INFO] 
17:44:47 [2021-07-10T21:44:47.791Z] [INFO] --- maven-pmd-plugin:3.14.0:cpd (pmd-integration) @ org.eclipse.ease.ui.scripts.test ---
17:44:47 [2021-07-10T21:44:47.791Z] [INFO] 
17:44:47 [2021-07-10T21:44:47.791Z] [INFO] --- spotbugs-maven-plugin:4.1.4:spotbugs (spotbugs-integration) @ org.eclipse.ease.ui.scripts.test ---
17:44:47 [2021-07-10T21:44:47.791Z] [INFO] Fork Value is false
17:44:47 [2021-07-10T21:44:47.791Z]      [java] JVM args ignored when same JVM is used.
17:44:51 [2021-07-10T21:44:51.077Z] [INFO] Done SpotBugs Analysis....
17:44:51 [2021-07-10T21:44:51.077Z] [INFO] 
17:44:51 [2021-07-10T21:44:51.077Z] [INFO] --- maven-checkstyle-plugin:3.1.1:check (checkstyle-integration) @ org.eclipse.ease.ui.scripts.test ---
17:44:51 [2021-07-10T21:44:51.077Z] [INFO] You have 0 Checkstyle violations.
17:44:51 [2021-07-10T21:44:51.077Z] [INFO] 
17:44:51 [2021-07-10T21:44:51.077Z] [INFO] --- maven-install-plugin:2.3.1:install (default-install) @ org.eclipse.ease.ui.scripts.test ---
17:44:51 [2021-07-10T21:44:51.077Z] [INFO] Installing /home/jenkins/agent/workspace/ease.verify.core.target.2019-03/tests/org.eclipse.ease.ui.scripts.test/target/org.eclipse.ease.ui.scripts.test-0.9.0-SNAPSHOT.jar to /home/jenkins/.m2/repository/org/eclipse/ease/org.eclipse.ease.ui.scripts.test/0.9.0-SNAPSHOT/org.eclipse.ease.ui.scripts.test-0.9.0-SNAPSHOT.jar
17:44:51 [2021-07-10T21:44:51.077Z] [INFO] Installing /home/jenkins/agent/workspace/ease.verify.core.target.2019-03/tests/org.eclipse.ease.ui.scripts.test/pom.xml to /home/jenkins/.m2/repository/org/eclipse/ease/org.eclipse.ease.ui.scripts.test/0.9.0-SNAPSHOT/org.eclipse.ease.ui.scripts.test-0.9.0-SNAPSHOT.pom
17:44:51 [2021-07-10T21:44:51.077Z] [INFO] Installing /home/jenkins/agent/workspace/ease.verify.core.target.2019-03/tests/org.eclipse.ease.ui.scripts.test/target/p2content.xml to /home/jenkins/.m2/repository/org/eclipse/ease/org.eclipse.ease.ui.scripts.test/0.9.0-SNAPSHOT/org.eclipse.ease.ui.scripts.test-0.9.0-SNAPSHOT-p2metadata.xml
17:44:51 [2021-07-10T21:44:51.077Z] [INFO] Installing /home/jenkins/agent/workspace/ease.verify.core.target.2019-03/tests/org.eclipse.ease.ui.scripts.test/target/p2artifacts.xml to /home/jenkins/.m2/repository/org/eclipse/ease/org.eclipse.ease.ui.scripts.test/0.9.0-SNAPSHOT/org.eclipse.ease.ui.scripts.test-0.9.0-SNAPSHOT-p2artifacts.xml
17:44:51 [2021-07-10T21:44:51.077Z] [INFO] 
17:44:51 [2021-07-10T21:44:51.077Z] [INFO] --- tycho-p2-plugin:2.2.0:update-local-index (default-update-local-index) @ org.eclipse.ease.ui.scripts.test ---
17:44:51 [2021-07-10T21:44:51.077Z] [INFO] 
17:44:51 [2021-07-10T21:44:51.077Z] [INFO] -------------< org.eclipse.ease:org.eclipse.ease.ui.test >--------------
17:44:51 [2021-07-10T21:44:51.077Z] [INFO] Building org.eclipse.ease.ui.test 0.9.0-SNAPSHOT                 [46/48]
17:44:51 [2021-07-10T21:44:51.077Z] [INFO] ------------------------[ eclipse-test-plugin ]-------------------------
17:44:51 [2021-07-10T21:44:51.077Z] [INFO] 
17:44:51 [2021-07-10T21:44:51.077Z] [INFO] --- maven-clean-plugin:2.5:clean (default-clean) @ org.eclipse.ease.ui.test ---
17:44:51 [2021-07-10T21:44:51.077Z] [INFO] 
17:44:51 [2021-07-10T21:44:51.077Z] [INFO] --- tycho-packaging-plugin:2.2.0:build-qualifier (default-build-qualifier) @ org.eclipse.ease.ui.test ---
17:44:51 [2021-07-10T21:44:51.077Z] [INFO] The project's OSGi version is 0.9.0.I202106220815
17:44:51 [2021-07-10T21:44:51.077Z] [INFO] 
17:44:51 [2021-07-10T21:44:51.077Z] [INFO] --- tycho-packaging-plugin:2.2.0:validate-id (default-validate-id) @ org.eclipse.ease.ui.test ---
17:44:51 [2021-07-10T21:44:51.077Z] [INFO] 
17:44:51 [2021-07-10T21:44:51.077Z] [INFO] --- tycho-packaging-plugin:2.2.0:validate-version (default-validate-version) @ org.eclipse.ease.ui.test ---
17:44:51 [2021-07-10T21:44:51.077Z] [INFO] 
17:44:51 [2021-07-10T21:44:51.077Z] [INFO] --- maven-resources-plugin:2.4.3:resources (default-resources) @ org.eclipse.ease.ui.test ---
17:44:51 [2021-07-10T21:44:51.077Z] [INFO] Using 'UTF-8' encoding to copy filtered resources.
17:44:51 [2021-07-10T21:44:51.077Z] [INFO] skip non existing resourceDirectory /home/jenkins/agent/workspace/ease.verify.core.target.2019-03/tests/org.eclipse.ease.ui.test/src/main/resources
17:44:51 [2021-07-10T21:44:51.077Z] [INFO] 
17:44:51 [2021-07-10T21:44:51.077Z] [INFO] --- tycho-compiler-plugin:2.2.0:compile (default-compile) @ org.eclipse.ease.ui.test ---
17:44:51 [2021-07-10T21:44:51.077Z] [INFO] Compiling 13 source files to /home/jenkins/agent/workspace/ease.verify.core.target.2019-03/tests/org.eclipse.ease.ui.test/target/classes
17:44:51 [2021-07-10T21:44:51.077Z] [INFO] 
17:44:51 [2021-07-10T21:44:51.077Z] [INFO] --- maven-resources-plugin:2.4.3:testResources (default-testResources) @ org.eclipse.ease.ui.test ---
17:44:51 [2021-07-10T21:44:51.077Z] [INFO] Using 'UTF-8' encoding to copy filtered resources.
17:44:51 [2021-07-10T21:44:51.077Z] [INFO] skip non existing resourceDirectory /home/jenkins/agent/workspace/ease.verify.core.target.2019-03/tests/org.eclipse.ease.ui.test/src/test/resources
17:44:51 [2021-07-10T21:44:51.077Z] [INFO] 
17:44:51 [2021-07-10T21:44:51.077Z] [INFO] --- target-platform-configuration:2.2.0:target-platform (default-target-platform) @ org.eclipse.ease.ui.test ---
17:44:51 [2021-07-10T21:44:51.077Z] [INFO] 
17:44:51 [2021-07-10T21:44:51.077Z] [INFO] --- tycho-packaging-plugin:2.2.0:package-plugin (default-package-plugin) @ org.eclipse.ease.ui.test ---
17:44:51 [2021-07-10T21:44:51.077Z] [INFO] Building jar: /home/jenkins/agent/workspace/ease.verify.core.target.2019-03/tests/org.eclipse.ease.ui.test/target/org.eclipse.ease.ui.test-0.9.0-SNAPSHOT.jar
17:44:51 [2021-07-10T21:44:51.077Z] [INFO] 
17:44:51 [2021-07-10T21:44:51.077Z] [INFO] --- tycho-p2-plugin:2.2.0:p2-metadata-default (default-p2-metadata-default) @ org.eclipse.ease.ui.test ---
17:44:51 [2021-07-10T21:44:51.077Z] [INFO] 
17:44:51 [2021-07-10T21:44:51.077Z] [INFO] --- jacoco-maven-plugin:0.8.6:prepare-agent (jacoco-initialize) @ org.eclipse.ease.ui.test ---
17:44:51 [2021-07-10T21:44:51.077Z] [INFO] tycho.testArgLine set to -javaagent:/home/jenkins/.m2/repository/org/jacoco/org.jacoco.agent/0.8.6/org.jacoco.agent-0.8.6-runtime.jar=destfile=/home/jenkins/agent/workspace/ease.verify.core.target.2019-03/tests/org.eclipse.ease.ui.test/target/jacoco.exec,output=file
17:44:51 [2021-07-10T21:44:51.077Z] [INFO] 
17:44:51 [2021-07-10T21:44:51.077Z] [INFO] --- tycho-surefire-plugin:2.2.0:test (default-test) @ org.eclipse.ease.ui.test ---
17:44:51 [2021-07-10T21:44:51.077Z] [INFO] Executing Test Runtime with timeout 0, logs (if any) will be placed at: /home/jenkins/agent/workspace/ease.verify.core.target.2019-03/tests/org.eclipse.ease.ui.test/target/work/data/.metadata/.log
17:44:51 [2021-07-10T21:44:51.077Z] [INFO] Command line:
17:44:51 [2021-07-10T21:44:51.077Z] 	[/opt/tools/java/openjdk/jdk-15/15.0.2+7/bin/java, -Dosgi.noShutdown=false, -Dosgi.os=linux, -Dosgi.ws=gtk, -Dosgi.arch=x86_64, -javaagent:/home/jenkins/.m2/repository/org/jacoco/org.jacoco.agent/0.8.6/org.jacoco.agent-0.8.6-runtime.jar=destfile=/home/jenkins/agent/workspace/ease.verify.core.target.2019-03/tests/org.eclipse.ease.ui.test/target/jacoco.exec,output=file, -Dosgi.clean=true, -jar, /home/jenkins/.m2/repository/p2/osgi/bundle/org.eclipse.equinox.launcher/1.6.200.v20210416-2027/org.eclipse.equinox.launcher-1.6.200.v20210416-2027.jar, -data, /home/jenkins/agent/workspace/ease.verify.core.target.2019-03/tests/org.eclipse.ease.ui.test/target/work/data, -install, /home/jenkins/agent/workspace/ease.verify.core.target.2019-03/tests/org.eclipse.ease.ui.test/target/work, -configuration, /home/jenkins/agent/workspace/ease.verify.core.target.2019-03/tests/org.eclipse.ease.ui.test/target/work/configuration, -application, org.eclipse.tycho.surefire.osgibooter.headlesstest, -testproperties, /home/jenkins/agent/workspace/ease.verify.core.target.2019-03/tests/org.eclipse.ease.ui.test/target/surefire.properties]
17:44:51 [2021-07-10T21:44:51.078Z] Picked up JAVA_TOOL_OPTIONS: -Dmaven.ext.class.path="/home/jenkins/agent/workspace/ease.verify.core.target.2019-03@tmp/withMaven6748b77a/pipeline-maven-spy.jar" -Dorg.jenkinsci.plugins.pipeline.maven.reportsFolder="/home/jenkins/agent/workspace/ease.verify.core.target.2019-03@tmp/withMaven6748b77a" 
17:44:55 [2021-07-10T21:44:55.270Z] Jul 10, 2021 9:44:54 PM org.junit.platform.launcher.core.DefaultLauncher handleThrowable
17:44:55 [2021-07-10T21:44:55.270Z] WARNING: TestEngine with ID 'junit-vintage' failed to discover tests
17:44:55 [2021-07-10T21:44:55.270Z] java.lang.NoClassDefFoundError: org/junit/runners/model/RunnerBuilder
17:44:55 [2021-07-10T21:44:55.270Z] 	at org.junit.vintage.engine.discovery.VintageDiscoverer.<init>(VintageDiscoverer.java:48)
17:44:55 [2021-07-10T21:44:55.270Z] 	at org.junit.vintage.engine.VintageTestEngine.discover(VintageTestEngine.java:65)
17:44:55 [2021-07-10T21:44:55.270Z] 	at org.junit.platform.launcher.core.DefaultLauncher.discoverEngineRoot(DefaultLauncher.java:130)
17:44:55 [2021-07-10T21:44:55.270Z] 	at org.junit.platform.launcher.core.DefaultLauncher.discoverRoot(DefaultLauncher.java:117)
17:44:55 [2021-07-10T21:44:55.270Z] 	at org.junit.platform.launcher.core.DefaultLauncher.discover(DefaultLauncher.java:82)
17:44:55 [2021-07-10T21:44:55.270Z] 	at org.apache.maven.surefire.junitplatform.TestPlanScannerFilter.accept(TestPlanScannerFilter.java:56)
17:44:55 [2021-07-10T21:44:55.270Z] 	at org.apache.maven.surefire.util.DefaultScanResult.applyFilter(DefaultScanResult.java:102)
17:44:55 [2021-07-10T21:44:55.270Z] 	at org.apache.maven.surefire.junitplatform.JUnitPlatformProvider.scanClasspath(JUnitPlatformProvider.java:143)
17:44:55 [2021-07-10T21:44:55.270Z] 	at org.apache.maven.surefire.junitplatform.JUnitPlatformProvider.invoke(JUnitPlatformProvider.java:124)
17:44:55 [2021-07-10T21:44:55.270Z] 	at java.base/jdk.internal.reflect.NativeMethodAccessorImpl.invoke0(Native Method)
17:44:55 [2021-07-10T21:44:55.270Z] 	at java.base/jdk.internal.reflect.NativeMethodAccessorImpl.invoke(NativeMethodAccessorImpl.java:64)
17:44:55 [2021-07-10T21:44:55.270Z] 	at java.base/jdk.internal.reflect.DelegatingMethodAccessorImpl.invoke(DelegatingMethodAccessorImpl.java:43)
17:44:55 [2021-07-10T21:44:55.270Z] 	at java.base/java.lang.reflect.Method.invoke(Method.java:564)
17:44:55 [2021-07-10T21:44:55.270Z] 	at org.apache.maven.surefire.util.ReflectionUtils.invokeMethodWithArray2(ReflectionUtils.java:206)
17:44:55 [2021-07-10T21:44:55.270Z] 	at org.apache.maven.surefire.booter.ProviderFactory$ProviderProxy.invoke(ProviderFactory.java:161)
17:44:55 [2021-07-10T21:44:55.270Z] 	at org.apache.maven.surefire.booter.ProviderFactory.invokeProvider(ProviderFactory.java:84)
17:44:55 [2021-07-10T21:44:55.270Z] 	at org.eclipse.tycho.surefire.osgibooter.OsgiSurefireBooter.run(OsgiSurefireBooter.java:116)
17:44:55 [2021-07-10T21:44:55.270Z] 	at org.eclipse.tycho.surefire.osgibooter.HeadlessTestApplication.start(HeadlessTestApplication.java:23)
17:44:55 [2021-07-10T21:44:55.270Z] 	at org.eclipse.equinox.internal.app.EclipseAppHandle.run(EclipseAppHandle.java:203)
17:44:55 [2021-07-10T21:44:55.270Z] 	at org.eclipse.core.runtime.internal.adaptor.EclipseAppLauncher.runApplication(EclipseAppLauncher.java:134)
17:44:55 [2021-07-10T21:44:55.270Z] 	at org.eclipse.core.runtime.internal.adaptor.EclipseAppLauncher.start(EclipseAppLauncher.java:104)
17:44:55 [2021-07-10T21:44:55.270Z] 	at org.eclipse.core.runtime.adaptor.EclipseStarter.run(EclipseStarter.java:401)
17:44:55 [2021-07-10T21:44:55.270Z] 	at org.eclipse.core.runtime.adaptor.EclipseStarter.run(EclipseStarter.java:255)
17:44:55 [2021-07-10T21:44:55.270Z] 	at java.base/jdk.internal.reflect.NativeMethodAccessorImpl.invoke0(Native Method)
17:44:55 [2021-07-10T21:44:55.270Z] 	at java.base/jdk.internal.reflect.NativeMethodAccessorImpl.invoke(NativeMethodAccessorImpl.java:64)
17:44:55 [2021-07-10T21:44:55.270Z] 	at java.base/jdk.internal.reflect.DelegatingMethodAccessorImpl.invoke(DelegatingMethodAccessorImpl.java:43)
17:44:55 [2021-07-10T21:44:55.270Z] 	at java.base/java.lang.reflect.Method.invoke(Method.java:564)
17:44:55 [2021-07-10T21:44:55.270Z] 	at org.eclipse.equinox.launcher.Main.invokeFramework(Main.java:654)
17:44:55 [2021-07-10T21:44:55.271Z] 	at org.eclipse.equinox.launcher.Main.basicRun(Main.java:591)
17:44:55 [2021-07-10T21:44:55.271Z] 	at org.eclipse.equinox.launcher.Main.run(Main.java:1462)
17:44:55 [2021-07-10T21:44:55.271Z] 	at org.eclipse.equinox.launcher.Main.main(Main.java:1435)
17:44:55 [2021-07-10T21:44:55.271Z] Caused by: java.lang.ClassNotFoundException: org.junit.runners.model.RunnerBuilder cannot be found by org.eclipse.tycho.surefire.osgibooter_2.2.0
17:44:55 [2021-07-10T21:44:55.271Z] 	at org.eclipse.osgi.internal.loader.BundleLoader.findClass(BundleLoader.java:519)
17:44:55 [2021-07-10T21:44:55.271Z] 	at org.eclipse.osgi.internal.loader.ModuleClassLoader.loadClass(ModuleClassLoader.java:170)
17:44:55 [2021-07-10T21:44:55.271Z] 	at java.base/java.lang.ClassLoader.loadClass(ClassLoader.java:522)
17:44:55 [2021-07-10T21:44:55.271Z] 	... 31 more
17:44:55 [2021-07-10T21:44:55.271Z] 
17:44:55 [2021-07-10T21:44:55.271Z] Jul 10, 2021 9:44:54 PM org.junit.platform.launcher.core.DefaultLauncher handleThrowable
17:44:55 [2021-07-10T21:44:55.271Z] WARNING: TestEngine with ID 'junit-vintage' failed to discover tests
17:44:55 [2021-07-10T21:44:55.271Z] java.lang.NoClassDefFoundError: org/junit/runners/model/RunnerBuilder
17:44:55 [2021-07-10T21:44:55.271Z] 	at org.junit.vintage.engine.discovery.VintageDiscoverer.<init>(VintageDiscoverer.java:48)
17:44:55 [2021-07-10T21:44:55.271Z] 	at org.junit.vintage.engine.VintageTestEngine.discover(VintageTestEngine.java:65)
17:44:55 [2021-07-10T21:44:55.271Z] 	at org.junit.platform.launcher.core.DefaultLauncher.discoverEngineRoot(DefaultLauncher.java:130)
17:44:55 [2021-07-10T21:44:55.271Z] 	at org.junit.platform.launcher.core.DefaultLauncher.discoverRoot(DefaultLauncher.java:117)
17:44:55 [2021-07-10T21:44:55.271Z] 	at org.junit.platform.launcher.core.DefaultLauncher.discover(DefaultLauncher.java:82)
17:44:55 [2021-07-10T21:44:55.271Z] 	at org.apache.maven.surefire.junitplatform.TestPlanScannerFilter.accept(TestPlanScannerFilter.java:56)
17:44:55 [2021-07-10T21:44:55.271Z] 	at org.apache.maven.surefire.util.DefaultScanResult.applyFilter(DefaultScanResult.java:102)
17:44:55 [2021-07-10T21:44:55.271Z] 	at org.apache.maven.surefire.junitplatform.JUnitPlatformProvider.scanClasspath(JUnitPlatformProvider.java:143)
17:44:55 [2021-07-10T21:44:55.271Z] 	at org.apache.maven.surefire.junitplatform.JUnitPlatformProvider.invoke(JUnitPlatformProvider.java:124)
17:44:55 [2021-07-10T21:44:55.271Z] 	at java.base/jdk.internal.reflect.NativeMethodAccessorImpl.invoke0(Native Method)
17:44:55 [2021-07-10T21:44:55.271Z] 	at java.base/jdk.internal.reflect.NativeMethodAccessorImpl.invoke(NativeMethodAccessorImpl.java:64)
17:44:55 [2021-07-10T21:44:55.271Z] 	at java.base/jdk.internal.reflect.DelegatingMethodAccessorImpl.invoke(DelegatingMethodAccessorImpl.java:43)
17:44:55 [2021-07-10T21:44:55.271Z] 	at java.base/java.lang.reflect.Method.invoke(Method.java:564)
17:44:55 [2021-07-10T21:44:55.271Z] 	at org.apache.maven.surefire.util.ReflectionUtils.invokeMethodWithArray2(ReflectionUtils.java:206)
17:44:55 [2021-07-10T21:44:55.271Z] 	at org.apache.maven.surefire.booter.ProviderFactory$ProviderProxy.invoke(ProviderFactory.java:161)
17:44:55 [2021-07-10T21:44:55.271Z] 	at org.apache.maven.surefire.booter.ProviderFactory.invokeProvider(ProviderFactory.java:84)
17:44:55 [2021-07-10T21:44:55.271Z] 	at org.eclipse.tycho.surefire.osgibooter.OsgiSurefireBooter.run(OsgiSurefireBooter.java:116)
17:44:55 [2021-07-10T21:44:55.271Z] 	at org.eclipse.tycho.surefire.osgibooter.HeadlessTestApplication.start(HeadlessTestApplication.java:23)
17:44:55 [2021-07-10T21:44:55.271Z] 	at org.eclipse.equinox.internal.app.EclipseAppHandle.run(EclipseAppHandle.java:203)
17:44:55 [2021-07-10T21:44:55.271Z] 	at org.eclipse.core.runtime.internal.adaptor.EclipseAppLauncher.runApplication(EclipseAppLauncher.java:134)
17:44:55 [2021-07-10T21:44:55.271Z] 	at org.eclipse.core.runtime.internal.adaptor.EclipseAppLauncher.start(EclipseAppLauncher.java:104)
17:44:55 [2021-07-10T21:44:55.271Z] 	at org.eclipse.core.runtime.adaptor.EclipseStarter.run(EclipseStarter.java:401)
17:44:55 [2021-07-10T21:44:55.271Z] 	at org.eclipse.core.runtime.adaptor.EclipseStarter.run(EclipseStarter.java:255)
17:44:55 [2021-07-10T21:44:55.271Z] 	at java.base/jdk.internal.reflect.NativeMethodAccessorImpl.invoke0(Native Method)
17:44:55 [2021-07-10T21:44:55.271Z] 	at java.base/jdk.internal.reflect.NativeMethodAccessorImpl.invoke(NativeMethodAccessorImpl.java:64)
17:44:55 [2021-07-10T21:44:55.271Z] 	at java.base/jdk.internal.reflect.DelegatingMethodAccessorImpl.invoke(DelegatingMethodAccessorImpl.java:43)
17:44:55 [2021-07-10T21:44:55.271Z] 	at java.base/java.lang.reflect.Method.invoke(Method.java:564)
17:44:55 [2021-07-10T21:44:55.271Z] 	at org.eclipse.equinox.launcher.Main.invokeFramework(Main.java:654)
17:44:55 [2021-07-10T21:44:55.271Z] 	at org.eclipse.equinox.launcher.Main.basicRun(Main.java:591)
17:44:55 [2021-07-10T21:44:55.271Z] 	at org.eclipse.equinox.launcher.Main.run(Main.java:1462)
17:44:55 [2021-07-10T21:44:55.271Z] 	at org.eclipse.equinox.launcher.Main.main(Main.java:1435)
17:44:55 [2021-07-10T21:44:55.271Z] Caused by: java.lang.ClassNotFoundException: org.junit.runners.model.RunnerBuilder cannot be found by org.eclipse.tycho.surefire.osgibooter_2.2.0
17:44:55 [2021-07-10T21:44:55.271Z] 	at org.eclipse.osgi.internal.loader.BundleLoader.findClass(BundleLoader.java:519)
17:44:55 [2021-07-10T21:44:55.271Z] 	at org.eclipse.osgi.internal.loader.ModuleClassLoader.loadClass(ModuleClassLoader.java:170)
17:44:55 [2021-07-10T21:44:55.271Z] 	at java.base/java.lang.ClassLoader.loadClass(ClassLoader.java:522)
17:44:55 [2021-07-10T21:44:55.271Z] 	... 31 more
17:44:55 [2021-07-10T21:44:55.271Z] 
17:44:55 [2021-07-10T21:44:55.271Z] Jul 10, 2021 9:44:54 PM org.junit.platform.launcher.core.DefaultLauncher handleThrowable
17:44:55 [2021-07-10T21:44:55.271Z] WARNING: TestEngine with ID 'junit-vintage' failed to discover tests
17:44:55 [2021-07-10T21:44:55.271Z] java.lang.NoClassDefFoundError: org/junit/runners/model/RunnerBuilder
17:44:55 [2021-07-10T21:44:55.271Z] 	at org.junit.vintage.engine.discovery.VintageDiscoverer.<init>(VintageDiscoverer.java:48)
17:44:55 [2021-07-10T21:44:55.271Z] 	at org.junit.vintage.engine.VintageTestEngine.discover(VintageTestEngine.java:65)
17:44:55 [2021-07-10T21:44:55.271Z] 	at org.junit.platform.launcher.core.DefaultLauncher.discoverEngineRoot(DefaultLauncher.java:130)
17:44:55 [2021-07-10T21:44:55.271Z] 	at org.junit.platform.launcher.core.DefaultLauncher.discoverRoot(DefaultLauncher.java:117)
17:44:55 [2021-07-10T21:44:55.271Z] 	at org.junit.platform.launcher.core.DefaultLauncher.discover(DefaultLauncher.java:82)
17:44:55 [2021-07-10T21:44:55.271Z] 	at org.apache.maven.surefire.junitplatform.TestPlanScannerFilter.accept(TestPlanScannerFilter.java:56)
17:44:55 [2021-07-10T21:44:55.271Z] 	at org.apache.maven.surefire.util.DefaultScanResult.applyFilter(DefaultScanResult.java:102)
17:44:55 [2021-07-10T21:44:55.271Z] 	at org.apache.maven.surefire.junitplatform.JUnitPlatformProvider.scanClasspath(JUnitPlatformProvider.java:143)
17:44:55 [2021-07-10T21:44:55.271Z] 	at org.apache.maven.surefire.junitplatform.JUnitPlatformProvider.invoke(JUnitPlatformProvider.java:124)
17:44:55 [2021-07-10T21:44:55.271Z] 	at java.base/jdk.internal.reflect.NativeMethodAccessorImpl.invoke0(Native Method)
17:44:55 [2021-07-10T21:44:55.271Z] 	at java.base/jdk.internal.reflect.NativeMethodAccessorImpl.invoke(NativeMethodAccessorImpl.java:64)
17:44:55 [2021-07-10T21:44:55.271Z] 	at java.base/jdk.internal.reflect.DelegatingMethodAccessorImpl.invoke(DelegatingMethodAccessorImpl.java:43)
17:44:55 [2021-07-10T21:44:55.271Z] 	at java.base/java.lang.reflect.Method.invoke(Method.java:564)
17:44:55 [2021-07-10T21:44:55.271Z] 	at org.apache.maven.surefire.util.ReflectionUtils.invokeMethodWithArray2(ReflectionUtils.java:206)
17:44:55 [2021-07-10T21:44:55.271Z] 	at org.apache.maven.surefire.booter.ProviderFactory$ProviderProxy.invoke(ProviderFactory.java:161)
17:44:55 [2021-07-10T21:44:55.271Z] 	at org.apache.maven.surefire.booter.ProviderFactory.invokeProvider(ProviderFactory.java:84)
17:44:55 [2021-07-10T21:44:55.271Z] 	at org.eclipse.tycho.surefire.osgibooter.OsgiSurefireBooter.run(OsgiSurefireBooter.java:116)
17:44:55 [2021-07-10T21:44:55.271Z] 	at org.eclipse.tycho.surefire.osgibooter.HeadlessTestApplication.start(HeadlessTestApplication.java:23)
17:44:55 [2021-07-10T21:44:55.271Z] 	at org.eclipse.equinox.internal.app.EclipseAppHandle.run(EclipseAppHandle.java:203)
17:44:55 [2021-07-10T21:44:55.271Z] 	at org.eclipse.core.runtime.internal.adaptor.EclipseAppLauncher.runApplication(EclipseAppLauncher.java:134)
17:44:55 [2021-07-10T21:44:55.271Z] 	at org.eclipse.core.runtime.internal.adaptor.EclipseAppLauncher.start(EclipseAppLauncher.java:104)
17:44:55 [2021-07-10T21:44:55.271Z] 	at org.eclipse.core.runtime.adaptor.EclipseStarter.run(EclipseStarter.java:401)
17:44:55 [2021-07-10T21:44:55.271Z] 	at org.eclipse.core.runtime.adaptor.EclipseStarter.run(EclipseStarter.java:255)
17:44:55 [2021-07-10T21:44:55.271Z] 	at java.base/jdk.internal.reflect.NativeMethodAccessorImpl.invoke0(Native Method)
17:44:55 [2021-07-10T21:44:55.271Z] 	at java.base/jdk.internal.reflect.NativeMethodAccessorImpl.invoke(NativeMethodAccessorImpl.java:64)
17:44:55 [2021-07-10T21:44:55.271Z] 	at java.base/jdk.internal.reflect.DelegatingMethodAccessorImpl.invoke(DelegatingMethodAccessorImpl.java:43)
17:44:55 [2021-07-10T21:44:55.271Z] 	at java.base/java.lang.reflect.Method.invoke(Method.java:564)
17:44:55 [2021-07-10T21:44:55.271Z] 	at org.eclipse.equinox.launcher.Main.invokeFramework(Main.java:654)
17:44:55 [2021-07-10T21:44:55.271Z] 	at org.eclipse.equinox.launcher.Main.basicRun(Main.java:591)
17:44:55 [2021-07-10T21:44:55.271Z] 	at org.eclipse.equinox.launcher.Main.run(Main.java:1462)
17:44:55 [2021-07-10T21:44:55.272Z] 	at org.eclipse.equinox.launcher.Main.main(Main.java:1435)
17:44:55 [2021-07-10T21:44:55.272Z] Caused by: java.lang.ClassNotFoundException: org.junit.runners.model.RunnerBuilder cannot be found by org.eclipse.tycho.surefire.osgibooter_2.2.0
17:44:55 [2021-07-10T21:44:55.272Z] 	at org.eclipse.osgi.internal.loader.BundleLoader.findClass(BundleLoader.java:519)
17:44:55 [2021-07-10T21:44:55.272Z] 	at org.eclipse.osgi.internal.loader.ModuleClassLoader.loadClass(ModuleClassLoader.java:170)
17:44:55 [2021-07-10T21:44:55.272Z] 	at java.base/java.lang.ClassLoader.loadClass(ClassLoader.java:522)
17:44:55 [2021-07-10T21:44:55.272Z] 	... 31 more
17:44:55 [2021-07-10T21:44:55.272Z] 
17:44:55 [2021-07-10T21:44:55.272Z] Jul 10, 2021 9:44:54 PM org.junit.platform.launcher.core.DefaultLauncher handleThrowable
17:44:55 [2021-07-10T21:44:55.272Z] WARNING: TestEngine with ID 'junit-vintage' failed to discover tests
17:44:55 [2021-07-10T21:44:55.272Z] java.lang.NoClassDefFoundError: org/junit/runners/model/RunnerBuilder
17:44:55 [2021-07-10T21:44:55.272Z] 	at org.junit.vintage.engine.discovery.VintageDiscoverer.<init>(VintageDiscoverer.java:48)
17:44:55 [2021-07-10T21:44:55.272Z] 	at org.junit.vintage.engine.VintageTestEngine.discover(VintageTestEngine.java:65)
17:44:55 [2021-07-10T21:44:55.272Z] 	at org.junit.platform.launcher.core.DefaultLauncher.discoverEngineRoot(DefaultLauncher.java:130)
17:44:55 [2021-07-10T21:44:55.272Z] 	at org.junit.platform.launcher.core.DefaultLauncher.discoverRoot(DefaultLauncher.java:117)
17:44:55 [2021-07-10T21:44:55.272Z] 	at org.junit.platform.launcher.core.DefaultLauncher.discover(DefaultLauncher.java:82)
17:44:55 [2021-07-10T21:44:55.272Z] 	at org.apache.maven.surefire.junitplatform.TestPlanScannerFilter.accept(TestPlanScannerFilter.java:56)
17:44:55 [2021-07-10T21:44:55.272Z] 	at org.apache.maven.surefire.util.DefaultScanResult.applyFilter(DefaultScanResult.java:102)
17:44:55 [2021-07-10T21:44:55.272Z] 	at org.apache.maven.surefire.junitplatform.JUnitPlatformProvider.scanClasspath(JUnitPlatformProvider.java:143)
17:44:55 [2021-07-10T21:44:55.272Z] 	at org.apache.maven.surefire.junitplatform.JUnitPlatformProvider.invoke(JUnitPlatformProvider.java:124)
17:44:55 [2021-07-10T21:44:55.272Z] 	at java.base/jdk.internal.reflect.NativeMethodAccessorImpl.invoke0(Native Method)
17:44:55 [2021-07-10T21:44:55.272Z] 	at java.base/jdk.internal.reflect.NativeMethodAccessorImpl.invoke(NativeMethodAccessorImpl.java:64)
17:44:55 [2021-07-10T21:44:55.272Z] 	at java.base/jdk.internal.reflect.DelegatingMethodAccessorImpl.invoke(DelegatingMethodAccessorImpl.java:43)
17:44:55 [2021-07-10T21:44:55.272Z] 	at java.base/java.lang.reflect.Method.invoke(Method.java:564)
17:44:55 [2021-07-10T21:44:55.272Z] 	at org.apache.maven.surefire.util.ReflectionUtils.invokeMethodWithArray2(ReflectionUtils.java:206)
17:44:55 [2021-07-10T21:44:55.272Z] 	at org.apache.maven.surefire.booter.ProviderFactory$ProviderProxy.invoke(ProviderFactory.java:161)
17:44:55 [2021-07-10T21:44:55.272Z] 	at org.apache.maven.surefire.booter.ProviderFactory.invokeProvider(ProviderFactory.java:84)
17:44:55 [2021-07-10T21:44:55.272Z] 	at org.eclipse.tycho.surefire.osgibooter.OsgiSurefireBooter.run(OsgiSurefireBooter.java:116)
17:44:55 [2021-07-10T21:44:55.272Z] 	at org.eclipse.tycho.surefire.osgibooter.HeadlessTestApplication.start(HeadlessTestApplication.java:23)
17:44:55 [2021-07-10T21:44:55.272Z] 	at org.eclipse.equinox.internal.app.EclipseAppHandle.run(EclipseAppHandle.java:203)
17:44:55 [2021-07-10T21:44:55.272Z] 	at org.eclipse.core.runtime.internal.adaptor.EclipseAppLauncher.runApplication(EclipseAppLauncher.java:134)
17:44:55 [2021-07-10T21:44:55.272Z] 	at org.eclipse.core.runtime.internal.adaptor.EclipseAppLauncher.start(EclipseAppLauncher.java:104)
17:44:55 [2021-07-10T21:44:55.272Z] 	at org.eclipse.core.runtime.adaptor.EclipseStarter.run(EclipseStarter.java:401)
17:44:55 [2021-07-10T21:44:55.272Z] 	at org.eclipse.core.runtime.adaptor.EclipseStarter.run(EclipseStarter.java:255)
17:44:55 [2021-07-10T21:44:55.272Z] 	at java.base/jdk.internal.reflect.NativeMethodAccessorImpl.invoke0(Native Method)
17:44:55 [2021-07-10T21:44:55.272Z] 	at java.base/jdk.internal.reflect.NativeMethodAccessorImpl.invoke(NativeMethodAccessorImpl.java:64)
17:44:55 [2021-07-10T21:44:55.272Z] 	at java.base/jdk.internal.reflect.DelegatingMethodAccessorImpl.invoke(DelegatingMethodAccessorImpl.java:43)
17:44:55 [2021-07-10T21:44:55.272Z] 	at java.base/java.lang.reflect.Method.invoke(Method.java:564)
17:44:55 [2021-07-10T21:44:55.272Z] 	at org.eclipse.equinox.launcher.Main.invokeFramework(Main.java:654)
17:44:55 [2021-07-10T21:44:55.272Z] 	at org.eclipse.equinox.launcher.Main.basicRun(Main.java:591)
17:44:55 [2021-07-10T21:44:55.272Z] 	at org.eclipse.equinox.launcher.Main.run(Main.java:1462)
17:44:55 [2021-07-10T21:44:55.272Z] 	at org.eclipse.equinox.launcher.Main.main(Main.java:1435)
17:44:55 [2021-07-10T21:44:55.272Z] Caused by: java.lang.ClassNotFoundException: org.junit.runners.model.RunnerBuilder cannot be found by org.eclipse.tycho.surefire.osgibooter_2.2.0
17:44:55 [2021-07-10T21:44:55.272Z] 	at org.eclipse.osgi.internal.loader.BundleLoader.findClass(BundleLoader.java:519)
17:44:55 [2021-07-10T21:44:55.272Z] 	at org.eclipse.osgi.internal.loader.ModuleClassLoader.loadClass(ModuleClassLoader.java:170)
17:44:55 [2021-07-10T21:44:55.272Z] 	at java.base/java.lang.ClassLoader.loadClass(ClassLoader.java:522)
17:44:55 [2021-07-10T21:44:55.272Z] 	... 31 more
17:44:55 [2021-07-10T21:44:55.272Z] 
17:44:55 [2021-07-10T21:44:55.272Z] Jul 10, 2021 9:44:54 PM org.junit.platform.launcher.core.DefaultLauncher handleThrowable
17:44:55 [2021-07-10T21:44:55.272Z] WARNING: TestEngine with ID 'junit-vintage' failed to discover tests
17:44:55 [2021-07-10T21:44:55.272Z] java.lang.NoClassDefFoundError: org/junit/runners/model/RunnerBuilder
17:44:55 [2021-07-10T21:44:55.272Z] 	at org.junit.vintage.engine.discovery.VintageDiscoverer.<init>(VintageDiscoverer.java:48)
17:44:55 [2021-07-10T21:44:55.272Z] 	at org.junit.vintage.engine.VintageTestEngine.discover(VintageTestEngine.java:65)
17:44:55 [2021-07-10T21:44:55.272Z] 	at org.junit.platform.launcher.core.DefaultLauncher.discoverEngineRoot(DefaultLauncher.java:130)
17:44:55 [2021-07-10T21:44:55.272Z] 	at org.junit.platform.launcher.core.DefaultLauncher.discoverRoot(DefaultLauncher.java:117)
17:44:55 [2021-07-10T21:44:55.272Z] 	at org.junit.platform.launcher.core.DefaultLauncher.discover(DefaultLauncher.java:82)
17:44:55 [2021-07-10T21:44:55.272Z] 	at org.apache.maven.surefire.junitplatform.TestPlanScannerFilter.accept(TestPlanScannerFilter.java:56)
17:44:55 [2021-07-10T21:44:55.272Z] 	at org.apache.maven.surefire.util.DefaultScanResult.applyFilter(DefaultScanResult.java:102)
17:44:55 [2021-07-10T21:44:55.272Z] 	at org.apache.maven.surefire.junitplatform.JUnitPlatformProvider.scanClasspath(JUnitPlatformProvider.java:143)
17:44:55 [2021-07-10T21:44:55.272Z] 	at org.apache.maven.surefire.junitplatform.JUnitPlatformProvider.invoke(JUnitPlatformProvider.java:124)
17:44:55 [2021-07-10T21:44:55.272Z] 	at java.base/jdk.internal.reflect.NativeMethodAccessorImpl.invoke0(Native Method)
17:44:55 [2021-07-10T21:44:55.272Z] 	at java.base/jdk.internal.reflect.NativeMethodAccessorImpl.invoke(NativeMethodAccessorImpl.java:64)
17:44:55 [2021-07-10T21:44:55.272Z] 	at java.base/jdk.internal.reflect.DelegatingMethodAccessorImpl.invoke(DelegatingMethodAccessorImpl.java:43)
17:44:55 [2021-07-10T21:44:55.272Z] 	at java.base/java.lang.reflect.Method.invoke(Method.java:564)
17:44:55 [2021-07-10T21:44:55.272Z] 	at org.apache.maven.surefire.util.ReflectionUtils.invokeMethodWithArray2(ReflectionUtils.java:206)
17:44:55 [2021-07-10T21:44:55.272Z] 	at org.apache.maven.surefire.booter.ProviderFactory$ProviderProxy.invoke(ProviderFactory.java:161)
17:44:55 [2021-07-10T21:44:55.272Z] 	at org.apache.maven.surefire.booter.ProviderFactory.invokeProvider(ProviderFactory.java:84)
17:44:55 [2021-07-10T21:44:55.272Z] 	at org.eclipse.tycho.surefire.osgibooter.OsgiSurefireBooter.run(OsgiSurefireBooter.java:116)
17:44:55 [2021-07-10T21:44:55.272Z] 	at org.eclipse.tycho.surefire.osgibooter.HeadlessTestApplication.start(HeadlessTestApplication.java:23)
17:44:55 [2021-07-10T21:44:55.272Z] 	at org.eclipse.equinox.internal.app.EclipseAppHandle.run(EclipseAppHandle.java:203)
17:44:55 [2021-07-10T21:44:55.272Z] 	at org.eclipse.core.runtime.internal.adaptor.EclipseAppLauncher.runApplication(EclipseAppLauncher.java:134)
17:44:55 [2021-07-10T21:44:55.272Z] 	at org.eclipse.core.runtime.internal.adaptor.EclipseAppLauncher.start(EclipseAppLauncher.java:104)
17:44:55 [2021-07-10T21:44:55.272Z] 	at org.eclipse.core.runtime.adaptor.EclipseStarter.run(EclipseStarter.java:401)
17:44:55 [2021-07-10T21:44:55.272Z] 	at org.eclipse.core.runtime.adaptor.EclipseStarter.run(EclipseStarter.java:255)
17:44:55 [2021-07-10T21:44:55.272Z] 	at java.base/jdk.internal.reflect.NativeMethodAccessorImpl.invoke0(Native Method)
17:44:55 [2021-07-10T21:44:55.272Z] 	at java.base/jdk.internal.reflect.NativeMethodAccessorImpl.invoke(NativeMethodAccessorImpl.java:64)
17:44:55 [2021-07-10T21:44:55.272Z] 	at java.base/jdk.internal.reflect.DelegatingMethodAccessorImpl.invoke(DelegatingMethodAccessorImpl.java:43)
17:44:55 [2021-07-10T21:44:55.272Z] 	at java.base/java.lang.reflect.Method.invoke(Method.java:564)
17:44:55 [2021-07-10T21:44:55.272Z] 	at org.eclipse.equinox.launcher.Main.invokeFramework(Main.java:654)
17:44:55 [2021-07-10T21:44:55.272Z] 	at org.eclipse.equinox.launcher.Main.basicRun(Main.java:591)
17:44:55 [2021-07-10T21:44:55.272Z] 	at org.eclipse.equinox.launcher.Main.run(Main.java:1462)
17:44:55 [2021-07-10T21:44:55.272Z] 	at org.eclipse.equinox.launcher.Main.main(Main.java:1435)
17:44:55 [2021-07-10T21:44:55.272Z] Caused by: java.lang.ClassNotFoundException: org.junit.runners.model.RunnerBuilder cannot be found by org.eclipse.tycho.surefire.osgibooter_2.2.0
17:44:55 [2021-07-10T21:44:55.273Z] 	at org.eclipse.osgi.internal.loader.BundleLoader.findClass(BundleLoader.java:519)
17:44:55 [2021-07-10T21:44:55.273Z] 	at org.eclipse.osgi.internal.loader.ModuleClassLoader.loadClass(ModuleClassLoader.java:170)
17:44:55 [2021-07-10T21:44:55.273Z] 	at java.base/java.lang.ClassLoader.loadClass(ClassLoader.java:522)
17:44:55 [2021-07-10T21:44:55.273Z] 	... 31 more
17:44:55 [2021-07-10T21:44:55.273Z] 
17:44:55 [2021-07-10T21:44:55.273Z] Jul 10, 2021 9:44:54 PM org.junit.platform.launcher.core.DefaultLauncher handleThrowable
17:44:55 [2021-07-10T21:44:55.273Z] WARNING: TestEngine with ID 'junit-vintage' failed to discover tests
17:44:55 [2021-07-10T21:44:55.273Z] java.lang.NoClassDefFoundError: org/junit/runners/model/RunnerBuilder
17:44:55 [2021-07-10T21:44:55.273Z] 	at org.junit.vintage.engine.discovery.VintageDiscoverer.<init>(VintageDiscoverer.java:48)
17:44:55 [2021-07-10T21:44:55.273Z] 	at org.junit.vintage.engine.VintageTestEngine.discover(VintageTestEngine.java:65)
17:44:55 [2021-07-10T21:44:55.273Z] 	at org.junit.platform.launcher.core.DefaultLauncher.discoverEngineRoot(DefaultLauncher.java:130)
17:44:55 [2021-07-10T21:44:55.273Z] 	at org.junit.platform.launcher.core.DefaultLauncher.discoverRoot(DefaultLauncher.java:117)
17:44:55 [2021-07-10T21:44:55.273Z] 	at org.junit.platform.launcher.core.DefaultLauncher.discover(DefaultLauncher.java:82)
17:44:55 [2021-07-10T21:44:55.273Z] 	at org.apache.maven.surefire.junitplatform.TestPlanScannerFilter.accept(TestPlanScannerFilter.java:56)
17:44:55 [2021-07-10T21:44:55.273Z] 	at org.apache.maven.surefire.util.DefaultScanResult.applyFilter(DefaultScanResult.java:102)
17:44:55 [2021-07-10T21:44:55.273Z] 	at org.apache.maven.surefire.junitplatform.JUnitPlatformProvider.scanClasspath(JUnitPlatformProvider.java:143)
17:44:55 [2021-07-10T21:44:55.273Z] 	at org.apache.maven.surefire.junitplatform.JUnitPlatformProvider.invoke(JUnitPlatformProvider.java:124)
17:44:55 [2021-07-10T21:44:55.273Z] 	at java.base/jdk.internal.reflect.NativeMethodAccessorImpl.invoke0(Native Method)
17:44:55 [2021-07-10T21:44:55.273Z] 	at java.base/jdk.internal.reflect.NativeMethodAccessorImpl.invoke(NativeMethodAccessorImpl.java:64)
17:44:55 [2021-07-10T21:44:55.273Z] 	at java.base/jdk.internal.reflect.DelegatingMethodAccessorImpl.invoke(DelegatingMethodAccessorImpl.java:43)
17:44:55 [2021-07-10T21:44:55.273Z] 	at java.base/java.lang.reflect.Method.invoke(Method.java:564)
17:44:55 [2021-07-10T21:44:55.273Z] 	at org.apache.maven.surefire.util.ReflectionUtils.invokeMethodWithArray2(ReflectionUtils.java:206)
17:44:55 [2021-07-10T21:44:55.273Z] 	at org.apache.maven.surefire.booter.ProviderFactory$ProviderProxy.invoke(ProviderFactory.java:161)
17:44:55 [2021-07-10T21:44:55.273Z] 	at org.apache.maven.surefire.booter.ProviderFactory.invokeProvider(ProviderFactory.java:84)
17:44:55 [2021-07-10T21:44:55.273Z] 	at org.eclipse.tycho.surefire.osgibooter.OsgiSurefireBooter.run(OsgiSurefireBooter.java:116)
17:44:55 [2021-07-10T21:44:55.273Z] 	at org.eclipse.tycho.surefire.osgibooter.HeadlessTestApplication.start(HeadlessTestApplication.java:23)
17:44:55 [2021-07-10T21:44:55.273Z] 	at org.eclipse.equinox.internal.app.EclipseAppHandle.run(EclipseAppHandle.java:203)
17:44:55 [2021-07-10T21:44:55.273Z] 	at org.eclipse.core.runtime.internal.adaptor.EclipseAppLauncher.runApplication(EclipseAppLauncher.java:134)
17:44:55 [2021-07-10T21:44:55.273Z] 	at org.eclipse.core.runtime.internal.adaptor.EclipseAppLauncher.start(EclipseAppLauncher.java:104)
17:44:55 [2021-07-10T21:44:55.273Z] 	at org.eclipse.core.runtime.adaptor.EclipseStarter.run(EclipseStarter.java:401)
17:44:55 [2021-07-10T21:44:55.273Z] 	at org.eclipse.core.runtime.adaptor.EclipseStarter.run(EclipseStarter.java:255)
17:44:55 [2021-07-10T21:44:55.273Z] 	at java.base/jdk.internal.reflect.NativeMethodAccessorImpl.invoke0(Native Method)
17:44:55 [2021-07-10T21:44:55.273Z] 	at java.base/jdk.internal.reflect.NativeMethodAccessorImpl.invoke(NativeMethodAccessorImpl.java:64)
17:44:55 [2021-07-10T21:44:55.273Z] 	at java.base/jdk.internal.reflect.DelegatingMethodAccessorImpl.invoke(DelegatingMethodAccessorImpl.java:43)
17:44:55 [2021-07-10T21:44:55.273Z] 	at java.base/java.lang.reflect.Method.invoke(Method.java:564)
17:44:55 [2021-07-10T21:44:55.273Z] 	at org.eclipse.equinox.launcher.Main.invokeFramework(Main.java:654)
17:44:55 [2021-07-10T21:44:55.273Z] 	at org.eclipse.equinox.launcher.Main.basicRun(Main.java:591)
17:44:55 [2021-07-10T21:44:55.273Z] 	at org.eclipse.equinox.launcher.Main.run(Main.java:1462)
17:44:55 [2021-07-10T21:44:55.273Z] 	at org.eclipse.equinox.launcher.Main.main(Main.java:1435)
17:44:55 [2021-07-10T21:44:55.273Z] Caused by: java.lang.ClassNotFoundException: org.junit.runners.model.RunnerBuilder cannot be found by org.eclipse.tycho.surefire.osgibooter_2.2.0
17:44:55 [2021-07-10T21:44:55.273Z] 	at org.eclipse.osgi.internal.loader.BundleLoader.findClass(BundleLoader.java:519)
17:44:55 [2021-07-10T21:44:55.273Z] 	at org.eclipse.osgi.internal.loader.ModuleClassLoader.loadClass(ModuleClassLoader.java:170)
17:44:55 [2021-07-10T21:44:55.273Z] 	at java.base/java.lang.ClassLoader.loadClass(ClassLoader.java:522)
17:44:55 [2021-07-10T21:44:55.273Z] 	... 31 more
17:44:55 [2021-07-10T21:44:55.273Z] 
17:44:55 [2021-07-10T21:44:55.273Z] Jul 10, 2021 9:44:54 PM org.junit.platform.launcher.core.DefaultLauncher handleThrowable
17:44:55 [2021-07-10T21:44:55.273Z] WARNING: TestEngine with ID 'junit-vintage' failed to discover tests
17:44:55 [2021-07-10T21:44:55.273Z] java.lang.NoClassDefFoundError: org/junit/runners/model/RunnerBuilder
17:44:55 [2021-07-10T21:44:55.273Z] 	at org.junit.vintage.engine.discovery.VintageDiscoverer.<init>(VintageDiscoverer.java:48)
17:44:55 [2021-07-10T21:44:55.273Z] 	at org.junit.vintage.engine.VintageTestEngine.discover(VintageTestEngine.java:65)
17:44:55 [2021-07-10T21:44:55.273Z] 	at org.junit.platform.launcher.core.DefaultLauncher.discoverEngineRoot(DefaultLauncher.java:130)
17:44:55 [2021-07-10T21:44:55.273Z] 	at org.junit.platform.launcher.core.DefaultLauncher.discoverRoot(DefaultLauncher.java:117)
17:44:55 [2021-07-10T21:44:55.273Z] 	at org.junit.platform.launcher.core.DefaultLauncher.discover(DefaultLauncher.java:82)
17:44:55 [2021-07-10T21:44:55.273Z] 	at org.apache.maven.surefire.junitplatform.TestPlanScannerFilter.accept(TestPlanScannerFilter.java:56)
17:44:55 [2021-07-10T21:44:55.273Z] 	at org.apache.maven.surefire.util.DefaultScanResult.applyFilter(DefaultScanResult.java:102)
17:44:55 [2021-07-10T21:44:55.273Z] 	at org.apache.maven.surefire.junitplatform.JUnitPlatformProvider.scanClasspath(JUnitPlatformProvider.java:143)
17:44:55 [2021-07-10T21:44:55.273Z] 	at org.apache.maven.surefire.junitplatform.JUnitPlatformProvider.invoke(JUnitPlatformProvider.java:124)
17:44:55 [2021-07-10T21:44:55.273Z] 	at java.base/jdk.internal.reflect.NativeMethodAccessorImpl.invoke0(Native Method)
17:44:55 [2021-07-10T21:44:55.273Z] 	at java.base/jdk.internal.reflect.NativeMethodAccessorImpl.invoke(NativeMethodAccessorImpl.java:64)
17:44:55 [2021-07-10T21:44:55.273Z] 	at java.base/jdk.internal.reflect.DelegatingMethodAccessorImpl.invoke(DelegatingMethodAccessorImpl.java:43)
17:44:55 [2021-07-10T21:44:55.273Z] 	at java.base/java.lang.reflect.Method.invoke(Method.java:564)
17:44:55 [2021-07-10T21:44:55.273Z] 	at org.apache.maven.surefire.util.ReflectionUtils.invokeMethodWithArray2(ReflectionUtils.java:206)
17:44:55 [2021-07-10T21:44:55.273Z] 	at org.apache.maven.surefire.booter.ProviderFactory$ProviderProxy.invoke(ProviderFactory.java:161)
17:44:55 [2021-07-10T21:44:55.273Z] 	at org.apache.maven.surefire.booter.ProviderFactory.invokeProvider(ProviderFactory.java:84)
17:44:55 [2021-07-10T21:44:55.273Z] 	at org.eclipse.tycho.surefire.osgibooter.OsgiSurefireBooter.run(OsgiSurefireBooter.java:116)
17:44:55 [2021-07-10T21:44:55.273Z] 	at org.eclipse.tycho.surefire.osgibooter.HeadlessTestApplication.start(HeadlessTestApplication.java:23)
17:44:55 [2021-07-10T21:44:55.273Z] 	at org.eclipse.equinox.internal.app.EclipseAppHandle.run(EclipseAppHandle.java:203)
17:44:55 [2021-07-10T21:44:55.273Z] 	at org.eclipse.core.runtime.internal.adaptor.EclipseAppLauncher.runApplication(EclipseAppLauncher.java:134)
17:44:55 [2021-07-10T21:44:55.273Z] 	at org.eclipse.core.runtime.internal.adaptor.EclipseAppLauncher.start(EclipseAppLauncher.java:104)
17:44:55 [2021-07-10T21:44:55.273Z] 	at org.eclipse.core.runtime.adaptor.EclipseStarter.run(EclipseStarter.java:401)
17:44:55 [2021-07-10T21:44:55.273Z] 	at org.eclipse.core.runtime.adaptor.EclipseStarter.run(EclipseStarter.java:255)
17:44:55 [2021-07-10T21:44:55.273Z] 	at java.base/jdk.internal.reflect.NativeMethodAccessorImpl.invoke0(Native Method)
17:44:55 [2021-07-10T21:44:55.273Z] 	at java.base/jdk.internal.reflect.NativeMethodAccessorImpl.invoke(NativeMethodAccessorImpl.java:64)
17:44:55 [2021-07-10T21:44:55.273Z] 	at java.base/jdk.internal.reflect.DelegatingMethodAccessorImpl.invoke(DelegatingMethodAccessorImpl.java:43)
17:44:55 [2021-07-10T21:44:55.273Z] 	at java.base/java.lang.reflect.Method.invoke(Method.java:564)
17:44:55 [2021-07-10T21:44:55.273Z] 	at org.eclipse.equinox.launcher.Main.invokeFramework(Main.java:654)
17:44:55 [2021-07-10T21:44:55.273Z] 	at org.eclipse.equinox.launcher.Main.basicRun(Main.java:591)
17:44:55 [2021-07-10T21:44:55.273Z] 	at org.eclipse.equinox.launcher.Main.run(Main.java:1462)
17:44:55 [2021-07-10T21:44:55.273Z] 	at org.eclipse.equinox.launcher.Main.main(Main.java:1435)
17:44:55 [2021-07-10T21:44:55.273Z] Caused by: java.lang.ClassNotFoundException: org.junit.runners.model.RunnerBuilder cannot be found by org.eclipse.tycho.surefire.osgibooter_2.2.0
17:44:55 [2021-07-10T21:44:55.274Z] 	at org.eclipse.osgi.internal.loader.BundleLoader.findClass(BundleLoader.java:519)
17:44:55 [2021-07-10T21:44:55.274Z] 	at org.eclipse.osgi.internal.loader.ModuleClassLoader.loadClass(ModuleClassLoader.java:170)
17:44:55 [2021-07-10T21:44:55.274Z] 	at java.base/java.lang.ClassLoader.loadClass(ClassLoader.java:522)
17:44:55 [2021-07-10T21:44:55.274Z] 	... 31 more
17:44:55 [2021-07-10T21:44:55.274Z] 
17:44:55 [2021-07-10T21:44:55.274Z] Jul 10, 2021 9:44:54 PM org.junit.platform.launcher.core.DefaultLauncher handleThrowable
17:44:55 [2021-07-10T21:44:55.274Z] WARNING: TestEngine with ID 'junit-vintage' failed to discover tests
17:44:55 [2021-07-10T21:44:55.274Z] java.lang.NoClassDefFoundError: org/junit/runners/model/RunnerBuilder
17:44:55 [2021-07-10T21:44:55.274Z] 	at org.junit.vintage.engine.discovery.VintageDiscoverer.<init>(VintageDiscoverer.java:48)
17:44:55 [2021-07-10T21:44:55.274Z] 	at org.junit.vintage.engine.VintageTestEngine.discover(VintageTestEngine.java:65)
17:44:55 [2021-07-10T21:44:55.274Z] 	at org.junit.platform.launcher.core.DefaultLauncher.discoverEngineRoot(DefaultLauncher.java:130)
17:44:55 [2021-07-10T21:44:55.274Z] 	at org.junit.platform.launcher.core.DefaultLauncher.discoverRoot(DefaultLauncher.java:117)
17:44:55 [2021-07-10T21:44:55.274Z] 	at org.junit.platform.launcher.core.DefaultLauncher.discover(DefaultLauncher.java:82)
17:44:55 [2021-07-10T21:44:55.274Z] 	at org.apache.maven.surefire.junitplatform.TestPlanScannerFilter.accept(TestPlanScannerFilter.java:56)
17:44:55 [2021-07-10T21:44:55.274Z] 	at org.apache.maven.surefire.util.DefaultScanResult.applyFilter(DefaultScanResult.java:102)
17:44:55 [2021-07-10T21:44:55.274Z] 	at org.apache.maven.surefire.junitplatform.JUnitPlatformProvider.scanClasspath(JUnitPlatformProvider.java:143)
17:44:55 [2021-07-10T21:44:55.274Z] 	at org.apache.maven.surefire.junitplatform.JUnitPlatformProvider.invoke(JUnitPlatformProvider.java:124)
17:44:55 [2021-07-10T21:44:55.274Z] 	at java.base/jdk.internal.reflect.NativeMethodAccessorImpl.invoke0(Native Method)
17:44:55 [2021-07-10T21:44:55.274Z] 	at java.base/jdk.internal.reflect.NativeMethodAccessorImpl.invoke(NativeMethodAccessorImpl.java:64)
17:44:55 [2021-07-10T21:44:55.274Z] 	at java.base/jdk.internal.reflect.DelegatingMethodAccessorImpl.invoke(DelegatingMethodAccessorImpl.java:43)
17:44:55 [2021-07-10T21:44:55.274Z] 	at java.base/java.lang.reflect.Method.invoke(Method.java:564)
17:44:55 [2021-07-10T21:44:55.274Z] 	at org.apache.maven.surefire.util.ReflectionUtils.invokeMethodWithArray2(ReflectionUtils.java:206)
17:44:55 [2021-07-10T21:44:55.274Z] 	at org.apache.maven.surefire.booter.ProviderFactory$ProviderProxy.invoke(ProviderFactory.java:161)
17:44:55 [2021-07-10T21:44:55.274Z] 	at org.apache.maven.surefire.booter.ProviderFactory.invokeProvider(ProviderFactory.java:84)
17:44:55 [2021-07-10T21:44:55.274Z] 	at org.eclipse.tycho.surefire.osgibooter.OsgiSurefireBooter.run(OsgiSurefireBooter.java:116)
17:44:55 [2021-07-10T21:44:55.274Z] 	at org.eclipse.tycho.surefire.osgibooter.HeadlessTestApplication.start(HeadlessTestApplication.java:23)
17:44:55 [2021-07-10T21:44:55.274Z] 	at org.eclipse.equinox.internal.app.EclipseAppHandle.run(EclipseAppHandle.java:203)
17:44:55 [2021-07-10T21:44:55.274Z] 	at org.eclipse.core.runtime.internal.adaptor.EclipseAppLauncher.runApplication(EclipseAppLauncher.java:134)
17:44:55 [2021-07-10T21:44:55.274Z] 	at org.eclipse.core.runtime.internal.adaptor.EclipseAppLauncher.start(EclipseAppLauncher.java:104)
17:44:55 [2021-07-10T21:44:55.274Z] 	at org.eclipse.core.runtime.adaptor.EclipseStarter.run(EclipseStarter.java:401)
17:44:55 [2021-07-10T21:44:55.274Z] 	at org.eclipse.core.runtime.adaptor.EclipseStarter.run(EclipseStarter.java:255)
17:44:55 [2021-07-10T21:44:55.274Z] 	at java.base/jdk.internal.reflect.NativeMethodAccessorImpl.invoke0(Native Method)
17:44:55 [2021-07-10T21:44:55.274Z] 	at java.base/jdk.internal.reflect.NativeMethodAccessorImpl.invoke(NativeMethodAccessorImpl.java:64)
17:44:55 [2021-07-10T21:44:55.274Z] 	at java.base/jdk.internal.reflect.DelegatingMethodAccessorImpl.invoke(DelegatingMethodAccessorImpl.java:43)
17:44:55 [2021-07-10T21:44:55.274Z] 	at java.base/java.lang.reflect.Method.invoke(Method.java:564)
17:44:55 [2021-07-10T21:44:55.274Z] 	at org.eclipse.equinox.launcher.Main.invokeFramework(Main.java:654)
17:44:55 [2021-07-10T21:44:55.274Z] 	at org.eclipse.equinox.launcher.Main.basicRun(Main.java:591)
17:44:55 [2021-07-10T21:44:55.274Z] 	at org.eclipse.equinox.launcher.Main.run(Main.java:1462)
17:44:55 [2021-07-10T21:44:55.274Z] 	at org.eclipse.equinox.launcher.Main.main(Main.java:1435)
17:44:55 [2021-07-10T21:44:55.274Z] Caused by: java.lang.ClassNotFoundException: org.junit.runners.model.RunnerBuilder cannot be found by org.eclipse.tycho.surefire.osgibooter_2.2.0
17:44:55 [2021-07-10T21:44:55.274Z] 	at org.eclipse.osgi.internal.loader.BundleLoader.findClass(BundleLoader.java:519)
17:44:55 [2021-07-10T21:44:55.274Z] 	at org.eclipse.osgi.internal.loader.ModuleClassLoader.loadClass(ModuleClassLoader.java:170)
17:44:55 [2021-07-10T21:44:55.274Z] 	at java.base/java.lang.ClassLoader.loadClass(ClassLoader.java:522)
17:44:55 [2021-07-10T21:44:55.274Z] 	... 31 more
17:44:55 [2021-07-10T21:44:55.274Z] 
17:44:55 [2021-07-10T21:44:55.274Z] Jul 10, 2021 9:44:54 PM org.junit.platform.launcher.core.DefaultLauncher handleThrowable
17:44:55 [2021-07-10T21:44:55.274Z] WARNING: TestEngine with ID 'junit-vintage' failed to discover tests
17:44:55 [2021-07-10T21:44:55.274Z] java.lang.NoClassDefFoundError: org/junit/runners/model/RunnerBuilder
17:44:55 [2021-07-10T21:44:55.274Z] 	at org.junit.vintage.engine.discovery.VintageDiscoverer.<init>(VintageDiscoverer.java:48)
17:44:55 [2021-07-10T21:44:55.274Z] 	at org.junit.vintage.engine.VintageTestEngine.discover(VintageTestEngine.java:65)
17:44:55 [2021-07-10T21:44:55.274Z] 	at org.junit.platform.launcher.core.DefaultLauncher.discoverEngineRoot(DefaultLauncher.java:130)
17:44:55 [2021-07-10T21:44:55.274Z] 	at org.junit.platform.launcher.core.DefaultLauncher.discoverRoot(DefaultLauncher.java:117)
17:44:55 [2021-07-10T21:44:55.274Z] 	at org.junit.platform.launcher.core.DefaultLauncher.discover(DefaultLauncher.java:82)
17:44:55 [2021-07-10T21:44:55.274Z] 	at org.apache.maven.surefire.junitplatform.TestPlanScannerFilter.accept(TestPlanScannerFilter.java:56)
17:44:55 [2021-07-10T21:44:55.274Z] 	at org.apache.maven.surefire.util.DefaultScanResult.applyFilter(DefaultScanResult.java:102)
17:44:55 [2021-07-10T21:44:55.274Z] 	at org.apache.maven.surefire.junitplatform.JUnitPlatformProvider.scanClasspath(JUnitPlatformProvider.java:143)
17:44:55 [2021-07-10T21:44:55.274Z] 	at org.apache.maven.surefire.junitplatform.JUnitPlatformProvider.invoke(JUnitPlatformProvider.java:124)
17:44:55 [2021-07-10T21:44:55.274Z] 	at java.base/jdk.internal.reflect.NativeMethodAccessorImpl.invoke0(Native Method)
17:44:55 [2021-07-10T21:44:55.274Z] 	at java.base/jdk.internal.reflect.NativeMethodAccessorImpl.invoke(NativeMethodAccessorImpl.java:64)
17:44:55 [2021-07-10T21:44:55.274Z] 	at java.base/jdk.internal.reflect.DelegatingMethodAccessorImpl.invoke(DelegatingMethodAccessorImpl.java:43)
17:44:55 [2021-07-10T21:44:55.274Z] 	at java.base/java.lang.reflect.Method.invoke(Method.java:564)
17:44:55 [2021-07-10T21:44:55.274Z] 	at org.apache.maven.surefire.util.ReflectionUtils.invokeMethodWithArray2(ReflectionUtils.java:206)
17:44:55 [2021-07-10T21:44:55.274Z] 	at org.apache.maven.surefire.booter.ProviderFactory$ProviderProxy.invoke(ProviderFactory.java:161)
17:44:55 [2021-07-10T21:44:55.274Z] 	at org.apache.maven.surefire.booter.ProviderFactory.invokeProvider(ProviderFactory.java:84)
17:44:55 [2021-07-10T21:44:55.274Z] 	at org.eclipse.tycho.surefire.osgibooter.OsgiSurefireBooter.run(OsgiSurefireBooter.java:116)
17:44:55 [2021-07-10T21:44:55.274Z] 	at org.eclipse.tycho.surefire.osgibooter.HeadlessTestApplication.start(HeadlessTestApplication.java:23)
17:44:55 [2021-07-10T21:44:55.274Z] 	at org.eclipse.equinox.internal.app.EclipseAppHandle.run(EclipseAppHandle.java:203)
17:44:55 [2021-07-10T21:44:55.274Z] 	at org.eclipse.core.runtime.internal.adaptor.EclipseAppLauncher.runApplication(EclipseAppLauncher.java:134)
17:44:55 [2021-07-10T21:44:55.274Z] 	at org.eclipse.core.runtime.internal.adaptor.EclipseAppLauncher.start(EclipseAppLauncher.java:104)
17:44:55 [2021-07-10T21:44:55.274Z] 	at org.eclipse.core.runtime.adaptor.EclipseStarter.run(EclipseStarter.java:401)
17:44:55 [2021-07-10T21:44:55.274Z] 	at org.eclipse.core.runtime.adaptor.EclipseStarter.run(EclipseStarter.java:255)
17:44:55 [2021-07-10T21:44:55.274Z] 	at java.base/jdk.internal.reflect.NativeMethodAccessorImpl.invoke0(Native Method)
17:44:55 [2021-07-10T21:44:55.274Z] 	at java.base/jdk.internal.reflect.NativeMethodAccessorImpl.invoke(NativeMethodAccessorImpl.java:64)
17:44:55 [2021-07-10T21:44:55.274Z] 	at java.base/jdk.internal.reflect.DelegatingMethodAccessorImpl.invoke(DelegatingMethodAccessorImpl.java:43)
17:44:55 [2021-07-10T21:44:55.274Z] 	at java.base/java.lang.reflect.Method.invoke(Method.java:564)
17:44:55 [2021-07-10T21:44:55.274Z] 	at org.eclipse.equinox.launcher.Main.invokeFramework(Main.java:654)
17:44:55 [2021-07-10T21:44:55.274Z] 	at org.eclipse.equinox.launcher.Main.basicRun(Main.java:591)
17:44:55 [2021-07-10T21:44:55.274Z] 	at org.eclipse.equinox.launcher.Main.run(Main.java:1462)
17:44:55 [2021-07-10T21:44:55.274Z] 	at org.eclipse.equinox.launcher.Main.main(Main.java:1435)
17:44:55 [2021-07-10T21:44:55.274Z] Caused by: java.lang.ClassNotFoundException: org.junit.runners.model.RunnerBuilder cannot be found by org.eclipse.tycho.surefire.osgibooter_2.2.0
17:44:55 [2021-07-10T21:44:55.274Z] 	at org.eclipse.osgi.internal.loader.BundleLoader.findClass(BundleLoader.java:519)
17:44:55 [2021-07-10T21:44:55.274Z] 	at org.eclipse.osgi.internal.loader.ModuleClassLoader.loadClass(ModuleClassLoader.java:170)
17:44:55 [2021-07-10T21:44:55.275Z] 	at java.base/java.lang.ClassLoader.loadClass(ClassLoader.java:522)
17:44:55 [2021-07-10T21:44:55.275Z] 	... 31 more
17:44:55 [2021-07-10T21:44:55.275Z] 
17:44:55 [2021-07-10T21:44:55.275Z] Jul 10, 2021 9:44:54 PM org.junit.platform.launcher.core.DefaultLauncher handleThrowable
17:44:55 [2021-07-10T21:44:55.275Z] WARNING: TestEngine with ID 'junit-vintage' failed to discover tests
17:44:55 [2021-07-10T21:44:55.275Z] java.lang.NoClassDefFoundError: org/junit/runners/model/RunnerBuilder
17:44:55 [2021-07-10T21:44:55.275Z] 	at org.junit.vintage.engine.discovery.VintageDiscoverer.<init>(VintageDiscoverer.java:48)
17:44:55 [2021-07-10T21:44:55.275Z] 	at org.junit.vintage.engine.VintageTestEngine.discover(VintageTestEngine.java:65)
17:44:55 [2021-07-10T21:44:55.275Z] 	at org.junit.platform.launcher.core.DefaultLauncher.discoverEngineRoot(DefaultLauncher.java:130)
17:44:55 [2021-07-10T21:44:55.275Z] 	at org.junit.platform.launcher.core.DefaultLauncher.discoverRoot(DefaultLauncher.java:117)
17:44:55 [2021-07-10T21:44:55.275Z] 	at org.junit.platform.launcher.core.DefaultLauncher.discover(DefaultLauncher.java:82)
17:44:55 [2021-07-10T21:44:55.275Z] 	at org.apache.maven.surefire.junitplatform.TestPlanScannerFilter.accept(TestPlanScannerFilter.java:56)
17:44:55 [2021-07-10T21:44:55.275Z] 	at org.apache.maven.surefire.util.DefaultScanResult.applyFilter(DefaultScanResult.java:102)
17:44:55 [2021-07-10T21:44:55.275Z] 	at org.apache.maven.surefire.junitplatform.JUnitPlatformProvider.scanClasspath(JUnitPlatformProvider.java:143)
17:44:55 [2021-07-10T21:44:55.275Z] 	at org.apache.maven.surefire.junitplatform.JUnitPlatformProvider.invoke(JUnitPlatformProvider.java:124)
17:44:55 [2021-07-10T21:44:55.275Z] 	at java.base/jdk.internal.reflect.NativeMethodAccessorImpl.invoke0(Native Method)
17:44:55 [2021-07-10T21:44:55.275Z] 	at java.base/jdk.internal.reflect.NativeMethodAccessorImpl.invoke(NativeMethodAccessorImpl.java:64)
17:44:55 [2021-07-10T21:44:55.275Z] 	at java.base/jdk.internal.reflect.DelegatingMethodAccessorImpl.invoke(DelegatingMethodAccessorImpl.java:43)
17:44:55 [2021-07-10T21:44:55.275Z] 	at java.base/java.lang.reflect.Method.invoke(Method.java:564)
17:44:55 [2021-07-10T21:44:55.275Z] 	at org.apache.maven.surefire.util.ReflectionUtils.invokeMethodWithArray2(ReflectionUtils.java:206)
17:44:55 [2021-07-10T21:44:55.275Z] 	at org.apache.maven.surefire.booter.ProviderFactory$ProviderProxy.invoke(ProviderFactory.java:161)
17:44:55 [2021-07-10T21:44:55.275Z] 	at org.apache.maven.surefire.booter.ProviderFactory.invokeProvider(ProviderFactory.java:84)
17:44:55 [2021-07-10T21:44:55.275Z] 	at org.eclipse.tycho.surefire.osgibooter.OsgiSurefireBooter.run(OsgiSurefireBooter.java:116)
17:44:55 [2021-07-10T21:44:55.275Z] 	at org.eclipse.tycho.surefire.osgibooter.HeadlessTestApplication.start(HeadlessTestApplication.java:23)
17:44:55 [2021-07-10T21:44:55.275Z] 	at org.eclipse.equinox.internal.app.EclipseAppHandle.run(EclipseAppHandle.java:203)
17:44:55 [2021-07-10T21:44:55.275Z] 	at org.eclipse.core.runtime.internal.adaptor.EclipseAppLauncher.runApplication(EclipseAppLauncher.java:134)
17:44:55 [2021-07-10T21:44:55.275Z] 	at org.eclipse.core.runtime.internal.adaptor.EclipseAppLauncher.start(EclipseAppLauncher.java:104)
17:44:55 [2021-07-10T21:44:55.275Z] 	at org.eclipse.core.runtime.adaptor.EclipseStarter.run(EclipseStarter.java:401)
17:44:55 [2021-07-10T21:44:55.275Z] 	at org.eclipse.core.runtime.adaptor.EclipseStarter.run(EclipseStarter.java:255)
17:44:55 [2021-07-10T21:44:55.275Z] 	at java.base/jdk.internal.reflect.NativeMethodAccessorImpl.invoke0(Native Method)
17:44:55 [2021-07-10T21:44:55.275Z] 	at java.base/jdk.internal.reflect.NativeMethodAccessorImpl.invoke(NativeMethodAccessorImpl.java:64)
17:44:55 [2021-07-10T21:44:55.275Z] 	at java.base/jdk.internal.reflect.DelegatingMethodAccessorImpl.invoke(DelegatingMethodAccessorImpl.java:43)
17:44:55 [2021-07-10T21:44:55.275Z] 	at java.base/java.lang.reflect.Method.invoke(Method.java:564)
17:44:55 [2021-07-10T21:44:55.275Z] 	at org.eclipse.equinox.launcher.Main.invokeFramework(Main.java:654)
17:44:55 [2021-07-10T21:44:55.275Z] 	at org.eclipse.equinox.launcher.Main.basicRun(Main.java:591)
17:44:55 [2021-07-10T21:44:55.275Z] 	at org.eclipse.equinox.launcher.Main.run(Main.java:1462)
17:44:55 [2021-07-10T21:44:55.275Z] 	at org.eclipse.equinox.launcher.Main.main(Main.java:1435)
17:44:55 [2021-07-10T21:44:55.275Z] Caused by: java.lang.ClassNotFoundException: org.junit.runners.model.RunnerBuilder cannot be found by org.eclipse.tycho.surefire.osgibooter_2.2.0
17:44:55 [2021-07-10T21:44:55.275Z] 	at org.eclipse.osgi.internal.loader.BundleLoader.findClass(BundleLoader.java:519)
17:44:55 [2021-07-10T21:44:55.275Z] 	at org.eclipse.osgi.internal.loader.ModuleClassLoader.loadClass(ModuleClassLoader.java:170)
17:44:55 [2021-07-10T21:44:55.275Z] 	at java.base/java.lang.ClassLoader.loadClass(ClassLoader.java:522)
17:44:55 [2021-07-10T21:44:55.275Z] 	... 31 more
17:44:55 [2021-07-10T21:44:55.275Z] 
17:44:55 [2021-07-10T21:44:55.275Z] Jul 10, 2021 9:44:54 PM org.junit.platform.launcher.core.DefaultLauncher handleThrowable
17:44:55 [2021-07-10T21:44:55.275Z] WARNING: TestEngine with ID 'junit-vintage' failed to discover tests
17:44:55 [2021-07-10T21:44:55.275Z] java.lang.NoClassDefFoundError: org/junit/runners/model/RunnerBuilder
17:44:55 [2021-07-10T21:44:55.275Z] 	at org.junit.vintage.engine.discovery.VintageDiscoverer.<init>(VintageDiscoverer.java:48)
17:44:55 [2021-07-10T21:44:55.275Z] 	at org.junit.vintage.engine.VintageTestEngine.discover(VintageTestEngine.java:65)
17:44:55 [2021-07-10T21:44:55.275Z] 	at org.junit.platform.launcher.core.DefaultLauncher.discoverEngineRoot(DefaultLauncher.java:130)
17:44:55 [2021-07-10T21:44:55.275Z] 	at org.junit.platform.launcher.core.DefaultLauncher.discoverRoot(DefaultLauncher.java:117)
17:44:55 [2021-07-10T21:44:55.275Z] 	at org.junit.platform.launcher.core.DefaultLauncher.discover(DefaultLauncher.java:82)
17:44:55 [2021-07-10T21:44:55.275Z] 	at org.apache.maven.surefire.junitplatform.TestPlanScannerFilter.accept(TestPlanScannerFilter.java:56)
17:44:55 [2021-07-10T21:44:55.275Z] 	at org.apache.maven.surefire.util.DefaultScanResult.applyFilter(DefaultScanResult.java:102)
17:44:55 [2021-07-10T21:44:55.275Z] 	at org.apache.maven.surefire.junitplatform.JUnitPlatformProvider.scanClasspath(JUnitPlatformProvider.java:143)
17:44:55 [2021-07-10T21:44:55.275Z] 	at org.apache.maven.surefire.junitplatform.JUnitPlatformProvider.invoke(JUnitPlatformProvider.java:124)
17:44:55 [2021-07-10T21:44:55.275Z] 	at java.base/jdk.internal.reflect.NativeMethodAccessorImpl.invoke0(Native Method)
17:44:55 [2021-07-10T21:44:55.275Z] 	at java.base/jdk.internal.reflect.NativeMethodAccessorImpl.invoke(NativeMethodAccessorImpl.java:64)
17:44:55 [2021-07-10T21:44:55.275Z] 	at java.base/jdk.internal.reflect.DelegatingMethodAccessorImpl.invoke(DelegatingMethodAccessorImpl.java:43)
17:44:55 [2021-07-10T21:44:55.275Z] 	at java.base/java.lang.reflect.Method.invoke(Method.java:564)
17:44:55 [2021-07-10T21:44:55.275Z] 	at org.apache.maven.surefire.util.ReflectionUtils.invokeMethodWithArray2(ReflectionUtils.java:206)
17:44:55 [2021-07-10T21:44:55.275Z] 	at org.apache.maven.surefire.booter.ProviderFactory$ProviderProxy.invoke(ProviderFactory.java:161)
17:44:55 [2021-07-10T21:44:55.275Z] 	at org.apache.maven.surefire.booter.ProviderFactory.invokeProvider(ProviderFactory.java:84)
17:44:55 [2021-07-10T21:44:55.275Z] 	at org.eclipse.tycho.surefire.osgibooter.OsgiSurefireBooter.run(OsgiSurefireBooter.java:116)
17:44:55 [2021-07-10T21:44:55.275Z] 	at org.eclipse.tycho.surefire.osgibooter.HeadlessTestApplication.start(HeadlessTestApplication.java:23)
17:44:55 [2021-07-10T21:44:55.275Z] 	at org.eclipse.equinox.internal.app.EclipseAppHandle.run(EclipseAppHandle.java:203)
17:44:55 [2021-07-10T21:44:55.275Z] 	at org.eclipse.core.runtime.internal.adaptor.EclipseAppLauncher.runApplication(EclipseAppLauncher.java:134)
17:44:55 [2021-07-10T21:44:55.275Z] 	at org.eclipse.core.runtime.internal.adaptor.EclipseAppLauncher.start(EclipseAppLauncher.java:104)
17:44:55 [2021-07-10T21:44:55.275Z] 	at org.eclipse.core.runtime.adaptor.EclipseStarter.run(EclipseStarter.java:401)
17:44:55 [2021-07-10T21:44:55.275Z] 	at org.eclipse.core.runtime.adaptor.EclipseStarter.run(EclipseStarter.java:255)
17:44:55 [2021-07-10T21:44:55.275Z] 	at java.base/jdk.internal.reflect.NativeMethodAccessorImpl.invoke0(Native Method)
17:44:55 [2021-07-10T21:44:55.275Z] 	at java.base/jdk.internal.reflect.NativeMethodAccessorImpl.invoke(NativeMethodAccessorImpl.java:64)
17:44:55 [2021-07-10T21:44:55.275Z] 	at java.base/jdk.internal.reflect.DelegatingMethodAccessorImpl.invoke(DelegatingMethodAccessorImpl.java:43)
17:44:55 [2021-07-10T21:44:55.275Z] 	at java.base/java.lang.reflect.Method.invoke(Method.java:564)
17:44:55 [2021-07-10T21:44:55.275Z] 	at org.eclipse.equinox.launcher.Main.invokeFramework(Main.java:654)
17:44:55 [2021-07-10T21:44:55.275Z] 	at org.eclipse.equinox.launcher.Main.basicRun(Main.java:591)
17:44:55 [2021-07-10T21:44:55.275Z] 	at org.eclipse.equinox.launcher.Main.run(Main.java:1462)
17:44:55 [2021-07-10T21:44:55.275Z] 	at org.eclipse.equinox.launcher.Main.main(Main.java:1435)
17:44:55 [2021-07-10T21:44:55.275Z] Caused by: java.lang.ClassNotFoundException: org.junit.runners.model.RunnerBuilder cannot be found by org.eclipse.tycho.surefire.osgibooter_2.2.0
17:44:55 [2021-07-10T21:44:55.275Z] 	at org.eclipse.osgi.internal.loader.BundleLoader.findClass(BundleLoader.java:519)
17:44:55 [2021-07-10T21:44:55.275Z] 	at org.eclipse.osgi.internal.loader.ModuleClassLoader.loadClass(ModuleClassLoader.java:170)
17:44:55 [2021-07-10T21:44:55.275Z] 	at java.base/java.lang.ClassLoader.loadClass(ClassLoader.java:522)
17:44:55 [2021-07-10T21:44:55.275Z] 	... 31 more
17:44:55 [2021-07-10T21:44:55.275Z] 
17:44:55 [2021-07-10T21:44:55.276Z] Jul 10, 2021 9:44:54 PM org.junit.platform.launcher.core.DefaultLauncher handleThrowable
17:44:55 [2021-07-10T21:44:55.276Z] WARNING: TestEngine with ID 'junit-vintage' failed to discover tests
17:44:55 [2021-07-10T21:44:55.276Z] java.lang.NoClassDefFoundError: org/junit/runners/model/RunnerBuilder
17:44:55 [2021-07-10T21:44:55.276Z] 	at org.junit.vintage.engine.discovery.VintageDiscoverer.<init>(VintageDiscoverer.java:48)
17:44:55 [2021-07-10T21:44:55.276Z] 	at org.junit.vintage.engine.VintageTestEngine.discover(VintageTestEngine.java:65)
17:44:55 [2021-07-10T21:44:55.276Z] 	at org.junit.platform.launcher.core.DefaultLauncher.discoverEngineRoot(DefaultLauncher.java:130)
17:44:55 [2021-07-10T21:44:55.276Z] 	at org.junit.platform.launcher.core.DefaultLauncher.discoverRoot(DefaultLauncher.java:117)
17:44:55 [2021-07-10T21:44:55.276Z] 	at org.junit.platform.launcher.core.DefaultLauncher.discover(DefaultLauncher.java:82)
17:44:55 [2021-07-10T21:44:55.276Z] 	at org.apache.maven.surefire.junitplatform.TestPlanScannerFilter.accept(TestPlanScannerFilter.java:56)
17:44:55 [2021-07-10T21:44:55.276Z] 	at org.apache.maven.surefire.util.DefaultScanResult.applyFilter(DefaultScanResult.java:102)
17:44:55 [2021-07-10T21:44:55.276Z] 	at org.apache.maven.surefire.junitplatform.JUnitPlatformProvider.scanClasspath(JUnitPlatformProvider.java:143)
17:44:55 [2021-07-10T21:44:55.276Z] 	at org.apache.maven.surefire.junitplatform.JUnitPlatformProvider.invoke(JUnitPlatformProvider.java:124)
17:44:55 [2021-07-10T21:44:55.276Z] 	at java.base/jdk.internal.reflect.NativeMethodAccessorImpl.invoke0(Native Method)
17:44:55 [2021-07-10T21:44:55.276Z] 	at java.base/jdk.internal.reflect.NativeMethodAccessorImpl.invoke(NativeMethodAccessorImpl.java:64)
17:44:55 [2021-07-10T21:44:55.276Z] 	at java.base/jdk.internal.reflect.DelegatingMethodAccessorImpl.invoke(DelegatingMethodAccessorImpl.java:43)
17:44:55 [2021-07-10T21:44:55.276Z] 	at java.base/java.lang.reflect.Method.invoke(Method.java:564)
17:44:55 [2021-07-10T21:44:55.276Z] 	at org.apache.maven.surefire.util.ReflectionUtils.invokeMethodWithArray2(ReflectionUtils.java:206)
17:44:55 [2021-07-10T21:44:55.276Z] 	at org.apache.maven.surefire.booter.ProviderFactory$ProviderProxy.invoke(ProviderFactory.java:161)
17:44:55 [2021-07-10T21:44:55.276Z] 	at org.apache.maven.surefire.booter.ProviderFactory.invokeProvider(ProviderFactory.java:84)
17:44:55 [2021-07-10T21:44:55.276Z] 	at org.eclipse.tycho.surefire.osgibooter.OsgiSurefireBooter.run(OsgiSurefireBooter.java:116)
17:44:55 [2021-07-10T21:44:55.276Z] 	at org.eclipse.tycho.surefire.osgibooter.HeadlessTestApplication.start(HeadlessTestApplication.java:23)
17:44:55 [2021-07-10T21:44:55.276Z] 	at org.eclipse.equinox.internal.app.EclipseAppHandle.run(EclipseAppHandle.java:203)
17:44:55 [2021-07-10T21:44:55.276Z] 	at org.eclipse.core.runtime.internal.adaptor.EclipseAppLauncher.runApplication(EclipseAppLauncher.java:134)
17:44:55 [2021-07-10T21:44:55.276Z] 	at org.eclipse.core.runtime.internal.adaptor.EclipseAppLauncher.start(EclipseAppLauncher.java:104)
17:44:55 [2021-07-10T21:44:55.276Z] 	at org.eclipse.core.runtime.adaptor.EclipseStarter.run(EclipseStarter.java:401)
17:44:55 [2021-07-10T21:44:55.276Z] 	at org.eclipse.core.runtime.adaptor.EclipseStarter.run(EclipseStarter.java:255)
17:44:55 [2021-07-10T21:44:55.276Z] 	at java.base/jdk.internal.reflect.NativeMethodAccessorImpl.invoke0(Native Method)
17:44:55 [2021-07-10T21:44:55.276Z] 	at java.base/jdk.internal.reflect.NativeMethodAccessorImpl.invoke(NativeMethodAccessorImpl.java:64)
17:44:55 [2021-07-10T21:44:55.276Z] 	at java.base/jdk.internal.reflect.DelegatingMethodAccessorImpl.invoke(DelegatingMethodAccessorImpl.java:43)
17:44:55 [2021-07-10T21:44:55.276Z] 	at java.base/java.lang.reflect.Method.invoke(Method.java:564)
17:44:55 [2021-07-10T21:44:55.276Z] 	at org.eclipse.equinox.launcher.Main.invokeFramework(Main.java:654)
17:44:55 [2021-07-10T21:44:55.276Z] 	at org.eclipse.equinox.launcher.Main.basicRun(Main.java:591)
17:44:55 [2021-07-10T21:44:55.276Z] 	at org.eclipse.equinox.launcher.Main.run(Main.java:1462)
17:44:55 [2021-07-10T21:44:55.276Z] 	at org.eclipse.equinox.launcher.Main.main(Main.java:1435)
17:44:55 [2021-07-10T21:44:55.276Z] Caused by: java.lang.ClassNotFoundException: org.junit.runners.model.RunnerBuilder cannot be found by org.eclipse.tycho.surefire.osgibooter_2.2.0
17:44:55 [2021-07-10T21:44:55.276Z] 	at org.eclipse.osgi.internal.loader.BundleLoader.findClass(BundleLoader.java:519)
17:44:55 [2021-07-10T21:44:55.276Z] 	at org.eclipse.osgi.internal.loader.ModuleClassLoader.loadClass(ModuleClassLoader.java:170)
17:44:55 [2021-07-10T21:44:55.276Z] 	at java.base/java.lang.ClassLoader.loadClass(ClassLoader.java:522)
17:44:55 [2021-07-10T21:44:55.276Z] 	... 31 more
17:44:55 [2021-07-10T21:44:55.276Z] 
17:44:55 [2021-07-10T21:44:55.276Z] Jul 10, 2021 9:44:54 PM org.junit.platform.launcher.core.DefaultLauncher handleThrowable
17:44:55 [2021-07-10T21:44:55.276Z] WARNING: TestEngine with ID 'junit-vintage' failed to discover tests
17:44:55 [2021-07-10T21:44:55.276Z] java.lang.NoClassDefFoundError: org/junit/runners/model/RunnerBuilder
17:44:55 [2021-07-10T21:44:55.276Z] 	at org.junit.vintage.engine.discovery.VintageDiscoverer.<init>(VintageDiscoverer.java:48)
17:44:55 [2021-07-10T21:44:55.276Z] 	at org.junit.vintage.engine.VintageTestEngine.discover(VintageTestEngine.java:65)
17:44:55 [2021-07-10T21:44:55.276Z] 	at org.junit.platform.launcher.core.DefaultLauncher.discoverEngineRoot(DefaultLauncher.java:130)
17:44:55 [2021-07-10T21:44:55.276Z] 	at org.junit.platform.launcher.core.DefaultLauncher.discoverRoot(DefaultLauncher.java:117)
17:44:55 [2021-07-10T21:44:55.276Z] 	at org.junit.platform.launcher.core.DefaultLauncher.execute(DefaultLauncher.java:90)
17:44:55 [2021-07-10T21:44:55.276Z] 	at org.apache.maven.surefire.junitplatform.JUnitPlatformProvider.invokeAllTests(JUnitPlatformProvider.java:150)
17:44:55 [2021-07-10T21:44:55.276Z] 	at org.apache.maven.surefire.junitplatform.JUnitPlatformProvider.invoke(JUnitPlatformProvider.java:124)
17:44:55 [2021-07-10T21:44:55.276Z] 	at java.base/jdk.internal.reflect.NativeMethodAccessorImpl.invoke0(Native Method)
17:44:55 [2021-07-10T21:44:55.276Z] 	at java.base/jdk.internal.reflect.NativeMethodAccessorImpl.invoke(NativeMethodAccessorImpl.java:64)
17:44:55 [2021-07-10T21:44:55.276Z] 	at java.base/jdk.internal.reflect.DelegatingMethodAccessorImpl.invoke(DelegatingMethodAccessorImpl.java:43)
17:44:55 [2021-07-10T21:44:55.276Z] 	at java.base/java.lang.reflect.Method.invoke(Method.java:564)
17:44:55 [2021-07-10T21:44:55.276Z] 	at org.apache.maven.surefire.util.ReflectionUtils.invokeMethodWithArray2(ReflectionUtils.java:206)
17:44:55 [2021-07-10T21:44:55.276Z] 	at org.apache.maven.surefire.booter.ProviderFactory$ProviderProxy.invoke(ProviderFactory.java:161)
17:44:55 [2021-07-10T21:44:55.276Z] 	at org.apache.maven.surefire.booter.ProviderFactory.invokeProvider(ProviderFactory.java:84)
17:44:55 [2021-07-10T21:44:55.276Z] 	at org.eclipse.tycho.surefire.osgibooter.OsgiSurefireBooter.run(OsgiSurefireBooter.java:116)
17:44:55 [2021-07-10T21:44:55.276Z] 	at org.eclipse.tycho.surefire.osgibooter.HeadlessTestApplication.start(HeadlessTestApplication.java:23)
17:44:55 [2021-07-10T21:44:55.276Z] 	at org.eclipse.equinox.internal.app.EclipseAppHandle.run(EclipseAppHandle.java:203)
17:44:55 [2021-07-10T21:44:55.276Z] 	at org.eclipse.core.runtime.internal.adaptor.EclipseAppLauncher.runApplication(EclipseAppLauncher.java:134)
17:44:55 [2021-07-10T21:44:55.276Z] 	at org.eclipse.core.runtime.internal.adaptor.EclipseAppLauncher.start(EclipseAppLauncher.java:104)
17:44:55 [2021-07-10T21:44:55.276Z] 	at org.eclipse.core.runtime.adaptor.EclipseStarter.run(EclipseStarter.java:401)
17:44:55 [2021-07-10T21:44:55.276Z] 	at org.eclipse.core.runtime.adaptor.EclipseStarter.run(EclipseStarter.java:255)
17:44:55 [2021-07-10T21:44:55.276Z] 	at java.base/jdk.internal.reflect.NativeMethodAccessorImpl.invoke0(Native Method)
17:44:55 [2021-07-10T21:44:55.276Z] 	at java.base/jdk.internal.reflect.NativeMethodAccessorImpl.invoke(NativeMethodAccessorImpl.java:64)
17:44:55 [2021-07-10T21:44:55.276Z] 	at java.base/jdk.internal.reflect.DelegatingMethodAccessorImpl.invoke(DelegatingMethodAccessorImpl.java:43)
17:44:55 [2021-07-10T21:44:55.276Z] 	at java.base/java.lang.reflect.Method.invoke(Method.java:564)
17:44:55 [2021-07-10T21:44:55.276Z] 	at org.eclipse.equinox.launcher.Main.invokeFramework(Main.java:654)
17:44:55 [2021-07-10T21:44:55.276Z] 	at org.eclipse.equinox.launcher.Main.basicRun(Main.java:591)
17:44:55 [2021-07-10T21:44:55.276Z] 	at org.eclipse.equinox.launcher.Main.run(Main.java:1462)
17:44:55 [2021-07-10T21:44:55.276Z] 	at org.eclipse.equinox.launcher.Main.main(Main.java:1435)
17:44:55 [2021-07-10T21:44:55.276Z] Caused by: java.lang.ClassNotFoundException: org.junit.runners.model.RunnerBuilder cannot be found by org.eclipse.tycho.surefire.osgibooter_2.2.0
17:44:55 [2021-07-10T21:44:55.276Z] 	at org.eclipse.osgi.internal.loader.BundleLoader.findClass(BundleLoader.java:519)
17:44:55 [2021-07-10T21:44:55.276Z] 	at org.eclipse.osgi.internal.loader.ModuleClassLoader.loadClass(ModuleClassLoader.java:170)
17:44:55 [2021-07-10T21:44:55.276Z] 	at java.base/java.lang.ClassLoader.loadClass(ClassLoader.java:522)
17:44:55 [2021-07-10T21:44:55.276Z] 	... 29 more
17:44:55 [2021-07-10T21:44:55.276Z] 
17:44:55 [2021-07-10T21:44:55.276Z] Running org.eclipse.ease.ui.views.shell.dropins.variables.VariablesComparatorTest
17:44:56 [2021-07-10T21:44:56.207Z] Tests run: 1, Failures: 0, Errors: 0, Skipped: 0, Time elapsed: 1.169 s - in org.eclipse.ease.ui.views.shell.dropins.variables.VariablesComparatorTest
17:44:56 [2021-07-10T21:44:56.207Z] lastExecutionResult_comes_before_debugVariable  Time elapsed: 1.137 s
17:44:56 [2021-07-10T21:44:56.207Z] Running org.eclipse.ease.ui.views.shell.dropins.variables.ContentLabelProviderTest
17:44:56 [2021-07-10T21:44:56.470Z] Tests run: 1, Failures: 0, Errors: 0, Skipped: 0, Time elapsed: 0.102 s - in org.eclipse.ease.ui.views.shell.dropins.variables.ContentLabelProviderTest
17:44:56 [2021-07-10T21:44:56.470Z] getText_returns_variable_content  Time elapsed: 0.102 s
17:44:56 [2021-07-10T21:44:56.470Z] Running org.eclipse.ease.ui.views.shell.dropins.variables.VariablesLabelProviderTest
17:44:56 [2021-07-10T21:44:56.470Z] Tests run: 1, Failures: 0, Errors: 0, Skipped: 0, Time elapsed: 0.003 s - in org.eclipse.ease.ui.views.shell.dropins.variables.VariablesLabelProviderTest
17:44:56 [2021-07-10T21:44:56.470Z] getText_returns_variable_name  Time elapsed: 0.003 s
17:44:56 [2021-07-10T21:44:56.470Z] Running org.eclipse.ease.ui.views.shell.dropins.variables.VariablesContentProviderTest
17:44:56 [2021-07-10T21:44:56.470Z] Tests run: 5, Failures: 0, Errors: 0, Skipped: 0, Time elapsed: 0.077 s - in org.eclipse.ease.ui.views.shell.dropins.variables.VariablesContentProviderTest
17:44:56 [2021-07-10T21:44:56.470Z] hasChildren_true_when_child_nodes_are_available  Time elapsed: 0.002 s
17:44:56 [2021-07-10T21:44:56.470Z] getChildren_is_empty_when_no_child_nodes_are_available  Time elapsed: 0.003 s
17:44:56 [2021-07-10T21:44:56.470Z] getElements_contains_variables_from_engine  Time elapsed: 0.069 s
17:44:56 [2021-07-10T21:44:56.470Z] hasChildren_false_when_no_child_nodes_are_available  Time elapsed: 0.001 s
17:44:56 [2021-07-10T21:44:56.470Z] getChildren_not_empty_when_child_nodes_are_available  Time elapsed: 0 s
17:44:56 [2021-07-10T21:44:56.470Z] Running org.eclipse.ease.ui.views.shell.dropins.variables.HiddenVariablesFilterTest
17:44:56 [2021-07-10T21:44:56.470Z] Tests run: 3, Failures: 0, Errors: 0, Skipped: 0, Time elapsed: 0.004 s - in org.eclipse.ease.ui.views.shell.dropins.variables.HiddenVariablesFilterTest
17:44:56 [2021-07-10T21:44:56.470Z] select_accepts_unknown_classes  Time elapsed: 0.001 s
17:44:56 [2021-07-10T21:44:56.470Z] select_accepts_script_variables  Time elapsed: 0.001 s
17:44:56 [2021-07-10T21:44:56.470Z] select_declines_hidden_script_variables  Time elapsed: 0 s
17:44:56 [2021-07-10T21:44:56.470Z] Running org.eclipse.ease.ui.views.shell.dropins.modules.ModulesStackContentProviderTest
17:44:56 [2021-07-10T21:44:56.470Z] Tests run: 2, Failures: 0, Errors: 0, Skipped: 0, Time elapsed: 0.107 s - in org.eclipse.ease.ui.views.shell.dropins.modules.ModulesStackContentProviderTest
17:44:56 [2021-07-10T21:44:56.470Z] getElements_returns_modules  Time elapsed: 0.106 s
17:44:56 [2021-07-10T21:44:56.470Z] getElements_returns_empty_list_without_environment  Time elapsed: 0.001 s
17:44:56 [2021-07-10T21:44:56.470Z] Running org.eclipse.ease.ui.views.shell.dropins.modules.ModulesStackLabelProviderTest
17:44:56 [2021-07-10T21:44:56.727Z] Tests run: 3, Failures: 0, Errors: 0, Skipped: 0, Time elapsed: 0.083 s - in org.eclipse.ease.ui.views.shell.dropins.modules.ModulesStackLabelProviderTest
17:44:56 [2021-07-10T21:44:56.727Z] getText_null_returns_empty_string  Time elapsed: 0.001 s
17:44:56 [2021-07-10T21:44:56.727Z] getText_returns_definition_name  Time elapsed: 0.081 s
17:44:56 [2021-07-10T21:44:56.727Z] getText_returns_full_class_name_name  Time elapsed: 0 s
17:44:56 [2021-07-10T21:44:56.727Z] Running org.eclipse.ease.ui.help.hovers.ModuleHelpTest
17:44:56 [2021-07-10T21:44:56.727Z] Tests run: 4, Failures: 0, Errors: 0, Skipped: 4, Time elapsed: 0.002 s - in org.eclipse.ease.ui.help.hovers.ModuleHelpTest
17:44:56 [2021-07-10T21:44:56.727Z] getModuleHelpLocation skipped
17:44:56 [2021-07-10T21:44:56.727Z] getModuleHelp skipped
17:44:56 [2021-07-10T21:44:56.727Z] getMethodHelp skipped
17:44:56 [2021-07-10T21:44:56.727Z] getConstantHelp skipped
17:44:56 [2021-07-10T21:44:56.727Z] Running org.eclipse.ease.ui.completion.provider.AbstractFileLocationCompletionProviderTest
17:44:56 [2021-07-10T21:44:56.727Z] Tests run: 8, Failures: 0, Errors: 0, Skipped: 8, Time elapsed: 0.059 s - in org.eclipse.ease.ui.completion.provider.AbstractFileLocationCompletionProviderTest
17:44:56 [2021-07-10T21:44:56.727Z] workspaceProjectProposals skipped
17:44:56 [2021-07-10T21:44:56.727Z] checkOperatingSystem skipped
17:44:56 [2021-07-10T21:44:56.727Z] absoluteRootWorkspaceProposals skipped
17:44:56 [2021-07-10T21:44:56.727Z] workspaceFolderProposals skipped
17:44:56 [2021-07-10T21:44:56.727Z] fileSystemFolderProposals skipped
17:44:56 [2021-07-10T21:44:56.727Z] workspaceProposals skipped
17:44:56 [2021-07-10T21:44:56.727Z] relativeRootWorkspaceProposals skipped
17:44:56 [2021-07-10T21:44:56.727Z] fileSystemRootProposals skipped
17:44:56 [2021-07-10T21:44:56.727Z] Running org.eclipse.ease.ui.completion.CompletionContextTest
17:44:56 [2021-07-10T21:44:56.727Z] Tests run: 9, Failures: 0, Errors: 0, Skipped: 0, Time elapsed: 0.01 s - in org.eclipse.ease.ui.completion.CompletionContextTest
17:44:56 [2021-07-10T21:44:56.727Z] resolveStaticClass  Time elapsed: 0.006 s
17:44:56 [2021-07-10T21:44:56.727Z] resolveClassWithFilter  Time elapsed: 0 s
17:44:56 [2021-07-10T21:44:56.727Z] simplifyCalls  Time elapsed: 0 s
17:44:56 [2021-07-10T21:44:56.727Z] resolveClass  Time elapsed: 0 s
17:44:56 [2021-07-10T21:44:56.727Z] replaceEscapedStringLiterals  Time elapsed: 0 s
17:44:56 [2021-07-10T21:44:56.727Z] replaceSimpleStringLiterals  Time elapsed: 0 s
17:44:56 [2021-07-10T21:44:56.727Z] resolveStaticClassWithFilter  Time elapsed: 0 s
17:44:56 [2021-07-10T21:44:56.727Z] resolveClassWithParameters  Time elapsed: 0 s
17:44:56 [2021-07-10T21:44:56.727Z] replaceMultipleStringLiterals  Time elapsed: 0.001 s
17:44:56 [2021-07-10T21:44:56.727Z] Running org.eclipse.ease.ui.dnd.ModulesDropHandlerTest
17:44:56 [2021-07-10T21:44:56.727Z] Tests run: 2, Failures: 0, Errors: 0, Skipped: 0, Time elapsed: 0.02 s - in org.eclipse.ease.ui.dnd.ModulesDropHandlerTest
17:44:56 [2021-07-10T21:44:56.727Z] accepts_true_for_ModuleEntry  Time elapsed: 0.02 s
17:44:56 [2021-07-10T21:44:56.727Z] accepts_true_for_ModuleDefinition  Time elapsed: 0 s
17:44:56 [2021-07-10T21:44:56.727Z] 
17:44:56 [2021-07-10T21:44:56.727Z] Results:
17:44:56 [2021-07-10T21:44:56.727Z] 
17:44:56 [2021-07-10T21:44:56.727Z] Tests run: 39, Failures: 0, Errors: 0, Skipped: 12
17:44:56 [2021-07-10T21:44:56.727Z] 
17:44:57 [2021-07-10T21:44:57.291Z] [INFO] All tests passed!
17:44:57 [2021-07-10T21:44:57.291Z] [INFO] 
17:44:57 [2021-07-10T21:44:57.291Z] [INFO] --- maven-pmd-plugin:3.14.0:pmd (pmd-integration) @ org.eclipse.ease.ui.test ---
17:44:58 [2021-07-10T21:44:58.243Z] [INFO] 
17:44:58 [2021-07-10T21:44:58.243Z] [INFO] --- maven-pmd-plugin:3.14.0:cpd (pmd-integration) @ org.eclipse.ease.ui.test ---
17:44:58 [2021-07-10T21:44:58.243Z] [INFO] 
17:44:58 [2021-07-10T21:44:58.243Z] [INFO] --- spotbugs-maven-plugin:4.1.4:spotbugs (spotbugs-integration) @ org.eclipse.ease.ui.test ---
17:44:58 [2021-07-10T21:44:58.243Z] [INFO] Fork Value is false
17:44:58 [2021-07-10T21:44:58.243Z]      [java] JVM args ignored when same JVM is used.
17:45:02 [2021-07-10T21:45:02.421Z] [INFO] Done SpotBugs Analysis....
17:45:02 [2021-07-10T21:45:02.421Z] [INFO] 
17:45:02 [2021-07-10T21:45:02.421Z] [INFO] --- maven-checkstyle-plugin:3.1.1:check (checkstyle-integration) @ org.eclipse.ease.ui.test ---
17:45:02 [2021-07-10T21:45:02.421Z] [INFO] You have 0 Checkstyle violations.
17:45:02 [2021-07-10T21:45:02.421Z] [INFO] 
17:45:02 [2021-07-10T21:45:02.421Z] [INFO] --- maven-install-plugin:2.3.1:install (default-install) @ org.eclipse.ease.ui.test ---
17:45:02 [2021-07-10T21:45:02.421Z] [INFO] Installing /home/jenkins/agent/workspace/ease.verify.core.target.2019-03/tests/org.eclipse.ease.ui.test/target/org.eclipse.ease.ui.test-0.9.0-SNAPSHOT.jar to /home/jenkins/.m2/repository/org/eclipse/ease/org.eclipse.ease.ui.test/0.9.0-SNAPSHOT/org.eclipse.ease.ui.test-0.9.0-SNAPSHOT.jar
17:45:02 [2021-07-10T21:45:02.421Z] [INFO] Installing /home/jenkins/agent/workspace/ease.verify.core.target.2019-03/tests/org.eclipse.ease.ui.test/pom.xml to /home/jenkins/.m2/repository/org/eclipse/ease/org.eclipse.ease.ui.test/0.9.0-SNAPSHOT/org.eclipse.ease.ui.test-0.9.0-SNAPSHOT.pom
17:45:02 [2021-07-10T21:45:02.421Z] [INFO] Installing /home/jenkins/agent/workspace/ease.verify.core.target.2019-03/tests/org.eclipse.ease.ui.test/target/p2content.xml to /home/jenkins/.m2/repository/org/eclipse/ease/org.eclipse.ease.ui.test/0.9.0-SNAPSHOT/org.eclipse.ease.ui.test-0.9.0-SNAPSHOT-p2metadata.xml
17:45:02 [2021-07-10T21:45:02.421Z] [INFO] Installing /home/jenkins/agent/workspace/ease.verify.core.target.2019-03/tests/org.eclipse.ease.ui.test/target/p2artifacts.xml to /home/jenkins/.m2/repository/org/eclipse/ease/org.eclipse.ease.ui.test/0.9.0-SNAPSHOT/org.eclipse.ease.ui.test-0.9.0-SNAPSHOT-p2artifacts.xml
17:45:02 [2021-07-10T21:45:02.421Z] [INFO] 
17:45:02 [2021-07-10T21:45:02.421Z] [INFO] --- tycho-p2-plugin:2.2.0:update-local-index (default-update-local-index) @ org.eclipse.ease.ui.test ---
17:45:02 [2021-07-10T21:45:02.421Z] [INFO] 
17:45:02 [2021-07-10T21:45:02.421Z] [INFO] ---------< org.eclipse.ease:org.eclipse.ease.releng.coverage >----------
17:45:02 [2021-07-10T21:45:02.421Z] [INFO] Building org.eclipse.ease.releng.coverage 0.9.0-SNAPSHOT         [47/48]
17:45:02 [2021-07-10T21:45:02.421Z] [INFO] --------------------------------[ pom ]---------------------------------
17:45:02 [2021-07-10T21:45:02.421Z] [INFO] 
17:45:02 [2021-07-10T21:45:02.422Z] [INFO] --- maven-clean-plugin:2.5:clean (default-clean) @ org.eclipse.ease.releng.coverage ---
17:45:02 [2021-07-10T21:45:02.422Z] [INFO] 
17:45:02 [2021-07-10T21:45:02.422Z] [INFO] --- jacoco-maven-plugin:0.8.6:report-aggregate (default) @ org.eclipse.ease.releng.coverage ---
17:45:02 [2021-07-10T21:45:02.422Z] [INFO] Loading execution data file /home/jenkins/agent/workspace/ease.verify.core.target.2019-03/tests/org.eclipse.ease.test/target/jacoco.exec
17:45:02 [2021-07-10T21:45:02.422Z] [INFO] Loading execution data file /home/jenkins/agent/workspace/ease.verify.core.target.2019-03/tests/org.eclipse.ease.lang.javascript.rhino.test/target/jacoco.exec
17:45:02 [2021-07-10T21:45:02.422Z] [INFO] Loading execution data file /home/jenkins/agent/workspace/ease.verify.core.target.2019-03/tests/org.eclipse.ease.lang.javascript.test/target/jacoco.exec
17:45:02 [2021-07-10T21:45:02.422Z] [INFO] Loading execution data file /home/jenkins/agent/workspace/ease.verify.core.target.2019-03/tests/org.eclipse.ease.lang.python.test/target/jacoco.exec
17:45:02 [2021-07-10T21:45:02.422Z] [INFO] Loading execution data file /home/jenkins/agent/workspace/ease.verify.core.target.2019-03/tests/org.eclipse.ease.lang.python.jython.test/target/jacoco.exec
17:45:02 [2021-07-10T21:45:02.422Z] [INFO] Loading execution data file /home/jenkins/agent/workspace/ease.verify.core.target.2019-03/tests/org.eclipse.ease.lang.scriptarchive.test/target/jacoco.exec
17:45:02 [2021-07-10T21:45:02.422Z] [INFO] Loading execution data file /home/jenkins/agent/workspace/ease.verify.core.target.2019-03/tests/org.eclipse.ease.ui.scripts.test/target/jacoco.exec
17:45:02 [2021-07-10T21:45:02.422Z] [INFO] Loading execution data file /home/jenkins/agent/workspace/ease.verify.core.target.2019-03/tests/org.eclipse.ease.ui.test/target/jacoco.exec
17:45:02 [2021-07-10T21:45:02.679Z] [INFO] Analyzed bundle 'org.eclipse.ease' with 106 classes
17:45:02 [2021-07-10T21:45:02.937Z] [INFO] Analyzed bundle 'org.eclipse.ease.classloader' with 1 classes
17:45:03 [2021-07-10T21:45:03.194Z] [INFO] Analyzed bundle 'org.eclipse.ease.ui' with 211 classes
17:45:03 [2021-07-10T21:45:03.452Z] [INFO] Analyzed bundle 'org.eclipse.ease.ui.completions.java' with 13 classes
17:45:03 [2021-07-10T21:45:03.709Z] [INFO] Analyzed bundle 'org.eclipse.ease.ui.scripts' with 157 classes
17:45:03 [2021-07-10T21:45:03.709Z] [INFO] Analyzed bundle 'org.eclipse.ease.help' with 0 classes
17:45:03 [2021-07-10T21:45:03.709Z] [INFO] Analyzed bundle 'org.eclipse.ease.lang.javascript' with 4 classes
17:45:03 [2021-07-10T21:45:03.709Z] [INFO] Analyzed bundle 'org.eclipse.ease.lang.javascript.ui' with 4 classes
17:45:03 [2021-07-10T21:45:03.970Z] [INFO] Analyzed bundle 'org.eclipse.ease.lang.javascript.rhino' with 21 classes
17:45:03 [2021-07-10T21:45:03.970Z] [INFO] Analyzed bundle 'org.eclipse.ease.lang.javascript.nashorn' with 2 classes
17:45:03 [2021-07-10T21:45:03.970Z] [INFO] Analyzed bundle 'org.eclipse.ease.lang.python' with 21 classes
17:45:03 [2021-07-10T21:45:03.970Z] [INFO] Analyzed bundle 'org.eclipse.ease.lang.python.jython' with 13 classes
17:45:03 [2021-07-10T21:45:03.970Z] [INFO] Analyzed bundle 'org.eclipse.ease.lang.python.py4j' with 11 classes
17:45:03 [2021-07-10T21:45:03.970Z] [INFO] Analyzed bundle 'org.eclipse.ease.lang.jvm.compiled' with 2 classes
17:45:03 [2021-07-10T21:45:03.970Z] [INFO] Analyzed bundle 'org.eclipse.ease.lang.groovy' with 3 classes
17:45:03 [2021-07-10T21:45:03.970Z] [INFO] Analyzed bundle 'org.eclipse.ease.lang.groovy.interpreter' with 3 classes
17:45:03 [2021-07-10T21:45:03.970Z] [INFO] Analyzed bundle 'org.eclipse.ease.lang.ruby' with 3 classes
17:45:03 [2021-07-10T21:45:03.970Z] [INFO] Analyzed bundle 'org.eclipse.ease.lang.ruby.jruby' with 2 classes
17:45:03 [2021-07-10T21:45:03.970Z] [INFO] Analyzed bundle 'org.eclipse.ease.lang.scriptarchive' with 3 classes
17:45:03 [2021-07-10T21:45:03.970Z] [INFO] Analyzed bundle 'org.eclipse.ease.lang.scriptarchive.ui' with 8 classes
17:45:03 [2021-07-10T21:45:03.970Z] [INFO] Analyzed bundle 'org.eclipse.ease.lang.unittest' with 50 classes
17:45:04 [2021-07-10T21:45:04.227Z] [INFO] Analyzed bundle 'org.eclipse.ease.lang.unittest.ui' with 79 classes
17:45:04 [2021-07-10T21:45:04.483Z] [INFO] 
17:45:04 [2021-07-10T21:45:04.483Z] [INFO] --- maven-install-plugin:2.4:install (default-install) @ org.eclipse.ease.releng.coverage ---
17:45:04 [2021-07-10T21:45:04.483Z] [INFO] Installing /home/jenkins/agent/workspace/ease.verify.core.target.2019-03/releng/org.eclipse.ease.releng.coverage/pom.xml to /home/jenkins/.m2/repository/org/eclipse/ease/org.eclipse.ease.releng.coverage/0.9.0-SNAPSHOT/org.eclipse.ease.releng.coverage-0.9.0-SNAPSHOT.pom
17:45:04 [2021-07-10T21:45:04.483Z] [INFO] 
17:45:04 [2021-07-10T21:45:04.483Z] [INFO] ---------------------< org.eclipse.ease:ease.core >---------------------
17:45:04 [2021-07-10T21:45:04.483Z] [INFO] Building EASE (Incubation) 0.4.0-SNAPSHOT                        [48/48]
17:45:04 [2021-07-10T21:45:04.483Z] [INFO] --------------------------------[ pom ]---------------------------------
17:45:04 [2021-07-10T21:45:04.771Z] [INFO] 
17:45:04 [2021-07-10T21:45:04.771Z] [INFO] --- maven-clean-plugin:2.5:clean (default-clean) @ ease.core ---
17:45:04 [2021-07-10T21:45:04.771Z] [INFO] 
17:45:04 [2021-07-10T21:45:04.771Z] [INFO] --- maven-install-plugin:2.4:install (default-install) @ ease.core ---
17:45:04 [2021-07-10T21:45:04.771Z] [INFO] Installing /home/jenkins/agent/workspace/ease.verify.core.target.2019-03/pom.xml to /home/jenkins/.m2/repository/org/eclipse/ease/ease.core/0.4.0-SNAPSHOT/ease.core-0.4.0-SNAPSHOT.pom
17:45:04 [2021-07-10T21:45:04.771Z] [INFO] ------------------------------------------------------------------------
17:45:04 [2021-07-10T21:45:04.771Z] [INFO] Reactor Summary:
17:45:04 [2021-07-10T21:45:04.771Z] [INFO] 
17:45:04 [2021-07-10T21:45:04.771Z] [INFO] org.eclipse.ease.classloader 0.9.0-SNAPSHOT ........ SUCCESS [ 40.747 s]
17:45:04 [2021-07-10T21:45:04.771Z] [INFO] org.eclipse.ease 0.9.0-SNAPSHOT .................... SUCCESS [ 21.316 s]
17:45:04 [2021-07-10T21:45:04.771Z] [INFO] org.eclipse.ease.ui 0.9.0-SNAPSHOT ................. SUCCESS [ 27.905 s]
17:45:04 [2021-07-10T21:45:04.771Z] [INFO] org.eclipse.ease.ui.completions.java 0.9.0-SNAPSHOT  SUCCESS [  9.633 s]
17:45:04 [2021-07-10T21:45:04.771Z] [INFO] org.eclipse.ease.ui.scripts 0.9.0-SNAPSHOT ......... SUCCESS [ 20.758 s]
17:45:04 [2021-07-10T21:45:04.771Z] [INFO] org.eclipse.ease.releng 0.9.0-SNAPSHOT ............. SUCCESS [  0.466 s]
17:45:04 [2021-07-10T21:45:04.771Z] [INFO] org.eclipse.ease.lang.javascript 0.9.0-SNAPSHOT .... SUCCESS [  7.449 s]
17:45:04 [2021-07-10T21:45:04.771Z] [INFO] org.eclipse.ease.lang.scriptarchive 0.9.0-SNAPSHOT . SUCCESS [  6.477 s]
17:45:04 [2021-07-10T21:45:04.771Z] [INFO] org.eclipse.ease.lang.python 0.9.0-SNAPSHOT ........ SUCCESS [  8.615 s]
17:45:04 [2021-07-10T21:45:04.771Z] [INFO] org.eclipse.ease.lang.python.py4j 0.9.0-SNAPSHOT ... SUCCESS [  8.753 s]
17:45:04 [2021-07-10T21:45:04.771Z] [INFO] org.eclipse.ease.lang.groovy 0.9.0-SNAPSHOT ........ SUCCESS [  5.746 s]
17:45:04 [2021-07-10T21:45:04.771Z] [INFO] org.eclipse.ease.lang.groovy.interpreter 0.9.0-SNAPSHOT SUCCESS [  6.213 s]
17:45:04 [2021-07-10T21:45:04.771Z] [INFO] org.eclipse.ease.lang.unittest 0.9.0-SNAPSHOT ...... SUCCESS [ 13.294 s]
17:45:04 [2021-07-10T21:45:04.771Z] [INFO] org.eclipse.ease.lang.unittest.ui 0.9.0-SNAPSHOT ... SUCCESS [ 15.506 s]
17:45:04 [2021-07-10T21:45:04.771Z] [INFO] org.eclipse.ease.lang.ruby 0.9.0-SNAPSHOT .......... SUCCESS [  6.286 s]
17:45:04 [2021-07-10T21:45:04.771Z] [INFO] org.eclipse.ease.lang.ruby.jruby 0.9.0-SNAPSHOT .... SUCCESS [  5.937 s]
17:45:04 [2021-07-10T21:45:04.771Z] [INFO] org.eclipse.ease.lang.javascript.nashorn 0.9.0-SNAPSHOT SUCCESS [  6.302 s]
17:45:04 [2021-07-10T21:45:04.771Z] [INFO] org.eclipse.ease.lang.javascript.rhino 0.9.0-SNAPSHOT SUCCESS [  9.746 s]
17:45:04 [2021-07-10T21:45:04.771Z] [INFO] org.eclipse.ease.lang.python.jython 0.9.0-SNAPSHOT . SUCCESS [  9.697 s]
17:45:04 [2021-07-10T21:45:04.771Z] [INFO] org.eclipse.ease.lang.javascript.ui 0.9.0-SNAPSHOT . SUCCESS [  6.661 s]
17:45:04 [2021-07-10T21:45:04.771Z] [INFO] org.eclipse.ease.lang.jvm.compiled 0.9.0-SNAPSHOT .. SUCCESS [  6.650 s]
17:45:04 [2021-07-10T21:45:04.771Z] [INFO] org.eclipse.ease.lang.scriptarchive.ui 0.9.0-SNAPSHOT SUCCESS [  8.409 s]
17:45:04 [2021-07-10T21:45:04.771Z] [INFO] org.eclipse.ease.help 0.9.0-SNAPSHOT ............... SUCCESS [ 10.378 s]
17:45:04 [2021-07-10T21:45:04.771Z] [INFO] org.eclipse.ease.feature 0.9.0-SNAPSHOT ............ SUCCESS [  0.200 s]
17:45:04 [2021-07-10T21:45:04.771Z] [INFO] org.eclipse.ease.ui.feature 0.9.0-SNAPSHOT ......... SUCCESS [  0.149 s]
17:45:04 [2021-07-10T21:45:04.771Z] [INFO] org.eclipse.ease.lang.javascript.feature 0.9.0-SNAPSHOT SUCCESS [  0.257 s]
17:45:04 [2021-07-10T21:45:04.771Z] [INFO] org.eclipse.ease.lang.python.feature 0.9.0-SNAPSHOT  SUCCESS [  0.133 s]
17:45:04 [2021-07-10T21:45:04.771Z] [INFO] org.eclipse.ease.python.jython.feature 0.9.0-SNAPSHOT SUCCESS [  0.174 s]
17:45:04 [2021-07-10T21:45:04.771Z] [INFO] org.eclipse.ease.lang.python.py4j.feature 0.9.0-SNAPSHOT SUCCESS [  0.111 s]
17:45:04 [2021-07-10T21:45:04.772Z] [INFO] org.eclipse.ease.lang.jvm.feature 0.9.0-SNAPSHOT ... SUCCESS [  0.134 s]
17:45:04 [2021-07-10T21:45:04.772Z] [INFO] org.eclipse.ease.lang.groovy.feature 0.9.0-SNAPSHOT  SUCCESS [  0.136 s]
17:45:04 [2021-07-10T21:45:04.772Z] [INFO] org.eclipse.ease.lang.ruby.feature 0.9.0-SNAPSHOT .. SUCCESS [  0.109 s]
17:45:04 [2021-07-10T21:45:04.772Z] [INFO] org.eclipse.ease.lang.scriptarchive.feature 0.9.0-SNAPSHOT SUCCESS [  0.111 s]
17:45:04 [2021-07-10T21:45:04.772Z] [INFO] org.eclipse.ease.lang.unittest.feature 0.9.0-SNAPSHOT SUCCESS [  0.104 s]
17:45:04 [2021-07-10T21:45:04.772Z] [INFO] org.eclipse.ease.releng.target 0.9.0-SNAPSHOT ...... SUCCESS [  0.006 s]
17:45:04 [2021-07-10T21:45:04.772Z] [INFO] org.eclipse.ease.releng.p2 0.9.0-SNAPSHOT .......... SUCCESS [  5.583 s]
17:45:04 [2021-07-10T21:45:04.772Z] [INFO] org.eclipse.ease.testhelper 0.9.0-SNAPSHOT ......... SUCCESS [ 10.887 s]
17:45:04 [2021-07-10T21:45:04.772Z] [INFO] org.eclipse.ease.test 0.9.0-SNAPSHOT ............... SUCCESS [ 35.528 s]
17:45:04 [2021-07-10T21:45:04.772Z] [INFO] org.eclipse.ease.lang.javascript.rhino.test 0.9.0-SNAPSHOT SUCCESS [ 24.130 s]
17:45:04 [2021-07-10T21:45:04.772Z] [INFO] org.eclipse.ease.lang.javascript.test 0.9.0-SNAPSHOT SUCCESS [  9.086 s]
17:45:04 [2021-07-10T21:45:04.772Z] [INFO] org.eclipse.ease.lang.python.test 0.9.0-SNAPSHOT ... SUCCESS [  8.950 s]
17:45:04 [2021-07-10T21:45:04.772Z] [INFO] org.eclipse.ease.lang.python.jython.test 0.9.0-SNAPSHOT SUCCESS [ 28.845 s]
17:45:04 [2021-07-10T21:45:04.772Z] [INFO] org.eclipse.ease.lang.scriptarchive.test 0.9.0-SNAPSHOT SUCCESS [ 11.354 s]
17:45:04 [2021-07-10T21:45:04.772Z] [INFO] org.eclipse.ease.lang.unittest.test 0.9.0-SNAPSHOT . SUCCESS [  6.836 s]
17:45:04 [2021-07-10T21:45:04.772Z] [INFO] org.eclipse.ease.ui.scripts.test 0.9.0-SNAPSHOT .... SUCCESS [  8.200 s]
17:45:04 [2021-07-10T21:45:04.772Z] [INFO] org.eclipse.ease.ui.test 0.9.0-SNAPSHOT ............ SUCCESS [ 11.565 s]
17:45:04 [2021-07-10T21:45:04.772Z] [INFO] org.eclipse.ease.releng.coverage 0.9.0-SNAPSHOT .... SUCCESS [  2.456 s]
17:45:04 [2021-07-10T21:45:04.772Z] [INFO] EASE (Incubation) 0.4.0-SNAPSHOT ................... SUCCESS [  0.265 s]
17:45:04 [2021-07-10T21:45:04.772Z] [INFO] ------------------------------------------------------------------------
17:45:04 [2021-07-10T21:45:04.772Z] [INFO] BUILD SUCCESS
17:45:04 [2021-07-10T21:45:04.772Z] [INFO] ------------------------------------------------------------------------
17:45:04 [2021-07-10T21:45:04.772Z] [INFO] Total time:  09:42 min
17:45:04 [2021-07-10T21:45:04.772Z] [INFO] Finished at: 2021-07-10T21:45:04Z
17:45:04 [2021-07-10T21:45:04.772Z] [INFO] ------------------------------------------------------------------------
17:45:04 [2021-07-10T21:45:04.772Z] [INFO] [jenkins-event-spy] Generated /home/jenkins/agent/workspace/ease.verify.core.target.2019-03@tmp/withMaven6748b77a/maven-spy-20210710-213521-6444037922083870978127.log