Console Output

Skipping 1,246 KB.. Full Log
17:51:06 [2021-06-05T21:51:06.139Z] 	at org.eclipse.equinox.launcher.Main.main(Main.java:1449)
17:51:06 [2021-06-05T21:51:06.139Z] Caused by: java.lang.ClassNotFoundException: org.junit.runners.model.RunnerBuilder cannot be found by org.eclipse.tycho.surefire.osgibooter_2.2.0
17:51:06 [2021-06-05T21:51:06.139Z] 	at org.eclipse.osgi.internal.loader.BundleLoader.findClassInternal(BundleLoader.java:511)
17:51:06 [2021-06-05T21:51:06.139Z] 	at org.eclipse.osgi.internal.loader.BundleLoader.findClass(BundleLoader.java:422)
17:51:06 [2021-06-05T21:51:06.139Z] 	at org.eclipse.osgi.internal.loader.BundleLoader.findClass(BundleLoader.java:414)
17:51:06 [2021-06-05T21:51:06.139Z] 	at org.eclipse.osgi.internal.loader.ModuleClassLoader.loadClass(ModuleClassLoader.java:153)
17:51:06 [2021-06-05T21:51:06.139Z] 	at java.base/java.lang.ClassLoader.loadClass(ClassLoader.java:522)
17:51:06 [2021-06-05T21:51:06.139Z] 	... 31 more
17:51:06 [2021-06-05T21:51:06.139Z] 
17:51:06 [2021-06-05T21:51:06.139Z] Jun 05, 2021 9:51:05 PM org.junit.platform.launcher.core.DefaultLauncher handleThrowable
17:51:06 [2021-06-05T21:51:06.139Z] WARNING: TestEngine with ID 'junit-vintage' failed to discover tests
17:51:06 [2021-06-05T21:51:06.139Z] java.lang.NoClassDefFoundError: org/junit/runners/model/RunnerBuilder
17:51:06 [2021-06-05T21:51:06.139Z] 	at org.junit.vintage.engine.discovery.VintageDiscoverer.<init>(VintageDiscoverer.java:48)
17:51:06 [2021-06-05T21:51:06.139Z] 	at org.junit.vintage.engine.VintageTestEngine.discover(VintageTestEngine.java:65)
17:51:06 [2021-06-05T21:51:06.139Z] 	at org.junit.platform.launcher.core.DefaultLauncher.discoverEngineRoot(DefaultLauncher.java:130)
17:51:06 [2021-06-05T21:51:06.139Z] 	at org.junit.platform.launcher.core.DefaultLauncher.discoverRoot(DefaultLauncher.java:117)
17:51:06 [2021-06-05T21:51:06.139Z] 	at org.junit.platform.launcher.core.DefaultLauncher.discover(DefaultLauncher.java:82)
17:51:06 [2021-06-05T21:51:06.139Z] 	at org.apache.maven.surefire.junitplatform.TestPlanScannerFilter.accept(TestPlanScannerFilter.java:56)
17:51:06 [2021-06-05T21:51:06.139Z] 	at org.apache.maven.surefire.util.DefaultScanResult.applyFilter(DefaultScanResult.java:102)
17:51:06 [2021-06-05T21:51:06.139Z] 	at org.apache.maven.surefire.junitplatform.JUnitPlatformProvider.scanClasspath(JUnitPlatformProvider.java:143)
17:51:06 [2021-06-05T21:51:06.139Z] 	at org.apache.maven.surefire.junitplatform.JUnitPlatformProvider.invoke(JUnitPlatformProvider.java:124)
17:51:06 [2021-06-05T21:51:06.139Z] 	at java.base/jdk.internal.reflect.NativeMethodAccessorImpl.invoke0(Native Method)
17:51:06 [2021-06-05T21:51:06.139Z] 	at java.base/jdk.internal.reflect.NativeMethodAccessorImpl.invoke(NativeMethodAccessorImpl.java:64)
17:51:06 [2021-06-05T21:51:06.139Z] 	at java.base/jdk.internal.reflect.DelegatingMethodAccessorImpl.invoke(DelegatingMethodAccessorImpl.java:43)
17:51:06 [2021-06-05T21:51:06.139Z] 	at java.base/java.lang.reflect.Method.invoke(Method.java:564)
17:51:06 [2021-06-05T21:51:06.139Z] 	at org.apache.maven.surefire.util.ReflectionUtils.invokeMethodWithArray2(ReflectionUtils.java:206)
17:51:06 [2021-06-05T21:51:06.139Z] 	at org.apache.maven.surefire.booter.ProviderFactory$ProviderProxy.invoke(ProviderFactory.java:161)
17:51:06 [2021-06-05T21:51:06.139Z] 	at org.apache.maven.surefire.booter.ProviderFactory.invokeProvider(ProviderFactory.java:84)
17:51:06 [2021-06-05T21:51:06.139Z] 	at org.eclipse.tycho.surefire.osgibooter.OsgiSurefireBooter.run(OsgiSurefireBooter.java:116)
17:51:06 [2021-06-05T21:51:06.139Z] 	at org.eclipse.tycho.surefire.osgibooter.HeadlessTestApplication.start(HeadlessTestApplication.java:23)
17:51:06 [2021-06-05T21:51:06.140Z] 	at org.eclipse.equinox.internal.app.EclipseAppHandle.run(EclipseAppHandle.java:203)
17:51:06 [2021-06-05T21:51:06.140Z] 	at org.eclipse.core.runtime.internal.adaptor.EclipseAppLauncher.runApplication(EclipseAppLauncher.java:137)
17:51:06 [2021-06-05T21:51:06.140Z] 	at org.eclipse.core.runtime.internal.adaptor.EclipseAppLauncher.start(EclipseAppLauncher.java:107)
17:51:06 [2021-06-05T21:51:06.140Z] 	at org.eclipse.core.runtime.adaptor.EclipseStarter.run(EclipseStarter.java:400)
17:51:06 [2021-06-05T21:51:06.140Z] 	at org.eclipse.core.runtime.adaptor.EclipseStarter.run(EclipseStarter.java:255)
17:51:06 [2021-06-05T21:51:06.140Z] 	at java.base/jdk.internal.reflect.NativeMethodAccessorImpl.invoke0(Native Method)
17:51:06 [2021-06-05T21:51:06.140Z] 	at java.base/jdk.internal.reflect.NativeMethodAccessorImpl.invoke(NativeMethodAccessorImpl.java:64)
17:51:06 [2021-06-05T21:51:06.140Z] 	at java.base/jdk.internal.reflect.DelegatingMethodAccessorImpl.invoke(DelegatingMethodAccessorImpl.java:43)
17:51:06 [2021-06-05T21:51:06.140Z] 	at java.base/java.lang.reflect.Method.invoke(Method.java:564)
17:51:06 [2021-06-05T21:51:06.140Z] 	at org.eclipse.equinox.launcher.Main.invokeFramework(Main.java:661)
17:51:06 [2021-06-05T21:51:06.140Z] 	at org.eclipse.equinox.launcher.Main.basicRun(Main.java:597)
17:51:06 [2021-06-05T21:51:06.140Z] 	at org.eclipse.equinox.launcher.Main.run(Main.java:1476)
17:51:06 [2021-06-05T21:51:06.140Z] 	at org.eclipse.equinox.launcher.Main.main(Main.java:1449)
17:51:06 [2021-06-05T21:51:06.140Z] Caused by: java.lang.ClassNotFoundException: org.junit.runners.model.RunnerBuilder cannot be found by org.eclipse.tycho.surefire.osgibooter_2.2.0
17:51:06 [2021-06-05T21:51:06.140Z] 	at org.eclipse.osgi.internal.loader.BundleLoader.findClassInternal(BundleLoader.java:511)
17:51:06 [2021-06-05T21:51:06.140Z] 	at org.eclipse.osgi.internal.loader.BundleLoader.findClass(BundleLoader.java:422)
17:51:06 [2021-06-05T21:51:06.140Z] 	at org.eclipse.osgi.internal.loader.BundleLoader.findClass(BundleLoader.java:414)
17:51:06 [2021-06-05T21:51:06.140Z] 	at org.eclipse.osgi.internal.loader.ModuleClassLoader.loadClass(ModuleClassLoader.java:153)
17:51:06 [2021-06-05T21:51:06.140Z] 	at java.base/java.lang.ClassLoader.loadClass(ClassLoader.java:522)
17:51:06 [2021-06-05T21:51:06.140Z] 	... 31 more
17:51:06 [2021-06-05T21:51:06.140Z] 
17:51:06 [2021-06-05T21:51:06.140Z] Jun 05, 2021 9:51:05 PM org.junit.platform.launcher.core.DefaultLauncher handleThrowable
17:51:06 [2021-06-05T21:51:06.140Z] WARNING: TestEngine with ID 'junit-vintage' failed to discover tests
17:51:06 [2021-06-05T21:51:06.140Z] java.lang.NoClassDefFoundError: org/junit/runners/model/RunnerBuilder
17:51:06 [2021-06-05T21:51:06.140Z] 	at org.junit.vintage.engine.discovery.VintageDiscoverer.<init>(VintageDiscoverer.java:48)
17:51:06 [2021-06-05T21:51:06.140Z] 	at org.junit.vintage.engine.VintageTestEngine.discover(VintageTestEngine.java:65)
17:51:06 [2021-06-05T21:51:06.140Z] 	at org.junit.platform.launcher.core.DefaultLauncher.discoverEngineRoot(DefaultLauncher.java:130)
17:51:06 [2021-06-05T21:51:06.140Z] 	at org.junit.platform.launcher.core.DefaultLauncher.discoverRoot(DefaultLauncher.java:117)
17:51:06 [2021-06-05T21:51:06.140Z] 	at org.junit.platform.launcher.core.DefaultLauncher.discover(DefaultLauncher.java:82)
17:51:06 [2021-06-05T21:51:06.140Z] 	at org.apache.maven.surefire.junitplatform.TestPlanScannerFilter.accept(TestPlanScannerFilter.java:56)
17:51:06 [2021-06-05T21:51:06.140Z] 	at org.apache.maven.surefire.util.DefaultScanResult.applyFilter(DefaultScanResult.java:102)
17:51:06 [2021-06-05T21:51:06.140Z] 	at org.apache.maven.surefire.junitplatform.JUnitPlatformProvider.scanClasspath(JUnitPlatformProvider.java:143)
17:51:06 [2021-06-05T21:51:06.140Z] 	at org.apache.maven.surefire.junitplatform.JUnitPlatformProvider.invoke(JUnitPlatformProvider.java:124)
17:51:06 [2021-06-05T21:51:06.140Z] 	at java.base/jdk.internal.reflect.NativeMethodAccessorImpl.invoke0(Native Method)
17:51:06 [2021-06-05T21:51:06.140Z] 	at java.base/jdk.internal.reflect.NativeMethodAccessorImpl.invoke(NativeMethodAccessorImpl.java:64)
17:51:06 [2021-06-05T21:51:06.140Z] 	at java.base/jdk.internal.reflect.DelegatingMethodAccessorImpl.invoke(DelegatingMethodAccessorImpl.java:43)
17:51:06 [2021-06-05T21:51:06.140Z] 	at java.base/java.lang.reflect.Method.invoke(Method.java:564)
17:51:06 [2021-06-05T21:51:06.140Z] 	at org.apache.maven.surefire.util.ReflectionUtils.invokeMethodWithArray2(ReflectionUtils.java:206)
17:51:06 [2021-06-05T21:51:06.140Z] 	at org.apache.maven.surefire.booter.ProviderFactory$ProviderProxy.invoke(ProviderFactory.java:161)
17:51:06 [2021-06-05T21:51:06.140Z] 	at org.apache.maven.surefire.booter.ProviderFactory.invokeProvider(ProviderFactory.java:84)
17:51:06 [2021-06-05T21:51:06.140Z] 	at org.eclipse.tycho.surefire.osgibooter.OsgiSurefireBooter.run(OsgiSurefireBooter.java:116)
17:51:06 [2021-06-05T21:51:06.140Z] 	at org.eclipse.tycho.surefire.osgibooter.HeadlessTestApplication.start(HeadlessTestApplication.java:23)
17:51:06 [2021-06-05T21:51:06.140Z] 	at org.eclipse.equinox.internal.app.EclipseAppHandle.run(EclipseAppHandle.java:203)
17:51:06 [2021-06-05T21:51:06.140Z] 	at org.eclipse.core.runtime.internal.adaptor.EclipseAppLauncher.runApplication(EclipseAppLauncher.java:137)
17:51:06 [2021-06-05T21:51:06.140Z] 	at org.eclipse.core.runtime.internal.adaptor.EclipseAppLauncher.start(EclipseAppLauncher.java:107)
17:51:06 [2021-06-05T21:51:06.140Z] 	at org.eclipse.core.runtime.adaptor.EclipseStarter.run(EclipseStarter.java:400)
17:51:06 [2021-06-05T21:51:06.140Z] 	at org.eclipse.core.runtime.adaptor.EclipseStarter.run(EclipseStarter.java:255)
17:51:06 [2021-06-05T21:51:06.140Z] 	at java.base/jdk.internal.reflect.NativeMethodAccessorImpl.invoke0(Native Method)
17:51:06 [2021-06-05T21:51:06.140Z] 	at java.base/jdk.internal.reflect.NativeMethodAccessorImpl.invoke(NativeMethodAccessorImpl.java:64)
17:51:06 [2021-06-05T21:51:06.140Z] 	at java.base/jdk.internal.reflect.DelegatingMethodAccessorImpl.invoke(DelegatingMethodAccessorImpl.java:43)
17:51:06 [2021-06-05T21:51:06.140Z] 	at java.base/java.lang.reflect.Method.invoke(Method.java:564)
17:51:06 [2021-06-05T21:51:06.140Z] 	at org.eclipse.equinox.launcher.Main.invokeFramework(Main.java:661)
17:51:06 [2021-06-05T21:51:06.140Z] 	at org.eclipse.equinox.launcher.Main.basicRun(Main.java:597)
17:51:06 [2021-06-05T21:51:06.140Z] 	at org.eclipse.equinox.launcher.Main.run(Main.java:1476)
17:51:06 [2021-06-05T21:51:06.140Z] 	at org.eclipse.equinox.launcher.Main.main(Main.java:1449)
17:51:06 [2021-06-05T21:51:06.140Z] Caused by: java.lang.ClassNotFoundException: org.junit.runners.model.RunnerBuilder cannot be found by org.eclipse.tycho.surefire.osgibooter_2.2.0
17:51:06 [2021-06-05T21:51:06.140Z] 	at org.eclipse.osgi.internal.loader.BundleLoader.findClassInternal(BundleLoader.java:511)
17:51:06 [2021-06-05T21:51:06.140Z] 	at org.eclipse.osgi.internal.loader.BundleLoader.findClass(BundleLoader.java:422)
17:51:06 [2021-06-05T21:51:06.140Z] 	at org.eclipse.osgi.internal.loader.BundleLoader.findClass(BundleLoader.java:414)
17:51:06 [2021-06-05T21:51:06.140Z] 	at org.eclipse.osgi.internal.loader.ModuleClassLoader.loadClass(ModuleClassLoader.java:153)
17:51:06 [2021-06-05T21:51:06.140Z] 	at java.base/java.lang.ClassLoader.loadClass(ClassLoader.java:522)
17:51:06 [2021-06-05T21:51:06.140Z] 	... 31 more
17:51:06 [2021-06-05T21:51:06.140Z] 
17:51:06 [2021-06-05T21:51:06.140Z] Jun 05, 2021 9:51:05 PM org.junit.platform.launcher.core.DefaultLauncher handleThrowable
17:51:06 [2021-06-05T21:51:06.140Z] WARNING: TestEngine with ID 'junit-vintage' failed to discover tests
17:51:06 [2021-06-05T21:51:06.141Z] java.lang.NoClassDefFoundError: org/junit/runners/model/RunnerBuilder
17:51:06 [2021-06-05T21:51:06.141Z] 	at org.junit.vintage.engine.discovery.VintageDiscoverer.<init>(VintageDiscoverer.java:48)
17:51:06 [2021-06-05T21:51:06.141Z] 	at org.junit.vintage.engine.VintageTestEngine.discover(VintageTestEngine.java:65)
17:51:06 [2021-06-05T21:51:06.141Z] 	at org.junit.platform.launcher.core.DefaultLauncher.discoverEngineRoot(DefaultLauncher.java:130)
17:51:06 [2021-06-05T21:51:06.141Z] 	at org.junit.platform.launcher.core.DefaultLauncher.discoverRoot(DefaultLauncher.java:117)
17:51:06 [2021-06-05T21:51:06.141Z] 	at org.junit.platform.launcher.core.DefaultLauncher.discover(DefaultLauncher.java:82)
17:51:06 [2021-06-05T21:51:06.141Z] 	at org.apache.maven.surefire.junitplatform.TestPlanScannerFilter.accept(TestPlanScannerFilter.java:56)
17:51:06 [2021-06-05T21:51:06.141Z] 	at org.apache.maven.surefire.util.DefaultScanResult.applyFilter(DefaultScanResult.java:102)
17:51:06 [2021-06-05T21:51:06.141Z] 	at org.apache.maven.surefire.junitplatform.JUnitPlatformProvider.scanClasspath(JUnitPlatformProvider.java:143)
17:51:06 [2021-06-05T21:51:06.141Z] 	at org.apache.maven.surefire.junitplatform.JUnitPlatformProvider.invoke(JUnitPlatformProvider.java:124)
17:51:06 [2021-06-05T21:51:06.141Z] 	at java.base/jdk.internal.reflect.NativeMethodAccessorImpl.invoke0(Native Method)
17:51:06 [2021-06-05T21:51:06.141Z] 	at java.base/jdk.internal.reflect.NativeMethodAccessorImpl.invoke(NativeMethodAccessorImpl.java:64)
17:51:06 [2021-06-05T21:51:06.141Z] 	at java.base/jdk.internal.reflect.DelegatingMethodAccessorImpl.invoke(DelegatingMethodAccessorImpl.java:43)
17:51:06 [2021-06-05T21:51:06.141Z] 	at java.base/java.lang.reflect.Method.invoke(Method.java:564)
17:51:06 [2021-06-05T21:51:06.141Z] 	at org.apache.maven.surefire.util.ReflectionUtils.invokeMethodWithArray2(ReflectionUtils.java:206)
17:51:06 [2021-06-05T21:51:06.141Z] 	at org.apache.maven.surefire.booter.ProviderFactory$ProviderProxy.invoke(ProviderFactory.java:161)
17:51:06 [2021-06-05T21:51:06.141Z] 	at org.apache.maven.surefire.booter.ProviderFactory.invokeProvider(ProviderFactory.java:84)
17:51:06 [2021-06-05T21:51:06.141Z] 	at org.eclipse.tycho.surefire.osgibooter.OsgiSurefireBooter.run(OsgiSurefireBooter.java:116)
17:51:06 [2021-06-05T21:51:06.141Z] 	at org.eclipse.tycho.surefire.osgibooter.HeadlessTestApplication.start(HeadlessTestApplication.java:23)
17:51:06 [2021-06-05T21:51:06.141Z] 	at org.eclipse.equinox.internal.app.EclipseAppHandle.run(EclipseAppHandle.java:203)
17:51:06 [2021-06-05T21:51:06.141Z] 	at org.eclipse.core.runtime.internal.adaptor.EclipseAppLauncher.runApplication(EclipseAppLauncher.java:137)
17:51:06 [2021-06-05T21:51:06.141Z] 	at org.eclipse.core.runtime.internal.adaptor.EclipseAppLauncher.start(EclipseAppLauncher.java:107)
17:51:06 [2021-06-05T21:51:06.141Z] 	at org.eclipse.core.runtime.adaptor.EclipseStarter.run(EclipseStarter.java:400)
17:51:06 [2021-06-05T21:51:06.141Z] 	at org.eclipse.core.runtime.adaptor.EclipseStarter.run(EclipseStarter.java:255)
17:51:06 [2021-06-05T21:51:06.141Z] 	at java.base/jdk.internal.reflect.NativeMethodAccessorImpl.invoke0(Native Method)
17:51:06 [2021-06-05T21:51:06.141Z] 	at java.base/jdk.internal.reflect.NativeMethodAccessorImpl.invoke(NativeMethodAccessorImpl.java:64)
17:51:06 [2021-06-05T21:51:06.141Z] 	at java.base/jdk.internal.reflect.DelegatingMethodAccessorImpl.invoke(DelegatingMethodAccessorImpl.java:43)
17:51:06 [2021-06-05T21:51:06.141Z] 	at java.base/java.lang.reflect.Method.invoke(Method.java:564)
17:51:06 [2021-06-05T21:51:06.141Z] 	at org.eclipse.equinox.launcher.Main.invokeFramework(Main.java:661)
17:51:06 [2021-06-05T21:51:06.141Z] 	at org.eclipse.equinox.launcher.Main.basicRun(Main.java:597)
17:51:06 [2021-06-05T21:51:06.141Z] 	at org.eclipse.equinox.launcher.Main.run(Main.java:1476)
17:51:06 [2021-06-05T21:51:06.141Z] 	at org.eclipse.equinox.launcher.Main.main(Main.java:1449)
17:51:06 [2021-06-05T21:51:06.141Z] Caused by: java.lang.ClassNotFoundException: org.junit.runners.model.RunnerBuilder cannot be found by org.eclipse.tycho.surefire.osgibooter_2.2.0
17:51:06 [2021-06-05T21:51:06.141Z] 	at org.eclipse.osgi.internal.loader.BundleLoader.findClassInternal(BundleLoader.java:511)
17:51:06 [2021-06-05T21:51:06.141Z] 	at org.eclipse.osgi.internal.loader.BundleLoader.findClass(BundleLoader.java:422)
17:51:06 [2021-06-05T21:51:06.141Z] 	at org.eclipse.osgi.internal.loader.BundleLoader.findClass(BundleLoader.java:414)
17:51:06 [2021-06-05T21:51:06.141Z] 	at org.eclipse.osgi.internal.loader.ModuleClassLoader.loadClass(ModuleClassLoader.java:153)
17:51:06 [2021-06-05T21:51:06.141Z] 	at java.base/java.lang.ClassLoader.loadClass(ClassLoader.java:522)
17:51:06 [2021-06-05T21:51:06.141Z] 	... 31 more
17:51:06 [2021-06-05T21:51:06.141Z] 
17:51:06 [2021-06-05T21:51:06.141Z] Jun 05, 2021 9:51:05 PM org.junit.platform.launcher.core.DefaultLauncher handleThrowable
17:51:06 [2021-06-05T21:51:06.141Z] WARNING: TestEngine with ID 'junit-vintage' failed to discover tests
17:51:06 [2021-06-05T21:51:06.141Z] java.lang.NoClassDefFoundError: org/junit/runners/model/RunnerBuilder
17:51:06 [2021-06-05T21:51:06.141Z] 	at org.junit.vintage.engine.discovery.VintageDiscoverer.<init>(VintageDiscoverer.java:48)
17:51:06 [2021-06-05T21:51:06.141Z] 	at org.junit.vintage.engine.VintageTestEngine.discover(VintageTestEngine.java:65)
17:51:06 [2021-06-05T21:51:06.141Z] 	at org.junit.platform.launcher.core.DefaultLauncher.discoverEngineRoot(DefaultLauncher.java:130)
17:51:06 [2021-06-05T21:51:06.141Z] 	at org.junit.platform.launcher.core.DefaultLauncher.discoverRoot(DefaultLauncher.java:117)
17:51:06 [2021-06-05T21:51:06.141Z] 	at org.junit.platform.launcher.core.DefaultLauncher.discover(DefaultLauncher.java:82)
17:51:06 [2021-06-05T21:51:06.141Z] 	at org.apache.maven.surefire.junitplatform.TestPlanScannerFilter.accept(TestPlanScannerFilter.java:56)
17:51:06 [2021-06-05T21:51:06.141Z] 	at org.apache.maven.surefire.util.DefaultScanResult.applyFilter(DefaultScanResult.java:102)
17:51:06 [2021-06-05T21:51:06.141Z] 	at org.apache.maven.surefire.junitplatform.JUnitPlatformProvider.scanClasspath(JUnitPlatformProvider.java:143)
17:51:06 [2021-06-05T21:51:06.141Z] 	at org.apache.maven.surefire.junitplatform.JUnitPlatformProvider.invoke(JUnitPlatformProvider.java:124)
17:51:06 [2021-06-05T21:51:06.141Z] 	at java.base/jdk.internal.reflect.NativeMethodAccessorImpl.invoke0(Native Method)
17:51:06 [2021-06-05T21:51:06.141Z] 	at java.base/jdk.internal.reflect.NativeMethodAccessorImpl.invoke(NativeMethodAccessorImpl.java:64)
17:51:06 [2021-06-05T21:51:06.141Z] 	at java.base/jdk.internal.reflect.DelegatingMethodAccessorImpl.invoke(DelegatingMethodAccessorImpl.java:43)
17:51:06 [2021-06-05T21:51:06.141Z] 	at java.base/java.lang.reflect.Method.invoke(Method.java:564)
17:51:06 [2021-06-05T21:51:06.141Z] 	at org.apache.maven.surefire.util.ReflectionUtils.invokeMethodWithArray2(ReflectionUtils.java:206)
17:51:06 [2021-06-05T21:51:06.141Z] 	at org.apache.maven.surefire.booter.ProviderFactory$ProviderProxy.invoke(ProviderFactory.java:161)
17:51:06 [2021-06-05T21:51:06.141Z] 	at org.apache.maven.surefire.booter.ProviderFactory.invokeProvider(ProviderFactory.java:84)
17:51:06 [2021-06-05T21:51:06.141Z] 	at org.eclipse.tycho.surefire.osgibooter.OsgiSurefireBooter.run(OsgiSurefireBooter.java:116)
17:51:06 [2021-06-05T21:51:06.142Z] 	at org.eclipse.tycho.surefire.osgibooter.HeadlessTestApplication.start(HeadlessTestApplication.java:23)
17:51:06 [2021-06-05T21:51:06.142Z] 	at org.eclipse.equinox.internal.app.EclipseAppHandle.run(EclipseAppHandle.java:203)
17:51:06 [2021-06-05T21:51:06.142Z] 	at org.eclipse.core.runtime.internal.adaptor.EclipseAppLauncher.runApplication(EclipseAppLauncher.java:137)
17:51:06 [2021-06-05T21:51:06.142Z] 	at org.eclipse.core.runtime.internal.adaptor.EclipseAppLauncher.start(EclipseAppLauncher.java:107)
17:51:06 [2021-06-05T21:51:06.142Z] 	at org.eclipse.core.runtime.adaptor.EclipseStarter.run(EclipseStarter.java:400)
17:51:06 [2021-06-05T21:51:06.142Z] 	at org.eclipse.core.runtime.adaptor.EclipseStarter.run(EclipseStarter.java:255)
17:51:06 [2021-06-05T21:51:06.142Z] 	at java.base/jdk.internal.reflect.NativeMethodAccessorImpl.invoke0(Native Method)
17:51:06 [2021-06-05T21:51:06.142Z] 	at java.base/jdk.internal.reflect.NativeMethodAccessorImpl.invoke(NativeMethodAccessorImpl.java:64)
17:51:06 [2021-06-05T21:51:06.142Z] 	at java.base/jdk.internal.reflect.DelegatingMethodAccessorImpl.invoke(DelegatingMethodAccessorImpl.java:43)
17:51:06 [2021-06-05T21:51:06.142Z] 	at java.base/java.lang.reflect.Method.invoke(Method.java:564)
17:51:06 [2021-06-05T21:51:06.142Z] 	at org.eclipse.equinox.launcher.Main.invokeFramework(Main.java:661)
17:51:06 [2021-06-05T21:51:06.142Z] 	at org.eclipse.equinox.launcher.Main.basicRun(Main.java:597)
17:51:06 [2021-06-05T21:51:06.142Z] 	at org.eclipse.equinox.launcher.Main.run(Main.java:1476)
17:51:06 [2021-06-05T21:51:06.142Z] 	at org.eclipse.equinox.launcher.Main.main(Main.java:1449)
17:51:06 [2021-06-05T21:51:06.142Z] Caused by: java.lang.ClassNotFoundException: org.junit.runners.model.RunnerBuilder cannot be found by org.eclipse.tycho.surefire.osgibooter_2.2.0
17:51:06 [2021-06-05T21:51:06.142Z] 	at org.eclipse.osgi.internal.loader.BundleLoader.findClassInternal(BundleLoader.java:511)
17:51:06 [2021-06-05T21:51:06.142Z] 	at org.eclipse.osgi.internal.loader.BundleLoader.findClass(BundleLoader.java:422)
17:51:06 [2021-06-05T21:51:06.142Z] 	at org.eclipse.osgi.internal.loader.BundleLoader.findClass(BundleLoader.java:414)
17:51:06 [2021-06-05T21:51:06.142Z] 	at org.eclipse.osgi.internal.loader.ModuleClassLoader.loadClass(ModuleClassLoader.java:153)
17:51:06 [2021-06-05T21:51:06.142Z] 	at java.base/java.lang.ClassLoader.loadClass(ClassLoader.java:522)
17:51:06 [2021-06-05T21:51:06.142Z] 	... 31 more
17:51:06 [2021-06-05T21:51:06.142Z] 
17:51:06 [2021-06-05T21:51:06.142Z] Jun 05, 2021 9:51:06 PM org.junit.platform.launcher.core.DefaultLauncher handleThrowable
17:51:06 [2021-06-05T21:51:06.142Z] WARNING: TestEngine with ID 'junit-vintage' failed to discover tests
17:51:06 [2021-06-05T21:51:06.142Z] java.lang.NoClassDefFoundError: org/junit/runners/model/RunnerBuilder
17:51:06 [2021-06-05T21:51:06.142Z] 	at org.junit.vintage.engine.discovery.VintageDiscoverer.<init>(VintageDiscoverer.java:48)
17:51:06 [2021-06-05T21:51:06.142Z] 	at org.junit.vintage.engine.VintageTestEngine.discover(VintageTestEngine.java:65)
17:51:06 [2021-06-05T21:51:06.142Z] 	at org.junit.platform.launcher.core.DefaultLauncher.discoverEngineRoot(DefaultLauncher.java:130)
17:51:06 [2021-06-05T21:51:06.142Z] 	at org.junit.platform.launcher.core.DefaultLauncher.discoverRoot(DefaultLauncher.java:117)
17:51:06 [2021-06-05T21:51:06.142Z] 	at org.junit.platform.launcher.core.DefaultLauncher.execute(DefaultLauncher.java:90)
17:51:06 [2021-06-05T21:51:06.142Z] 	at org.apache.maven.surefire.junitplatform.JUnitPlatformProvider.invokeAllTests(JUnitPlatformProvider.java:150)
17:51:06 [2021-06-05T21:51:06.142Z] 	at org.apache.maven.surefire.junitplatform.JUnitPlatformProvider.invoke(JUnitPlatformProvider.java:124)
17:51:06 [2021-06-05T21:51:06.142Z] 	at java.base/jdk.internal.reflect.NativeMethodAccessorImpl.invoke0(Native Method)
17:51:06 [2021-06-05T21:51:06.142Z] 	at java.base/jdk.internal.reflect.NativeMethodAccessorImpl.invoke(NativeMethodAccessorImpl.java:64)
17:51:06 [2021-06-05T21:51:06.142Z] 	at java.base/jdk.internal.reflect.DelegatingMethodAccessorImpl.invoke(DelegatingMethodAccessorImpl.java:43)
17:51:06 [2021-06-05T21:51:06.142Z] 	at java.base/java.lang.reflect.Method.invoke(Method.java:564)
17:51:06 [2021-06-05T21:51:06.142Z] 	at org.apache.maven.surefire.util.ReflectionUtils.invokeMethodWithArray2(ReflectionUtils.java:206)
17:51:06 [2021-06-05T21:51:06.142Z] 	at org.apache.maven.surefire.booter.ProviderFactory$ProviderProxy.invoke(ProviderFactory.java:161)
17:51:06 [2021-06-05T21:51:06.142Z] 	at org.apache.maven.surefire.booter.ProviderFactory.invokeProvider(ProviderFactory.java:84)
17:51:06 [2021-06-05T21:51:06.142Z] 	at org.eclipse.tycho.surefire.osgibooter.OsgiSurefireBooter.run(OsgiSurefireBooter.java:116)
17:51:06 [2021-06-05T21:51:06.142Z] 	at org.eclipse.tycho.surefire.osgibooter.HeadlessTestApplication.start(HeadlessTestApplication.java:23)
17:51:06 [2021-06-05T21:51:06.142Z] 	at org.eclipse.equinox.internal.app.EclipseAppHandle.run(EclipseAppHandle.java:203)
17:51:06 [2021-06-05T21:51:06.142Z] 	at org.eclipse.core.runtime.internal.adaptor.EclipseAppLauncher.runApplication(EclipseAppLauncher.java:137)
17:51:06 [2021-06-05T21:51:06.142Z] 	at org.eclipse.core.runtime.internal.adaptor.EclipseAppLauncher.start(EclipseAppLauncher.java:107)
17:51:06 [2021-06-05T21:51:06.142Z] 	at org.eclipse.core.runtime.adaptor.EclipseStarter.run(EclipseStarter.java:400)
17:51:06 [2021-06-05T21:51:06.142Z] 	at org.eclipse.core.runtime.adaptor.EclipseStarter.run(EclipseStarter.java:255)
17:51:06 [2021-06-05T21:51:06.142Z] 	at java.base/jdk.internal.reflect.NativeMethodAccessorImpl.invoke0(Native Method)
17:51:06 [2021-06-05T21:51:06.142Z] 	at java.base/jdk.internal.reflect.NativeMethodAccessorImpl.invoke(NativeMethodAccessorImpl.java:64)
17:51:06 [2021-06-05T21:51:06.143Z] 	at java.base/jdk.internal.reflect.DelegatingMethodAccessorImpl.invoke(DelegatingMethodAccessorImpl.java:43)
17:51:06 [2021-06-05T21:51:06.143Z] 	at java.base/java.lang.reflect.Method.invoke(Method.java:564)
17:51:06 [2021-06-05T21:51:06.143Z] 	at org.eclipse.equinox.launcher.Main.invokeFramework(Main.java:661)
17:51:06 [2021-06-05T21:51:06.143Z] 	at org.eclipse.equinox.launcher.Main.basicRun(Main.java:597)
17:51:06 [2021-06-05T21:51:06.143Z] 	at org.eclipse.equinox.launcher.Main.run(Main.java:1476)
17:51:06 [2021-06-05T21:51:06.143Z] 	at org.eclipse.equinox.launcher.Main.main(Main.java:1449)
17:51:06 [2021-06-05T21:51:06.143Z] Caused by: java.lang.ClassNotFoundException: org.junit.runners.model.RunnerBuilder cannot be found by org.eclipse.tycho.surefire.osgibooter_2.2.0
17:51:06 [2021-06-05T21:51:06.143Z] 	at org.eclipse.osgi.internal.loader.BundleLoader.findClassInternal(BundleLoader.java:511)
17:51:06 [2021-06-05T21:51:06.143Z] 	at org.eclipse.osgi.internal.loader.BundleLoader.findClass(BundleLoader.java:422)
17:51:06 [2021-06-05T21:51:06.143Z] 	at org.eclipse.osgi.internal.loader.BundleLoader.findClass(BundleLoader.java:414)
17:51:06 [2021-06-05T21:51:06.143Z] 	at org.eclipse.osgi.internal.loader.ModuleClassLoader.loadClass(ModuleClassLoader.java:153)
17:51:06 [2021-06-05T21:51:06.143Z] 	at java.base/java.lang.ClassLoader.loadClass(ClassLoader.java:522)
17:51:06 [2021-06-05T21:51:06.143Z] 	... 29 more
17:51:06 [2021-06-05T21:51:06.143Z] 
17:51:06 [2021-06-05T21:51:06.401Z] Running org.eclipse.ease.ScriptTest
17:51:06 [2021-06-05T21:51:06.658Z] Tests run: 13, Failures: 0, Errors: 0, Skipped: 0, Time elapsed: 0.23 s - in org.eclipse.ease.ScriptTest
17:51:06 [2021-06-05T21:51:06.658Z] codeFromScriptable  Time elapsed: 0.198 s
17:51:06 [2021-06-05T21:51:06.658Z] codeFromFilesystemFile  Time elapsed: 0.006 s
17:51:06 [2021-06-05T21:51:06.658Z] getCodeStream  Time elapsed: 0.001 s
17:51:06 [2021-06-05T21:51:06.658Z] getFile  Time elapsed: 0.001 s
17:51:06 [2021-06-05T21:51:06.658Z] codeFromStringBuilder  Time elapsed: 0 s
17:51:06 [2021-06-05T21:51:06.658Z] getResult  Time elapsed: 0.001 s
17:51:06 [2021-06-05T21:51:06.658Z] getException  Time elapsed: 0.002 s
17:51:06 [2021-06-05T21:51:06.658Z] codeFromWorkspaceFile  Time elapsed: 0.001 s
17:51:06 [2021-06-05T21:51:06.658Z] codeFromInputStream  Time elapsed: 0.001 s
17:51:06 [2021-06-05T21:51:06.658Z] getTitle  Time elapsed: 0.001 s
17:51:06 [2021-06-05T21:51:06.658Z] getCommand  Time elapsed: 0.001 s
17:51:06 [2021-06-05T21:51:06.659Z] codeFromReader  Time elapsed: 0.001 s
17:51:06 [2021-06-05T21:51:06.659Z] codeFromString  Time elapsed: 0.001 s
17:51:06 [2021-06-05T21:51:06.659Z] Running org.eclipse.ease.adapters.ScriptableAdapterTest
17:51:06 [2021-06-05T21:51:06.659Z] Tests run: 5, Failures: 0, Errors: 0, Skipped: 0, Time elapsed: 0.039 s - in org.eclipse.ease.adapters.ScriptableAdapterTest
17:51:06 [2021-06-05T21:51:06.659Z] adaptURI  Time elapsed: 0.033 s
17:51:06 [2021-06-05T21:51:06.659Z] adaptURL  Time elapsed: 0.002 s
17:51:06 [2021-06-05T21:51:06.659Z] adaptWorkspaceFile  Time elapsed: 0 s
17:51:06 [2021-06-05T21:51:06.659Z] getAdapterList  Time elapsed: 0 s
17:51:06 [2021-06-05T21:51:06.659Z] adaptFilesystemFile  Time elapsed: 0 s
17:51:06 [2021-06-05T21:51:06.659Z] Running org.eclipse.ease.modules.ModuleDocumentationTest
17:51:06 [2021-06-05T21:51:06.659Z] Tests run: 1, Failures: 0, Errors: 0, Skipped: 0, Time elapsed: 0.002 s - in org.eclipse.ease.modules.ModuleDocumentationTest
17:51:06 [2021-06-05T21:51:06.659Z] module_documentation_exists  Time elapsed: 0 s
17:51:06 [2021-06-05T21:51:06.659Z] Running org.eclipse.ease.modules.ScriptParameterTest
17:51:06 [2021-06-05T21:51:06.659Z] Tests run: 6, Failures: 0, Errors: 0, Skipped: 0, Time elapsed: 0.009 s - in org.eclipse.ease.modules.ScriptParameterTest
17:51:06 [2021-06-05T21:51:06.659Z] getDefaultValue_null_when_annotation_has_no_default_value  Time elapsed: 0.003 s
17:51:06 [2021-06-05T21:51:06.659Z] isOptional_false_when_annotation_is_missing  Time elapsed: 0.001 s
17:51:06 [2021-06-05T21:51:06.659Z] isOptional_false_when_annotation_has_no_default_value  Time elapsed: 0.001 s
17:51:06 [2021-06-05T21:51:06.659Z] getDefaultValue_has_value_when_annotation_with_default_value_exists  Time elapsed: 0.001 s
17:51:06 [2021-06-05T21:51:06.659Z] getDefaultValue_null_when_annotation_is_missing  Time elapsed: 0 s
17:51:06 [2021-06-05T21:51:06.659Z] isOptional_true_when_annotation_with_default_value_exists  Time elapsed: 0.001 s
17:51:06 [2021-06-05T21:51:06.659Z] Running org.eclipse.ease.modules.EnvironmentModuleTest
17:51:06 [2021-06-05T21:51:06.659Z] Tests run: 1, Failures: 0, Errors: 0, Skipped: 0, Time elapsed: 0.02 s - in org.eclipse.ease.modules.EnvironmentModuleTest
17:51:06 [2021-06-05T21:51:06.659Z] getModuleDefinition_returns_environment_definition  Time elapsed: 0.019 s
17:51:06 [2021-06-05T21:51:06.659Z] Running org.eclipse.ease.modules.ModuleDefinitionTest
17:51:06 [2021-06-05T21:51:06.659Z] Tests run: 2, Failures: 0, Errors: 0, Skipped: 0, Time elapsed: 0.002 s - in org.eclipse.ease.modules.ModuleDefinitionTest
17:51:06 [2021-06-05T21:51:06.659Z] forInstance_returns_definition  Time elapsed: 0.001 s
17:51:06 [2021-06-05T21:51:06.659Z] forInstance_returns_null  Time elapsed: 0 s
17:51:06 [2021-06-05T21:51:06.659Z] Running org.eclipse.ease.applications.RunHeadlessScriptTest
17:51:08 [2021-06-05T21:51:08.043Z] org.eclipse.ease.ScriptExecutionException: SyntaxError: missing ; before statement (file:///home/jenkins/agent/workspace/ease.verify.core.target.2019-03/tests/org.eclipse.ease.test/resources/throwsException.js#1)
17:51:08 [2021-06-05T21:51:08.043Z] this does not work;
17:51:08 [2021-06-05T21:51:08.043Z]          ^
17:51:08 [2021-06-05T21:51:08.043Z] 	at throwsException.js,file:///home/jenkins/agent/workspace/ease.verify.core.target.2019-03/tests/org.eclipse.ease.test/resources/throwsException.js
17:51:08 [2021-06-05T21:51:08.043Z] ERROR: invalid command line argument
17:51:08 [2021-06-05T21:51:08.043Z] 	invalid argument: -unknown
17:51:08 [2021-06-05T21:51:08.043Z] 
17:51:08 [2021-06-05T21:51:08.043Z] SYNTAX: [-workspace <workspace location> [-refreshWorkspace]] [-engine <engineID>]-script <script name> <script parameters>
17:51:08 [2021-06-05T21:51:08.043Z] 
17:51:08 [2021-06-05T21:51:08.043Z] 		<script name> is a path like 'file://C/myfolder/myscript.js'
17:51:08 [2021-06-05T21:51:08.043Z] 		<engineID> provides a dedicated script engine ID. Use org.eclipse.ease.listEngines application.
17:51:08 [2021-06-05T21:51:08.043Z] 		<workspace location> is a file system path like 'C:\somefolder\myworkspace'
17:51:08 [2021-06-05T21:51:08.043Z] 			if you provide a workspace you can use workspace:// identifiers in your scripts
17:51:08 [2021-06-05T21:51:08.043Z] 			if you provide a workspace you may ask to refresh it first prior to script execution
17:51:08 [2021-06-05T21:51:08.043Z] 		<script parameters> will be passed to the script as String[] in the variable 'argv'
17:51:08 [2021-06-05T21:51:08.043Z] ERROR: invalid command line argument
17:51:08 [2021-06-05T21:51:08.043Z] 	script name is missing
17:51:08 [2021-06-05T21:51:08.043Z] 
17:51:08 [2021-06-05T21:51:08.043Z] SYNTAX: [-workspace <workspace location> [-refreshWorkspace]] [-engine <engineID>]-script <script name> <script parameters>
17:51:08 [2021-06-05T21:51:08.043Z] 
17:51:08 [2021-06-05T21:51:08.043Z] 		<script name> is a path like 'file://C/myfolder/myscript.js'
17:51:08 [2021-06-05T21:51:08.043Z] 		<engineID> provides a dedicated script engine ID. Use org.eclipse.ease.listEngines application.
17:51:08 [2021-06-05T21:51:08.043Z] 		<workspace location> is a file system path like 'C:\somefolder\myworkspace'
17:51:08 [2021-06-05T21:51:08.043Z] 			if you provide a workspace you can use workspace:// identifiers in your scripts
17:51:08 [2021-06-05T21:51:08.043Z] 			if you provide a workspace you may ask to refresh it first prior to script execution
17:51:08 [2021-06-05T21:51:08.043Z] 		<script parameters> will be passed to the script as String[] in the variable 'argv'
17:51:08 [2021-06-05T21:51:08.043Z] SYNTAX: [-workspace <workspace location> [-refreshWorkspace]] [-engine <engineID>]-script <script name> <script parameters>
17:51:08 [2021-06-05T21:51:08.043Z] 
17:51:08 [2021-06-05T21:51:08.043Z] 		<script name> is a path like 'file://C/myfolder/myscript.js'
17:51:08 [2021-06-05T21:51:08.043Z] 		<engineID> provides a dedicated script engine ID. Use org.eclipse.ease.listEngines application.
17:51:08 [2021-06-05T21:51:08.043Z] 		<workspace location> is a file system path like 'C:\somefolder\myworkspace'
17:51:08 [2021-06-05T21:51:08.043Z] 			if you provide a workspace you can use workspace:// identifiers in your scripts
17:51:08 [2021-06-05T21:51:08.043Z] 			if you provide a workspace you may ask to refresh it first prior to script execution
17:51:08 [2021-06-05T21:51:08.043Z] 		<script parameters> will be passed to the script as String[] in the variable 'argv'
17:51:08 [2021-06-05T21:51:08.301Z] Hello World
17:51:08 [2021-06-05T21:51:08.301Z] ERROR: invalid command line argument
17:51:08 [2021-06-05T21:51:08.301Z] 	workspace name is missing
17:51:08 [2021-06-05T21:51:08.301Z] 
17:51:08 [2021-06-05T21:51:08.301Z] SYNTAX: [-workspace <workspace location> [-refreshWorkspace]] [-engine <engineID>]-script <script name> <script parameters>
17:51:08 [2021-06-05T21:51:08.301Z] 
17:51:08 [2021-06-05T21:51:08.301Z] 		<script name> is a path like 'file://C/myfolder/myscript.js'
17:51:08 [2021-06-05T21:51:08.301Z] 		<engineID> provides a dedicated script engine ID. Use org.eclipse.ease.listEngines application.
17:51:08 [2021-06-05T21:51:08.301Z] 		<workspace location> is a file system path like 'C:\somefolder\myworkspace'
17:51:08 [2021-06-05T21:51:08.301Z] 			if you provide a workspace you can use workspace:// identifiers in your scripts
17:51:08 [2021-06-05T21:51:08.301Z] 			if you provide a workspace you may ask to refresh it first prior to script execution
17:51:08 [2021-06-05T21:51:08.301Z] 		<script parameters> will be passed to the script as String[] in the variable 'argv'
17:51:08 [2021-06-05T21:51:08.301Z] ERROR: invalid command line argument
17:51:08 [2021-06-05T21:51:08.301Z] 	engine ID is missing
17:51:08 [2021-06-05T21:51:08.301Z] 
17:51:08 [2021-06-05T21:51:08.301Z] SYNTAX: [-workspace <workspace location> [-refreshWorkspace]] [-engine <engineID>]-script <script name> <script parameters>
17:51:08 [2021-06-05T21:51:08.301Z] 
17:51:08 [2021-06-05T21:51:08.301Z] 		<script name> is a path like 'file://C/myfolder/myscript.js'
17:51:08 [2021-06-05T21:51:08.301Z] 		<engineID> provides a dedicated script engine ID. Use org.eclipse.ease.listEngines application.
17:51:08 [2021-06-05T21:51:08.301Z] 		<workspace location> is a file system path like 'C:\somefolder\myworkspace'
17:51:08 [2021-06-05T21:51:08.301Z] 			if you provide a workspace you can use workspace:// identifiers in your scripts
17:51:08 [2021-06-05T21:51:08.301Z] 			if you provide a workspace you may ask to refresh it first prior to script execution
17:51:08 [2021-06-05T21:51:08.301Z] 		<script parameters> will be passed to the script as String[] in the variable 'argv'
17:51:08 [2021-06-05T21:51:08.301Z] Tests run: 12, Failures: 0, Errors: 0, Skipped: 0, Time elapsed: 1.723 s - in org.eclipse.ease.applications.RunHeadlessScriptTest
17:51:08 [2021-06-05T21:51:08.301Z] start_error_when_script_throws  Time elapsed: 1.455 s
17:51:08 [2021-06-05T21:51:08.301Z] start_error_when_engine_ID_is_invalid  Time elapsed: 0.003 s
17:51:08 [2021-06-05T21:51:08.301Z] start_error_when_argument_is_unknown  Time elapsed: 0.002 s
17:51:08 [2021-06-05T21:51:08.301Z] start_error_when_script_location_is_missing  Time elapsed: 0.002 s
17:51:08 [2021-06-05T21:51:08.301Z] start_error_when_help_is_set  Time elapsed: 0.002 s
17:51:08 [2021-06-05T21:51:08.301Z] start_error_when_script_location_is_invalid  Time elapsed: 0.002 s
17:51:08 [2021-06-05T21:51:08.301Z] start_script  Time elapsed: 0.001 s
17:51:08 [2021-06-05T21:51:08.301Z] start_executes_script_with_return_value  Time elapsed: 0.089 s
17:51:08 [2021-06-05T21:51:08.301Z] start_executes_hello_world  Time elapsed: 0.082 s
17:51:08 [2021-06-05T21:51:08.301Z] start_error_when_workspace_location_is_missing  Time elapsed: 0.002 s
17:51:08 [2021-06-05T21:51:08.301Z] start_executes_script_arguments  Time elapsed: 0.048 s
17:51:08 [2021-06-05T21:51:08.302Z] start_error_when_engine_ID_is_missing  Time elapsed: 0.033 s
17:51:08 [2021-06-05T21:51:08.302Z] Running org.eclipse.ease.sign.VerifySignatureTest
17:51:08 [2021-06-05T21:51:08.581Z] Tests run: 1, Failures: 0, Errors: 0, Skipped: 0, Time elapsed: 0.132 s - in org.eclipse.ease.sign.VerifySignatureTest
17:51:08 [2021-06-05T21:51:08.581Z] testWithNonCodeParserScriptType  Time elapsed: 0.131 s
17:51:08 [2021-06-05T21:51:08.581Z] Running org.eclipse.ease.sign.SignatureHelperTest
17:51:08 [2021-06-05T21:51:08.581Z] Tests run: 1, Failures: 0, Errors: 0, Skipped: 0, Time elapsed: 0.019 s - in org.eclipse.ease.sign.SignatureHelperTest
17:51:08 [2021-06-05T21:51:08.581Z] certificateTest  Time elapsed: 0.019 s
17:51:08 [2021-06-05T21:51:08.581Z] Running org.eclipse.ease.ScriptResultTest
17:51:12 [2021-06-05T21:51:12.765Z] Tests run: 17, Failures: 0, Errors: 0, Skipped: 0, Time elapsed: 3.762 s - in org.eclipse.ease.ScriptResultTest
17:51:12 [2021-06-05T21:51:12.765Z] setResult_after_setException_throws  Time elapsed: 0.001 s
17:51:12 [2021-06-05T21:51:12.765Z] setResult_after_setResult_throws  Time elapsed: 0.037 s
17:51:12 [2021-06-05T21:51:12.765Z] isDone_true_when_exception_was_thrown  Time elapsed: 0 s
17:51:12 [2021-06-05T21:51:12.765Z] get_returns_ready_execution_result  Time elapsed: 0.001 s
17:51:12 [2021-06-05T21:51:12.765Z] get_waits_for_execution_result  Time elapsed: 0.552 s
17:51:12 [2021-06-05T21:51:12.765Z] get_with_timeout_waits_for_execution_result  Time elapsed: 0.553 s
17:51:12 [2021-06-05T21:51:12.765Z] get_throws_execution_exception  Time elapsed: 0.001 s
17:51:12 [2021-06-05T21:51:12.765Z] get_with_milliseconds_timeout_waits_for_execution_result  Time elapsed: 0.552 s
17:51:12 [2021-06-05T21:51:12.765Z] setException_after_setException_throws  Time elapsed: 0.001 s
17:51:12 [2021-06-05T21:51:12.766Z] isDone_false_on_new_ScriptResult  Time elapsed: 0 s
17:51:12 [2021-06-05T21:51:12.766Z] get_milliseconds_times_out  Time elapsed: 0.501 s
17:51:12 [2021-06-05T21:51:12.766Z] get_times_out  Time elapsed: 0.502 s
17:51:12 [2021-06-05T21:51:12.766Z] get_waits_for_execution_exception  Time elapsed: 0.552 s
17:51:12 [2021-06-05T21:51:12.766Z] setException_after_setResult_throws  Time elapsed: 0 s
17:51:12 [2021-06-05T21:51:12.766Z] isDone_true_when_result_is_null  Time elapsed: 0 s
17:51:12 [2021-06-05T21:51:12.766Z] isDone_true_when_result_is_ready  Time elapsed: 0 s
17:51:12 [2021-06-05T21:51:12.766Z] get_with_timeout_waits_for_execution_exception  Time elapsed: 0.501 s
17:51:12 [2021-06-05T21:51:12.766Z] Running org.eclipse.ease.AbstractCodeParserTest
17:51:12 [2021-06-05T21:51:12.766Z] Tests run: 5, Failures: 0, Errors: 0, Skipped: 0, Time elapsed: 0.006 s - in org.eclipse.ease.AbstractCodeParserTest
17:51:12 [2021-06-05T21:51:12.766Z] parseCode  Time elapsed: 0.002 s
17:51:12 [2021-06-05T21:51:12.766Z] parseLineHeader  Time elapsed: 0.001 s
17:51:12 [2021-06-05T21:51:12.766Z] parseBlockAfterWhitespace  Time elapsed: 0.001 s
17:51:12 [2021-06-05T21:51:12.766Z] parseEmpty  Time elapsed: 0 s
17:51:12 [2021-06-05T21:51:12.766Z] parseBlockHeader  Time elapsed: 0.001 s
17:51:12 [2021-06-05T21:51:12.766Z] Running org.eclipse.ease.tools.StringToolsTest
17:51:12 [2021-06-05T21:51:12.766Z] Tests run: 8, Failures: 0, Errors: 0, Skipped: 0, Time elapsed: 0.009 s - in org.eclipse.ease.tools.StringToolsTest
17:51:12 [2021-06-05T21:51:12.766Z] parseArgumentsNull  Time elapsed: 0.003 s
17:51:12 [2021-06-05T21:51:12.766Z] parseArgumentsQuotedSingle  Time elapsed: 0.001 s
17:51:12 [2021-06-05T21:51:12.766Z] parseArgumentsEmpty  Time elapsed: 0 s
17:51:12 [2021-06-05T21:51:12.766Z] parseArgumentsMixedMultiple  Time elapsed: 0 s
17:51:12 [2021-06-05T21:51:12.766Z] parseArgumentsMixedMultipleLines  Time elapsed: 0 s
17:51:12 [2021-06-05T21:51:12.766Z] parseArgumentsNonQuotedMultiple  Time elapsed: 0.001 s
17:51:12 [2021-06-05T21:51:12.766Z] parseArgumentsNonQuotedSingle  Time elapsed: 0 s
17:51:12 [2021-06-05T21:51:12.766Z] parseArgumentsQuotedMultiple  Time elapsed: 0 s
17:51:12 [2021-06-05T21:51:12.766Z] Running org.eclipse.ease.tools.ResourceToolsTest
17:51:12 [2021-06-05T21:51:12.766Z] Tests run: 47, Failures: 0, Errors: 0, Skipped: 0, Time elapsed: 0.159 s - in org.eclipse.ease.tools.ResourceToolsTest
17:51:12 [2021-06-05T21:51:12.766Z] resolveScriptLocation  Time elapsed: 0.016 s
17:51:12 [2021-06-05T21:51:12.766Z] getWorkspaceInputStream  Time elapsed: 0.001 s
17:51:12 [2021-06-05T21:51:12.766Z] resolvePlatformURI  Time elapsed: 0 s
17:51:12 [2021-06-05T21:51:12.766Z] resolveScriptLocationWithSpacesInPath  Time elapsed: 0.015 s
17:51:12 [2021-06-05T21:51:12.766Z] resolveURL  Time elapsed: 0.004 s
17:51:12 [2021-06-05T21:51:12.766Z] invalidIsAbsolute  Time elapsed: 0.001 s
17:51:12 [2021-06-05T21:51:12.766Z] getFilesystemInputStream  Time elapsed: 0.003 s
17:51:12 [2021-06-05T21:51:12.766Z] toRelativeLocationInWorkspace  Time elapsed: 0.001 s
17:51:12 [2021-06-05T21:51:12.766Z] checkOperatingSystem  Time elapsed: 0 s
17:51:12 [2021-06-05T21:51:12.766Z] inputStreamToString  Time elapsed: 0.001 s
17:51:12 [2021-06-05T21:51:12.766Z] fileSystemToAbsoluteLocationOnLinux  Time elapsed: 0.001 s
17:51:12 [2021-06-05T21:51:12.766Z] exists  Time elapsed: 0.001 s
17:51:12 [2021-06-05T21:51:12.766Z] resolveRelativeInWorkspace  Time elapsed: 0.004 s
17:51:12 [2021-06-05T21:51:12.766Z] isFile  Time elapsed: 0.001 s
17:51:12 [2021-06-05T21:51:12.766Z] invalidToFile  Time elapsed: 0 s
17:51:12 [2021-06-05T21:51:12.766Z] resolveAbsoluteInFileSystem  Time elapsed: 0.002 s
17:51:12 [2021-06-05T21:51:12.766Z] resolveWindowsRoot  Time elapsed: 0 s
17:51:12 [2021-06-05T21:51:12.766Z] resolveRelativeInFileSystemOnWindows  Time elapsed: 0 s
17:51:12 [2021-06-05T21:51:12.766Z] isAbsoluteFileSystemPathOnWindows  Time elapsed: 0 s
17:51:12 [2021-06-05T21:51:12.766Z] readerToString  Time elapsed: 0 s
17:51:12 [2021-06-05T21:51:12.766Z] workspaceFileToString  Time elapsed: 0.002 s
17:51:12 [2021-06-05T21:51:12.766Z] toFile  Time elapsed: 0.001 s
17:51:12 [2021-06-05T21:51:12.766Z] toProjectRelativeLocation  Time elapsed: 0.001 s
17:51:12 [2021-06-05T21:51:12.766Z] getInvalidInputStream  Time elapsed: 0.007 s
17:51:12 [2021-06-05T21:51:12.766Z] resolveRelativeInFileSystemOnLinux  Time elapsed: 0.001 s
17:51:12 [2021-06-05T21:51:12.766Z] isFolder  Time elapsed: 0.001 s
17:51:12 [2021-06-05T21:51:12.766Z] fileSystemToAbsoluteLocationOnWindows  Time elapsed: 0 s
17:51:12 [2021-06-05T21:51:12.766Z] isAbsoluteWorkspacePath  Time elapsed: 0 s
17:51:12 [2021-06-05T21:51:12.766Z] isAbsoluteFileSystemPathOnLinux  Time elapsed: 0.001 s
17:51:12 [2021-06-05T21:51:12.766Z] resolveInvalid  Time elapsed: 0 s
17:51:12 [2021-06-05T21:51:12.766Z] resolveAbsoluteInFileSystemOnWindows  Time elapsed: 0 s
17:51:12 [2021-06-05T21:51:12.766Z] resolveScriptLocationWithSpacesInDomain  Time elapsed: 0.001 s
17:51:12 [2021-06-05T21:51:12.766Z] resolveRelativefromWorkspaceToFilesystem  Time elapsed: 0.001 s
17:51:12 [2021-06-05T21:51:12.766Z] resolveRelativeWithoutBaseFile  Time elapsed: 0 s
17:51:12 [2021-06-05T21:51:12.766Z] resolveInWorkspace  Time elapsed: 0.001 s
17:51:12 [2021-06-05T21:51:12.766Z] resolveScriptLocationWithSpecialCharactersInPath  Time elapsed: 0 s
17:51:12 [2021-06-05T21:51:12.766Z] filesystemFileToString  Time elapsed: 0.001 s
17:51:12 [2021-06-05T21:51:12.766Z] createURI  Time elapsed: 0.001 s
17:51:12 [2021-06-05T21:51:12.766Z] uriToAbsoluteLocation  Time elapsed: 0 s
17:51:12 [2021-06-05T21:51:12.766Z] createFolder  Time elapsed: 0.006 s
17:51:12 [2021-06-05T21:51:12.766Z] workspaceToAbsoluteLocation  Time elapsed: 0 s
17:51:12 [2021-06-05T21:51:12.766Z] resolveAbsoluteInFileSystemOnLinux  Time elapsed: 0.001 s
17:51:12 [2021-06-05T21:51:12.766Z] invalidToString  Time elapsed: 0 s
17:51:12 [2021-06-05T21:51:12.766Z] resolveRelativeURIs  Time elapsed: 0.001 s
17:51:12 [2021-06-05T21:51:12.766Z] resolveRelativeInFileSystem  Time elapsed: 0.001 s
17:51:12 [2021-06-05T21:51:12.766Z] resolveScriptLocationWithSpecialCharactersInDomain  Time elapsed: 0.005 s
17:51:12 [2021-06-05T21:51:12.766Z] isAbsoluteURL  Time elapsed: 0.001 s
17:51:12 [2021-06-05T21:51:12.766Z] Running org.eclipse.ease.tools.RunnableWithResultTest
17:51:12 [2021-06-05T21:51:12.767Z] Tests run: 2, Failures: 0, Errors: 0, Skipped: 0, Time elapsed: 0.002 s - in org.eclipse.ease.tools.RunnableWithResultTest
17:51:12 [2021-06-05T21:51:12.767Z] testException  Time elapsed: 0 s
17:51:12 [2021-06-05T21:51:12.767Z] testResult  Time elapsed: 0.001 s
17:51:12 [2021-06-05T21:51:12.767Z] Running org.eclipse.ease.AbstractScriptEngineTest
17:51:16 [2021-06-05T21:51:16.950Z] testorg.eclipse.ease.ScriptEngineCancellationException: Terminated on user request
17:51:16 [2021-06-05T21:51:16.950Z] 	at org.eclipse.ease.AbstractScriptEngine.checkForCancellation(AbstractScriptEngine.java:391)
17:51:16 [2021-06-05T21:51:16.950Z] 	at org.eclipse.ease.AbstractScriptEngineTest$3.execute(AbstractScriptEngineTest.java:294)
17:51:16 [2021-06-05T21:51:16.950Z] 	at org.eclipse.ease.AbstractScriptEngine.inject(AbstractScriptEngine.java:189)
17:51:16 [2021-06-05T21:51:16.950Z] 	at org.eclipse.ease.AbstractScriptEngine.run(AbstractScriptEngine.java:242)
17:51:16 [2021-06-05T21:51:16.950Z] 	at org.eclipse.core.internal.jobs.Worker.run(Worker.java:63)
17:51:17 [2021-06-05T21:51:17.532Z] java.lang.RuntimeException: ERROR
17:51:17 [2021-06-05T21:51:17.532Z] 	at org.eclipse.ease.AbstractScriptEngineTest$MockedScriptEngine.execute(AbstractScriptEngineTest.java:76)
17:51:17 [2021-06-05T21:51:17.532Z] 	at org.eclipse.ease.AbstractScriptEngine.inject(AbstractScriptEngine.java:189)
17:51:17 [2021-06-05T21:51:17.532Z] 	at org.eclipse.ease.AbstractScriptEngine.run(AbstractScriptEngine.java:242)
17:51:17 [2021-06-05T21:51:17.532Z] 	at org.eclipse.core.internal.jobs.Worker.run(Worker.java:63)
17:51:18 [2021-06-05T21:51:18.467Z] 1Tests run: 17, Failures: 0, Errors: 0, Skipped: 0, Time elapsed: 6.029 s - in org.eclipse.ease.AbstractScriptEngineTest
17:51:18 [2021-06-05T21:51:18.467Z] extractEmptyArguments  Time elapsed: 0.001 s
17:51:18 [2021-06-05T21:51:18.467Z] setNotNullOutputStream  Time elapsed: 0.001 s
17:51:18 [2021-06-05T21:51:18.467Z] terminateViaMonitorCancellation  Time elapsed: 0.204 s
17:51:18 [2021-06-05T21:51:18.467Z] inject  Time elapsed: 0 s
17:51:18 [2021-06-05T21:51:18.467Z] extractArguments  Time elapsed: 0 s
17:51:18 [2021-06-05T21:51:18.468Z] executeSync  Time elapsed: 1.001 s
17:51:18 [2021-06-05T21:51:18.468Z] setNotNullErrorStream  Time elapsed: 0 s
17:51:18 [2021-06-05T21:51:18.468Z] setNullErrorStream  Time elapsed: 0.001 s
17:51:18 [2021-06-05T21:51:18.468Z] isJob  Time elapsed: 0 s
17:51:18 [2021-06-05T21:51:18.468Z] streamsAvailable  Time elapsed: 0 s
17:51:18 [2021-06-05T21:51:18.468Z] executeValidCodeAndTerminate  Time elapsed: 1.001 s
17:51:18 [2021-06-05T21:51:18.468Z] setNullOutputStream  Time elapsed: 0 s
17:51:18 [2021-06-05T21:51:18.468Z] terminateMultipleTimes  Time elapsed: 0.602 s
17:51:18 [2021-06-05T21:51:18.468Z] engineTerminatesWhenIdle  Time elapsed: 1.001 s
17:51:18 [2021-06-05T21:51:18.468Z] terminateViaTerminateMethod  Time elapsed: 0.204 s
17:51:18 [2021-06-05T21:51:18.468Z] terminateViaMethodCallback  Time elapsed: 1.003 s
17:51:18 [2021-06-05T21:51:18.468Z] executeErrorCodeAndTerminate  Time elapsed: 1.002 s
17:51:18 [2021-06-05T21:51:18.468Z] Running org.eclipse.ease.AbstractCodeFactoryTest
17:51:18 [2021-06-05T21:51:18.726Z] Tests run: 1, Failures: 0, Errors: 0, Skipped: 0, Time elapsed: 0.248 s - in org.eclipse.ease.AbstractCodeFactoryTest
17:51:18 [2021-06-05T21:51:18.726Z] createNewKeywordHeader  Time elapsed: 0.247 s
17:51:18 [2021-06-05T21:51:18.726Z] Running org.eclipse.ease.AbstractReplScriptEngineTest
17:51:25 [2021-06-05T21:51:25.285Z] testorg.eclipse.ease.ScriptEngineCancellationException: Terminated on user request
17:51:25 [2021-06-05T21:51:25.286Z] 	at org.eclipse.ease.AbstractScriptEngine.checkForCancellation(AbstractScriptEngine.java:391)
17:51:25 [2021-06-05T21:51:25.286Z] 	at org.eclipse.ease.AbstractScriptEngineTest$3.execute(AbstractScriptEngineTest.java:294)
17:51:25 [2021-06-05T21:51:25.286Z] 	at org.eclipse.ease.AbstractScriptEngine.inject(AbstractScriptEngine.java:189)
17:51:25 [2021-06-05T21:51:25.286Z] 	at org.eclipse.ease.AbstractScriptEngine.run(AbstractScriptEngine.java:242)
17:51:25 [2021-06-05T21:51:25.286Z] 	at org.eclipse.core.internal.jobs.Worker.run(Worker.java:63)
17:51:25 [2021-06-05T21:51:25.286Z] java.lang.RuntimeException: ERROR
17:51:25 [2021-06-05T21:51:25.286Z] 	at org.eclipse.ease.AbstractReplScriptEngineTest$MockedScriptEngine.execute(AbstractReplScriptEngineTest.java:61)
17:51:25 [2021-06-05T21:51:25.286Z] 	at org.eclipse.ease.AbstractScriptEngine.inject(AbstractScriptEngine.java:189)
17:51:25 [2021-06-05T21:51:25.286Z] 	at org.eclipse.ease.AbstractScriptEngine.run(AbstractScriptEngine.java:242)
17:51:25 [2021-06-05T21:51:25.286Z] 	at org.eclipse.core.internal.jobs.Worker.run(Worker.java:63)
17:51:29 [2021-06-05T21:51:29.472Z] 1Hello worldHello worldTests run: 20, Failures: 0, Errors: 0, Skipped: 0, Time elapsed: 10.039 s - in org.eclipse.ease.AbstractReplScriptEngineTest
17:51:29 [2021-06-05T21:51:29.472Z] extractEmptyArguments  Time elapsed: 0.001 s
17:51:29 [2021-06-05T21:51:29.472Z] setNotNullOutputStream  Time elapsed: 0 s
17:51:29 [2021-06-05T21:51:29.472Z] terminateViaMonitorCancellation  Time elapsed: 1.203 s
17:51:29 [2021-06-05T21:51:29.472Z] inject  Time elapsed: 0.001 s
17:51:29 [2021-06-05T21:51:29.472Z] extractArguments  Time elapsed: 0 s
17:51:29 [2021-06-05T21:51:29.472Z] executeSync  Time elapsed: 1.002 s
17:51:29 [2021-06-05T21:51:29.472Z] setNotNullErrorStream  Time elapsed: 0 s
17:51:29 [2021-06-05T21:51:29.472Z] setNullErrorStream  Time elapsed: 0 s
17:51:29 [2021-06-05T21:51:29.472Z] isJob  Time elapsed: 0 s
17:51:29 [2021-06-05T21:51:29.472Z] streamsAvailable  Time elapsed: 0 s
17:51:29 [2021-06-05T21:51:29.472Z] executeValidCodeAndTerminate  Time elapsed: 1.001 s
17:51:29 [2021-06-05T21:51:29.472Z] setNullOutputStream  Time elapsed: 0 s
17:51:29 [2021-06-05T21:51:29.472Z] terminateMultipleTimes  Time elapsed: 0.601 s
17:51:29 [2021-06-05T21:51:29.472Z] engineTerminatesWhenIdle  Time elapsed: 1.001 s
17:51:29 [2021-06-05T21:51:29.472Z] terminateViaTerminateMethod  Time elapsed: 1.203 s
17:51:29 [2021-06-05T21:51:29.472Z] terminateViaMethodCallback  Time elapsed: 0.002 s
17:51:29 [2021-06-05T21:51:29.472Z] executeErrorCodeAndTerminate  Time elapsed: 1.001 s
17:51:29 [2021-06-05T21:51:29.472Z] terminateOnIdleAfterSchedule  Time elapsed: 1.011 s
17:51:29 [2021-06-05T21:51:29.472Z] terminateEngine  Time elapsed: 1.001 s
17:51:29 [2021-06-05T21:51:29.472Z] keepRunningOnIdle  Time elapsed: 1.001 s
17:51:29 [2021-06-05T21:51:29.472Z] 
17:51:29 [2021-06-05T21:51:29.472Z] Results:
17:51:29 [2021-06-05T21:51:29.472Z] 
17:51:29 [2021-06-05T21:51:29.472Z] Tests run: 159, Failures: 0, Errors: 0, Skipped: 0
17:51:29 [2021-06-05T21:51:29.472Z] 
17:51:30 [2021-06-05T21:51:30.406Z] [INFO] All tests passed!
17:51:30 [2021-06-05T21:51:30.406Z] [INFO] 
17:51:30 [2021-06-05T21:51:30.406Z] [INFO] ----< org.eclipse.ease:org.eclipse.ease.lang.javascript.rhino.test >----
17:51:30 [2021-06-05T21:51:30.406Z] [INFO] Building org.eclipse.ease.lang.javascript.rhino.test 0.8.0-SNAPSHOT [4/9]
17:51:30 [2021-06-05T21:51:30.406Z] [INFO] ------------------------[ eclipse-test-plugin ]-------------------------
17:51:30 [2021-06-05T21:51:30.406Z] [INFO] 
17:51:30 [2021-06-05T21:51:30.406Z] [INFO] --- tycho-packaging-plugin:2.2.0:build-qualifier (default-build-qualifier) @ org.eclipse.ease.lang.javascript.rhino.test ---
17:51:30 [2021-06-05T21:51:30.406Z] [INFO] The project's OSGi version is 0.8.0.I202104091518
17:51:30 [2021-06-05T21:51:30.406Z] [INFO] 
17:51:30 [2021-06-05T21:51:30.406Z] [INFO] --- tycho-packaging-plugin:2.2.0:validate-id (default-validate-id) @ org.eclipse.ease.lang.javascript.rhino.test ---
17:51:30 [2021-06-05T21:51:30.406Z] [INFO] 
17:51:30 [2021-06-05T21:51:30.406Z] [INFO] --- tycho-packaging-plugin:2.2.0:validate-version (default-validate-version) @ org.eclipse.ease.lang.javascript.rhino.test ---
17:51:30 [2021-06-05T21:51:30.406Z] [INFO] 
17:51:30 [2021-06-05T21:51:30.406Z] [INFO] --- maven-resources-plugin:2.4.3:resources (default-resources) @ org.eclipse.ease.lang.javascript.rhino.test ---
17:51:30 [2021-06-05T21:51:30.406Z] [INFO] Using 'UTF-8' encoding to copy filtered resources.
17:51:30 [2021-06-05T21:51:30.406Z] [INFO] skip non existing resourceDirectory /home/jenkins/agent/workspace/ease.verify.core.target.2019-03/tests/org.eclipse.ease.lang.javascript.rhino.test/src/main/resources
17:51:30 [2021-06-05T21:51:30.406Z] [INFO] 
17:51:30 [2021-06-05T21:51:30.406Z] [INFO] --- tycho-compiler-plugin:2.2.0:compile (default-compile) @ org.eclipse.ease.lang.javascript.rhino.test ---
17:51:30 [2021-06-05T21:51:30.406Z] [INFO] Nothing to compile - all classes are up to date
17:51:30 [2021-06-05T21:51:30.406Z] [INFO] 
17:51:30 [2021-06-05T21:51:30.406Z] [INFO] --- maven-resources-plugin:2.4.3:testResources (default-testResources) @ org.eclipse.ease.lang.javascript.rhino.test ---
17:51:30 [2021-06-05T21:51:30.406Z] [INFO] Using 'UTF-8' encoding to copy filtered resources.
17:51:30 [2021-06-05T21:51:30.406Z] [INFO] skip non existing resourceDirectory /home/jenkins/agent/workspace/ease.verify.core.target.2019-03/tests/org.eclipse.ease.lang.javascript.rhino.test/src/test/resources
17:51:30 [2021-06-05T21:51:30.406Z] [INFO] 
17:51:30 [2021-06-05T21:51:30.406Z] [INFO] --- target-platform-configuration:2.2.0:target-platform (default-target-platform) @ org.eclipse.ease.lang.javascript.rhino.test ---
17:51:30 [2021-06-05T21:51:30.406Z] [INFO] 
17:51:30 [2021-06-05T21:51:30.406Z] [INFO] --- tycho-packaging-plugin:2.2.0:package-plugin (default-package-plugin) @ org.eclipse.ease.lang.javascript.rhino.test ---
17:51:30 [2021-06-05T21:51:30.406Z] [INFO] Building jar: /home/jenkins/agent/workspace/ease.verify.core.target.2019-03/tests/org.eclipse.ease.lang.javascript.rhino.test/target/org.eclipse.ease.lang.javascript.rhino.test-0.8.0-SNAPSHOT.jar
17:51:30 [2021-06-05T21:51:30.682Z] [INFO] 
17:51:30 [2021-06-05T21:51:30.682Z] [INFO] --- tycho-p2-plugin:2.2.0:p2-metadata-default (default-p2-metadata-default) @ org.eclipse.ease.lang.javascript.rhino.test ---
17:51:30 [2021-06-05T21:51:30.682Z] [INFO] 
17:51:30 [2021-06-05T21:51:30.682Z] [INFO] --- jacoco-maven-plugin:0.8.6:prepare-agent (jacoco-initialize) @ org.eclipse.ease.lang.javascript.rhino.test ---
17:51:30 [2021-06-05T21:51:30.682Z] [INFO] tycho.testArgLine set to -javaagent:/home/jenkins/.m2/repository/org/jacoco/org.jacoco.agent/0.8.6/org.jacoco.agent-0.8.6-runtime.jar=destfile=/home/jenkins/agent/workspace/ease.verify.core.target.2019-03/tests/org.eclipse.ease.lang.javascript.rhino.test/target/jacoco.exec,output=file
17:51:30 [2021-06-05T21:51:30.682Z] [INFO] 
17:51:30 [2021-06-05T21:51:30.682Z] [INFO] --- tycho-surefire-plugin:2.2.0:test (default-test) @ org.eclipse.ease.lang.javascript.rhino.test ---
17:51:30 [2021-06-05T21:51:30.682Z] [INFO] Executing Test Runtime with timeout 0, logs (if any) will be placed at: /home/jenkins/agent/workspace/ease.verify.core.target.2019-03/tests/org.eclipse.ease.lang.javascript.rhino.test/target/work/data/.metadata/.log
17:51:30 [2021-06-05T21:51:30.682Z] [INFO] Command line:
17:51:30 [2021-06-05T21:51:30.682Z] 	[/opt/tools/java/openjdk/jdk-15/15.0.2+7/bin/java, -Dosgi.noShutdown=false, -Dosgi.os=linux, -Dosgi.ws=gtk, -Dosgi.arch=x86_64, -javaagent:/home/jenkins/.m2/repository/org/jacoco/org.jacoco.agent/0.8.6/org.jacoco.agent-0.8.6-runtime.jar=destfile=/home/jenkins/agent/workspace/ease.verify.core.target.2019-03/tests/org.eclipse.ease.lang.javascript.rhino.test/target/jacoco.exec,output=file, -Dosgi.clean=true, -jar, /home/jenkins/.m2/repository/p2/osgi/bundle/org.eclipse.equinox.launcher/1.5.300.v20190213-1655/org.eclipse.equinox.launcher-1.5.300.v20190213-1655.jar, -data, /home/jenkins/agent/workspace/ease.verify.core.target.2019-03/tests/org.eclipse.ease.lang.javascript.rhino.test/target/work/data, -install, /home/jenkins/agent/workspace/ease.verify.core.target.2019-03/tests/org.eclipse.ease.lang.javascript.rhino.test/target/work, -configuration, /home/jenkins/agent/workspace/ease.verify.core.target.2019-03/tests/org.eclipse.ease.lang.javascript.rhino.test/target/work/configuration, -application, org.eclipse.tycho.surefire.osgibooter.headlesstest, -testproperties, /home/jenkins/agent/workspace/ease.verify.core.target.2019-03/tests/org.eclipse.ease.lang.javascript.rhino.test/target/surefire.properties]
17:51:30 [2021-06-05T21:51:30.682Z] Picked up JAVA_TOOL_OPTIONS: -Dmaven.ext.class.path="/home/jenkins/agent/workspace/ease.verify.core.target.2019-03@tmp/withMavend0cee191/pipeline-maven-spy.jar" -Dorg.jenkinsci.plugins.pipeline.maven.reportsFolder="/home/jenkins/agent/workspace/ease.verify.core.target.2019-03@tmp/withMavend0cee191" 
17:51:37 [2021-06-05T21:51:37.257Z] Jun 05, 2021 9:51:36 PM org.junit.platform.launcher.core.DefaultLauncher handleThrowable
17:51:37 [2021-06-05T21:51:37.257Z] WARNING: TestEngine with ID 'junit-vintage' failed to discover tests
17:51:37 [2021-06-05T21:51:37.257Z] java.lang.NoClassDefFoundError: org/junit/runners/model/RunnerBuilder
17:51:37 [2021-06-05T21:51:37.257Z] 	at org.junit.vintage.engine.discovery.VintageDiscoverer.<init>(VintageDiscoverer.java:48)
17:51:37 [2021-06-05T21:51:37.257Z] 	at org.junit.vintage.engine.VintageTestEngine.discover(VintageTestEngine.java:65)
17:51:37 [2021-06-05T21:51:37.257Z] 	at org.junit.platform.launcher.core.DefaultLauncher.discoverEngineRoot(DefaultLauncher.java:130)
17:51:37 [2021-06-05T21:51:37.257Z] 	at org.junit.platform.launcher.core.DefaultLauncher.discoverRoot(DefaultLauncher.java:117)
17:51:37 [2021-06-05T21:51:37.257Z] 	at org.junit.platform.launcher.core.DefaultLauncher.discover(DefaultLauncher.java:82)
17:51:37 [2021-06-05T21:51:37.257Z] 	at org.apache.maven.surefire.junitplatform.TestPlanScannerFilter.accept(TestPlanScannerFilter.java:56)
17:51:37 [2021-06-05T21:51:37.257Z] 	at org.apache.maven.surefire.util.DefaultScanResult.applyFilter(DefaultScanResult.java:102)
17:51:37 [2021-06-05T21:51:37.257Z] 	at org.apache.maven.surefire.junitplatform.JUnitPlatformProvider.scanClasspath(JUnitPlatformProvider.java:143)
17:51:37 [2021-06-05T21:51:37.257Z] 	at org.apache.maven.surefire.junitplatform.JUnitPlatformProvider.invoke(JUnitPlatformProvider.java:124)
17:51:37 [2021-06-05T21:51:37.257Z] 	at java.base/jdk.internal.reflect.NativeMethodAccessorImpl.invoke0(Native Method)
17:51:37 [2021-06-05T21:51:37.257Z] 	at java.base/jdk.internal.reflect.NativeMethodAccessorImpl.invoke(NativeMethodAccessorImpl.java:64)
17:51:37 [2021-06-05T21:51:37.257Z] 	at java.base/jdk.internal.reflect.DelegatingMethodAccessorImpl.invoke(DelegatingMethodAccessorImpl.java:43)
17:51:37 [2021-06-05T21:51:37.257Z] 	at java.base/java.lang.reflect.Method.invoke(Method.java:564)
17:51:37 [2021-06-05T21:51:37.257Z] 	at org.apache.maven.surefire.util.ReflectionUtils.invokeMethodWithArray2(ReflectionUtils.java:206)
17:51:37 [2021-06-05T21:51:37.257Z] 	at org.apache.maven.surefire.booter.ProviderFactory$ProviderProxy.invoke(ProviderFactory.java:161)
17:51:37 [2021-06-05T21:51:37.257Z] 	at org.apache.maven.surefire.booter.ProviderFactory.invokeProvider(ProviderFactory.java:84)
17:51:37 [2021-06-05T21:51:37.257Z] 	at org.eclipse.tycho.surefire.osgibooter.OsgiSurefireBooter.run(OsgiSurefireBooter.java:116)
17:51:37 [2021-06-05T21:51:37.257Z] 	at org.eclipse.tycho.surefire.osgibooter.HeadlessTestApplication.start(HeadlessTestApplication.java:23)
17:51:37 [2021-06-05T21:51:37.258Z] 	at org.eclipse.equinox.internal.app.EclipseAppHandle.run(EclipseAppHandle.java:203)
17:51:37 [2021-06-05T21:51:37.258Z] 	at org.eclipse.core.runtime.internal.adaptor.EclipseAppLauncher.runApplication(EclipseAppLauncher.java:137)
17:51:37 [2021-06-05T21:51:37.258Z] 	at org.eclipse.core.runtime.internal.adaptor.EclipseAppLauncher.start(EclipseAppLauncher.java:107)
17:51:37 [2021-06-05T21:51:37.258Z] 	at org.eclipse.core.runtime.adaptor.EclipseStarter.run(EclipseStarter.java:400)
17:51:37 [2021-06-05T21:51:37.258Z] 	at org.eclipse.core.runtime.adaptor.EclipseStarter.run(EclipseStarter.java:255)
17:51:37 [2021-06-05T21:51:37.258Z] 	at java.base/jdk.internal.reflect.NativeMethodAccessorImpl.invoke0(Native Method)
17:51:37 [2021-06-05T21:51:37.258Z] 	at java.base/jdk.internal.reflect.NativeMethodAccessorImpl.invoke(NativeMethodAccessorImpl.java:64)
17:51:37 [2021-06-05T21:51:37.258Z] 	at java.base/jdk.internal.reflect.DelegatingMethodAccessorImpl.invoke(DelegatingMethodAccessorImpl.java:43)
17:51:37 [2021-06-05T21:51:37.258Z] 	at java.base/java.lang.reflect.Method.invoke(Method.java:564)
17:51:37 [2021-06-05T21:51:37.258Z] 	at org.eclipse.equinox.launcher.Main.invokeFramework(Main.java:661)
17:51:37 [2021-06-05T21:51:37.258Z] 	at org.eclipse.equinox.launcher.Main.basicRun(Main.java:597)
17:51:37 [2021-06-05T21:51:37.258Z] 	at org.eclipse.equinox.launcher.Main.run(Main.java:1476)
17:51:37 [2021-06-05T21:51:37.258Z] 	at org.eclipse.equinox.launcher.Main.main(Main.java:1449)
17:51:37 [2021-06-05T21:51:37.258Z] Caused by: java.lang.ClassNotFoundException: org.junit.runners.model.RunnerBuilder cannot be found by org.eclipse.tycho.surefire.osgibooter_2.2.0
17:51:37 [2021-06-05T21:51:37.258Z] 	at org.eclipse.osgi.internal.loader.BundleLoader.findClassInternal(BundleLoader.java:511)
17:51:37 [2021-06-05T21:51:37.258Z] 	at org.eclipse.osgi.internal.loader.BundleLoader.findClass(BundleLoader.java:422)
17:51:37 [2021-06-05T21:51:37.258Z] 	at org.eclipse.osgi.internal.loader.BundleLoader.findClass(BundleLoader.java:414)
17:51:37 [2021-06-05T21:51:37.258Z] 	at org.eclipse.osgi.internal.loader.ModuleClassLoader.loadClass(ModuleClassLoader.java:153)
17:51:37 [2021-06-05T21:51:37.258Z] 	at java.base/java.lang.ClassLoader.loadClass(ClassLoader.java:522)
17:51:37 [2021-06-05T21:51:37.258Z] 	... 31 more
17:51:37 [2021-06-05T21:51:37.258Z] 
17:51:37 [2021-06-05T21:51:37.258Z] Jun 05, 2021 9:51:36 PM org.junit.platform.launcher.core.DefaultLauncher handleThrowable
17:51:37 [2021-06-05T21:51:37.258Z] WARNING: TestEngine with ID 'junit-vintage' failed to discover tests
17:51:37 [2021-06-05T21:51:37.258Z] java.lang.NoClassDefFoundError: org/junit/runners/model/RunnerBuilder
17:51:37 [2021-06-05T21:51:37.258Z] 	at org.junit.vintage.engine.discovery.VintageDiscoverer.<init>(VintageDiscoverer.java:48)
17:51:37 [2021-06-05T21:51:37.258Z] 	at org.junit.vintage.engine.VintageTestEngine.discover(VintageTestEngine.java:65)
17:51:37 [2021-06-05T21:51:37.258Z] 	at org.junit.platform.launcher.core.DefaultLauncher.discoverEngineRoot(DefaultLauncher.java:130)
17:51:37 [2021-06-05T21:51:37.258Z] 	at org.junit.platform.launcher.core.DefaultLauncher.discoverRoot(DefaultLauncher.java:117)
17:51:37 [2021-06-05T21:51:37.258Z] 	at org.junit.platform.launcher.core.DefaultLauncher.discover(DefaultLauncher.java:82)
17:51:37 [2021-06-05T21:51:37.258Z] 	at org.apache.maven.surefire.junitplatform.TestPlanScannerFilter.accept(TestPlanScannerFilter.java:56)
17:51:37 [2021-06-05T21:51:37.258Z] 	at org.apache.maven.surefire.util.DefaultScanResult.applyFilter(DefaultScanResult.java:102)
17:51:37 [2021-06-05T21:51:37.258Z] 	at org.apache.maven.surefire.junitplatform.JUnitPlatformProvider.scanClasspath(JUnitPlatformProvider.java:143)
17:51:37 [2021-06-05T21:51:37.258Z] 	at org.apache.maven.surefire.junitplatform.JUnitPlatformProvider.invoke(JUnitPlatformProvider.java:124)
17:51:37 [2021-06-05T21:51:37.258Z] 	at java.base/jdk.internal.reflect.NativeMethodAccessorImpl.invoke0(Native Method)
17:51:37 [2021-06-05T21:51:37.258Z] 	at java.base/jdk.internal.reflect.NativeMethodAccessorImpl.invoke(NativeMethodAccessorImpl.java:64)
17:51:37 [2021-06-05T21:51:37.258Z] 	at java.base/jdk.internal.reflect.DelegatingMethodAccessorImpl.invoke(DelegatingMethodAccessorImpl.java:43)
17:51:37 [2021-06-05T21:51:37.258Z] 	at java.base/java.lang.reflect.Method.invoke(Method.java:564)
17:51:37 [2021-06-05T21:51:37.258Z] 	at org.apache.maven.surefire.util.ReflectionUtils.invokeMethodWithArray2(ReflectionUtils.java:206)
17:51:37 [2021-06-05T21:51:37.258Z] 	at org.apache.maven.surefire.booter.ProviderFactory$ProviderProxy.invoke(ProviderFactory.java:161)
17:51:37 [2021-06-05T21:51:37.258Z] 	at org.apache.maven.surefire.booter.ProviderFactory.invokeProvider(ProviderFactory.java:84)
17:51:37 [2021-06-05T21:51:37.258Z] 	at org.eclipse.tycho.surefire.osgibooter.OsgiSurefireBooter.run(OsgiSurefireBooter.java:116)
17:51:37 [2021-06-05T21:51:37.258Z] 	at org.eclipse.tycho.surefire.osgibooter.HeadlessTestApplication.start(HeadlessTestApplication.java:23)
17:51:37 [2021-06-05T21:51:37.258Z] 	at org.eclipse.equinox.internal.app.EclipseAppHandle.run(EclipseAppHandle.java:203)
17:51:37 [2021-06-05T21:51:37.258Z] 	at org.eclipse.core.runtime.internal.adaptor.EclipseAppLauncher.runApplication(EclipseAppLauncher.java:137)
17:51:37 [2021-06-05T21:51:37.258Z] 	at org.eclipse.core.runtime.internal.adaptor.EclipseAppLauncher.start(EclipseAppLauncher.java:107)
17:51:37 [2021-06-05T21:51:37.258Z] 	at org.eclipse.core.runtime.adaptor.EclipseStarter.run(EclipseStarter.java:400)
17:51:37 [2021-06-05T21:51:37.258Z] 	at org.eclipse.core.runtime.adaptor.EclipseStarter.run(EclipseStarter.java:255)
17:51:37 [2021-06-05T21:51:37.258Z] 	at java.base/jdk.internal.reflect.NativeMethodAccessorImpl.invoke0(Native Method)
17:51:37 [2021-06-05T21:51:37.258Z] 	at java.base/jdk.internal.reflect.NativeMethodAccessorImpl.invoke(NativeMethodAccessorImpl.java:64)
17:51:37 [2021-06-05T21:51:37.258Z] 	at java.base/jdk.internal.reflect.DelegatingMethodAccessorImpl.invoke(DelegatingMethodAccessorImpl.java:43)
17:51:37 [2021-06-05T21:51:37.258Z] 	at java.base/java.lang.reflect.Method.invoke(Method.java:564)
17:51:37 [2021-06-05T21:51:37.258Z] 	at org.eclipse.equinox.launcher.Main.invokeFramework(Main.java:661)
17:51:37 [2021-06-05T21:51:37.258Z] 	at org.eclipse.equinox.launcher.Main.basicRun(Main.java:597)
17:51:37 [2021-06-05T21:51:37.258Z] 	at org.eclipse.equinox.launcher.Main.run(Main.java:1476)
17:51:37 [2021-06-05T21:51:37.258Z] 	at org.eclipse.equinox.launcher.Main.main(Main.java:1449)
17:51:37 [2021-06-05T21:51:37.258Z] Caused by: java.lang.ClassNotFoundException: org.junit.runners.model.RunnerBuilder cannot be found by org.eclipse.tycho.surefire.osgibooter_2.2.0
17:51:37 [2021-06-05T21:51:37.258Z] 	at org.eclipse.osgi.internal.loader.BundleLoader.findClassInternal(BundleLoader.java:511)
17:51:37 [2021-06-05T21:51:37.258Z] 	at org.eclipse.osgi.internal.loader.BundleLoader.findClass(BundleLoader.java:422)
17:51:37 [2021-06-05T21:51:37.258Z] 	at org.eclipse.osgi.internal.loader.BundleLoader.findClass(BundleLoader.java:414)
17:51:37 [2021-06-05T21:51:37.258Z] 	at org.eclipse.osgi.internal.loader.ModuleClassLoader.loadClass(ModuleClassLoader.java:153)
17:51:37 [2021-06-05T21:51:37.259Z] 	at java.base/java.lang.ClassLoader.loadClass(ClassLoader.java:522)
17:51:37 [2021-06-05T21:51:37.259Z] 	... 31 more
17:51:37 [2021-06-05T21:51:37.259Z] 
17:51:37 [2021-06-05T21:51:37.259Z] Jun 05, 2021 9:51:36 PM org.junit.platform.launcher.core.DefaultLauncher handleThrowable
17:51:37 [2021-06-05T21:51:37.259Z] WARNING: TestEngine with ID 'junit-vintage' failed to discover tests
17:51:37 [2021-06-05T21:51:37.259Z] java.lang.NoClassDefFoundError: org/junit/runners/model/RunnerBuilder
17:51:37 [2021-06-05T21:51:37.259Z] 	at org.junit.vintage.engine.discovery.VintageDiscoverer.<init>(VintageDiscoverer.java:48)
17:51:37 [2021-06-05T21:51:37.259Z] 	at org.junit.vintage.engine.VintageTestEngine.discover(VintageTestEngine.java:65)
17:51:37 [2021-06-05T21:51:37.259Z] 	at org.junit.platform.launcher.core.DefaultLauncher.discoverEngineRoot(DefaultLauncher.java:130)
17:51:37 [2021-06-05T21:51:37.259Z] 	at org.junit.platform.launcher.core.DefaultLauncher.discoverRoot(DefaultLauncher.java:117)
17:51:37 [2021-06-05T21:51:37.259Z] 	at org.junit.platform.launcher.core.DefaultLauncher.discover(DefaultLauncher.java:82)
17:51:37 [2021-06-05T21:51:37.259Z] 	at org.apache.maven.surefire.junitplatform.TestPlanScannerFilter.accept(TestPlanScannerFilter.java:56)
17:51:37 [2021-06-05T21:51:37.259Z] 	at org.apache.maven.surefire.util.DefaultScanResult.applyFilter(DefaultScanResult.java:102)
17:51:37 [2021-06-05T21:51:37.259Z] 	at org.apache.maven.surefire.junitplatform.JUnitPlatformProvider.scanClasspath(JUnitPlatformProvider.java:143)
17:51:37 [2021-06-05T21:51:37.259Z] 	at org.apache.maven.surefire.junitplatform.JUnitPlatformProvider.invoke(JUnitPlatformProvider.java:124)
17:51:37 [2021-06-05T21:51:37.259Z] 	at java.base/jdk.internal.reflect.NativeMethodAccessorImpl.invoke0(Native Method)
17:51:37 [2021-06-05T21:51:37.259Z] 	at java.base/jdk.internal.reflect.NativeMethodAccessorImpl.invoke(NativeMethodAccessorImpl.java:64)
17:51:37 [2021-06-05T21:51:37.259Z] 	at java.base/jdk.internal.reflect.DelegatingMethodAccessorImpl.invoke(DelegatingMethodAccessorImpl.java:43)
17:51:37 [2021-06-05T21:51:37.259Z] 	at java.base/java.lang.reflect.Method.invoke(Method.java:564)
17:51:37 [2021-06-05T21:51:37.259Z] 	at org.apache.maven.surefire.util.ReflectionUtils.invokeMethodWithArray2(ReflectionUtils.java:206)
17:51:37 [2021-06-05T21:51:37.259Z] 	at org.apache.maven.surefire.booter.ProviderFactory$ProviderProxy.invoke(ProviderFactory.java:161)
17:51:37 [2021-06-05T21:51:37.259Z] 	at org.apache.maven.surefire.booter.ProviderFactory.invokeProvider(ProviderFactory.java:84)
17:51:37 [2021-06-05T21:51:37.259Z] 	at org.eclipse.tycho.surefire.osgibooter.OsgiSurefireBooter.run(OsgiSurefireBooter.java:116)
17:51:37 [2021-06-05T21:51:37.259Z] 	at org.eclipse.tycho.surefire.osgibooter.HeadlessTestApplication.start(HeadlessTestApplication.java:23)
17:51:37 [2021-06-05T21:51:37.259Z] 	at org.eclipse.equinox.internal.app.EclipseAppHandle.run(EclipseAppHandle.java:203)
17:51:37 [2021-06-05T21:51:37.259Z] 	at org.eclipse.core.runtime.internal.adaptor.EclipseAppLauncher.runApplication(EclipseAppLauncher.java:137)
17:51:37 [2021-06-05T21:51:37.259Z] 	at org.eclipse.core.runtime.internal.adaptor.EclipseAppLauncher.start(EclipseAppLauncher.java:107)
17:51:37 [2021-06-05T21:51:37.259Z] 	at org.eclipse.core.runtime.adaptor.EclipseStarter.run(EclipseStarter.java:400)
17:51:37 [2021-06-05T21:51:37.259Z] 	at org.eclipse.core.runtime.adaptor.EclipseStarter.run(EclipseStarter.java:255)
17:51:37 [2021-06-05T21:51:37.259Z] 	at java.base/jdk.internal.reflect.NativeMethodAccessorImpl.invoke0(Native Method)
17:51:37 [2021-06-05T21:51:37.259Z] 	at java.base/jdk.internal.reflect.NativeMethodAccessorImpl.invoke(NativeMethodAccessorImpl.java:64)
17:51:37 [2021-06-05T21:51:37.259Z] 	at java.base/jdk.internal.reflect.DelegatingMethodAccessorImpl.invoke(DelegatingMethodAccessorImpl.java:43)
17:51:37 [2021-06-05T21:51:37.259Z] 	at java.base/java.lang.reflect.Method.invoke(Method.java:564)
17:51:37 [2021-06-05T21:51:37.259Z] 	at org.eclipse.equinox.launcher.Main.invokeFramework(Main.java:661)
17:51:37 [2021-06-05T21:51:37.259Z] 	at org.eclipse.equinox.launcher.Main.basicRun(Main.java:597)
17:51:37 [2021-06-05T21:51:37.259Z] 	at org.eclipse.equinox.launcher.Main.run(Main.java:1476)
17:51:37 [2021-06-05T21:51:37.259Z] 	at org.eclipse.equinox.launcher.Main.main(Main.java:1449)
17:51:37 [2021-06-05T21:51:37.259Z] Caused by: java.lang.ClassNotFoundException: org.junit.runners.model.RunnerBuilder cannot be found by org.eclipse.tycho.surefire.osgibooter_2.2.0
17:51:37 [2021-06-05T21:51:37.259Z] 	at org.eclipse.osgi.internal.loader.BundleLoader.findClassInternal(BundleLoader.java:511)
17:51:37 [2021-06-05T21:51:37.259Z] 	at org.eclipse.osgi.internal.loader.BundleLoader.findClass(BundleLoader.java:422)
17:51:37 [2021-06-05T21:51:37.259Z] 	at org.eclipse.osgi.internal.loader.BundleLoader.findClass(BundleLoader.java:414)
17:51:37 [2021-06-05T21:51:37.259Z] 	at org.eclipse.osgi.internal.loader.ModuleClassLoader.loadClass(ModuleClassLoader.java:153)
17:51:37 [2021-06-05T21:51:37.259Z] 	at java.base/java.lang.ClassLoader.loadClass(ClassLoader.java:522)
17:51:37 [2021-06-05T21:51:37.259Z] 	... 31 more
17:51:37 [2021-06-05T21:51:37.259Z] 
17:51:37 [2021-06-05T21:51:37.259Z] Jun 05, 2021 9:51:36 PM org.junit.platform.launcher.core.DefaultLauncher handleThrowable
17:51:37 [2021-06-05T21:51:37.259Z] WARNING: TestEngine with ID 'junit-vintage' failed to discover tests
17:51:37 [2021-06-05T21:51:37.259Z] java.lang.NoClassDefFoundError: org/junit/runners/model/RunnerBuilder
17:51:37 [2021-06-05T21:51:37.259Z] 	at org.junit.vintage.engine.discovery.VintageDiscoverer.<init>(VintageDiscoverer.java:48)
17:51:37 [2021-06-05T21:51:37.259Z] 	at org.junit.vintage.engine.VintageTestEngine.discover(VintageTestEngine.java:65)
17:51:37 [2021-06-05T21:51:37.259Z] 	at org.junit.platform.launcher.core.DefaultLauncher.discoverEngineRoot(DefaultLauncher.java:130)
17:51:37 [2021-06-05T21:51:37.259Z] 	at org.junit.platform.launcher.core.DefaultLauncher.discoverRoot(DefaultLauncher.java:117)
17:51:37 [2021-06-05T21:51:37.259Z] 	at org.junit.platform.launcher.core.DefaultLauncher.discover(DefaultLauncher.java:82)
17:51:37 [2021-06-05T21:51:37.259Z] 	at org.apache.maven.surefire.junitplatform.TestPlanScannerFilter.accept(TestPlanScannerFilter.java:56)
17:51:37 [2021-06-05T21:51:37.259Z] 	at org.apache.maven.surefire.util.DefaultScanResult.applyFilter(DefaultScanResult.java:102)
17:51:37 [2021-06-05T21:51:37.259Z] 	at org.apache.maven.surefire.junitplatform.JUnitPlatformProvider.scanClasspath(JUnitPlatformProvider.java:143)
17:51:37 [2021-06-05T21:51:37.259Z] 	at org.apache.maven.surefire.junitplatform.JUnitPlatformProvider.invoke(JUnitPlatformProvider.java:124)
17:51:37 [2021-06-05T21:51:37.259Z] 	at java.base/jdk.internal.reflect.NativeMethodAccessorImpl.invoke0(Native Method)
17:51:37 [2021-06-05T21:51:37.259Z] 	at java.base/jdk.internal.reflect.NativeMethodAccessorImpl.invoke(NativeMethodAccessorImpl.java:64)
17:51:37 [2021-06-05T21:51:37.259Z] 	at java.base/jdk.internal.reflect.DelegatingMethodAccessorImpl.invoke(DelegatingMethodAccessorImpl.java:43)
17:51:37 [2021-06-05T21:51:37.260Z] 	at java.base/java.lang.reflect.Method.invoke(Method.java:564)
17:51:37 [2021-06-05T21:51:37.260Z] 	at org.apache.maven.surefire.util.ReflectionUtils.invokeMethodWithArray2(ReflectionUtils.java:206)
17:51:37 [2021-06-05T21:51:37.260Z] 	at org.apache.maven.surefire.booter.ProviderFactory$ProviderProxy.invoke(ProviderFactory.java:161)
17:51:37 [2021-06-05T21:51:37.260Z] 	at org.apache.maven.surefire.booter.ProviderFactory.invokeProvider(ProviderFactory.java:84)
17:51:37 [2021-06-05T21:51:37.260Z] 	at org.eclipse.tycho.surefire.osgibooter.OsgiSurefireBooter.run(OsgiSurefireBooter.java:116)
17:51:37 [2021-06-05T21:51:37.260Z] 	at org.eclipse.tycho.surefire.osgibooter.HeadlessTestApplication.start(HeadlessTestApplication.java:23)
17:51:37 [2021-06-05T21:51:37.260Z] 	at org.eclipse.equinox.internal.app.EclipseAppHandle.run(EclipseAppHandle.java:203)
17:51:37 [2021-06-05T21:51:37.260Z] 	at org.eclipse.core.runtime.internal.adaptor.EclipseAppLauncher.runApplication(EclipseAppLauncher.java:137)
17:51:37 [2021-06-05T21:51:37.260Z] 	at org.eclipse.core.runtime.internal.adaptor.EclipseAppLauncher.start(EclipseAppLauncher.java:107)
17:51:37 [2021-06-05T21:51:37.260Z] 	at org.eclipse.core.runtime.adaptor.EclipseStarter.run(EclipseStarter.java:400)
17:51:37 [2021-06-05T21:51:37.260Z] 	at org.eclipse.core.runtime.adaptor.EclipseStarter.run(EclipseStarter.java:255)
17:51:37 [2021-06-05T21:51:37.260Z] 	at java.base/jdk.internal.reflect.NativeMethodAccessorImpl.invoke0(Native Method)
17:51:37 [2021-06-05T21:51:37.260Z] 	at java.base/jdk.internal.reflect.NativeMethodAccessorImpl.invoke(NativeMethodAccessorImpl.java:64)
17:51:37 [2021-06-05T21:51:37.260Z] 	at java.base/jdk.internal.reflect.DelegatingMethodAccessorImpl.invoke(DelegatingMethodAccessorImpl.java:43)
17:51:37 [2021-06-05T21:51:37.260Z] 	at java.base/java.lang.reflect.Method.invoke(Method.java:564)
17:51:37 [2021-06-05T21:51:37.260Z] 	at org.eclipse.equinox.launcher.Main.invokeFramework(Main.java:661)
17:51:37 [2021-06-05T21:51:37.260Z] 	at org.eclipse.equinox.launcher.Main.basicRun(Main.java:597)
17:51:37 [2021-06-05T21:51:37.260Z] 	at org.eclipse.equinox.launcher.Main.run(Main.java:1476)
17:51:37 [2021-06-05T21:51:37.260Z] 	at org.eclipse.equinox.launcher.Main.main(Main.java:1449)
17:51:37 [2021-06-05T21:51:37.260Z] Caused by: java.lang.ClassNotFoundException: org.junit.runners.model.RunnerBuilder cannot be found by org.eclipse.tycho.surefire.osgibooter_2.2.0
17:51:37 [2021-06-05T21:51:37.260Z] 	at org.eclipse.osgi.internal.loader.BundleLoader.findClassInternal(BundleLoader.java:511)
17:51:37 [2021-06-05T21:51:37.260Z] 	at org.eclipse.osgi.internal.loader.BundleLoader.findClass(BundleLoader.java:422)
17:51:37 [2021-06-05T21:51:37.260Z] 	at org.eclipse.osgi.internal.loader.BundleLoader.findClass(BundleLoader.java:414)
17:51:37 [2021-06-05T21:51:37.260Z] 	at org.eclipse.osgi.internal.loader.ModuleClassLoader.loadClass(ModuleClassLoader.java:153)
17:51:37 [2021-06-05T21:51:37.260Z] 	at java.base/java.lang.ClassLoader.loadClass(ClassLoader.java:522)
17:51:37 [2021-06-05T21:51:37.260Z] 	... 31 more
17:51:37 [2021-06-05T21:51:37.260Z] 
17:51:37 [2021-06-05T21:51:37.260Z] Jun 05, 2021 9:51:36 PM org.junit.platform.launcher.core.DefaultLauncher handleThrowable
17:51:37 [2021-06-05T21:51:37.260Z] WARNING: TestEngine with ID 'junit-vintage' failed to discover tests
17:51:37 [2021-06-05T21:51:37.260Z] java.lang.NoClassDefFoundError: org/junit/runners/model/RunnerBuilder
17:51:37 [2021-06-05T21:51:37.260Z] 	at org.junit.vintage.engine.discovery.VintageDiscoverer.<init>(VintageDiscoverer.java:48)
17:51:37 [2021-06-05T21:51:37.260Z] 	at org.junit.vintage.engine.VintageTestEngine.discover(VintageTestEngine.java:65)
17:51:37 [2021-06-05T21:51:37.260Z] 	at org.junit.platform.launcher.core.DefaultLauncher.discoverEngineRoot(DefaultLauncher.java:130)
17:51:37 [2021-06-05T21:51:37.260Z] 	at org.junit.platform.launcher.core.DefaultLauncher.discoverRoot(DefaultLauncher.java:117)
17:51:37 [2021-06-05T21:51:37.260Z] 	at org.junit.platform.launcher.core.DefaultLauncher.discover(DefaultLauncher.java:82)
17:51:37 [2021-06-05T21:51:37.260Z] 	at org.apache.maven.surefire.junitplatform.TestPlanScannerFilter.accept(TestPlanScannerFilter.java:56)
17:51:37 [2021-06-05T21:51:37.260Z] 	at org.apache.maven.surefire.util.DefaultScanResult.applyFilter(DefaultScanResult.java:102)
17:51:37 [2021-06-05T21:51:37.260Z] 	at org.apache.maven.surefire.junitplatform.JUnitPlatformProvider.scanClasspath(JUnitPlatformProvider.java:143)
17:51:37 [2021-06-05T21:51:37.260Z] 	at org.apache.maven.surefire.junitplatform.JUnitPlatformProvider.invoke(JUnitPlatformProvider.java:124)
17:51:37 [2021-06-05T21:51:37.260Z] 	at java.base/jdk.internal.reflect.NativeMethodAccessorImpl.invoke0(Native Method)
17:51:37 [2021-06-05T21:51:37.260Z] 	at java.base/jdk.internal.reflect.NativeMethodAccessorImpl.invoke(NativeMethodAccessorImpl.java:64)
17:51:37 [2021-06-05T21:51:37.260Z] 	at java.base/jdk.internal.reflect.DelegatingMethodAccessorImpl.invoke(DelegatingMethodAccessorImpl.java:43)
17:51:37 [2021-06-05T21:51:37.260Z] 	at java.base/java.lang.reflect.Method.invoke(Method.java:564)
17:51:37 [2021-06-05T21:51:37.260Z] 	at org.apache.maven.surefire.util.ReflectionUtils.invokeMethodWithArray2(ReflectionUtils.java:206)
17:51:37 [2021-06-05T21:51:37.260Z] 	at org.apache.maven.surefire.booter.ProviderFactory$ProviderProxy.invoke(ProviderFactory.java:161)
17:51:37 [2021-06-05T21:51:37.260Z] 	at org.apache.maven.surefire.booter.ProviderFactory.invokeProvider(ProviderFactory.java:84)
17:51:37 [2021-06-05T21:51:37.260Z] 	at org.eclipse.tycho.surefire.osgibooter.OsgiSurefireBooter.run(OsgiSurefireBooter.java:116)
17:51:37 [2021-06-05T21:51:37.260Z] 	at org.eclipse.tycho.surefire.osgibooter.HeadlessTestApplication.start(HeadlessTestApplication.java:23)
17:51:37 [2021-06-05T21:51:37.260Z] 	at org.eclipse.equinox.internal.app.EclipseAppHandle.run(EclipseAppHandle.java:203)
17:51:37 [2021-06-05T21:51:37.260Z] 	at org.eclipse.core.runtime.internal.adaptor.EclipseAppLauncher.runApplication(EclipseAppLauncher.java:137)
17:51:37 [2021-06-05T21:51:37.260Z] 	at org.eclipse.core.runtime.internal.adaptor.EclipseAppLauncher.start(EclipseAppLauncher.java:107)
17:51:37 [2021-06-05T21:51:37.260Z] 	at org.eclipse.core.runtime.adaptor.EclipseStarter.run(EclipseStarter.java:400)
17:51:37 [2021-06-05T21:51:37.260Z] 	at org.eclipse.core.runtime.adaptor.EclipseStarter.run(EclipseStarter.java:255)
17:51:37 [2021-06-05T21:51:37.260Z] 	at java.base/jdk.internal.reflect.NativeMethodAccessorImpl.invoke0(Native Method)
17:51:37 [2021-06-05T21:51:37.260Z] 	at java.base/jdk.internal.reflect.NativeMethodAccessorImpl.invoke(NativeMethodAccessorImpl.java:64)
17:51:37 [2021-06-05T21:51:37.260Z] 	at java.base/jdk.internal.reflect.DelegatingMethodAccessorImpl.invoke(DelegatingMethodAccessorImpl.java:43)
17:51:37 [2021-06-05T21:51:37.260Z] 	at java.base/java.lang.reflect.Method.invoke(Method.java:564)
17:51:37 [2021-06-05T21:51:37.260Z] 	at org.eclipse.equinox.launcher.Main.invokeFramework(Main.java:661)
17:51:37 [2021-06-05T21:51:37.260Z] 	at org.eclipse.equinox.launcher.Main.basicRun(Main.java:597)
17:51:37 [2021-06-05T21:51:37.260Z] 	at org.eclipse.equinox.launcher.Main.run(Main.java:1476)
17:51:37 [2021-06-05T21:51:37.261Z] 	at org.eclipse.equinox.launcher.Main.main(Main.java:1449)
17:51:37 [2021-06-05T21:51:37.261Z] Caused by: java.lang.ClassNotFoundException: org.junit.runners.model.RunnerBuilder cannot be found by org.eclipse.tycho.surefire.osgibooter_2.2.0
17:51:37 [2021-06-05T21:51:37.261Z] 	at org.eclipse.osgi.internal.loader.BundleLoader.findClassInternal(BundleLoader.java:511)
17:51:37 [2021-06-05T21:51:37.261Z] 	at org.eclipse.osgi.internal.loader.BundleLoader.findClass(BundleLoader.java:422)
17:51:37 [2021-06-05T21:51:37.261Z] 	at org.eclipse.osgi.internal.loader.BundleLoader.findClass(BundleLoader.java:414)
17:51:37 [2021-06-05T21:51:37.261Z] 	at org.eclipse.osgi.internal.loader.ModuleClassLoader.loadClass(ModuleClassLoader.java:153)
17:51:37 [2021-06-05T21:51:37.261Z] 	at java.base/java.lang.ClassLoader.loadClass(ClassLoader.java:522)
17:51:37 [2021-06-05T21:51:37.261Z] 	... 31 more
17:51:37 [2021-06-05T21:51:37.261Z] 
17:51:37 [2021-06-05T21:51:37.261Z] Jun 05, 2021 9:51:36 PM org.junit.platform.launcher.core.DefaultLauncher handleThrowable
17:51:37 [2021-06-05T21:51:37.261Z] WARNING: TestEngine with ID 'junit-vintage' failed to discover tests
17:51:37 [2021-06-05T21:51:37.261Z] java.lang.NoClassDefFoundError: org/junit/runners/model/RunnerBuilder
17:51:37 [2021-06-05T21:51:37.261Z] 	at org.junit.vintage.engine.discovery.VintageDiscoverer.<init>(VintageDiscoverer.java:48)
17:51:37 [2021-06-05T21:51:37.261Z] 	at org.junit.vintage.engine.VintageTestEngine.discover(VintageTestEngine.java:65)
17:51:37 [2021-06-05T21:51:37.261Z] 	at org.junit.platform.launcher.core.DefaultLauncher.discoverEngineRoot(DefaultLauncher.java:130)
17:51:37 [2021-06-05T21:51:37.261Z] 	at org.junit.platform.launcher.core.DefaultLauncher.discoverRoot(DefaultLauncher.java:117)
17:51:37 [2021-06-05T21:51:37.261Z] 	at org.junit.platform.launcher.core.DefaultLauncher.execute(DefaultLauncher.java:90)
17:51:37 [2021-06-05T21:51:37.261Z] 	at org.apache.maven.surefire.junitplatform.JUnitPlatformProvider.invokeAllTests(JUnitPlatformProvider.java:150)
17:51:37 [2021-06-05T21:51:37.261Z] 	at org.apache.maven.surefire.junitplatform.JUnitPlatformProvider.invoke(JUnitPlatformProvider.java:124)
17:51:37 [2021-06-05T21:51:37.261Z] 	at java.base/jdk.internal.reflect.NativeMethodAccessorImpl.invoke0(Native Method)
17:51:37 [2021-06-05T21:51:37.261Z] 	at java.base/jdk.internal.reflect.NativeMethodAccessorImpl.invoke(NativeMethodAccessorImpl.java:64)
17:51:37 [2021-06-05T21:51:37.261Z] 	at java.base/jdk.internal.reflect.DelegatingMethodAccessorImpl.invoke(DelegatingMethodAccessorImpl.java:43)
17:51:37 [2021-06-05T21:51:37.261Z] 	at java.base/java.lang.reflect.Method.invoke(Method.java:564)
17:51:37 [2021-06-05T21:51:37.261Z] 	at org.apache.maven.surefire.util.ReflectionUtils.invokeMethodWithArray2(ReflectionUtils.java:206)
17:51:37 [2021-06-05T21:51:37.261Z] 	at org.apache.maven.surefire.booter.ProviderFactory$ProviderProxy.invoke(ProviderFactory.java:161)
17:51:37 [2021-06-05T21:51:37.261Z] 	at org.apache.maven.surefire.booter.ProviderFactory.invokeProvider(ProviderFactory.java:84)
17:51:37 [2021-06-05T21:51:37.261Z] 	at org.eclipse.tycho.surefire.osgibooter.OsgiSurefireBooter.run(OsgiSurefireBooter.java:116)
17:51:37 [2021-06-05T21:51:37.261Z] 	at org.eclipse.tycho.surefire.osgibooter.HeadlessTestApplication.start(HeadlessTestApplication.java:23)
17:51:37 [2021-06-05T21:51:37.261Z] 	at org.eclipse.equinox.internal.app.EclipseAppHandle.run(EclipseAppHandle.java:203)
17:51:37 [2021-06-05T21:51:37.261Z] 	at org.eclipse.core.runtime.internal.adaptor.EclipseAppLauncher.runApplication(EclipseAppLauncher.java:137)
17:51:37 [2021-06-05T21:51:37.261Z] 	at org.eclipse.core.runtime.internal.adaptor.EclipseAppLauncher.start(EclipseAppLauncher.java:107)
17:51:37 [2021-06-05T21:51:37.261Z] 	at org.eclipse.core.runtime.adaptor.EclipseStarter.run(EclipseStarter.java:400)
17:51:37 [2021-06-05T21:51:37.261Z] 	at org.eclipse.core.runtime.adaptor.EclipseStarter.run(EclipseStarter.java:255)
17:51:37 [2021-06-05T21:51:37.261Z] 	at java.base/jdk.internal.reflect.NativeMethodAccessorImpl.invoke0(Native Method)
17:51:37 [2021-06-05T21:51:37.261Z] 	at java.base/jdk.internal.reflect.NativeMethodAccessorImpl.invoke(NativeMethodAccessorImpl.java:64)
17:51:37 [2021-06-05T21:51:37.261Z] 	at java.base/jdk.internal.reflect.DelegatingMethodAccessorImpl.invoke(DelegatingMethodAccessorImpl.java:43)
17:51:37 [2021-06-05T21:51:37.261Z] 	at java.base/java.lang.reflect.Method.invoke(Method.java:564)
17:51:37 [2021-06-05T21:51:37.261Z] 	at org.eclipse.equinox.launcher.Main.invokeFramework(Main.java:661)
17:51:37 [2021-06-05T21:51:37.261Z] 	at org.eclipse.equinox.launcher.Main.basicRun(Main.java:597)
17:51:37 [2021-06-05T21:51:37.261Z] 	at org.eclipse.equinox.launcher.Main.run(Main.java:1476)
17:51:37 [2021-06-05T21:51:37.261Z] 	at org.eclipse.equinox.launcher.Main.main(Main.java:1449)
17:51:37 [2021-06-05T21:51:37.261Z] Caused by: java.lang.ClassNotFoundException: org.junit.runners.model.RunnerBuilder cannot be found by org.eclipse.tycho.surefire.osgibooter_2.2.0
17:51:37 [2021-06-05T21:51:37.261Z] 	at org.eclipse.osgi.internal.loader.BundleLoader.findClassInternal(BundleLoader.java:511)
17:51:37 [2021-06-05T21:51:37.261Z] 	at org.eclipse.osgi.internal.loader.BundleLoader.findClass(BundleLoader.java:422)
17:51:37 [2021-06-05T21:51:37.261Z] 	at org.eclipse.osgi.internal.loader.BundleLoader.findClass(BundleLoader.java:414)
17:51:37 [2021-06-05T21:51:37.261Z] 	at org.eclipse.osgi.internal.loader.ModuleClassLoader.loadClass(ModuleClassLoader.java:153)
17:51:37 [2021-06-05T21:51:37.261Z] 	at java.base/java.lang.ClassLoader.loadClass(ClassLoader.java:522)
17:51:37 [2021-06-05T21:51:37.261Z] 	... 29 more
17:51:37 [2021-06-05T21:51:37.261Z] 
17:51:37 [2021-06-05T21:51:37.261Z] Running org.eclipse.ease.lang.javascript.rhino.RhinoDebuggerEngineTest
17:51:38 [2021-06-05T21:51:38.225Z] org.eclipse.ease.ScriptExecutionException: JavaError: java.lang.Exception
17:51:38 [2021-06-05T21:51:38.225Z] 
17:51:38 [2021-06-05T21:51:38.225Z] Java Stacktrace:
17:51:38 [2021-06-05T21:51:38.225Z] java.lang.Exception
17:51:38 [2021-06-05T21:51:38.225Z] 	at java.base/jdk.internal.reflect.NativeConstructorAccessorImpl.newInstance0(Native Method)
17:51:38 [2021-06-05T21:51:38.225Z] 	at java.base/jdk.internal.reflect.NativeConstructorAccessorImpl.newInstance(NativeConstructorAccessorImpl.java:64)
17:51:38 [2021-06-05T21:51:38.225Z] 	at java.base/jdk.internal.reflect.DelegatingConstructorAccessorImpl.newInstance(DelegatingConstructorAccessorImpl.java:45)
17:51:38 [2021-06-05T21:51:38.225Z] 	at java.base/java.lang.reflect.Constructor.newInstanceWithCaller(Constructor.java:500)
17:51:38 [2021-06-05T21:51:38.225Z] 	at java.base/java.lang.reflect.Constructor.newInstance(Constructor.java:481)
17:51:38 [2021-06-05T21:51:38.225Z] 	at org.mozilla.javascript.MemberBox.newInstance(MemberBox.java:159)
17:51:38 [2021-06-05T21:51:38.225Z] 	at org.mozilla.javascript.NativeJavaClass.constructInternal(NativeJavaClass.java:266)
17:51:38 [2021-06-05T21:51:38.225Z] 	at org.mozilla.javascript.NativeJavaClass.constructSpecific(NativeJavaClass.java:205)
17:51:38 [2021-06-05T21:51:38.225Z] 	at org.mozilla.javascript.NativeJavaClass.construct(NativeJavaClass.java:166)
17:51:38 [2021-06-05T21:51:38.225Z] 	at org.mozilla.javascript.Interpreter.interpretLoop(Interpreter.java:1519)
17:51:38 [2021-06-05T21:51:38.225Z] 	at org.mozilla.javascript.Interpreter.interpret(Interpreter.java:815)
17:51:38 [2021-06-05T21:51:38.225Z] 	at org.mozilla.javascript.InterpretedFunction.call(InterpretedFunction.java:109)
17:51:38 [2021-06-05T21:51:38.225Z] 	at org.mozilla.javascript.ContextFactory.doTopCall(ContextFactory.java:394)
17:51:38 [2021-06-05T21:51:38.225Z] 	at org.mozilla.javascript.ScriptRuntime.doTopCall(ScriptRuntime.java:3091)
17:51:38 [2021-06-05T21:51:38.225Z] 	at org.mozilla.javascript.InterpretedFunction.exec(InterpretedFunction.java:120)
17:51:38 [2021-06-05T21:51:38.225Z] 	at org.mozilla.javascript.Context.evaluateReader(Context.java:1110)
17:51:38 [2021-06-05T21:51:38.225Z] 	at org.eclipse.ease.lang.javascript.rhino.RhinoScriptEngine.internalExecute(RhinoScriptEngine.java:224)
17:51:38 [2021-06-05T21:51:38.225Z] 	at org.eclipse.ease.lang.javascript.rhino.RhinoScriptEngine.execute(RhinoScriptEngine.java:203)
17:51:38 [2021-06-05T21:51:38.225Z] 	at org.eclipse.ease.AbstractScriptEngine.inject(AbstractScriptEngine.java:189)
17:51:38 [2021-06-05T21:51:38.225Z] 	at org.eclipse.ease.AbstractScriptEngine.run(AbstractScriptEngine.java:242)
17:51:38 [2021-06-05T21:51:38.225Z] 	at org.eclipse.core.internal.jobs.Worker.run(Worker.java:63)
17:51:38 [2021-06-05T21:51:38.225Z] org.eclipse.ease.ScriptExecutionException: ScriptException: test
17:51:38 [2021-06-05T21:51:38.225Z] org.eclipse.ease.ScriptExecutionException: ScriptException: JavaScript
17:51:38 [2021-06-05T21:51:38.483Z] org.eclipse.ease.ScriptExecutionException: SyntaxError: unterminated string literal (#1)
17:51:38 [2021-06-05T21:51:38.483Z] 'asdf
17:51:38 [2021-06-05T21:51:38.483Z]     ^
17:51:38 [2021-06-05T21:51:38.483Z] 	at <unknown source>:1
17:51:38 [2021-06-05T21:51:38.483Z] org.eclipse.ease.ScriptExecutionException: TypeError: Cannot call method "foobar" of undefined
17:51:38 [2021-06-05T21:51:38.484Z] org.eclipse.ease.ScriptExecutionException: JavaError: NotThere cannot be found by org.mozilla.javascript_1.7.5.v201504281450
17:51:38 [2021-06-05T21:51:38.484Z] 
17:51:38 [2021-06-05T21:51:38.484Z] Java Stacktrace:
17:51:38 [2021-06-05T21:51:38.484Z] java.lang.ClassNotFoundException: NotThere cannot be found by org.mozilla.javascript_1.7.5.v201504281450
17:51:38 [2021-06-05T21:51:38.484Z] 	at org.eclipse.osgi.internal.loader.BundleLoader.findClassInternal(BundleLoader.java:511)
17:51:38 [2021-06-05T21:51:38.484Z] 	at org.eclipse.osgi.internal.loader.BundleLoader.findClass(BundleLoader.java:422)
17:51:38 [2021-06-05T21:51:38.484Z] 	at org.eclipse.osgi.internal.loader.BundleLoader.findClass(BundleLoader.java:414)
17:51:38 [2021-06-05T21:51:38.484Z] 	at org.eclipse.osgi.internal.loader.ModuleClassLoader.loadClass(ModuleClassLoader.java:153)
17:51:38 [2021-06-05T21:51:38.484Z] 	at java.base/java.lang.ClassLoader.loadClass(ClassLoader.java:522)
17:51:38 [2021-06-05T21:51:38.484Z] 	at java.base/java.lang.Class.forName0(Native Method)
17:51:38 [2021-06-05T21:51:38.484Z] 	at java.base/java.lang.Class.forName(Class.java:377)
17:51:38 [2021-06-05T21:51:38.484Z] 	at java.base/jdk.internal.reflect.NativeMethodAccessorImpl.invoke0(Native Method)
17:51:38 [2021-06-05T21:51:38.484Z] 	at java.base/jdk.internal.reflect.NativeMethodAccessorImpl.invoke(NativeMethodAccessorImpl.java:64)
17:51:38 [2021-06-05T21:51:38.484Z] 	at java.base/jdk.internal.reflect.DelegatingMethodAccessorImpl.invoke(DelegatingMethodAccessorImpl.java:43)
17:51:38 [2021-06-05T21:51:38.484Z] 	at java.base/java.lang.reflect.Method.invoke(Method.java:564)
17:51:38 [2021-06-05T21:51:38.484Z] 	at org.mozilla.javascript.MemberBox.invoke(MemberBox.java:126)
17:51:38 [2021-06-05T21:51:38.484Z] 	at org.mozilla.javascript.NativeJavaMethod.call(NativeJavaMethod.java:225)
17:51:38 [2021-06-05T21:51:38.484Z] 	at org.mozilla.javascript.Interpreter.interpretLoop(Interpreter.java:1473)
17:51:38 [2021-06-05T21:51:38.484Z] 	at org.mozilla.javascript.Interpreter.interpret(Interpreter.java:815)
17:51:38 [2021-06-05T21:51:38.484Z] 	at org.mozilla.javascript.InterpretedFunction.call(InterpretedFunction.java:109)
17:51:38 [2021-06-05T21:51:38.484Z] 	at org.mozilla.javascript.ContextFactory.doTopCall(ContextFactory.java:394)
17:51:38 [2021-06-05T21:51:38.484Z] 	at org.mozilla.javascript.ScriptRuntime.doTopCall(ScriptRuntime.java:3091)
17:51:38 [2021-06-05T21:51:38.484Z] 	at org.mozilla.javascript.InterpretedFunction.exec(InterpretedFunction.java:120)
17:51:38 [2021-06-05T21:51:38.484Z] 	at org.mozilla.javascript.Context.evaluateReader(Context.java:1110)
17:51:38 [2021-06-05T21:51:38.484Z] 	at org.eclipse.ease.lang.javascript.rhino.RhinoScriptEngine.internalExecute(RhinoScriptEngine.java:224)
17:51:38 [2021-06-05T21:51:38.484Z] 	at org.eclipse.ease.lang.javascript.rhino.RhinoScriptEngine.execute(RhinoScriptEngine.java:203)
17:51:38 [2021-06-05T21:51:38.484Z] 	at org.eclipse.ease.AbstractScriptEngine.inject(AbstractScriptEngine.java:189)
17:51:38 [2021-06-05T21:51:38.484Z] 	at org.eclipse.ease.AbstractScriptEngine.run(AbstractScriptEngine.java:242)
17:51:38 [2021-06-05T21:51:38.484Z] 	at org.eclipse.core.internal.jobs.Worker.run(Worker.java:63)
17:51:38 [2021-06-05T21:51:38.484Z] org.eclipse.ease.ScriptExecutionException: TypeError: Cannot call method "substr" of null
17:51:38 [2021-06-05T21:51:38.484Z] 	at mainFile.js,throwOnNull():4
17:51:38 [2021-06-05T21:51:38.484Z] 	at includeFile.js,subCall():2
17:51:38 [2021-06-05T21:51:38.484Z] 	at mainFile.js:7
17:51:38 [2021-06-05T21:51:38.742Z] Tests run: 12, Failures: 0, Errors: 0, Skipped: 0, Time elapsed: 1.538 s - in org.eclipse.ease.lang.javascript.rhino.RhinoDebuggerEngineTest
17:51:38 [2021-06-05T21:51:38.743Z] execute_java_class_instantiation  Time elapsed: 0.82 s
17:51:38 [2021-06-05T21:51:38.743Z] execute_environment_module_code_with_optional_parameters  Time elapsed: 0.086 s
17:51:38 [2021-06-05T21:51:38.743Z] execute_throws_java_exception  Time elapsed: 0.095 s
17:51:38 [2021-06-05T21:51:38.743Z] execute_throws_java_class  Time elapsed: 0.081 s
17:51:38 [2021-06-05T21:51:38.743Z] execute_javascript_assignment  Time elapsed: 0.048 s
17:51:38 [2021-06-05T21:51:38.743Z] execute_eclipse_class_instantiation  Time elapsed: 0.072 s
17:51:38 [2021-06-05T21:51:38.743Z] execute_throws_javascript_object  Time elapsed: 0.037 s
17:51:38 [2021-06-05T21:51:38.743Z] execute_throws_syntax_error  Time elapsed: 0.07 s
17:51:38 [2021-06-05T21:51:38.743Z] execute_throws_javascript_runtime_error  Time elapsed: 0.062 s
17:51:38 [2021-06-05T21:51:38.743Z] execute_environment_module_code  Time elapsed: 0.034 s
17:51:38 [2021-06-05T21:51:38.743Z] execute_throws_wrapped_java_exception  Time elapsed: 0.064 s
17:51:38 [2021-06-05T21:51:38.743Z] getExceptionStackTrace_returns_script_trace_over_multiple_files  Time elapsed: 0.047 s
17:51:38 [2021-06-05T21:51:38.743Z] Running org.eclipse.ease.lang.javascript.rhino.RhinoDebugTest
17:51:39 [2021-06-05T21:51:39.708Z] Start of script
17:51:39 [2021-06-05T21:51:39.708Z] include file start
17:51:39 [2021-06-05T21:51:39.708Z] Include file processed
17:51:39 [2021-06-05T21:51:39.708Z] line after include file
17:51:39 [2021-06-05T21:51:39.708Z] Result of testMethod = 5
17:51:39 [2021-06-05T21:51:39.708Z] End of script
17:51:39 [2021-06-05T21:51:39.966Z] Start of script
17:51:39 [2021-06-05T21:51:39.966Z] include file start
17:51:39 [2021-06-05T21:51:39.966Z] Include file processed
17:51:39 [2021-06-05T21:51:39.966Z] line after include file
17:51:39 [2021-06-05T21:51:39.966Z] Result of testMethod = 5
17:51:39 [2021-06-05T21:51:39.966Z] End of script
17:51:40 [2021-06-05T21:51:40.224Z] Start of script
17:51:40 [2021-06-05T21:51:40.224Z] include file start
17:51:40 [2021-06-05T21:51:40.224Z] Include file processed
17:51:40 [2021-06-05T21:51:40.224Z] line after include file
17:51:40 [2021-06-05T21:51:40.224Z] Result of testMethod = 5
17:51:40 [2021-06-05T21:51:40.224Z] org.eclipse.ease.ScriptEngineCancellationException: Terminated on user request
17:51:40 [2021-06-05T21:51:40.224Z] 	at org.eclipse.ease.debugging.AbstractEaseDebugger.handleEventsInSuspendedState(AbstractEaseDebugger.java:329)
17:51:40 [2021-06-05T21:51:40.224Z] 	at org.eclipse.ease.debugging.AbstractEaseDebugger.suspend(AbstractEaseDebugger.java:255)
17:51:40 [2021-06-05T21:51:40.224Z] 	at org.eclipse.ease.debugging.AbstractEaseDebugger.processLine(AbstractEaseDebugger.java:490)
17:51:40 [2021-06-05T21:51:40.225Z] 	at org.eclipse.ease.lang.javascript.rhino.debugger.RhinoDebugger.access$4(RhinoDebugger.java:1)
17:51:40 [2021-06-05T21:51:40.225Z] 	at org.eclipse.ease.lang.javascript.rhino.debugger.RhinoDebugger$RhinoDebugFrame.onLineChange(RhinoDebugger.java:122)
17:51:40 [2021-06-05T21:51:40.225Z] 	at org.mozilla.javascript.Interpreter.interpretLoop(Interpreter.java:1824)
17:51:40 [2021-06-05T21:51:40.225Z] 	at org.mozilla.javascript.Interpreter.interpret(Interpreter.java:815)
17:51:40 [2021-06-05T21:51:40.225Z] 	at org.mozilla.javascript.InterpretedFunction.call(InterpretedFunction.java:109)
17:51:40 [2021-06-05T21:51:40.225Z] 	at org.mozilla.javascript.ContextFactory.doTopCall(ContextFactory.java:394)
17:51:40 [2021-06-05T21:51:40.225Z] 	at org.mozilla.javascript.ScriptRuntime.doTopCall(ScriptRuntime.java:3091)
17:51:40 [2021-06-05T21:51:40.225Z] 	at org.mozilla.javascript.InterpretedFunction.exec(InterpretedFunction.java:120)
17:51:40 [2021-06-05T21:51:40.225Z] 	at org.mozilla.javascript.Context.evaluateReader(Context.java:1110)
17:51:40 [2021-06-05T21:51:40.225Z] 	at org.eclipse.ease.lang.javascript.rhino.RhinoScriptEngine.internalExecute(RhinoScriptEngine.java:224)
17:51:40 [2021-06-05T21:51:40.225Z] 	at org.eclipse.ease.lang.javascript.rhino.RhinoScriptEngine.execute(RhinoScriptEngine.java:203)
17:51:40 [2021-06-05T21:51:40.225Z] 	at org.eclipse.ease.AbstractScriptEngine.inject(AbstractScriptEngine.java:189)
17:51:40 [2021-06-05T21:51:40.225Z] 	at org.eclipse.ease.AbstractScriptEngine.run(AbstractScriptEngine.java:242)
17:51:40 [2021-06-05T21:51:40.225Z] 	at org.eclipse.core.internal.jobs.Worker.run(Worker.java:63)
17:51:40 [2021-06-05T21:51:40.482Z] Start of script
17:51:40 [2021-06-05T21:51:40.482Z] include file start
17:51:40 [2021-06-05T21:51:40.482Z] Include file processed
17:51:40 [2021-06-05T21:51:40.482Z] line after include file
17:51:40 [2021-06-05T21:51:40.482Z] Result of testMethod = 5
17:51:40 [2021-06-05T21:51:40.482Z] End of script
17:51:41 [2021-06-05T21:51:41.048Z] Start of script
17:51:41 [2021-06-05T21:51:41.048Z] include file start
17:51:41 [2021-06-05T21:51:41.048Z] Include file processed
17:51:41 [2021-06-05T21:51:41.048Z] line after include file
17:51:41 [2021-06-05T21:51:41.048Z] Result of testMethod = 5
17:51:41 [2021-06-05T21:51:41.048Z] End of script
17:51:41 [2021-06-05T21:51:41.048Z] Start of script
17:51:41 [2021-06-05T21:51:41.048Z] include file start
17:51:41 [2021-06-05T21:51:41.049Z] Include file processed
17:51:41 [2021-06-05T21:51:41.049Z] line after include file
17:51:41 [2021-06-05T21:51:41.306Z] Result of testMethod = 5
17:51:41 [2021-06-05T21:51:41.306Z] End of script
17:51:41 [2021-06-05T21:51:41.306Z] Start of script
17:51:41 [2021-06-05T21:51:41.306Z] include file start
17:51:41 [2021-06-05T21:51:41.306Z] Include file processed
17:51:41 [2021-06-05T21:51:41.306Z] line after include file
17:51:41 [2021-06-05T21:51:41.306Z] Result of testMethod = 5
17:51:41 [2021-06-05T21:51:41.564Z] org.eclipse.ease.ScriptEngineCancellationException: Terminated on user request
17:51:41 [2021-06-05T21:51:41.564Z] 	at org.eclipse.ease.debugging.AbstractEaseDebugger.handleEventsInSuspendedState(AbstractEaseDebugger.java:329)
17:51:41 [2021-06-05T21:51:41.564Z] 	at org.eclipse.ease.debugging.AbstractEaseDebugger.suspend(AbstractEaseDebugger.java:255)
17:51:41 [2021-06-05T21:51:41.564Z] 	at org.eclipse.ease.debugging.AbstractEaseDebugger.processLine(AbstractEaseDebugger.java:490)
17:51:41 [2021-06-05T21:51:41.564Z] 	at org.eclipse.ease.lang.javascript.rhino.debugger.RhinoDebugger.access$4(RhinoDebugger.java:1)
17:51:41 [2021-06-05T21:51:41.564Z] 	at org.eclipse.ease.lang.javascript.rhino.debugger.RhinoDebugger$RhinoDebugFrame.onLineChange(RhinoDebugger.java:122)
17:51:41 [2021-06-05T21:51:41.564Z] 	at org.mozilla.javascript.Interpreter.interpretLoop(Interpreter.java:1824)
17:51:41 [2021-06-05T21:51:41.564Z] 	at org.mozilla.javascript.Interpreter.interpret(Interpreter.java:815)
17:51:41 [2021-06-05T21:51:41.564Z] 	at org.mozilla.javascript.InterpretedFunction.call(InterpretedFunction.java:109)
17:51:41 [2021-06-05T21:51:41.564Z] 	at org.mozilla.javascript.ContextFactory.doTopCall(ContextFactory.java:394)
17:51:41 [2021-06-05T21:51:41.564Z] 	at org.mozilla.javascript.ScriptRuntime.doTopCall(ScriptRuntime.java:3091)
17:51:41 [2021-06-05T21:51:41.564Z] 	at org.mozilla.javascript.InterpretedFunction.exec(InterpretedFunction.java:120)
17:51:41 [2021-06-05T21:51:41.564Z] 	at org.mozilla.javascript.Context.evaluateReader(Context.java:1110)
17:51:41 [2021-06-05T21:51:41.564Z] 	at org.eclipse.ease.lang.javascript.rhino.RhinoScriptEngine.internalExecute(RhinoScriptEngine.java:224)
17:51:41 [2021-06-05T21:51:41.564Z] 	at org.eclipse.ease.lang.javascript.rhino.RhinoScriptEngine.execute(RhinoScriptEngine.java:203)
17:51:41 [2021-06-05T21:51:41.564Z] 	at org.eclipse.ease.AbstractScriptEngine.inject(AbstractScriptEngine.java:189)
17:51:41 [2021-06-05T21:51:41.564Z] 	at org.eclipse.ease.AbstractScriptEngine.run(AbstractScriptEngine.java:242)
17:51:41 [2021-06-05T21:51:41.564Z] 	at org.eclipse.core.internal.jobs.Worker.run(Worker.java:63)
17:51:41 [2021-06-05T21:51:41.564Z] Start of script
17:51:41 [2021-06-05T21:51:41.564Z] include file start
17:51:41 [2021-06-05T21:51:41.564Z] Include file processed
17:51:41 [2021-06-05T21:51:41.564Z] line after include file
17:51:41 [2021-06-05T21:51:41.822Z] Result of testMethod = 5
17:51:41 [2021-06-05T21:51:41.822Z] End of script
17:51:42 [2021-06-05T21:51:42.079Z] Start of script
17:51:42 [2021-06-05T21:51:42.079Z] include file start
17:51:42 [2021-06-05T21:51:42.079Z] Include file processed
17:51:42 [2021-06-05T21:51:42.079Z] line after include file
17:51:42 [2021-06-05T21:51:42.079Z] Result of testMethod = 5
17:51:42 [2021-06-05T21:51:42.079Z] End of script
17:51:42 [2021-06-05T21:51:42.079Z] Start of script
17:51:42 [2021-06-05T21:51:42.336Z] include file start
17:51:42 [2021-06-05T21:51:42.336Z] Include file processed
17:51:42 [2021-06-05T21:51:42.336Z] line after include file
17:51:42 [2021-06-05T21:51:42.594Z] org.eclipse.ease.ScriptEngineCancellationException: Terminated on user request
17:51:42 [2021-06-05T21:51:42.594Z] 	at org.eclipse.ease.debugging.AbstractEaseDebugger.handleEventsInSuspendedState(AbstractEaseDebugger.java:329)
17:51:42 [2021-06-05T21:51:42.594Z] 	at org.eclipse.ease.debugging.AbstractEaseDebugger.suspend(AbstractEaseDebugger.java:255)
17:51:42 [2021-06-05T21:51:42.594Z] 	at org.eclipse.ease.debugging.AbstractEaseDebugger.processLine(AbstractEaseDebugger.java:510)
17:51:42 [2021-06-05T21:51:42.594Z] 	at org.eclipse.ease.lang.javascript.rhino.debugger.RhinoDebugger.access$4(RhinoDebugger.java:1)
17:51:42 [2021-06-05T21:51:42.594Z] 	at org.eclipse.ease.lang.javascript.rhino.debugger.RhinoDebugger$RhinoDebugFrame.onLineChange(RhinoDebugger.java:122)
17:51:42 [2021-06-05T21:51:42.594Z] 	at org.mozilla.javascript.Interpreter.interpretLoop(Interpreter.java:1824)
17:51:42 [2021-06-05T21:51:42.594Z] 	at org.mozilla.javascript.Interpreter.interpret(Interpreter.java:815)
17:51:42 [2021-06-05T21:51:42.594Z] 	at org.mozilla.javascript.InterpretedFunction.call(InterpretedFunction.java:109)
17:51:42 [2021-06-05T21:51:42.594Z] 	at org.mozilla.javascript.ContextFactory.doTopCall(ContextFactory.java:394)
17:51:42 [2021-06-05T21:51:42.594Z] 	at org.mozilla.javascript.ScriptRuntime.doTopCall(ScriptRuntime.java:3091)
17:51:42 [2021-06-05T21:51:42.594Z] 	at org.mozilla.javascript.InterpretedFunction.exec(InterpretedFunction.java:120)
17:51:42 [2021-06-05T21:51:42.594Z] 	at org.mozilla.javascript.Context.evaluateReader(Context.java:1110)
17:51:42 [2021-06-05T21:51:42.594Z] 	at org.eclipse.ease.lang.javascript.rhino.RhinoScriptEngine.internalExecute(RhinoScriptEngine.java:224)
17:51:42 [2021-06-05T21:51:42.594Z] 	at org.eclipse.ease.lang.javascript.rhino.RhinoScriptEngine.execute(RhinoScriptEngine.java:203)
17:51:42 [2021-06-05T21:51:42.594Z] 	at org.eclipse.ease.AbstractScriptEngine.inject(AbstractScriptEngine.java:189)
17:51:42 [2021-06-05T21:51:42.594Z] 	at org.eclipse.ease.AbstractScriptEngine.run(AbstractScriptEngine.java:242)
17:51:42 [2021-06-05T21:51:42.594Z] 	at org.eclipse.core.internal.jobs.Worker.run(Worker.java:63)
17:51:42 [2021-06-05T21:51:42.594Z] Start of script
17:51:42 [2021-06-05T21:51:42.594Z] include file start
17:51:42 [2021-06-05T21:51:42.594Z] Include file processed
17:51:42 [2021-06-05T21:51:42.594Z] line after include file
17:51:42 [2021-06-05T21:51:42.594Z] Result of testMethod = 5
17:51:42 [2021-06-05T21:51:42.594Z] End of script
17:51:42 [2021-06-05T21:51:42.852Z] Start of script
17:51:42 [2021-06-05T21:51:42.852Z] include file start
17:51:42 [2021-06-05T21:51:42.852Z] Include file processed
17:51:42 [2021-06-05T21:51:42.852Z] line after include file
17:51:43 [2021-06-05T21:51:43.110Z] Result of testMethod = 5
17:51:43 [2021-06-05T21:51:43.110Z] End of script
17:51:43 [2021-06-05T21:51:43.110Z] org.eclipse.ease.ScriptEngineCancellationException: Terminated on user request
17:51:43 [2021-06-05T21:51:43.110Z] 	at org.eclipse.ease.debugging.AbstractEaseDebugger.handleEventsInSuspendedState(AbstractEaseDebugger.java:329)
17:51:43 [2021-06-05T21:51:43.110Z] 	at org.eclipse.ease.debugging.AbstractEaseDebugger.suspend(AbstractEaseDebugger.java:255)
17:51:43 [2021-06-05T21:51:43.110Z] 	at org.eclipse.ease.debugging.AbstractEaseDebugger.processLine(AbstractEaseDebugger.java:490)
17:51:43 [2021-06-05T21:51:43.110Z] 	at org.eclipse.ease.lang.javascript.rhino.debugger.RhinoDebugger.access$4(RhinoDebugger.java:1)
17:51:43 [2021-06-05T21:51:43.110Z] 	at org.eclipse.ease.lang.javascript.rhino.debugger.RhinoDebugger$RhinoDebugFrame.onLineChange(RhinoDebugger.java:122)
17:51:43 [2021-06-05T21:51:43.110Z] 	at org.mozilla.javascript.Interpreter.interpretLoop(Interpreter.java:1824)
17:51:43 [2021-06-05T21:51:43.110Z] 	at org.mozilla.javascript.Interpreter.interpret(Interpreter.java:815)
17:51:43 [2021-06-05T21:51:43.110Z] 	at org.mozilla.javascript.InterpretedFunction.call(InterpretedFunction.java:109)
17:51:43 [2021-06-05T21:51:43.110Z] 	at org.mozilla.javascript.ContextFactory.doTopCall(ContextFactory.java:394)
17:51:43 [2021-06-05T21:51:43.110Z] 	at org.mozilla.javascript.ScriptRuntime.doTopCall(ScriptRuntime.java:3091)
17:51:43 [2021-06-05T21:51:43.110Z] 	at org.mozilla.javascript.InterpretedFunction.exec(InterpretedFunction.java:120)
17:51:43 [2021-06-05T21:51:43.110Z] 	at org.mozilla.javascript.Context.evaluateReader(Context.java:1110)
17:51:43 [2021-06-05T21:51:43.110Z] 	at org.eclipse.ease.lang.javascript.rhino.RhinoScriptEngine.internalExecute(RhinoScriptEngine.java:224)
17:51:43 [2021-06-05T21:51:43.110Z] 	at org.eclipse.ease.lang.javascript.rhino.RhinoScriptEngine.execute(RhinoScriptEngine.java:203)
17:51:43 [2021-06-05T21:51:43.110Z] 	at org.eclipse.ease.AbstractScriptEngine.inject(AbstractScriptEngine.java:189)
17:51:43 [2021-06-05T21:51:43.110Z] 	at org.eclipse.ease.AbstractScriptEngine.run(AbstractScriptEngine.java:242)
17:51:43 [2021-06-05T21:51:43.110Z] 	at org.eclipse.core.internal.jobs.Worker.run(Worker.java:63)
17:51:43 [2021-06-05T21:51:43.368Z] Start of script
17:51:43 [2021-06-05T21:51:43.368Z] include file start
17:51:43 [2021-06-05T21:51:43.368Z] Include file processed
17:51:43 [2021-06-05T21:51:43.368Z] line after include file
17:51:43 [2021-06-05T21:51:43.368Z] Result of testMethod = 5
17:51:43 [2021-06-05T21:51:43.368Z] End of script
17:51:43 [2021-06-05T21:51:43.626Z] Start of script
17:51:43 [2021-06-05T21:51:43.626Z] include file start
17:51:43 [2021-06-05T21:51:43.626Z] Include file processed
17:51:43 [2021-06-05T21:51:43.626Z] line after include file
17:51:43 [2021-06-05T21:51:43.626Z] Result of testMethod = 5
17:51:43 [2021-06-05T21:51:43.626Z] End of script
17:51:43 [2021-06-05T21:51:43.884Z] Start of script
17:51:43 [2021-06-05T21:51:43.884Z] include file start
17:51:43 [2021-06-05T21:51:43.884Z] Include file processed
17:51:43 [2021-06-05T21:51:43.884Z] line after include file
17:51:43 [2021-06-05T21:51:43.884Z] Result of testMethod = 5
17:51:44 [2021-06-05T21:51:44.142Z] org.eclipse.ease.ScriptEngineCancellationException: Terminated on user request
17:51:44 [2021-06-05T21:51:44.142Z] 	at org.eclipse.ease.debugging.AbstractEaseDebugger.handleEventsInSuspendedState(AbstractEaseDebugger.java:329)
17:51:44 [2021-06-05T21:51:44.142Z] 	at org.eclipse.ease.debugging.AbstractEaseDebugger.suspend(AbstractEaseDebugger.java:255)
17:51:44 [2021-06-05T21:51:44.142Z] 	at org.eclipse.ease.debugging.AbstractEaseDebugger.processLine(AbstractEaseDebugger.java:490)
17:51:44 [2021-06-05T21:51:44.142Z] 	at org.eclipse.ease.lang.javascript.rhino.debugger.RhinoDebugger.access$4(RhinoDebugger.java:1)
17:51:44 [2021-06-05T21:51:44.142Z] 	at org.eclipse.ease.lang.javascript.rhino.debugger.RhinoDebugger$RhinoDebugFrame.onLineChange(RhinoDebugger.java:122)
17:51:44 [2021-06-05T21:51:44.142Z] 	at org.mozilla.javascript.Interpreter.interpretLoop(Interpreter.java:1824)
17:51:44 [2021-06-05T21:51:44.142Z] 	at org.mozilla.javascript.Interpreter.interpret(Interpreter.java:815)
17:51:44 [2021-06-05T21:51:44.142Z] 	at org.mozilla.javascript.InterpretedFunction.call(InterpretedFunction.java:109)
17:51:44 [2021-06-05T21:51:44.142Z] 	at org.mozilla.javascript.ContextFactory.doTopCall(ContextFactory.java:394)
17:51:44 [2021-06-05T21:51:44.142Z] 	at org.mozilla.javascript.ScriptRuntime.doTopCall(ScriptRuntime.java:3091)
17:51:44 [2021-06-05T21:51:44.142Z] 	at org.mozilla.javascript.InterpretedFunction.exec(InterpretedFunction.java:120)
17:51:44 [2021-06-05T21:51:44.142Z] 	at org.mozilla.javascript.Context.evaluateReader(Context.java:1110)
17:51:44 [2021-06-05T21:51:44.142Z] 	at org.eclipse.ease.lang.javascript.rhino.RhinoScriptEngine.internalExecute(RhinoScriptEngine.java:224)
17:51:44 [2021-06-05T21:51:44.142Z] 	at org.eclipse.ease.lang.javascript.rhino.RhinoScriptEngine.execute(RhinoScriptEngine.java:203)
17:51:44 [2021-06-05T21:51:44.142Z] 	at org.eclipse.ease.AbstractScriptEngine.inject(AbstractScriptEngine.java:189)
17:51:44 [2021-06-05T21:51:44.142Z] 	at org.eclipse.ease.AbstractScriptEngine.run(AbstractScriptEngine.java:242)
17:51:44 [2021-06-05T21:51:44.142Z] 	at org.eclipse.core.internal.jobs.Worker.run(Worker.java:63)
17:51:44 [2021-06-05T21:51:44.142Z] Start of script
17:51:44 [2021-06-05T21:51:44.142Z] include file start
17:51:44 [2021-06-05T21:51:44.142Z] Include file processed
17:51:44 [2021-06-05T21:51:44.142Z] line after include file
17:51:44 [2021-06-05T21:51:44.400Z] Result of testMethod = 5
17:51:44 [2021-06-05T21:51:44.400Z] End of script
17:51:44 [2021-06-05T21:51:44.658Z] org.eclipse.ease.ScriptEngineCancellationException: Terminated on user request
17:51:44 [2021-06-05T21:51:44.658Z] 	at org.eclipse.ease.debugging.AbstractEaseDebugger.handleEventsInSuspendedState(AbstractEaseDebugger.java:329)
17:51:44 [2021-06-05T21:51:44.658Z] 	at org.eclipse.ease.debugging.AbstractEaseDebugger.suspend(AbstractEaseDebugger.java:255)
17:51:44 [2021-06-05T21:51:44.658Z] 	at org.eclipse.ease.debugging.AbstractEaseDebugger.processLine(AbstractEaseDebugger.java:490)
17:51:44 [2021-06-05T21:51:44.658Z] 	at org.eclipse.ease.lang.javascript.rhino.debugger.RhinoDebugger.access$4(RhinoDebugger.java:1)
17:51:44 [2021-06-05T21:51:44.658Z] 	at org.eclipse.ease.lang.javascript.rhino.debugger.RhinoDebugger$RhinoDebugFrame.onLineChange(RhinoDebugger.java:122)
17:51:44 [2021-06-05T21:51:44.658Z] 	at org.mozilla.javascript.Interpreter.interpretLoop(Interpreter.java:1824)
17:51:44 [2021-06-05T21:51:44.658Z] 	at org.mozilla.javascript.Interpreter.interpret(Interpreter.java:815)
17:51:44 [2021-06-05T21:51:44.658Z] 	at org.mozilla.javascript.InterpretedFunction.call(InterpretedFunction.java:109)
17:51:44 [2021-06-05T21:51:44.658Z] 	at org.mozilla.javascript.ContextFactory.doTopCall(ContextFactory.java:394)
17:51:44 [2021-06-05T21:51:44.658Z] 	at org.mozilla.javascript.ScriptRuntime.doTopCall(ScriptRuntime.java:3091)
17:51:44 [2021-06-05T21:51:44.658Z] 	at org.mozilla.javascript.InterpretedFunction.exec(InterpretedFunction.java:120)
17:51:44 [2021-06-05T21:51:44.658Z] 	at org.mozilla.javascript.Context.evaluateReader(Context.java:1110)
17:51:44 [2021-06-05T21:51:44.658Z] 	at org.eclipse.ease.lang.javascript.rhino.RhinoScriptEngine.internalExecute(RhinoScriptEngine.java:224)
17:51:44 [2021-06-05T21:51:44.658Z] 	at org.eclipse.ease.lang.javascript.rhino.RhinoScriptEngine.execute(RhinoScriptEngine.java:203)
17:51:44 [2021-06-05T21:51:44.658Z] 	at org.eclipse.ease.AbstractScriptEngine.inject(AbstractScriptEngine.java:189)
17:51:44 [2021-06-05T21:51:44.658Z] 	at org.eclipse.ease.AbstractScriptEngine.run(AbstractScriptEngine.java:242)
17:51:44 [2021-06-05T21:51:44.658Z] 	at org.eclipse.core.internal.jobs.Worker.run(Worker.java:63)
17:51:44 [2021-06-05T21:51:44.658Z] Start of script
17:51:44 [2021-06-05T21:51:44.658Z] include file start
17:51:44 [2021-06-05T21:51:44.658Z] Include file processed
17:51:44 [2021-06-05T21:51:44.658Z] line after include file
17:51:44 [2021-06-05T21:51:44.658Z] Result of testMethod = 5
17:51:44 [2021-06-05T21:51:44.916Z] End of script
17:51:44 [2021-06-05T21:51:44.916Z] Start of script
17:51:44 [2021-06-05T21:51:44.916Z] include file start
17:51:44 [2021-06-05T21:51:44.916Z] Include file processed
17:51:44 [2021-06-05T21:51:44.916Z] line after include file
17:51:45 [2021-06-05T21:51:45.174Z] Result of testMethod = 5
17:51:45 [2021-06-05T21:51:45.174Z] End of script
17:51:45 [2021-06-05T21:51:45.432Z] org.eclipse.ease.ScriptEngineCancellationException: Terminated on user request
17:51:45 [2021-06-05T21:51:45.432Z] 	at org.eclipse.ease.debugging.AbstractEaseDebugger.handleEventsInSuspendedState(AbstractEaseDebugger.java:329)
17:51:45 [2021-06-05T21:51:45.432Z] 	at org.eclipse.ease.debugging.AbstractEaseDebugger.suspend(AbstractEaseDebugger.java:255)
17:51:45 [2021-06-05T21:51:45.432Z] 	at org.eclipse.ease.debugging.AbstractEaseDebugger.processLine(AbstractEaseDebugger.java:490)
17:51:45 [2021-06-05T21:51:45.432Z] 	at org.eclipse.ease.lang.javascript.rhino.debugger.RhinoDebugger.access$4(RhinoDebugger.java:1)
17:51:45 [2021-06-05T21:51:45.432Z] 	at org.eclipse.ease.lang.javascript.rhino.debugger.RhinoDebugger$RhinoDebugFrame.onLineChange(RhinoDebugger.java:122)
17:51:45 [2021-06-05T21:51:45.432Z] 	at org.mozilla.javascript.Interpreter.interpretLoop(Interpreter.java:1824)
17:51:45 [2021-06-05T21:51:45.432Z] 	at org.mozilla.javascript.Interpreter.interpret(Interpreter.java:815)
17:51:45 [2021-06-05T21:51:45.432Z] 	at org.mozilla.javascript.InterpretedFunction.call(InterpretedFunction.java:109)
17:51:45 [2021-06-05T21:51:45.432Z] 	at org.mozilla.javascript.ContextFactory.doTopCall(ContextFactory.java:394)
17:51:45 [2021-06-05T21:51:45.432Z] 	at org.mozilla.javascript.ScriptRuntime.doTopCall(ScriptRuntime.java:3091)
17:51:45 [2021-06-05T21:51:45.432Z] 	at org.mozilla.javascript.InterpretedFunction.exec(InterpretedFunction.java:120)
17:51:45 [2021-06-05T21:51:45.432Z] 	at org.mozilla.javascript.Context.evaluateReader(Context.java:1110)
17:51:45 [2021-06-05T21:51:45.432Z] 	at org.eclipse.ease.lang.javascript.rhino.RhinoScriptEngine.internalExecute(RhinoScriptEngine.java:224)
17:51:45 [2021-06-05T21:51:45.432Z] 	at org.eclipse.ease.lang.javascript.rhino.RhinoScriptEngine.execute(RhinoScriptEngine.java:203)
17:51:45 [2021-06-05T21:51:45.432Z] 	at org.eclipse.ease.AbstractScriptEngine.inject(AbstractScriptEngine.java:189)
17:51:45 [2021-06-05T21:51:45.432Z] 	at org.eclipse.ease.AbstractScriptEngine.run(AbstractScriptEngine.java:242)
17:51:45 [2021-06-05T21:51:45.432Z] 	at org.eclipse.core.internal.jobs.Worker.run(Worker.java:63)
17:51:45 [2021-06-05T21:51:45.432Z] Start of script
17:51:45 [2021-06-05T21:51:45.432Z] include file start
17:51:45 [2021-06-05T21:51:45.432Z] Include file processed
17:51:45 [2021-06-05T21:51:45.432Z] line after include file
17:51:45 [2021-06-05T21:51:45.690Z] Result of testMethod = 5
17:51:45 [2021-06-05T21:51:45.690Z] End of script
17:51:45 [2021-06-05T21:51:45.690Z] Start of script
17:51:45 [2021-06-05T21:51:45.690Z] include file start
17:51:45 [2021-06-05T21:51:45.690Z] Include file processed
17:51:45 [2021-06-05T21:51:45.690Z] line after include file
17:51:45 [2021-06-05T21:51:45.690Z] Result of testMethod = 5
17:51:45 [2021-06-05T21:51:45.948Z] WARNING: An illegal reflective access operation has occurred
17:51:45 [2021-06-05T21:51:45.948Z] WARNING: Illegal reflective access by org.eclipse.ease.debugging.model.EaseDebugValue (file:/home/jenkins/.m2/repository/org/eclipse/ease/org.eclipse.ease/0.8.0-SNAPSHOT/org.eclipse.ease-0.8.0-SNAPSHOT.jar) to field java.lang.String.hash
17:51:45 [2021-06-05T21:51:45.948Z] WARNING: Please consider reporting this to the maintainers of org.eclipse.ease.debugging.model.EaseDebugValue
17:51:45 [2021-06-05T21:51:45.948Z] WARNING: Use --illegal-access=warn to enable warnings of further illegal reflective access operations
17:51:45 [2021-06-05T21:51:45.948Z] WARNING: All illegal access operations will be denied in a future release
17:51:45 [2021-06-05T21:51:45.948Z] org.eclipse.ease.ScriptEngineCancellationException: Terminated on user request
17:51:45 [2021-06-05T21:51:45.948Z] 	at org.eclipse.ease.debugging.AbstractEaseDebugger.handleEventsInSuspendedState(AbstractEaseDebugger.java:329)
17:51:45 [2021-06-05T21:51:45.948Z] 	at org.eclipse.ease.debugging.AbstractEaseDebugger.suspend(AbstractEaseDebugger.java:255)
17:51:45 [2021-06-05T21:51:45.948Z] 	at org.eclipse.ease.debugging.AbstractEaseDebugger.processLine(AbstractEaseDebugger.java:490)
17:51:45 [2021-06-05T21:51:45.948Z] 	at org.eclipse.ease.lang.javascript.rhino.debugger.RhinoDebugger.access$4(RhinoDebugger.java:1)
17:51:45 [2021-06-05T21:51:45.948Z] 	at org.eclipse.ease.lang.javascript.rhino.debugger.RhinoDebugger$RhinoDebugFrame.onLineChange(RhinoDebugger.java:122)
17:51:45 [2021-06-05T21:51:45.948Z] 	at org.mozilla.javascript.Interpreter.interpretLoop(Interpreter.java:1824)
17:51:45 [2021-06-05T21:51:45.948Z] 	at org.mozilla.javascript.Interpreter.interpret(Interpreter.java:815)
17:51:45 [2021-06-05T21:51:45.948Z] 	at org.mozilla.javascript.InterpretedFunction.call(InterpretedFunction.java:109)
17:51:45 [2021-06-05T21:51:45.948Z] 	at org.mozilla.javascript.ContextFactory.doTopCall(ContextFactory.java:394)
17:51:45 [2021-06-05T21:51:45.948Z] 	at org.mozilla.javascript.ScriptRuntime.doTopCall(ScriptRuntime.java:3091)
17:51:45 [2021-06-05T21:51:45.948Z] 	at org.mozilla.javascript.InterpretedFunction.exec(InterpretedFunction.java:120)
17:51:45 [2021-06-05T21:51:45.948Z] 	at org.mozilla.javascript.Context.evaluateReader(Context.java:1110)
17:51:45 [2021-06-05T21:51:45.948Z] 	at org.eclipse.ease.lang.javascript.rhino.RhinoScriptEngine.internalExecute(RhinoScriptEngine.java:224)
17:51:45 [2021-06-05T21:51:45.948Z] 	at org.eclipse.ease.lang.javascript.rhino.RhinoScriptEngine.execute(RhinoScriptEngine.java:203)
17:51:45 [2021-06-05T21:51:45.948Z] 	at org.eclipse.ease.AbstractScriptEngine.inject(AbstractScriptEngine.java:189)
17:51:45 [2021-06-05T21:51:45.948Z] 	at org.eclipse.ease.AbstractScriptEngine.run(AbstractScriptEngine.java:242)
17:51:45 [2021-06-05T21:51:45.948Z] 	at org.eclipse.core.internal.jobs.Worker.run(Worker.java:63)
17:51:46 [2021-06-05T21:51:46.208Z] Start of script
17:51:46 [2021-06-05T21:51:46.208Z] include file start
17:51:46 [2021-06-05T21:51:46.208Z] Include file processed
17:51:46 [2021-06-05T21:51:46.208Z] line after include file
17:51:46 [2021-06-05T21:51:46.208Z] Result of testMethod = 5
17:51:46 [2021-06-05T21:51:46.208Z] End of script
17:51:46 [2021-06-05T21:51:46.208Z] Start of script
17:51:46 [2021-06-05T21:51:46.208Z] include file start
17:51:46 [2021-06-05T21:51:46.208Z] Include file processed
17:51:46 [2021-06-05T21:51:46.208Z] line after include file
17:51:46 [2021-06-05T21:51:46.466Z] Result of testMethod = 5
17:51:46 [2021-06-05T21:51:46.466Z] End of script
17:51:46 [2021-06-05T21:51:46.724Z] Start of script
17:51:46 [2021-06-05T21:51:46.724Z] include file start
17:51:46 [2021-06-05T21:51:46.724Z] Include file processed
17:51:46 [2021-06-05T21:51:46.724Z] line after include file
17:51:46 [2021-06-05T21:51:46.724Z] Result of testMethod = 5
17:51:46 [2021-06-05T21:51:46.724Z] End of script
17:51:46 [2021-06-05T21:51:46.724Z] Start of script
17:51:46 [2021-06-05T21:51:46.724Z] include file start
17:51:46 [2021-06-05T21:51:46.724Z] Include file processed
17:51:46 [2021-06-05T21:51:46.982Z] line after include file
17:51:46 [2021-06-05T21:51:46.982Z] Result of testMethod = 5
17:51:46 [2021-06-05T21:51:46.982Z] End of script
17:51:46 [2021-06-05T21:51:46.982Z] Start of script
17:51:46 [2021-06-05T21:51:46.982Z] include file start
17:51:46 [2021-06-05T21:51:46.982Z] Include file processed
17:51:46 [2021-06-05T21:51:46.982Z] line after include file
17:51:47 [2021-06-05T21:51:47.240Z] org.eclipse.ease.ScriptEngineCancellationException: Terminated on user request
17:51:47 [2021-06-05T21:51:47.240Z] 	at org.eclipse.ease.debugging.AbstractEaseDebugger.handleEventsInSuspendedState(AbstractEaseDebugger.java:329)
17:51:47 [2021-06-05T21:51:47.240Z] 	at org.eclipse.ease.debugging.AbstractEaseDebugger.suspend(AbstractEaseDebugger.java:255)
17:51:47 [2021-06-05T21:51:47.240Z] 	at org.eclipse.ease.debugging.AbstractEaseDebugger.processLine(AbstractEaseDebugger.java:490)
17:51:47 [2021-06-05T21:51:47.240Z] 	at org.eclipse.ease.lang.javascript.rhino.debugger.RhinoDebugger.access$4(RhinoDebugger.java:1)
17:51:47 [2021-06-05T21:51:47.240Z] 	at org.eclipse.ease.lang.javascript.rhino.debugger.RhinoDebugger$RhinoDebugFrame.onLineChange(RhinoDebugger.java:122)
17:51:47 [2021-06-05T21:51:47.240Z] 	at org.mozilla.javascript.Interpreter.interpretLoop(Interpreter.java:1824)
17:51:47 [2021-06-05T21:51:47.240Z] 	at org.mozilla.javascript.Interpreter.interpret(Interpreter.java:815)
17:51:47 [2021-06-05T21:51:47.240Z] 	at org.mozilla.javascript.InterpretedFunction.call(InterpretedFunction.java:109)
17:51:47 [2021-06-05T21:51:47.240Z] 	at org.mozilla.javascript.ContextFactory.doTopCall(ContextFactory.java:394)
17:51:47 [2021-06-05T21:51:47.240Z] 	at org.mozilla.javascript.ScriptRuntime.doTopCall(ScriptRuntime.java:3091)
17:51:47 [2021-06-05T21:51:47.241Z] 	at org.mozilla.javascript.InterpretedFunction.exec(InterpretedFunction.java:120)
17:51:47 [2021-06-05T21:51:47.241Z] 	at org.mozilla.javascript.Context.evaluateReader(Context.java:1110)
17:51:47 [2021-06-05T21:51:47.241Z] 	at org.eclipse.ease.lang.javascript.rhino.RhinoScriptEngine.internalExecute(RhinoScriptEngine.java:224)
17:51:47 [2021-06-05T21:51:47.241Z] 	at org.eclipse.ease.lang.javascript.rhino.RhinoScriptEngine.execute(RhinoScriptEngine.java:203)
17:51:47 [2021-06-05T21:51:47.241Z] 	at org.eclipse.ease.AbstractScriptEngine.inject(AbstractScriptEngine.java:189)
17:51:47 [2021-06-05T21:51:47.241Z] 	at org.eclipse.ease.AbstractScriptEngine.run(AbstractScriptEngine.java:242)
17:51:47 [2021-06-05T21:51:47.241Z] 	at org.eclipse.core.internal.jobs.Worker.run(Worker.java:63)
17:51:47 [2021-06-05T21:51:47.241Z] Start of script
17:51:47 [2021-06-05T21:51:47.499Z] include file start
17:51:47 [2021-06-05T21:51:47.499Z] Include file processed
17:51:47 [2021-06-05T21:51:47.499Z] line after include file
17:51:47 [2021-06-05T21:51:47.499Z] Result of testMethod = 5
17:51:47 [2021-06-05T21:51:47.499Z] End of script
17:51:47 [2021-06-05T21:51:47.756Z] Start of script
17:51:47 [2021-06-05T21:51:47.757Z] include file start
17:51:47 [2021-06-05T21:51:47.757Z] Include file processed
17:51:47 [2021-06-05T21:51:47.757Z] line after include file
17:51:47 [2021-06-05T21:51:47.757Z] Result of testMethod = 5
17:51:47 [2021-06-05T21:51:47.757Z] org.eclipse.ease.ScriptEngineCancellationException: Terminated on user request
17:51:47 [2021-06-05T21:51:47.757Z] 	at org.eclipse.ease.debugging.AbstractEaseDebugger.handleEventsInSuspendedState(AbstractEaseDebugger.java:329)
17:51:47 [2021-06-05T21:51:47.757Z] 	at org.eclipse.ease.debugging.AbstractEaseDebugger.suspend(AbstractEaseDebugger.java:255)
17:51:47 [2021-06-05T21:51:47.757Z] 	at org.eclipse.ease.debugging.AbstractEaseDebugger.processLine(AbstractEaseDebugger.java:490)
17:51:47 [2021-06-05T21:51:47.757Z] 	at org.eclipse.ease.lang.javascript.rhino.debugger.RhinoDebugger.access$4(RhinoDebugger.java:1)
17:51:47 [2021-06-05T21:51:47.757Z] 	at org.eclipse.ease.lang.javascript.rhino.debugger.RhinoDebugger$RhinoDebugFrame.onLineChange(RhinoDebugger.java:122)
17:51:47 [2021-06-05T21:51:47.757Z] 	at org.mozilla.javascript.Interpreter.interpretLoop(Interpreter.java:1824)
17:51:47 [2021-06-05T21:51:47.757Z] 	at org.mozilla.javascript.Interpreter.interpret(Interpreter.java:815)
17:51:47 [2021-06-05T21:51:47.757Z] 	at org.mozilla.javascript.InterpretedFunction.call(InterpretedFunction.java:109)
17:51:47 [2021-06-05T21:51:47.757Z] 	at org.mozilla.javascript.ContextFactory.doTopCall(ContextFactory.java:394)
17:51:47 [2021-06-05T21:51:47.757Z] 	at org.mozilla.javascript.ScriptRuntime.doTopCall(ScriptRuntime.java:3091)
17:51:47 [2021-06-05T21:51:47.757Z] 	at org.mozilla.javascript.InterpretedFunction.exec(InterpretedFunction.java:120)
17:51:47 [2021-06-05T21:51:47.757Z] 	at org.mozilla.javascript.Context.evaluateReader(Context.java:1110)
17:51:47 [2021-06-05T21:51:47.757Z] 	at org.eclipse.ease.lang.javascript.rhino.RhinoScriptEngine.internalExecute(RhinoScriptEngine.java:224)
17:51:47 [2021-06-05T21:51:47.757Z] 	at org.eclipse.ease.lang.javascript.rhino.RhinoScriptEngine.execute(RhinoScriptEngine.java:203)
17:51:47 [2021-06-05T21:51:47.757Z] 	at org.eclipse.ease.AbstractScriptEngine.inject(AbstractScriptEngine.java:189)
17:51:47 [2021-06-05T21:51:47.757Z] 	at org.eclipse.ease.AbstractScriptEngine.run(AbstractScriptEngine.java:242)
17:51:47 [2021-06-05T21:51:47.757Z] 	at org.eclipse.core.internal.jobs.Worker.run(Worker.java:63)
17:51:48 [2021-06-05T21:51:48.014Z] Start of script
17:51:48 [2021-06-05T21:51:48.014Z] include file start
17:51:48 [2021-06-05T21:51:48.014Z] Include file processed
17:51:48 [2021-06-05T21:51:48.014Z] line after include file
17:51:48 [2021-06-05T21:51:48.014Z] Result of testMethod = 5
17:51:48 [2021-06-05T21:51:48.014Z] End of script
17:51:48 [2021-06-05T21:51:48.272Z] Start of script
17:51:48 [2021-06-05T21:51:48.272Z] include file start
17:51:48 [2021-06-05T21:51:48.272Z] Include file processed
17:51:48 [2021-06-05T21:51:48.272Z] line after include file
17:51:48 [2021-06-05T21:51:48.272Z] Result of testMethod = 5
17:51:48 [2021-06-05T21:51:48.272Z] End of script
17:51:48 [2021-06-05T21:51:48.529Z] Start of script
17:51:48 [2021-06-05T21:51:48.529Z] include file start
17:51:48 [2021-06-05T21:51:48.529Z] Include file processed
17:51:48 [2021-06-05T21:51:48.529Z] line after include file
17:51:48 [2021-06-05T21:51:48.529Z] Result of testMethod = 5
17:51:48 [2021-06-05T21:51:48.529Z] End of script
17:51:48 [2021-06-05T21:51:48.787Z] Start of script
17:51:48 [2021-06-05T21:51:48.787Z] include file start
17:51:48 [2021-06-05T21:51:48.787Z] Include file processed
17:51:48 [2021-06-05T21:51:48.787Z] line after include file
17:51:48 [2021-06-05T21:51:48.787Z] Result of testMethod = 5
17:51:48 [2021-06-05T21:51:48.787Z] End of script
17:51:49 [2021-06-05T21:51:49.064Z] Start of script
17:51:49 [2021-06-05T21:51:49.064Z] include file start
17:51:49 [2021-06-05T21:51:49.064Z] Include file processed
17:51:49 [2021-06-05T21:51:49.064Z] line after include file
17:51:49 [2021-06-05T21:51:49.064Z] Result of testMethod = 5
17:51:49 [2021-06-05T21:51:49.064Z] org.eclipse.ease.ScriptEngineCancellationException: Terminated on user request
17:51:49 [2021-06-05T21:51:49.064Z] 	at org.eclipse.ease.debugging.AbstractEaseDebugger.handleEventsInSuspendedState(AbstractEaseDebugger.java:329)
17:51:49 [2021-06-05T21:51:49.064Z] 	at org.eclipse.ease.debugging.AbstractEaseDebugger.suspend(AbstractEaseDebugger.java:255)
17:51:49 [2021-06-05T21:51:49.064Z] 	at org.eclipse.ease.debugging.AbstractEaseDebugger.processLine(AbstractEaseDebugger.java:490)
17:51:49 [2021-06-05T21:51:49.064Z] 	at org.eclipse.ease.lang.javascript.rhino.debugger.RhinoDebugger.access$4(RhinoDebugger.java:1)
17:51:49 [2021-06-05T21:51:49.064Z] 	at org.eclipse.ease.lang.javascript.rhino.debugger.RhinoDebugger$RhinoDebugFrame.onLineChange(RhinoDebugger.java:122)
17:51:49 [2021-06-05T21:51:49.064Z] 	at org.mozilla.javascript.Interpreter.interpretLoop(Interpreter.java:1824)
17:51:49 [2021-06-05T21:51:49.064Z] 	at org.mozilla.javascript.Interpreter.interpret(Interpreter.java:815)
17:51:49 [2021-06-05T21:51:49.064Z] 	at org.mozilla.javascript.InterpretedFunction.call(InterpretedFunction.java:109)
17:51:49 [2021-06-05T21:51:49.064Z] 	at org.mozilla.javascript.ContextFactory.doTopCall(ContextFactory.java:394)
17:51:49 [2021-06-05T21:51:49.064Z] 	at org.mozilla.javascript.ScriptRuntime.doTopCall(ScriptRuntime.java:3091)
17:51:49 [2021-06-05T21:51:49.064Z] 	at org.mozilla.javascript.InterpretedFunction.exec(InterpretedFunction.java:120)
17:51:49 [2021-06-05T21:51:49.064Z] 	at org.mozilla.javascript.Context.evaluateReader(Context.java:1110)
17:51:49 [2021-06-05T21:51:49.064Z] 	at org.eclipse.ease.lang.javascript.rhino.RhinoScriptEngine.internalExecute(RhinoScriptEngine.java:224)
17:51:49 [2021-06-05T21:51:49.064Z] 	at org.eclipse.ease.lang.javascript.rhino.RhinoScriptEngine.execute(RhinoScriptEngine.java:203)
17:51:49 [2021-06-05T21:51:49.064Z] 	at org.eclipse.ease.AbstractScriptEngine.inject(AbstractScriptEngine.java:189)
17:51:49 [2021-06-05T21:51:49.064Z] 	at org.eclipse.ease.AbstractScriptEngine.run(AbstractScriptEngine.java:242)
17:51:49 [2021-06-05T21:51:49.064Z] 	at org.eclipse.core.internal.jobs.Worker.run(Worker.java:63)
17:51:49 [2021-06-05T21:51:49.322Z] Start of script
17:51:49 [2021-06-05T21:51:49.322Z] include file start
17:51:49 [2021-06-05T21:51:49.322Z] Include file processed
17:51:49 [2021-06-05T21:51:49.322Z] line after include file
17:51:49 [2021-06-05T21:51:49.322Z] Result of testMethod = 5
17:51:49 [2021-06-05T21:51:49.322Z] End of script
17:51:49 [2021-06-05T21:51:49.580Z] Start of script
17:51:49 [2021-06-05T21:51:49.580Z] include file start
17:51:49 [2021-06-05T21:51:49.580Z] Include file processed
17:51:49 [2021-06-05T21:51:49.580Z] line after include file
17:51:49 [2021-06-05T21:51:49.580Z] Result of testMethod = 5
17:51:49 [2021-06-05T21:51:49.580Z] org.eclipse.ease.ScriptEngineCancellationException: Terminated on user request
17:51:49 [2021-06-05T21:51:49.580Z] 	at org.eclipse.ease.debugging.AbstractEaseDebugger.handleEventsInSuspendedState(AbstractEaseDebugger.java:329)
17:51:49 [2021-06-05T21:51:49.580Z] 	at org.eclipse.ease.debugging.AbstractEaseDebugger.suspend(AbstractEaseDebugger.java:255)
17:51:49 [2021-06-05T21:51:49.580Z] 	at org.eclipse.ease.debugging.AbstractEaseDebugger.processLine(AbstractEaseDebugger.java:490)
17:51:49 [2021-06-05T21:51:49.580Z] 	at org.eclipse.ease.lang.javascript.rhino.debugger.RhinoDebugger.access$4(RhinoDebugger.java:1)
17:51:49 [2021-06-05T21:51:49.580Z] 	at org.eclipse.ease.lang.javascript.rhino.debugger.RhinoDebugger$RhinoDebugFrame.onLineChange(RhinoDebugger.java:122)
17:51:49 [2021-06-05T21:51:49.580Z] 	at org.mozilla.javascript.Interpreter.interpretLoop(Interpreter.java:1824)
17:51:49 [2021-06-05T21:51:49.580Z] 	at org.mozilla.javascript.Interpreter.interpret(Interpreter.java:815)
17:51:49 [2021-06-05T21:51:49.580Z] 	at org.mozilla.javascript.InterpretedFunction.call(InterpretedFunction.java:109)
17:51:49 [2021-06-05T21:51:49.580Z] 	at org.mozilla.javascript.ContextFactory.doTopCall(ContextFactory.java:394)
17:51:49 [2021-06-05T21:51:49.580Z] 	at org.mozilla.javascript.ScriptRuntime.doTopCall(ScriptRuntime.java:3091)
17:51:49 [2021-06-05T21:51:49.580Z] 	at org.mozilla.javascript.InterpretedFunction.exec(InterpretedFunction.java:120)
17:51:49 [2021-06-05T21:51:49.580Z] 	at org.mozilla.javascript.Context.evaluateReader(Context.java:1110)
17:51:49 [2021-06-05T21:51:49.580Z] 	at org.eclipse.ease.lang.javascript.rhino.RhinoScriptEngine.internalExecute(RhinoScriptEngine.java:224)
17:51:49 [2021-06-05T21:51:49.580Z] 	at org.eclipse.ease.lang.javascript.rhino.RhinoScriptEngine.execute(RhinoScriptEngine.java:203)
17:51:49 [2021-06-05T21:51:49.580Z] 	at org.eclipse.ease.AbstractScriptEngine.inject(AbstractScriptEngine.java:189)
17:51:49 [2021-06-05T21:51:49.580Z] 	at org.eclipse.ease.AbstractScriptEngine.run(AbstractScriptEngine.java:242)
17:51:49 [2021-06-05T21:51:49.580Z] 	at org.eclipse.core.internal.jobs.Worker.run(Worker.java:63)
17:51:49 [2021-06-05T21:51:49.838Z] org.eclipse.ease.ScriptEngineCancellationException: Terminated on user request
17:51:49 [2021-06-05T21:51:49.838Z] 	at org.eclipse.ease.debugging.AbstractEaseDebugger.handleEventsInSuspendedState(AbstractEaseDebugger.java:329)
17:51:49 [2021-06-05T21:51:49.838Z] 	at org.eclipse.ease.debugging.AbstractEaseDebugger.suspend(AbstractEaseDebugger.java:255)
17:51:49 [2021-06-05T21:51:49.838Z] 	at org.eclipse.ease.debugging.AbstractEaseDebugger.processLine(AbstractEaseDebugger.java:490)
17:51:49 [2021-06-05T21:51:49.838Z] 	at org.eclipse.ease.lang.javascript.rhino.debugger.RhinoDebugger.access$4(RhinoDebugger.java:1)
17:51:49 [2021-06-05T21:51:49.838Z] 	at org.eclipse.ease.lang.javascript.rhino.debugger.RhinoDebugger$RhinoDebugFrame.onLineChange(RhinoDebugger.java:122)
17:51:49 [2021-06-05T21:51:49.838Z] 	at org.mozilla.javascript.Interpreter.interpretLoop(Interpreter.java:1824)
17:51:49 [2021-06-05T21:51:49.838Z] 	at org.mozilla.javascript.Interpreter.interpret(Interpreter.java:815)
17:51:49 [2021-06-05T21:51:49.838Z] 	at org.mozilla.javascript.InterpretedFunction.call(InterpretedFunction.java:109)
17:51:49 [2021-06-05T21:51:49.838Z] 	at org.mozilla.javascript.ContextFactory.doTopCall(ContextFactory.java:394)
17:51:49 [2021-06-05T21:51:49.838Z] 	at org.mozilla.javascript.ScriptRuntime.doTopCall(ScriptRuntime.java:3091)
17:51:49 [2021-06-05T21:51:49.839Z] 	at org.mozilla.javascript.InterpretedFunction.exec(InterpretedFunction.java:120)
17:51:49 [2021-06-05T21:51:49.839Z] 	at org.mozilla.javascript.Context.evaluateReader(Context.java:1110)
17:51:49 [2021-06-05T21:51:49.839Z] 	at org.eclipse.ease.lang.javascript.rhino.RhinoScriptEngine.internalExecute(RhinoScriptEngine.java:224)
17:51:49 [2021-06-05T21:51:49.839Z] 	at org.eclipse.ease.lang.javascript.rhino.RhinoScriptEngine.execute(RhinoScriptEngine.java:203)
17:51:49 [2021-06-05T21:51:49.839Z] 	at org.eclipse.ease.AbstractScriptEngine.inject(AbstractScriptEngine.java:189)
17:51:49 [2021-06-05T21:51:49.839Z] 	at org.eclipse.ease.AbstractScriptEngine.run(AbstractScriptEngine.java:242)
17:51:49 [2021-06-05T21:51:49.839Z] 	at org.eclipse.core.internal.jobs.Worker.run(Worker.java:63)
17:51:50 [2021-06-05T21:51:50.096Z] Start of script
17:51:50 [2021-06-05T21:51:50.096Z] include file start
17:51:50 [2021-06-05T21:51:50.096Z] Include file processed
17:51:50 [2021-06-05T21:51:50.096Z] line after include file
17:51:50 [2021-06-05T21:51:50.096Z] Result of testMethod = 5
17:51:50 [2021-06-05T21:51:50.096Z] End of script
17:51:50 [2021-06-05T21:51:50.353Z] Start of script
17:51:50 [2021-06-05T21:51:50.353Z] include file start
17:51:50 [2021-06-05T21:51:50.353Z] Include file processed
17:51:50 [2021-06-05T21:51:50.353Z] line after include file
17:51:50 [2021-06-05T21:51:50.353Z] Result of testMethod = 5
17:51:50 [2021-06-05T21:51:50.353Z] End of script
17:51:50 [2021-06-05T21:51:50.611Z] Start of script
17:51:50 [2021-06-05T21:51:50.611Z] include file start
17:51:50 [2021-06-05T21:51:50.611Z] Include file processed
17:51:50 [2021-06-05T21:51:50.611Z] line after include file
17:51:50 [2021-06-05T21:51:50.611Z] Result of testMethod = 5
17:51:50 [2021-06-05T21:51:50.611Z] End of script
17:51:50 [2021-06-05T21:51:50.869Z] Tests run: 42, Failures: 1, Errors: 0, Skipped: 0, Time elapsed: 12.103 s <<< FAILURE! - in org.eclipse.ease.lang.javascript.rhino.RhinoDebugTest
17:51:50 [2021-06-05T21:51:50.869Z] disconnectProcessInSuspendedState  Time elapsed: 1.186 s
17:51:50 [2021-06-05T21:51:50.869Z] stepReturnIncludeCommand  Time elapsed: 0.218 s
17:51:50 [2021-06-05T21:51:50.869Z] arrayVariableSorting  Time elapsed: 0.311 s
17:51:50 [2021-06-05T21:51:50.869Z] stepOverOnDebugTarget  Time elapsed: 0.317 s
17:51:50 [2021-06-05T21:51:50.869Z] hasDebugTarget  Time elapsed: 0.107 s
17:51:50 [2021-06-05T21:51:50.869Z] disconnectThreadInSuspendedState  Time elapsed: 0.211 s
17:51:50 [2021-06-05T21:51:50.869Z] stepReturnOnDebugTarget  Time elapsed: 0.314 s
17:51:50 [2021-06-05T21:51:50.869Z] nullVariable  Time elapsed: 0.311 s
17:51:50 [2021-06-05T21:51:50.869Z] stepOverOnStackFrame  Time elapsed: 0.311 s
17:51:50 [2021-06-05T21:51:50.869Z] resumeOnDebugTarget  Time elapsed: 0.21 s
17:51:50 [2021-06-05T21:51:50.869Z] modifyVariableKeepingType  Time elapsed: 0.411 s
17:51:50 [2021-06-05T21:51:50.869Z] resumeOnLastIncludeLine  Time elapsed: 0.209 s
17:51:50 [2021-06-05T21:51:50.869Z] stepReturnOnStackFrame  Time elapsed: 0.31 s
17:51:50 [2021-06-05T21:51:50.869Z] terminateStackFrameInSuspendedState  Time elapsed: 0.212 s
17:51:50 [2021-06-05T21:51:50.869Z] breakpointLocation  Time elapsed: 0.213 s
17:51:50 [2021-06-05T21:51:50.869Z] stepReturnOnThread  Time elapsed: 0.311 s
17:51:50 [2021-06-05T21:51:50.869Z] javaClassVariable  Time elapsed: 0.313 s
17:51:50 [2021-06-05T21:51:50.869Z] stepIntoOnThread  Time elapsed: 0.31 s
17:51:50 [2021-06-05T21:51:50.869Z] terminateThreadInSuspendedState  Time elapsed: 0.209 s
17:51:50 [2021-06-05T21:51:50.869Z] resumeOnThread  Time elapsed: 0.209 s
17:51:50 [2021-06-05T21:51:50.869Z] stepIntoOnStackFrame  Time elapsed: 0.31 s
17:51:50 [2021-06-05T21:51:50.869Z] terminateProcessInSuspendedState  Time elapsed: 0.214 s  <<< FAILURE!
17:51:50 [2021-06-05T21:51:50.869Z] org.opentest4j.AssertionFailedError: expected: <true> but was: <false>
17:51:50 [2021-06-05T21:51:50.869Z] 	at org.eclipse.ease.testhelper.AbstractDebugTest.terminateTestTemplate(AbstractDebugTest.java:488)
17:51:50 [2021-06-05T21:51:50.869Z] 	at org.eclipse.ease.testhelper.AbstractDebugTest.terminateProcessInSuspendedState(AbstractDebugTest.java:505)
17:51:50 [2021-06-05T21:51:50.869Z] 
17:51:50 [2021-06-05T21:51:50.869Z] stepOverOnProcess  Time elapsed: 0.343 s
17:51:50 [2021-06-05T21:51:50.869Z] nativeArrayVariable  Time elapsed: 0.31 s
17:51:50 [2021-06-05T21:51:50.869Z] disconnectDebugTargetInSuspendedState  Time elapsed: 0.209 s
17:51:50 [2021-06-05T21:51:50.869Z] stepIntoOnProcess  Time elapsed: 0.31 s
17:51:50 [2021-06-05T21:51:50.869Z] terminatedState  Time elapsed: 0.106 s
17:51:50 [2021-06-05T21:51:50.869Z] stepOverIncludeCommand  Time elapsed: 0.309 s
17:51:50 [2021-06-05T21:51:50.869Z] innerScopeVariableBeforeOuterScopeVariable  Time elapsed: 0.307 s
17:51:50 [2021-06-05T21:51:50.869Z] stepIntoIncludeCommand  Time elapsed: 0.308 s
17:51:50 [2021-06-05T21:51:50.869Z] primitiveStringVariable  Time elapsed: 0.307 s
17:51:50 [2021-06-05T21:51:50.869Z] resumeOnProcess  Time elapsed: 0.208 s
17:51:50 [2021-06-05T21:51:50.869Z] stepIntoOnDebugTarget  Time elapsed: 0.309 s
17:51:50 [2021-06-05T21:51:50.869Z] stepOverOnThread  Time elapsed: 0.313 s
17:51:50 [2021-06-05T21:51:50.869Z] suspendedState  Time elapsed: 0.208 s
17:51:50 [2021-06-05T21:51:50.869Z] primitiveDoubleVariable  Time elapsed: 0.309 s
17:51:50 [2021-06-05T21:51:50.869Z] resumeOnStackFrame  Time elapsed: 0.209 s
17:51:50 [2021-06-05T21:51:50.869Z] nativeObjectVariable  Time elapsed: 0.308 s
17:51:50 [2021-06-05T21:51:50.869Z] terminateDebugTargetInSuspendedState  Time elapsed: 0.209 s
17:51:50 [2021-06-05T21:51:50.869Z] disconnectStackFrameInSuspendedState  Time elapsed: 0.209 s
17:51:50 [2021-06-05T21:51:50.869Z] stepReturnOnProcess  Time elapsed: 0.31 s
17:51:50 [2021-06-05T21:51:50.869Z] evaluateWatchExpression  Time elapsed: 0.253 s
17:51:50 [2021-06-05T21:51:50.869Z] Running org.eclipse.ease.lang.javascript.rhino.RhinoEnvironmentTest
17:51:51 [2021-06-05T21:51:51.127Z] Tests run: 5, Failures: 0, Errors: 0, Skipped: 0, Time elapsed: 0.39 s - in org.eclipse.ease.lang.javascript.rhino.RhinoEnvironmentTest
17:51:51 [2021-06-05T21:51:51.127Z] reloadEnvironment  Time elapsed: 0.116 s
17:51:51 [2021-06-05T21:51:51.127Z] bootstrappedEnvironment  Time elapsed: 0.033 s
17:51:51 [2021-06-05T21:51:51.127Z] postMethodCallback  Time elapsed: 0.106 s
17:51:51 [2021-06-05T21:51:51.127Z] preMethodCallback  Time elapsed: 0.028 s
17:51:51 [2021-06-05T21:51:51.127Z] reloadFunctionDefinitions  Time elapsed: 0.072 s
17:51:51 [2021-06-05T21:51:51.127Z] Running org.eclipse.ease.lang.javascript.rhino.RhinoScriptEngineTest
17:51:51 [2021-06-05T21:51:51.385Z] org.eclipse.ease.ScriptExecutionException: JavaError: java.lang.Exception
17:51:51 [2021-06-05T21:51:51.385Z] 	at <unknown source>
17:51:51 [2021-06-05T21:51:51.385Z] 
17:51:51 [2021-06-05T21:51:51.385Z] Java Stacktrace:
17:51:51 [2021-06-05T21:51:51.385Z] java.lang.Exception
17:51:51 [2021-06-05T21:51:51.385Z] 	at java.base/jdk.internal.reflect.NativeConstructorAccessorImpl.newInstance0(Native Method)
17:51:51 [2021-06-05T21:51:51.385Z] 	at java.base/jdk.internal.reflect.NativeConstructorAccessorImpl.newInstance(NativeConstructorAccessorImpl.java:64)
17:51:51 [2021-06-05T21:51:51.385Z] 	at java.base/jdk.internal.reflect.DelegatingConstructorAccessorImpl.newInstance(DelegatingConstructorAccessorImpl.java:45)
17:51:51 [2021-06-05T21:51:51.385Z] 	at java.base/java.lang.reflect.Constructor.newInstanceWithCaller(Constructor.java:500)
17:51:51 [2021-06-05T21:51:51.385Z] 	at java.base/java.lang.reflect.Constructor.newInstance(Constructor.java:481)
17:51:51 [2021-06-05T21:51:51.385Z] 	at org.mozilla.javascript.MemberBox.newInstance(MemberBox.java:159)
17:51:51 [2021-06-05T21:51:51.386Z] 	at org.mozilla.javascript.NativeJavaClass.constructInternal(NativeJavaClass.java:266)
17:51:51 [2021-06-05T21:51:51.386Z] 	at org.mozilla.javascript.NativeJavaClass.constructSpecific(NativeJavaClass.java:205)
17:51:51 [2021-06-05T21:51:51.386Z] 	at org.mozilla.javascript.NativeJavaClass.construct(NativeJavaClass.java:166)
17:51:51 [2021-06-05T21:51:51.386Z] 	at org.mozilla.javascript.ScriptRuntime.newObject(ScriptRuntime.java:2349)
17:51:51 [2021-06-05T21:51:51.386Z] 	at org.mozilla.javascript.gen.c_33._c_script_0(Unknown Source)
17:51:51 [2021-06-05T21:51:51.386Z] 	at org.mozilla.javascript.gen.c_33.call(Unknown Source)
17:51:51 [2021-06-05T21:51:51.386Z] 	at org.mozilla.javascript.ContextFactory.doTopCall(ContextFactory.java:394)
17:51:51 [2021-06-05T21:51:51.386Z] 	at org.mozilla.javascript.ScriptRuntime.doTopCall(ScriptRuntime.java:3091)
17:51:51 [2021-06-05T21:51:51.386Z] 	at org.mozilla.javascript.gen.c_33.call(Unknown Source)
17:51:51 [2021-06-05T21:51:51.386Z] 	at org.mozilla.javascript.gen.c_33.exec(Unknown Source)
17:51:51 [2021-06-05T21:51:51.386Z] 	at org.mozilla.javascript.Context.evaluateReader(Context.java:1110)
17:51:51 [2021-06-05T21:51:51.386Z] 	at org.eclipse.ease.lang.javascript.rhino.RhinoScriptEngine.internalExecute(RhinoScriptEngine.java:224)
17:51:51 [2021-06-05T21:51:51.386Z] 	at org.eclipse.ease.lang.javascript.rhino.RhinoScriptEngine.execute(RhinoScriptEngine.java:203)
17:51:51 [2021-06-05T21:51:51.386Z] 	at org.eclipse.ease.AbstractScriptEngine.inject(AbstractScriptEngine.java:189)
17:51:51 [2021-06-05T21:51:51.386Z] 	at org.eclipse.ease.AbstractScriptEngine.run(AbstractScriptEngine.java:242)
17:51:51 [2021-06-05T21:51:51.386Z] 	at org.eclipse.core.internal.jobs.Worker.run(Worker.java:63)
17:51:51 [2021-06-05T21:51:51.386Z] org.eclipse.ease.ScriptExecutionException: ScriptException: test
17:51:51 [2021-06-05T21:51:51.386Z] 	at <unknown source>
17:51:51 [2021-06-05T21:51:51.386Z] org.eclipse.ease.ScriptExecutionException: ScriptException: JavaScript
17:51:51 [2021-06-05T21:51:51.386Z] 	at <unknown source>
17:51:51 [2021-06-05T21:51:51.386Z] org.eclipse.ease.ScriptExecutionException: SyntaxError: unterminated string literal (#1)
17:51:51 [2021-06-05T21:51:51.386Z] 'asdf
17:51:51 [2021-06-05T21:51:51.386Z]     ^
17:51:51 [2021-06-05T21:51:51.386Z] 	at <unknown source>
17:51:51 [2021-06-05T21:51:51.386Z] org.eclipse.ease.ScriptExecutionException: TypeError: Cannot call method "foobar" of undefined
17:51:51 [2021-06-05T21:51:51.386Z] 	at <unknown source>
17:51:51 [2021-06-05T21:51:51.386Z] org.eclipse.ease.ScriptExecutionException: JavaError: NotThere cannot be found by org.mozilla.javascript_1.7.5.v201504281450
17:51:51 [2021-06-05T21:51:51.386Z] 	at <unknown source>
17:51:51 [2021-06-05T21:51:51.386Z] 
17:51:51 [2021-06-05T21:51:51.386Z] Java Stacktrace:
17:51:51 [2021-06-05T21:51:51.386Z] java.lang.ClassNotFoundException: NotThere cannot be found by org.mozilla.javascript_1.7.5.v201504281450
17:51:51 [2021-06-05T21:51:51.386Z] 	at org.eclipse.osgi.internal.loader.BundleLoader.findClassInternal(BundleLoader.java:511)
17:51:51 [2021-06-05T21:51:51.386Z] 	at org.eclipse.osgi.internal.loader.BundleLoader.findClass(BundleLoader.java:422)
17:51:51 [2021-06-05T21:51:51.386Z] 	at org.eclipse.osgi.internal.loader.BundleLoader.findClass(BundleLoader.java:414)
17:51:51 [2021-06-05T21:51:51.386Z] 	at org.eclipse.osgi.internal.loader.ModuleClassLoader.loadClass(ModuleClassLoader.java:153)
17:51:51 [2021-06-05T21:51:51.386Z] 	at java.base/java.lang.ClassLoader.loadClass(ClassLoader.java:522)
17:51:51 [2021-06-05T21:51:51.386Z] 	at java.base/java.lang.Class.forName0(Native Method)
17:51:51 [2021-06-05T21:51:51.386Z] 	at java.base/java.lang.Class.forName(Class.java:377)
17:51:51 [2021-06-05T21:51:51.386Z] 	at java.base/jdk.internal.reflect.NativeMethodAccessorImpl.invoke0(Native Method)
17:51:51 [2021-06-05T21:51:51.386Z] 	at java.base/jdk.internal.reflect.NativeMethodAccessorImpl.invoke(NativeMethodAccessorImpl.java:64)
17:51:51 [2021-06-05T21:51:51.386Z] 	at java.base/jdk.internal.reflect.DelegatingMethodAccessorImpl.invoke(DelegatingMethodAccessorImpl.java:43)
17:51:51 [2021-06-05T21:51:51.386Z] 	at java.base/java.lang.reflect.Method.invoke(Method.java:564)
17:51:51 [2021-06-05T21:51:51.386Z] 	at org.mozilla.javascript.MemberBox.invoke(MemberBox.java:126)
17:51:51 [2021-06-05T21:51:51.386Z] 	at org.mozilla.javascript.NativeJavaMethod.call(NativeJavaMethod.java:225)
17:51:51 [2021-06-05T21:51:51.386Z] 	at org.mozilla.javascript.optimizer.OptRuntime.call1(OptRuntime.java:32)
17:51:51 [2021-06-05T21:51:51.386Z] 	at org.mozilla.javascript.gen.c_56._c_script_0(Unknown Source)
17:51:51 [2021-06-05T21:51:51.386Z] 	at org.mozilla.javascript.gen.c_56.call(Unknown Source)
17:51:51 [2021-06-05T21:51:51.386Z] 	at org.mozilla.javascript.ContextFactory.doTopCall(ContextFactory.java:394)
17:51:51 [2021-06-05T21:51:51.386Z] 	at org.mozilla.javascript.ScriptRuntime.doTopCall(ScriptRuntime.java:3091)
17:51:51 [2021-06-05T21:51:51.386Z] 	at org.mozilla.javascript.gen.c_56.call(Unknown Source)
17:51:51 [2021-06-05T21:51:51.386Z] 	at org.mozilla.javascript.gen.c_56.exec(Unknown Source)
17:51:51 [2021-06-05T21:51:51.386Z] 	at org.mozilla.javascript.Context.evaluateReader(Context.java:1110)
17:51:51 [2021-06-05T21:51:51.386Z] 	at org.eclipse.ease.lang.javascript.rhino.RhinoScriptEngine.internalExecute(RhinoScriptEngine.java:224)
17:51:51 [2021-06-05T21:51:51.386Z] 	at org.eclipse.ease.lang.javascript.rhino.RhinoScriptEngine.execute(RhinoScriptEngine.java:203)
17:51:51 [2021-06-05T21:51:51.386Z] 	at org.eclipse.ease.AbstractScriptEngine.inject(AbstractScriptEngine.java:189)
17:51:51 [2021-06-05T21:51:51.386Z] 	at org.eclipse.ease.AbstractScriptEngine.run(AbstractScriptEngine.java:242)
17:51:51 [2021-06-05T21:51:51.386Z] 	at org.eclipse.core.internal.jobs.Worker.run(Worker.java:63)
17:51:51 [2021-06-05T21:51:51.386Z] Tests run: 11, Failures: 0, Errors: 0, Skipped: 0, Time elapsed: 0.277 s - in org.eclipse.ease.lang.javascript.rhino.RhinoScriptEngineTest
17:51:51 [2021-06-05T21:51:51.386Z] execute_java_class_instantiation  Time elapsed: 0.03 s
17:51:51 [2021-06-05T21:51:51.386Z] execute_environment_module_code_with_optional_parameters  Time elapsed: 0.029 s
17:51:51 [2021-06-05T21:51:51.386Z] execute_throws_java_exception  Time elapsed: 0.02 s
17:51:51 [2021-06-05T21:51:51.386Z] execute_throws_java_class  Time elapsed: 0.02 s
17:51:51 [2021-06-05T21:51:51.386Z] execute_javascript_assignment  Time elapsed: 0.019 s
17:51:51 [2021-06-05T21:51:51.386Z] execute_eclipse_class_instantiation  Time elapsed: 0.04 s
17:51:51 [2021-06-05T21:51:51.387Z] execute_throws_javascript_object  Time elapsed: 0.019 s
17:51:51 [2021-06-05T21:51:51.387Z] execute_throws_syntax_error  Time elapsed: 0.018 s
17:51:51 [2021-06-05T21:51:51.387Z] execute_throws_javascript_runtime_error  Time elapsed: 0.018 s
17:51:51 [2021-06-05T21:51:51.387Z] execute_environment_module_code  Time elapsed: 0.038 s
17:51:51 [2021-06-05T21:51:51.387Z] execute_throws_wrapped_java_exception  Time elapsed: 0.02 s
17:51:51 [2021-06-05T21:51:51.387Z] 
17:51:51 [2021-06-05T21:51:51.387Z] Results:
17:51:51 [2021-06-05T21:51:51.387Z] 
17:51:51 [2021-06-05T21:51:51.387Z] Failures: 
17:51:51 [2021-06-05T21:51:51.387Z]   AbstractDebugTest.terminateProcessInSuspendedState:505->terminateTestTemplate:488 expected: <true> but was: <false>
17:51:51 [2021-06-05T21:51:51.387Z] 
17:51:51 [2021-06-05T21:51:51.387Z] Tests run: 70, Failures: 1, Errors: 0, Skipped: 0
17:51:51 [2021-06-05T21:51:51.387Z] 
17:51:52 [2021-06-05T21:51:52.320Z] [INFO] ------------------------------------------------------------------------
17:51:52 [2021-06-05T21:51:52.320Z] [INFO] Reactor Summary for org.eclipse.ease.releng 0.8.0-SNAPSHOT:
17:51:52 [2021-06-05T21:51:52.320Z] [INFO] 
17:51:52 [2021-06-05T21:51:52.320Z] [INFO] org.eclipse.ease.releng ............................ SUCCESS [  0.003 s]
17:51:52 [2021-06-05T21:51:52.320Z] [INFO] org.eclipse.ease.releng.target ..................... SUCCESS [  0.272 s]
17:51:52 [2021-06-05T21:51:52.320Z] [INFO] org.eclipse.ease.test .............................. SUCCESS [ 32.108 s]
17:51:52 [2021-06-05T21:51:52.320Z] [INFO] org.eclipse.ease.lang.javascript.rhino.test ........ FAILURE [ 21.768 s]
17:51:52 [2021-06-05T21:51:52.320Z] [INFO] org.eclipse.ease.lang.javascript.test .............. SKIPPED
17:51:52 [2021-06-05T21:51:52.320Z] [INFO] org.eclipse.ease.lang.python.test .................. SKIPPED
17:51:52 [2021-06-05T21:51:52.320Z] [INFO] org.eclipse.ease.lang.python.jython.test ........... SKIPPED
17:51:52 [2021-06-05T21:51:52.320Z] [INFO] org.eclipse.ease.lang.scriptarchive.test ........... SKIPPED
17:51:52 [2021-06-05T21:51:52.320Z] [INFO] org.eclipse.ease.ui.test ........................... SKIPPED
17:51:52 [2021-06-05T21:51:52.320Z] [INFO] ------------------------------------------------------------------------
17:51:52 [2021-06-05T21:51:52.320Z] [INFO] BUILD FAILURE
17:51:52 [2021-06-05T21:51:52.320Z] [INFO] ------------------------------------------------------------------------
17:51:52 [2021-06-05T21:51:52.320Z] [INFO] Total time:  01:45 min
17:51:52 [2021-06-05T21:51:52.320Z] [INFO] Finished at: 2021-06-05T21:51:52Z
17:51:52 [2021-06-05T21:51:52.320Z] [INFO] ------------------------------------------------------------------------
17:51:52 [2021-06-05T21:51:52.320Z] [WARNING] [jenkins-event-spy] Unexpected Maven project file name 'target-tests-pom.xml', problems may occur
17:51:52 [2021-06-05T21:51:52.320Z] [INFO] [jenkins-event-spy] Generated /home/jenkins/agent/workspace/ease.verify.core.target.2019-03@tmp/withMavend0cee191/maven-spy-20210605-215006-33216371232712451112695.log
17:51:52 [2021-06-05T21:51:52.321Z] [ERROR] Failed to execute goal org.eclipse.tycho:tycho-surefire-plugin:2.2.0:test (default-test) on project org.eclipse.ease.lang.javascript.rhino.test: There are test failures.
17:51:52 [2021-06-05T21:51:52.321Z] [ERROR] 
17:51:52 [2021-06-05T21:51:52.321Z] [ERROR] Please refer to /home/jenkins/agent/workspace/ease.verify.core.target.2019-03/tests/org.eclipse.ease.lang.javascript.rhino.test/target/surefire-reports for the individual test results.
17:51:52 [2021-06-05T21:51:52.321Z] [ERROR] -> [Help 1]
17:51:52 [2021-06-05T21:51:52.321Z] [ERROR] 
17:51:52 [2021-06-05T21:51:52.321Z] [ERROR] To see the full stack trace of the errors, re-run Maven with the -e switch.
17:51:52 [2021-06-05T21:51:52.321Z] [ERROR] Re-run Maven using the -X switch to enable full debug logging.
17:51:52 [2021-06-05T21:51:52.321Z] [ERROR] 
17:51:52 [2021-06-05T21:51:52.321Z] [ERROR] For more information about the errors and possible solutions, please read the following articles:
17:51:52 [2021-06-05T21:51:52.321Z] [ERROR] [Help 1] http://cwiki.apache.org/confluence/display/MAVEN/MojoFailureException
17:51:52 [2021-06-05T21:51:52.321Z] [ERROR] 
17:51:52 [2021-06-05T21:51:52.321Z] [ERROR] After correcting the problems, you can resume the build with the command
17:51:52 [2021-06-05T21:51:52.321Z] [ERROR]   mvn <args> -rf :org.eclipse.ease.lang.javascript.rhino.test
[Pipeline] }
17:51:52 [2021-06-05T21:51:52.916Z] [withMaven] junitPublisher - Archive test results for Maven artifact org.eclipse.ease:org.eclipse.ease.test:eclipse-test-plugin:0.8.0-SNAPSHOT generated by tycho-surefire-plugin:test (default-test): tests/org.eclipse.ease.test/target/surefire-reports/*.xml
17:51:52 [2021-06-05T21:51:52.917Z] [withMaven] junitPublisher - Archive test results for Maven artifact org.eclipse.ease:org.eclipse.ease.lang.javascript.rhino.test:eclipse-test-plugin:0.8.0-SNAPSHOT generated by tycho-surefire-plugin:test (default-test): tests/org.eclipse.ease.lang.javascript.rhino.test/target/surefire-reports/*.xml
17:51:52 [2021-06-05T21:51:52.918Z] [withMaven] junitPublisher - Jenkins JUnit Attachments Plugin not found, can't publish test attachments.Recording test results
17:51:53 [2021-06-05T21:51:53.163Z] [withMaven] Jenkins JaCoCo Plugin not found, don't display org.jacoco:jacoco-maven-plugin:prepare-agent[-integration] results in pipeline screen.
17:51:53 [2021-06-05T21:51:53.167Z] [withMaven] Publishers: Pipeline Graph Publisher: 1 ms, Junit Publisher: 235 ms, Jacoco Publisher: 1 ms
[Pipeline] // withMaven
[Pipeline] }
[Pipeline] // stage
[Pipeline] stage
[Pipeline] { (Declarative: Post Actions)
[Pipeline] archiveArtifacts
17:51:53 [2021-06-05T21:51:53.219Z] Archiving artifacts
[Pipeline] emailext
17:57:42 [2021-06-05T21:57:42.338Z] Sending email to: christian.pontesegger@web.de
[Pipeline] }
[Pipeline] // stage
[Pipeline] }
[Pipeline] // timeout
[Pipeline] }
[Pipeline] // timestamps
[Pipeline] }
[Pipeline] // node
[Pipeline] End of Pipeline
ERROR: script returned exit code 1
Finished: FAILURE