Console Output

Skipping 910 KB.. Full Log
23:43:18 [2022-05-28T03:43:18.740Z] [INFO] 
23:43:18 [2022-05-28T03:43:18.740Z] [INFO] --- tycho-p2-plugin:2.4.0:p2-metadata-default (default-p2-metadata-default) @ org.eclipse.ease.lang.scriptarchive.test ---
23:43:18 [2022-05-28T03:43:18.740Z] [INFO] 
23:43:18 [2022-05-28T03:43:18.740Z] [INFO] --- jacoco-maven-plugin:0.8.6:prepare-agent (jacoco-initialize) @ org.eclipse.ease.lang.scriptarchive.test ---
23:43:18 [2022-05-28T03:43:18.740Z] [INFO] tycho.testArgLine set to -javaagent:/home/jenkins/.m2/repository/org/jacoco/org.jacoco.agent/0.8.6/org.jacoco.agent-0.8.6-runtime.jar=destfile=/home/jenkins/agent/workspace/ease.verify.core.target.2018-12/tests/org.eclipse.ease.lang.scriptarchive.test/target/jacoco.exec,output=file
23:43:18 [2022-05-28T03:43:18.740Z] [INFO] 
23:43:18 [2022-05-28T03:43:18.740Z] [INFO] --- tycho-surefire-plugin:2.4.0:test (default-test) @ org.eclipse.ease.lang.scriptarchive.test ---
23:43:18 [2022-05-28T03:43:18.740Z] [INFO] Executing Test Runtime with timeout 0, logs (if any) will be placed at: /home/jenkins/agent/workspace/ease.verify.core.target.2018-12/tests/org.eclipse.ease.lang.scriptarchive.test/target/work/data/.metadata/.log
23:43:18 [2022-05-28T03:43:18.740Z] [INFO] Command line:
23:43:18 [2022-05-28T03:43:18.740Z] 	[/opt/tools/java/openjdk/jdk-15/15.0.2+7/bin/java, -Dosgi.noShutdown=false, -Dosgi.os=linux, -Dosgi.ws=gtk, -Dosgi.arch=x86_64, -javaagent:/home/jenkins/.m2/repository/org/jacoco/org.jacoco.agent/0.8.6/org.jacoco.agent-0.8.6-runtime.jar=destfile=/home/jenkins/agent/workspace/ease.verify.core.target.2018-12/tests/org.eclipse.ease.lang.scriptarchive.test/target/jacoco.exec,output=file, -Dosgi.clean=true, -jar, /home/jenkins/.m2/repository/p2/osgi/bundle/org.eclipse.equinox.launcher/1.6.400.v20210924-0641/org.eclipse.equinox.launcher-1.6.400.v20210924-0641.jar, -data, /home/jenkins/agent/workspace/ease.verify.core.target.2018-12/tests/org.eclipse.ease.lang.scriptarchive.test/target/work/data, -install, /home/jenkins/agent/workspace/ease.verify.core.target.2018-12/tests/org.eclipse.ease.lang.scriptarchive.test/target/work, -configuration, /home/jenkins/agent/workspace/ease.verify.core.target.2018-12/tests/org.eclipse.ease.lang.scriptarchive.test/target/work/configuration, -application, org.eclipse.tycho.surefire.osgibooter.headlesstest, -testproperties, /home/jenkins/agent/workspace/ease.verify.core.target.2018-12/tests/org.eclipse.ease.lang.scriptarchive.test/target/surefire.properties]
23:43:18 [2022-05-28T03:43:18.741Z] Picked up JAVA_TOOL_OPTIONS: -Dmaven.ext.class.path="/home/jenkins/agent/workspace/ease.verify.core.target.2018-12@tmp/withMavenf46734fb/pipeline-maven-spy.jar" -Dorg.jenkinsci.plugins.pipeline.maven.reportsFolder="/home/jenkins/agent/workspace/ease.verify.core.target.2018-12@tmp/withMavenf46734fb" 
23:43:22 [2022-05-28T03:43:22.948Z] Running org.eclipse.ease.lang.scriptarchive.ArchiveEngineTest
23:43:23 [2022-05-28T03:43:23.878Z] We are running from a zip file!
23:43:24 [2022-05-28T03:43:24.138Z] org.eclipse.ease.ScriptExecutionException: SyntaxError: missing ; before statement (workspace://__EASE_ScriptArchive_1/scripts/Master.js#3)
23:43:24 [2022-05-28T03:43:24.138Z] this is an error
23:43:24 [2022-05-28T03:43:24.139Z]        ^
23:43:24 [2022-05-28T03:43:24.139Z] 	at Master.js,workspace://__EASE_ScriptArchive_1/scripts/Master.js
23:43:24 [2022-05-28T03:43:24.139Z] org.eclipse.ease.ScriptExecutionException: SyntaxError: missing ; before statement (workspace://__EASE_ScriptArchive_1/scripts/Master.js#3)
23:43:24 [2022-05-28T03:43:24.139Z] this is an error
23:43:24 [2022-05-28T03:43:24.139Z]        ^
23:43:24 [2022-05-28T03:43:24.139Z] 	at Master.js,workspace://__EASE_ScriptArchive_1/scripts/Master.js
23:43:24 [2022-05-28T03:43:24.139Z] Tests run: 7, Failures: 0, Errors: 0, Skipped: 0, Time elapsed: 1.172 s - in org.eclipse.ease.lang.scriptarchive.ArchiveEngineTest
23:43:24 [2022-05-28T03:43:24.139Z] executeWithManifest  Time elapsed: 0.95 s
23:43:24 [2022-05-28T03:43:24.139Z] zipFileRegistration  Time elapsed: 0.015 s
23:43:24 [2022-05-28T03:43:24.139Z] engineIdRegistration  Time elapsed: 0 s
23:43:24 [2022-05-28T03:43:24.139Z] jarFileRegistration  Time elapsed: 0 s
23:43:24 [2022-05-28T03:43:24.139Z] sarFileRegistration  Time elapsed: 0.001 s
23:43:24 [2022-05-28T03:43:24.139Z] executeWithErrors  Time elapsed: 0.087 s
23:43:24 [2022-05-28T03:43:24.139Z] executeWithIncludes  Time elapsed: 0.097 s
23:43:24 [2022-05-28T03:43:24.139Z] 
23:43:24 [2022-05-28T03:43:24.139Z] Results:
23:43:24 [2022-05-28T03:43:24.139Z] 
23:43:24 [2022-05-28T03:43:24.139Z] Tests run: 7, Failures: 0, Errors: 0, Skipped: 0
23:43:24 [2022-05-28T03:43:24.139Z] 
23:43:24 [2022-05-28T03:43:24.741Z] [INFO] All tests passed!
23:43:24 [2022-05-28T03:43:24.741Z] [INFO] 
23:43:24 [2022-05-28T03:43:24.741Z] [INFO] --- maven-pmd-plugin:3.16.0:pmd (pmd-integration) @ org.eclipse.ease.lang.scriptarchive.test ---
23:43:24 [2022-05-28T03:43:24.741Z] [INFO] PMD version: 6.42.0
23:43:25 [2022-05-28T03:43:25.000Z] [INFO] 
23:43:25 [2022-05-28T03:43:25.000Z] [INFO] --- maven-pmd-plugin:3.16.0:cpd (pmd-integration) @ org.eclipse.ease.lang.scriptarchive.test ---
23:43:25 [2022-05-28T03:43:25.000Z] [INFO] PMD version: 6.42.0
23:43:25 [2022-05-28T03:43:25.000Z] [INFO] 
23:43:25 [2022-05-28T03:43:25.000Z] [INFO] --- spotbugs-maven-plugin:4.1.4:spotbugs (spotbugs-integration) @ org.eclipse.ease.lang.scriptarchive.test ---
23:43:25 [2022-05-28T03:43:25.000Z] [INFO] Fork Value is false
23:43:25 [2022-05-28T03:43:25.000Z]      [java] JVM args ignored when same JVM is used.
23:43:28 [2022-05-28T03:43:28.345Z] [INFO] Done SpotBugs Analysis....
23:43:28 [2022-05-28T03:43:28.345Z] [INFO] 
23:43:28 [2022-05-28T03:43:28.345Z] [INFO] --- maven-checkstyle-plugin:3.1.1:check (checkstyle-integration) @ org.eclipse.ease.lang.scriptarchive.test ---
23:43:28 [2022-05-28T03:43:28.345Z] [INFO] You have 0 Checkstyle violations.
23:43:28 [2022-05-28T03:43:28.345Z] [INFO] 
23:43:28 [2022-05-28T03:43:28.345Z] [INFO] --- maven-install-plugin:2.3.1:install (default-install) @ org.eclipse.ease.lang.scriptarchive.test ---
23:43:28 [2022-05-28T03:43:28.345Z] [INFO] Installing /home/jenkins/agent/workspace/ease.verify.core.target.2018-12/tests/org.eclipse.ease.lang.scriptarchive.test/target/org.eclipse.ease.lang.scriptarchive.test-0.9.0-SNAPSHOT.jar to /home/jenkins/.m2/repository/org/eclipse/ease/org.eclipse.ease.lang.scriptarchive.test/0.9.0-SNAPSHOT/org.eclipse.ease.lang.scriptarchive.test-0.9.0-SNAPSHOT.jar
23:43:28 [2022-05-28T03:43:28.345Z] [INFO] Installing /home/jenkins/agent/workspace/ease.verify.core.target.2018-12/tests/org.eclipse.ease.lang.scriptarchive.test/pom.xml to /home/jenkins/.m2/repository/org/eclipse/ease/org.eclipse.ease.lang.scriptarchive.test/0.9.0-SNAPSHOT/org.eclipse.ease.lang.scriptarchive.test-0.9.0-SNAPSHOT.pom
23:43:28 [2022-05-28T03:43:28.345Z] [INFO] Installing /home/jenkins/agent/workspace/ease.verify.core.target.2018-12/tests/org.eclipse.ease.lang.scriptarchive.test/target/p2content.xml to /home/jenkins/.m2/repository/org/eclipse/ease/org.eclipse.ease.lang.scriptarchive.test/0.9.0-SNAPSHOT/org.eclipse.ease.lang.scriptarchive.test-0.9.0-SNAPSHOT-p2metadata.xml
23:43:28 [2022-05-28T03:43:28.345Z] [INFO] Installing /home/jenkins/agent/workspace/ease.verify.core.target.2018-12/tests/org.eclipse.ease.lang.scriptarchive.test/target/p2artifacts.xml to /home/jenkins/.m2/repository/org/eclipse/ease/org.eclipse.ease.lang.scriptarchive.test/0.9.0-SNAPSHOT/org.eclipse.ease.lang.scriptarchive.test-0.9.0-SNAPSHOT-p2artifacts.xml
23:43:28 [2022-05-28T03:43:28.345Z] [INFO] 
23:43:28 [2022-05-28T03:43:28.345Z] [INFO] --- tycho-p2-plugin:2.4.0:update-local-index (default-update-local-index) @ org.eclipse.ease.lang.scriptarchive.test ---
23:43:28 [2022-05-28T03:43:28.345Z] [INFO] 
23:43:28 [2022-05-28T03:43:28.345Z] [INFO] --------< org.eclipse.ease:org.eclipse.ease.lang.unittest.test >--------
23:43:28 [2022-05-28T03:43:28.345Z] [INFO] Building org.eclipse.ease.lang.unittest.test 0.9.0-SNAPSHOT      [44/49]
23:43:28 [2022-05-28T03:43:28.345Z] [INFO] ------------------------[ eclipse-test-plugin ]-------------------------
23:43:28 [2022-05-28T03:43:28.345Z] [INFO] 
23:43:28 [2022-05-28T03:43:28.345Z] [INFO] --- maven-clean-plugin:2.5:clean (default-clean) @ org.eclipse.ease.lang.unittest.test ---
23:43:28 [2022-05-28T03:43:28.346Z] [INFO] 
23:43:28 [2022-05-28T03:43:28.346Z] [INFO] --- tycho-packaging-plugin:2.4.0:build-qualifier (default-build-qualifier) @ org.eclipse.ease.lang.unittest.test ---
23:43:28 [2022-05-28T03:43:28.346Z] [INFO] The project's OSGi version is 0.9.0.I202204291053
23:43:28 [2022-05-28T03:43:28.346Z] [INFO] 
23:43:28 [2022-05-28T03:43:28.346Z] [INFO] --- tycho-packaging-plugin:2.4.0:validate-id (default-validate-id) @ org.eclipse.ease.lang.unittest.test ---
23:43:28 [2022-05-28T03:43:28.346Z] [INFO] 
23:43:28 [2022-05-28T03:43:28.346Z] [INFO] --- tycho-packaging-plugin:2.4.0:validate-version (default-validate-version) @ org.eclipse.ease.lang.unittest.test ---
23:43:28 [2022-05-28T03:43:28.346Z] [INFO] 
23:43:28 [2022-05-28T03:43:28.346Z] [INFO] --- target-platform-configuration:2.4.0:target-platform (default-target-platform) @ org.eclipse.ease.lang.unittest.test ---
23:43:28 [2022-05-28T03:43:28.346Z] [INFO] 
23:43:28 [2022-05-28T03:43:28.346Z] [INFO] --- maven-resources-plugin:2.4.3:resources (default-resources) @ org.eclipse.ease.lang.unittest.test ---
23:43:28 [2022-05-28T03:43:28.346Z] [INFO] Using 'UTF-8' encoding to copy filtered resources.
23:43:28 [2022-05-28T03:43:28.346Z] [INFO] skip non existing resourceDirectory /home/jenkins/agent/workspace/ease.verify.core.target.2018-12/tests/org.eclipse.ease.lang.unittest.test/src/main/resources
23:43:28 [2022-05-28T03:43:28.346Z] [INFO] 
23:43:28 [2022-05-28T03:43:28.346Z] [INFO] --- tycho-compiler-plugin:2.4.0:compile (default-compile) @ org.eclipse.ease.lang.unittest.test ---
23:43:28 [2022-05-28T03:43:28.346Z] [INFO] Compiling 9 source files to /home/jenkins/agent/workspace/ease.verify.core.target.2018-12/tests/org.eclipse.ease.lang.unittest.test/target/classes
23:43:28 [2022-05-28T03:43:28.346Z] [INFO] 
23:43:28 [2022-05-28T03:43:28.346Z] [INFO] --- maven-resources-plugin:2.4.3:testResources (default-testResources) @ org.eclipse.ease.lang.unittest.test ---
23:43:28 [2022-05-28T03:43:28.346Z] [INFO] Using 'UTF-8' encoding to copy filtered resources.
23:43:28 [2022-05-28T03:43:28.346Z] [INFO] skip non existing resourceDirectory /home/jenkins/agent/workspace/ease.verify.core.target.2018-12/tests/org.eclipse.ease.lang.unittest.test/src/test/resources
23:43:28 [2022-05-28T03:43:28.346Z] [INFO] 
23:43:28 [2022-05-28T03:43:28.346Z] [INFO] --- tycho-packaging-plugin:2.4.0:package-plugin (default-package-plugin) @ org.eclipse.ease.lang.unittest.test ---
23:43:28 [2022-05-28T03:43:28.346Z] [INFO] Building jar: /home/jenkins/agent/workspace/ease.verify.core.target.2018-12/tests/org.eclipse.ease.lang.unittest.test/target/org.eclipse.ease.lang.unittest.test-0.9.0-SNAPSHOT.jar
23:43:28 [2022-05-28T03:43:28.346Z] [INFO] 
23:43:28 [2022-05-28T03:43:28.346Z] [INFO] --- tycho-p2-plugin:2.4.0:p2-metadata-default (default-p2-metadata-default) @ org.eclipse.ease.lang.unittest.test ---
23:43:28 [2022-05-28T03:43:28.346Z] [INFO] 
23:43:28 [2022-05-28T03:43:28.346Z] [INFO] --- jacoco-maven-plugin:0.8.6:prepare-agent (jacoco-initialize) @ org.eclipse.ease.lang.unittest.test ---
23:43:28 [2022-05-28T03:43:28.347Z] [INFO] tycho.testArgLine set to -javaagent:/home/jenkins/.m2/repository/org/jacoco/org.jacoco.agent/0.8.6/org.jacoco.agent-0.8.6-runtime.jar=destfile=/home/jenkins/agent/workspace/ease.verify.core.target.2018-12/tests/org.eclipse.ease.lang.unittest.test/target/jacoco.exec,output=file
23:43:28 [2022-05-28T03:43:28.347Z] [INFO] 
23:43:28 [2022-05-28T03:43:28.347Z] [INFO] --- tycho-surefire-plugin:2.4.0:test (default-test) @ org.eclipse.ease.lang.unittest.test ---
23:43:28 [2022-05-28T03:43:28.347Z] [INFO] Executing Test Runtime with timeout 0, logs (if any) will be placed at: /home/jenkins/agent/workspace/ease.verify.core.target.2018-12/tests/org.eclipse.ease.lang.unittest.test/target/work/data/.metadata/.log
23:43:28 [2022-05-28T03:43:28.347Z] [INFO] Command line:
23:43:28 [2022-05-28T03:43:28.347Z] 	[/opt/tools/java/openjdk/jdk-15/15.0.2+7/bin/java, -Dosgi.noShutdown=false, -Dosgi.os=linux, -Dosgi.ws=gtk, -Dosgi.arch=x86_64, -javaagent:/home/jenkins/.m2/repository/org/jacoco/org.jacoco.agent/0.8.6/org.jacoco.agent-0.8.6-runtime.jar=destfile=/home/jenkins/agent/workspace/ease.verify.core.target.2018-12/tests/org.eclipse.ease.lang.unittest.test/target/jacoco.exec,output=file, -Dosgi.clean=true, -jar, /home/jenkins/.m2/repository/p2/osgi/bundle/org.eclipse.equinox.launcher/1.6.400.v20210924-0641/org.eclipse.equinox.launcher-1.6.400.v20210924-0641.jar, -data, /home/jenkins/agent/workspace/ease.verify.core.target.2018-12/tests/org.eclipse.ease.lang.unittest.test/target/work/data, -install, /home/jenkins/agent/workspace/ease.verify.core.target.2018-12/tests/org.eclipse.ease.lang.unittest.test/target/work, -configuration, /home/jenkins/agent/workspace/ease.verify.core.target.2018-12/tests/org.eclipse.ease.lang.unittest.test/target/work/configuration, -application, org.eclipse.tycho.surefire.osgibooter.headlesstest, -testproperties, /home/jenkins/agent/workspace/ease.verify.core.target.2018-12/tests/org.eclipse.ease.lang.unittest.test/target/surefire.properties]
23:43:28 [2022-05-28T03:43:28.347Z] Picked up JAVA_TOOL_OPTIONS: -Dmaven.ext.class.path="/home/jenkins/agent/workspace/ease.verify.core.target.2018-12@tmp/withMavenf46734fb/pipeline-maven-spy.jar" -Dorg.jenkinsci.plugins.pipeline.maven.reportsFolder="/home/jenkins/agent/workspace/ease.verify.core.target.2018-12@tmp/withMavenf46734fb" 
23:43:33 [2022-05-28T03:43:33.726Z] Running org.eclipse.ease.lang.unittest.runtime.impl.TestTest
23:43:34 [2022-05-28T03:43:34.656Z] Tests run: 30, Failures: 0, Errors: 0, Skipped: 0, Time elapsed: 1.501 s - in org.eclipse.ease.lang.unittest.runtime.impl.TestTest
23:43:34 [2022-05-28T03:43:34.656Z] reset_clears_results  Time elapsed: 0.054 s
23:43:34 [2022-05-28T03:43:34.656Z] hasError_is_false_when_no_error_exists  Time elapsed: 0.001 s
23:43:34 [2022-05-28T03:43:34.656Z] getDuration_is_0_for_not_executed_test  Time elapsed: 0.002 s
23:43:34 [2022-05-28T03:43:34.656Z] getStatus_is_DISABLED_when_1_result_is_disabled  Time elapsed: 0.002 s
23:43:34 [2022-05-28T03:43:34.656Z] reset_clears_status  Time elapsed: 0.151 s
23:43:34 [2022-05-28T03:43:34.656Z] getResults_FAILURE_returns_only_matching_results  Time elapsed: 0.001 s
23:43:34 [2022-05-28T03:43:34.656Z] isDisabled_is_false_for_finished_test  Time elapsed: 0 s
23:43:34 [2022-05-28T03:43:34.656Z] getStatus_is_DISABLED_when_entity_status_is_disabled  Time elapsed: 0.001 s
23:43:34 [2022-05-28T03:43:34.656Z] getStatus_is_status_of_worst_result  Time elapsed: 0 s
23:43:34 [2022-05-28T03:43:34.656Z] getEstimatedDuration_is_minus_1_by_default  Time elapsed: 0 s
23:43:34 [2022-05-28T03:43:34.656Z] getDuration_returns_current_execution_time_for_running_test  Time elapsed: 0.201 s
23:43:34 [2022-05-28T03:43:34.656Z] setDisabled_marks_test_as_disabled  Time elapsed: 0 s
23:43:34 [2022-05-28T03:43:34.656Z] getStatus_is_entity_status_if_it_is_the_worst_status  Time elapsed: 0 s
23:43:34 [2022-05-28T03:43:34.656Z] reset_clears_timestamps  Time elapsed: 0 s
23:43:34 [2022-05-28T03:43:34.656Z] getResource_returns_parent_resource  Time elapsed: 0.006 s
23:43:34 [2022-05-28T03:43:34.656Z] isDisabled_is_true_when_1_result_is_DISABLED  Time elapsed: 0.001 s
23:43:34 [2022-05-28T03:43:34.656Z] getFullPath_returns_test_name  Time elapsed: 0 s
23:43:34 [2022-05-28T03:43:34.656Z] getDuration_returns_execution_time_for_completed_test  Time elapsed: 0.101 s
23:43:34 [2022-05-28T03:43:34.656Z] addError_adds_error_result  Time elapsed: 0.62 s
23:43:34 [2022-05-28T03:43:34.656Z] getFullPath_returns_parent_path_and_test_name  Time elapsed: 0 s
23:43:34 [2022-05-28T03:43:34.656Z] reset_clears_metadata  Time elapsed: 0.001 s
23:43:34 [2022-05-28T03:43:34.656Z] getRoot_returns_root_element  Time elapsed: 0 s
23:43:34 [2022-05-28T03:43:34.656Z] hasError_is_true_when_error_exists  Time elapsed: 0 s
23:43:34 [2022-05-28T03:43:34.656Z] setEntityStatus_FINISHED_sets_end_timestamp  Time elapsed: 0.001 s
23:43:34 [2022-05-28T03:43:34.656Z] getWorstResult_returns_worst_execution_result  Time elapsed: 0.001 s
23:43:34 [2022-05-28T03:43:34.656Z] getTestSuite_returns_master_suite  Time elapsed: 0.003 s
23:43:34 [2022-05-28T03:43:34.656Z] isDisabled_is_true_when_status_is_DISABLED  Time elapsed: 0 s
23:43:34 [2022-05-28T03:43:34.656Z] setEntityStatus_RUNNING_sets_start_timestamp  Time elapsed: 0.001 s
23:43:34 [2022-05-28T03:43:34.656Z] setEndTimestamp_verifies_duration_limit  Time elapsed: 0.022 s
23:43:34 [2022-05-28T03:43:34.656Z] setStackTrace_stores_a_clone_of_the_trace  Time elapsed: 0.308 s
23:43:34 [2022-05-28T03:43:34.656Z] Running org.eclipse.ease.lang.unittest.runtime.impl.TestContainerTest
23:43:34 [2022-05-28T03:43:34.913Z] Tests run: 38, Failures: 0, Errors: 0, Skipped: 1, Time elapsed: 0.34 s - in org.eclipse.ease.lang.unittest.runtime.impl.TestContainerTest
23:43:34 [2022-05-28T03:43:34.913Z] reset_clears_results  Time elapsed: 0 s
23:43:34 [2022-05-28T03:43:34.913Z] hasError_is_false_when_no_error_exists  Time elapsed: 0.001 s
23:43:34 [2022-05-28T03:43:34.913Z] getDuration_is_0_for_not_executed_test  Time elapsed: 0 s
23:43:34 [2022-05-28T03:43:34.913Z] getStatus_is_DISABLED_when_1_result_is_disabled  Time elapsed: 0 s
23:43:34 [2022-05-28T03:43:34.913Z] reset_clears_status  Time elapsed: 0 s
23:43:34 [2022-05-28T03:43:34.913Z] getResults_FAILURE_returns_only_matching_results  Time elapsed: 0 s
23:43:34 [2022-05-28T03:43:34.913Z] isDisabled_is_false_for_finished_test  Time elapsed: 0.001 s
23:43:34 [2022-05-28T03:43:34.913Z] getStatus_is_DISABLED_when_entity_status_is_disabled  Time elapsed: 0 s
23:43:34 [2022-05-28T03:43:34.913Z] getStatus_is_status_of_worst_result  Time elapsed: 0 s
23:43:34 [2022-05-28T03:43:34.913Z] getEstimatedDuration_is_minus_1_by_default  Time elapsed: 0.001 s
23:43:34 [2022-05-28T03:43:34.913Z] getDuration_returns_current_execution_time_for_running_test  Time elapsed: 0.201 s
23:43:34 [2022-05-28T03:43:34.913Z] setDisabled_marks_test_as_disabled  Time elapsed: 0 s
23:43:34 [2022-05-28T03:43:34.913Z] getStatus_is_entity_status_if_it_is_the_worst_status  Time elapsed: 0.001 s
23:43:34 [2022-05-28T03:43:34.913Z] reset_clears_timestamps  Time elapsed: 0 s
23:43:34 [2022-05-28T03:43:34.913Z] isDisabled_is_true_when_1_result_is_DISABLED  Time elapsed: 0.001 s
23:43:34 [2022-05-28T03:43:34.913Z] getFullPath_returns_test_name  Time elapsed: 0 s
23:43:34 [2022-05-28T03:43:34.913Z] getDuration_returns_execution_time_for_completed_test  Time elapsed: 0.101 s
23:43:34 [2022-05-28T03:43:34.913Z] addError_adds_error_result  Time elapsed: 0.001 s
23:43:34 [2022-05-28T03:43:34.913Z] getFullPath_returns_parent_path_and_test_name  Time elapsed: 0 s
23:43:34 [2022-05-28T03:43:34.913Z] reset_clears_metadata  Time elapsed: 0.001 s
23:43:34 [2022-05-28T03:43:34.913Z] getRoot_returns_root_element  Time elapsed: 0 s
23:43:34 [2022-05-28T03:43:34.913Z] hasError_is_true_when_error_exists  Time elapsed: 0.001 s
23:43:34 [2022-05-28T03:43:34.913Z] setEntityStatus_FINISHED_sets_end_timestamp  Time elapsed: 0 s
23:43:34 [2022-05-28T03:43:34.913Z] getWorstResult_returns_worst_execution_result  Time elapsed: 0 s
23:43:34 [2022-05-28T03:43:34.913Z] getTestSuite_returns_master_suite  Time elapsed: 0 s
23:43:34 [2022-05-28T03:43:34.913Z] isDisabled_is_true_when_status_is_DISABLED  Time elapsed: 0 s
23:43:34 [2022-05-28T03:43:34.913Z] setEntityStatus_RUNNING_sets_start_timestamp  Time elapsed: 0.001 s
23:43:34 [2022-05-28T03:43:34.913Z] hasError_queries_children_for_error_status  Time elapsed: 0.002 s
23:43:34 [2022-05-28T03:43:34.913Z] setTerminated_terminates_children_too  Time elapsed: 0 s
23:43:34 [2022-05-28T03:43:34.913Z] getTest_is_null_when_child_test_does_not_exist  Time elapsed: 0.001 s
23:43:34 [2022-05-28T03:43:34.913Z] getTest_returns_child_with_matching_name  Time elapsed: 0 s
23:43:34 [2022-05-28T03:43:34.913Z] getEstimatedDuration_sums_child_estimations  Time elapsed: 0.001 s
23:43:34 [2022-05-28T03:43:34.913Z] reset_deletes_children_of_type_ITest  Time elapsed: 0 s
23:43:34 [2022-05-28T03:43:34.913Z] getResource_returns_parent_resource skipped
23:43:34 [2022-05-28T03:43:34.913Z] getStatus_returns_worst_child_status  Time elapsed: 0 s
23:43:34 [2022-05-28T03:43:34.913Z] getChildContainers_returns_only_containers  Time elapsed: 0.001 s
23:43:34 [2022-05-28T03:43:34.913Z] getStatus_returns_entity_status  Time elapsed: 0 s
23:43:34 [2022-05-28T03:43:34.913Z] run_executes_each_child  Time elapsed: 0.019 s
23:43:34 [2022-05-28T03:43:34.913Z] Running org.eclipse.ease.lang.unittest.runtime.impl.TestFileTest
23:43:35 [2022-05-28T03:43:35.477Z] Tests run: 43, Failures: 0, Errors: 0, Skipped: 2, Time elapsed: 0.467 s - in org.eclipse.ease.lang.unittest.runtime.impl.TestFileTest
23:43:35 [2022-05-28T03:43:35.477Z] reset_clears_results  Time elapsed: 0.001 s
23:43:35 [2022-05-28T03:43:35.477Z] hasError_is_false_when_no_error_exists  Time elapsed: 0 s
23:43:35 [2022-05-28T03:43:35.477Z] getDuration_is_0_for_not_executed_test  Time elapsed: 0 s
23:43:35 [2022-05-28T03:43:35.477Z] getStatus_is_DISABLED_when_1_result_is_disabled  Time elapsed: 0 s
23:43:35 [2022-05-28T03:43:35.477Z] reset_clears_status  Time elapsed: 0 s
23:43:35 [2022-05-28T03:43:35.477Z] getResults_FAILURE_returns_only_matching_results  Time elapsed: 0.001 s
23:43:35 [2022-05-28T03:43:35.477Z] isDisabled_is_false_for_finished_test  Time elapsed: 0 s
23:43:35 [2022-05-28T03:43:35.477Z] getStatus_is_DISABLED_when_entity_status_is_disabled  Time elapsed: 0 s
23:43:35 [2022-05-28T03:43:35.477Z] getStatus_is_status_of_worst_result  Time elapsed: 0 s
23:43:35 [2022-05-28T03:43:35.477Z] getEstimatedDuration_is_minus_1_by_default  Time elapsed: 0 s
23:43:35 [2022-05-28T03:43:35.477Z] getDuration_returns_current_execution_time_for_running_test  Time elapsed: 0.2 s
23:43:35 [2022-05-28T03:43:35.477Z] setDisabled_marks_test_as_disabled  Time elapsed: 0 s
23:43:35 [2022-05-28T03:43:35.477Z] getStatus_is_entity_status_if_it_is_the_worst_status  Time elapsed: 0.001 s
23:43:35 [2022-05-28T03:43:35.477Z] reset_clears_timestamps  Time elapsed: 0 s
23:43:35 [2022-05-28T03:43:35.477Z] isDisabled_is_true_when_1_result_is_DISABLED  Time elapsed: 0.001 s
23:43:35 [2022-05-28T03:43:35.477Z] getFullPath_returns_test_name  Time elapsed: 0 s
23:43:35 [2022-05-28T03:43:35.477Z] getDuration_returns_execution_time_for_completed_test  Time elapsed: 0.101 s
23:43:35 [2022-05-28T03:43:35.477Z] addError_adds_error_result  Time elapsed: 0.001 s
23:43:35 [2022-05-28T03:43:35.477Z] getFullPath_returns_parent_path_and_test_name  Time elapsed: 0 s
23:43:35 [2022-05-28T03:43:35.478Z] reset_clears_metadata  Time elapsed: 0 s
23:43:35 [2022-05-28T03:43:35.478Z] getRoot_returns_root_element  Time elapsed: 0.001 s
23:43:35 [2022-05-28T03:43:35.478Z] hasError_is_true_when_error_exists  Time elapsed: 0 s
23:43:35 [2022-05-28T03:43:35.478Z] setEntityStatus_FINISHED_sets_end_timestamp  Time elapsed: 0 s
23:43:35 [2022-05-28T03:43:35.478Z] getWorstResult_returns_worst_execution_result  Time elapsed: 0 s
23:43:35 [2022-05-28T03:43:35.478Z] getTestSuite_returns_master_suite  Time elapsed: 0 s
23:43:35 [2022-05-28T03:43:35.478Z] isDisabled_is_true_when_status_is_DISABLED  Time elapsed: 0.001 s
23:43:35 [2022-05-28T03:43:35.478Z] setEntityStatus_RUNNING_sets_start_timestamp  Time elapsed: 0 s
23:43:35 [2022-05-28T03:43:35.478Z] hasError_queries_children_for_error_status  Time elapsed: 0 s
23:43:35 [2022-05-28T03:43:35.478Z] setTerminated_terminates_children_too  Time elapsed: 0 s
23:43:35 [2022-05-28T03:43:35.478Z] getTest_is_null_when_child_test_does_not_exist  Time elapsed: 0 s
23:43:35 [2022-05-28T03:43:35.478Z] getTest_returns_child_with_matching_name  Time elapsed: 0 s
23:43:35 [2022-05-28T03:43:35.478Z] getEstimatedDuration_sums_child_estimations  Time elapsed: 0 s
23:43:35 [2022-05-28T03:43:35.478Z] reset_deletes_children_of_type_ITest  Time elapsed: 0 s
23:43:35 [2022-05-28T03:43:35.478Z] getResource_returns_parent_resource skipped
23:43:35 [2022-05-28T03:43:35.478Z] getStatus_returns_worst_child_status  Time elapsed: 0 s
23:43:35 [2022-05-28T03:43:35.478Z] getChildContainers_returns_only_containers  Time elapsed: 0 s
23:43:35 [2022-05-28T03:43:35.478Z] getStatus_returns_entity_status  Time elapsed: 0 s
23:43:35 [2022-05-28T03:43:35.478Z] getEstimatedDuration_is_0_for_disabled_status  Time elapsed: 0 s
23:43:35 [2022-05-28T03:43:35.478Z] run_adds_error_when_no_engine_is_found  Time elapsed: 0.001 s
23:43:35 [2022-05-28T03:43:35.478Z] reset_removes_error_markers_from_files  Time elapsed: 0.11 s
23:43:35 [2022-05-28T03:43:35.478Z] reset_disables_TestFile_when_set_in_suite_description  Time elapsed: 0.037 s
23:43:35 [2022-05-28T03:43:35.478Z] run_does_not_execute_disabled_tests  Time elapsed: 0 s
23:43:35 [2022-05-28T03:43:35.478Z] run_executes_each_child skipped
23:43:35 [2022-05-28T03:43:35.478Z] Running org.eclipse.ease.lang.unittest.runtime.impl.TestEntityTest
23:43:35 [2022-05-28T03:43:35.739Z] Tests run: 28, Failures: 0, Errors: 0, Skipped: 0, Time elapsed: 0.314 s - in org.eclipse.ease.lang.unittest.runtime.impl.TestEntityTest
23:43:35 [2022-05-28T03:43:35.739Z] reset_clears_results  Time elapsed: 0 s
23:43:35 [2022-05-28T03:43:35.739Z] hasError_is_false_when_no_error_exists  Time elapsed: 0 s
23:43:35 [2022-05-28T03:43:35.739Z] getDuration_is_0_for_not_executed_test  Time elapsed: 0 s
23:43:35 [2022-05-28T03:43:35.740Z] getStatus_is_DISABLED_when_1_result_is_disabled  Time elapsed: 0 s
23:43:35 [2022-05-28T03:43:35.740Z] reset_clears_status  Time elapsed: 0.001 s
23:43:35 [2022-05-28T03:43:35.740Z] getResults_FAILURE_returns_only_matching_results  Time elapsed: 0 s
23:43:35 [2022-05-28T03:43:35.740Z] isDisabled_is_false_for_finished_test  Time elapsed: 0 s
23:43:35 [2022-05-28T03:43:35.740Z] getStatus_is_DISABLED_when_entity_status_is_disabled  Time elapsed: 0.001 s
23:43:35 [2022-05-28T03:43:35.740Z] getStatus_is_status_of_worst_result  Time elapsed: 0 s
23:43:35 [2022-05-28T03:43:35.740Z] getEstimatedDuration_is_minus_1_by_default  Time elapsed: 0 s
23:43:35 [2022-05-28T03:43:35.740Z] getDuration_returns_current_execution_time_for_running_test  Time elapsed: 0.201 s
23:43:35 [2022-05-28T03:43:35.740Z] setDisabled_marks_test_as_disabled  Time elapsed: 0 s
23:43:35 [2022-05-28T03:43:35.740Z] getStatus_is_entity_status_if_it_is_the_worst_status  Time elapsed: 0 s
23:43:35 [2022-05-28T03:43:35.740Z] reset_clears_timestamps  Time elapsed: 0.001 s
23:43:35 [2022-05-28T03:43:35.740Z] getResource_returns_parent_resource  Time elapsed: 0 s
23:43:35 [2022-05-28T03:43:35.740Z] isDisabled_is_true_when_1_result_is_DISABLED  Time elapsed: 0 s
23:43:35 [2022-05-28T03:43:35.740Z] getFullPath_returns_test_name  Time elapsed: 0 s
23:43:35 [2022-05-28T03:43:35.740Z] getDuration_returns_execution_time_for_completed_test  Time elapsed: 0.1 s
23:43:35 [2022-05-28T03:43:35.740Z] addError_adds_error_result  Time elapsed: 0 s
23:43:35 [2022-05-28T03:43:35.740Z] getFullPath_returns_parent_path_and_test_name  Time elapsed: 0 s
23:43:35 [2022-05-28T03:43:35.740Z] reset_clears_metadata  Time elapsed: 0 s
23:43:35 [2022-05-28T03:43:35.740Z] getRoot_returns_root_element  Time elapsed: 0 s
23:43:35 [2022-05-28T03:43:35.740Z] hasError_is_true_when_error_exists  Time elapsed: 0 s
23:43:35 [2022-05-28T03:43:35.740Z] setEntityStatus_FINISHED_sets_end_timestamp  Time elapsed: 0.001 s
23:43:35 [2022-05-28T03:43:35.740Z] getWorstResult_returns_worst_execution_result  Time elapsed: 0 s
23:43:35 [2022-05-28T03:43:35.740Z] getTestSuite_returns_master_suite  Time elapsed: 0 s
23:43:35 [2022-05-28T03:43:35.740Z] isDisabled_is_true_when_status_is_DISABLED  Time elapsed: 0.001 s
23:43:35 [2022-05-28T03:43:35.740Z] setEntityStatus_RUNNING_sets_start_timestamp  Time elapsed: 0 s
23:43:35 [2022-05-28T03:43:35.740Z] Running org.eclipse.ease.lang.unittest.ModernJavaScriptTest
23:43:38 [2022-05-28T03:43:38.292Z] Tests run: 8, Failures: 0, Errors: 0, Skipped: 0, Time elapsed: 2.195 s - in org.eclipse.ease.lang.unittest.ModernJavaScriptTest
23:43:38 [2022-05-28T03:43:38.292Z] folderStatus  Time elapsed: 0.854 s
23:43:38 [2022-05-28T03:43:38.292Z] verifyOutput  Time elapsed: 0.236 s
23:43:38 [2022-05-28T03:43:38.292Z] suiteStatus  Time elapsed: 0.183 s
23:43:38 [2022-05-28T03:43:38.292Z] ignoreTestStatus  Time elapsed: 0.182 s
23:43:38 [2022-05-28T03:43:38.292Z] ignoreTestClassStatus  Time elapsed: 0.139 s
23:43:38 [2022-05-28T03:43:38.292Z] failureTestClassStatus  Time elapsed: 0.177 s
23:43:38 [2022-05-28T03:43:38.292Z] errorTestClassStatus  Time elapsed: 0.159 s
23:43:38 [2022-05-28T03:43:38.292Z] passTestClassStatus  Time elapsed: 0.157 s
23:43:38 [2022-05-28T03:43:38.292Z] Running org.eclipse.ease.lang.unittest.adapters.HeadlessResultAdapterTest
23:43:38 [2022-05-28T03:43:38.292Z] Tests run: 7, Failures: 0, Errors: 0, Skipped: 0, Time elapsed: 0.062 s - in org.eclipse.ease.lang.unittest.adapters.HeadlessResultAdapterTest
23:43:38 [2022-05-28T03:43:38.292Z] getAdapter_declines_to_adapt_generic_object  Time elapsed: 0.001 s
23:43:38 [2022-05-28T03:43:38.292Z] getAdapter_adapts_testsuite_with_failures_to_100  Time elapsed: 0.052 s
23:43:38 [2022-05-28T03:43:38.292Z] adapter_can_be_called_via_adapter_framework  Time elapsed: 0.004 s
23:43:38 [2022-05-28T03:43:38.292Z] getAdapter_adapts_testsuite_with_errors_to_200  Time elapsed: 0.001 s
23:43:38 [2022-05-28T03:43:38.292Z] getAdapterList_returns_only_ITestSuite  Time elapsed: 0.002 s
23:43:38 [2022-05-28T03:43:38.292Z] getAdapter_adapts_testsuite_with_no_errors_to_0  Time elapsed: 0 s
23:43:38 [2022-05-28T03:43:38.292Z] getAdapter_declines_to_adapt_to_Boolean  Time elapsed: 0.001 s
23:43:38 [2022-05-28T03:43:38.292Z] Running org.eclipse.ease.lang.unittest.definition.impl.TestSuiteDefinitionTest
23:43:38 [2022-05-28T03:43:38.293Z] Tests run: 4, Failures: 0, Errors: 0, Skipped: 0, Time elapsed: 0.005 s - in org.eclipse.ease.lang.unittest.definition.impl.TestSuiteDefinitionTest
23:43:38 [2022-05-28T03:43:38.293Z] setVariable_sets_new_variable  Time elapsed: 0.001 s
23:43:38 [2022-05-28T03:43:38.293Z] setVariable_updates_existing_variable  Time elapsed: 0 s
23:43:38 [2022-05-28T03:43:38.293Z] setFlag_throws_on_unknown_flag  Time elapsed: 0.002 s
23:43:38 [2022-05-28T03:43:38.293Z] setFlag_sets_flag  Time elapsed: 0.001 s
23:43:38 [2022-05-28T03:43:38.293Z] Running org.eclipse.ease.lang.unittest.ClassicJavaScriptTest
23:43:38 [2022-05-28T03:43:38.856Z] Tests run: 7, Failures: 0, Errors: 0, Skipped: 0, Time elapsed: 0.719 s - in org.eclipse.ease.lang.unittest.ClassicJavaScriptTest
23:43:38 [2022-05-28T03:43:38.857Z] folderStatus  Time elapsed: 0.105 s
23:43:38 [2022-05-28T03:43:38.857Z] errorTestStatus  Time elapsed: 0.107 s
23:43:38 [2022-05-28T03:43:38.857Z] failureTestStatus  Time elapsed: 0.1 s
23:43:38 [2022-05-28T03:43:38.857Z] verifyOutput  Time elapsed: 0.109 s
23:43:38 [2022-05-28T03:43:38.857Z] suiteStatus  Time elapsed: 0.101 s
23:43:38 [2022-05-28T03:43:38.857Z] ignoreTestStatus  Time elapsed: 0.103 s
23:43:38 [2022-05-28T03:43:38.857Z] passTestStatus  Time elapsed: 0.092 s
23:43:38 [2022-05-28T03:43:38.857Z] 
23:43:38 [2022-05-28T03:43:38.857Z] Results:
23:43:38 [2022-05-28T03:43:38.857Z] 
23:43:38 [2022-05-28T03:43:38.857Z] Tests run: 165, Failures: 0, Errors: 0, Skipped: 3
23:43:38 [2022-05-28T03:43:38.857Z] 
23:43:39 [2022-05-28T03:43:39.138Z] [INFO] All tests passed!
23:43:39 [2022-05-28T03:43:39.138Z] [INFO] 
23:43:39 [2022-05-28T03:43:39.138Z] [INFO] --- maven-pmd-plugin:3.16.0:pmd (pmd-integration) @ org.eclipse.ease.lang.unittest.test ---
23:43:39 [2022-05-28T03:43:39.138Z] [INFO] PMD version: 6.42.0
23:43:39 [2022-05-28T03:43:39.745Z] [INFO] 
23:43:39 [2022-05-28T03:43:39.745Z] [INFO] --- maven-pmd-plugin:3.16.0:cpd (pmd-integration) @ org.eclipse.ease.lang.unittest.test ---
23:43:39 [2022-05-28T03:43:39.745Z] [INFO] PMD version: 6.42.0
23:43:39 [2022-05-28T03:43:39.745Z] [INFO] 
23:43:39 [2022-05-28T03:43:39.745Z] [INFO] --- spotbugs-maven-plugin:4.1.4:spotbugs (spotbugs-integration) @ org.eclipse.ease.lang.unittest.test ---
23:43:39 [2022-05-28T03:43:39.745Z] [INFO] Fork Value is false
23:43:40 [2022-05-28T03:43:40.002Z]      [java] JVM args ignored when same JVM is used.
23:43:44 [2022-05-28T03:43:44.189Z] [INFO] Done SpotBugs Analysis....
23:43:44 [2022-05-28T03:43:44.190Z] [INFO] 
23:43:44 [2022-05-28T03:43:44.190Z] [INFO] --- maven-checkstyle-plugin:3.1.1:check (checkstyle-integration) @ org.eclipse.ease.lang.unittest.test ---
23:43:44 [2022-05-28T03:43:44.190Z] [INFO] You have 0 Checkstyle violations.
23:43:44 [2022-05-28T03:43:44.190Z] [INFO] 
23:43:44 [2022-05-28T03:43:44.190Z] [INFO] --- maven-install-plugin:2.3.1:install (default-install) @ org.eclipse.ease.lang.unittest.test ---
23:43:44 [2022-05-28T03:43:44.190Z] [INFO] Installing /home/jenkins/agent/workspace/ease.verify.core.target.2018-12/tests/org.eclipse.ease.lang.unittest.test/target/org.eclipse.ease.lang.unittest.test-0.9.0-SNAPSHOT.jar to /home/jenkins/.m2/repository/org/eclipse/ease/org.eclipse.ease.lang.unittest.test/0.9.0-SNAPSHOT/org.eclipse.ease.lang.unittest.test-0.9.0-SNAPSHOT.jar
23:43:44 [2022-05-28T03:43:44.190Z] [INFO] Installing /home/jenkins/agent/workspace/ease.verify.core.target.2018-12/tests/org.eclipse.ease.lang.unittest.test/pom.xml to /home/jenkins/.m2/repository/org/eclipse/ease/org.eclipse.ease.lang.unittest.test/0.9.0-SNAPSHOT/org.eclipse.ease.lang.unittest.test-0.9.0-SNAPSHOT.pom
23:43:44 [2022-05-28T03:43:44.190Z] [INFO] Installing /home/jenkins/agent/workspace/ease.verify.core.target.2018-12/tests/org.eclipse.ease.lang.unittest.test/target/p2content.xml to /home/jenkins/.m2/repository/org/eclipse/ease/org.eclipse.ease.lang.unittest.test/0.9.0-SNAPSHOT/org.eclipse.ease.lang.unittest.test-0.9.0-SNAPSHOT-p2metadata.xml
23:43:44 [2022-05-28T03:43:44.190Z] [INFO] Installing /home/jenkins/agent/workspace/ease.verify.core.target.2018-12/tests/org.eclipse.ease.lang.unittest.test/target/p2artifacts.xml to /home/jenkins/.m2/repository/org/eclipse/ease/org.eclipse.ease.lang.unittest.test/0.9.0-SNAPSHOT/org.eclipse.ease.lang.unittest.test-0.9.0-SNAPSHOT-p2artifacts.xml
23:43:44 [2022-05-28T03:43:44.190Z] [INFO] 
23:43:44 [2022-05-28T03:43:44.190Z] [INFO] --- tycho-p2-plugin:2.4.0:update-local-index (default-update-local-index) @ org.eclipse.ease.lang.unittest.test ---
23:43:44 [2022-05-28T03:43:44.190Z] [INFO] 
23:43:44 [2022-05-28T03:43:44.190Z] [INFO] ---------< org.eclipse.ease:org.eclipse.ease.ui.scripts.test >----------
23:43:44 [2022-05-28T03:43:44.190Z] [INFO] Building org.eclipse.ease.ui.scripts.test 0.9.0-SNAPSHOT         [45/49]
23:43:44 [2022-05-28T03:43:44.190Z] [INFO] ------------------------[ eclipse-test-plugin ]-------------------------
23:43:44 [2022-05-28T03:43:44.190Z] [INFO] 
23:43:44 [2022-05-28T03:43:44.190Z] [INFO] --- maven-clean-plugin:2.5:clean (default-clean) @ org.eclipse.ease.ui.scripts.test ---
23:43:44 [2022-05-28T03:43:44.190Z] [INFO] 
23:43:44 [2022-05-28T03:43:44.190Z] [INFO] --- tycho-packaging-plugin:2.4.0:build-qualifier (default-build-qualifier) @ org.eclipse.ease.ui.scripts.test ---
23:43:44 [2022-05-28T03:43:44.190Z] [INFO] The project's OSGi version is 0.9.0.I202106220815
23:43:44 [2022-05-28T03:43:44.190Z] [INFO] 
23:43:44 [2022-05-28T03:43:44.190Z] [INFO] --- tycho-packaging-plugin:2.4.0:validate-id (default-validate-id) @ org.eclipse.ease.ui.scripts.test ---
23:43:44 [2022-05-28T03:43:44.190Z] [INFO] 
23:43:44 [2022-05-28T03:43:44.190Z] [INFO] --- tycho-packaging-plugin:2.4.0:validate-version (default-validate-version) @ org.eclipse.ease.ui.scripts.test ---
23:43:44 [2022-05-28T03:43:44.190Z] [INFO] 
23:43:44 [2022-05-28T03:43:44.191Z] [INFO] --- target-platform-configuration:2.4.0:target-platform (default-target-platform) @ org.eclipse.ease.ui.scripts.test ---
23:43:44 [2022-05-28T03:43:44.191Z] [INFO] 
23:43:44 [2022-05-28T03:43:44.191Z] [INFO] --- maven-resources-plugin:2.4.3:resources (default-resources) @ org.eclipse.ease.ui.scripts.test ---
23:43:44 [2022-05-28T03:43:44.191Z] [INFO] Using 'UTF-8' encoding to copy filtered resources.
23:43:44 [2022-05-28T03:43:44.191Z] [INFO] skip non existing resourceDirectory /home/jenkins/agent/workspace/ease.verify.core.target.2018-12/tests/org.eclipse.ease.ui.scripts.test/src/main/resources
23:43:44 [2022-05-28T03:43:44.191Z] [INFO] 
23:43:44 [2022-05-28T03:43:44.191Z] [INFO] --- tycho-compiler-plugin:2.4.0:compile (default-compile) @ org.eclipse.ease.ui.scripts.test ---
23:43:44 [2022-05-28T03:43:44.191Z] [INFO] Compiling 1 source file to /home/jenkins/agent/workspace/ease.verify.core.target.2018-12/tests/org.eclipse.ease.ui.scripts.test/target/classes
23:43:44 [2022-05-28T03:43:44.191Z] [INFO] 
23:43:44 [2022-05-28T03:43:44.191Z] [INFO] --- maven-resources-plugin:2.4.3:testResources (default-testResources) @ org.eclipse.ease.ui.scripts.test ---
23:43:44 [2022-05-28T03:43:44.191Z] [INFO] Using 'UTF-8' encoding to copy filtered resources.
23:43:44 [2022-05-28T03:43:44.191Z] [INFO] skip non existing resourceDirectory /home/jenkins/agent/workspace/ease.verify.core.target.2018-12/tests/org.eclipse.ease.ui.scripts.test/src/test/resources
23:43:44 [2022-05-28T03:43:44.191Z] [INFO] 
23:43:44 [2022-05-28T03:43:44.191Z] [INFO] --- tycho-packaging-plugin:2.4.0:package-plugin (default-package-plugin) @ org.eclipse.ease.ui.scripts.test ---
23:43:44 [2022-05-28T03:43:44.191Z] [INFO] Building jar: /home/jenkins/agent/workspace/ease.verify.core.target.2018-12/tests/org.eclipse.ease.ui.scripts.test/target/org.eclipse.ease.ui.scripts.test-0.9.0-SNAPSHOT.jar
23:43:44 [2022-05-28T03:43:44.191Z] [INFO] 
23:43:44 [2022-05-28T03:43:44.191Z] [INFO] --- tycho-p2-plugin:2.4.0:p2-metadata-default (default-p2-metadata-default) @ org.eclipse.ease.ui.scripts.test ---
23:43:44 [2022-05-28T03:43:44.191Z] [INFO] 
23:43:44 [2022-05-28T03:43:44.191Z] [INFO] --- jacoco-maven-plugin:0.8.6:prepare-agent (jacoco-initialize) @ org.eclipse.ease.ui.scripts.test ---
23:43:44 [2022-05-28T03:43:44.191Z] [INFO] tycho.testArgLine set to -javaagent:/home/jenkins/.m2/repository/org/jacoco/org.jacoco.agent/0.8.6/org.jacoco.agent-0.8.6-runtime.jar=destfile=/home/jenkins/agent/workspace/ease.verify.core.target.2018-12/tests/org.eclipse.ease.ui.scripts.test/target/jacoco.exec,output=file
23:43:44 [2022-05-28T03:43:44.191Z] [INFO] 
23:43:44 [2022-05-28T03:43:44.191Z] [INFO] --- tycho-surefire-plugin:2.4.0:test (default-test) @ org.eclipse.ease.ui.scripts.test ---
23:43:44 [2022-05-28T03:43:44.449Z] [INFO] Executing Test Runtime with timeout 0, logs (if any) will be placed at: /home/jenkins/agent/workspace/ease.verify.core.target.2018-12/tests/org.eclipse.ease.ui.scripts.test/target/work/data/.metadata/.log
23:43:44 [2022-05-28T03:43:44.449Z] [INFO] Command line:
23:43:44 [2022-05-28T03:43:44.449Z] 	[/opt/tools/java/openjdk/jdk-15/15.0.2+7/bin/java, -Dosgi.noShutdown=false, -Dosgi.os=linux, -Dosgi.ws=gtk, -Dosgi.arch=x86_64, -javaagent:/home/jenkins/.m2/repository/org/jacoco/org.jacoco.agent/0.8.6/org.jacoco.agent-0.8.6-runtime.jar=destfile=/home/jenkins/agent/workspace/ease.verify.core.target.2018-12/tests/org.eclipse.ease.ui.scripts.test/target/jacoco.exec,output=file, -Dosgi.clean=true, -jar, /home/jenkins/.m2/repository/p2/osgi/bundle/org.eclipse.equinox.launcher/1.6.400.v20210924-0641/org.eclipse.equinox.launcher-1.6.400.v20210924-0641.jar, -data, /home/jenkins/agent/workspace/ease.verify.core.target.2018-12/tests/org.eclipse.ease.ui.scripts.test/target/work/data, -install, /home/jenkins/agent/workspace/ease.verify.core.target.2018-12/tests/org.eclipse.ease.ui.scripts.test/target/work, -configuration, /home/jenkins/agent/workspace/ease.verify.core.target.2018-12/tests/org.eclipse.ease.ui.scripts.test/target/work/configuration, -application, org.eclipse.tycho.surefire.osgibooter.headlesstest, -testproperties, /home/jenkins/agent/workspace/ease.verify.core.target.2018-12/tests/org.eclipse.ease.ui.scripts.test/target/surefire.properties]
23:43:44 [2022-05-28T03:43:44.449Z] Picked up JAVA_TOOL_OPTIONS: -Dmaven.ext.class.path="/home/jenkins/agent/workspace/ease.verify.core.target.2018-12@tmp/withMavenf46734fb/pipeline-maven-spy.jar" -Dorg.jenkinsci.plugins.pipeline.maven.reportsFolder="/home/jenkins/agent/workspace/ease.verify.core.target.2018-12@tmp/withMavenf46734fb" 
23:43:48 [2022-05-28T03:43:48.690Z] Running org.eclipse.ease.ui.scripts.expressions.definitions.ExpressionFactoryTest
23:43:48 [2022-05-28T03:43:48.690Z] Tests run: 14, Failures: 0, Errors: 0, Skipped: 0, Time elapsed: 0.085 s - in org.eclipse.ease.ui.scripts.expressions.definitions.ExpressionFactoryTest
23:43:48 [2022-05-28T03:43:48.690Z] loadClassWithExpression  Time elapsed: 0.042 s
23:43:48 [2022-05-28T03:43:48.690Z] createWithExpression  Time elapsed: 0.001 s
23:43:48 [2022-05-28T03:43:48.690Z] createReferenceExpression  Time elapsed: 0.001 s
23:43:48 [2022-05-28T03:43:48.690Z] loadClassReferenceExpression  Time elapsed: 0 s
23:43:48 [2022-05-28T03:43:48.690Z] loadClassTestExpression  Time elapsed: 0.002 s
23:43:48 [2022-05-28T03:43:48.690Z] createEqualsExpression  Time elapsed: 0.001 s
23:43:48 [2022-05-28T03:43:48.690Z] loadClassCountExpression  Time elapsed: 0.001 s
23:43:48 [2022-05-28T03:43:48.690Z] loadClassOrExpression  Time elapsed: 0.001 s
23:43:48 [2022-05-28T03:43:48.690Z] createTestExpression  Time elapsed: 0.005 s
23:43:48 [2022-05-28T03:43:48.690Z] createOrExpression  Time elapsed: 0.002 s
23:43:48 [2022-05-28T03:43:48.690Z] loadClassAndExpression  Time elapsed: 0 s
23:43:48 [2022-05-28T03:43:48.690Z] createAndExpression  Time elapsed: 0 s
23:43:48 [2022-05-28T03:43:48.690Z] loadClassEqualsExpression  Time elapsed: 0 s
23:43:48 [2022-05-28T03:43:48.690Z] createCountExpression  Time elapsed: 0.001 s
23:43:48 [2022-05-28T03:43:48.690Z] 
23:43:48 [2022-05-28T03:43:48.690Z] Results:
23:43:48 [2022-05-28T03:43:48.690Z] 
23:43:48 [2022-05-28T03:43:48.690Z] Tests run: 14, Failures: 0, Errors: 0, Skipped: 0
23:43:48 [2022-05-28T03:43:48.690Z] 
23:43:48 [2022-05-28T03:43:48.690Z] [INFO] All tests passed!
23:43:48 [2022-05-28T03:43:48.690Z] [INFO] 
23:43:48 [2022-05-28T03:43:48.690Z] [INFO] --- maven-pmd-plugin:3.16.0:pmd (pmd-integration) @ org.eclipse.ease.ui.scripts.test ---
23:43:48 [2022-05-28T03:43:48.690Z] [INFO] PMD version: 6.42.0
23:43:48 [2022-05-28T03:43:48.947Z] [INFO] 
23:43:48 [2022-05-28T03:43:48.947Z] [INFO] --- maven-pmd-plugin:3.16.0:cpd (pmd-integration) @ org.eclipse.ease.ui.scripts.test ---
23:43:48 [2022-05-28T03:43:48.947Z] [INFO] PMD version: 6.42.0
23:43:48 [2022-05-28T03:43:48.947Z] [INFO] 
23:43:48 [2022-05-28T03:43:48.947Z] [INFO] --- spotbugs-maven-plugin:4.1.4:spotbugs (spotbugs-integration) @ org.eclipse.ease.ui.scripts.test ---
23:43:48 [2022-05-28T03:43:48.947Z] [INFO] Fork Value is false
23:43:49 [2022-05-28T03:43:49.204Z]      [java] JVM args ignored when same JVM is used.
23:43:51 [2022-05-28T03:43:51.738Z] [INFO] Done SpotBugs Analysis....
23:43:51 [2022-05-28T03:43:51.738Z] [INFO] 
23:43:51 [2022-05-28T03:43:51.738Z] [INFO] --- maven-checkstyle-plugin:3.1.1:check (checkstyle-integration) @ org.eclipse.ease.ui.scripts.test ---
23:43:51 [2022-05-28T03:43:51.738Z] [INFO] You have 0 Checkstyle violations.
23:43:51 [2022-05-28T03:43:51.738Z] [INFO] 
23:43:51 [2022-05-28T03:43:51.738Z] [INFO] --- maven-install-plugin:2.3.1:install (default-install) @ org.eclipse.ease.ui.scripts.test ---
23:43:51 [2022-05-28T03:43:51.738Z] [INFO] Installing /home/jenkins/agent/workspace/ease.verify.core.target.2018-12/tests/org.eclipse.ease.ui.scripts.test/target/org.eclipse.ease.ui.scripts.test-0.9.0-SNAPSHOT.jar to /home/jenkins/.m2/repository/org/eclipse/ease/org.eclipse.ease.ui.scripts.test/0.9.0-SNAPSHOT/org.eclipse.ease.ui.scripts.test-0.9.0-SNAPSHOT.jar
23:43:51 [2022-05-28T03:43:51.738Z] [INFO] Installing /home/jenkins/agent/workspace/ease.verify.core.target.2018-12/tests/org.eclipse.ease.ui.scripts.test/pom.xml to /home/jenkins/.m2/repository/org/eclipse/ease/org.eclipse.ease.ui.scripts.test/0.9.0-SNAPSHOT/org.eclipse.ease.ui.scripts.test-0.9.0-SNAPSHOT.pom
23:43:51 [2022-05-28T03:43:51.738Z] [INFO] Installing /home/jenkins/agent/workspace/ease.verify.core.target.2018-12/tests/org.eclipse.ease.ui.scripts.test/target/p2content.xml to /home/jenkins/.m2/repository/org/eclipse/ease/org.eclipse.ease.ui.scripts.test/0.9.0-SNAPSHOT/org.eclipse.ease.ui.scripts.test-0.9.0-SNAPSHOT-p2metadata.xml
23:43:51 [2022-05-28T03:43:51.738Z] [INFO] Installing /home/jenkins/agent/workspace/ease.verify.core.target.2018-12/tests/org.eclipse.ease.ui.scripts.test/target/p2artifacts.xml to /home/jenkins/.m2/repository/org/eclipse/ease/org.eclipse.ease.ui.scripts.test/0.9.0-SNAPSHOT/org.eclipse.ease.ui.scripts.test-0.9.0-SNAPSHOT-p2artifacts.xml
23:43:51 [2022-05-28T03:43:51.738Z] [INFO] 
23:43:51 [2022-05-28T03:43:51.738Z] [INFO] --- tycho-p2-plugin:2.4.0:update-local-index (default-update-local-index) @ org.eclipse.ease.ui.scripts.test ---
23:43:51 [2022-05-28T03:43:51.739Z] [INFO] 
23:43:51 [2022-05-28T03:43:51.739Z] [INFO] -------------< org.eclipse.ease:org.eclipse.ease.ui.test >--------------
23:43:51 [2022-05-28T03:43:51.739Z] [INFO] Building org.eclipse.ease.ui.test 0.9.0-SNAPSHOT                 [46/49]
23:43:51 [2022-05-28T03:43:51.739Z] [INFO] ------------------------[ eclipse-test-plugin ]-------------------------
23:43:51 [2022-05-28T03:43:51.739Z] [INFO] 
23:43:51 [2022-05-28T03:43:51.739Z] [INFO] --- maven-clean-plugin:2.5:clean (default-clean) @ org.eclipse.ease.ui.test ---
23:43:51 [2022-05-28T03:43:51.739Z] [INFO] 
23:43:51 [2022-05-28T03:43:51.739Z] [INFO] --- tycho-packaging-plugin:2.4.0:build-qualifier (default-build-qualifier) @ org.eclipse.ease.ui.test ---
23:43:51 [2022-05-28T03:43:51.739Z] [INFO] The project's OSGi version is 0.9.0.I202205091123
23:43:51 [2022-05-28T03:43:51.739Z] [INFO] 
23:43:51 [2022-05-28T03:43:51.739Z] [INFO] --- tycho-packaging-plugin:2.4.0:validate-id (default-validate-id) @ org.eclipse.ease.ui.test ---
23:43:51 [2022-05-28T03:43:51.739Z] [INFO] 
23:43:51 [2022-05-28T03:43:51.739Z] [INFO] --- tycho-packaging-plugin:2.4.0:validate-version (default-validate-version) @ org.eclipse.ease.ui.test ---
23:43:51 [2022-05-28T03:43:51.739Z] [INFO] 
23:43:51 [2022-05-28T03:43:51.739Z] [INFO] --- target-platform-configuration:2.4.0:target-platform (default-target-platform) @ org.eclipse.ease.ui.test ---
23:43:51 [2022-05-28T03:43:51.739Z] [INFO] 
23:43:51 [2022-05-28T03:43:51.739Z] [INFO] --- maven-resources-plugin:2.4.3:resources (default-resources) @ org.eclipse.ease.ui.test ---
23:43:51 [2022-05-28T03:43:51.739Z] [INFO] Using 'UTF-8' encoding to copy filtered resources.
23:43:51 [2022-05-28T03:43:51.739Z] [INFO] skip non existing resourceDirectory /home/jenkins/agent/workspace/ease.verify.core.target.2018-12/tests/org.eclipse.ease.ui.test/src/main/resources
23:43:51 [2022-05-28T03:43:51.739Z] [INFO] 
23:43:51 [2022-05-28T03:43:51.739Z] [INFO] --- tycho-compiler-plugin:2.4.0:compile (default-compile) @ org.eclipse.ease.ui.test ---
23:43:51 [2022-05-28T03:43:51.739Z] [INFO] Compiling 32 source files to /home/jenkins/agent/workspace/ease.verify.core.target.2018-12/tests/org.eclipse.ease.ui.test/target/classes
23:43:52 [2022-05-28T03:43:52.345Z] [INFO] 
23:43:52 [2022-05-28T03:43:52.345Z] [INFO] --- maven-resources-plugin:2.4.3:testResources (default-testResources) @ org.eclipse.ease.ui.test ---
23:43:52 [2022-05-28T03:43:52.345Z] [INFO] Using 'UTF-8' encoding to copy filtered resources.
23:43:52 [2022-05-28T03:43:52.345Z] [INFO] skip non existing resourceDirectory /home/jenkins/agent/workspace/ease.verify.core.target.2018-12/tests/org.eclipse.ease.ui.test/src/test/resources
23:43:52 [2022-05-28T03:43:52.345Z] [INFO] 
23:43:52 [2022-05-28T03:43:52.346Z] [INFO] --- tycho-packaging-plugin:2.4.0:package-plugin (default-package-plugin) @ org.eclipse.ease.ui.test ---
23:43:52 [2022-05-28T03:43:52.346Z] [INFO] Building jar: /home/jenkins/agent/workspace/ease.verify.core.target.2018-12/tests/org.eclipse.ease.ui.test/target/org.eclipse.ease.ui.test-0.9.0-SNAPSHOT.jar
23:43:52 [2022-05-28T03:43:52.346Z] [INFO] 
23:43:52 [2022-05-28T03:43:52.346Z] [INFO] --- tycho-p2-plugin:2.4.0:p2-metadata-default (default-p2-metadata-default) @ org.eclipse.ease.ui.test ---
23:43:52 [2022-05-28T03:43:52.346Z] [INFO] 
23:43:52 [2022-05-28T03:43:52.346Z] [INFO] --- jacoco-maven-plugin:0.8.6:prepare-agent (jacoco-initialize) @ org.eclipse.ease.ui.test ---
23:43:52 [2022-05-28T03:43:52.346Z] [INFO] tycho.testArgLine set to -javaagent:/home/jenkins/.m2/repository/org/jacoco/org.jacoco.agent/0.8.6/org.jacoco.agent-0.8.6-runtime.jar=destfile=/home/jenkins/agent/workspace/ease.verify.core.target.2018-12/tests/org.eclipse.ease.ui.test/target/jacoco.exec,output=file
23:43:52 [2022-05-28T03:43:52.346Z] [INFO] 
23:43:52 [2022-05-28T03:43:52.346Z] [INFO] --- tycho-surefire-plugin:2.4.0:test (default-test) @ org.eclipse.ease.ui.test ---
23:43:52 [2022-05-28T03:43:52.346Z] [INFO] Executing Test Runtime with timeout 0, logs (if any) will be placed at: /home/jenkins/agent/workspace/ease.verify.core.target.2018-12/tests/org.eclipse.ease.ui.test/target/work/data/.metadata/.log
23:43:52 [2022-05-28T03:43:52.346Z] [INFO] Command line:
23:43:52 [2022-05-28T03:43:52.346Z] 	[/opt/tools/java/openjdk/jdk-15/15.0.2+7/bin/java, -Dosgi.noShutdown=false, -Dosgi.os=linux, -Dosgi.ws=gtk, -Dosgi.arch=x86_64, -javaagent:/home/jenkins/.m2/repository/org/jacoco/org.jacoco.agent/0.8.6/org.jacoco.agent-0.8.6-runtime.jar=destfile=/home/jenkins/agent/workspace/ease.verify.core.target.2018-12/tests/org.eclipse.ease.ui.test/target/jacoco.exec,output=file, -Dosgi.clean=true, -jar, /home/jenkins/.m2/repository/p2/osgi/bundle/org.eclipse.equinox.launcher/1.6.400.v20210924-0641/org.eclipse.equinox.launcher-1.6.400.v20210924-0641.jar, -data, /home/jenkins/agent/workspace/ease.verify.core.target.2018-12/tests/org.eclipse.ease.ui.test/target/work/data, -install, /home/jenkins/agent/workspace/ease.verify.core.target.2018-12/tests/org.eclipse.ease.ui.test/target/work, -configuration, /home/jenkins/agent/workspace/ease.verify.core.target.2018-12/tests/org.eclipse.ease.ui.test/target/work/configuration, -application, org.eclipse.tycho.surefire.osgibooter.headlesstest, -testproperties, /home/jenkins/agent/workspace/ease.verify.core.target.2018-12/tests/org.eclipse.ease.ui.test/target/surefire.properties]
23:43:52 [2022-05-28T03:43:52.346Z] Picked up JAVA_TOOL_OPTIONS: -Dmaven.ext.class.path="/home/jenkins/agent/workspace/ease.verify.core.target.2018-12@tmp/withMavenf46734fb/pipeline-maven-spy.jar" -Dorg.jenkinsci.plugins.pipeline.maven.reportsFolder="/home/jenkins/agent/workspace/ease.verify.core.target.2018-12@tmp/withMavenf46734fb" 
23:43:57 [2022-05-28T03:43:57.624Z] Running org.eclipse.ease.ui.completion.CodeCompletionAggregatorTest
23:43:57 [2022-05-28T03:43:57.624Z] Tests run: 4, Failures: 0, Errors: 0, Skipped: 0, Time elapsed: 0.858 s - in org.eclipse.ease.ui.completion.CodeCompletionAggregatorTest
23:43:57 [2022-05-28T03:43:57.624Z] context_for_empty_input  Time elapsed: 0.825 s
23:43:57 [2022-05-28T03:43:57.624Z] context_for_root_package_with_suffix  Time elapsed: 0.003 s
23:43:57 [2022-05-28T03:43:57.624Z] getProposals_contains_proposal_from_local_provider  Time elapsed: 0.004 s
23:43:57 [2022-05-28T03:43:57.624Z] context_for_root_package  Time elapsed: 0.002 s
23:43:57 [2022-05-28T03:43:57.624Z] Running org.eclipse.ease.ui.completion.provider.AbstractCompletionProviderTest
23:43:57 [2022-05-28T03:43:57.892Z] Tests run: 16, Failures: 0, Errors: 0, Skipped: 0, Time elapsed: 0.143 s - in org.eclipse.ease.ui.completion.provider.AbstractCompletionProviderTest
23:43:57 [2022-05-28T03:43:57.892Z] isStringParameter_equals_true{String}[1]  Time elapsed: 0.026 s
23:43:57 [2022-05-28T03:43:57.892Z] isStringParameter_equals_true{String}[2]  Time elapsed: 0.001 s
23:43:57 [2022-05-28T03:43:57.892Z] isStringParameter_equals_true{String}[3]  Time elapsed: 0.002 s
23:43:57 [2022-05-28T03:43:57.892Z] isStringParameter_equals_true{String}[4]  Time elapsed: 0.002 s
23:43:57 [2022-05-28T03:43:57.892Z] isMethodParameter_equals_true  Time elapsed: 0.001 s
23:43:57 [2022-05-28T03:43:57.892Z] isMethodParameter_equals_true_for_2nd_parameter  Time elapsed: 0.001 s
23:43:57 [2022-05-28T03:43:57.892Z] isValid_equals_false_for_invalid_context  Time elapsed: 0.029 s
23:43:57 [2022-05-28T03:43:57.892Z] isStringParameter_equals_false{String}[1]  Time elapsed: 0.001 s
23:43:57 [2022-05-28T03:43:57.892Z] isStringParameter_equals_false{String}[2]  Time elapsed: 0.001 s
23:43:57 [2022-05-28T03:43:57.892Z] isStringParameter_equals_false{String}[3]  Time elapsed: 0 s
23:43:57 [2022-05-28T03:43:57.892Z] isStringParameter_equals_false{String}[4]  Time elapsed: 0 s
23:43:57 [2022-05-28T03:43:57.892Z] isStringParameter_equals_false{String}[5]  Time elapsed: 0.001 s
23:43:57 [2022-05-28T03:43:57.892Z] isMethodParameter_equals_false_when_no_method_is_detected  Time elapsed: 0.001 s
23:43:57 [2022-05-28T03:43:57.892Z] isValid_equals_true_for_valid_context  Time elapsed: 0 s
23:43:57 [2022-05-28T03:43:57.892Z] isMethodParameter_equals_false_for_wrong_method_name  Time elapsed: 0.001 s
23:43:57 [2022-05-28T03:43:57.892Z] isMethodParameter_equals_false_for_wrong_parameter_index  Time elapsed: 0.001 s
23:43:57 [2022-05-28T03:43:57.892Z] Running org.eclipse.ease.ui.completion.provider.VariablesCompletionProviderTest
23:43:58 [2022-05-28T03:43:58.458Z] Tests run: 18, Failures: 0, Errors: 0, Skipped: 0, Time elapsed: 0.467 s - in org.eclipse.ease.ui.completion.provider.VariablesCompletionProviderTest
23:43:58 [2022-05-28T03:43:58.458Z] prepareProposals_instance_contains_integer_variable  Time elapsed: 0.41 s
23:43:58 [2022-05-28T03:43:58.458Z] prepareProposals_instance_contains_string_variable  Time elapsed: 0.001 s
23:43:58 [2022-05-28T03:43:58.458Z] prepareProposals_instance_contains_string_variable_for_filter_input_case_insensitive  Time elapsed: 0.001 s
23:43:58 [2022-05-28T03:43:58.458Z] prepareProposals_instance_contains_string_variable_for_filter_input  Time elapsed: 0.001 s
23:43:58 [2022-05-28T03:43:58.458Z] prepareProposals_does_not_contain_internal_variable  Time elapsed: 0.001 s
23:43:58 [2022-05-28T03:43:58.458Z] isActive_equals_false{String}[1]  Time elapsed: 0.001 s
23:43:58 [2022-05-28T03:43:58.458Z] isActive_equals_false{String}[2]  Time elapsed: 0.002 s
23:43:58 [2022-05-28T03:43:58.458Z] isActive_equals_false{String}[3]  Time elapsed: 0.001 s
23:43:58 [2022-05-28T03:43:58.458Z] isActive_equals_false{String}[4]  Time elapsed: 0.002 s
23:43:58 [2022-05-28T03:43:58.459Z] isActive_equals_false{String}[5]  Time elapsed: 0.002 s
23:43:58 [2022-05-28T03:43:58.459Z] isActive_equals_true{String}[1]  Time elapsed: 0.001 s
23:43:58 [2022-05-28T03:43:58.459Z] isActive_equals_true{String}[2]  Time elapsed: 0.002 s
23:43:58 [2022-05-28T03:43:58.459Z] isActive_equals_true{String}[3]  Time elapsed: 0.001 s
23:43:58 [2022-05-28T03:43:58.459Z] isActive_equals_true{String}[4]  Time elapsed: 0.002 s
23:43:58 [2022-05-28T03:43:58.459Z] isActive_equals_true{String}[5]  Time elapsed: 0.002 s
23:43:58 [2022-05-28T03:43:58.459Z] isActive_equals_true{String}[6]  Time elapsed: 0.002 s
23:43:58 [2022-05-28T03:43:58.459Z] isActive_equals_true{String}[7]  Time elapsed: 0.001 s
23:43:58 [2022-05-28T03:43:58.459Z] isActive_equals_true{String}[8]  Time elapsed: 0.002 s
23:43:58 [2022-05-28T03:43:58.459Z] Running org.eclipse.ease.ui.completion.provider.LoadModuleCompletionProviderTest
23:43:58 [2022-05-28T03:43:58.459Z] Tests run: 12, Failures: 0, Errors: 0, Skipped: 0, Time elapsed: 0.025 s - in org.eclipse.ease.ui.completion.provider.LoadModuleCompletionProviderTest
23:43:58 [2022-05-28T03:43:58.459Z] getProposals_contains_root_entry_with_absolute_filter  Time elapsed: 0.007 s
23:43:58 [2022-05-28T03:43:58.459Z] getProposals_contains_root_entry_with_relative_filter  Time elapsed: 0.001 s
23:43:58 [2022-05-28T03:43:58.459Z] getProposals_contains_category_with_relative_filter  Time elapsed: 0.001 s
23:43:58 [2022-05-28T03:43:58.459Z] getProposals_does_not_contain_root_entry_on_filter_mismatch  Time elapsed: 0.001 s
23:43:58 [2022-05-28T03:43:58.459Z] isActive_equals_false{String}[1]  Time elapsed: 0.001 s
23:43:58 [2022-05-28T03:43:58.459Z] isActive_equals_false{String}[2]  Time elapsed: 0.001 s
23:43:58 [2022-05-28T03:43:58.459Z] isActive_equals_false{String}[3]  Time elapsed: 0.001 s
23:43:58 [2022-05-28T03:43:58.459Z] getProposals_contains_root_entry  Time elapsed: 0.001 s
23:43:58 [2022-05-28T03:43:58.459Z] isActive_equals_true{String}[1]  Time elapsed: 0.001 s
23:43:58 [2022-05-28T03:43:58.459Z] isActive_equals_true{String}[2]  Time elapsed: 0.001 s
23:43:58 [2022-05-28T03:43:58.459Z] getProposals_contains_child_entry_with_absolute_filter  Time elapsed: 0.001 s
23:43:58 [2022-05-28T03:43:58.459Z] getProposals_does_not_contain_entry_on_completed_input  Time elapsed: 0.001 s
23:43:58 [2022-05-28T03:43:58.459Z] Running org.eclipse.ease.ui.completion.provider.AbstractPathCompletionProviderTest
23:43:58 [2022-05-28T03:43:58.459Z] Tests run: 11, Failures: 0, Errors: 0, Skipped: 0, Time elapsed: 0.008 s - in org.eclipse.ease.ui.completion.provider.AbstractPathCompletionProviderTest
23:43:58 [2022-05-28T03:43:58.459Z] filter_keeps_only_lower_level_on_matching_filter  Time elapsed: 0.003 s
23:43:58 [2022-05-28T03:43:58.459Z] filter_removes_nothing_if_context_is_empty  Time elapsed: 0 s
23:43:58 [2022-05-28T03:43:58.459Z] getPathsFromElements_is_empty_for_root_elements_only  Time elapsed: 0.001 s
23:43:58 [2022-05-28T03:43:58.459Z] filter_keeps_only_1st_level_on_empty_filter  Time elapsed: 0 s
23:43:58 [2022-05-28T03:43:58.459Z] filter_keeps_only_1st_level_on_matching_filter  Time elapsed: 0 s
23:43:58 [2022-05-28T03:43:58.459Z] getPathsFromElements_is_empty_for_empty_element  Time elapsed: 0 s
23:43:58 [2022-05-28T03:43:58.459Z] filter_removes_mismatches_on_same_level  Time elapsed: 0 s
23:43:58 [2022-05-28T03:43:58.459Z] filter_matches_next_level  Time elapsed: 0.001 s
23:43:58 [2022-05-28T03:43:58.459Z] filter_matches_relative_paths  Time elapsed: 0 s
23:43:58 [2022-05-28T03:43:58.459Z] getPathsFromElements_contains_parent_paths  Time elapsed: 0 s
23:43:58 [2022-05-28T03:43:58.459Z] getPathsFromElements_contains_all_hierarchies  Time elapsed: 0 s
23:43:58 [2022-05-28T03:43:58.459Z] Running org.eclipse.ease.ui.completion.provider.LoadedModuleCompletionProviderTest
23:43:58 [2022-05-28T03:43:58.459Z] Tests run: 15, Failures: 0, Errors: 0, Skipped: 0, Time elapsed: 0.034 s - in org.eclipse.ease.ui.completion.provider.LoadedModuleCompletionProviderTest
23:43:58 [2022-05-28T03:43:58.459Z] method_proposal_contains_opening_bracket_when_method_has_mandatory_parameters  Time elapsed: 0.005 s
23:43:58 [2022-05-28T03:43:58.459Z] method_proposal_contains_full_method_call_when_method_has_only_optional_parameters  Time elapsed: 0.004 s
23:43:58 [2022-05-28T03:43:58.459Z] getProposals_contains_constant_methods  Time elapsed: 0.003 s
23:43:58 [2022-05-28T03:43:58.459Z] getProposals_contains_module_methods  Time elapsed: 0.004 s
23:43:58 [2022-05-28T03:43:58.459Z] isActive_equals_false{String}[1]  Time elapsed: 0.001 s
23:43:58 [2022-05-28T03:43:58.459Z] isActive_equals_false{String}[2]  Time elapsed: 0 s
23:43:58 [2022-05-28T03:43:58.459Z] isActive_equals_false{String}[3]  Time elapsed: 0 s
23:43:58 [2022-05-28T03:43:58.459Z] isActive_equals_false{String}[4]  Time elapsed: 0.001 s
23:43:58 [2022-05-28T03:43:58.459Z] isActive_equals_true{String}[1]  Time elapsed: 0.001 s
23:43:58 [2022-05-28T03:43:58.459Z] isActive_equals_true{String}[2]  Time elapsed: 0.001 s
23:43:58 [2022-05-28T03:43:58.459Z] isActive_equals_true{String}[3]  Time elapsed: 0.001 s
23:43:58 [2022-05-28T03:43:58.459Z] isActive_equals_true{String}[4]  Time elapsed: 0 s
23:43:58 [2022-05-28T03:43:58.459Z] isActive_equals_true{String}[5]  Time elapsed: 0.001 s
23:43:58 [2022-05-28T03:43:58.459Z] isActive_equals_true{String}[6]  Time elapsed: 0.001 s
23:43:58 [2022-05-28T03:43:58.459Z] method_proposal_contains_full_method_call_when_method_has_no_parameters  Time elapsed: 0.004 s
23:43:58 [2022-05-28T03:43:58.459Z] Running org.eclipse.ease.ui.completion.provider.LocationResolverTest
23:43:58 [2022-05-28T03:43:58.459Z] Tests run: 1, Failures: 0, Errors: 0, Skipped: 0, Time elapsed: 0.004 s - in org.eclipse.ease.ui.completion.provider.LocationResolverTest
23:43:58 [2022-05-28T03:43:58.459Z] getParentString_has_no_trailing_slashes  Time elapsed: 0.003 s
23:43:58 [2022-05-28T03:43:58.459Z] Running org.eclipse.ease.ui.completion.provider.AbstractFileLocationCompletionProviderTest
23:43:58 [2022-05-28T03:43:58.737Z] Tests run: 22, Failures: 0, Errors: 0, Skipped: 0, Time elapsed: 0.173 s - in org.eclipse.ease.ui.completion.provider.AbstractFileLocationCompletionProviderTest
23:43:58 [2022-05-28T03:43:58.737Z] getProposals_does_not_contain_back_proposal_for_project  Time elapsed: 0.133 s
23:43:58 [2022-05-28T03:43:58.737Z] getProposals_does_not_contain_project_root_with_file_resource  Time elapsed: 0.001 s
23:43:58 [2022-05-28T03:43:58.737Z] getProposals_contains_project_root_files_for_project_root  Time elapsed: 0 s
23:43:58 [2022-05-28T03:43:58.737Z] getProposals_contains_files_for_workspace_folder  Time elapsed: 0 s
23:43:58 [2022-05-28T03:43:58.737Z] getProposals_contains_back_for_workspace_folder  Time elapsed: 0.001 s
23:43:58 [2022-05-28T03:43:58.737Z] getProposals_contains_root_file_systems  Time elapsed: 0 s
23:43:58 [2022-05-28T03:43:58.737Z] getProposals_contains_files_for_project  Time elapsed: 0 s
23:43:58 [2022-05-28T03:43:58.737Z] back_proposal_contains_correct_replacement_string_for_absolute_workspace_folder_link  Time elapsed: 0.001 s
23:43:58 [2022-05-28T03:43:58.737Z] getProposals_does_not_contain_project_root_without_resource  Time elapsed: 0 s
23:43:58 [2022-05-28T03:43:58.737Z] getProposals_contains_project_root_with_workspace_resource  Time elapsed: 0 s
23:43:58 [2022-05-28T03:43:58.737Z] getProposals_contains_back_for_project_folder  Time elapsed: 0 s
23:43:58 [2022-05-28T03:43:58.737Z] getProposals_contains_project_root_folders_for_workspace_project_with_back_path  Time elapsed: 0 s
23:43:58 [2022-05-28T03:43:58.737Z] getProposals_contains_projects_for_workspace_root  Time elapsed: 0 s
23:43:58 [2022-05-28T03:43:58.737Z] getProposals_contains_project_root_folders_for_workspace_project  Time elapsed: 0 s
23:43:58 [2022-05-28T03:43:58.737Z] getProposals_contains_filesystem_root  Time elapsed: 0 s
23:43:58 [2022-05-28T03:43:58.737Z] getProposals_contains_files_for_project_folder  Time elapsed: 0 s
23:43:58 [2022-05-28T03:43:58.737Z] getProposals_contains_workspace_root  Time elapsed: 0.001 s
23:43:58 [2022-05-28T03:43:58.737Z] getProposals_does_not_contain_back_proposal  Time elapsed: 0 s
23:43:58 [2022-05-28T03:43:58.737Z] getProposals_contains_files_for_filesystem  Time elapsed: 0.007 s
23:43:58 [2022-05-28T03:43:58.737Z] getProposals_contains_project_root_files_for_workspace_project  Time elapsed: 0 s
23:43:58 [2022-05-28T03:43:58.737Z] getProposals_contains_back_for_filesystem  Time elapsed: 0.001 s
23:43:58 [2022-05-28T03:43:58.737Z] back_proposal_contains_correct_replacement_string_for_relative_workspace_folder_link  Time elapsed: 0.001 s
23:43:58 [2022-05-28T03:43:58.737Z] Running org.eclipse.ease.ui.completion.tokenizer.TokenListTest
23:43:58 [2022-05-28T03:43:58.737Z] Tests run: 1, Failures: 0, Errors: 0, Skipped: 0, Time elapsed: 0.001 s - in org.eclipse.ease.ui.completion.tokenizer.TokenListTest
23:43:58 [2022-05-28T03:43:58.737Z] new_TokenList_is_empty  Time elapsed: 0 s
23:43:58 [2022-05-28T03:43:58.737Z] Running org.eclipse.ease.ui.completion.tokenizer.BracketMatcherTest
23:43:58 [2022-05-28T03:43:58.737Z] Tests run: 9, Failures: 0, Errors: 0, Skipped: 0, Time elapsed: 0.003 s - in org.eclipse.ease.ui.completion.tokenizer.BracketMatcherTest
23:43:58 [2022-05-28T03:43:58.737Z] getOpenBrackets_returns_open_brackets_only  Time elapsed: 0 s
23:43:58 [2022-05-28T03:43:58.737Z] getBrackets_detects_1  Time elapsed: 0.001 s
23:43:58 [2022-05-28T03:43:58.737Z] getBrackets_detects_2  Time elapsed: 0 s
23:43:58 [2022-05-28T03:43:58.737Z] getBrackets_detects_3  Time elapsed: 0 s
23:43:58 [2022-05-28T03:43:58.737Z] hasOpenBrackets_equals_true  Time elapsed: 0.001 s
23:43:58 [2022-05-28T03:43:58.737Z] getBrackets_is_empty  Time elapsed: 0 s
23:43:58 [2022-05-28T03:43:58.737Z] hasOpenBrackets_equals_false  Time elapsed: 0 s
23:43:58 [2022-05-28T03:43:58.737Z] getBrackets_detects_open_brackets  Time elapsed: 0.001 s
23:43:58 [2022-05-28T03:43:58.737Z] getBrackets_detects_nested  Time elapsed: 0 s
23:43:58 [2022-05-28T03:43:58.737Z] Running org.eclipse.ease.ui.completion.tokenizer.InputTokenizerTest
23:43:58 [2022-05-28T03:43:58.737Z] Tests run: 68, Failures: 0, Errors: 0, Skipped: 0, Time elapsed: 0.1 s - in org.eclipse.ease.ui.completion.tokenizer.InputTokenizerTest
23:43:58 [2022-05-28T03:43:58.737Z] getTokens_detects_method_chaining  Time elapsed: 0.002 s
23:43:58 [2022-05-28T03:43:58.737Z] isDelimiter_equals_true{String}[1]  Time elapsed: 0 s
23:43:58 [2022-05-28T03:43:58.737Z] isDelimiter_equals_true{String}[2]  Time elapsed: 0 s
23:43:58 [2022-05-28T03:43:58.738Z] isDelimiter_equals_true{String}[3]  Time elapsed: 0 s
23:43:58 [2022-05-28T03:43:58.738Z] isDelimiter_equals_true{String}[4]  Time elapsed: 0 s
23:43:58 [2022-05-28T03:43:58.738Z] isDelimiter_equals_true{String}[5]  Time elapsed: 0.001 s
23:43:58 [2022-05-28T03:43:58.738Z] isDelimiter_equals_true{String}[6]  Time elapsed: 0.001 s
23:43:58 [2022-05-28T03:43:58.738Z] isDelimiter_equals_true{String}[7]  Time elapsed: 0 s
23:43:58 [2022-05-28T03:43:58.738Z] getTokens_detects_package_fragments  Time elapsed: 0 s
23:43:58 [2022-05-28T03:43:58.738Z] getTokens_detects_javascript_method_call  Time elapsed: 0.001 s
23:43:58 [2022-05-28T03:43:58.738Z] getTokens_detects_incomplete_package  Time elapsed: 0 s
23:43:58 [2022-05-28T03:43:58.738Z] getTokens_detects_module_methods_call_chain  Time elapsed: 0.001 s
23:43:58 [2022-05-28T03:43:58.738Z] getTokens_splits_string_literal  Time elapsed: 0.001 s
23:43:58 [2022-05-28T03:43:58.738Z] getTokens_detects_static_method_call  Time elapsed: 0 s
23:43:58 [2022-05-28T03:43:58.738Z] getTokens_detects_method_call_chain  Time elapsed: 0 s
23:43:58 [2022-05-28T03:43:58.738Z] getTokens_simplifies_multiply_operations  Time elapsed: 0 s
23:43:58 [2022-05-28T03:43:58.738Z] getTokens_detects_method_call_parameter_prefix  Time elapsed: 0.001 s
23:43:58 [2022-05-28T03:43:58.738Z] getTokens_detects_method_call_parameters_with_prefix  Time elapsed: 0 s
23:43:58 [2022-05-28T03:43:58.738Z] getTokens_detects_package  Time elapsed: 0 s
23:43:58 [2022-05-28T03:43:58.738Z] getTokens_detects_partial_package  Time elapsed: 0.001 s
23:43:58 [2022-05-28T03:43:58.738Z] getTokens_simplifies_plus_operations  Time elapsed: 0 s
23:43:58 [2022-05-28T03:43:58.738Z] getTokens_detects_class  Time elapsed: 0.034 s
23:43:58 [2022-05-28T03:43:58.738Z] getTokens_detects_opened_module_method  Time elapsed: 0.002 s
23:43:58 [2022-05-28T03:43:58.738Z] getTokens_simplifies_brackets_recursively  Time elapsed: 0 s
23:43:58 [2022-05-28T03:43:58.738Z] getTokens_detects_method_call_parameter  Time elapsed: 0 s
23:43:58 [2022-05-28T03:43:58.738Z] getTokens_simplifies_brackets  Time elapsed: 0.01 s
23:43:58 [2022-05-28T03:43:58.738Z] getTokens_removes_new_operator  Time elapsed: 0 s
23:43:58 [2022-05-28T03:43:58.738Z] isDelimiter_equals_false{String}[1]  Time elapsed: 0 s
23:43:58 [2022-05-28T03:43:58.738Z] isDelimiter_equals_false{String}[2]  Time elapsed: 0 s
23:43:58 [2022-05-28T03:43:58.738Z] isDelimiter_equals_false{String}[3]  Time elapsed: 0 s
23:43:58 [2022-05-28T03:43:58.738Z] getTokens_detects_method_call_parameters  Time elapsed: 0 s
23:43:58 [2022-05-28T03:43:58.738Z] getTokens_detects_class_instantiation  Time elapsed: 0.001 s
23:43:58 [2022-05-28T03:43:58.738Z] getTokens_detects_method_call  Time elapsed: 0 s
23:43:58 [2022-05-28T03:43:58.738Z] getTokens_simplifies_divide_operations  Time elapsed: 0 s
23:43:58 [2022-05-28T03:43:58.738Z] getTokens_removes_left_hand_side_of_assignment  Time elapsed: 0.001 s
23:43:58 [2022-05-28T03:43:58.738Z] getTokens_detects_javascript_class_instantiation  Time elapsed: 0 s
23:43:58 [2022-05-28T03:43:58.738Z] getTokens_simplifies_for_loop  Time elapsed: 0.001 s
23:43:58 [2022-05-28T03:43:58.738Z] getTokens_detects_resolved_javascript_variable_2  Time elapsed: 0.001 s
23:43:58 [2022-05-28T03:43:58.738Z] getTokens_simplifies_minus_operations  Time elapsed: 0.001 s
23:43:58 [2022-05-28T03:43:58.738Z] getTokens_detects_class_instantiation_2  Time elapsed: 0 s
23:43:58 [2022-05-28T03:43:58.738Z] getTokens_detects_class_instantiation_3  Time elapsed: 0 s
23:43:58 [2022-05-28T03:43:58.738Z] getTokens_simplifies_assignments  Time elapsed: 0 s
23:43:58 [2022-05-28T03:43:58.738Z] getTokens_detects_inner_class  Time elapsed: 0 s
23:43:58 [2022-05-28T03:43:58.738Z] getTokens_detects_static_method_call_with_dot_prefix  Time elapsed: 0 s
23:43:58 [2022-05-28T03:43:58.738Z] getTokens_detects_class_2  Time elapsed: 0.001 s
23:43:58 [2022-05-28T03:43:58.738Z] isTextFilter_equals_false{String}[1]  Time elapsed: 0 s
23:43:58 [2022-05-28T03:43:58.738Z] isTextFilter_equals_false{String}[2]  Time elapsed: 0 s
23:43:58 [2022-05-28T03:43:58.738Z] isTextFilter_equals_false{String}[3]  Time elapsed: 0 s
23:43:58 [2022-05-28T03:43:58.738Z] isTextFilter_equals_false{String}[4]  Time elapsed: 0 s
23:43:58 [2022-05-28T03:43:58.738Z] isTextFilter_equals_false{String}[5]  Time elapsed: 0 s
23:43:58 [2022-05-28T03:43:58.738Z] getTokens_does_not_split_within_string_literal  Time elapsed: 0 s
23:43:58 [2022-05-28T03:43:58.738Z] getTokens_1  Time elapsed: 0 s
23:43:58 [2022-05-28T03:43:58.738Z] isTextFilter_equals_true{String}[1]  Time elapsed: 0 s
23:43:58 [2022-05-28T03:43:58.738Z] isTextFilter_equals_true{String}[2]  Time elapsed: 0 s
23:43:58 [2022-05-28T03:43:58.738Z] getTokens_detects_opened_module_method_with_filter  Time elapsed: 0.001 s
23:43:58 [2022-05-28T03:43:58.738Z] getTokens_detects_method_call_request_with_filter  Time elapsed: 0.001 s
23:43:58 [2022-05-28T03:43:58.738Z] getTokens_for_empty_input  Time elapsed: 0 s
23:43:58 [2022-05-28T03:43:58.738Z] getTokens_detects_package_with_class_prefix  Time elapsed: 0 s
23:43:58 [2022-05-28T03:43:58.738Z] getTokens_detects_module_methods  Time elapsed: 0 s
23:43:58 [2022-05-28T03:43:58.738Z] getTokens_detects_completed_method  Time elapsed: 0 s
23:43:58 [2022-05-28T03:43:58.738Z] getTokens_detects_resolved_javascript_variable_with_method  Time elapsed: 0.001 s
23:43:58 [2022-05-28T03:43:58.738Z] getTokens_detects_resolved_javascript_variable  Time elapsed: 0.001 s
23:43:58 [2022-05-28T03:43:58.738Z] getTokens_simplifies_string_literal_1  Time elapsed: 0.001 s
23:43:58 [2022-05-28T03:43:58.738Z] getTokens_simplifies_string_literal_2  Time elapsed: 0 s
23:43:58 [2022-05-28T03:43:58.738Z] getTokens_is_empty_after_string_literal  Time elapsed: 0.001 s
23:43:58 [2022-05-28T03:43:58.738Z] getTokens_detects_static_method_call_chain  Time elapsed: 0.001 s
23:43:58 [2022-05-28T03:43:58.738Z] getTokens_detects_opened_module_method_with_parameter  Time elapsed: 0 s
23:43:58 [2022-05-28T03:43:58.738Z] getTokens_detects_javascript_object_call  Time elapsed: 0 s
23:43:58 [2022-05-28T03:43:58.738Z] Running org.eclipse.ease.ui.completion.BasicContextTest
23:43:58 [2022-05-28T03:43:58.738Z] Tests run: 12, Failures: 0, Errors: 0, Skipped: 0, Time elapsed: 0.01 s - in org.eclipse.ease.ui.completion.BasicContextTest
23:43:58 [2022-05-28T03:43:58.739Z] isValid_equals_true  Time elapsed: 0.003 s
23:43:58 [2022-05-28T03:43:58.739Z] getScriptEngine_returns_engine  Time elapsed: 0 s
23:43:58 [2022-05-28T03:43:58.739Z] getFilter_removes_string_literal_start  Time elapsed: 0.001 s
23:43:58 [2022-05-28T03:43:58.739Z] getLoadedModules_detects_modules_from_ScriptEngine  Time elapsed: 0.001 s
23:43:58 [2022-05-28T03:43:58.739Z] getFilter_contains_parameter_prefix  Time elapsed: 0 s
23:43:58 [2022-05-28T03:43:58.739Z] getLoadedModules_contains_environment_on_resource  Time elapsed: 0.001 s
23:43:58 [2022-05-28T03:43:58.739Z] getLoadedModules_does_not_contain_environment_twice_on_resource  Time elapsed: 0 s
23:43:58 [2022-05-28T03:43:58.739Z] getFilter_is_empty  Time elapsed: 0 s
23:43:58 [2022-05-28T03:43:58.739Z] getFilter_keeps_spaces_in_string_literal  Time elapsed: 0 s
23:43:58 [2022-05-28T03:43:58.739Z] getLoadedModules_detects_loadModule_commands  Time elapsed: 0 s
23:43:58 [2022-05-28T03:43:58.739Z] getFilter_is_empty_for_empty_input  Time elapsed: 0 s
23:43:58 [2022-05-28T03:43:58.739Z] isInvalid_equals_true  Time elapsed: 0 s
23:43:58 [2022-05-28T03:43:58.739Z] Running org.eclipse.ease.ui.completion.ScriptCompletionProposalTest
23:43:58 [2022-05-28T03:43:58.739Z] Tests run: 8, Failures: 0, Errors: 0, Skipped: 0, Time elapsed: 0.036 s - in org.eclipse.ease.ui.completion.ScriptCompletionProposalTest
23:43:58 [2022-05-28T03:43:58.739Z] getCursorPosition_equals_end_of_inserted_text  Time elapsed: 0 s
23:43:58 [2022-05-28T03:43:58.739Z] getCursorPosition_equals_end_of_appended_text  Time elapsed: 0 s
23:43:58 [2022-05-28T03:43:58.739Z] compareTo_lists_higher_priority_first  Time elapsed: 0 s
23:43:58 [2022-05-28T03:43:58.739Z] getContent_inserts_replacement_text  Time elapsed: 0.033 s
23:43:58 [2022-05-28T03:43:58.739Z] getCursorPosition_equals_end_of_set_text  Time elapsed: 0.001 s
23:43:58 [2022-05-28T03:43:58.739Z] getContent_sets_replacement_text  Time elapsed: 0 s
23:43:58 [2022-05-28T03:43:58.739Z] compareTo_lists_same_prio_in_alphabetic_order  Time elapsed: 0 s
23:43:58 [2022-05-28T03:43:58.739Z] getContent_appends_replacement_text  Time elapsed: 0.001 s
23:43:58 [2022-05-28T03:43:58.739Z] Running org.eclipse.ease.ui.help.hovers.ModuleHelpTest
23:43:58 [2022-05-28T03:43:58.739Z] Tests run: 4, Failures: 0, Errors: 0, Skipped: 4, Time elapsed: 0.003 s - in org.eclipse.ease.ui.help.hovers.ModuleHelpTest
23:43:58 [2022-05-28T03:43:58.739Z] getModuleHelpLocation skipped
23:43:58 [2022-05-28T03:43:58.739Z] getModuleHelp skipped
23:43:58 [2022-05-28T03:43:58.739Z] getMethodHelp skipped
23:43:58 [2022-05-28T03:43:58.739Z] getConstantHelp skipped
23:43:58 [2022-05-28T03:43:58.739Z] Running org.eclipse.ease.ui.views.shell.dropins.modules.ModulesStackLabelProviderTest
23:43:58 [2022-05-28T03:43:58.739Z] Tests run: 2, Failures: 0, Errors: 0, Skipped: 0, Time elapsed: 0.007 s - in org.eclipse.ease.ui.views.shell.dropins.modules.ModulesStackLabelProviderTest
23:43:58 [2022-05-28T03:43:58.739Z] getText_returns_definition_name  Time elapsed: 0.005 s
23:43:58 [2022-05-28T03:43:58.739Z] getText_returns_full_class_name_name  Time elapsed: 0 s
23:43:58 [2022-05-28T03:43:58.739Z] Running org.eclipse.ease.ui.views.shell.dropins.modules.ModulesStackContentProviderTest
23:43:58 [2022-05-28T03:43:58.739Z] Tests run: 2, Failures: 0, Errors: 0, Skipped: 0, Time elapsed: 0.035 s - in org.eclipse.ease.ui.views.shell.dropins.modules.ModulesStackContentProviderTest
23:43:58 [2022-05-28T03:43:58.739Z] getElements_returns_modules  Time elapsed: 0.033 s
23:43:58 [2022-05-28T03:43:58.739Z] getElements_returns_empty_list_without_environment  Time elapsed: 0.001 s
23:43:58 [2022-05-28T03:43:58.739Z] Running org.eclipse.ease.ui.views.shell.dropins.variables.HiddenVariablesFilterTest
23:43:58 [2022-05-28T03:43:58.996Z] Tests run: 3, Failures: 0, Errors: 0, Skipped: 0, Time elapsed: 0.121 s - in org.eclipse.ease.ui.views.shell.dropins.variables.HiddenVariablesFilterTest
23:43:58 [2022-05-28T03:43:58.996Z] select_accepts_unknown_classes  Time elapsed: 0.002 s
23:43:58 [2022-05-28T03:43:58.996Z] select_accepts_script_variables  Time elapsed: 0.117 s
23:43:58 [2022-05-28T03:43:58.996Z] select_declines_hidden_script_variables  Time elapsed: 0 s
23:43:58 [2022-05-28T03:43:58.996Z] Running org.eclipse.ease.ui.views.shell.dropins.variables.ContentLabelProviderTest
23:43:58 [2022-05-28T03:43:58.996Z] Tests run: 1, Failures: 0, Errors: 0, Skipped: 0, Time elapsed: 0.085 s - in org.eclipse.ease.ui.views.shell.dropins.variables.ContentLabelProviderTest
23:43:58 [2022-05-28T03:43:58.996Z] getText_returns_variable_content  Time elapsed: 0.057 s
23:43:58 [2022-05-28T03:43:58.996Z] Running org.eclipse.ease.ui.views.shell.dropins.variables.VariablesComparatorTest
23:43:58 [2022-05-28T03:43:58.996Z] Tests run: 1, Failures: 0, Errors: 0, Skipped: 0, Time elapsed: 0.076 s - in org.eclipse.ease.ui.views.shell.dropins.variables.VariablesComparatorTest
23:43:58 [2022-05-28T03:43:58.996Z] lastExecutionResult_comes_before_debugVariable  Time elapsed: 0.076 s
23:43:58 [2022-05-28T03:43:58.996Z] Running org.eclipse.ease.ui.views.shell.dropins.variables.VariablesLabelProviderTest
23:43:58 [2022-05-28T03:43:58.996Z] Tests run: 1, Failures: 0, Errors: 0, Skipped: 0, Time elapsed: 0.003 s - in org.eclipse.ease.ui.views.shell.dropins.variables.VariablesLabelProviderTest
23:43:58 [2022-05-28T03:43:58.996Z] getText_returns_variable_name  Time elapsed: 0.003 s
23:43:58 [2022-05-28T03:43:58.996Z] Running org.eclipse.ease.ui.views.shell.dropins.variables.VariablesContentProviderTest
23:43:59 [2022-05-28T03:43:59.253Z] Tests run: 5, Failures: 0, Errors: 0, Skipped: 0, Time elapsed: 0.064 s - in org.eclipse.ease.ui.views.shell.dropins.variables.VariablesContentProviderTest
23:43:59 [2022-05-28T03:43:59.253Z] hasChildren_true_when_child_nodes_are_available  Time elapsed: 0.001 s
23:43:59 [2022-05-28T03:43:59.253Z] getChildren_is_empty_when_no_child_nodes_are_available  Time elapsed: 0 s
23:43:59 [2022-05-28T03:43:59.253Z] getElements_contains_variables_from_engine  Time elapsed: 0.06 s
23:43:59 [2022-05-28T03:43:59.253Z] hasChildren_false_when_no_child_nodes_are_available  Time elapsed: 0.001 s
23:43:59 [2022-05-28T03:43:59.253Z] getChildren_not_empty_when_child_nodes_are_available  Time elapsed: 0.001 s
23:43:59 [2022-05-28T03:43:59.253Z] Running org.eclipse.ease.ui.views.shell.dropins.DropinToolsTest
23:43:59 [2022-05-28T03:43:59.253Z] 
23:43:59 [2022-05-28T03:43:59.253Z] (java:2441): Gdk-CRITICAL **: 03:43:59.097: gdk_threads_set_lock_functions: assertion 'gdk_threads_lock == NULL && gdk_threads_unlock == NULL' failed
23:43:59 [2022-05-28T03:43:59.253Z] 
23:43:59 [2022-05-28T03:43:59.253Z] (java:2441): Gdk-CRITICAL **: 03:43:59.101: gdk_threads_set_lock_functions: assertion 'gdk_threads_lock == NULL && gdk_threads_unlock == NULL' failed
23:43:59 [2022-05-28T03:43:59.253Z] 
23:43:59 [2022-05-28T03:43:59.253Z] (java:2441): Gdk-CRITICAL **: 03:43:59.106: gdk_threads_set_lock_functions: assertion 'gdk_threads_lock == NULL && gdk_threads_unlock == NULL' failed
23:43:59 [2022-05-28T03:43:59.253Z] 
23:43:59 [2022-05-28T03:43:59.253Z] (java:2441): Gdk-CRITICAL **: 03:43:59.109: gdk_threads_set_lock_functions: assertion 'gdk_threads_lock == NULL && gdk_threads_unlock == NULL' failed
23:43:59 [2022-05-28T03:43:59.253Z] 
23:43:59 [2022-05-28T03:43:59.253Z] (java:2441): Gdk-CRITICAL **: 03:43:59.112: gdk_threads_set_lock_functions: assertion 'gdk_threads_lock == NULL && gdk_threads_unlock == NULL' failed
23:43:59 [2022-05-28T03:43:59.253Z] Tests run: 3, Failures: 0, Errors: 0, Skipped: 1, Time elapsed: 0.093 s - in org.eclipse.ease.ui.views.shell.dropins.DropinToolsTest
23:43:59 [2022-05-28T03:43:59.253Z] getAvailableDropins_does_not_contain_InvalidDropin  Time elapsed: 0.062 s
23:43:59 [2022-05-28T03:43:59.253Z] getAvailableDropins_contains_DummyDropin skipped
23:43:59 [2022-05-28T03:43:59.253Z] getAvailableDropins_is_not_null  Time elapsed: 0.03 s
23:43:59 [2022-05-28T03:43:59.253Z] Running org.eclipse.ease.ui.views.shell.dropins.AbstractDropinTest
23:43:59 [2022-05-28T03:43:59.253Z] Tests run: 3, Failures: 0, Errors: 0, Skipped: 0, Time elapsed: 0.039 s - in org.eclipse.ease.ui.views.shell.dropins.AbstractDropinTest
23:43:59 [2022-05-28T03:43:59.253Z] getSelectionProvider_is_not_null  Time elapsed: 0.035 s
23:43:59 [2022-05-28T03:43:59.253Z] getScriptEngine_returns_current_script_engine  Time elapsed: 0.001 s
23:43:59 [2022-05-28T03:43:59.253Z] getSelectionProvider_getSelection_is_empty  Time elapsed: 0.002 s
23:43:59 [2022-05-28T03:43:59.253Z] Running org.eclipse.ease.ui.view.DropinsSelectionProviderTest
23:43:59 [2022-05-28T03:43:59.871Z] Tests run: 3, Failures: 0, Errors: 0, Skipped: 0, Time elapsed: 0.63 s - in org.eclipse.ease.ui.view.DropinsSelectionProviderTest
23:43:59 [2022-05-28T03:43:59.871Z] removeSelectionChangedListener_unregisters_listener  Time elapsed: 0.629 s
23:43:59 [2022-05-28T03:43:59.871Z] getSelection_is_not_null  Time elapsed: 0.001 s
23:43:59 [2022-05-28T03:43:59.871Z] addSelectionChangedListener_registers_listener  Time elapsed: 0 s
23:43:59 [2022-05-28T03:43:59.871Z] Running org.eclipse.ease.ui.view.ScriptShellTest
23:43:59 [2022-05-28T03:43:59.871Z] Tests run: 2, Failures: 0, Errors: 0, Skipped: 0, Time elapsed: 0.053 s - in org.eclipse.ease.ui.view.ScriptShellTest
23:43:59 [2022-05-28T03:43:59.871Z] scriptShell_implements_ITabbedPropertySheetPageContributor  Time elapsed: 0.051 s
23:43:59 [2022-05-28T03:43:59.871Z] getContributorId_returns_view_ID  Time elapsed: 0 s
23:43:59 [2022-05-28T03:43:59.871Z] Running org.eclipse.ease.ui.dnd.ResourceDropHandlerTest
23:44:00 [2022-05-28T03:44:00.138Z] Tests run: 4, Failures: 0, Errors: 0, Skipped: 0, Time elapsed: 0.174 s - in org.eclipse.ease.ui.dnd.ResourceDropHandlerTest
23:44:00 [2022-05-28T03:44:00.138Z] performDrop_includes_URI_instance  Time elapsed: 0.018 s
23:44:00 [2022-05-28T03:44:00.138Z] performDrop_includes_File_instance  Time elapsed: 0.079 s
23:44:00 [2022-05-28T03:44:00.138Z] accepts_returns_false_for_String_input  Time elapsed: 0.006 s
23:44:00 [2022-05-28T03:44:00.138Z] performDrop_includes_IFile_instance  Time elapsed: 0.07 s
23:44:00 [2022-05-28T03:44:00.138Z] Running org.eclipse.ease.ui.dnd.ModulesDropHandlerTest
23:44:00 [2022-05-28T03:44:00.395Z] Tests run: 5, Failures: 0, Errors: 0, Skipped: 0, Time elapsed: 0.102 s - in org.eclipse.ease.ui.dnd.ModulesDropHandlerTest
23:44:00 [2022-05-28T03:44:00.395Z] accepts_true_for_ModuleEntry  Time elapsed: 0.014 s
23:44:00 [2022-05-28T03:44:00.395Z] performDrop_of_Method_executes_with_default_parameters_on_DROP_COPY  Time elapsed: 0.006 s
23:44:00 [2022-05-28T03:44:00.395Z] performDrop_of_ModuleEntry_loads_module  Time elapsed: 0.002 s
23:44:00 [2022-05-28T03:44:00.395Z] accepts_true_for_ModuleDefinition  Time elapsed: 0.076 s
23:44:00 [2022-05-28T03:44:00.395Z] performDrop_of_ModuleDefinition_loads_module  Time elapsed: 0.001 s
23:44:00 [2022-05-28T03:44:00.395Z] 
23:44:00 [2022-05-28T03:44:00.395Z] Results:
23:44:00 [2022-05-28T03:44:00.395Z] 
23:44:00 [2022-05-28T03:44:00.395Z] Tests run: 236, Failures: 0, Errors: 0, Skipped: 5
23:44:00 [2022-05-28T03:44:00.395Z] 
23:44:00 [2022-05-28T03:44:00.652Z] [INFO] All tests passed!
23:44:00 [2022-05-28T03:44:00.652Z] [INFO] 
23:44:00 [2022-05-28T03:44:00.652Z] [INFO] --- maven-pmd-plugin:3.16.0:pmd (pmd-integration) @ org.eclipse.ease.ui.test ---
23:44:00 [2022-05-28T03:44:00.652Z] [INFO] PMD version: 6.42.0
23:44:02 [2022-05-28T03:44:02.096Z] [INFO] 
23:44:02 [2022-05-28T03:44:02.096Z] [INFO] --- maven-pmd-plugin:3.16.0:cpd (pmd-integration) @ org.eclipse.ease.ui.test ---
23:44:02 [2022-05-28T03:44:02.096Z] [INFO] PMD version: 6.42.0
23:44:02 [2022-05-28T03:44:02.096Z] [INFO] 
23:44:02 [2022-05-28T03:44:02.096Z] [INFO] --- spotbugs-maven-plugin:4.1.4:spotbugs (spotbugs-integration) @ org.eclipse.ease.ui.test ---
23:44:02 [2022-05-28T03:44:02.096Z] [INFO] Fork Value is false
23:44:02 [2022-05-28T03:44:02.354Z]      [java] JVM args ignored when same JVM is used.
23:44:07 [2022-05-28T03:44:07.640Z] [INFO] Done SpotBugs Analysis....
23:44:07 [2022-05-28T03:44:07.640Z] [INFO] 
23:44:07 [2022-05-28T03:44:07.640Z] [INFO] --- maven-checkstyle-plugin:3.1.1:check (checkstyle-integration) @ org.eclipse.ease.ui.test ---
23:44:07 [2022-05-28T03:44:07.941Z] [INFO] You have 0 Checkstyle violations.
23:44:07 [2022-05-28T03:44:07.941Z] [INFO] 
23:44:07 [2022-05-28T03:44:07.941Z] [INFO] --- maven-install-plugin:2.3.1:install (default-install) @ org.eclipse.ease.ui.test ---
23:44:07 [2022-05-28T03:44:07.941Z] [INFO] Installing /home/jenkins/agent/workspace/ease.verify.core.target.2018-12/tests/org.eclipse.ease.ui.test/target/org.eclipse.ease.ui.test-0.9.0-SNAPSHOT.jar to /home/jenkins/.m2/repository/org/eclipse/ease/org.eclipse.ease.ui.test/0.9.0-SNAPSHOT/org.eclipse.ease.ui.test-0.9.0-SNAPSHOT.jar
23:44:07 [2022-05-28T03:44:07.941Z] [INFO] Installing /home/jenkins/agent/workspace/ease.verify.core.target.2018-12/tests/org.eclipse.ease.ui.test/pom.xml to /home/jenkins/.m2/repository/org/eclipse/ease/org.eclipse.ease.ui.test/0.9.0-SNAPSHOT/org.eclipse.ease.ui.test-0.9.0-SNAPSHOT.pom
23:44:07 [2022-05-28T03:44:07.941Z] [INFO] Installing /home/jenkins/agent/workspace/ease.verify.core.target.2018-12/tests/org.eclipse.ease.ui.test/target/p2content.xml to /home/jenkins/.m2/repository/org/eclipse/ease/org.eclipse.ease.ui.test/0.9.0-SNAPSHOT/org.eclipse.ease.ui.test-0.9.0-SNAPSHOT-p2metadata.xml
23:44:07 [2022-05-28T03:44:07.941Z] [INFO] Installing /home/jenkins/agent/workspace/ease.verify.core.target.2018-12/tests/org.eclipse.ease.ui.test/target/p2artifacts.xml to /home/jenkins/.m2/repository/org/eclipse/ease/org.eclipse.ease.ui.test/0.9.0-SNAPSHOT/org.eclipse.ease.ui.test-0.9.0-SNAPSHOT-p2artifacts.xml
23:44:07 [2022-05-28T03:44:07.941Z] [INFO] 
23:44:07 [2022-05-28T03:44:07.941Z] [INFO] --- tycho-p2-plugin:2.4.0:update-local-index (default-update-local-index) @ org.eclipse.ease.ui.test ---
23:44:07 [2022-05-28T03:44:07.941Z] [INFO] 
23:44:07 [2022-05-28T03:44:07.941Z] [INFO] -----< org.eclipse.ease:org.eclipse.ease.ui.completions.java.test >-----
23:44:07 [2022-05-28T03:44:07.941Z] [INFO] Building org.eclipse.ease.ui.completions.java.test 0.9.0-SNAPSHOT [47/49]
23:44:07 [2022-05-28T03:44:07.941Z] [INFO] ------------------------[ eclipse-test-plugin ]-------------------------
23:44:07 [2022-05-28T03:44:07.941Z] [INFO] 
23:44:07 [2022-05-28T03:44:07.941Z] [INFO] --- maven-clean-plugin:2.5:clean (default-clean) @ org.eclipse.ease.ui.completions.java.test ---
23:44:07 [2022-05-28T03:44:07.942Z] [INFO] 
23:44:07 [2022-05-28T03:44:07.942Z] [INFO] --- tycho-packaging-plugin:2.4.0:build-qualifier (default-build-qualifier) @ org.eclipse.ease.ui.completions.java.test ---
23:44:07 [2022-05-28T03:44:07.942Z] [INFO] The project's OSGi version is 0.9.0.I202110141644
23:44:07 [2022-05-28T03:44:07.942Z] [INFO] 
23:44:07 [2022-05-28T03:44:07.942Z] [INFO] --- tycho-packaging-plugin:2.4.0:validate-id (default-validate-id) @ org.eclipse.ease.ui.completions.java.test ---
23:44:07 [2022-05-28T03:44:07.942Z] [INFO] 
23:44:07 [2022-05-28T03:44:07.942Z] [INFO] --- tycho-packaging-plugin:2.4.0:validate-version (default-validate-version) @ org.eclipse.ease.ui.completions.java.test ---
23:44:07 [2022-05-28T03:44:07.942Z] [INFO] 
23:44:07 [2022-05-28T03:44:07.942Z] [INFO] --- target-platform-configuration:2.4.0:target-platform (default-target-platform) @ org.eclipse.ease.ui.completions.java.test ---
23:44:07 [2022-05-28T03:44:07.942Z] [INFO] 
23:44:07 [2022-05-28T03:44:07.942Z] [INFO] --- maven-resources-plugin:2.4.3:resources (default-resources) @ org.eclipse.ease.ui.completions.java.test ---
23:44:07 [2022-05-28T03:44:07.942Z] [INFO] Using 'UTF-8' encoding to copy filtered resources.
23:44:07 [2022-05-28T03:44:07.942Z] [INFO] skip non existing resourceDirectory /home/jenkins/agent/workspace/ease.verify.core.target.2018-12/tests/org.eclipse.ease.ui.completions.java.test/src/main/resources
23:44:07 [2022-05-28T03:44:07.942Z] [INFO] 
23:44:07 [2022-05-28T03:44:07.942Z] [INFO] --- tycho-compiler-plugin:2.4.0:compile (default-compile) @ org.eclipse.ease.ui.completions.java.test ---
23:44:07 [2022-05-28T03:44:07.942Z] [INFO] Compiling 4 source files to /home/jenkins/agent/workspace/ease.verify.core.target.2018-12/tests/org.eclipse.ease.ui.completions.java.test/target/classes
23:44:08 [2022-05-28T03:44:08.237Z] [INFO] 
23:44:08 [2022-05-28T03:44:08.237Z] [INFO] --- maven-resources-plugin:2.4.3:testResources (default-testResources) @ org.eclipse.ease.ui.completions.java.test ---
23:44:08 [2022-05-28T03:44:08.237Z] [INFO] Using 'UTF-8' encoding to copy filtered resources.
23:44:08 [2022-05-28T03:44:08.237Z] [INFO] skip non existing resourceDirectory /home/jenkins/agent/workspace/ease.verify.core.target.2018-12/tests/org.eclipse.ease.ui.completions.java.test/src/test/resources
23:44:08 [2022-05-28T03:44:08.237Z] [INFO] 
23:44:08 [2022-05-28T03:44:08.237Z] [INFO] --- tycho-packaging-plugin:2.4.0:package-plugin (default-package-plugin) @ org.eclipse.ease.ui.completions.java.test ---
23:44:08 [2022-05-28T03:44:08.237Z] [INFO] Building jar: /home/jenkins/agent/workspace/ease.verify.core.target.2018-12/tests/org.eclipse.ease.ui.completions.java.test/target/org.eclipse.ease.ui.completions.java.test-0.9.0-SNAPSHOT.jar
23:44:08 [2022-05-28T03:44:08.237Z] [INFO] 
23:44:08 [2022-05-28T03:44:08.237Z] [INFO] --- tycho-p2-plugin:2.4.0:p2-metadata-default (default-p2-metadata-default) @ org.eclipse.ease.ui.completions.java.test ---
23:44:08 [2022-05-28T03:44:08.237Z] [INFO] 
23:44:08 [2022-05-28T03:44:08.237Z] [INFO] --- jacoco-maven-plugin:0.8.6:prepare-agent (jacoco-initialize) @ org.eclipse.ease.ui.completions.java.test ---
23:44:08 [2022-05-28T03:44:08.237Z] [INFO] tycho.testArgLine set to -javaagent:/home/jenkins/.m2/repository/org/jacoco/org.jacoco.agent/0.8.6/org.jacoco.agent-0.8.6-runtime.jar=destfile=/home/jenkins/agent/workspace/ease.verify.core.target.2018-12/tests/org.eclipse.ease.ui.completions.java.test/target/jacoco.exec,output=file
23:44:08 [2022-05-28T03:44:08.238Z] [INFO] 
23:44:08 [2022-05-28T03:44:08.238Z] [INFO] --- tycho-surefire-plugin:2.4.0:test (default-test) @ org.eclipse.ease.ui.completions.java.test ---
23:44:08 [2022-05-28T03:44:08.238Z] [INFO] Executing Test Runtime with timeout 0, logs (if any) will be placed at: /home/jenkins/agent/workspace/ease.verify.core.target.2018-12/tests/org.eclipse.ease.ui.completions.java.test/target/work/data/.metadata/.log
23:44:08 [2022-05-28T03:44:08.238Z] [INFO] Command line:
23:44:08 [2022-05-28T03:44:08.238Z] 	[/opt/tools/java/openjdk/jdk-15/15.0.2+7/bin/java, -Dosgi.noShutdown=false, -Dosgi.os=linux, -Dosgi.ws=gtk, -Dosgi.arch=x86_64, -javaagent:/home/jenkins/.m2/repository/org/jacoco/org.jacoco.agent/0.8.6/org.jacoco.agent-0.8.6-runtime.jar=destfile=/home/jenkins/agent/workspace/ease.verify.core.target.2018-12/tests/org.eclipse.ease.ui.completions.java.test/target/jacoco.exec,output=file, -Dosgi.clean=true, -jar, /home/jenkins/.m2/repository/p2/osgi/bundle/org.eclipse.equinox.launcher/1.6.400.v20210924-0641/org.eclipse.equinox.launcher-1.6.400.v20210924-0641.jar, -data, /home/jenkins/agent/workspace/ease.verify.core.target.2018-12/tests/org.eclipse.ease.ui.completions.java.test/target/work/data, -install, /home/jenkins/agent/workspace/ease.verify.core.target.2018-12/tests/org.eclipse.ease.ui.completions.java.test/target/work, -configuration, /home/jenkins/agent/workspace/ease.verify.core.target.2018-12/tests/org.eclipse.ease.ui.completions.java.test/target/work/configuration, -application, org.eclipse.tycho.surefire.osgibooter.headlesstest, -testproperties, /home/jenkins/agent/workspace/ease.verify.core.target.2018-12/tests/org.eclipse.ease.ui.completions.java.test/target/surefire.properties]
23:44:08 [2022-05-28T03:44:08.541Z] Picked up JAVA_TOOL_OPTIONS: -Dmaven.ext.class.path="/home/jenkins/agent/workspace/ease.verify.core.target.2018-12@tmp/withMavenf46734fb/pipeline-maven-spy.jar" -Dorg.jenkinsci.plugins.pipeline.maven.reportsFolder="/home/jenkins/agent/workspace/ease.verify.core.target.2018-12@tmp/withMavenf46734fb" 
23:44:13 [2022-05-28T03:44:13.869Z] Running org.eclipse.ease.ui.completions.java.provider.JavaClassCompletionProviderTest
23:44:14 [2022-05-28T03:44:14.806Z] Tests run: 16, Failures: 0, Errors: 0, Skipped: 0, Time elapsed: 1.398 s - in org.eclipse.ease.ui.completions.java.provider.JavaClassCompletionProviderTest
23:44:14 [2022-05-28T03:44:14.806Z] prepareProposals_instance_contains_class_for_package_context_with_filter  Time elapsed: 0.913 s
23:44:14 [2022-05-28T03:44:14.806Z] prepareProposals_instance_contains_inner_class_for_class_context  Time elapsed: 0.009 s
23:44:14 [2022-05-28T03:44:14.806Z] prepareProposals_instance_contains_class_for_package_context  Time elapsed: 0.005 s
23:44:14 [2022-05-28T03:44:14.806Z] prepareProposals_instance_contains_class_for_partial_context  Time elapsed: 0.004 s
23:44:14 [2022-05-28T03:44:14.806Z] prepareProposals_instance_contains_inner_class_for_class_context_with_filter  Time elapsed: 0.001 s
23:44:14 [2022-05-28T03:44:14.806Z] prepareProposals_instance_contains_class_for_global_context  Time elapsed: 0.006 s
23:44:14 [2022-05-28T03:44:14.806Z] prepareProposals_does_not_contain_inner_class_for_a_given_inner_class_context  Time elapsed: 0.001 s
23:44:14 [2022-05-28T03:44:14.806Z] isActive_equals_false{String}[1]  Time elapsed: 0.025 s
23:44:14 [2022-05-28T03:44:14.806Z] isActive_equals_false{String}[2]  Time elapsed: 0.001 s
23:44:14 [2022-05-28T03:44:14.806Z] isActive_equals_true{String}[1]  Time elapsed: 0 s
23:44:14 [2022-05-28T03:44:14.806Z] isActive_equals_true{String}[2]  Time elapsed: 0 s
23:44:14 [2022-05-28T03:44:14.806Z] isActive_equals_true{String}[3]  Time elapsed: 0 s
23:44:14 [2022-05-28T03:44:14.806Z] isActive_equals_true{String}[4]  Time elapsed: 0 s
23:44:14 [2022-05-28T03:44:14.806Z] isActive_equals_true{String}[5]  Time elapsed: 0 s
23:44:14 [2022-05-28T03:44:14.806Z] isActive_equals_true{String}[6]  Time elapsed: 0.001 s
23:44:14 [2022-05-28T03:44:14.807Z] prepareProposals_is_empty_for_exact_class_context  Time elapsed: 0.002 s
23:44:14 [2022-05-28T03:44:14.807Z] Running org.eclipse.ease.ui.completions.java.provider.JavaMethodCompletionProviderTest
23:44:14 [2022-05-28T03:44:14.807Z] Tests run: 23, Failures: 0, Errors: 0, Skipped: 0, Time elapsed: 0.053 s - in org.eclipse.ease.ui.completions.java.provider.JavaMethodCompletionProviderTest
23:44:14 [2022-05-28T03:44:14.807Z] prepareProposals_class_does_not_contain_isntance_methods  Time elapsed: 0.022 s
23:44:14 [2022-05-28T03:44:14.807Z] prepareProposals_instance_contains_method_with_filter  Time elapsed: 0.001 s
23:44:14 [2022-05-28T03:44:14.807Z] prepareProposals_method_contains_instance_methods  Time elapsed: 0.002 s
23:44:14 [2022-05-28T03:44:14.807Z] prepareProposals_instance_contains_instance_methods  Time elapsed: 0.001 s
23:44:14 [2022-05-28T03:44:14.807Z] prepareProposals_class_contains_static_methods  Time elapsed: 0.001 s
23:44:14 [2022-05-28T03:44:14.807Z] proposal_replacement_string_contains_leading_dot  Time elapsed: 0.003 s
23:44:14 [2022-05-28T03:44:14.807Z] prepareProposals_instance_does_not_contain_static_methods  Time elapsed: 0.001 s
23:44:14 [2022-05-28T03:44:14.807Z] prepareProposals_class_contains_static_fields  Time elapsed: 0.001 s
23:44:14 [2022-05-28T03:44:14.807Z] prepareProposals_instance_does_not_contain_static_fields  Time elapsed: 0.001 s
23:44:14 [2022-05-28T03:44:14.807Z] prepareProposals_does_not_contain_methods_of_base_class_for_method_context  Time elapsed: 0.001 s
23:44:14 [2022-05-28T03:44:14.807Z] isActive_equals_false{String}[1]  Time elapsed: 0 s
23:44:14 [2022-05-28T03:44:14.807Z] isActive_equals_false{String}[2]  Time elapsed: 0.001 s
23:44:14 [2022-05-28T03:44:14.807Z] isActive_equals_false{String}[3]  Time elapsed: 0.001 s
23:44:14 [2022-05-28T03:44:14.807Z] isActive_equals_true{String}[1]  Time elapsed: 0.001 s
23:44:14 [2022-05-28T03:44:14.807Z] isActive_equals_true{String}[2]  Time elapsed: 0.001 s
23:44:14 [2022-05-28T03:44:14.807Z] isActive_equals_true{String}[3]  Time elapsed: 0 s
23:44:14 [2022-05-28T03:44:14.807Z] isActive_equals_true{String}[4]  Time elapsed: 0 s
23:44:14 [2022-05-28T03:44:14.807Z] isActive_equals_true{String}[5]  Time elapsed: 0 s
23:44:14 [2022-05-28T03:44:14.807Z] isActive_equals_true{String}[6]  Time elapsed: 0.001 s
23:44:14 [2022-05-28T03:44:14.807Z] isActive_equals_true{String}[7]  Time elapsed: 0.001 s
23:44:14 [2022-05-28T03:44:14.807Z] isActive_equals_true{String}[8]  Time elapsed: 0.001 s
23:44:14 [2022-05-28T03:44:14.807Z] isActive_equals_true{String}[9]  Time elapsed: 0.001 s
23:44:14 [2022-05-28T03:44:14.807Z] isActive_equals_true{String}[10]  Time elapsed: 0.001 s
23:44:14 [2022-05-28T03:44:14.807Z] Running org.eclipse.ease.ui.completions.java.provider.JavaPackagesCompletionProviderTest
23:44:14 [2022-05-28T03:44:14.807Z] Tests run: 28, Failures: 0, Errors: 0, Skipped: 0, Time elapsed: 0.093 s - in org.eclipse.ease.ui.completions.java.provider.JavaPackagesCompletionProviderTest
23:44:14 [2022-05-28T03:44:14.807Z] proposal_java_preserves_suffix  Time elapsed: 0.002 s
23:44:14 [2022-05-28T03:44:14.807Z] proposal_java_appends_to_prefix  Time elapsed: 0.001 s
23:44:14 [2022-05-28T03:44:14.807Z] prepareProposals_instance_contains_root_package_after_new_keyword  Time elapsed: 0.001 s
23:44:14 [2022-05-28T03:44:14.807Z] proposal_java_replaces_filter  Time elapsed: 0 s
23:44:14 [2022-05-28T03:44:14.807Z] prepareProposals_instance_contains_sub_package  Time elapsed: 0.001 s
23:44:14 [2022-05-28T03:44:14.807Z] prepareProposals_instance_contains_3rd_level  Time elapsed: 0.001 s
23:44:14 [2022-05-28T03:44:14.807Z] isActive_equals_false{String}[1]  Time elapsed: 0.05 s
23:44:14 [2022-05-28T03:44:14.807Z] isActive_equals_false{String}[2]  Time elapsed: 0.001 s
23:44:14 [2022-05-28T03:44:14.807Z] isActive_equals_false{String}[3]  Time elapsed: 0.001 s
23:44:14 [2022-05-28T03:44:14.807Z] isActive_equals_false{String}[4]  Time elapsed: 0.001 s
23:44:14 [2022-05-28T03:44:14.807Z] prepareProposals_contains_root_package{String}[1]  Time elapsed: 0.002 s
23:44:14 [2022-05-28T03:44:14.807Z] prepareProposals_contains_root_package{String}[2]  Time elapsed: 0.001 s
23:44:14 [2022-05-28T03:44:14.807Z] prepareProposals_contains_root_package{String}[3]  Time elapsed: 0.002 s
23:44:14 [2022-05-28T03:44:14.807Z] isActive_equals_true{String}[1]  Time elapsed: 0.001 s
23:44:14 [2022-05-28T03:44:14.807Z] isActive_equals_true{String}[2]  Time elapsed: 0.001 s
23:44:14 [2022-05-28T03:44:14.807Z] isActive_equals_true{String}[3]  Time elapsed: 0.001 s
23:44:14 [2022-05-28T03:44:14.807Z] isActive_equals_true{String}[4]  Time elapsed: 0 s
23:44:14 [2022-05-28T03:44:14.807Z] isActive_equals_true{String}[5]  Time elapsed: 0 s
23:44:14 [2022-05-28T03:44:14.807Z] isActive_equals_true{String}[6]  Time elapsed: 0.001 s
23:44:14 [2022-05-28T03:44:14.807Z] isActive_equals_true{String}[7]  Time elapsed: 0.001 s
23:44:14 [2022-05-28T03:44:14.807Z] isActive_equals_true{String}[8]  Time elapsed: 0 s
23:44:14 [2022-05-28T03:44:14.807Z] isActive_equals_true{String}[9]  Time elapsed: 0.001 s
23:44:14 [2022-05-28T03:44:14.807Z] isActive_equals_true{String}[10]  Time elapsed: 0 s
23:44:14 [2022-05-28T03:44:14.807Z] isActive_equals_true{String}[11]  Time elapsed: 0.001 s
23:44:14 [2022-05-28T03:44:14.807Z] isActive_equals_true{String}[12]  Time elapsed: 0 s
23:44:14 [2022-05-28T03:44:14.807Z] isActive_equals_true{String}[13]  Time elapsed: 0 s
23:44:14 [2022-05-28T03:44:14.807Z] isActive_equals_true{String}[14]  Time elapsed: 0 s
23:44:14 [2022-05-28T03:44:14.807Z] prepareProposals_is_empty_for_exact_class_context  Time elapsed: 0.001 s
23:44:14 [2022-05-28T03:44:14.807Z] Running org.eclipse.ease.ui.completions.java.provider.JavaResourcesTest
23:44:14 [2022-05-28T03:44:14.807Z] Tests run: 5, Failures: 0, Errors: 0, Skipped: 0, Time elapsed: 0.002 s - in org.eclipse.ease.ui.completions.java.provider.JavaResourcesTest
23:44:14 [2022-05-28T03:44:14.807Z] getClasses_with_filter_is_populated  Time elapsed: 0 s
23:44:14 [2022-05-28T03:44:14.807Z] getClasses_is_populated  Time elapsed: 0 s
23:44:14 [2022-05-28T03:44:14.808Z] singleton_exists  Time elapsed: 0.001 s
23:44:14 [2022-05-28T03:44:14.808Z] getPackages_is_populated  Time elapsed: 0 s
23:44:14 [2022-05-28T03:44:14.808Z] getClasses_with_filter_contains_File_class  Time elapsed: 0 s
23:44:14 [2022-05-28T03:44:14.808Z] 
23:44:14 [2022-05-28T03:44:14.808Z] Results:
23:44:14 [2022-05-28T03:44:14.808Z] 
23:44:14 [2022-05-28T03:44:14.808Z] Tests run: 72, Failures: 0, Errors: 0, Skipped: 0
23:44:14 [2022-05-28T03:44:14.808Z] 
23:44:15 [2022-05-28T03:44:15.740Z] [INFO] All tests passed!
23:44:15 [2022-05-28T03:44:15.740Z] [INFO] 
23:44:15 [2022-05-28T03:44:15.740Z] [INFO] --- maven-pmd-plugin:3.16.0:pmd (pmd-integration) @ org.eclipse.ease.ui.completions.java.test ---
23:44:15 [2022-05-28T03:44:15.740Z] [INFO] PMD version: 6.42.0
23:44:15 [2022-05-28T03:44:15.996Z] [INFO] 
23:44:15 [2022-05-28T03:44:15.996Z] [INFO] --- maven-pmd-plugin:3.16.0:cpd (pmd-integration) @ org.eclipse.ease.ui.completions.java.test ---
23:44:15 [2022-05-28T03:44:15.996Z] [INFO] PMD version: 6.42.0
23:44:15 [2022-05-28T03:44:15.996Z] [INFO] 
23:44:15 [2022-05-28T03:44:15.996Z] [INFO] --- spotbugs-maven-plugin:4.1.4:spotbugs (spotbugs-integration) @ org.eclipse.ease.ui.completions.java.test ---
23:44:15 [2022-05-28T03:44:15.997Z] [INFO] Fork Value is false
23:44:16 [2022-05-28T03:44:16.253Z]      [java] JVM args ignored when same JVM is used.
23:44:19 [2022-05-28T03:44:19.557Z] [INFO] Done SpotBugs Analysis....
23:44:19 [2022-05-28T03:44:19.557Z] [INFO] 
23:44:19 [2022-05-28T03:44:19.557Z] [INFO] --- maven-checkstyle-plugin:3.1.1:check (checkstyle-integration) @ org.eclipse.ease.ui.completions.java.test ---
23:44:19 [2022-05-28T03:44:19.557Z] [INFO] You have 0 Checkstyle violations.
23:44:19 [2022-05-28T03:44:19.557Z] [INFO] 
23:44:19 [2022-05-28T03:44:19.557Z] [INFO] --- maven-install-plugin:2.3.1:install (default-install) @ org.eclipse.ease.ui.completions.java.test ---
23:44:19 [2022-05-28T03:44:19.557Z] [INFO] Installing /home/jenkins/agent/workspace/ease.verify.core.target.2018-12/tests/org.eclipse.ease.ui.completions.java.test/target/org.eclipse.ease.ui.completions.java.test-0.9.0-SNAPSHOT.jar to /home/jenkins/.m2/repository/org/eclipse/ease/org.eclipse.ease.ui.completions.java.test/0.9.0-SNAPSHOT/org.eclipse.ease.ui.completions.java.test-0.9.0-SNAPSHOT.jar
23:44:19 [2022-05-28T03:44:19.557Z] [INFO] Installing /home/jenkins/agent/workspace/ease.verify.core.target.2018-12/tests/org.eclipse.ease.ui.completions.java.test/pom.xml to /home/jenkins/.m2/repository/org/eclipse/ease/org.eclipse.ease.ui.completions.java.test/0.9.0-SNAPSHOT/org.eclipse.ease.ui.completions.java.test-0.9.0-SNAPSHOT.pom
23:44:19 [2022-05-28T03:44:19.558Z] [INFO] Installing /home/jenkins/agent/workspace/ease.verify.core.target.2018-12/tests/org.eclipse.ease.ui.completions.java.test/target/p2content.xml to /home/jenkins/.m2/repository/org/eclipse/ease/org.eclipse.ease.ui.completions.java.test/0.9.0-SNAPSHOT/org.eclipse.ease.ui.completions.java.test-0.9.0-SNAPSHOT-p2metadata.xml
23:44:19 [2022-05-28T03:44:19.558Z] [INFO] Installing /home/jenkins/agent/workspace/ease.verify.core.target.2018-12/tests/org.eclipse.ease.ui.completions.java.test/target/p2artifacts.xml to /home/jenkins/.m2/repository/org/eclipse/ease/org.eclipse.ease.ui.completions.java.test/0.9.0-SNAPSHOT/org.eclipse.ease.ui.completions.java.test-0.9.0-SNAPSHOT-p2artifacts.xml
23:44:19 [2022-05-28T03:44:19.558Z] [INFO] 
23:44:19 [2022-05-28T03:44:19.558Z] [INFO] --- tycho-p2-plugin:2.4.0:update-local-index (default-update-local-index) @ org.eclipse.ease.ui.completions.java.test ---
23:44:19 [2022-05-28T03:44:19.558Z] [INFO] 
23:44:19 [2022-05-28T03:44:19.558Z] [INFO] ---------< org.eclipse.ease:org.eclipse.ease.releng.coverage >----------
23:44:19 [2022-05-28T03:44:19.558Z] [INFO] Building org.eclipse.ease.releng.coverage 0.9.0-SNAPSHOT         [48/49]
23:44:19 [2022-05-28T03:44:19.558Z] [INFO] --------------------------------[ pom ]---------------------------------
23:44:19 [2022-05-28T03:44:19.558Z] [INFO] 
23:44:19 [2022-05-28T03:44:19.558Z] [INFO] --- maven-clean-plugin:2.5:clean (default-clean) @ org.eclipse.ease.releng.coverage ---
23:44:19 [2022-05-28T03:44:19.558Z] [INFO] 
23:44:19 [2022-05-28T03:44:19.558Z] [INFO] --- jacoco-maven-plugin:0.8.6:report-aggregate (default) @ org.eclipse.ease.releng.coverage ---
23:44:19 [2022-05-28T03:44:19.558Z] [INFO] Loading execution data file /home/jenkins/agent/workspace/ease.verify.core.target.2018-12/tests/org.eclipse.ease.test/target/jacoco.exec
23:44:19 [2022-05-28T03:44:19.558Z] [INFO] Loading execution data file /home/jenkins/agent/workspace/ease.verify.core.target.2018-12/tests/org.eclipse.ease.lang.javascript.rhino.test/target/jacoco.exec
23:44:19 [2022-05-28T03:44:19.558Z] [INFO] Loading execution data file /home/jenkins/agent/workspace/ease.verify.core.target.2018-12/tests/org.eclipse.ease.lang.javascript.test/target/jacoco.exec
23:44:19 [2022-05-28T03:44:19.815Z] [INFO] Loading execution data file /home/jenkins/agent/workspace/ease.verify.core.target.2018-12/tests/org.eclipse.ease.lang.python.test/target/jacoco.exec
23:44:19 [2022-05-28T03:44:19.815Z] [INFO] Loading execution data file /home/jenkins/agent/workspace/ease.verify.core.target.2018-12/tests/org.eclipse.ease.lang.python.jython.test/target/jacoco.exec
23:44:19 [2022-05-28T03:44:19.815Z] [INFO] Loading execution data file /home/jenkins/agent/workspace/ease.verify.core.target.2018-12/tests/org.eclipse.ease.lang.scriptarchive.test/target/jacoco.exec
23:44:19 [2022-05-28T03:44:19.815Z] [INFO] Loading execution data file /home/jenkins/agent/workspace/ease.verify.core.target.2018-12/tests/org.eclipse.ease.lang.unittest.test/target/jacoco.exec
23:44:19 [2022-05-28T03:44:19.815Z] [INFO] Loading execution data file /home/jenkins/agent/workspace/ease.verify.core.target.2018-12/tests/org.eclipse.ease.ui.scripts.test/target/jacoco.exec
23:44:19 [2022-05-28T03:44:19.815Z] [INFO] Loading execution data file /home/jenkins/agent/workspace/ease.verify.core.target.2018-12/tests/org.eclipse.ease.ui.test/target/jacoco.exec
23:44:19 [2022-05-28T03:44:19.815Z] [INFO] Loading execution data file /home/jenkins/agent/workspace/ease.verify.core.target.2018-12/tests/org.eclipse.ease.ui.completions.java.test/target/jacoco.exec
23:44:20 [2022-05-28T03:44:20.071Z] [INFO] Analyzed bundle 'org.eclipse.ease' with 105 classes
23:44:20 [2022-05-28T03:44:20.338Z] [INFO] Analyzed bundle 'org.eclipse.ease.classloader' with 1 classes
23:44:20 [2022-05-28T03:44:20.338Z] [INFO] Analyzed bundle 'org.eclipse.ease.ui' with 215 classes
23:44:20 [2022-05-28T03:44:20.595Z] [INFO] Analyzed bundle 'org.eclipse.ease.ui.completions.java' with 14 classes
23:44:20 [2022-05-28T03:44:20.595Z] [INFO] Analyzed bundle 'org.eclipse.ease.ui.scripts' with 154 classes
23:44:20 [2022-05-28T03:44:20.595Z] [INFO] Analyzed bundle 'org.eclipse.ease.help' with 0 classes
23:44:20 [2022-05-28T03:44:20.595Z] [INFO] Analyzed bundle 'org.eclipse.ease.lang.javascript' with 5 classes
23:44:20 [2022-05-28T03:44:20.595Z] [INFO] Analyzed bundle 'org.eclipse.ease.lang.javascript.ui' with 4 classes
23:44:20 [2022-05-28T03:44:20.595Z] [INFO] Analyzed bundle 'org.eclipse.ease.lang.javascript.rhino' with 21 classes
23:44:20 [2022-05-28T03:44:20.851Z] [INFO] Analyzed bundle 'org.eclipse.ease.lang.javascript.nashorn' with 2 classes
23:44:20 [2022-05-28T03:44:20.851Z] [INFO] Analyzed bundle 'org.eclipse.ease.lang.python' with 23 classes
23:44:20 [2022-05-28T03:44:20.851Z] [INFO] Analyzed bundle 'org.eclipse.ease.lang.python.jython' with 13 classes
23:44:20 [2022-05-28T03:44:20.851Z] [INFO] Analyzed bundle 'org.eclipse.ease.lang.python.py4j' with 11 classes
23:44:20 [2022-05-28T03:44:20.852Z] [INFO] Analyzed bundle 'org.eclipse.ease.lang.jvm.compiled' with 2 classes
23:44:20 [2022-05-28T03:44:20.852Z] [INFO] Analyzed bundle 'org.eclipse.ease.lang.groovy' with 3 classes
23:44:20 [2022-05-28T03:44:20.852Z] [INFO] Analyzed bundle 'org.eclipse.ease.lang.groovy.interpreter' with 3 classes
23:44:20 [2022-05-28T03:44:20.852Z] [INFO] Analyzed bundle 'org.eclipse.ease.lang.ruby' with 3 classes
23:44:20 [2022-05-28T03:44:20.852Z] [INFO] Analyzed bundle 'org.eclipse.ease.lang.ruby.jruby' with 2 classes
23:44:20 [2022-05-28T03:44:20.852Z] [INFO] Analyzed bundle 'org.eclipse.ease.lang.scriptarchive' with 3 classes
23:44:20 [2022-05-28T03:44:20.852Z] [INFO] Analyzed bundle 'org.eclipse.ease.lang.scriptarchive.ui' with 8 classes
23:44:20 [2022-05-28T03:44:20.852Z] [INFO] Analyzed bundle 'org.eclipse.ease.lang.unittest' with 51 classes
23:44:20 [2022-05-28T03:44:20.852Z] [INFO] Analyzed bundle 'org.eclipse.ease.lang.unittest.ui' with 79 classes
23:44:21 [2022-05-28T03:44:21.108Z] [INFO] 
23:44:21 [2022-05-28T03:44:21.108Z] [INFO] --- maven-install-plugin:2.4:install (default-install) @ org.eclipse.ease.releng.coverage ---
23:44:21 [2022-05-28T03:44:21.108Z] [INFO] Installing /home/jenkins/agent/workspace/ease.verify.core.target.2018-12/releng/org.eclipse.ease.releng.coverage/pom.xml to /home/jenkins/.m2/repository/org/eclipse/ease/org.eclipse.ease.releng.coverage/0.9.0-SNAPSHOT/org.eclipse.ease.releng.coverage-0.9.0-SNAPSHOT.pom
23:44:21 [2022-05-28T03:44:21.109Z] [INFO] 
23:44:21 [2022-05-28T03:44:21.109Z] [INFO] ---------------------< org.eclipse.ease:ease.core >---------------------
23:44:21 [2022-05-28T03:44:21.109Z] [INFO] Building EASE (Incubation) 0.4.0-SNAPSHOT                        [49/49]
23:44:21 [2022-05-28T03:44:21.109Z] [INFO] --------------------------------[ pom ]---------------------------------
23:44:21 [2022-05-28T03:44:21.109Z] [INFO] 
23:44:21 [2022-05-28T03:44:21.109Z] [INFO] --- maven-clean-plugin:2.5:clean (default-clean) @ ease.core ---
23:44:21 [2022-05-28T03:44:21.109Z] [INFO] 
23:44:21 [2022-05-28T03:44:21.109Z] [INFO] --- maven-install-plugin:2.4:install (default-install) @ ease.core ---
23:44:21 [2022-05-28T03:44:21.366Z] [INFO] Installing /home/jenkins/agent/workspace/ease.verify.core.target.2018-12/pom.xml to /home/jenkins/.m2/repository/org/eclipse/ease/ease.core/0.4.0-SNAPSHOT/ease.core-0.4.0-SNAPSHOT.pom
23:44:21 [2022-05-28T03:44:21.366Z] [INFO] ------------------------------------------------------------------------
23:44:21 [2022-05-28T03:44:21.366Z] [INFO] Reactor Summary:
23:44:21 [2022-05-28T03:44:21.366Z] [INFO] 
23:44:21 [2022-05-28T03:44:21.366Z] [INFO] org.eclipse.ease.classloader 0.9.0-SNAPSHOT ........ SUCCESS [ 31.421 s]
23:44:21 [2022-05-28T03:44:21.366Z] [INFO] org.eclipse.ease 0.9.0-SNAPSHOT .................... SUCCESS [ 21.775 s]
23:44:21 [2022-05-28T03:44:21.366Z] [INFO] org.eclipse.ease.ui 0.9.0-SNAPSHOT ................. SUCCESS [ 25.248 s]
23:44:21 [2022-05-28T03:44:21.366Z] [INFO] org.eclipse.ease.ui.completions.java 0.9.0-SNAPSHOT  SUCCESS [  9.641 s]
23:44:21 [2022-05-28T03:44:21.366Z] [INFO] org.eclipse.ease.ui.scripts 0.9.0-SNAPSHOT ......... SUCCESS [ 19.891 s]
23:44:21 [2022-05-28T03:44:21.366Z] [INFO] org.eclipse.ease.releng 0.9.0-SNAPSHOT ............. SUCCESS [  0.331 s]
23:44:21 [2022-05-28T03:44:21.366Z] [INFO] org.eclipse.ease.lang.javascript 0.9.0-SNAPSHOT .... SUCCESS [  7.457 s]
23:44:21 [2022-05-28T03:44:21.366Z] [INFO] org.eclipse.ease.lang.scriptarchive 0.9.0-SNAPSHOT . SUCCESS [  6.591 s]
23:44:21 [2022-05-28T03:44:21.366Z] [INFO] org.eclipse.ease.lang.python 0.9.0-SNAPSHOT ........ SUCCESS [  8.399 s]
23:44:21 [2022-05-28T03:44:21.366Z] [INFO] org.eclipse.ease.lang.python.py4j 0.9.0-SNAPSHOT ... SUCCESS [  9.074 s]
23:44:21 [2022-05-28T03:44:21.366Z] [INFO] org.eclipse.ease.lang.groovy 0.9.0-SNAPSHOT ........ SUCCESS [  5.790 s]
23:44:21 [2022-05-28T03:44:21.366Z] [INFO] org.eclipse.ease.lang.groovy.interpreter 0.9.0-SNAPSHOT SUCCESS [  5.869 s]
23:44:21 [2022-05-28T03:44:21.366Z] [INFO] org.eclipse.ease.lang.unittest 0.9.0-SNAPSHOT ...... SUCCESS [ 13.239 s]
23:44:21 [2022-05-28T03:44:21.366Z] [INFO] org.eclipse.ease.lang.unittest.ui 0.9.0-SNAPSHOT ... SUCCESS [ 16.534 s]
23:44:21 [2022-05-28T03:44:21.366Z] [INFO] org.eclipse.ease.lang.ruby 0.9.0-SNAPSHOT .......... SUCCESS [  6.084 s]
23:44:21 [2022-05-28T03:44:21.366Z] [INFO] org.eclipse.ease.lang.ruby.jruby 0.9.0-SNAPSHOT .... SUCCESS [  5.192 s]
23:44:21 [2022-05-28T03:44:21.366Z] [INFO] org.eclipse.ease.lang.javascript.nashorn 0.9.0-SNAPSHOT SUCCESS [  6.433 s]
23:44:21 [2022-05-28T03:44:21.366Z] [INFO] org.eclipse.ease.lang.javascript.rhino 0.9.0-SNAPSHOT SUCCESS [  8.885 s]
23:44:21 [2022-05-28T03:44:21.366Z] [INFO] org.eclipse.ease.lang.python.jython 0.9.0-SNAPSHOT . SUCCESS [  9.736 s]
23:44:21 [2022-05-28T03:44:21.366Z] [INFO] org.eclipse.ease.lang.javascript.ui 0.9.0-SNAPSHOT . SUCCESS [  6.674 s]
23:44:21 [2022-05-28T03:44:21.366Z] [INFO] org.eclipse.ease.lang.jvm.compiled 0.9.0-SNAPSHOT .. SUCCESS [  6.906 s]
23:44:21 [2022-05-28T03:44:21.366Z] [INFO] org.eclipse.ease.lang.scriptarchive.ui 0.9.0-SNAPSHOT SUCCESS [  8.409 s]
23:44:21 [2022-05-28T03:44:21.366Z] [INFO] org.eclipse.ease.help 0.9.0-SNAPSHOT ............... SUCCESS [ 10.341 s]
23:44:21 [2022-05-28T03:44:21.366Z] [INFO] org.eclipse.ease.feature 0.9.0-SNAPSHOT ............ SUCCESS [  0.230 s]
23:44:21 [2022-05-28T03:44:21.366Z] [INFO] org.eclipse.ease.ui.feature 0.9.0-SNAPSHOT ......... SUCCESS [  0.185 s]
23:44:21 [2022-05-28T03:44:21.366Z] [INFO] org.eclipse.ease.lang.javascript.feature 0.9.0-SNAPSHOT SUCCESS [  0.107 s]
23:44:21 [2022-05-28T03:44:21.366Z] [INFO] org.eclipse.ease.lang.python.feature 0.9.0-SNAPSHOT  SUCCESS [  0.102 s]
23:44:21 [2022-05-28T03:44:21.366Z] [INFO] org.eclipse.ease.python.jython.feature 0.9.0-SNAPSHOT SUCCESS [  0.106 s]
23:44:21 [2022-05-28T03:44:21.366Z] [INFO] org.eclipse.ease.lang.python.py4j.feature 0.9.0-SNAPSHOT SUCCESS [  0.080 s]
23:44:21 [2022-05-28T03:44:21.366Z] [INFO] org.eclipse.ease.lang.jvm.feature 0.9.0-SNAPSHOT ... SUCCESS [  0.043 s]
23:44:21 [2022-05-28T03:44:21.366Z] [INFO] org.eclipse.ease.lang.groovy.feature 0.9.0-SNAPSHOT  SUCCESS [  0.087 s]
23:44:21 [2022-05-28T03:44:21.366Z] [INFO] org.eclipse.ease.lang.ruby.feature 0.9.0-SNAPSHOT .. SUCCESS [  0.095 s]
23:44:21 [2022-05-28T03:44:21.366Z] [INFO] org.eclipse.ease.lang.scriptarchive.feature 0.9.0-SNAPSHOT SUCCESS [  0.120 s]
23:44:21 [2022-05-28T03:44:21.366Z] [INFO] org.eclipse.ease.lang.unittest.feature 0.9.0-SNAPSHOT SUCCESS [  0.088 s]
23:44:21 [2022-05-28T03:44:21.366Z] [INFO] org.eclipse.ease.releng.target 0.9.0-SNAPSHOT ...... SUCCESS [  0.009 s]
23:44:21 [2022-05-28T03:44:21.366Z] [INFO] org.eclipse.ease.releng.p2 0.9.0-SNAPSHOT .......... SUCCESS [  3.243 s]
23:44:21 [2022-05-28T03:44:21.366Z] [INFO] org.eclipse.ease.testhelper 0.9.0-SNAPSHOT ......... SUCCESS [  7.735 s]
23:44:21 [2022-05-28T03:44:21.366Z] [INFO] org.eclipse.ease.test 0.9.0-SNAPSHOT ............... SUCCESS [ 31.035 s]
23:44:21 [2022-05-28T03:44:21.366Z] [INFO] org.eclipse.ease.lang.javascript.rhino.test 0.9.0-SNAPSHOT SUCCESS [ 23.115 s]
23:44:21 [2022-05-28T03:44:21.366Z] [INFO] org.eclipse.ease.lang.javascript.test 0.9.0-SNAPSHOT SUCCESS [  8.235 s]
23:44:21 [2022-05-28T03:44:21.366Z] [INFO] org.eclipse.ease.lang.python.test 0.9.0-SNAPSHOT ... SUCCESS [ 10.884 s]
23:44:21 [2022-05-28T03:44:21.366Z] [INFO] org.eclipse.ease.lang.python.jython.test 0.9.0-SNAPSHOT SUCCESS [ 26.165 s]
23:44:21 [2022-05-28T03:44:21.366Z] [INFO] org.eclipse.ease.lang.scriptarchive.test 0.9.0-SNAPSHOT SUCCESS [  9.609 s]
23:44:21 [2022-05-28T03:44:21.366Z] [INFO] org.eclipse.ease.lang.unittest.test 0.9.0-SNAPSHOT . SUCCESS [ 16.111 s]
23:44:21 [2022-05-28T03:44:21.366Z] [INFO] org.eclipse.ease.ui.scripts.test 0.9.0-SNAPSHOT .... SUCCESS [  7.373 s]
23:44:21 [2022-05-28T03:44:21.367Z] [INFO] org.eclipse.ease.ui.test 0.9.0-SNAPSHOT ............ SUCCESS [ 16.377 s]
23:44:21 [2022-05-28T03:44:21.367Z] [INFO] org.eclipse.ease.ui.completions.java.test 0.9.0-SNAPSHOT SUCCESS [ 11.663 s]
23:44:21 [2022-05-28T03:44:21.367Z] [INFO] org.eclipse.ease.releng.coverage 0.9.0-SNAPSHOT .... SUCCESS [  1.611 s]
23:44:21 [2022-05-28T03:44:21.367Z] [INFO] EASE (Incubation) 0.4.0-SNAPSHOT ................... SUCCESS [  0.231 s]
23:44:21 [2022-05-28T03:44:21.367Z] [INFO] ------------------------------------------------------------------------
23:44:21 [2022-05-28T03:44:21.367Z] [INFO] BUILD SUCCESS
23:44:21 [2022-05-28T03:44:21.367Z] [INFO] ------------------------------------------------------------------------
23:44:21 [2022-05-28T03:44:21.367Z] [INFO] Total time:  07:48 min
23:44:21 [2022-05-28T03:44:21.367Z] [INFO] Finished at: 2022-05-28T03:44:21Z
23:44:21 [2022-05-28T03:44:21.367Z] [INFO] ------------------------------------------------------------------------
23:44:21 [2022-05-28T03:44:21.367Z] [INFO] [jenkins-event-spy] Generated /home/jenkins/agent/workspace/ease.verify.core.target.2018-12@tmp/withMavenf46734fb/maven-spy-20220528-033632-4562858530969399326699.log
[Pipeline] }
23:44:22 [2022-05-28T03:44:22.716Z] [withMaven] junitPublisher - Archive test results for Maven artifact org.eclipse.ease:org.eclipse.ease.classloader:eclipse-plugin:0.9.0-SNAPSHOT generated by maven-surefire-plugin:test (default-test): plugins/org.eclipse.ease.classloader/target/surefire-reports/*.xml
23:44:22 [2022-05-28T03:44:22.718Z] [withMaven] junitPublisher - Archive test results for Maven artifact org.eclipse.ease:org.eclipse.ease:eclipse-plugin:0.9.0-SNAPSHOT generated by maven-surefire-plugin:test (default-test): plugins/org.eclipse.ease/target/surefire-reports/*.xml
23:44:22 [2022-05-28T03:44:22.718Z] [withMaven] junitPublisher - Archive test results for Maven artifact org.eclipse.ease:org.eclipse.ease.ui:eclipse-plugin:0.9.0-SNAPSHOT generated by maven-surefire-plugin:test (default-test): plugins/org.eclipse.ease.ui/target/surefire-reports/*.xml
23:44:22 [2022-05-28T03:44:22.718Z] [withMaven] junitPublisher - Archive test results for Maven artifact org.eclipse.ease:org.eclipse.ease.ui.completions.java:eclipse-plugin:0.9.0-SNAPSHOT generated by maven-surefire-plugin:test (default-test): plugins/org.eclipse.ease.ui.completions.java/target/surefire-reports/*.xml
23:44:22 [2022-05-28T03:44:22.718Z] [withMaven] junitPublisher - Archive test results for Maven artifact org.eclipse.ease:org.eclipse.ease.ui.scripts:eclipse-plugin:0.9.0-SNAPSHOT generated by maven-surefire-plugin:test (default-test): plugins/org.eclipse.ease.ui.scripts/target/surefire-reports/*.xml
23:44:22 [2022-05-28T03:44:22.718Z] [withMaven] junitPublisher - Archive test results for Maven artifact org.eclipse.ease:org.eclipse.ease.lang.javascript:eclipse-plugin:0.9.0-SNAPSHOT generated by maven-surefire-plugin:test (default-test): plugins/org.eclipse.ease.lang.javascript/target/surefire-reports/*.xml
23:44:22 [2022-05-28T03:44:22.718Z] [withMaven] junitPublisher - Archive test results for Maven artifact org.eclipse.ease:org.eclipse.ease.lang.scriptarchive:eclipse-plugin:0.9.0-SNAPSHOT generated by maven-surefire-plugin:test (default-test): plugins/org.eclipse.ease.lang.scriptarchive/target/surefire-reports/*.xml
23:44:22 [2022-05-28T03:44:22.718Z] [withMaven] junitPublisher - Archive test results for Maven artifact org.eclipse.ease:org.eclipse.ease.lang.python:eclipse-plugin:0.9.0-SNAPSHOT generated by maven-surefire-plugin:test (default-test): plugins/org.eclipse.ease.lang.python/target/surefire-reports/*.xml
23:44:22 [2022-05-28T03:44:22.718Z] [withMaven] junitPublisher - Archive test results for Maven artifact org.eclipse.ease:org.eclipse.ease.lang.python.py4j:eclipse-plugin:0.9.0-SNAPSHOT generated by maven-surefire-plugin:test (default-test): plugins/org.eclipse.ease.lang.python.py4j/target/surefire-reports/*.xml
23:44:22 [2022-05-28T03:44:22.719Z] [withMaven] junitPublisher - Archive test results for Maven artifact org.eclipse.ease:org.eclipse.ease.lang.groovy:eclipse-plugin:0.9.0-SNAPSHOT generated by maven-surefire-plugin:test (default-test): plugins/org.eclipse.ease.lang.groovy/target/surefire-reports/*.xml
23:44:22 [2022-05-28T03:44:22.719Z] [withMaven] junitPublisher - Archive test results for Maven artifact org.eclipse.ease:org.eclipse.ease.lang.groovy.interpreter:eclipse-plugin:0.9.0-SNAPSHOT generated by maven-surefire-plugin:test (default-test): plugins/org.eclipse.ease.lang.groovy.interpreter/target/surefire-reports/*.xml
23:44:22 [2022-05-28T03:44:22.719Z] [withMaven] junitPublisher - Archive test results for Maven artifact org.eclipse.ease:org.eclipse.ease.lang.unittest:eclipse-plugin:0.9.0-SNAPSHOT generated by maven-surefire-plugin:test (default-test): plugins/org.eclipse.ease.lang.unittest/target/surefire-reports/*.xml
23:44:22 [2022-05-28T03:44:22.719Z] [withMaven] junitPublisher - Archive test results for Maven artifact org.eclipse.ease:org.eclipse.ease.lang.unittest.ui:eclipse-plugin:0.9.0-SNAPSHOT generated by maven-surefire-plugin:test (default-test): plugins/org.eclipse.ease.lang.unittest.ui/target/surefire-reports/*.xml
23:44:22 [2022-05-28T03:44:22.719Z] [withMaven] junitPublisher - Archive test results for Maven artifact org.eclipse.ease:org.eclipse.ease.lang.ruby:eclipse-plugin:0.9.0-SNAPSHOT generated by maven-surefire-plugin:test (default-test): plugins/org.eclipse.ease.lang.ruby/target/surefire-reports/*.xml
23:44:22 [2022-05-28T03:44:22.719Z] [withMaven] junitPublisher - Archive test results for Maven artifact org.eclipse.ease:org.eclipse.ease.lang.ruby.jruby:eclipse-plugin:0.9.0-SNAPSHOT generated by maven-surefire-plugin:test (default-test): plugins/org.eclipse.ease.lang.ruby.jruby/target/surefire-reports/*.xml
23:44:22 [2022-05-28T03:44:22.719Z] [withMaven] junitPublisher - Archive test results for Maven artifact org.eclipse.ease:org.eclipse.ease.lang.javascript.nashorn:eclipse-plugin:0.9.0-SNAPSHOT generated by maven-surefire-plugin:test (default-test): plugins/org.eclipse.ease.lang.javascript.nashorn/target/surefire-reports/*.xml
23:44:22 [2022-05-28T03:44:22.719Z] [withMaven] junitPublisher - Archive test results for Maven artifact org.eclipse.ease:org.eclipse.ease.lang.javascript.rhino:eclipse-plugin:0.9.0-SNAPSHOT generated by maven-surefire-plugin:test (default-test): plugins/org.eclipse.ease.lang.javascript.rhino/target/surefire-reports/*.xml
23:44:22 [2022-05-28T03:44:22.719Z] [withMaven] junitPublisher - Archive test results for Maven artifact org.eclipse.ease:org.eclipse.ease.lang.python.jython:eclipse-plugin:0.9.0-SNAPSHOT generated by maven-surefire-plugin:test (default-test): plugins/org.eclipse.ease.lang.python.jython/target/surefire-reports/*.xml
23:44:22 [2022-05-28T03:44:22.719Z] [withMaven] junitPublisher - Archive test results for Maven artifact org.eclipse.ease:org.eclipse.ease.lang.javascript.ui:eclipse-plugin:0.9.0-SNAPSHOT generated by maven-surefire-plugin:test (default-test): plugins/org.eclipse.ease.lang.javascript.ui/target/surefire-reports/*.xml
23:44:22 [2022-05-28T03:44:22.720Z] [withMaven] junitPublisher - Archive test results for Maven artifact org.eclipse.ease:org.eclipse.ease.lang.jvm.compiled:eclipse-plugin:0.9.0-SNAPSHOT generated by maven-surefire-plugin:test (default-test): plugins/org.eclipse.ease.lang.jvm.compiled/target/surefire-reports/*.xml
23:44:22 [2022-05-28T03:44:22.720Z] [withMaven] junitPublisher - Archive test results for Maven artifact org.eclipse.ease:org.eclipse.ease.lang.scriptarchive.ui:eclipse-plugin:0.9.0-SNAPSHOT generated by maven-surefire-plugin:test (default-test): plugins/org.eclipse.ease.lang.scriptarchive.ui/target/surefire-reports/*.xml
23:44:22 [2022-05-28T03:44:22.720Z] [withMaven] junitPublisher - Archive test results for Maven artifact org.eclipse.ease:org.eclipse.ease.help:eclipse-plugin:0.9.0-SNAPSHOT generated by maven-surefire-plugin:test (default-test): plugins/org.eclipse.ease.help/target/surefire-reports/*.xml
23:44:22 [2022-05-28T03:44:22.720Z] [withMaven] junitPublisher - Archive test results for Maven artifact org.eclipse.ease:org.eclipse.ease.testhelper:eclipse-plugin:0.9.0-SNAPSHOT generated by maven-surefire-plugin:test (default-test): tests/org.eclipse.ease.testhelper/target/surefire-reports/*.xml
23:44:22 [2022-05-28T03:44:22.722Z] [withMaven] junitPublisher - Jenkins JUnit Attachments Plugin not found, can't publish test attachments.Recording test results
23:44:22 [2022-05-28T03:44:22.855Z] None of the test reports contained any result
23:44:22 [2022-05-28T03:44:22.855Z] [withMaven] junitPublisher - Archive test results for Maven artifact org.eclipse.ease:org.eclipse.ease.test:eclipse-test-plugin:0.9.0-SNAPSHOT generated by tycho-surefire-plugin:test (default-test): tests/org.eclipse.ease.test/target/surefire-reports/*.xml
23:44:22 [2022-05-28T03:44:22.855Z] [withMaven] junitPublisher - Archive test results for Maven artifact org.eclipse.ease:org.eclipse.ease.lang.javascript.rhino.test:eclipse-test-plugin:0.9.0-SNAPSHOT generated by tycho-surefire-plugin:test (default-test): tests/org.eclipse.ease.lang.javascript.rhino.test/target/surefire-reports/*.xml
23:44:22 [2022-05-28T03:44:22.855Z] [withMaven] junitPublisher - Archive test results for Maven artifact org.eclipse.ease:org.eclipse.ease.lang.javascript.test:eclipse-test-plugin:0.9.0-SNAPSHOT generated by tycho-surefire-plugin:test (default-test): tests/org.eclipse.ease.lang.javascript.test/target/surefire-reports/*.xml
23:44:22 [2022-05-28T03:44:22.856Z] [withMaven] junitPublisher - Archive test results for Maven artifact org.eclipse.ease:org.eclipse.ease.lang.python.test:eclipse-test-plugin:0.9.0-SNAPSHOT generated by tycho-surefire-plugin:test (default-test): tests/org.eclipse.ease.lang.python.test/target/surefire-reports/*.xml
23:44:22 [2022-05-28T03:44:22.856Z] [withMaven] junitPublisher - Archive test results for Maven artifact org.eclipse.ease:org.eclipse.ease.lang.python.jython.test:eclipse-test-plugin:0.9.0-SNAPSHOT generated by tycho-surefire-plugin:test (default-test): tests/org.eclipse.ease.lang.python.jython.test/target/surefire-reports/*.xml
23:44:22 [2022-05-28T03:44:22.856Z] [withMaven] junitPublisher - Archive test results for Maven artifact org.eclipse.ease:org.eclipse.ease.lang.scriptarchive.test:eclipse-test-plugin:0.9.0-SNAPSHOT generated by tycho-surefire-plugin:test (default-test): tests/org.eclipse.ease.lang.scriptarchive.test/target/surefire-reports/*.xml
23:44:22 [2022-05-28T03:44:22.856Z] [withMaven] junitPublisher - Archive test results for Maven artifact org.eclipse.ease:org.eclipse.ease.lang.unittest.test:eclipse-test-plugin:0.9.0-SNAPSHOT generated by tycho-surefire-plugin:test (default-test): tests/org.eclipse.ease.lang.unittest.test/target/surefire-reports/*.xml
23:44:22 [2022-05-28T03:44:22.856Z] [withMaven] junitPublisher - Archive test results for Maven artifact org.eclipse.ease:org.eclipse.ease.ui.scripts.test:eclipse-test-plugin:0.9.0-SNAPSHOT generated by tycho-surefire-plugin:test (default-test): tests/org.eclipse.ease.ui.scripts.test/target/surefire-reports/*.xml
23:44:22 [2022-05-28T03:44:22.856Z] [withMaven] junitPublisher - Archive test results for Maven artifact org.eclipse.ease:org.eclipse.ease.ui.test:eclipse-test-plugin:0.9.0-SNAPSHOT generated by tycho-surefire-plugin:test (default-test): tests/org.eclipse.ease.ui.test/target/surefire-reports/*.xml
23:44:22 [2022-05-28T03:44:22.856Z] [withMaven] junitPublisher - Archive test results for Maven artifact org.eclipse.ease:org.eclipse.ease.ui.completions.java.test:eclipse-test-plugin:0.9.0-SNAPSHOT generated by tycho-surefire-plugin:test (default-test): tests/org.eclipse.ease.ui.completions.java.test/target/surefire-reports/*.xml
23:44:22 [2022-05-28T03:44:22.857Z] [withMaven] junitPublisher - Jenkins JUnit Attachments Plugin not found, can't publish test attachments.Recording test results
23:44:22 [2022-05-28T03:44:22.787Z] No test report files were found. Configuration error?
23:44:25 [2022-05-28T03:44:25.061Z] [withMaven] Jenkins JaCoCo Plugin not found, don't display org.jacoco:jacoco-maven-plugin:prepare-agent[-integration] results in pipeline screen.
23:44:25 [2022-05-28T03:44:25.065Z] [withMaven] Jenkins FindBugs Plugin not found, don't display com.github.spotbugs:spotbugs-maven-plugin:spotbugs results in pipeline screen.
23:44:25 [2022-05-28T03:44:25.071Z] [withMaven] Publishers: Pipeline Graph Publisher: 59 ms, Invoker Publisher: 2 ms, Junit Publisher: 527 ms, Concordion Publisher: 2 ms, Dependencies Fingerprint Publisher: 1804 ms, Findbugs Publisher: 1 ms, Jacoco Publisher: 3 ms, SpotBugs Publisher: 2 ms
[Pipeline] // withMaven
[Pipeline] }
[Pipeline] // stage
[Pipeline] stage
[Pipeline] { (Test)
[Pipeline] sh
23:44:25 [2022-05-28T03:44:25.428Z] + cp 'releng/org.eclipse.ease.releng.target/previous targets/2018-12.target' releng/org.eclipse.ease.releng.target/org.eclipse.ease.releng.target.target
[Pipeline] withMaven
23:44:25 [2022-05-28T03:44:25.437Z] [withMaven] Options: [org.jenkinsci.plugins.pipeline.maven.publishers.GeneratedArtifactsPublisher[disabled=true], org.jenkinsci.plugins.pipeline.maven.publishers.FindbugsAnalysisPublisher[disabled='false', healthy='', unHealthy='', thresholdLimit='low'], org.jenkinsci.plugins.pipeline.maven.publishers.TasksScannerPublisher[disabled='true', healthy='', unHealthy='', thresholdLimit='low']]
23:44:25 [2022-05-28T03:44:25.438Z] [withMaven] Available options: 
23:44:25 [2022-05-28T03:44:25.438Z] [withMaven] using JDK installation openjdk-jdk15-latest
23:44:25 [2022-05-28T03:44:25.443Z] [withMaven] using Maven installation 'apache-maven-latest'
[Pipeline] {
[Pipeline] sh
23:44:26 [2022-05-28T03:44:26.245Z] + mvn integration-test -f releng/org.eclipse.ease.releng/target-tests-pom.xml
23:44:26 [2022-05-28T03:44:26.246Z] ----- withMaven Wrapper script -----
23:44:26 [2022-05-28T03:44:26.246Z] Picked up JAVA_TOOL_OPTIONS: -Dmaven.ext.class.path="/home/jenkins/agent/workspace/ease.verify.core.target.2018-12@tmp/withMaven00b3f76e/pipeline-maven-spy.jar" -Dorg.jenkinsci.plugins.pipeline.maven.reportsFolder="/home/jenkins/agent/workspace/ease.verify.core.target.2018-12@tmp/withMaven00b3f76e" 
23:44:26 [2022-05-28T03:44:26.503Z] Apache Maven 3.8.5 (3599d3414f046de2324203b78ddcf9b5e4388aa0)
23:44:26 [2022-05-28T03:44:26.503Z] Maven home: /opt/tools/apache-maven/latest
23:44:26 [2022-05-28T03:44:26.503Z] Java version: 15.0.2, vendor: Oracle Corporation, runtime: /opt/tools/java/openjdk/jdk-15/15.0.2+7
23:44:26 [2022-05-28T03:44:26.503Z] Default locale: en_US, platform encoding: UTF-8
23:44:26 [2022-05-28T03:44:26.503Z] OS name: "linux", version: "5.14.14-200.fc34.x86_64", arch: "amd64", family: "unix"
23:44:27 [2022-05-28T03:44:27.436Z] [INFO] [jenkins-event-spy] Generate /home/jenkins/agent/workspace/ease.verify.core.target.2018-12@tmp/withMaven00b3f76e/maven-spy-20220528-034427-19510188387289726595268.log.tmp ...
23:44:27 [2022-05-28T03:44:27.693Z] [INFO] Scanning for projects...
23:44:31 [2022-05-28T03:44:31.868Z] [ERROR] Several versions of tycho plugins are configured [2.2.0, 2.4.0]:
23:44:31 [2022-05-28T03:44:31.868Z] [ERROR] 2.2.0:
23:44:31 [2022-05-28T03:44:31.868Z] [ERROR] 	MavenProject: org.eclipse.ease:org.eclipse.ease.releng:0.9.0-SNAPSHOT @ /home/jenkins/agent/workspace/ease.verify.core.target.2018-12/releng/org.eclipse.ease.releng/target-tests-pom.xml
23:44:31 [2022-05-28T03:44:31.868Z] [ERROR] 2.4.0:
23:44:31 [2022-05-28T03:44:31.868Z] [ERROR] 	MavenProject: org.eclipse.ease:org.eclipse.ease.releng.target:0.9.0-SNAPSHOT @ /home/jenkins/agent/workspace/ease.verify.core.target.2018-12/releng/org.eclipse.ease.releng.target/pom.xml
23:44:31 [2022-05-28T03:44:31.868Z] [ERROR] 	MavenProject: org.eclipse.ease:org.eclipse.ease.test:0.9.0-SNAPSHOT @ /home/jenkins/agent/workspace/ease.verify.core.target.2018-12/tests/org.eclipse.ease.test/pom.xml
23:44:31 [2022-05-28T03:44:31.868Z] [ERROR] 	MavenProject: org.eclipse.ease:org.eclipse.ease.lang.javascript.rhino.test:0.9.0-SNAPSHOT @ /home/jenkins/agent/workspace/ease.verify.core.target.2018-12/tests/org.eclipse.ease.lang.javascript.rhino.test/pom.xml
23:44:31 [2022-05-28T03:44:31.868Z] [ERROR] 	MavenProject: org.eclipse.ease:org.eclipse.ease.lang.javascript.test:0.9.0-SNAPSHOT @ /home/jenkins/agent/workspace/ease.verify.core.target.2018-12/tests/org.eclipse.ease.lang.javascript.test/pom.xml
23:44:31 [2022-05-28T03:44:31.868Z] [ERROR] 	MavenProject: org.eclipse.ease:org.eclipse.ease.lang.python.test:0.9.0-SNAPSHOT @ /home/jenkins/agent/workspace/ease.verify.core.target.2018-12/tests/org.eclipse.ease.lang.python.test/pom.xml
23:44:31 [2022-05-28T03:44:31.868Z] [ERROR] 	MavenProject: org.eclipse.ease:org.eclipse.ease.lang.python.jython.test:0.9.0-SNAPSHOT @ /home/jenkins/agent/workspace/ease.verify.core.target.2018-12/tests/org.eclipse.ease.lang.python.jython.test/pom.xml
23:44:31 [2022-05-28T03:44:31.869Z] [ERROR] 	MavenProject: org.eclipse.ease:org.eclipse.ease.lang.scriptarchive.test:0.9.0-SNAPSHOT @ /home/jenkins/agent/workspace/ease.verify.core.target.2018-12/tests/org.eclipse.ease.lang.scriptarchive.test/pom.xml
23:44:31 [2022-05-28T03:44:31.869Z] [ERROR] 	MavenProject: org.eclipse.ease:org.eclipse.ease.ui.test:0.9.0-SNAPSHOT @ /home/jenkins/agent/workspace/ease.verify.core.target.2018-12/tests/org.eclipse.ease.ui.test/pom.xml
23:44:31 [2022-05-28T03:44:31.869Z] [INFO] [jenkins-event-spy] Generated /home/jenkins/agent/workspace/ease.verify.core.target.2018-12@tmp/withMaven00b3f76e/maven-spy-20220528-034427-19510188387289726595268.log
23:44:31 [2022-05-28T03:44:31.869Z] [ERROR] All tycho plugins configured in one reactor must use the same version -> [Help 1]
23:44:31 [2022-05-28T03:44:31.869Z] [ERROR] 
23:44:31 [2022-05-28T03:44:31.869Z] [ERROR] To see the full stack trace of the errors, re-run Maven with the -e switch.
23:44:31 [2022-05-28T03:44:31.869Z] [ERROR] Re-run Maven using the -X switch to enable full debug logging.
23:44:31 [2022-05-28T03:44:31.869Z] [ERROR] 
23:44:31 [2022-05-28T03:44:31.869Z] [ERROR] For more information about the errors and possible solutions, please read the following articles:
23:44:31 [2022-05-28T03:44:31.869Z] [ERROR] [Help 1] http://cwiki.apache.org/confluence/display/MAVEN/MavenExecutionException
[Pipeline] }
23:44:31 [2022-05-28T03:44:31.899Z] [withMaven] Publishers: 
[Pipeline] // withMaven
[Pipeline] }
[Pipeline] // stage
[Pipeline] stage
[Pipeline] { (Declarative: Post Actions)
[Pipeline] archiveArtifacts
23:44:32 [2022-05-28T03:44:32.226Z] Archiving artifacts
[Pipeline] emailext
23:45:03 [2022-05-28T03:45:03.864Z] Sending email to: christian.pontesegger@web.de
[Pipeline] }
[Pipeline] // stage
[Pipeline] }
[Pipeline] // timeout
[Pipeline] }
[Pipeline] // timestamps
[Pipeline] }
[Pipeline] // node
[Pipeline] End of Pipeline
ERROR: script returned exit code 1
Finished: FAILURE