Console Output

Skipping 207 KB.. Full Log
.java:422)
23:43:50 [2021-04-03T03:43:50.274Z] 	at org.eclipse.osgi.internal.loader.BundleLoader.findClass(BundleLoader.java:414)
23:43:50 [2021-04-03T03:43:50.274Z] 	at org.eclipse.osgi.internal.loader.ModuleClassLoader.loadClass(ModuleClassLoader.java:153)
23:43:50 [2021-04-03T03:43:50.274Z] 	at java.base/java.lang.ClassLoader.loadClass(ClassLoader.java:522)
23:43:50 [2021-04-03T03:43:50.274Z] 	... 31 more
23:43:50 [2021-04-03T03:43:50.274Z] 
23:43:50 [2021-04-03T03:43:50.274Z] Apr 03, 2021 3:43:50 AM org.junit.platform.launcher.core.DefaultLauncher handleThrowable
23:43:50 [2021-04-03T03:43:50.274Z] WARNING: TestEngine with ID 'junit-vintage' failed to discover tests
23:43:50 [2021-04-03T03:43:50.274Z] java.lang.NoClassDefFoundError: org/junit/runners/model/RunnerBuilder
23:43:50 [2021-04-03T03:43:50.274Z] 	at org.junit.vintage.engine.discovery.VintageDiscoverer.<init>(VintageDiscoverer.java:48)
23:43:50 [2021-04-03T03:43:50.274Z] 	at org.junit.vintage.engine.VintageTestEngine.discover(VintageTestEngine.java:65)
23:43:50 [2021-04-03T03:43:50.274Z] 	at org.junit.platform.launcher.core.DefaultLauncher.discoverEngineRoot(DefaultLauncher.java:130)
23:43:50 [2021-04-03T03:43:50.274Z] 	at org.junit.platform.launcher.core.DefaultLauncher.discoverRoot(DefaultLauncher.java:117)
23:43:50 [2021-04-03T03:43:50.274Z] 	at org.junit.platform.launcher.core.DefaultLauncher.execute(DefaultLauncher.java:90)
23:43:50 [2021-04-03T03:43:50.275Z] 	at org.apache.maven.surefire.junitplatform.JUnitPlatformProvider.invokeAllTests(JUnitPlatformProvider.java:150)
23:43:50 [2021-04-03T03:43:50.275Z] 	at org.apache.maven.surefire.junitplatform.JUnitPlatformProvider.invoke(JUnitPlatformProvider.java:124)
23:43:50 [2021-04-03T03:43:50.275Z] 	at java.base/jdk.internal.reflect.NativeMethodAccessorImpl.invoke0(Native Method)
23:43:50 [2021-04-03T03:43:50.275Z] 	at java.base/jdk.internal.reflect.NativeMethodAccessorImpl.invoke(NativeMethodAccessorImpl.java:64)
23:43:50 [2021-04-03T03:43:50.275Z] 	at java.base/jdk.internal.reflect.DelegatingMethodAccessorImpl.invoke(DelegatingMethodAccessorImpl.java:43)
23:43:50 [2021-04-03T03:43:50.275Z] 	at java.base/java.lang.reflect.Method.invoke(Method.java:564)
23:43:50 [2021-04-03T03:43:50.275Z] 	at org.apache.maven.surefire.util.ReflectionUtils.invokeMethodWithArray2(ReflectionUtils.java:206)
23:43:50 [2021-04-03T03:43:50.275Z] 	at org.apache.maven.surefire.booter.ProviderFactory$ProviderProxy.invoke(ProviderFactory.java:161)
23:43:50 [2021-04-03T03:43:50.275Z] 	at org.apache.maven.surefire.booter.ProviderFactory.invokeProvider(ProviderFactory.java:84)
23:43:50 [2021-04-03T03:43:50.275Z] 	at org.eclipse.tycho.surefire.osgibooter.OsgiSurefireBooter.run(OsgiSurefireBooter.java:116)
23:43:50 [2021-04-03T03:43:50.275Z] 	at org.eclipse.tycho.surefire.osgibooter.HeadlessTestApplication.start(HeadlessTestApplication.java:23)
23:43:50 [2021-04-03T03:43:50.275Z] 	at org.eclipse.equinox.internal.app.EclipseAppHandle.run(EclipseAppHandle.java:203)
23:43:50 [2021-04-03T03:43:50.275Z] 	at org.eclipse.core.runtime.internal.adaptor.EclipseAppLauncher.runApplication(EclipseAppLauncher.java:137)
23:43:50 [2021-04-03T03:43:50.275Z] 	at org.eclipse.core.runtime.internal.adaptor.EclipseAppLauncher.start(EclipseAppLauncher.java:107)
23:43:50 [2021-04-03T03:43:50.275Z] 	at org.eclipse.core.runtime.adaptor.EclipseStarter.run(EclipseStarter.java:400)
23:43:50 [2021-04-03T03:43:50.275Z] 	at org.eclipse.core.runtime.adaptor.EclipseStarter.run(EclipseStarter.java:255)
23:43:50 [2021-04-03T03:43:50.275Z] 	at java.base/jdk.internal.reflect.NativeMethodAccessorImpl.invoke0(Native Method)
23:43:50 [2021-04-03T03:43:50.275Z] 	at java.base/jdk.internal.reflect.NativeMethodAccessorImpl.invoke(NativeMethodAccessorImpl.java:64)
23:43:50 [2021-04-03T03:43:50.275Z] 	at java.base/jdk.internal.reflect.DelegatingMethodAccessorImpl.invoke(DelegatingMethodAccessorImpl.java:43)
23:43:50 [2021-04-03T03:43:50.275Z] 	at java.base/java.lang.reflect.Method.invoke(Method.java:564)
23:43:50 [2021-04-03T03:43:50.275Z] 	at org.eclipse.equinox.launcher.Main.invokeFramework(Main.java:659)
23:43:50 [2021-04-03T03:43:50.275Z] 	at org.eclipse.equinox.launcher.Main.basicRun(Main.java:595)
23:43:50 [2021-04-03T03:43:50.275Z] 	at org.eclipse.equinox.launcher.Main.run(Main.java:1501)
23:43:50 [2021-04-03T03:43:50.275Z] 	at org.eclipse.equinox.launcher.Main.main(Main.java:1474)
23:43:50 [2021-04-03T03:43:50.275Z] Caused by: java.lang.ClassNotFoundException: org.junit.runners.model.RunnerBuilder cannot be found by org.eclipse.tycho.surefire.osgibooter_2.2.0
23:43:50 [2021-04-03T03:43:50.275Z] 	at org.eclipse.osgi.internal.loader.BundleLoader.findClassInternal(BundleLoader.java:511)
23:43:50 [2021-04-03T03:43:50.275Z] 	at org.eclipse.osgi.internal.loader.BundleLoader.findClass(BundleLoader.java:422)
23:43:50 [2021-04-03T03:43:50.275Z] 	at org.eclipse.osgi.internal.loader.BundleLoader.findClass(BundleLoader.java:414)
23:43:50 [2021-04-03T03:43:50.275Z] 	at org.eclipse.osgi.internal.loader.ModuleClassLoader.loadClass(ModuleClassLoader.java:153)
23:43:50 [2021-04-03T03:43:50.275Z] 	at java.base/java.lang.ClassLoader.loadClass(ClassLoader.java:522)
23:43:50 [2021-04-03T03:43:50.275Z] 	... 29 more
23:43:50 [2021-04-03T03:43:50.275Z] 
23:43:50 [2021-04-03T03:43:50.275Z] Running org.eclipse.ease.lang.javascript.JavaScriptCodeFactoryTest
23:43:50 [2021-04-03T03:43:50.275Z] Tests run: 1, Failures: 0, Errors: 0, Skipped: 0, Time elapsed: 0.122 s - in org.eclipse.ease.lang.javascript.JavaScriptCodeFactoryTest
23:43:50 [2021-04-03T03:43:50.275Z] testCommentCreator  Time elapsed: 0.118 s
23:43:50 [2021-04-03T03:43:50.275Z] Running org.eclipse.ease.lang.javascript.JavaScriptCompletionContextTest
23:43:50 [2021-04-03T03:43:50.540Z] Tests run: 8, Failures: 0, Errors: 0, Skipped: 0, Time elapsed: 0.286 s - in org.eclipse.ease.lang.javascript.JavaScriptCompletionContextTest
23:43:50 [2021-04-03T03:43:50.540Z] verifyStaticClassTypes  Time elapsed: 0.01 s
23:43:50 [2021-04-03T03:43:50.540Z] verifyClassInstanceTypes  Time elapsed: 0.015 s
23:43:50 [2021-04-03T03:43:50.540Z] verifyTypesForScriptEngine  Time elapsed: 0.256 s
23:43:50 [2021-04-03T03:43:50.540Z] verifyPackageTypes  Time elapsed: 0.001 s
23:43:50 [2021-04-03T03:43:50.540Z] definedVariableTypes  Time elapsed: 0.001 s
23:43:50 [2021-04-03T03:43:50.540Z] verifyStringLiteralTypes  Time elapsed: 0 s
23:43:50 [2021-04-03T03:43:50.540Z] verifyUnknownTypes  Time elapsed: 0.001 s
23:43:50 [2021-04-03T03:43:50.540Z] verifyNoneTypes  Time elapsed: 0 s
23:43:50 [2021-04-03T03:43:50.540Z] 
23:43:50 [2021-04-03T03:43:50.540Z] Results:
23:43:50 [2021-04-03T03:43:50.540Z] 
23:43:50 [2021-04-03T03:43:50.540Z] Tests run: 9, Failures: 0, Errors: 0, Skipped: 0
23:43:50 [2021-04-03T03:43:50.540Z] 
23:43:51 [2021-04-03T03:43:51.101Z] [INFO] All tests passed!
23:43:51 [2021-04-03T03:43:51.101Z] [INFO] 
23:43:51 [2021-04-03T03:43:51.101Z] [INFO] ---------< org.eclipse.ease:org.eclipse.ease.lang.python.test >---------
23:43:51 [2021-04-03T03:43:51.101Z] [INFO] Building org.eclipse.ease.lang.python.test 0.8.0-SNAPSHOT          [6/9]
23:43:51 [2021-04-03T03:43:51.101Z] [INFO] ------------------------[ eclipse-test-plugin ]-------------------------
23:43:51 [2021-04-03T03:43:51.101Z] [INFO] 
23:43:51 [2021-04-03T03:43:51.101Z] [INFO] --- tycho-packaging-plugin:2.2.0:build-qualifier (default-build-qualifier) @ org.eclipse.ease.lang.python.test ---
23:43:51 [2021-04-03T03:43:51.101Z] [INFO] The project's OSGi version is 0.8.0.I202103261223
23:43:51 [2021-04-03T03:43:51.101Z] [INFO] 
23:43:51 [2021-04-03T03:43:51.101Z] [INFO] --- tycho-packaging-plugin:2.2.0:validate-id (default-validate-id) @ org.eclipse.ease.lang.python.test ---
23:43:51 [2021-04-03T03:43:51.101Z] [INFO] 
23:43:51 [2021-04-03T03:43:51.101Z] [INFO] --- tycho-packaging-plugin:2.2.0:validate-version (default-validate-version) @ org.eclipse.ease.lang.python.test ---
23:43:51 [2021-04-03T03:43:51.101Z] [INFO] 
23:43:51 [2021-04-03T03:43:51.101Z] [INFO] --- maven-resources-plugin:2.4.3:resources (default-resources) @ org.eclipse.ease.lang.python.test ---
23:43:51 [2021-04-03T03:43:51.101Z] [INFO] Using 'UTF-8' encoding to copy filtered resources.
23:43:51 [2021-04-03T03:43:51.101Z] [INFO] skip non existing resourceDirectory /home/jenkins/agent/workspace/ease.verify.core.target.2018-12/tests/org.eclipse.ease.lang.python.test/src/main/resources
23:43:51 [2021-04-03T03:43:51.101Z] [INFO] 
23:43:51 [2021-04-03T03:43:51.101Z] [INFO] --- tycho-compiler-plugin:2.2.0:compile (default-compile) @ org.eclipse.ease.lang.python.test ---
23:43:51 [2021-04-03T03:43:51.101Z] [INFO] Nothing to compile - all classes are up to date
23:43:51 [2021-04-03T03:43:51.101Z] [INFO] 
23:43:51 [2021-04-03T03:43:51.101Z] [INFO] --- maven-resources-plugin:2.4.3:testResources (default-testResources) @ org.eclipse.ease.lang.python.test ---
23:43:51 [2021-04-03T03:43:51.101Z] [INFO] Using 'UTF-8' encoding to copy filtered resources.
23:43:51 [2021-04-03T03:43:51.101Z] [INFO] skip non existing resourceDirectory /home/jenkins/agent/workspace/ease.verify.core.target.2018-12/tests/org.eclipse.ease.lang.python.test/src/test/resources
23:43:51 [2021-04-03T03:43:51.101Z] [INFO] 
23:43:51 [2021-04-03T03:43:51.101Z] [INFO] --- target-platform-configuration:2.2.0:target-platform (default-target-platform) @ org.eclipse.ease.lang.python.test ---
23:43:51 [2021-04-03T03:43:51.101Z] [INFO] 
23:43:51 [2021-04-03T03:43:51.102Z] [INFO] --- tycho-packaging-plugin:2.2.0:package-plugin (default-package-plugin) @ org.eclipse.ease.lang.python.test ---
23:43:51 [2021-04-03T03:43:51.102Z] [INFO] Building jar: /home/jenkins/agent/workspace/ease.verify.core.target.2018-12/tests/org.eclipse.ease.lang.python.test/target/org.eclipse.ease.lang.python.test-0.8.0-SNAPSHOT.jar
23:43:51 [2021-04-03T03:43:51.388Z] [INFO] 
23:43:51 [2021-04-03T03:43:51.388Z] [INFO] --- tycho-p2-plugin:2.2.0:p2-metadata-default (default-p2-metadata-default) @ org.eclipse.ease.lang.python.test ---
23:43:51 [2021-04-03T03:43:51.388Z] [INFO] 
23:43:51 [2021-04-03T03:43:51.388Z] [INFO] --- jacoco-maven-plugin:0.8.6:prepare-agent (jacoco-initialize) @ org.eclipse.ease.lang.python.test ---
23:43:51 [2021-04-03T03:43:51.388Z] [INFO] tycho.testArgLine set to -javaagent:/home/jenkins/.m2/repository/org/jacoco/org.jacoco.agent/0.8.6/org.jacoco.agent-0.8.6-runtime.jar=destfile=/home/jenkins/agent/workspace/ease.verify.core.target.2018-12/tests/org.eclipse.ease.lang.python.test/target/jacoco.exec,output=file
23:43:51 [2021-04-03T03:43:51.388Z] [INFO] 
23:43:51 [2021-04-03T03:43:51.388Z] [INFO] --- tycho-surefire-plugin:2.2.0:test (default-test) @ org.eclipse.ease.lang.python.test ---
23:43:51 [2021-04-03T03:43:51.388Z] [INFO] Executing Test Runtime with timeout 0, logs (if any) will be placed at: /home/jenkins/agent/workspace/ease.verify.core.target.2018-12/tests/org.eclipse.ease.lang.python.test/target/work/data/.metadata/.log
23:43:51 [2021-04-03T03:43:51.388Z] [INFO] Command line:
23:43:51 [2021-04-03T03:43:51.388Z] 	[/opt/tools/java/openjdk/jdk-15/15.0.2+7/bin/java, -Dosgi.noShutdown=false, -Dosgi.os=linux, -Dosgi.ws=gtk, -Dosgi.arch=x86_64, -javaagent:/home/jenkins/.m2/repository/org/jacoco/org.jacoco.agent/0.8.6/org.jacoco.agent-0.8.6-runtime.jar=destfile=/home/jenkins/agent/workspace/ease.verify.core.target.2018-12/tests/org.eclipse.ease.lang.python.test/target/jacoco.exec,output=file, -Dosgi.clean=true, -jar, /home/jenkins/.m2/repository/p2/osgi/bundle/org.eclipse.equinox.launcher/1.5.200.v20180922-1751/org.eclipse.equinox.launcher-1.5.200.v20180922-1751.jar, -data, /home/jenkins/agent/workspace/ease.verify.core.target.2018-12/tests/org.eclipse.ease.lang.python.test/target/work/data, -install, /home/jenkins/agent/workspace/ease.verify.core.target.2018-12/tests/org.eclipse.ease.lang.python.test/target/work, -configuration, /home/jenkins/agent/workspace/ease.verify.core.target.2018-12/tests/org.eclipse.ease.lang.python.test/target/work/configuration, -application, org.eclipse.tycho.surefire.osgibooter.headlesstest, -testproperties, /home/jenkins/agent/workspace/ease.verify.core.target.2018-12/tests/org.eclipse.ease.lang.python.test/target/surefire.properties]
23:43:51 [2021-04-03T03:43:51.388Z] Picked up JAVA_TOOL_OPTIONS: -Dmaven.ext.class.path="/home/jenkins/agent/workspace/ease.verify.core.target.2018-12@tmp/withMaven758cb5fd/pipeline-maven-spy.jar" -Dorg.jenkinsci.plugins.pipeline.maven.reportsFolder="/home/jenkins/agent/workspace/ease.verify.core.target.2018-12@tmp/withMaven758cb5fd" 
23:43:53 [2021-04-03T03:43:53.915Z] Apr 03, 2021 3:43:53 AM org.junit.platform.launcher.core.DefaultLauncher handleThrowable
23:43:53 [2021-04-03T03:43:53.915Z] WARNING: TestEngine with ID 'junit-vintage' failed to discover tests
23:43:53 [2021-04-03T03:43:53.915Z] java.lang.NoClassDefFoundError: org/junit/runners/model/RunnerBuilder
23:43:53 [2021-04-03T03:43:53.915Z] 	at org.junit.vintage.engine.discovery.VintageDiscoverer.<init>(VintageDiscoverer.java:48)
23:43:53 [2021-04-03T03:43:53.915Z] 	at org.junit.vintage.engine.VintageTestEngine.discover(VintageTestEngine.java:65)
23:43:53 [2021-04-03T03:43:53.915Z] 	at org.junit.platform.launcher.core.DefaultLauncher.discoverEngineRoot(DefaultLauncher.java:130)
23:43:53 [2021-04-03T03:43:53.915Z] 	at org.junit.platform.launcher.core.DefaultLauncher.discoverRoot(DefaultLauncher.java:117)
23:43:53 [2021-04-03T03:43:53.915Z] 	at org.junit.platform.launcher.core.DefaultLauncher.discover(DefaultLauncher.java:82)
23:43:53 [2021-04-03T03:43:53.915Z] 	at org.apache.maven.surefire.junitplatform.TestPlanScannerFilter.accept(TestPlanScannerFilter.java:56)
23:43:53 [2021-04-03T03:43:53.915Z] 	at org.apache.maven.surefire.util.DefaultScanResult.applyFilter(DefaultScanResult.java:102)
23:43:53 [2021-04-03T03:43:53.915Z] 	at org.apache.maven.surefire.junitplatform.JUnitPlatformProvider.scanClasspath(JUnitPlatformProvider.java:143)
23:43:53 [2021-04-03T03:43:53.915Z] 	at org.apache.maven.surefire.junitplatform.JUnitPlatformProvider.invoke(JUnitPlatformProvider.java:124)
23:43:53 [2021-04-03T03:43:53.915Z] 	at java.base/jdk.internal.reflect.NativeMethodAccessorImpl.invoke0(Native Method)
23:43:53 [2021-04-03T03:43:53.915Z] 	at java.base/jdk.internal.reflect.NativeMethodAccessorImpl.invoke(NativeMethodAccessorImpl.java:64)
23:43:53 [2021-04-03T03:43:53.915Z] 	at java.base/jdk.internal.reflect.DelegatingMethodAccessorImpl.invoke(DelegatingMethodAccessorImpl.java:43)
23:43:53 [2021-04-03T03:43:53.915Z] 	at java.base/java.lang.reflect.Method.invoke(Method.java:564)
23:43:53 [2021-04-03T03:43:53.915Z] 	at org.apache.maven.surefire.util.ReflectionUtils.invokeMethodWithArray2(ReflectionUtils.java:206)
23:43:53 [2021-04-03T03:43:53.915Z] 	at org.apache.maven.surefire.booter.ProviderFactory$ProviderProxy.invoke(ProviderFactory.java:161)
23:43:53 [2021-04-03T03:43:53.915Z] 	at org.apache.maven.surefire.booter.ProviderFactory.invokeProvider(ProviderFactory.java:84)
23:43:53 [2021-04-03T03:43:53.915Z] 	at org.eclipse.tycho.surefire.osgibooter.OsgiSurefireBooter.run(OsgiSurefireBooter.java:116)
23:43:53 [2021-04-03T03:43:53.916Z] 	at org.eclipse.tycho.surefire.osgibooter.HeadlessTestApplication.start(HeadlessTestApplication.java:23)
23:43:53 [2021-04-03T03:43:53.916Z] 	at org.eclipse.equinox.internal.app.EclipseAppHandle.run(EclipseAppHandle.java:203)
23:43:53 [2021-04-03T03:43:53.916Z] 	at org.eclipse.core.runtime.internal.adaptor.EclipseAppLauncher.runApplication(EclipseAppLauncher.java:137)
23:43:53 [2021-04-03T03:43:53.916Z] 	at org.eclipse.core.runtime.internal.adaptor.EclipseAppLauncher.start(EclipseAppLauncher.java:107)
23:43:53 [2021-04-03T03:43:53.916Z] 	at org.eclipse.core.runtime.adaptor.EclipseStarter.run(EclipseStarter.java:400)
23:43:53 [2021-04-03T03:43:53.916Z] 	at org.eclipse.core.runtime.adaptor.EclipseStarter.run(EclipseStarter.java:255)
23:43:53 [2021-04-03T03:43:53.916Z] 	at java.base/jdk.internal.reflect.NativeMethodAccessorImpl.invoke0(Native Method)
23:43:53 [2021-04-03T03:43:53.916Z] 	at java.base/jdk.internal.reflect.NativeMethodAccessorImpl.invoke(NativeMethodAccessorImpl.java:64)
23:43:53 [2021-04-03T03:43:53.916Z] 	at java.base/jdk.internal.reflect.DelegatingMethodAccessorImpl.invoke(DelegatingMethodAccessorImpl.java:43)
23:43:53 [2021-04-03T03:43:53.916Z] 	at java.base/java.lang.reflect.Method.invoke(Method.java:564)
23:43:53 [2021-04-03T03:43:53.916Z] 	at org.eclipse.equinox.launcher.Main.invokeFramework(Main.java:659)
23:43:53 [2021-04-03T03:43:53.916Z] 	at org.eclipse.equinox.launcher.Main.basicRun(Main.java:595)
23:43:53 [2021-04-03T03:43:53.916Z] 	at org.eclipse.equinox.launcher.Main.run(Main.java:1501)
23:43:53 [2021-04-03T03:43:53.916Z] 	at org.eclipse.equinox.launcher.Main.main(Main.java:1474)
23:43:53 [2021-04-03T03:43:53.916Z] Caused by: java.lang.ClassNotFoundException: org.junit.runners.model.RunnerBuilder cannot be found by org.eclipse.tycho.surefire.osgibooter_2.2.0
23:43:53 [2021-04-03T03:43:53.916Z] 	at org.eclipse.osgi.internal.loader.BundleLoader.findClassInternal(BundleLoader.java:511)
23:43:53 [2021-04-03T03:43:53.916Z] 	at org.eclipse.osgi.internal.loader.BundleLoader.findClass(BundleLoader.java:422)
23:43:53 [2021-04-03T03:43:53.916Z] 	at org.eclipse.osgi.internal.loader.BundleLoader.findClass(BundleLoader.java:414)
23:43:53 [2021-04-03T03:43:53.916Z] 	at org.eclipse.osgi.internal.loader.ModuleClassLoader.loadClass(ModuleClassLoader.java:153)
23:43:53 [2021-04-03T03:43:53.916Z] 	at java.base/java.lang.ClassLoader.loadClass(ClassLoader.java:522)
23:43:53 [2021-04-03T03:43:53.916Z] 	... 31 more
23:43:53 [2021-04-03T03:43:53.916Z] 
23:43:53 [2021-04-03T03:43:53.916Z] Apr 03, 2021 3:43:53 AM org.junit.platform.launcher.core.DefaultLauncher handleThrowable
23:43:53 [2021-04-03T03:43:53.916Z] WARNING: TestEngine with ID 'junit-vintage' failed to discover tests
23:43:53 [2021-04-03T03:43:53.916Z] java.lang.NoClassDefFoundError: org/junit/runners/model/RunnerBuilder
23:43:53 [2021-04-03T03:43:53.916Z] 	at org.junit.vintage.engine.discovery.VintageDiscoverer.<init>(VintageDiscoverer.java:48)
23:43:53 [2021-04-03T03:43:53.916Z] 	at org.junit.vintage.engine.VintageTestEngine.discover(VintageTestEngine.java:65)
23:43:53 [2021-04-03T03:43:53.916Z] 	at org.junit.platform.launcher.core.DefaultLauncher.discoverEngineRoot(DefaultLauncher.java:130)
23:43:53 [2021-04-03T03:43:53.916Z] 	at org.junit.platform.launcher.core.DefaultLauncher.discoverRoot(DefaultLauncher.java:117)
23:43:53 [2021-04-03T03:43:53.916Z] 	at org.junit.platform.launcher.core.DefaultLauncher.execute(DefaultLauncher.java:90)
23:43:53 [2021-04-03T03:43:53.916Z] 	at org.apache.maven.surefire.junitplatform.JUnitPlatformProvider.invokeAllTests(JUnitPlatformProvider.java:150)
23:43:53 [2021-04-03T03:43:53.916Z] 	at org.apache.maven.surefire.junitplatform.JUnitPlatformProvider.invoke(JUnitPlatformProvider.java:124)
23:43:53 [2021-04-03T03:43:53.916Z] 	at java.base/jdk.internal.reflect.NativeMethodAccessorImpl.invoke0(Native Method)
23:43:53 [2021-04-03T03:43:53.916Z] 	at java.base/jdk.internal.reflect.NativeMethodAccessorImpl.invoke(NativeMethodAccessorImpl.java:64)
23:43:53 [2021-04-03T03:43:53.916Z] 	at java.base/jdk.internal.reflect.DelegatingMethodAccessorImpl.invoke(DelegatingMethodAccessorImpl.java:43)
23:43:53 [2021-04-03T03:43:53.916Z] 	at java.base/java.lang.reflect.Method.invoke(Method.java:564)
23:43:53 [2021-04-03T03:43:53.916Z] 	at org.apache.maven.surefire.util.ReflectionUtils.invokeMethodWithArray2(ReflectionUtils.java:206)
23:43:53 [2021-04-03T03:43:53.916Z] 	at org.apache.maven.surefire.booter.ProviderFactory$ProviderProxy.invoke(ProviderFactory.java:161)
23:43:53 [2021-04-03T03:43:53.916Z] 	at org.apache.maven.surefire.booter.ProviderFactory.invokeProvider(ProviderFactory.java:84)
23:43:53 [2021-04-03T03:43:53.916Z] 	at org.eclipse.tycho.surefire.osgibooter.OsgiSurefireBooter.run(OsgiSurefireBooter.java:116)
23:43:53 [2021-04-03T03:43:53.916Z] 	at org.eclipse.tycho.surefire.osgibooter.HeadlessTestApplication.start(HeadlessTestApplication.java:23)
23:43:53 [2021-04-03T03:43:53.916Z] 	at org.eclipse.equinox.internal.app.EclipseAppHandle.run(EclipseAppHandle.java:203)
23:43:53 [2021-04-03T03:43:53.916Z] 	at org.eclipse.core.runtime.internal.adaptor.EclipseAppLauncher.runApplication(EclipseAppLauncher.java:137)
23:43:53 [2021-04-03T03:43:53.916Z] 	at org.eclipse.core.runtime.internal.adaptor.EclipseAppLauncher.start(EclipseAppLauncher.java:107)
23:43:53 [2021-04-03T03:43:53.916Z] 	at org.eclipse.core.runtime.adaptor.EclipseStarter.run(EclipseStarter.java:400)
23:43:53 [2021-04-03T03:43:53.916Z] 	at org.eclipse.core.runtime.adaptor.EclipseStarter.run(EclipseStarter.java:255)
23:43:53 [2021-04-03T03:43:53.916Z] 	at java.base/jdk.internal.reflect.NativeMethodAccessorImpl.invoke0(Native Method)
23:43:53 [2021-04-03T03:43:53.916Z] 	at java.base/jdk.internal.reflect.NativeMethodAccessorImpl.invoke(NativeMethodAccessorImpl.java:64)
23:43:53 [2021-04-03T03:43:53.916Z] 	at java.base/jdk.internal.reflect.DelegatingMethodAccessorImpl.invoke(DelegatingMethodAccessorImpl.java:43)
23:43:53 [2021-04-03T03:43:53.916Z] 	at java.base/java.lang.reflect.Method.invoke(Method.java:564)
23:43:53 [2021-04-03T03:43:53.916Z] 	at org.eclipse.equinox.launcher.Main.invokeFramework(Main.java:659)
23:43:53 [2021-04-03T03:43:53.916Z] 	at org.eclipse.equinox.launcher.Main.basicRun(Main.java:595)
23:43:53 [2021-04-03T03:43:53.916Z] 	at org.eclipse.equinox.launcher.Main.run(Main.java:1501)
23:43:53 [2021-04-03T03:43:53.916Z] 	at org.eclipse.equinox.launcher.Main.main(Main.java:1474)
23:43:53 [2021-04-03T03:43:53.916Z] Caused by: java.lang.ClassNotFoundException: org.junit.runners.model.RunnerBuilder cannot be found by org.eclipse.tycho.surefire.osgibooter_2.2.0
23:43:53 [2021-04-03T03:43:53.916Z] 	at org.eclipse.osgi.internal.loader.BundleLoader.findClassInternal(BundleLoader.java:511)
23:43:53 [2021-04-03T03:43:53.916Z] 	at org.eclipse.osgi.internal.loader.BundleLoader.findClass(BundleLoader.java:422)
23:43:53 [2021-04-03T03:43:53.916Z] 	at org.eclipse.osgi.internal.loader.BundleLoader.findClass(BundleLoader.java:414)
23:43:53 [2021-04-03T03:43:53.916Z] 	at org.eclipse.osgi.internal.loader.ModuleClassLoader.loadClass(ModuleClassLoader.java:153)
23:43:53 [2021-04-03T03:43:53.916Z] 	at java.base/java.lang.ClassLoader.loadClass(ClassLoader.java:522)
23:43:53 [2021-04-03T03:43:53.916Z] 	... 29 more
23:43:53 [2021-04-03T03:43:53.916Z] 
23:43:53 [2021-04-03T03:43:53.916Z] Running org.eclipse.ease.lang.python.PythonCodeFactoryTest
23:43:53 [2021-04-03T03:43:53.916Z] Tests run: 1, Failures: 0, Errors: 0, Skipped: 0, Time elapsed: 0.023 s - in org.eclipse.ease.lang.python.PythonCodeFactoryTest
23:43:53 [2021-04-03T03:43:53.916Z] testCommentCreator  Time elapsed: 0.018 s
23:43:53 [2021-04-03T03:43:53.916Z] 
23:43:53 [2021-04-03T03:43:53.916Z] Results:
23:43:53 [2021-04-03T03:43:53.916Z] 
23:43:53 [2021-04-03T03:43:53.916Z] Tests run: 1, Failures: 0, Errors: 0, Skipped: 0
23:43:53 [2021-04-03T03:43:53.916Z] 
23:43:54 [2021-04-03T03:43:54.172Z] [INFO] All tests passed!
23:43:54 [2021-04-03T03:43:54.172Z] [INFO] 
23:43:54 [2021-04-03T03:43:54.172Z] [INFO] -----< org.eclipse.ease:org.eclipse.ease.lang.python.jython.test >------
23:43:54 [2021-04-03T03:43:54.172Z] [INFO] Building org.eclipse.ease.lang.python.jython.test 0.8.0-SNAPSHOT   [7/9]
23:43:54 [2021-04-03T03:43:54.172Z] [INFO] ------------------------[ eclipse-test-plugin ]-------------------------
23:43:54 [2021-04-03T03:43:54.172Z] [INFO] 
23:43:54 [2021-04-03T03:43:54.172Z] [INFO] --- tycho-packaging-plugin:2.2.0:build-qualifier (default-build-qualifier) @ org.eclipse.ease.lang.python.jython.test ---
23:43:54 [2021-04-03T03:43:54.172Z] [INFO] The project's OSGi version is 0.8.0.I202103261223
23:43:54 [2021-04-03T03:43:54.172Z] [INFO] 
23:43:54 [2021-04-03T03:43:54.172Z] [INFO] --- tycho-packaging-plugin:2.2.0:validate-id (default-validate-id) @ org.eclipse.ease.lang.python.jython.test ---
23:43:54 [2021-04-03T03:43:54.172Z] [INFO] 
23:43:54 [2021-04-03T03:43:54.172Z] [INFO] --- tycho-packaging-plugin:2.2.0:validate-version (default-validate-version) @ org.eclipse.ease.lang.python.jython.test ---
23:43:54 [2021-04-03T03:43:54.172Z] [INFO] 
23:43:54 [2021-04-03T03:43:54.172Z] [INFO] --- maven-resources-plugin:2.4.3:resources (default-resources) @ org.eclipse.ease.lang.python.jython.test ---
23:43:54 [2021-04-03T03:43:54.172Z] [INFO] Using 'UTF-8' encoding to copy filtered resources.
23:43:54 [2021-04-03T03:43:54.172Z] [INFO] skip non existing resourceDirectory /home/jenkins/agent/workspace/ease.verify.core.target.2018-12/tests/org.eclipse.ease.lang.python.jython.test/src/main/resources
23:43:54 [2021-04-03T03:43:54.172Z] [INFO] 
23:43:54 [2021-04-03T03:43:54.172Z] [INFO] --- tycho-compiler-plugin:2.2.0:compile (default-compile) @ org.eclipse.ease.lang.python.jython.test ---
23:43:54 [2021-04-03T03:43:54.172Z] [INFO] Nothing to compile - all classes are up to date
23:43:54 [2021-04-03T03:43:54.172Z] [INFO] 
23:43:54 [2021-04-03T03:43:54.172Z] [INFO] --- maven-resources-plugin:2.4.3:testResources (default-testResources) @ org.eclipse.ease.lang.python.jython.test ---
23:43:54 [2021-04-03T03:43:54.173Z] [INFO] Using 'UTF-8' encoding to copy filtered resources.
23:43:54 [2021-04-03T03:43:54.173Z] [INFO] skip non existing resourceDirectory /home/jenkins/agent/workspace/ease.verify.core.target.2018-12/tests/org.eclipse.ease.lang.python.jython.test/src/test/resources
23:43:54 [2021-04-03T03:43:54.173Z] [INFO] 
23:43:54 [2021-04-03T03:43:54.173Z] [INFO] --- target-platform-configuration:2.2.0:target-platform (default-target-platform) @ org.eclipse.ease.lang.python.jython.test ---
23:43:54 [2021-04-03T03:43:54.173Z] [INFO] 
23:43:54 [2021-04-03T03:43:54.173Z] [INFO] --- tycho-packaging-plugin:2.2.0:package-plugin (default-package-plugin) @ org.eclipse.ease.lang.python.jython.test ---
23:43:54 [2021-04-03T03:43:54.173Z] [INFO] Building jar: /home/jenkins/agent/workspace/ease.verify.core.target.2018-12/tests/org.eclipse.ease.lang.python.jython.test/target/org.eclipse.ease.lang.python.jython.test-0.8.0-SNAPSHOT.jar
23:43:54 [2021-04-03T03:43:54.173Z] [INFO] 
23:43:54 [2021-04-03T03:43:54.173Z] [INFO] --- tycho-p2-plugin:2.2.0:p2-metadata-default (default-p2-metadata-default) @ org.eclipse.ease.lang.python.jython.test ---
23:43:54 [2021-04-03T03:43:54.173Z] [INFO] 
23:43:54 [2021-04-03T03:43:54.173Z] [INFO] --- jacoco-maven-plugin:0.8.6:prepare-agent (jacoco-initialize) @ org.eclipse.ease.lang.python.jython.test ---
23:43:54 [2021-04-03T03:43:54.173Z] [INFO] tycho.testArgLine set to -javaagent:/home/jenkins/.m2/repository/org/jacoco/org.jacoco.agent/0.8.6/org.jacoco.agent-0.8.6-runtime.jar=destfile=/home/jenkins/agent/workspace/ease.verify.core.target.2018-12/tests/org.eclipse.ease.lang.python.jython.test/target/jacoco.exec,output=file
23:43:54 [2021-04-03T03:43:54.173Z] [INFO] 
23:43:54 [2021-04-03T03:43:54.173Z] [INFO] --- tycho-surefire-plugin:2.2.0:test (default-test) @ org.eclipse.ease.lang.python.jython.test ---
23:43:54 [2021-04-03T03:43:54.745Z] [INFO] Executing Test Runtime with timeout 0, logs (if any) will be placed at: /home/jenkins/agent/workspace/ease.verify.core.target.2018-12/tests/org.eclipse.ease.lang.python.jython.test/target/work/data/.metadata/.log
23:43:54 [2021-04-03T03:43:54.745Z] [INFO] Command line:
23:43:54 [2021-04-03T03:43:54.746Z] 	[/opt/tools/java/openjdk/jdk-15/15.0.2+7/bin/java, -Dosgi.noShutdown=false, -Dosgi.os=linux, -Dosgi.ws=gtk, -Dosgi.arch=x86_64, -javaagent:/home/jenkins/.m2/repository/org/jacoco/org.jacoco.agent/0.8.6/org.jacoco.agent-0.8.6-runtime.jar=destfile=/home/jenkins/agent/workspace/ease.verify.core.target.2018-12/tests/org.eclipse.ease.lang.python.jython.test/target/jacoco.exec,output=file, -Dosgi.clean=true, -jar, /home/jenkins/.m2/repository/p2/osgi/bundle/org.eclipse.equinox.launcher/1.5.200.v20180922-1751/org.eclipse.equinox.launcher-1.5.200.v20180922-1751.jar, -data, /home/jenkins/agent/workspace/ease.verify.core.target.2018-12/tests/org.eclipse.ease.lang.python.jython.test/target/work/data, -install, /home/jenkins/agent/workspace/ease.verify.core.target.2018-12/tests/org.eclipse.ease.lang.python.jython.test/target/work, -configuration, /home/jenkins/agent/workspace/ease.verify.core.target.2018-12/tests/org.eclipse.ease.lang.python.jython.test/target/work/configuration, -application, org.eclipse.tycho.surefire.osgibooter.headlesstest, -testproperties, /home/jenkins/agent/workspace/ease.verify.core.target.2018-12/tests/org.eclipse.ease.lang.python.jython.test/target/surefire.properties]
23:43:54 [2021-04-03T03:43:54.746Z] Picked up JAVA_TOOL_OPTIONS: -Dmaven.ext.class.path="/home/jenkins/agent/workspace/ease.verify.core.target.2018-12@tmp/withMaven758cb5fd/pipeline-maven-spy.jar" -Dorg.jenkinsci.plugins.pipeline.maven.reportsFolder="/home/jenkins/agent/workspace/ease.verify.core.target.2018-12@tmp/withMaven758cb5fd" 
23:43:57 [2021-04-03T03:43:57.273Z] WARNING: An illegal reflective access operation has occurred
23:43:57 [2021-04-03T03:43:57.273Z] WARNING: Illegal reflective access by org.python.core.PySystemState (file:/home/jenkins/agent/workspace/ease.verify.core.target.2018-12/tests/org.eclipse.ease.lang.python.jython.test/target/work/plugins/org.jython_2.7.0.I201609090924/jython.jar) to method java.io.Console.encoding()
23:43:57 [2021-04-03T03:43:57.273Z] WARNING: Please consider reporting this to the maintainers of org.python.core.PySystemState
23:43:57 [2021-04-03T03:43:57.273Z] WARNING: Use --illegal-access=warn to enable warnings of further illegal reflective access operations
23:43:57 [2021-04-03T03:43:57.273Z] WARNING: All illegal access operations will be denied in a future release
23:43:57 [2021-04-03T03:43:57.834Z] Apr 03, 2021 3:43:57 AM org.junit.platform.launcher.core.DefaultLauncher handleThrowable
23:43:57 [2021-04-03T03:43:57.834Z] WARNING: TestEngine with ID 'junit-vintage' failed to discover tests
23:43:57 [2021-04-03T03:43:57.834Z] java.lang.NoClassDefFoundError: org/junit/runners/model/RunnerBuilder
23:43:57 [2021-04-03T03:43:57.834Z] 	at org.junit.vintage.engine.discovery.VintageDiscoverer.<init>(VintageDiscoverer.java:48)
23:43:57 [2021-04-03T03:43:57.834Z] 	at org.junit.vintage.engine.VintageTestEngine.discover(VintageTestEngine.java:65)
23:43:57 [2021-04-03T03:43:57.835Z] 	at org.junit.platform.launcher.core.DefaultLauncher.discoverEngineRoot(DefaultLauncher.java:130)
23:43:57 [2021-04-03T03:43:57.835Z] 	at org.junit.platform.launcher.core.DefaultLauncher.discoverRoot(DefaultLauncher.java:117)
23:43:57 [2021-04-03T03:43:57.835Z] 	at org.junit.platform.launcher.core.DefaultLauncher.discover(DefaultLauncher.java:82)
23:43:57 [2021-04-03T03:43:57.835Z] 	at org.apache.maven.surefire.junitplatform.TestPlanScannerFilter.accept(TestPlanScannerFilter.java:56)
23:43:57 [2021-04-03T03:43:57.835Z] 	at org.apache.maven.surefire.util.DefaultScanResult.applyFilter(DefaultScanResult.java:102)
23:43:57 [2021-04-03T03:43:57.835Z] 	at org.apache.maven.surefire.junitplatform.JUnitPlatformProvider.scanClasspath(JUnitPlatformProvider.java:143)
23:43:57 [2021-04-03T03:43:57.835Z] 	at org.apache.maven.surefire.junitplatform.JUnitPlatformProvider.invoke(JUnitPlatformProvider.java:124)
23:43:57 [2021-04-03T03:43:57.835Z] 	at java.base/jdk.internal.reflect.NativeMethodAccessorImpl.invoke0(Native Method)
23:43:57 [2021-04-03T03:43:57.835Z] 	at java.base/jdk.internal.reflect.NativeMethodAccessorImpl.invoke(NativeMethodAccessorImpl.java:64)
23:43:57 [2021-04-03T03:43:57.835Z] 	at java.base/jdk.internal.reflect.DelegatingMethodAccessorImpl.invoke(DelegatingMethodAccessorImpl.java:43)
23:43:57 [2021-04-03T03:43:57.835Z] 	at java.base/java.lang.reflect.Method.invoke(Method.java:564)
23:43:57 [2021-04-03T03:43:57.835Z] 	at org.apache.maven.surefire.util.ReflectionUtils.invokeMethodWithArray2(ReflectionUtils.java:206)
23:43:57 [2021-04-03T03:43:57.835Z] 	at org.apache.maven.surefire.booter.ProviderFactory$ProviderProxy.invoke(ProviderFactory.java:161)
23:43:57 [2021-04-03T03:43:57.835Z] 	at org.apache.maven.surefire.booter.ProviderFactory.invokeProvider(ProviderFactory.java:84)
23:43:57 [2021-04-03T03:43:57.835Z] 	at org.eclipse.tycho.surefire.osgibooter.OsgiSurefireBooter.run(OsgiSurefireBooter.java:116)
23:43:57 [2021-04-03T03:43:57.835Z] 	at org.eclipse.tycho.surefire.osgibooter.HeadlessTestApplication.start(HeadlessTestApplication.java:23)
23:43:57 [2021-04-03T03:43:57.835Z] 	at org.eclipse.equinox.internal.app.EclipseAppHandle.run(EclipseAppHandle.java:203)
23:43:57 [2021-04-03T03:43:57.835Z] 	at org.eclipse.core.runtime.internal.adaptor.EclipseAppLauncher.runApplication(EclipseAppLauncher.java:137)
23:43:57 [2021-04-03T03:43:57.835Z] 	at org.eclipse.core.runtime.internal.adaptor.EclipseAppLauncher.start(EclipseAppLauncher.java:107)
23:43:57 [2021-04-03T03:43:57.835Z] 	at org.eclipse.core.runtime.adaptor.EclipseStarter.run(EclipseStarter.java:400)
23:43:57 [2021-04-03T03:43:57.835Z] 	at org.eclipse.core.runtime.adaptor.EclipseStarter.run(EclipseStarter.java:255)
23:43:57 [2021-04-03T03:43:57.835Z] 	at java.base/jdk.internal.reflect.NativeMethodAccessorImpl.invoke0(Native Method)
23:43:57 [2021-04-03T03:43:57.835Z] 	at java.base/jdk.internal.reflect.NativeMethodAccessorImpl.invoke(NativeMethodAccessorImpl.java:64)
23:43:57 [2021-04-03T03:43:57.835Z] 	at java.base/jdk.internal.reflect.DelegatingMethodAccessorImpl.invoke(DelegatingMethodAccessorImpl.java:43)
23:43:57 [2021-04-03T03:43:57.835Z] 	at java.base/java.lang.reflect.Method.invoke(Method.java:564)
23:43:57 [2021-04-03T03:43:57.835Z] 	at org.eclipse.equinox.launcher.Main.invokeFramework(Main.java:659)
23:43:57 [2021-04-03T03:43:57.835Z] 	at org.eclipse.equinox.launcher.Main.basicRun(Main.java:595)
23:43:57 [2021-04-03T03:43:57.835Z] 	at org.eclipse.equinox.launcher.Main.run(Main.java:1501)
23:43:57 [2021-04-03T03:43:57.835Z] 	at org.eclipse.equinox.launcher.Main.main(Main.java:1474)
23:43:57 [2021-04-03T03:43:57.835Z] Caused by: java.lang.ClassNotFoundException: org.junit.runners.model.RunnerBuilder cannot be found by org.eclipse.tycho.surefire.osgibooter_2.2.0
23:43:57 [2021-04-03T03:43:57.835Z] 	at org.eclipse.osgi.internal.loader.BundleLoader.findClassInternal(BundleLoader.java:511)
23:43:57 [2021-04-03T03:43:57.835Z] 	at org.eclipse.osgi.internal.loader.BundleLoader.findClass(BundleLoader.java:422)
23:43:57 [2021-04-03T03:43:57.835Z] 	at org.eclipse.osgi.internal.loader.BundleLoader.findClass(BundleLoader.java:414)
23:43:57 [2021-04-03T03:43:57.835Z] 	at org.eclipse.osgi.internal.loader.ModuleClassLoader.loadClass(ModuleClassLoader.java:153)
23:43:57 [2021-04-03T03:43:57.835Z] 	at java.base/java.lang.ClassLoader.loadClass(ClassLoader.java:522)
23:43:57 [2021-04-03T03:43:57.835Z] 	... 31 more
23:43:57 [2021-04-03T03:43:57.835Z] 
23:43:57 [2021-04-03T03:43:57.835Z] Apr 03, 2021 3:43:57 AM org.junit.platform.launcher.core.DefaultLauncher handleThrowable
23:43:57 [2021-04-03T03:43:57.835Z] WARNING: TestEngine with ID 'junit-vintage' failed to discover tests
23:43:57 [2021-04-03T03:43:57.835Z] java.lang.NoClassDefFoundError: org/junit/runners/model/RunnerBuilder
23:43:57 [2021-04-03T03:43:57.835Z] 	at org.junit.vintage.engine.discovery.VintageDiscoverer.<init>(VintageDiscoverer.java:48)
23:43:57 [2021-04-03T03:43:57.835Z] 	at org.junit.vintage.engine.VintageTestEngine.discover(VintageTestEngine.java:65)
23:43:57 [2021-04-03T03:43:57.835Z] 	at org.junit.platform.launcher.core.DefaultLauncher.discoverEngineRoot(DefaultLauncher.java:130)
23:43:57 [2021-04-03T03:43:57.835Z] 	at org.junit.platform.launcher.core.DefaultLauncher.discoverRoot(DefaultLauncher.java:117)
23:43:57 [2021-04-03T03:43:57.835Z] 	at org.junit.platform.launcher.core.DefaultLauncher.execute(DefaultLauncher.java:90)
23:43:57 [2021-04-03T03:43:57.835Z] 	at org.apache.maven.surefire.junitplatform.JUnitPlatformProvider.invokeAllTests(JUnitPlatformProvider.java:150)
23:43:57 [2021-04-03T03:43:57.835Z] 	at org.apache.maven.surefire.junitplatform.JUnitPlatformProvider.invoke(JUnitPlatformProvider.java:124)
23:43:57 [2021-04-03T03:43:57.835Z] 	at java.base/jdk.internal.reflect.NativeMethodAccessorImpl.invoke0(Native Method)
23:43:57 [2021-04-03T03:43:57.835Z] 	at java.base/jdk.internal.reflect.NativeMethodAccessorImpl.invoke(NativeMethodAccessorImpl.java:64)
23:43:57 [2021-04-03T03:43:57.835Z] 	at java.base/jdk.internal.reflect.DelegatingMethodAccessorImpl.invoke(DelegatingMethodAccessorImpl.java:43)
23:43:57 [2021-04-03T03:43:57.835Z] 	at java.base/java.lang.reflect.Method.invoke(Method.java:564)
23:43:57 [2021-04-03T03:43:57.835Z] 	at org.apache.maven.surefire.util.ReflectionUtils.invokeMethodWithArray2(ReflectionUtils.java:206)
23:43:57 [2021-04-03T03:43:57.835Z] 	at org.apache.maven.surefire.booter.ProviderFactory$ProviderProxy.invoke(ProviderFactory.java:161)
23:43:57 [2021-04-03T03:43:57.835Z] 	at org.apache.maven.surefire.booter.ProviderFactory.invokeProvider(ProviderFactory.java:84)
23:43:57 [2021-04-03T03:43:57.835Z] 	at org.eclipse.tycho.surefire.osgibooter.OsgiSurefireBooter.run(OsgiSurefireBooter.java:116)
23:43:57 [2021-04-03T03:43:57.835Z] 	at org.eclipse.tycho.surefire.osgibooter.HeadlessTestApplication.start(HeadlessTestApplication.java:23)
23:43:57 [2021-04-03T03:43:57.835Z] 	at org.eclipse.equinox.internal.app.EclipseAppHandle.run(EclipseAppHandle.java:203)
23:43:57 [2021-04-03T03:43:57.835Z] 	at org.eclipse.core.runtime.internal.adaptor.EclipseAppLauncher.runApplication(EclipseAppLauncher.java:137)
23:43:57 [2021-04-03T03:43:57.835Z] 	at org.eclipse.core.runtime.internal.adaptor.EclipseAppLauncher.start(EclipseAppLauncher.java:107)
23:43:57 [2021-04-03T03:43:57.835Z] 	at org.eclipse.core.runtime.adaptor.EclipseStarter.run(EclipseStarter.java:400)
23:43:57 [2021-04-03T03:43:57.835Z] 	at org.eclipse.core.runtime.adaptor.EclipseStarter.run(EclipseStarter.java:255)
23:43:57 [2021-04-03T03:43:57.835Z] 	at java.base/jdk.internal.reflect.NativeMethodAccessorImpl.invoke0(Native Method)
23:43:57 [2021-04-03T03:43:57.835Z] 	at java.base/jdk.internal.reflect.NativeMethodAccessorImpl.invoke(NativeMethodAccessorImpl.java:64)
23:43:57 [2021-04-03T03:43:57.835Z] 	at java.base/jdk.internal.reflect.DelegatingMethodAccessorImpl.invoke(DelegatingMethodAccessorImpl.java:43)
23:43:57 [2021-04-03T03:43:57.835Z] 	at java.base/java.lang.reflect.Method.invoke(Method.java:564)
23:43:57 [2021-04-03T03:43:57.835Z] 	at org.eclipse.equinox.launcher.Main.invokeFramework(Main.java:659)
23:43:57 [2021-04-03T03:43:57.835Z] 	at org.eclipse.equinox.launcher.Main.basicRun(Main.java:595)
23:43:57 [2021-04-03T03:43:57.835Z] 	at org.eclipse.equinox.launcher.Main.run(Main.java:1501)
23:43:57 [2021-04-03T03:43:57.835Z] 	at org.eclipse.equinox.launcher.Main.main(Main.java:1474)
23:43:57 [2021-04-03T03:43:57.836Z] Caused by: java.lang.ClassNotFoundException: org.junit.runners.model.RunnerBuilder cannot be found by org.eclipse.tycho.surefire.osgibooter_2.2.0
23:43:57 [2021-04-03T03:43:57.836Z] 	at org.eclipse.osgi.internal.loader.BundleLoader.findClassInternal(BundleLoader.java:511)
23:43:57 [2021-04-03T03:43:57.836Z] 	at org.eclipse.osgi.internal.loader.BundleLoader.findClass(BundleLoader.java:422)
23:43:57 [2021-04-03T03:43:57.836Z] 	at org.eclipse.osgi.internal.loader.BundleLoader.findClass(BundleLoader.java:414)
23:43:57 [2021-04-03T03:43:57.836Z] 	at org.eclipse.osgi.internal.loader.ModuleClassLoader.loadClass(ModuleClassLoader.java:153)
23:43:57 [2021-04-03T03:43:57.836Z] 	at java.base/java.lang.ClassLoader.loadClass(ClassLoader.java:522)
23:43:57 [2021-04-03T03:43:57.836Z] 	... 29 more
23:43:57 [2021-04-03T03:43:57.836Z] 
23:43:57 [2021-04-03T03:43:57.836Z] Running org.eclipse.ease.lang.python.jython.debugger.JythonDebugTest
23:44:01 [2021-04-03T03:44:01.108Z] Start of script
23:44:01 [2021-04-03T03:44:01.108Z] include file start
23:44:01 [2021-04-03T03:44:01.108Z] include file processed
23:44:01 [2021-04-03T03:44:01.108Z] Result of testMethod = 5
23:44:01 [2021-04-03T03:44:01.108Z] End of script
23:44:01 [2021-04-03T03:44:01.363Z] Start of script
23:44:01 [2021-04-03T03:44:01.363Z] include file start
23:44:01 [2021-04-03T03:44:01.363Z] include file processed
23:44:01 [2021-04-03T03:44:01.363Z] Result of testMethod = 5
23:44:01 [2021-04-03T03:44:01.363Z] End of script
23:44:01 [2021-04-03T03:44:01.363Z] Start of script
23:44:01 [2021-04-03T03:44:01.363Z] include file start
23:44:01 [2021-04-03T03:44:01.363Z] include file processed
23:44:01 [2021-04-03T03:44:01.363Z] Result of testMethod = 5
23:44:01 [2021-04-03T03:44:01.618Z] Traceback (most recent call last):
23:44:01 [2021-04-03T03:44:01.618Z]   File "(none)", line 184, in run
23:44:01 [2021-04-03T03:44:01.618Z]   File "__ref_L/Debug Test/Main.py_ireyfuxbhw", line 23, in <module>
23:44:01 [2021-04-03T03:44:01.618Z]   File "(none)", line 161, in trace_dispatch
23:44:01 [2021-04-03T03:44:01.618Z] org.eclipse.ease.ExitException: 
23:44:01 [2021-04-03T03:44:01.618Z] 
23:44:01 [2021-04-03T03:44:01.618Z] org.eclipse.ease.ExitException: org.eclipse.ease.ExitException: 
23:44:01 [2021-04-03T03:44:01.618Z] Start of script
23:44:01 [2021-04-03T03:44:01.618Z] include file start
23:44:01 [2021-04-03T03:44:01.618Z] include file processed
23:44:01 [2021-04-03T03:44:01.873Z] Result of testMethod = 5
23:44:01 [2021-04-03T03:44:01.873Z] End of script
23:44:02 [2021-04-03T03:44:02.130Z] Start of script
23:44:02 [2021-04-03T03:44:02.130Z] include file start
23:44:02 [2021-04-03T03:44:02.130Z] include file processed
23:44:02 [2021-04-03T03:44:02.130Z] Result of testMethod = 5
23:44:02 [2021-04-03T03:44:02.130Z] End of script
23:44:02 [2021-04-03T03:44:02.385Z] Start of script
23:44:02 [2021-04-03T03:44:02.385Z] include file start
23:44:02 [2021-04-03T03:44:02.385Z] include file processed
23:44:02 [2021-04-03T03:44:02.385Z] Result of testMethod = 5
23:44:02 [2021-04-03T03:44:02.385Z] End of script
23:44:02 [2021-04-03T03:44:02.641Z] Start of script
23:44:02 [2021-04-03T03:44:02.641Z] include file start
23:44:02 [2021-04-03T03:44:02.641Z] include file processed
23:44:02 [2021-04-03T03:44:02.641Z] Result of testMethod = 5
23:44:02 [2021-04-03T03:44:02.897Z] Traceback (most recent call last):
23:44:02 [2021-04-03T03:44:02.897Z]   File "(none)", line 184, in run
23:44:02 [2021-04-03T03:44:02.897Z]   File "__ref_L/Debug Test/Main.py_otlhpuxqja", line 23, in <module>
23:44:02 [2021-04-03T03:44:02.897Z]   File "(none)", line 161, in trace_dispatch
23:44:02 [2021-04-03T03:44:02.897Z] org.eclipse.ease.ExitException: 
23:44:02 [2021-04-03T03:44:02.897Z] 
23:44:02 [2021-04-03T03:44:02.897Z] org.eclipse.ease.ExitException: org.eclipse.ease.ExitException: 
23:44:02 [2021-04-03T03:44:02.897Z] Start of script
23:44:02 [2021-04-03T03:44:02.897Z] include file start
23:44:02 [2021-04-03T03:44:02.897Z] include file processed
23:44:03 [2021-04-03T03:44:03.152Z] Result of testMethod = 5
23:44:03 [2021-04-03T03:44:03.152Z] End of script
23:44:03 [2021-04-03T03:44:03.152Z] Start of script
23:44:03 [2021-04-03T03:44:03.152Z] include file start
23:44:03 [2021-04-03T03:44:03.152Z] include file processed
23:44:03 [2021-04-03T03:44:03.152Z] Result of testMethod = 5
23:44:03 [2021-04-03T03:44:03.408Z] End of script
23:44:03 [2021-04-03T03:44:03.408Z] Start of script
23:44:03 [2021-04-03T03:44:03.408Z] include file start
23:44:03 [2021-04-03T03:44:03.408Z] include file processed
23:44:03 [2021-04-03T03:44:03.990Z] Traceback (most recent call last):
23:44:03 [2021-04-03T03:44:03.990Z]   File "(none)", line 184, in run
23:44:03 [2021-04-03T03:44:03.990Z]   File "__ref_L/Debug Test/Main.py_rypijodbbk", line 22, in <module>
23:44:03 [2021-04-03T03:44:03.990Z]   File "(none)", line 161, in trace_dispatch
23:44:03 [2021-04-03T03:44:03.990Z] org.eclipse.ease.ExitException: 
23:44:03 [2021-04-03T03:44:03.990Z] 
23:44:03 [2021-04-03T03:44:03.990Z] org.eclipse.ease.ExitException: org.eclipse.ease.ExitException: 
23:44:03 [2021-04-03T03:44:03.990Z] Start of script
23:44:03 [2021-04-03T03:44:03.990Z] include file start
23:44:04 [2021-04-03T03:44:04.245Z] include file processed
23:44:04 [2021-04-03T03:44:04.245Z] Result of testMethod = 5
23:44:04 [2021-04-03T03:44:04.245Z] End of script
23:44:04 [2021-04-03T03:44:04.246Z] Start of script
23:44:04 [2021-04-03T03:44:04.246Z] include file start
23:44:04 [2021-04-03T03:44:04.246Z] include file processed
23:44:04 [2021-04-03T03:44:04.501Z] Result of testMethod = 5
23:44:04 [2021-04-03T03:44:04.501Z] End of script
23:44:04 [2021-04-03T03:44:04.757Z] Traceback (most recent call last):
23:44:04 [2021-04-03T03:44:04.757Z]   File "(none)", line 184, in run
23:44:04 [2021-04-03T03:44:04.757Z]   File "__ref_L/Debug Test/Main.py_mwprjvqjdc", line 1, in <module>
23:44:04 [2021-04-03T03:44:04.757Z]   File "(none)", line 161, in trace_dispatch
23:44:04 [2021-04-03T03:44:04.757Z] org.eclipse.ease.ExitException: 
23:44:04 [2021-04-03T03:44:04.757Z] 
23:44:04 [2021-04-03T03:44:04.757Z] org.eclipse.ease.ExitException: org.eclipse.ease.ExitException: 
23:44:04 [2021-04-03T03:44:04.757Z] Start of script
23:44:04 [2021-04-03T03:44:04.757Z] include file start
23:44:04 [2021-04-03T03:44:04.757Z] include file processed
23:44:04 [2021-04-03T03:44:04.757Z] Result of testMethod = 5
23:44:04 [2021-04-03T03:44:04.757Z] End of script
23:44:05 [2021-04-03T03:44:05.012Z] Start of script
23:44:05 [2021-04-03T03:44:05.012Z] include file start
23:44:05 [2021-04-03T03:44:05.012Z] include file processed
23:44:05 [2021-04-03T03:44:05.268Z] Result of testMethod = 5
23:44:05 [2021-04-03T03:44:05.268Z] End of script
23:44:05 [2021-04-03T03:44:05.268Z] Start of script
23:44:05 [2021-04-03T03:44:05.268Z] include file start
23:44:05 [2021-04-03T03:44:05.268Z] include file processed
23:44:05 [2021-04-03T03:44:05.268Z] Result of testMethod = 5
23:44:05 [2021-04-03T03:44:05.524Z] Traceback (most recent call last):
23:44:05 [2021-04-03T03:44:05.524Z]   File "(none)", line 184, in run
23:44:05 [2021-04-03T03:44:05.524Z]   File "__ref_L/Debug Test/Main.py_gvbbtmtysw", line 23, in <module>
23:44:05 [2021-04-03T03:44:05.524Z]   File "(none)", line 161, in trace_dispatch
23:44:05 [2021-04-03T03:44:05.524Z] org.eclipse.ease.ExitException: 
23:44:05 [2021-04-03T03:44:05.524Z] 
23:44:05 [2021-04-03T03:44:05.524Z] org.eclipse.ease.ExitException: org.eclipse.ease.ExitException: 
23:44:05 [2021-04-03T03:44:05.524Z] Start of script
23:44:05 [2021-04-03T03:44:05.524Z] include file start
23:44:05 [2021-04-03T03:44:05.524Z] include file processed
23:44:05 [2021-04-03T03:44:05.780Z] Result of testMethod = 5
23:44:05 [2021-04-03T03:44:05.780Z] End of script
23:44:06 [2021-04-03T03:44:06.035Z] Traceback (most recent call last):
23:44:06 [2021-04-03T03:44:06.035Z]   File "(none)", line 184, in run
23:44:06 [2021-04-03T03:44:06.035Z]   File "__ref_L/Debug Test/Main.py_erroreivrb", line 1, in <module>
23:44:06 [2021-04-03T03:44:06.035Z]   File "(none)", line 161, in trace_dispatch
23:44:06 [2021-04-03T03:44:06.035Z] org.eclipse.ease.ExitException: 
23:44:06 [2021-04-03T03:44:06.036Z] 
23:44:06 [2021-04-03T03:44:06.036Z] org.eclipse.ease.ExitException: org.eclipse.ease.ExitException: 
23:44:06 [2021-04-03T03:44:06.036Z] Start of script
23:44:06 [2021-04-03T03:44:06.036Z] include file start
23:44:06 [2021-04-03T03:44:06.036Z] include file processed
23:44:06 [2021-04-03T03:44:06.036Z] Result of testMethod = 5
23:44:06 [2021-04-03T03:44:06.291Z] End of script
23:44:06 [2021-04-03T03:44:06.291Z] Start of script
23:44:06 [2021-04-03T03:44:06.291Z] include file start
23:44:06 [2021-04-03T03:44:06.291Z] include file processed
23:44:06 [2021-04-03T03:44:06.546Z] Result of testMethod = 5
23:44:06 [2021-04-03T03:44:06.546Z] End of script
23:44:06 [2021-04-03T03:44:06.546Z] Traceback (most recent call last):
23:44:06 [2021-04-03T03:44:06.546Z]   File "(none)", line 184, in run
23:44:06 [2021-04-03T03:44:06.546Z]   File "__ref_L/Debug Test/Main.py_fbnwjlbuou", line 1, in <module>
23:44:06 [2021-04-03T03:44:06.546Z]   File "(none)", line 161, in trace_dispatch
23:44:06 [2021-04-03T03:44:06.546Z] org.eclipse.ease.ExitException: 
23:44:06 [2021-04-03T03:44:06.546Z] 
23:44:06 [2021-04-03T03:44:06.546Z] org.eclipse.ease.ExitException: org.eclipse.ease.ExitException: 
23:44:06 [2021-04-03T03:44:06.803Z] Start of script
23:44:06 [2021-04-03T03:44:06.803Z] include file start
23:44:06 [2021-04-03T03:44:06.803Z] include file processed
23:44:07 [2021-04-03T03:44:07.058Z] Result of testMethod = 5
23:44:07 [2021-04-03T03:44:07.058Z] End of script
23:44:07 [2021-04-03T03:44:07.058Z] Start of script
23:44:07 [2021-04-03T03:44:07.058Z] include file start
23:44:07 [2021-04-03T03:44:07.058Z] include file processed
23:44:07 [2021-04-03T03:44:07.058Z] Result of testMethod = 5
23:44:07 [2021-04-03T03:44:07.314Z] Traceback (most recent call last):
23:44:07 [2021-04-03T03:44:07.314Z]   File "(none)", line 184, in run
23:44:07 [2021-04-03T03:44:07.314Z]   File "__ref_L/Debug Test/Main.py_fixvlpztwy", line 23, in <module>
23:44:07 [2021-04-03T03:44:07.314Z]   File "(none)", line 161, in trace_dispatch
23:44:07 [2021-04-03T03:44:07.314Z] org.eclipse.ease.ExitException: 
23:44:07 [2021-04-03T03:44:07.314Z] 
23:44:07 [2021-04-03T03:44:07.314Z] org.eclipse.ease.ExitException: org.eclipse.ease.ExitException: 
23:44:07 [2021-04-03T03:44:07.569Z] Start of script
23:44:07 [2021-04-03T03:44:07.569Z] include file start
23:44:07 [2021-04-03T03:44:07.569Z] include file processed
23:44:07 [2021-04-03T03:44:07.569Z] Result of testMethod = 5
23:44:07 [2021-04-03T03:44:07.569Z] End of script
23:44:07 [2021-04-03T03:44:07.569Z] Start of script
23:44:07 [2021-04-03T03:44:07.569Z] include file start
23:44:07 [2021-04-03T03:44:07.569Z] include file processed
23:44:07 [2021-04-03T03:44:07.824Z] Result of testMethod = 5
23:44:07 [2021-04-03T03:44:07.824Z] End of script
23:44:07 [2021-04-03T03:44:07.824Z] Start of script
23:44:07 [2021-04-03T03:44:07.824Z] include file start
23:44:07 [2021-04-03T03:44:07.824Z] include file processed
23:44:07 [2021-04-03T03:44:07.824Z] Result of testMethod = 5
23:44:07 [2021-04-03T03:44:07.824Z] End of script
23:44:08 [2021-04-03T03:44:08.079Z] Start of script
23:44:08 [2021-04-03T03:44:08.079Z] include file start
23:44:08 [2021-04-03T03:44:08.079Z] include file processed
23:44:08 [2021-04-03T03:44:08.079Z] Result of testMethod = 5
23:44:08 [2021-04-03T03:44:08.079Z] End of script
23:44:08 [2021-04-03T03:44:08.334Z] Start of script
23:44:08 [2021-04-03T03:44:08.334Z] include file start
23:44:08 [2021-04-03T03:44:08.334Z] include file processed
23:44:08 [2021-04-03T03:44:08.591Z] Traceback (most recent call last):
23:44:08 [2021-04-03T03:44:08.591Z]   File "(none)", line 184, in run
23:44:08 [2021-04-03T03:44:08.591Z]   File "__ref_L/Debug Test/Main.py_yeydbvtsaa", line 21, in <module>
23:44:08 [2021-04-03T03:44:08.591Z]   File "__ref_L/Debug Test/Main.py_yeydbvtsaa", line 18, in testMethod
23:44:08 [2021-04-03T03:44:08.591Z]   File "(none)", line 161, in trace_dispatch
23:44:08 [2021-04-03T03:44:08.591Z] org.eclipse.ease.ExitException: 
23:44:08 [2021-04-03T03:44:08.591Z] 
23:44:08 [2021-04-03T03:44:08.591Z] org.eclipse.ease.ExitException: org.eclipse.ease.ExitException: 
23:44:08 [2021-04-03T03:44:08.591Z] Start of script
23:44:08 [2021-04-03T03:44:08.846Z] include file start
23:44:08 [2021-04-03T03:44:08.846Z] include file processed
23:44:08 [2021-04-03T03:44:08.846Z] Result of testMethod = 5
23:44:08 [2021-04-03T03:44:08.846Z] End of script
23:44:08 [2021-04-03T03:44:08.846Z] Start of script
23:44:08 [2021-04-03T03:44:08.846Z] include file start
23:44:08 [2021-04-03T03:44:08.846Z] include file processed
23:44:08 [2021-04-03T03:44:08.846Z] Result of testMethod = 5
23:44:09 [2021-04-03T03:44:09.102Z] Traceback (most recent call last):
23:44:09 [2021-04-03T03:44:09.102Z]   File "(none)", line 184, in run
23:44:09 [2021-04-03T03:44:09.102Z]   File "__ref_L/Debug Test/Main.py_dxjtmgxhll", line 23, in <module>
23:44:09 [2021-04-03T03:44:09.102Z]   File "(none)", line 161, in trace_dispatch
23:44:09 [2021-04-03T03:44:09.102Z] org.eclipse.ease.ExitException: 
23:44:09 [2021-04-03T03:44:09.102Z] 
23:44:09 [2021-04-03T03:44:09.102Z] org.eclipse.ease.ExitException: org.eclipse.ease.ExitException: 
23:44:09 [2021-04-03T03:44:09.357Z] Start of script
23:44:09 [2021-04-03T03:44:09.357Z] include file start
23:44:09 [2021-04-03T03:44:09.357Z] include file processed
23:44:09 [2021-04-03T03:44:09.357Z] Result of testMethod = 5
23:44:09 [2021-04-03T03:44:09.357Z] End of script
23:44:09 [2021-04-03T03:44:09.357Z] Start of script
23:44:09 [2021-04-03T03:44:09.357Z] include file start
23:44:09 [2021-04-03T03:44:09.357Z] include file processed
23:44:09 [2021-04-03T03:44:09.613Z] Result of testMethod = 5
23:44:09 [2021-04-03T03:44:09.613Z] End of script
23:44:09 [2021-04-03T03:44:09.868Z] Start of script
23:44:09 [2021-04-03T03:44:09.868Z] include file start
23:44:09 [2021-04-03T03:44:09.868Z] include file processed
23:44:09 [2021-04-03T03:44:09.868Z] Result of testMethod = 5
23:44:09 [2021-04-03T03:44:09.868Z] End of script
23:44:10 [2021-04-03T03:44:10.123Z] Start of script
23:44:10 [2021-04-03T03:44:10.123Z] include file start
23:44:10 [2021-04-03T03:44:10.123Z] include file processed
23:44:10 [2021-04-03T03:44:10.123Z] Result of testMethod = 5
23:44:10 [2021-04-03T03:44:10.123Z] End of script
23:44:10 [2021-04-03T03:44:10.379Z] Start of script
23:44:10 [2021-04-03T03:44:10.379Z] include file start
23:44:10 [2021-04-03T03:44:10.379Z] include file processed
23:44:10 [2021-04-03T03:44:10.379Z] Result of testMethod = 5
23:44:10 [2021-04-03T03:44:10.379Z] Traceback (most recent call last):
23:44:10 [2021-04-03T03:44:10.379Z]   File "(none)", line 184, in run
23:44:10 [2021-04-03T03:44:10.379Z]   File "__ref_L/Debug Test/Main.py_xzsursnqkd", line 23, in <module>
23:44:10 [2021-04-03T03:44:10.379Z]   File "(none)", line 161, in trace_dispatch
23:44:10 [2021-04-03T03:44:10.379Z] org.eclipse.ease.ExitException: 
23:44:10 [2021-04-03T03:44:10.379Z] 
23:44:10 [2021-04-03T03:44:10.379Z] org.eclipse.ease.ExitException: org.eclipse.ease.ExitException: 
23:44:10 [2021-04-03T03:44:10.634Z] Start of script
23:44:10 [2021-04-03T03:44:10.634Z] include file start
23:44:10 [2021-04-03T03:44:10.634Z] include file processed
23:44:10 [2021-04-03T03:44:10.634Z] Result of testMethod = 5
23:44:10 [2021-04-03T03:44:10.634Z] End of script
23:44:10 [2021-04-03T03:44:10.889Z] Start of script
23:44:10 [2021-04-03T03:44:10.890Z] include file start
23:44:10 [2021-04-03T03:44:10.890Z] include file processed
23:44:10 [2021-04-03T03:44:10.890Z] Result of testMethod = 5
23:44:10 [2021-04-03T03:44:10.890Z] Traceback (most recent call last):
23:44:10 [2021-04-03T03:44:10.890Z]   File "(none)", line 184, in run
23:44:10 [2021-04-03T03:44:10.890Z]   File "__ref_L/Debug Test/Main.py_riezfqljur", line 23, in <module>
23:44:10 [2021-04-03T03:44:10.890Z]   File "(none)", line 161, in trace_dispatch
23:44:10 [2021-04-03T03:44:10.890Z] org.eclipse.ease.ExitException: 
23:44:10 [2021-04-03T03:44:10.890Z] 
23:44:10 [2021-04-03T03:44:10.890Z] org.eclipse.ease.ExitException: org.eclipse.ease.ExitException: 
23:44:11 [2021-04-03T03:44:11.144Z] Traceback (most recent call last):
23:44:11 [2021-04-03T03:44:11.144Z]   File "(none)", line 184, in run
23:44:11 [2021-04-03T03:44:11.144Z]   File "__ref_L/Debug Test/Main.py_wqimhvnpfb", line 1, in <module>
23:44:11 [2021-04-03T03:44:11.144Z]   File "(none)", line 161, in trace_dispatch
23:44:11 [2021-04-03T03:44:11.144Z] org.eclipse.ease.ExitException: 
23:44:11 [2021-04-03T03:44:11.144Z] 
23:44:11 [2021-04-03T03:44:11.144Z] org.eclipse.ease.ExitException: org.eclipse.ease.ExitException: 
23:44:11 [2021-04-03T03:44:11.400Z] Start of script
23:44:11 [2021-04-03T03:44:11.400Z] include file start
23:44:11 [2021-04-03T03:44:11.400Z] include file processed
23:44:11 [2021-04-03T03:44:11.400Z] Result of testMethod = 5
23:44:11 [2021-04-03T03:44:11.400Z] End of script
23:44:11 [2021-04-03T03:44:11.400Z] Start of script
23:44:11 [2021-04-03T03:44:11.655Z] include file start
23:44:11 [2021-04-03T03:44:11.655Z] include file processed
23:44:11 [2021-04-03T03:44:11.655Z] Result of testMethod = 5
23:44:11 [2021-04-03T03:44:11.655Z] End of script
23:44:11 [2021-04-03T03:44:11.911Z] Start of script
23:44:11 [2021-04-03T03:44:11.911Z] include file start
23:44:11 [2021-04-03T03:44:11.911Z] include file processed
23:44:11 [2021-04-03T03:44:11.911Z] Result of testMethod = 5
23:44:11 [2021-04-03T03:44:11.911Z] End of script
23:44:11 [2021-04-03T03:44:11.911Z] Tests run: 42, Failures: 0, Errors: 0, Skipped: 0, Time elapsed: 14.141 s - in org.eclipse.ease.lang.python.jython.debugger.JythonDebugTest
23:44:11 [2021-04-03T03:44:11.911Z] disconnectProcessInSuspendedState  Time elapsed: 3.293 s
23:44:11 [2021-04-03T03:44:11.911Z] stepReturnIncludeCommand  Time elapsed: 0.209 s
23:44:11 [2021-04-03T03:44:11.911Z] arrayVariableSorting  Time elapsed: 0.308 s
23:44:11 [2021-04-03T03:44:11.911Z] stepOverOnDebugTarget  Time elapsed: 0.307 s
23:44:11 [2021-04-03T03:44:11.911Z] hasDebugTarget  Time elapsed: 0.104 s
23:44:11 [2021-04-03T03:44:11.911Z] disconnectThreadInSuspendedState  Time elapsed: 0.206 s
23:44:11 [2021-04-03T03:44:11.911Z] stepReturnOnDebugTarget  Time elapsed: 0.308 s
23:44:11 [2021-04-03T03:44:11.911Z] nullVariable  Time elapsed: 0.305 s
23:44:11 [2021-04-03T03:44:11.911Z] stepOverOnStackFrame  Time elapsed: 0.305 s
23:44:11 [2021-04-03T03:44:11.911Z] resumeOnDebugTarget  Time elapsed: 0.205 s
23:44:11 [2021-04-03T03:44:11.911Z] modifyVariableKeepingType  Time elapsed: 0.506 s
23:44:11 [2021-04-03T03:44:11.911Z] resumeOnLastIncludeLine  Time elapsed: 0.305 s
23:44:11 [2021-04-03T03:44:11.911Z] stepReturnOnStackFrame  Time elapsed: 0.305 s
23:44:11 [2021-04-03T03:44:11.911Z] terminateStackFrameInSuspendedState  Time elapsed: 0.205 s
23:44:11 [2021-04-03T03:44:11.911Z] breakpointLocation  Time elapsed: 0.206 s
23:44:11 [2021-04-03T03:44:11.911Z] stepReturnOnThread  Time elapsed: 0.306 s
23:44:11 [2021-04-03T03:44:11.911Z] javaClassVariable  Time elapsed: 0.306 s
23:44:11 [2021-04-03T03:44:11.911Z] stepIntoOnThread  Time elapsed: 0.305 s
23:44:11 [2021-04-03T03:44:11.911Z] terminateThreadInSuspendedState  Time elapsed: 0.205 s
23:44:11 [2021-04-03T03:44:11.911Z] resumeOnThread  Time elapsed: 0.205 s
23:44:11 [2021-04-03T03:44:11.911Z] stepIntoOnStackFrame  Time elapsed: 0.305 s
23:44:11 [2021-04-03T03:44:11.911Z] terminateProcessInSuspendedState  Time elapsed: 0.204 s
23:44:11 [2021-04-03T03:44:11.911Z] stepOverOnProcess  Time elapsed: 0.305 s
23:44:11 [2021-04-03T03:44:11.911Z] nativeArrayVariable  Time elapsed: 0.305 s
23:44:11 [2021-04-03T03:44:11.911Z] disconnectDebugTargetInSuspendedState  Time elapsed: 0.205 s
23:44:11 [2021-04-03T03:44:11.911Z] stepIntoOnProcess  Time elapsed: 0.305 s
23:44:11 [2021-04-03T03:44:11.911Z] terminatedState  Time elapsed: 0.103 s
23:44:11 [2021-04-03T03:44:11.911Z] stepOverIncludeCommand  Time elapsed: 0.305 s
23:44:11 [2021-04-03T03:44:11.911Z] innerScopeVariableBeforeOuterScopeVariable  Time elapsed: 0.305 s
23:44:11 [2021-04-03T03:44:11.911Z] stepIntoIncludeCommand  Time elapsed: 0.305 s
23:44:11 [2021-04-03T03:44:11.911Z] primitiveStringVariable  Time elapsed: 0.305 s
23:44:11 [2021-04-03T03:44:11.911Z] resumeOnProcess  Time elapsed: 0.205 s
23:44:11 [2021-04-03T03:44:11.911Z] stepIntoOnDebugTarget  Time elapsed: 0.305 s
23:44:11 [2021-04-03T03:44:11.911Z] stepOverOnThread  Time elapsed: 0.304 s
23:44:11 [2021-04-03T03:44:11.911Z] suspendedState  Time elapsed: 0.204 s
23:44:11 [2021-04-03T03:44:11.911Z] primitiveDoubleVariable  Time elapsed: 0.304 s
23:44:11 [2021-04-03T03:44:11.911Z] resumeOnStackFrame  Time elapsed: 0.203 s
23:44:11 [2021-04-03T03:44:11.911Z] nativeObjectVariable  Time elapsed: 0.304 s
23:44:11 [2021-04-03T03:44:11.911Z] terminateDebugTargetInSuspendedState  Time elapsed: 0.204 s
23:44:11 [2021-04-03T03:44:11.911Z] disconnectStackFrameInSuspendedState  Time elapsed: 0.204 s
23:44:11 [2021-04-03T03:44:11.911Z] stepReturnOnProcess  Time elapsed: 0.306 s
23:44:11 [2021-04-03T03:44:11.911Z] evaluateWatchExpression  Time elapsed: 0.225 s
23:44:11 [2021-04-03T03:44:11.911Z] 
23:44:11 [2021-04-03T03:44:11.911Z] Results:
23:44:11 [2021-04-03T03:44:11.911Z] 
23:44:11 [2021-04-03T03:44:11.911Z] Tests run: 42, Failures: 0, Errors: 0, Skipped: 0
23:44:11 [2021-04-03T03:44:11.911Z] 
23:44:12 [2021-04-03T03:44:12.841Z] [INFO] All tests passed!
23:44:12 [2021-04-03T03:44:12.841Z] [INFO] 
23:44:12 [2021-04-03T03:44:12.841Z] [INFO] -----< org.eclipse.ease:org.eclipse.ease.lang.scriptarchive.test >------
23:44:12 [2021-04-03T03:44:12.841Z] [INFO] Building org.eclipse.ease.lang.scriptarchive.test 0.8.0-SNAPSHOT   [8/9]
23:44:12 [2021-04-03T03:44:12.841Z] [INFO] ------------------------[ eclipse-test-plugin ]-------------------------
23:44:12 [2021-04-03T03:44:12.841Z] [INFO] 
23:44:12 [2021-04-03T03:44:12.841Z] [INFO] --- tycho-packaging-plugin:2.2.0:build-qualifier (default-build-qualifier) @ org.eclipse.ease.lang.scriptarchive.test ---
23:44:12 [2021-04-03T03:44:12.841Z] [INFO] The project's OSGi version is 0.8.0.I202103261223
23:44:12 [2021-04-03T03:44:12.841Z] [INFO] 
23:44:12 [2021-04-03T03:44:12.841Z] [INFO] --- tycho-packaging-plugin:2.2.0:validate-id (default-validate-id) @ org.eclipse.ease.lang.scriptarchive.test ---
23:44:12 [2021-04-03T03:44:12.841Z] [INFO] 
23:44:12 [2021-04-03T03:44:12.841Z] [INFO] --- tycho-packaging-plugin:2.2.0:validate-version (default-validate-version) @ org.eclipse.ease.lang.scriptarchive.test ---
23:44:12 [2021-04-03T03:44:12.841Z] [INFO] 
23:44:12 [2021-04-03T03:44:12.841Z] [INFO] --- maven-resources-plugin:2.4.3:resources (default-resources) @ org.eclipse.ease.lang.scriptarchive.test ---
23:44:12 [2021-04-03T03:44:12.841Z] [INFO] Using 'UTF-8' encoding to copy filtered resources.
23:44:12 [2021-04-03T03:44:12.841Z] [INFO] skip non existing resourceDirectory /home/jenkins/agent/workspace/ease.verify.core.target.2018-12/tests/org.eclipse.ease.lang.scriptarchive.test/src/main/resources
23:44:12 [2021-04-03T03:44:12.841Z] [INFO] 
23:44:12 [2021-04-03T03:44:12.841Z] [INFO] --- tycho-compiler-plugin:2.2.0:compile (default-compile) @ org.eclipse.ease.lang.scriptarchive.test ---
23:44:12 [2021-04-03T03:44:12.841Z] [INFO] Nothing to compile - all classes are up to date
23:44:12 [2021-04-03T03:44:12.841Z] [INFO] 
23:44:12 [2021-04-03T03:44:12.841Z] [INFO] --- maven-resources-plugin:2.4.3:testResources (default-testResources) @ org.eclipse.ease.lang.scriptarchive.test ---
23:44:12 [2021-04-03T03:44:12.841Z] [INFO] Using 'UTF-8' encoding to copy filtered resources.
23:44:12 [2021-04-03T03:44:12.841Z] [INFO] skip non existing resourceDirectory /home/jenkins/agent/workspace/ease.verify.core.target.2018-12/tests/org.eclipse.ease.lang.scriptarchive.test/src/test/resources
23:44:12 [2021-04-03T03:44:12.841Z] [INFO] 
23:44:12 [2021-04-03T03:44:12.841Z] [INFO] --- target-platform-configuration:2.2.0:target-platform (default-target-platform) @ org.eclipse.ease.lang.scriptarchive.test ---
23:44:12 [2021-04-03T03:44:12.841Z] [INFO] 
23:44:12 [2021-04-03T03:44:12.841Z] [INFO] --- tycho-packaging-plugin:2.2.0:package-plugin (default-package-plugin) @ org.eclipse.ease.lang.scriptarchive.test ---
23:44:12 [2021-04-03T03:44:12.841Z] [INFO] Building jar: /home/jenkins/agent/workspace/ease.verify.core.target.2018-12/tests/org.eclipse.ease.lang.scriptarchive.test/target/org.eclipse.ease.lang.scriptarchive.test-0.8.0-SNAPSHOT.jar
23:44:12 [2021-04-03T03:44:12.841Z] [INFO] 
23:44:12 [2021-04-03T03:44:12.841Z] [INFO] --- tycho-p2-plugin:2.2.0:p2-metadata-default (default-p2-metadata-default) @ org.eclipse.ease.lang.scriptarchive.test ---
23:44:12 [2021-04-03T03:44:12.841Z] [INFO] 
23:44:12 [2021-04-03T03:44:12.841Z] [INFO] --- jacoco-maven-plugin:0.8.6:prepare-agent (jacoco-initialize) @ org.eclipse.ease.lang.scriptarchive.test ---
23:44:12 [2021-04-03T03:44:12.841Z] [INFO] tycho.testArgLine set to -javaagent:/home/jenkins/.m2/repository/org/jacoco/org.jacoco.agent/0.8.6/org.jacoco.agent-0.8.6-runtime.jar=destfile=/home/jenkins/agent/workspace/ease.verify.core.target.2018-12/tests/org.eclipse.ease.lang.scriptarchive.test/target/jacoco.exec,output=file
23:44:12 [2021-04-03T03:44:12.842Z] [INFO] 
23:44:12 [2021-04-03T03:44:12.842Z] [INFO] --- tycho-surefire-plugin:2.2.0:test (default-test) @ org.eclipse.ease.lang.scriptarchive.test ---
23:44:12 [2021-04-03T03:44:12.842Z] [INFO] Executing Test Runtime with timeout 0, logs (if any) will be placed at: /home/jenkins/agent/workspace/ease.verify.core.target.2018-12/tests/org.eclipse.ease.lang.scriptarchive.test/target/work/data/.metadata/.log
23:44:12 [2021-04-03T03:44:12.842Z] [INFO] Command line:
23:44:12 [2021-04-03T03:44:12.842Z] 	[/opt/tools/java/openjdk/jdk-15/15.0.2+7/bin/java, -Dosgi.noShutdown=false, -Dosgi.os=linux, -Dosgi.ws=gtk, -Dosgi.arch=x86_64, -javaagent:/home/jenkins/.m2/repository/org/jacoco/org.jacoco.agent/0.8.6/org.jacoco.agent-0.8.6-runtime.jar=destfile=/home/jenkins/agent/workspace/ease.verify.core.target.2018-12/tests/org.eclipse.ease.lang.scriptarchive.test/target/jacoco.exec,output=file, -Dosgi.clean=true, -jar, /home/jenkins/.m2/repository/p2/osgi/bundle/org.eclipse.equinox.launcher/1.5.200.v20180922-1751/org.eclipse.equinox.launcher-1.5.200.v20180922-1751.jar, -data, /home/jenkins/agent/workspace/ease.verify.core.target.2018-12/tests/org.eclipse.ease.lang.scriptarchive.test/target/work/data, -install, /home/jenkins/agent/workspace/ease.verify.core.target.2018-12/tests/org.eclipse.ease.lang.scriptarchive.test/target/work, -configuration, /home/jenkins/agent/workspace/ease.verify.core.target.2018-12/tests/org.eclipse.ease.lang.scriptarchive.test/target/work/configuration, -application, org.eclipse.tycho.surefire.osgibooter.headlesstest, -testproperties, /home/jenkins/agent/workspace/ease.verify.core.target.2018-12/tests/org.eclipse.ease.lang.scriptarchive.test/target/surefire.properties]
23:44:12 [2021-04-03T03:44:12.842Z] Picked up JAVA_TOOL_OPTIONS: -Dmaven.ext.class.path="/home/jenkins/agent/workspace/ease.verify.core.target.2018-12@tmp/withMaven758cb5fd/pipeline-maven-spy.jar" -Dorg.jenkinsci.plugins.pipeline.maven.reportsFolder="/home/jenkins/agent/workspace/ease.verify.core.target.2018-12@tmp/withMaven758cb5fd" 
23:44:15 [2021-04-03T03:44:15.389Z] Apr 03, 2021 3:44:15 AM org.junit.platform.launcher.core.DefaultLauncher handleThrowable
23:44:15 [2021-04-03T03:44:15.389Z] WARNING: TestEngine with ID 'junit-vintage' failed to discover tests
23:44:15 [2021-04-03T03:44:15.389Z] java.lang.NoClassDefFoundError: org/junit/runners/model/RunnerBuilder
23:44:15 [2021-04-03T03:44:15.389Z] 	at org.junit.vintage.engine.discovery.VintageDiscoverer.<init>(VintageDiscoverer.java:48)
23:44:15 [2021-04-03T03:44:15.389Z] 	at org.junit.vintage.engine.VintageTestEngine.discover(VintageTestEngine.java:65)
23:44:15 [2021-04-03T03:44:15.389Z] 	at org.junit.platform.launcher.core.DefaultLauncher.discoverEngineRoot(DefaultLauncher.java:130)
23:44:15 [2021-04-03T03:44:15.389Z] 	at org.junit.platform.launcher.core.DefaultLauncher.discoverRoot(DefaultLauncher.java:117)
23:44:15 [2021-04-03T03:44:15.389Z] 	at org.junit.platform.launcher.core.DefaultLauncher.discover(DefaultLauncher.java:82)
23:44:15 [2021-04-03T03:44:15.389Z] 	at org.apache.maven.surefire.junitplatform.TestPlanScannerFilter.accept(TestPlanScannerFilter.java:56)
23:44:15 [2021-04-03T03:44:15.389Z] 	at org.apache.maven.surefire.util.DefaultScanResult.applyFilter(DefaultScanResult.java:102)
23:44:15 [2021-04-03T03:44:15.389Z] 	at org.apache.maven.surefire.junitplatform.JUnitPlatformProvider.scanClasspath(JUnitPlatformProvider.java:143)
23:44:15 [2021-04-03T03:44:15.389Z] 	at org.apache.maven.surefire.junitplatform.JUnitPlatformProvider.invoke(JUnitPlatformProvider.java:124)
23:44:15 [2021-04-03T03:44:15.389Z] 	at java.base/jdk.internal.reflect.NativeMethodAccessorImpl.invoke0(Native Method)
23:44:15 [2021-04-03T03:44:15.389Z] 	at java.base/jdk.internal.reflect.NativeMethodAccessorImpl.invoke(NativeMethodAccessorImpl.java:64)
23:44:15 [2021-04-03T03:44:15.389Z] 	at java.base/jdk.internal.reflect.DelegatingMethodAccessorImpl.invoke(DelegatingMethodAccessorImpl.java:43)
23:44:15 [2021-04-03T03:44:15.389Z] 	at java.base/java.lang.reflect.Method.invoke(Method.java:564)
23:44:15 [2021-04-03T03:44:15.389Z] 	at org.apache.maven.surefire.util.ReflectionUtils.invokeMethodWithArray2(ReflectionUtils.java:206)
23:44:15 [2021-04-03T03:44:15.389Z] 	at org.apache.maven.surefire.booter.ProviderFactory$ProviderProxy.invoke(ProviderFactory.java:161)
23:44:15 [2021-04-03T03:44:15.389Z] 	at org.apache.maven.surefire.booter.ProviderFactory.invokeProvider(ProviderFactory.java:84)
23:44:15 [2021-04-03T03:44:15.389Z] 	at org.eclipse.tycho.surefire.osgibooter.OsgiSurefireBooter.run(OsgiSurefireBooter.java:116)
23:44:15 [2021-04-03T03:44:15.389Z] 	at org.eclipse.tycho.surefire.osgibooter.HeadlessTestApplication.start(HeadlessTestApplication.java:23)
23:44:15 [2021-04-03T03:44:15.389Z] 	at org.eclipse.equinox.internal.app.EclipseAppHandle.run(EclipseAppHandle.java:203)
23:44:15 [2021-04-03T03:44:15.389Z] 	at org.eclipse.core.runtime.internal.adaptor.EclipseAppLauncher.runApplication(EclipseAppLauncher.java:137)
23:44:15 [2021-04-03T03:44:15.389Z] 	at org.eclipse.core.runtime.internal.adaptor.EclipseAppLauncher.start(EclipseAppLauncher.java:107)
23:44:15 [2021-04-03T03:44:15.389Z] 	at org.eclipse.core.runtime.adaptor.EclipseStarter.run(EclipseStarter.java:400)
23:44:15 [2021-04-03T03:44:15.390Z] 	at org.eclipse.core.runtime.adaptor.EclipseStarter.run(EclipseStarter.java:255)
23:44:15 [2021-04-03T03:44:15.390Z] 	at java.base/jdk.internal.reflect.NativeMethodAccessorImpl.invoke0(Native Method)
23:44:15 [2021-04-03T03:44:15.390Z] 	at java.base/jdk.internal.reflect.NativeMethodAccessorImpl.invoke(NativeMethodAccessorImpl.java:64)
23:44:15 [2021-04-03T03:44:15.390Z] 	at java.base/jdk.internal.reflect.DelegatingMethodAccessorImpl.invoke(DelegatingMethodAccessorImpl.java:43)
23:44:15 [2021-04-03T03:44:15.390Z] 	at java.base/java.lang.reflect.Method.invoke(Method.java:564)
23:44:15 [2021-04-03T03:44:15.390Z] 	at org.eclipse.equinox.launcher.Main.invokeFramework(Main.java:659)
23:44:15 [2021-04-03T03:44:15.390Z] 	at org.eclipse.equinox.launcher.Main.basicRun(Main.java:595)
23:44:15 [2021-04-03T03:44:15.390Z] 	at org.eclipse.equinox.launcher.Main.run(Main.java:1501)
23:44:15 [2021-04-03T03:44:15.390Z] 	at org.eclipse.equinox.launcher.Main.main(Main.java:1474)
23:44:15 [2021-04-03T03:44:15.390Z] Caused by: java.lang.ClassNotFoundException: org.junit.runners.model.RunnerBuilder cannot be found by org.eclipse.tycho.surefire.osgibooter_2.2.0
23:44:15 [2021-04-03T03:44:15.390Z] 	at org.eclipse.osgi.internal.loader.BundleLoader.findClassInternal(BundleLoader.java:511)
23:44:15 [2021-04-03T03:44:15.390Z] 	at org.eclipse.osgi.internal.loader.BundleLoader.findClass(BundleLoader.java:422)
23:44:15 [2021-04-03T03:44:15.390Z] 	at org.eclipse.osgi.internal.loader.BundleLoader.findClass(BundleLoader.java:414)
23:44:15 [2021-04-03T03:44:15.390Z] 	at org.eclipse.osgi.internal.loader.ModuleClassLoader.loadClass(ModuleClassLoader.java:153)
23:44:15 [2021-04-03T03:44:15.390Z] 	at java.base/java.lang.ClassLoader.loadClass(ClassLoader.java:522)
23:44:15 [2021-04-03T03:44:15.390Z] 	... 31 more
23:44:15 [2021-04-03T03:44:15.390Z] 
23:44:15 [2021-04-03T03:44:15.390Z] Apr 03, 2021 3:44:15 AM org.junit.platform.launcher.core.DefaultLauncher handleThrowable
23:44:15 [2021-04-03T03:44:15.390Z] WARNING: TestEngine with ID 'junit-vintage' failed to discover tests
23:44:15 [2021-04-03T03:44:15.390Z] java.lang.NoClassDefFoundError: org/junit/runners/model/RunnerBuilder
23:44:15 [2021-04-03T03:44:15.390Z] 	at org.junit.vintage.engine.discovery.VintageDiscoverer.<init>(VintageDiscoverer.java:48)
23:44:15 [2021-04-03T03:44:15.390Z] 	at org.junit.vintage.engine.VintageTestEngine.discover(VintageTestEngine.java:65)
23:44:15 [2021-04-03T03:44:15.390Z] 	at org.junit.platform.launcher.core.DefaultLauncher.discoverEngineRoot(DefaultLauncher.java:130)
23:44:15 [2021-04-03T03:44:15.390Z] 	at org.junit.platform.launcher.core.DefaultLauncher.discoverRoot(DefaultLauncher.java:117)
23:44:15 [2021-04-03T03:44:15.390Z] 	at org.junit.platform.launcher.core.DefaultLauncher.execute(DefaultLauncher.java:90)
23:44:15 [2021-04-03T03:44:15.390Z] 	at org.apache.maven.surefire.junitplatform.JUnitPlatformProvider.invokeAllTests(JUnitPlatformProvider.java:150)
23:44:15 [2021-04-03T03:44:15.390Z] 	at org.apache.maven.surefire.junitplatform.JUnitPlatformProvider.invoke(JUnitPlatformProvider.java:124)
23:44:15 [2021-04-03T03:44:15.390Z] 	at java.base/jdk.internal.reflect.NativeMethodAccessorImpl.invoke0(Native Method)
23:44:15 [2021-04-03T03:44:15.390Z] 	at java.base/jdk.internal.reflect.NativeMethodAccessorImpl.invoke(NativeMethodAccessorImpl.java:64)
23:44:15 [2021-04-03T03:44:15.390Z] 	at java.base/jdk.internal.reflect.DelegatingMethodAccessorImpl.invoke(DelegatingMethodAccessorImpl.java:43)
23:44:15 [2021-04-03T03:44:15.390Z] 	at java.base/java.lang.reflect.Method.invoke(Method.java:564)
23:44:15 [2021-04-03T03:44:15.390Z] 	at org.apache.maven.surefire.util.ReflectionUtils.invokeMethodWithArray2(ReflectionUtils.java:206)
23:44:15 [2021-04-03T03:44:15.390Z] 	at org.apache.maven.surefire.booter.ProviderFactory$ProviderProxy.invoke(ProviderFactory.java:161)
23:44:15 [2021-04-03T03:44:15.390Z] 	at org.apache.maven.surefire.booter.ProviderFactory.invokeProvider(ProviderFactory.java:84)
23:44:15 [2021-04-03T03:44:15.390Z] 	at org.eclipse.tycho.surefire.osgibooter.OsgiSurefireBooter.run(OsgiSurefireBooter.java:116)
23:44:15 [2021-04-03T03:44:15.390Z] 	at org.eclipse.tycho.surefire.osgibooter.HeadlessTestApplication.start(HeadlessTestApplication.java:23)
23:44:15 [2021-04-03T03:44:15.390Z] 	at org.eclipse.equinox.internal.app.EclipseAppHandle.run(EclipseAppHandle.java:203)
23:44:15 [2021-04-03T03:44:15.390Z] 	at org.eclipse.core.runtime.internal.adaptor.EclipseAppLauncher.runApplication(EclipseAppLauncher.java:137)
23:44:15 [2021-04-03T03:44:15.390Z] 	at org.eclipse.core.runtime.internal.adaptor.EclipseAppLauncher.start(EclipseAppLauncher.java:107)
23:44:15 [2021-04-03T03:44:15.390Z] 	at org.eclipse.core.runtime.adaptor.EclipseStarter.run(EclipseStarter.java:400)
23:44:15 [2021-04-03T03:44:15.390Z] 	at org.eclipse.core.runtime.adaptor.EclipseStarter.run(EclipseStarter.java:255)
23:44:15 [2021-04-03T03:44:15.390Z] 	at java.base/jdk.internal.reflect.NativeMethodAccessorImpl.invoke0(Native Method)
23:44:15 [2021-04-03T03:44:15.390Z] 	at java.base/jdk.internal.reflect.NativeMethodAccessorImpl.invoke(NativeMethodAccessorImpl.java:64)
23:44:15 [2021-04-03T03:44:15.390Z] 	at java.base/jdk.internal.reflect.DelegatingMethodAccessorImpl.invoke(DelegatingMethodAccessorImpl.java:43)
23:44:15 [2021-04-03T03:44:15.390Z] 	at java.base/java.lang.reflect.Method.invoke(Method.java:564)
23:44:15 [2021-04-03T03:44:15.390Z] 	at org.eclipse.equinox.launcher.Main.invokeFramework(Main.java:659)
23:44:15 [2021-04-03T03:44:15.390Z] 	at org.eclipse.equinox.launcher.Main.basicRun(Main.java:595)
23:44:15 [2021-04-03T03:44:15.390Z] 	at org.eclipse.equinox.launcher.Main.run(Main.java:1501)
23:44:15 [2021-04-03T03:44:15.390Z] 	at org.eclipse.equinox.launcher.Main.main(Main.java:1474)
23:44:15 [2021-04-03T03:44:15.390Z] Caused by: java.lang.ClassNotFoundException: org.junit.runners.model.RunnerBuilder cannot be found by org.eclipse.tycho.surefire.osgibooter_2.2.0
23:44:15 [2021-04-03T03:44:15.390Z] 	at org.eclipse.osgi.internal.loader.BundleLoader.findClassInternal(BundleLoader.java:511)
23:44:15 [2021-04-03T03:44:15.390Z] 	at org.eclipse.osgi.internal.loader.BundleLoader.findClass(BundleLoader.java:422)
23:44:15 [2021-04-03T03:44:15.390Z] 	at org.eclipse.osgi.internal.loader.BundleLoader.findClass(BundleLoader.java:414)
23:44:15 [2021-04-03T03:44:15.390Z] 	at org.eclipse.osgi.internal.loader.ModuleClassLoader.loadClass(ModuleClassLoader.java:153)
23:44:15 [2021-04-03T03:44:15.390Z] 	at java.base/java.lang.ClassLoader.loadClass(ClassLoader.java:522)
23:44:15 [2021-04-03T03:44:15.390Z] 	... 29 more
23:44:15 [2021-04-03T03:44:15.390Z] 
23:44:15 [2021-04-03T03:44:15.390Z] Running org.eclipse.ease.lang.scriptarchive.ArchiveEngineTest
23:44:15 [2021-04-03T03:44:15.952Z] We are running from a zip file!
23:44:15 [2021-04-03T03:44:15.952Z] org.eclipse.ease.ScriptExecutionException: SyntaxError: missing ; before statement (workspace://__EASE_ScriptArchive_1/scripts/Master.js#3)
23:44:15 [2021-04-03T03:44:15.952Z] this is an error
23:44:15 [2021-04-03T03:44:15.952Z]        ^
23:44:15 [2021-04-03T03:44:15.952Z] 	at Master.js,workspace://__EASE_ScriptArchive_1/scripts/Master.js
23:44:15 [2021-04-03T03:44:15.952Z] org.eclipse.ease.ScriptExecutionException: SyntaxError: missing ; before statement (workspace://__EASE_ScriptArchive_1/scripts/Master.js#3)
23:44:15 [2021-04-03T03:44:15.952Z] this is an error
23:44:15 [2021-04-03T03:44:15.952Z]        ^
23:44:15 [2021-04-03T03:44:15.952Z] 	at Master.js,workspace://__EASE_ScriptArchive_1/scripts/Master.js
23:44:15 [2021-04-03T03:44:15.952Z] Tests run: 7, Failures: 0, Errors: 0, Skipped: 0, Time elapsed: 0.804 s - in org.eclipse.ease.lang.scriptarchive.ArchiveEngineTest
23:44:15 [2021-04-03T03:44:15.952Z] executeWithManifest  Time elapsed: 0.66 s
23:44:15 [2021-04-03T03:44:15.952Z] zipFileRegistration  Time elapsed: 0.011 s
23:44:15 [2021-04-03T03:44:15.952Z] engineIdRegistration  Time elapsed: 0 s
23:44:15 [2021-04-03T03:44:15.952Z] jarFileRegistration  Time elapsed: 0.001 s
23:44:15 [2021-04-03T03:44:15.952Z] sarFileRegistration  Time elapsed: 0 s
23:44:15 [2021-04-03T03:44:15.952Z] executeWithErrors  Time elapsed: 0.049 s
23:44:15 [2021-04-03T03:44:15.952Z] executeWithIncludes  Time elapsed: 0.078 s
23:44:15 [2021-04-03T03:44:15.952Z] 
23:44:15 [2021-04-03T03:44:15.952Z] Results:
23:44:15 [2021-04-03T03:44:15.952Z] 
23:44:15 [2021-04-03T03:44:15.952Z] Tests run: 7, Failures: 0, Errors: 0, Skipped: 0
23:44:15 [2021-04-03T03:44:15.952Z] 
23:44:16 [2021-04-03T03:44:16.515Z] [INFO] All tests passed!
23:44:16 [2021-04-03T03:44:16.515Z] [INFO] 
23:44:16 [2021-04-03T03:44:16.515Z] [INFO] -------------< org.eclipse.ease:org.eclipse.ease.ui.test >--------------
23:44:16 [2021-04-03T03:44:16.515Z] [INFO] Building org.eclipse.ease.ui.test 0.8.0-SNAPSHOT                   [9/9]
23:44:16 [2021-04-03T03:44:16.515Z] [INFO] ------------------------[ eclipse-test-plugin ]-------------------------
23:44:16 [2021-04-03T03:44:16.515Z] [INFO] 
23:44:16 [2021-04-03T03:44:16.515Z] [INFO] --- tycho-packaging-plugin:2.2.0:build-qualifier (default-build-qualifier) @ org.eclipse.ease.ui.test ---
23:44:16 [2021-04-03T03:44:16.515Z] [INFO] The project's OSGi version is 0.8.0.I202104021108
23:44:16 [2021-04-03T03:44:16.515Z] [INFO] 
23:44:16 [2021-04-03T03:44:16.515Z] [INFO] --- tycho-packaging-plugin:2.2.0:validate-id (default-validate-id) @ org.eclipse.ease.ui.test ---
23:44:16 [2021-04-03T03:44:16.515Z] [INFO] 
23:44:16 [2021-04-03T03:44:16.515Z] [INFO] --- tycho-packaging-plugin:2.2.0:validate-version (default-validate-version) @ org.eclipse.ease.ui.test ---
23:44:16 [2021-04-03T03:44:16.515Z] [INFO] 
23:44:16 [2021-04-03T03:44:16.515Z] [INFO] --- maven-resources-plugin:2.4.3:resources (default-resources) @ org.eclipse.ease.ui.test ---
23:44:16 [2021-04-03T03:44:16.515Z] [INFO] Using 'UTF-8' encoding to copy filtered resources.
23:44:16 [2021-04-03T03:44:16.515Z] [INFO] skip non existing resourceDirectory /home/jenkins/agent/workspace/ease.verify.core.target.2018-12/tests/org.eclipse.ease.ui.test/src/main/resources
23:44:16 [2021-04-03T03:44:16.515Z] [INFO] 
23:44:16 [2021-04-03T03:44:16.515Z] [INFO] --- tycho-compiler-plugin:2.2.0:compile (default-compile) @ org.eclipse.ease.ui.test ---
23:44:16 [2021-04-03T03:44:16.515Z] [INFO] Nothing to compile - all classes are up to date
23:44:16 [2021-04-03T03:44:16.515Z] [INFO] 
23:44:16 [2021-04-03T03:44:16.515Z] [INFO] --- maven-resources-plugin:2.4.3:testResources (default-testResources) @ org.eclipse.ease.ui.test ---
23:44:16 [2021-04-03T03:44:16.515Z] [INFO] Using 'UTF-8' encoding to copy filtered resources.
23:44:16 [2021-04-03T03:44:16.515Z] [INFO] skip non existing resourceDirectory /home/jenkins/agent/workspace/ease.verify.core.target.2018-12/tests/org.eclipse.ease.ui.test/src/test/resources
23:44:16 [2021-04-03T03:44:16.515Z] [INFO] 
23:44:16 [2021-04-03T03:44:16.515Z] [INFO] --- target-platform-configuration:2.2.0:target-platform (default-target-platform) @ org.eclipse.ease.ui.test ---
23:44:16 [2021-04-03T03:44:16.515Z] [INFO] 
23:44:16 [2021-04-03T03:44:16.515Z] [INFO] --- tycho-packaging-plugin:2.2.0:package-plugin (default-package-plugin) @ org.eclipse.ease.ui.test ---
23:44:16 [2021-04-03T03:44:16.515Z] [INFO] Building jar: /home/jenkins/agent/workspace/ease.verify.core.target.2018-12/tests/org.eclipse.ease.ui.test/target/org.eclipse.ease.ui.test-0.8.0-SNAPSHOT.jar
23:44:16 [2021-04-03T03:44:16.890Z] [INFO] 
23:44:16 [2021-04-03T03:44:16.890Z] [INFO] --- tycho-p2-plugin:2.2.0:p2-metadata-default (default-p2-metadata-default) @ org.eclipse.ease.ui.test ---
23:44:16 [2021-04-03T03:44:16.890Z] [INFO] 
23:44:16 [2021-04-03T03:44:16.890Z] [INFO] --- jacoco-maven-plugin:0.8.6:prepare-agent (jacoco-initialize) @ org.eclipse.ease.ui.test ---
23:44:16 [2021-04-03T03:44:16.890Z] [INFO] tycho.testArgLine set to -javaagent:/home/jenkins/.m2/repository/org/jacoco/org.jacoco.agent/0.8.6/org.jacoco.agent-0.8.6-runtime.jar=destfile=/home/jenkins/agent/workspace/ease.verify.core.target.2018-12/tests/org.eclipse.ease.ui.test/target/jacoco.exec,output=file
23:44:16 [2021-04-03T03:44:16.890Z] [INFO] 
23:44:16 [2021-04-03T03:44:16.890Z] [INFO] --- tycho-surefire-plugin:2.2.0:test (default-test) @ org.eclipse.ease.ui.test ---
23:44:16 [2021-04-03T03:44:16.890Z] [INFO] Executing Test Runtime with timeout 0, logs (if any) will be placed at: /home/jenkins/agent/workspace/ease.verify.core.target.2018-12/tests/org.eclipse.ease.ui.test/target/work/data/.metadata/.log
23:44:16 [2021-04-03T03:44:16.890Z] [INFO] Command line:
23:44:16 [2021-04-03T03:44:16.890Z] 	[/opt/tools/java/openjdk/jdk-15/15.0.2+7/bin/java, -Dosgi.noShutdown=false, -Dosgi.os=linux, -Dosgi.ws=gtk, -Dosgi.arch=x86_64, -javaagent:/home/jenkins/.m2/repository/org/jacoco/org.jacoco.agent/0.8.6/org.jacoco.agent-0.8.6-runtime.jar=destfile=/home/jenkins/agent/workspace/ease.verify.core.target.2018-12/tests/org.eclipse.ease.ui.test/target/jacoco.exec,output=file, -Dosgi.clean=true, -jar, /home/jenkins/.m2/repository/p2/osgi/bundle/org.eclipse.equinox.launcher/1.5.200.v20180922-1751/org.eclipse.equinox.launcher-1.5.200.v20180922-1751.jar, -data, /home/jenkins/agent/workspace/ease.verify.core.target.2018-12/tests/org.eclipse.ease.ui.test/target/work/data, -install, /home/jenkins/agent/workspace/ease.verify.core.target.2018-12/tests/org.eclipse.ease.ui.test/target/work, -configuration, /home/jenkins/agent/workspace/ease.verify.core.target.2018-12/tests/org.eclipse.ease.ui.test/target/work/configuration, -application, org.eclipse.tycho.surefire.osgibooter.headlesstest, -testproperties, /home/jenkins/agent/workspace/ease.verify.core.target.2018-12/tests/org.eclipse.ease.ui.test/target/surefire.properties]
23:44:16 [2021-04-03T03:44:16.890Z] Picked up JAVA_TOOL_OPTIONS: -Dmaven.ext.class.path="/home/jenkins/agent/workspace/ease.verify.core.target.2018-12@tmp/withMaven758cb5fd/pipeline-maven-spy.jar" -Dorg.jenkinsci.plugins.pipeline.maven.reportsFolder="/home/jenkins/agent/workspace/ease.verify.core.target.2018-12@tmp/withMaven758cb5fd" 
23:44:19 [2021-04-03T03:44:19.440Z] Apr 03, 2021 3:44:19 AM org.junit.platform.launcher.core.DefaultLauncher handleThrowable
23:44:19 [2021-04-03T03:44:19.440Z] WARNING: TestEngine with ID 'junit-vintage' failed to discover tests
23:44:19 [2021-04-03T03:44:19.440Z] java.lang.NoClassDefFoundError: org/junit/runners/model/RunnerBuilder
23:44:19 [2021-04-03T03:44:19.440Z] 	at org.junit.vintage.engine.discovery.VintageDiscoverer.<init>(VintageDiscoverer.java:48)
23:44:19 [2021-04-03T03:44:19.440Z] 	at org.junit.vintage.engine.VintageTestEngine.discover(VintageTestEngine.java:65)
23:44:19 [2021-04-03T03:44:19.440Z] 	at org.junit.platform.launcher.core.DefaultLauncher.discoverEngineRoot(DefaultLauncher.java:130)
23:44:19 [2021-04-03T03:44:19.440Z] 	at org.junit.platform.launcher.core.DefaultLauncher.discoverRoot(DefaultLauncher.java:117)
23:44:19 [2021-04-03T03:44:19.440Z] 	at org.junit.platform.launcher.core.DefaultLauncher.discover(DefaultLauncher.java:82)
23:44:19 [2021-04-03T03:44:19.440Z] 	at org.apache.maven.surefire.junitplatform.TestPlanScannerFilter.accept(TestPlanScannerFilter.java:56)
23:44:19 [2021-04-03T03:44:19.440Z] 	at org.apache.maven.surefire.util.DefaultScanResult.applyFilter(DefaultScanResult.java:102)
23:44:19 [2021-04-03T03:44:19.440Z] 	at org.apache.maven.surefire.junitplatform.JUnitPlatformProvider.scanClasspath(JUnitPlatformProvider.java:143)
23:44:19 [2021-04-03T03:44:19.440Z] 	at org.apache.maven.surefire.junitplatform.JUnitPlatformProvider.invoke(JUnitPlatformProvider.java:124)
23:44:19 [2021-04-03T03:44:19.440Z] 	at java.base/jdk.internal.reflect.NativeMethodAccessorImpl.invoke0(Native Method)
23:44:19 [2021-04-03T03:44:19.440Z] 	at java.base/jdk.internal.reflect.NativeMethodAccessorImpl.invoke(NativeMethodAccessorImpl.java:64)
23:44:19 [2021-04-03T03:44:19.440Z] 	at java.base/jdk.internal.reflect.DelegatingMethodAccessorImpl.invoke(DelegatingMethodAccessorImpl.java:43)
23:44:19 [2021-04-03T03:44:19.440Z] 	at java.base/java.lang.reflect.Method.invoke(Method.java:564)
23:44:19 [2021-04-03T03:44:19.440Z] 	at org.apache.maven.surefire.util.ReflectionUtils.invokeMethodWithArray2(ReflectionUtils.java:206)
23:44:19 [2021-04-03T03:44:19.440Z] 	at org.apache.maven.surefire.booter.ProviderFactory$ProviderProxy.invoke(ProviderFactory.java:161)
23:44:19 [2021-04-03T03:44:19.440Z] 	at org.apache.maven.surefire.booter.ProviderFactory.invokeProvider(ProviderFactory.java:84)
23:44:19 [2021-04-03T03:44:19.440Z] 	at org.eclipse.tycho.surefire.osgibooter.OsgiSurefireBooter.run(OsgiSurefireBooter.java:116)
23:44:19 [2021-04-03T03:44:19.440Z] 	at org.eclipse.tycho.surefire.osgibooter.HeadlessTestApplication.start(HeadlessTestApplication.java:23)
23:44:19 [2021-04-03T03:44:19.440Z] 	at org.eclipse.equinox.internal.app.EclipseAppHandle.run(EclipseAppHandle.java:203)
23:44:19 [2021-04-03T03:44:19.440Z] 	at org.eclipse.core.runtime.internal.adaptor.EclipseAppLauncher.runApplication(EclipseAppLauncher.java:137)
23:44:19 [2021-04-03T03:44:19.440Z] 	at org.eclipse.core.runtime.internal.adaptor.EclipseAppLauncher.start(EclipseAppLauncher.java:107)
23:44:19 [2021-04-03T03:44:19.440Z] 	at org.eclipse.core.runtime.adaptor.EclipseStarter.run(EclipseStarter.java:400)
23:44:19 [2021-04-03T03:44:19.440Z] 	at org.eclipse.core.runtime.adaptor.EclipseStarter.run(EclipseStarter.java:255)
23:44:19 [2021-04-03T03:44:19.440Z] 	at java.base/jdk.internal.reflect.NativeMethodAccessorImpl.invoke0(Native Method)
23:44:19 [2021-04-03T03:44:19.440Z] 	at java.base/jdk.internal.reflect.NativeMethodAccessorImpl.invoke(NativeMethodAccessorImpl.java:64)
23:44:19 [2021-04-03T03:44:19.440Z] 	at java.base/jdk.internal.reflect.DelegatingMethodAccessorImpl.invoke(DelegatingMethodAccessorImpl.java:43)
23:44:19 [2021-04-03T03:44:19.440Z] 	at java.base/java.lang.reflect.Method.invoke(Method.java:564)
23:44:19 [2021-04-03T03:44:19.440Z] 	at org.eclipse.equinox.launcher.Main.invokeFramework(Main.java:659)
23:44:19 [2021-04-03T03:44:19.440Z] 	at org.eclipse.equinox.launcher.Main.basicRun(Main.java:595)
23:44:19 [2021-04-03T03:44:19.440Z] 	at org.eclipse.equinox.launcher.Main.run(Main.java:1501)
23:44:19 [2021-04-03T03:44:19.440Z] 	at org.eclipse.equinox.launcher.Main.main(Main.java:1474)
23:44:19 [2021-04-03T03:44:19.440Z] Caused by: java.lang.ClassNotFoundException: org.junit.runners.model.RunnerBuilder cannot be found by org.eclipse.tycho.surefire.osgibooter_2.2.0
23:44:19 [2021-04-03T03:44:19.440Z] 	at org.eclipse.osgi.internal.loader.BundleLoader.findClassInternal(BundleLoader.java:511)
23:44:19 [2021-04-03T03:44:19.440Z] 	at org.eclipse.osgi.internal.loader.BundleLoader.findClass(BundleLoader.java:422)
23:44:19 [2021-04-03T03:44:19.440Z] 	at org.eclipse.osgi.internal.loader.BundleLoader.findClass(BundleLoader.java:414)
23:44:19 [2021-04-03T03:44:19.440Z] 	at org.eclipse.osgi.internal.loader.ModuleClassLoader.loadClass(ModuleClassLoader.java:153)
23:44:19 [2021-04-03T03:44:19.440Z] 	at java.base/java.lang.ClassLoader.loadClass(ClassLoader.java:522)
23:44:19 [2021-04-03T03:44:19.440Z] 	... 31 more
23:44:19 [2021-04-03T03:44:19.440Z] 
23:44:19 [2021-04-03T03:44:19.440Z] Apr 03, 2021 3:44:19 AM org.junit.platform.launcher.core.DefaultLauncher handleThrowable
23:44:19 [2021-04-03T03:44:19.440Z] WARNING: TestEngine with ID 'junit-vintage' failed to discover tests
23:44:19 [2021-04-03T03:44:19.440Z] java.lang.NoClassDefFoundError: org/junit/runners/model/RunnerBuilder
23:44:19 [2021-04-03T03:44:19.440Z] 	at org.junit.vintage.engine.discovery.VintageDiscoverer.<init>(VintageDiscoverer.java:48)
23:44:19 [2021-04-03T03:44:19.440Z] 	at org.junit.vintage.engine.VintageTestEngine.discover(VintageTestEngine.java:65)
23:44:19 [2021-04-03T03:44:19.440Z] 	at org.junit.platform.launcher.core.DefaultLauncher.discoverEngineRoot(DefaultLauncher.java:130)
23:44:19 [2021-04-03T03:44:19.440Z] 	at org.junit.platform.launcher.core.DefaultLauncher.discoverRoot(DefaultLauncher.java:117)
23:44:19 [2021-04-03T03:44:19.440Z] 	at org.junit.platform.launcher.core.DefaultLauncher.discover(DefaultLauncher.java:82)
23:44:19 [2021-04-03T03:44:19.440Z] 	at org.apache.maven.surefire.junitplatform.TestPlanScannerFilter.accept(TestPlanScannerFilter.java:56)
23:44:19 [2021-04-03T03:44:19.441Z] 	at org.apache.maven.surefire.util.DefaultScanResult.applyFilter(DefaultScanResult.java:102)
23:44:19 [2021-04-03T03:44:19.441Z] 	at org.apache.maven.surefire.junitplatform.JUnitPlatformProvider.scanClasspath(JUnitPlatformProvider.java:143)
23:44:19 [2021-04-03T03:44:19.441Z] 	at org.apache.maven.surefire.junitplatform.JUnitPlatformProvider.invoke(JUnitPlatformProvider.java:124)
23:44:19 [2021-04-03T03:44:19.441Z] 	at java.base/jdk.internal.reflect.NativeMethodAccessorImpl.invoke0(Native Method)
23:44:19 [2021-04-03T03:44:19.441Z] 	at java.base/jdk.internal.reflect.NativeMethodAccessorImpl.invoke(NativeMethodAccessorImpl.java:64)
23:44:19 [2021-04-03T03:44:19.441Z] 	at java.base/jdk.internal.reflect.DelegatingMethodAccessorImpl.invoke(DelegatingMethodAccessorImpl.java:43)
23:44:19 [2021-04-03T03:44:19.441Z] 	at java.base/java.lang.reflect.Method.invoke(Method.java:564)
23:44:19 [2021-04-03T03:44:19.441Z] 	at org.apache.maven.surefire.util.ReflectionUtils.invokeMethodWithArray2(ReflectionUtils.java:206)
23:44:19 [2021-04-03T03:44:19.441Z] 	at org.apache.maven.surefire.booter.ProviderFactory$ProviderProxy.invoke(ProviderFactory.java:161)
23:44:19 [2021-04-03T03:44:19.441Z] 	at org.apache.maven.surefire.booter.ProviderFactory.invokeProvider(ProviderFactory.java:84)
23:44:19 [2021-04-03T03:44:19.441Z] 	at org.eclipse.tycho.surefire.osgibooter.OsgiSurefireBooter.run(OsgiSurefireBooter.java:116)
23:44:19 [2021-04-03T03:44:19.441Z] 	at org.eclipse.tycho.surefire.osgibooter.HeadlessTestApplication.start(HeadlessTestApplication.java:23)
23:44:19 [2021-04-03T03:44:19.441Z] 	at org.eclipse.equinox.internal.app.EclipseAppHandle.run(EclipseAppHandle.java:203)
23:44:19 [2021-04-03T03:44:19.441Z] 	at org.eclipse.core.runtime.internal.adaptor.EclipseAppLauncher.runApplication(EclipseAppLauncher.java:137)
23:44:19 [2021-04-03T03:44:19.441Z] 	at org.eclipse.core.runtime.internal.adaptor.EclipseAppLauncher.start(EclipseAppLauncher.java:107)
23:44:19 [2021-04-03T03:44:19.441Z] 	at org.eclipse.core.runtime.adaptor.EclipseStarter.run(EclipseStarter.java:400)
23:44:19 [2021-04-03T03:44:19.441Z] 	at org.eclipse.core.runtime.adaptor.EclipseStarter.run(EclipseStarter.java:255)
23:44:19 [2021-04-03T03:44:19.441Z] 	at java.base/jdk.internal.reflect.NativeMethodAccessorImpl.invoke0(Native Method)
23:44:19 [2021-04-03T03:44:19.441Z] 	at java.base/jdk.internal.reflect.NativeMethodAccessorImpl.invoke(NativeMethodAccessorImpl.java:64)
23:44:19 [2021-04-03T03:44:19.441Z] 	at java.base/jdk.internal.reflect.DelegatingMethodAccessorImpl.invoke(DelegatingMethodAccessorImpl.java:43)
23:44:19 [2021-04-03T03:44:19.441Z] 	at java.base/java.lang.reflect.Method.invoke(Method.java:564)
23:44:19 [2021-04-03T03:44:19.441Z] 	at org.eclipse.equinox.launcher.Main.invokeFramework(Main.java:659)
23:44:19 [2021-04-03T03:44:19.441Z] 	at org.eclipse.equinox.launcher.Main.basicRun(Main.java:595)
23:44:19 [2021-04-03T03:44:19.441Z] 	at org.eclipse.equinox.launcher.Main.run(Main.java:1501)
23:44:19 [2021-04-03T03:44:19.441Z] 	at org.eclipse.equinox.launcher.Main.main(Main.java:1474)
23:44:19 [2021-04-03T03:44:19.441Z] Caused by: java.lang.ClassNotFoundException: org.junit.runners.model.RunnerBuilder cannot be found by org.eclipse.tycho.surefire.osgibooter_2.2.0
23:44:19 [2021-04-03T03:44:19.441Z] 	at org.eclipse.osgi.internal.loader.BundleLoader.findClassInternal(BundleLoader.java:511)
23:44:19 [2021-04-03T03:44:19.441Z] 	at org.eclipse.osgi.internal.loader.BundleLoader.findClass(BundleLoader.java:422)
23:44:19 [2021-04-03T03:44:19.441Z] 	at org.eclipse.osgi.internal.loader.BundleLoader.findClass(BundleLoader.java:414)
23:44:19 [2021-04-03T03:44:19.441Z] 	at org.eclipse.osgi.internal.loader.ModuleClassLoader.loadClass(ModuleClassLoader.java:153)
23:44:19 [2021-04-03T03:44:19.441Z] 	at java.base/java.lang.ClassLoader.loadClass(ClassLoader.java:522)
23:44:19 [2021-04-03T03:44:19.441Z] 	... 31 more
23:44:19 [2021-04-03T03:44:19.441Z] 
23:44:19 [2021-04-03T03:44:19.441Z] Apr 03, 2021 3:44:19 AM org.junit.platform.launcher.core.DefaultLauncher handleThrowable
23:44:19 [2021-04-03T03:44:19.441Z] WARNING: TestEngine with ID 'junit-vintage' failed to discover tests
23:44:19 [2021-04-03T03:44:19.441Z] java.lang.NoClassDefFoundError: org/junit/runners/model/RunnerBuilder
23:44:19 [2021-04-03T03:44:19.441Z] 	at org.junit.vintage.engine.discovery.VintageDiscoverer.<init>(VintageDiscoverer.java:48)
23:44:19 [2021-04-03T03:44:19.441Z] 	at org.junit.vintage.engine.VintageTestEngine.discover(VintageTestEngine.java:65)
23:44:19 [2021-04-03T03:44:19.441Z] 	at org.junit.platform.launcher.core.DefaultLauncher.discoverEngineRoot(DefaultLauncher.java:130)
23:44:19 [2021-04-03T03:44:19.441Z] 	at org.junit.platform.launcher.core.DefaultLauncher.discoverRoot(DefaultLauncher.java:117)
23:44:19 [2021-04-03T03:44:19.441Z] 	at org.junit.platform.launcher.core.DefaultLauncher.discover(DefaultLauncher.java:82)
23:44:19 [2021-04-03T03:44:19.441Z] 	at org.apache.maven.surefire.junitplatform.TestPlanScannerFilter.accept(TestPlanScannerFilter.java:56)
23:44:19 [2021-04-03T03:44:19.441Z] 	at org.apache.maven.surefire.util.DefaultScanResult.applyFilter(DefaultScanResult.java:102)
23:44:19 [2021-04-03T03:44:19.441Z] 	at org.apache.maven.surefire.junitplatform.JUnitPlatformProvider.scanClasspath(JUnitPlatformProvider.java:143)
23:44:19 [2021-04-03T03:44:19.441Z] 	at org.apache.maven.surefire.junitplatform.JUnitPlatformProvider.invoke(JUnitPlatformProvider.java:124)
23:44:19 [2021-04-03T03:44:19.441Z] 	at java.base/jdk.internal.reflect.NativeMethodAccessorImpl.invoke0(Native Method)
23:44:19 [2021-04-03T03:44:19.441Z] 	at java.base/jdk.internal.reflect.NativeMethodAccessorImpl.invoke(NativeMethodAccessorImpl.java:64)
23:44:19 [2021-04-03T03:44:19.441Z] 	at java.base/jdk.internal.reflect.DelegatingMethodAccessorImpl.invoke(DelegatingMethodAccessorImpl.java:43)
23:44:19 [2021-04-03T03:44:19.441Z] 	at java.base/java.lang.reflect.Method.invoke(Method.java:564)
23:44:19 [2021-04-03T03:44:19.441Z] 	at org.apache.maven.surefire.util.ReflectionUtils.invokeMethodWithArray2(ReflectionUtils.java:206)
23:44:19 [2021-04-03T03:44:19.441Z] 	at org.apache.maven.surefire.booter.ProviderFactory$ProviderProxy.invoke(ProviderFactory.java:161)
23:44:19 [2021-04-03T03:44:19.441Z] 	at org.apache.maven.surefire.booter.ProviderFactory.invokeProvider(ProviderFactory.java:84)
23:44:19 [2021-04-03T03:44:19.441Z] 	at org.eclipse.tycho.surefire.osgibooter.OsgiSurefireBooter.run(OsgiSurefireBooter.java:116)
23:44:19 [2021-04-03T03:44:19.441Z] 	at org.eclipse.tycho.surefire.osgibooter.HeadlessTestApplication.start(HeadlessTestApplication.java:23)
23:44:19 [2021-04-03T03:44:19.441Z] 	at org.eclipse.equinox.internal.app.EclipseAppHandle.run(EclipseAppHandle.java:203)
23:44:19 [2021-04-03T03:44:19.441Z] 	at org.eclipse.core.runtime.internal.adaptor.EclipseAppLauncher.runApplication(EclipseAppLauncher.java:137)
23:44:19 [2021-04-03T03:44:19.441Z] 	at org.eclipse.core.runtime.internal.adaptor.EclipseAppLauncher.start(EclipseAppLauncher.java:107)
23:44:19 [2021-04-03T03:44:19.441Z] 	at org.eclipse.core.runtime.adaptor.EclipseStarter.run(EclipseStarter.java:400)
23:44:19 [2021-04-03T03:44:19.441Z] 	at org.eclipse.core.runtime.adaptor.EclipseStarter.run(EclipseStarter.java:255)
23:44:19 [2021-04-03T03:44:19.441Z] 	at java.base/jdk.internal.reflect.NativeMethodAccessorImpl.invoke0(Native Method)
23:44:19 [2021-04-03T03:44:19.441Z] 	at java.base/jdk.internal.reflect.NativeMethodAccessorImpl.invoke(NativeMethodAccessorImpl.java:64)
23:44:19 [2021-04-03T03:44:19.441Z] 	at java.base/jdk.internal.reflect.DelegatingMethodAccessorImpl.invoke(DelegatingMethodAccessorImpl.java:43)
23:44:19 [2021-04-03T03:44:19.441Z] 	at java.base/java.lang.reflect.Method.invoke(Method.java:564)
23:44:19 [2021-04-03T03:44:19.441Z] 	at org.eclipse.equinox.launcher.Main.invokeFramework(Main.java:659)
23:44:19 [2021-04-03T03:44:19.441Z] 	at org.eclipse.equinox.launcher.Main.basicRun(Main.java:595)
23:44:19 [2021-04-03T03:44:19.441Z] 	at org.eclipse.equinox.launcher.Main.run(Main.java:1501)
23:44:19 [2021-04-03T03:44:19.441Z] 	at org.eclipse.equinox.launcher.Main.main(Main.java:1474)
23:44:19 [2021-04-03T03:44:19.441Z] Caused by: java.lang.ClassNotFoundException: org.junit.runners.model.RunnerBuilder cannot be found by org.eclipse.tycho.surefire.osgibooter_2.2.0
23:44:19 [2021-04-03T03:44:19.441Z] 	at org.eclipse.osgi.internal.loader.BundleLoader.findClassInternal(BundleLoader.java:511)
23:44:19 [2021-04-03T03:44:19.441Z] 	at org.eclipse.osgi.internal.loader.BundleLoader.findClass(BundleLoader.java:422)
23:44:19 [2021-04-03T03:44:19.441Z] 	at org.eclipse.osgi.internal.loader.BundleLoader.findClass(BundleLoader.java:414)
23:44:19 [2021-04-03T03:44:19.441Z] 	at org.eclipse.osgi.internal.loader.ModuleClassLoader.loadClass(ModuleClassLoader.java:153)
23:44:19 [2021-04-03T03:44:19.441Z] 	at java.base/java.lang.ClassLoader.loadClass(ClassLoader.java:522)
23:44:19 [2021-04-03T03:44:19.441Z] 	... 31 more
23:44:19 [2021-04-03T03:44:19.441Z] 
23:44:19 [2021-04-03T03:44:19.442Z] Apr 03, 2021 3:44:19 AM org.junit.platform.launcher.core.DefaultLauncher handleThrowable
23:44:19 [2021-04-03T03:44:19.442Z] WARNING: TestEngine with ID 'junit-vintage' failed to discover tests
23:44:19 [2021-04-03T03:44:19.442Z] java.lang.NoClassDefFoundError: org/junit/runners/model/RunnerBuilder
23:44:19 [2021-04-03T03:44:19.442Z] 	at org.junit.vintage.engine.discovery.VintageDiscoverer.<init>(VintageDiscoverer.java:48)
23:44:19 [2021-04-03T03:44:19.442Z] 	at org.junit.vintage.engine.VintageTestEngine.discover(VintageTestEngine.java:65)
23:44:19 [2021-04-03T03:44:19.442Z] 	at org.junit.platform.launcher.core.DefaultLauncher.discoverEngineRoot(DefaultLauncher.java:130)
23:44:19 [2021-04-03T03:44:19.442Z] 	at org.junit.platform.launcher.core.DefaultLauncher.discoverRoot(DefaultLauncher.java:117)
23:44:19 [2021-04-03T03:44:19.442Z] 	at org.junit.platform.launcher.core.DefaultLauncher.discover(DefaultLauncher.java:82)
23:44:19 [2021-04-03T03:44:19.442Z] 	at org.apache.maven.surefire.junitplatform.TestPlanScannerFilter.accept(TestPlanScannerFilter.java:56)
23:44:19 [2021-04-03T03:44:19.442Z] 	at org.apache.maven.surefire.util.DefaultScanResult.applyFilter(DefaultScanResult.java:102)
23:44:19 [2021-04-03T03:44:19.442Z] 	at org.apache.maven.surefire.junitplatform.JUnitPlatformProvider.scanClasspath(JUnitPlatformProvider.java:143)
23:44:19 [2021-04-03T03:44:19.442Z] 	at org.apache.maven.surefire.junitplatform.JUnitPlatformProvider.invoke(JUnitPlatformProvider.java:124)
23:44:19 [2021-04-03T03:44:19.442Z] 	at java.base/jdk.internal.reflect.NativeMethodAccessorImpl.invoke0(Native Method)
23:44:19 [2021-04-03T03:44:19.442Z] 	at java.base/jdk.internal.reflect.NativeMethodAccessorImpl.invoke(NativeMethodAccessorImpl.java:64)
23:44:19 [2021-04-03T03:44:19.442Z] 	at java.base/jdk.internal.reflect.DelegatingMethodAccessorImpl.invoke(DelegatingMethodAccessorImpl.java:43)
23:44:19 [2021-04-03T03:44:19.442Z] 	at java.base/java.lang.reflect.Method.invoke(Method.java:564)
23:44:19 [2021-04-03T03:44:19.442Z] 	at org.apache.maven.surefire.util.ReflectionUtils.invokeMethodWithArray2(ReflectionUtils.java:206)
23:44:19 [2021-04-03T03:44:19.442Z] 	at org.apache.maven.surefire.booter.ProviderFactory$ProviderProxy.invoke(ProviderFactory.java:161)
23:44:19 [2021-04-03T03:44:19.442Z] 	at org.apache.maven.surefire.booter.ProviderFactory.invokeProvider(ProviderFactory.java:84)
23:44:19 [2021-04-03T03:44:19.442Z] 	at org.eclipse.tycho.surefire.osgibooter.OsgiSurefireBooter.run(OsgiSurefireBooter.java:116)
23:44:19 [2021-04-03T03:44:19.442Z] 	at org.eclipse.tycho.surefire.osgibooter.HeadlessTestApplication.start(HeadlessTestApplication.java:23)
23:44:19 [2021-04-03T03:44:19.442Z] 	at org.eclipse.equinox.internal.app.EclipseAppHandle.run(EclipseAppHandle.java:203)
23:44:19 [2021-04-03T03:44:19.442Z] 	at org.eclipse.core.runtime.internal.adaptor.EclipseAppLauncher.runApplication(EclipseAppLauncher.java:137)
23:44:19 [2021-04-03T03:44:19.442Z] 	at org.eclipse.core.runtime.internal.adaptor.EclipseAppLauncher.start(EclipseAppLauncher.java:107)
23:44:19 [2021-04-03T03:44:19.442Z] 	at org.eclipse.core.runtime.adaptor.EclipseStarter.run(EclipseStarter.java:400)
23:44:19 [2021-04-03T03:44:19.442Z] 	at org.eclipse.core.runtime.adaptor.EclipseStarter.run(EclipseStarter.java:255)
23:44:19 [2021-04-03T03:44:19.442Z] 	at java.base/jdk.internal.reflect.NativeMethodAccessorImpl.invoke0(Native Method)
23:44:19 [2021-04-03T03:44:19.442Z] 	at java.base/jdk.internal.reflect.NativeMethodAccessorImpl.invoke(NativeMethodAccessorImpl.java:64)
23:44:19 [2021-04-03T03:44:19.442Z] 	at java.base/jdk.internal.reflect.DelegatingMethodAccessorImpl.invoke(DelegatingMethodAccessorImpl.java:43)
23:44:19 [2021-04-03T03:44:19.442Z] 	at java.base/java.lang.reflect.Method.invoke(Method.java:564)
23:44:19 [2021-04-03T03:44:19.442Z] 	at org.eclipse.equinox.launcher.Main.invokeFramework(Main.java:659)
23:44:19 [2021-04-03T03:44:19.442Z] 	at org.eclipse.equinox.launcher.Main.basicRun(Main.java:595)
23:44:19 [2021-04-03T03:44:19.442Z] 	at org.eclipse.equinox.launcher.Main.run(Main.java:1501)
23:44:19 [2021-04-03T03:44:19.442Z] 	at org.eclipse.equinox.launcher.Main.main(Main.java:1474)
23:44:19 [2021-04-03T03:44:19.442Z] Caused by: java.lang.ClassNotFoundException: org.junit.runners.model.RunnerBuilder cannot be found by org.eclipse.tycho.surefire.osgibooter_2.2.0
23:44:19 [2021-04-03T03:44:19.442Z] 	at org.eclipse.osgi.internal.loader.BundleLoader.findClassInternal(BundleLoader.java:511)
23:44:19 [2021-04-03T03:44:19.442Z] 	at org.eclipse.osgi.internal.loader.BundleLoader.findClass(BundleLoader.java:422)
23:44:19 [2021-04-03T03:44:19.442Z] 	at org.eclipse.osgi.internal.loader.BundleLoader.findClass(BundleLoader.java:414)
23:44:19 [2021-04-03T03:44:19.442Z] 	at org.eclipse.osgi.internal.loader.ModuleClassLoader.loadClass(ModuleClassLoader.java:153)
23:44:19 [2021-04-03T03:44:19.442Z] 	at java.base/java.lang.ClassLoader.loadClass(ClassLoader.java:522)
23:44:19 [2021-04-03T03:44:19.442Z] 	... 31 more
23:44:19 [2021-04-03T03:44:19.442Z] 
23:44:19 [2021-04-03T03:44:19.442Z] Apr 03, 2021 3:44:19 AM org.junit.platform.launcher.core.DefaultLauncher handleThrowable
23:44:19 [2021-04-03T03:44:19.442Z] WARNING: TestEngine with ID 'junit-vintage' failed to discover tests
23:44:19 [2021-04-03T03:44:19.442Z] java.lang.NoClassDefFoundError: org/junit/runners/model/RunnerBuilder
23:44:19 [2021-04-03T03:44:19.442Z] 	at org.junit.vintage.engine.discovery.VintageDiscoverer.<init>(VintageDiscoverer.java:48)
23:44:19 [2021-04-03T03:44:19.442Z] 	at org.junit.vintage.engine.VintageTestEngine.discover(VintageTestEngine.java:65)
23:44:19 [2021-04-03T03:44:19.442Z] 	at org.junit.platform.launcher.core.DefaultLauncher.discoverEngineRoot(DefaultLauncher.java:130)
23:44:19 [2021-04-03T03:44:19.442Z] 	at org.junit.platform.launcher.core.DefaultLauncher.discoverRoot(DefaultLauncher.java:117)
23:44:19 [2021-04-03T03:44:19.442Z] 	at org.junit.platform.launcher.core.DefaultLauncher.discover(DefaultLauncher.java:82)
23:44:19 [2021-04-03T03:44:19.442Z] 	at org.apache.maven.surefire.junitplatform.TestPlanScannerFilter.accept(TestPlanScannerFilter.java:56)
23:44:19 [2021-04-03T03:44:19.442Z] 	at org.apache.maven.surefire.util.DefaultScanResult.applyFilter(DefaultScanResult.java:102)
23:44:19 [2021-04-03T03:44:19.442Z] 	at org.apache.maven.surefire.junitplatform.JUnitPlatformProvider.scanClasspath(JUnitPlatformProvider.java:143)
23:44:19 [2021-04-03T03:44:19.442Z] 	at org.apache.maven.surefire.junitplatform.JUnitPlatformProvider.invoke(JUnitPlatformProvider.java:124)
23:44:19 [2021-04-03T03:44:19.442Z] 	at java.base/jdk.internal.reflect.NativeMethodAccessorImpl.invoke0(Native Method)
23:44:19 [2021-04-03T03:44:19.442Z] 	at java.base/jdk.internal.reflect.NativeMethodAccessorImpl.invoke(NativeMethodAccessorImpl.java:64)
23:44:19 [2021-04-03T03:44:19.442Z] 	at java.base/jdk.internal.reflect.DelegatingMethodAccessorImpl.invoke(DelegatingMethodAccessorImpl.java:43)
23:44:19 [2021-04-03T03:44:19.442Z] 	at java.base/java.lang.reflect.Method.invoke(Method.java:564)
23:44:19 [2021-04-03T03:44:19.442Z] 	at org.apache.maven.surefire.util.ReflectionUtils.invokeMethodWithArray2(ReflectionUtils.java:206)
23:44:19 [2021-04-03T03:44:19.442Z] 	at org.apache.maven.surefire.booter.ProviderFactory$ProviderProxy.invoke(ProviderFactory.java:161)
23:44:19 [2021-04-03T03:44:19.442Z] 	at org.apache.maven.surefire.booter.ProviderFactory.invokeProvider(ProviderFactory.java:84)
23:44:19 [2021-04-03T03:44:19.442Z] 	at org.eclipse.tycho.surefire.osgibooter.OsgiSurefireBooter.run(OsgiSurefireBooter.java:116)
23:44:19 [2021-04-03T03:44:19.442Z] 	at org.eclipse.tycho.surefire.osgibooter.HeadlessTestApplication.start(HeadlessTestApplication.java:23)
23:44:19 [2021-04-03T03:44:19.442Z] 	at org.eclipse.equinox.internal.app.EclipseAppHandle.run(EclipseAppHandle.java:203)
23:44:19 [2021-04-03T03:44:19.442Z] 	at org.eclipse.core.runtime.internal.adaptor.EclipseAppLauncher.runApplication(EclipseAppLauncher.java:137)
23:44:19 [2021-04-03T03:44:19.442Z] 	at org.eclipse.core.runtime.internal.adaptor.EclipseAppLauncher.start(EclipseAppLauncher.java:107)
23:44:19 [2021-04-03T03:44:19.442Z] 	at org.eclipse.core.runtime.adaptor.EclipseStarter.run(EclipseStarter.java:400)
23:44:19 [2021-04-03T03:44:19.442Z] 	at org.eclipse.core.runtime.adaptor.EclipseStarter.run(EclipseStarter.java:255)
23:44:19 [2021-04-03T03:44:19.442Z] 	at java.base/jdk.internal.reflect.NativeMethodAccessorImpl.invoke0(Native Method)
23:44:19 [2021-04-03T03:44:19.442Z] 	at java.base/jdk.internal.reflect.NativeMethodAccessorImpl.invoke(NativeMethodAccessorImpl.java:64)
23:44:19 [2021-04-03T03:44:19.442Z] 	at java.base/jdk.internal.reflect.DelegatingMethodAccessorImpl.invoke(DelegatingMethodAccessorImpl.java:43)
23:44:19 [2021-04-03T03:44:19.442Z] 	at java.base/java.lang.reflect.Method.invoke(Method.java:564)
23:44:19 [2021-04-03T03:44:19.442Z] 	at org.eclipse.equinox.launcher.Main.invokeFramework(Main.java:659)
23:44:19 [2021-04-03T03:44:19.442Z] 	at org.eclipse.equinox.launcher.Main.basicRun(Main.java:595)
23:44:19 [2021-04-03T03:44:19.442Z] 	at org.eclipse.equinox.launcher.Main.run(Main.java:1501)
23:44:19 [2021-04-03T03:44:19.442Z] 	at org.eclipse.equinox.launcher.Main.main(Main.java:1474)
23:44:19 [2021-04-03T03:44:19.442Z] Caused by: java.lang.ClassNotFoundException: org.junit.runners.model.RunnerBuilder cannot be found by org.eclipse.tycho.surefire.osgibooter_2.2.0
23:44:19 [2021-04-03T03:44:19.442Z] 	at org.eclipse.osgi.internal.loader.BundleLoader.findClassInternal(BundleLoader.java:511)
23:44:19 [2021-04-03T03:44:19.442Z] 	at org.eclipse.osgi.internal.loader.BundleLoader.findClass(BundleLoader.java:422)
23:44:19 [2021-04-03T03:44:19.443Z] 	at org.eclipse.osgi.internal.loader.BundleLoader.findClass(BundleLoader.java:414)
23:44:19 [2021-04-03T03:44:19.443Z] 	at org.eclipse.osgi.internal.loader.ModuleClassLoader.loadClass(ModuleClassLoader.java:153)
23:44:19 [2021-04-03T03:44:19.443Z] 	at java.base/java.lang.ClassLoader.loadClass(ClassLoader.java:522)
23:44:19 [2021-04-03T03:44:19.443Z] 	... 31 more
23:44:19 [2021-04-03T03:44:19.443Z] 
23:44:19 [2021-04-03T03:44:19.443Z] Apr 03, 2021 3:44:19 AM org.junit.platform.launcher.core.DefaultLauncher handleThrowable
23:44:19 [2021-04-03T03:44:19.443Z] WARNING: TestEngine with ID 'junit-vintage' failed to discover tests
23:44:19 [2021-04-03T03:44:19.443Z] java.lang.NoClassDefFoundError: org/junit/runners/model/RunnerBuilder
23:44:19 [2021-04-03T03:44:19.443Z] 	at org.junit.vintage.engine.discovery.VintageDiscoverer.<init>(VintageDiscoverer.java:48)
23:44:19 [2021-04-03T03:44:19.443Z] 	at org.junit.vintage.engine.VintageTestEngine.discover(VintageTestEngine.java:65)
23:44:19 [2021-04-03T03:44:19.443Z] 	at org.junit.platform.launcher.core.DefaultLauncher.discoverEngineRoot(DefaultLauncher.java:130)
23:44:19 [2021-04-03T03:44:19.443Z] 	at org.junit.platform.launcher.core.DefaultLauncher.discoverRoot(DefaultLauncher.java:117)
23:44:19 [2021-04-03T03:44:19.443Z] 	at org.junit.platform.launcher.core.DefaultLauncher.discover(DefaultLauncher.java:82)
23:44:19 [2021-04-03T03:44:19.443Z] 	at org.apache.maven.surefire.junitplatform.TestPlanScannerFilter.accept(TestPlanScannerFilter.java:56)
23:44:19 [2021-04-03T03:44:19.443Z] 	at org.apache.maven.surefire.util.DefaultScanResult.applyFilter(DefaultScanResult.java:102)
23:44:19 [2021-04-03T03:44:19.443Z] 	at org.apache.maven.surefire.junitplatform.JUnitPlatformProvider.scanClasspath(JUnitPlatformProvider.java:143)
23:44:19 [2021-04-03T03:44:19.443Z] 	at org.apache.maven.surefire.junitplatform.JUnitPlatformProvider.invoke(JUnitPlatformProvider.java:124)
23:44:19 [2021-04-03T03:44:19.443Z] 	at java.base/jdk.internal.reflect.NativeMethodAccessorImpl.invoke0(Native Method)
23:44:19 [2021-04-03T03:44:19.443Z] 	at java.base/jdk.internal.reflect.NativeMethodAccessorImpl.invoke(NativeMethodAccessorImpl.java:64)
23:44:19 [2021-04-03T03:44:19.443Z] 	at java.base/jdk.internal.reflect.DelegatingMethodAccessorImpl.invoke(DelegatingMethodAccessorImpl.java:43)
23:44:19 [2021-04-03T03:44:19.443Z] 	at java.base/java.lang.reflect.Method.invoke(Method.java:564)
23:44:19 [2021-04-03T03:44:19.443Z] 	at org.apache.maven.surefire.util.ReflectionUtils.invokeMethodWithArray2(ReflectionUtils.java:206)
23:44:19 [2021-04-03T03:44:19.443Z] 	at org.apache.maven.surefire.booter.ProviderFactory$ProviderProxy.invoke(ProviderFactory.java:161)
23:44:19 [2021-04-03T03:44:19.443Z] 	at org.apache.maven.surefire.booter.ProviderFactory.invokeProvider(ProviderFactory.java:84)
23:44:19 [2021-04-03T03:44:19.443Z] 	at org.eclipse.tycho.surefire.osgibooter.OsgiSurefireBooter.run(OsgiSurefireBooter.java:116)
23:44:19 [2021-04-03T03:44:19.443Z] 	at org.eclipse.tycho.surefire.osgibooter.HeadlessTestApplication.start(HeadlessTestApplication.java:23)
23:44:19 [2021-04-03T03:44:19.443Z] 	at org.eclipse.equinox.internal.app.EclipseAppHandle.run(EclipseAppHandle.java:203)
23:44:19 [2021-04-03T03:44:19.443Z] 	at org.eclipse.core.runtime.internal.adaptor.EclipseAppLauncher.runApplication(EclipseAppLauncher.java:137)
23:44:19 [2021-04-03T03:44:19.443Z] 	at org.eclipse.core.runtime.internal.adaptor.EclipseAppLauncher.start(EclipseAppLauncher.java:107)
23:44:19 [2021-04-03T03:44:19.443Z] 	at org.eclipse.core.runtime.adaptor.EclipseStarter.run(EclipseStarter.java:400)
23:44:19 [2021-04-03T03:44:19.443Z] 	at org.eclipse.core.runtime.adaptor.EclipseStarter.run(EclipseStarter.java:255)
23:44:19 [2021-04-03T03:44:19.443Z] 	at java.base/jdk.internal.reflect.NativeMethodAccessorImpl.invoke0(Native Method)
23:44:19 [2021-04-03T03:44:19.443Z] 	at java.base/jdk.internal.reflect.NativeMethodAccessorImpl.invoke(NativeMethodAccessorImpl.java:64)
23:44:19 [2021-04-03T03:44:19.443Z] 	at java.base/jdk.internal.reflect.DelegatingMethodAccessorImpl.invoke(DelegatingMethodAccessorImpl.java:43)
23:44:19 [2021-04-03T03:44:19.443Z] 	at java.base/java.lang.reflect.Method.invoke(Method.java:564)
23:44:19 [2021-04-03T03:44:19.443Z] 	at org.eclipse.equinox.launcher.Main.invokeFramework(Main.java:659)
23:44:19 [2021-04-03T03:44:19.443Z] 	at org.eclipse.equinox.launcher.Main.basicRun(Main.java:595)
23:44:19 [2021-04-03T03:44:19.443Z] 	at org.eclipse.equinox.launcher.Main.run(Main.java:1501)
23:44:19 [2021-04-03T03:44:19.443Z] 	at org.eclipse.equinox.launcher.Main.main(Main.java:1474)
23:44:19 [2021-04-03T03:44:19.443Z] Caused by: java.lang.ClassNotFoundException: org.junit.runners.model.RunnerBuilder cannot be found by org.eclipse.tycho.surefire.osgibooter_2.2.0
23:44:19 [2021-04-03T03:44:19.443Z] 	at org.eclipse.osgi.internal.loader.BundleLoader.findClassInternal(BundleLoader.java:511)
23:44:19 [2021-04-03T03:44:19.443Z] 	at org.eclipse.osgi.internal.loader.BundleLoader.findClass(BundleLoader.java:422)
23:44:19 [2021-04-03T03:44:19.443Z] 	at org.eclipse.osgi.internal.loader.BundleLoader.findClass(BundleLoader.java:414)
23:44:19 [2021-04-03T03:44:19.443Z] 	at org.eclipse.osgi.internal.loader.ModuleClassLoader.loadClass(ModuleClassLoader.java:153)
23:44:19 [2021-04-03T03:44:19.443Z] 	at java.base/java.lang.ClassLoader.loadClass(ClassLoader.java:522)
23:44:19 [2021-04-03T03:44:19.443Z] 	... 31 more
23:44:19 [2021-04-03T03:44:19.443Z] 
23:44:19 [2021-04-03T03:44:19.443Z] Apr 03, 2021 3:44:19 AM org.junit.platform.launcher.core.DefaultLauncher handleThrowable
23:44:19 [2021-04-03T03:44:19.443Z] WARNING: TestEngine with ID 'junit-vintage' failed to discover tests
23:44:19 [2021-04-03T03:44:19.443Z] java.lang.NoClassDefFoundError: org/junit/runners/model/RunnerBuilder
23:44:19 [2021-04-03T03:44:19.443Z] 	at org.junit.vintage.engine.discovery.VintageDiscoverer.<init>(VintageDiscoverer.java:48)
23:44:19 [2021-04-03T03:44:19.443Z] 	at org.junit.vintage.engine.VintageTestEngine.discover(VintageTestEngine.java:65)
23:44:19 [2021-04-03T03:44:19.443Z] 	at org.junit.platform.launcher.core.DefaultLauncher.discoverEngineRoot(DefaultLauncher.java:130)
23:44:19 [2021-04-03T03:44:19.443Z] 	at org.junit.platform.launcher.core.DefaultLauncher.discoverRoot(DefaultLauncher.java:117)
23:44:19 [2021-04-03T03:44:19.443Z] 	at org.junit.platform.launcher.core.DefaultLauncher.discover(DefaultLauncher.java:82)
23:44:19 [2021-04-03T03:44:19.443Z] 	at org.apache.maven.surefire.junitplatform.TestPlanScannerFilter.accept(TestPlanScannerFilter.java:56)
23:44:19 [2021-04-03T03:44:19.443Z] 	at org.apache.maven.surefire.util.DefaultScanResult.applyFilter(DefaultScanResult.java:102)
23:44:19 [2021-04-03T03:44:19.443Z] 	at org.apache.maven.surefire.junitplatform.JUnitPlatformProvider.scanClasspath(JUnitPlatformProvider.java:143)
23:44:19 [2021-04-03T03:44:19.443Z] 	at org.apache.maven.surefire.junitplatform.JUnitPlatformProvider.invoke(JUnitPlatformProvider.java:124)
23:44:19 [2021-04-03T03:44:19.443Z] 	at java.base/jdk.internal.reflect.NativeMethodAccessorImpl.invoke0(Native Method)
23:44:19 [2021-04-03T03:44:19.443Z] 	at java.base/jdk.internal.reflect.NativeMethodAccessorImpl.invoke(NativeMethodAccessorImpl.java:64)
23:44:19 [2021-04-03T03:44:19.443Z] 	at java.base/jdk.internal.reflect.DelegatingMethodAccessorImpl.invoke(DelegatingMethodAccessorImpl.java:43)
23:44:19 [2021-04-03T03:44:19.443Z] 	at java.base/java.lang.reflect.Method.invoke(Method.java:564)
23:44:19 [2021-04-03T03:44:19.443Z] 	at org.apache.maven.surefire.util.ReflectionUtils.invokeMethodWithArray2(ReflectionUtils.java:206)
23:44:19 [2021-04-03T03:44:19.443Z] 	at org.apache.maven.surefire.booter.ProviderFactory$ProviderProxy.invoke(ProviderFactory.java:161)
23:44:19 [2021-04-03T03:44:19.443Z] 	at org.apache.maven.surefire.booter.ProviderFactory.invokeProvider(ProviderFactory.java:84)
23:44:19 [2021-04-03T03:44:19.443Z] 	at org.eclipse.tycho.surefire.osgibooter.OsgiSurefireBooter.run(OsgiSurefireBooter.java:116)
23:44:19 [2021-04-03T03:44:19.443Z] 	at org.eclipse.tycho.surefire.osgibooter.HeadlessTestApplication.start(HeadlessTestApplication.java:23)
23:44:19 [2021-04-03T03:44:19.443Z] 	at org.eclipse.equinox.internal.app.EclipseAppHandle.run(EclipseAppHandle.java:203)
23:44:19 [2021-04-03T03:44:19.443Z] 	at org.eclipse.core.runtime.internal.adaptor.EclipseAppLauncher.runApplication(EclipseAppLauncher.java:137)
23:44:19 [2021-04-03T03:44:19.443Z] 	at org.eclipse.core.runtime.internal.adaptor.EclipseAppLauncher.start(EclipseAppLauncher.java:107)
23:44:19 [2021-04-03T03:44:19.443Z] 	at org.eclipse.core.runtime.adaptor.EclipseStarter.run(EclipseStarter.java:400)
23:44:19 [2021-04-03T03:44:19.443Z] 	at org.eclipse.core.runtime.adaptor.EclipseStarter.run(EclipseStarter.java:255)
23:44:19 [2021-04-03T03:44:19.443Z] 	at java.base/jdk.internal.reflect.NativeMethodAccessorImpl.invoke0(Native Method)
23:44:19 [2021-04-03T03:44:19.443Z] 	at java.base/jdk.internal.reflect.NativeMethodAccessorImpl.invoke(NativeMethodAccessorImpl.java:64)
23:44:19 [2021-04-03T03:44:19.443Z] 	at java.base/jdk.internal.reflect.DelegatingMethodAccessorImpl.invoke(DelegatingMethodAccessorImpl.java:43)
23:44:19 [2021-04-03T03:44:19.443Z] 	at java.base/java.lang.reflect.Method.invoke(Method.java:564)
23:44:19 [2021-04-03T03:44:19.443Z] 	at org.eclipse.equinox.launcher.Main.invokeFramework(Main.java:659)
23:44:19 [2021-04-03T03:44:19.443Z] 	at org.eclipse.equinox.launcher.Main.basicRun(Main.java:595)
23:44:19 [2021-04-03T03:44:19.443Z] 	at org.eclipse.equinox.launcher.Main.run(Main.java:1501)
23:44:19 [2021-04-03T03:44:19.443Z] 	at org.eclipse.equinox.launcher.Main.main(Main.java:1474)
23:44:19 [2021-04-03T03:44:19.444Z] Caused by: java.lang.ClassNotFoundException: org.junit.runners.model.RunnerBuilder cannot be found by org.eclipse.tycho.surefire.osgibooter_2.2.0
23:44:19 [2021-04-03T03:44:19.444Z] 	at org.eclipse.osgi.internal.loader.BundleLoader.findClassInternal(BundleLoader.java:511)
23:44:19 [2021-04-03T03:44:19.444Z] 	at org.eclipse.osgi.internal.loader.BundleLoader.findClass(BundleLoader.java:422)
23:44:19 [2021-04-03T03:44:19.444Z] 	at org.eclipse.osgi.internal.loader.BundleLoader.findClass(BundleLoader.java:414)
23:44:19 [2021-04-03T03:44:19.444Z] 	at org.eclipse.osgi.internal.loader.ModuleClassLoader.loadClass(ModuleClassLoader.java:153)
23:44:19 [2021-04-03T03:44:19.444Z] 	at java.base/java.lang.ClassLoader.loadClass(ClassLoader.java:522)
23:44:19 [2021-04-03T03:44:19.444Z] 	... 31 more
23:44:19 [2021-04-03T03:44:19.444Z] 
23:44:19 [2021-04-03T03:44:19.444Z] Apr 03, 2021 3:44:19 AM org.junit.platform.launcher.core.DefaultLauncher handleThrowable
23:44:19 [2021-04-03T03:44:19.444Z] WARNING: TestEngine with ID 'junit-vintage' failed to discover tests
23:44:19 [2021-04-03T03:44:19.444Z] java.lang.NoClassDefFoundError: org/junit/runners/model/RunnerBuilder
23:44:19 [2021-04-03T03:44:19.444Z] 	at org.junit.vintage.engine.discovery.VintageDiscoverer.<init>(VintageDiscoverer.java:48)
23:44:19 [2021-04-03T03:44:19.444Z] 	at org.junit.vintage.engine.VintageTestEngine.discover(VintageTestEngine.java:65)
23:44:19 [2021-04-03T03:44:19.444Z] 	at org.junit.platform.launcher.core.DefaultLauncher.discoverEngineRoot(DefaultLauncher.java:130)
23:44:19 [2021-04-03T03:44:19.444Z] 	at org.junit.platform.launcher.core.DefaultLauncher.discoverRoot(DefaultLauncher.java:117)
23:44:19 [2021-04-03T03:44:19.444Z] 	at org.junit.platform.launcher.core.DefaultLauncher.discover(DefaultLauncher.java:82)
23:44:19 [2021-04-03T03:44:19.444Z] 	at org.apache.maven.surefire.junitplatform.TestPlanScannerFilter.accept(TestPlanScannerFilter.java:56)
23:44:19 [2021-04-03T03:44:19.444Z] 	at org.apache.maven.surefire.util.DefaultScanResult.applyFilter(DefaultScanResult.java:102)
23:44:19 [2021-04-03T03:44:19.444Z] 	at org.apache.maven.surefire.junitplatform.JUnitPlatformProvider.scanClasspath(JUnitPlatformProvider.java:143)
23:44:19 [2021-04-03T03:44:19.444Z] 	at org.apache.maven.surefire.junitplatform.JUnitPlatformProvider.invoke(JUnitPlatformProvider.java:124)
23:44:19 [2021-04-03T03:44:19.444Z] 	at java.base/jdk.internal.reflect.NativeMethodAccessorImpl.invoke0(Native Method)
23:44:19 [2021-04-03T03:44:19.444Z] 	at java.base/jdk.internal.reflect.NativeMethodAccessorImpl.invoke(NativeMethodAccessorImpl.java:64)
23:44:19 [2021-04-03T03:44:19.444Z] 	at java.base/jdk.internal.reflect.DelegatingMethodAccessorImpl.invoke(DelegatingMethodAccessorImpl.java:43)
23:44:19 [2021-04-03T03:44:19.444Z] 	at java.base/java.lang.reflect.Method.invoke(Method.java:564)
23:44:19 [2021-04-03T03:44:19.444Z] 	at org.apache.maven.surefire.util.ReflectionUtils.invokeMethodWithArray2(ReflectionUtils.java:206)
23:44:19 [2021-04-03T03:44:19.444Z] 	at org.apache.maven.surefire.booter.ProviderFactory$ProviderProxy.invoke(ProviderFactory.java:161)
23:44:19 [2021-04-03T03:44:19.444Z] 	at org.apache.maven.surefire.booter.ProviderFactory.invokeProvider(ProviderFactory.java:84)
23:44:19 [2021-04-03T03:44:19.444Z] 	at org.eclipse.tycho.surefire.osgibooter.OsgiSurefireBooter.run(OsgiSurefireBooter.java:116)
23:44:19 [2021-04-03T03:44:19.444Z] 	at org.eclipse.tycho.surefire.osgibooter.HeadlessTestApplication.start(HeadlessTestApplication.java:23)
23:44:19 [2021-04-03T03:44:19.444Z] 	at org.eclipse.equinox.internal.app.EclipseAppHandle.run(EclipseAppHandle.java:203)
23:44:19 [2021-04-03T03:44:19.444Z] 	at org.eclipse.core.runtime.internal.adaptor.EclipseAppLauncher.runApplication(EclipseAppLauncher.java:137)
23:44:19 [2021-04-03T03:44:19.444Z] 	at org.eclipse.core.runtime.internal.adaptor.EclipseAppLauncher.start(EclipseAppLauncher.java:107)
23:44:19 [2021-04-03T03:44:19.444Z] 	at org.eclipse.core.runtime.adaptor.EclipseStarter.run(EclipseStarter.java:400)
23:44:19 [2021-04-03T03:44:19.444Z] 	at org.eclipse.core.runtime.adaptor.EclipseStarter.run(EclipseStarter.java:255)
23:44:19 [2021-04-03T03:44:19.444Z] 	at java.base/jdk.internal.reflect.NativeMethodAccessorImpl.invoke0(Native Method)
23:44:19 [2021-04-03T03:44:19.444Z] 	at java.base/jdk.internal.reflect.NativeMethodAccessorImpl.invoke(NativeMethodAccessorImpl.java:64)
23:44:19 [2021-04-03T03:44:19.444Z] 	at java.base/jdk.internal.reflect.DelegatingMethodAccessorImpl.invoke(DelegatingMethodAccessorImpl.java:43)
23:44:19 [2021-04-03T03:44:19.444Z] 	at java.base/java.lang.reflect.Method.invoke(Method.java:564)
23:44:19 [2021-04-03T03:44:19.444Z] 	at org.eclipse.equinox.launcher.Main.invokeFramework(Main.java:659)
23:44:19 [2021-04-03T03:44:19.444Z] 	at org.eclipse.equinox.launcher.Main.basicRun(Main.java:595)
23:44:19 [2021-04-03T03:44:19.444Z] 	at org.eclipse.equinox.launcher.Main.run(Main.java:1501)
23:44:19 [2021-04-03T03:44:19.444Z] 	at org.eclipse.equinox.launcher.Main.main(Main.java:1474)
23:44:19 [2021-04-03T03:44:19.444Z] Caused by: java.lang.ClassNotFoundException: org.junit.runners.model.RunnerBuilder cannot be found by org.eclipse.tycho.surefire.osgibooter_2.2.0
23:44:19 [2021-04-03T03:44:19.444Z] 	at org.eclipse.osgi.internal.loader.BundleLoader.findClassInternal(BundleLoader.java:511)
23:44:19 [2021-04-03T03:44:19.444Z] 	at org.eclipse.osgi.internal.loader.BundleLoader.findClass(BundleLoader.java:422)
23:44:19 [2021-04-03T03:44:19.444Z] 	at org.eclipse.osgi.internal.loader.BundleLoader.findClass(BundleLoader.java:414)
23:44:19 [2021-04-03T03:44:19.444Z] 	at org.eclipse.osgi.internal.loader.ModuleClassLoader.loadClass(ModuleClassLoader.java:153)
23:44:19 [2021-04-03T03:44:19.444Z] 	at java.base/java.lang.ClassLoader.loadClass(ClassLoader.java:522)
23:44:19 [2021-04-03T03:44:19.444Z] 	... 31 more
23:44:19 [2021-04-03T03:44:19.444Z] 
23:44:19 [2021-04-03T03:44:19.444Z] Apr 03, 2021 3:44:19 AM org.junit.platform.launcher.core.DefaultLauncher handleThrowable
23:44:19 [2021-04-03T03:44:19.444Z] WARNING: TestEngine with ID 'junit-vintage' failed to discover tests
23:44:19 [2021-04-03T03:44:19.444Z] java.lang.NoClassDefFoundError: org/junit/runners/model/RunnerBuilder
23:44:19 [2021-04-03T03:44:19.444Z] 	at org.junit.vintage.engine.discovery.VintageDiscoverer.<init>(VintageDiscoverer.java:48)
23:44:19 [2021-04-03T03:44:19.444Z] 	at org.junit.vintage.engine.VintageTestEngine.discover(VintageTestEngine.java:65)
23:44:19 [2021-04-03T03:44:19.444Z] 	at org.junit.platform.launcher.core.DefaultLauncher.discoverEngineRoot(DefaultLauncher.java:130)
23:44:19 [2021-04-03T03:44:19.444Z] 	at org.junit.platform.launcher.core.DefaultLauncher.discoverRoot(DefaultLauncher.java:117)
23:44:19 [2021-04-03T03:44:19.444Z] 	at org.junit.platform.launcher.core.DefaultLauncher.discover(DefaultLauncher.java:82)
23:44:19 [2021-04-03T03:44:19.444Z] 	at org.apache.maven.surefire.junitplatform.TestPlanScannerFilter.accept(TestPlanScannerFilter.java:56)
23:44:19 [2021-04-03T03:44:19.444Z] 	at org.apache.maven.surefire.util.DefaultScanResult.applyFilter(DefaultScanResult.java:102)
23:44:19 [2021-04-03T03:44:19.444Z] 	at org.apache.maven.surefire.junitplatform.JUnitPlatformProvider.scanClasspath(JUnitPlatformProvider.java:143)
23:44:19 [2021-04-03T03:44:19.444Z] 	at org.apache.maven.surefire.junitplatform.JUnitPlatformProvider.invoke(JUnitPlatformProvider.java:124)
23:44:19 [2021-04-03T03:44:19.444Z] 	at java.base/jdk.internal.reflect.NativeMethodAccessorImpl.invoke0(Native Method)
23:44:19 [2021-04-03T03:44:19.444Z] 	at java.base/jdk.internal.reflect.NativeMethodAccessorImpl.invoke(NativeMethodAccessorImpl.java:64)
23:44:19 [2021-04-03T03:44:19.444Z] 	at java.base/jdk.internal.reflect.DelegatingMethodAccessorImpl.invoke(DelegatingMethodAccessorImpl.java:43)
23:44:19 [2021-04-03T03:44:19.444Z] 	at java.base/java.lang.reflect.Method.invoke(Method.java:564)
23:44:19 [2021-04-03T03:44:19.444Z] 	at org.apache.maven.surefire.util.ReflectionUtils.invokeMethodWithArray2(ReflectionUtils.java:206)
23:44:19 [2021-04-03T03:44:19.444Z] 	at org.apache.maven.surefire.booter.ProviderFactory$ProviderProxy.invoke(ProviderFactory.java:161)
23:44:19 [2021-04-03T03:44:19.444Z] 	at org.apache.maven.surefire.booter.ProviderFactory.invokeProvider(ProviderFactory.java:84)
23:44:19 [2021-04-03T03:44:19.444Z] 	at org.eclipse.tycho.surefire.osgibooter.OsgiSurefireBooter.run(OsgiSurefireBooter.java:116)
23:44:19 [2021-04-03T03:44:19.444Z] 	at org.eclipse.tycho.surefire.osgibooter.HeadlessTestApplication.start(HeadlessTestApplication.java:23)
23:44:19 [2021-04-03T03:44:19.444Z] 	at org.eclipse.equinox.internal.app.EclipseAppHandle.run(EclipseAppHandle.java:203)
23:44:19 [2021-04-03T03:44:19.444Z] 	at org.eclipse.core.runtime.internal.adaptor.EclipseAppLauncher.runApplication(EclipseAppLauncher.java:137)
23:44:19 [2021-04-03T03:44:19.444Z] 	at org.eclipse.core.runtime.internal.adaptor.EclipseAppLauncher.start(EclipseAppLauncher.java:107)
23:44:19 [2021-04-03T03:44:19.444Z] 	at org.eclipse.core.runtime.adaptor.EclipseStarter.run(EclipseStarter.java:400)
23:44:19 [2021-04-03T03:44:19.444Z] 	at org.eclipse.core.runtime.adaptor.EclipseStarter.run(EclipseStarter.java:255)
23:44:19 [2021-04-03T03:44:19.444Z] 	at java.base/jdk.internal.reflect.NativeMethodAccessorImpl.invoke0(Native Method)
23:44:19 [2021-04-03T03:44:19.444Z] 	at java.base/jdk.internal.reflect.NativeMethodAccessorImpl.invoke(NativeMethodAccessorImpl.java:64)
23:44:19 [2021-04-03T03:44:19.444Z] 	at java.base/jdk.internal.reflect.DelegatingMethodAccessorImpl.invoke(DelegatingMethodAccessorImpl.java:43)
23:44:19 [2021-04-03T03:44:19.445Z] 	at java.base/java.lang.reflect.Method.invoke(Method.java:564)
23:44:19 [2021-04-03T03:44:19.445Z] 	at org.eclipse.equinox.launcher.Main.invokeFramework(Main.java:659)
23:44:19 [2021-04-03T03:44:19.445Z] 	at org.eclipse.equinox.launcher.Main.basicRun(Main.java:595)
23:44:19 [2021-04-03T03:44:19.445Z] 	at org.eclipse.equinox.launcher.Main.run(Main.java:1501)
23:44:19 [2021-04-03T03:44:19.445Z] 	at org.eclipse.equinox.launcher.Main.main(Main.java:1474)
23:44:19 [2021-04-03T03:44:19.445Z] Caused by: java.lang.ClassNotFoundException: org.junit.runners.model.RunnerBuilder cannot be found by org.eclipse.tycho.surefire.osgibooter_2.2.0
23:44:19 [2021-04-03T03:44:19.445Z] 	at org.eclipse.osgi.internal.loader.BundleLoader.findClassInternal(BundleLoader.java:511)
23:44:19 [2021-04-03T03:44:19.445Z] 	at org.eclipse.osgi.internal.loader.BundleLoader.findClass(BundleLoader.java:422)
23:44:19 [2021-04-03T03:44:19.445Z] 	at org.eclipse.osgi.internal.loader.BundleLoader.findClass(BundleLoader.java:414)
23:44:19 [2021-04-03T03:44:19.445Z] 	at org.eclipse.osgi.internal.loader.ModuleClassLoader.loadClass(ModuleClassLoader.java:153)
23:44:19 [2021-04-03T03:44:19.445Z] 	at java.base/java.lang.ClassLoader.loadClass(ClassLoader.java:522)
23:44:19 [2021-04-03T03:44:19.445Z] 	... 31 more
23:44:19 [2021-04-03T03:44:19.445Z] 
23:44:19 [2021-04-03T03:44:19.445Z] Apr 03, 2021 3:44:19 AM org.junit.platform.launcher.core.DefaultLauncher handleThrowable
23:44:19 [2021-04-03T03:44:19.445Z] WARNING: TestEngine with ID 'junit-vintage' failed to discover tests
23:44:19 [2021-04-03T03:44:19.445Z] java.lang.NoClassDefFoundError: org/junit/runners/model/RunnerBuilder
23:44:19 [2021-04-03T03:44:19.445Z] 	at org.junit.vintage.engine.discovery.VintageDiscoverer.<init>(VintageDiscoverer.java:48)
23:44:19 [2021-04-03T03:44:19.445Z] 	at org.junit.vintage.engine.VintageTestEngine.discover(VintageTestEngine.java:65)
23:44:19 [2021-04-03T03:44:19.445Z] 	at org.junit.platform.launcher.core.DefaultLauncher.discoverEngineRoot(DefaultLauncher.java:130)
23:44:19 [2021-04-03T03:44:19.445Z] 	at org.junit.platform.launcher.core.DefaultLauncher.discoverRoot(DefaultLauncher.java:117)
23:44:19 [2021-04-03T03:44:19.445Z] 	at org.junit.platform.launcher.core.DefaultLauncher.discover(DefaultLauncher.java:82)
23:44:19 [2021-04-03T03:44:19.445Z] 	at org.apache.maven.surefire.junitplatform.TestPlanScannerFilter.accept(TestPlanScannerFilter.java:56)
23:44:19 [2021-04-03T03:44:19.445Z] 	at org.apache.maven.surefire.util.DefaultScanResult.applyFilter(DefaultScanResult.java:102)
23:44:19 [2021-04-03T03:44:19.445Z] 	at org.apache.maven.surefire.junitplatform.JUnitPlatformProvider.scanClasspath(JUnitPlatformProvider.java:143)
23:44:19 [2021-04-03T03:44:19.445Z] 	at org.apache.maven.surefire.junitplatform.JUnitPlatformProvider.invoke(JUnitPlatformProvider.java:124)
23:44:19 [2021-04-03T03:44:19.445Z] 	at java.base/jdk.internal.reflect.NativeMethodAccessorImpl.invoke0(Native Method)
23:44:19 [2021-04-03T03:44:19.445Z] 	at java.base/jdk.internal.reflect.NativeMethodAccessorImpl.invoke(NativeMethodAccessorImpl.java:64)
23:44:19 [2021-04-03T03:44:19.445Z] 	at java.base/jdk.internal.reflect.DelegatingMethodAccessorImpl.invoke(DelegatingMethodAccessorImpl.java:43)
23:44:19 [2021-04-03T03:44:19.445Z] 	at java.base/java.lang.reflect.Method.invoke(Method.java:564)
23:44:19 [2021-04-03T03:44:19.445Z] 	at org.apache.maven.surefire.util.ReflectionUtils.invokeMethodWithArray2(ReflectionUtils.java:206)
23:44:19 [2021-04-03T03:44:19.445Z] 	at org.apache.maven.surefire.booter.ProviderFactory$ProviderProxy.invoke(ProviderFactory.java:161)
23:44:19 [2021-04-03T03:44:19.445Z] 	at org.apache.maven.surefire.booter.ProviderFactory.invokeProvider(ProviderFactory.java:84)
23:44:19 [2021-04-03T03:44:19.445Z] 	at org.eclipse.tycho.surefire.osgibooter.OsgiSurefireBooter.run(OsgiSurefireBooter.java:116)
23:44:19 [2021-04-03T03:44:19.445Z] 	at org.eclipse.tycho.surefire.osgibooter.HeadlessTestApplication.start(HeadlessTestApplication.java:23)
23:44:19 [2021-04-03T03:44:19.445Z] 	at org.eclipse.equinox.internal.app.EclipseAppHandle.run(EclipseAppHandle.java:203)
23:44:19 [2021-04-03T03:44:19.445Z] 	at org.eclipse.core.runtime.internal.adaptor.EclipseAppLauncher.runApplication(EclipseAppLauncher.java:137)
23:44:19 [2021-04-03T03:44:19.445Z] 	at org.eclipse.core.runtime.internal.adaptor.EclipseAppLauncher.start(EclipseAppLauncher.java:107)
23:44:19 [2021-04-03T03:44:19.445Z] 	at org.eclipse.core.runtime.adaptor.EclipseStarter.run(EclipseStarter.java:400)
23:44:19 [2021-04-03T03:44:19.445Z] 	at org.eclipse.core.runtime.adaptor.EclipseStarter.run(EclipseStarter.java:255)
23:44:19 [2021-04-03T03:44:19.445Z] 	at java.base/jdk.internal.reflect.NativeMethodAccessorImpl.invoke0(Native Method)
23:44:19 [2021-04-03T03:44:19.445Z] 	at java.base/jdk.internal.reflect.NativeMethodAccessorImpl.invoke(NativeMethodAccessorImpl.java:64)
23:44:19 [2021-04-03T03:44:19.445Z] 	at java.base/jdk.internal.reflect.DelegatingMethodAccessorImpl.invoke(DelegatingMethodAccessorImpl.java:43)
23:44:19 [2021-04-03T03:44:19.445Z] 	at java.base/java.lang.reflect.Method.invoke(Method.java:564)
23:44:19 [2021-04-03T03:44:19.445Z] 	at org.eclipse.equinox.launcher.Main.invokeFramework(Main.java:659)
23:44:19 [2021-04-03T03:44:19.445Z] 	at org.eclipse.equinox.launcher.Main.basicRun(Main.java:595)
23:44:19 [2021-04-03T03:44:19.445Z] 	at org.eclipse.equinox.launcher.Main.run(Main.java:1501)
23:44:19 [2021-04-03T03:44:19.445Z] 	at org.eclipse.equinox.launcher.Main.main(Main.java:1474)
23:44:19 [2021-04-03T03:44:19.445Z] Caused by: java.lang.ClassNotFoundException: org.junit.runners.model.RunnerBuilder cannot be found by org.eclipse.tycho.surefire.osgibooter_2.2.0
23:44:19 [2021-04-03T03:44:19.445Z] 	at org.eclipse.osgi.internal.loader.BundleLoader.findClassInternal(BundleLoader.java:511)
23:44:19 [2021-04-03T03:44:19.445Z] 	at org.eclipse.osgi.internal.loader.BundleLoader.findClass(BundleLoader.java:422)
23:44:19 [2021-04-03T03:44:19.445Z] 	at org.eclipse.osgi.internal.loader.BundleLoader.findClass(BundleLoader.java:414)
23:44:19 [2021-04-03T03:44:19.445Z] 	at org.eclipse.osgi.internal.loader.ModuleClassLoader.loadClass(ModuleClassLoader.java:153)
23:44:19 [2021-04-03T03:44:19.445Z] 	at java.base/java.lang.ClassLoader.loadClass(ClassLoader.java:522)
23:44:19 [2021-04-03T03:44:19.445Z] 	... 31 more
23:44:19 [2021-04-03T03:44:19.445Z] 
23:44:19 [2021-04-03T03:44:19.701Z] Apr 03, 2021 3:44:19 AM org.junit.platform.launcher.core.DefaultLauncher handleThrowable
23:44:19 [2021-04-03T03:44:19.701Z] WARNING: TestEngine with ID 'junit-vintage' failed to discover tests
23:44:19 [2021-04-03T03:44:19.701Z] java.lang.NoClassDefFoundError: org/junit/runners/model/RunnerBuilder
23:44:19 [2021-04-03T03:44:19.701Z] 	at org.junit.vintage.engine.discovery.VintageDiscoverer.<init>(VintageDiscoverer.java:48)
23:44:19 [2021-04-03T03:44:19.701Z] 	at org.junit.vintage.engine.VintageTestEngine.discover(VintageTestEngine.java:65)
23:44:19 [2021-04-03T03:44:19.701Z] 	at org.junit.platform.launcher.core.DefaultLauncher.discoverEngineRoot(DefaultLauncher.java:130)
23:44:19 [2021-04-03T03:44:19.701Z] 	at org.junit.platform.launcher.core.DefaultLauncher.discoverRoot(DefaultLauncher.java:117)
23:44:19 [2021-04-03T03:44:19.701Z] 	at org.junit.platform.launcher.core.DefaultLauncher.discover(DefaultLauncher.java:82)
23:44:19 [2021-04-03T03:44:19.701Z] 	at org.apache.maven.surefire.junitplatform.TestPlanScannerFilter.accept(TestPlanScannerFilter.java:56)
23:44:19 [2021-04-03T03:44:19.701Z] 	at org.apache.maven.surefire.util.DefaultScanResult.applyFilter(DefaultScanResult.java:102)
23:44:19 [2021-04-03T03:44:19.701Z] 	at org.apache.maven.surefire.junitplatform.JUnitPlatformProvider.scanClasspath(JUnitPlatformProvider.java:143)
23:44:19 [2021-04-03T03:44:19.701Z] 	at org.apache.maven.surefire.junitplatform.JUnitPlatformProvider.invoke(JUnitPlatformProvider.java:124)
23:44:19 [2021-04-03T03:44:19.701Z] 	at java.base/jdk.internal.reflect.NativeMethodAccessorImpl.invoke0(Native Method)
23:44:19 [2021-04-03T03:44:19.701Z] 	at java.base/jdk.internal.reflect.NativeMethodAccessorImpl.invoke(NativeMethodAccessorImpl.java:64)
23:44:19 [2021-04-03T03:44:19.701Z] 	at java.base/jdk.internal.reflect.DelegatingMethodAccessorImpl.invoke(DelegatingMethodAccessorImpl.java:43)
23:44:19 [2021-04-03T03:44:19.701Z] 	at java.base/java.lang.reflect.Method.invoke(Method.java:564)
23:44:19 [2021-04-03T03:44:19.701Z] 	at org.apache.maven.surefire.util.ReflectionUtils.invokeMethodWithArray2(ReflectionUtils.java:206)
23:44:19 [2021-04-03T03:44:19.701Z] 	at org.apache.maven.surefire.booter.ProviderFactory$ProviderProxy.invoke(ProviderFactory.java:161)
23:44:19 [2021-04-03T03:44:19.701Z] 	at org.apache.maven.surefire.booter.ProviderFactory.invokeProvider(ProviderFactory.java:84)
23:44:19 [2021-04-03T03:44:19.701Z] 	at org.eclipse.tycho.surefire.osgibooter.OsgiSurefireBooter.run(OsgiSurefireBooter.java:116)
23:44:19 [2021-04-03T03:44:19.702Z] 	at org.eclipse.tycho.surefire.osgibooter.HeadlessTestApplication.start(HeadlessTestApplication.java:23)
23:44:19 [2021-04-03T03:44:19.702Z] 	at org.eclipse.equinox.internal.app.EclipseAppHandle.run(EclipseAppHandle.java:203)
23:44:19 [2021-04-03T03:44:19.702Z] 	at org.eclipse.core.runtime.internal.adaptor.EclipseAppLauncher.runApplication(EclipseAppLauncher.java:137)
23:44:19 [2021-04-03T03:44:19.702Z] 	at org.eclipse.core.runtime.internal.adaptor.EclipseAppLauncher.start(EclipseAppLauncher.java:107)
23:44:19 [2021-04-03T03:44:19.702Z] 	at org.eclipse.core.runtime.adaptor.EclipseStarter.run(EclipseStarter.java:400)
23:44:19 [2021-04-03T03:44:19.702Z] 	at org.eclipse.core.runtime.adaptor.EclipseStarter.run(EclipseStarter.java:255)
23:44:19 [2021-04-03T03:44:19.702Z] 	at java.base/jdk.internal.reflect.NativeMethodAccessorImpl.invoke0(Native Method)
23:44:19 [2021-04-03T03:44:19.702Z] 	at java.base/jdk.internal.reflect.NativeMethodAccessorImpl.invoke(NativeMethodAccessorImpl.java:64)
23:44:19 [2021-04-03T03:44:19.702Z] 	at java.base/jdk.internal.reflect.DelegatingMethodAccessorImpl.invoke(DelegatingMethodAccessorImpl.java:43)
23:44:19 [2021-04-03T03:44:19.702Z] 	at java.base/java.lang.reflect.Method.invoke(Method.java:564)
23:44:19 [2021-04-03T03:44:19.702Z] 	at org.eclipse.equinox.launcher.Main.invokeFramework(Main.java:659)
23:44:19 [2021-04-03T03:44:19.702Z] 	at org.eclipse.equinox.launcher.Main.basicRun(Main.java:595)
23:44:19 [2021-04-03T03:44:19.702Z] 	at org.eclipse.equinox.launcher.Main.run(Main.java:1501)
23:44:19 [2021-04-03T03:44:19.702Z] 	at org.eclipse.equinox.launcher.Main.main(Main.java:1474)
23:44:19 [2021-04-03T03:44:19.702Z] Caused by: java.lang.ClassNotFoundException: org.junit.runners.model.RunnerBuilder cannot be found by org.eclipse.tycho.surefire.osgibooter_2.2.0
23:44:19 [2021-04-03T03:44:19.702Z] 	at org.eclipse.osgi.internal.loader.BundleLoader.findClassInternal(BundleLoader.java:511)
23:44:19 [2021-04-03T03:44:19.702Z] 	at org.eclipse.osgi.internal.loader.BundleLoader.findClass(BundleLoader.java:422)
23:44:19 [2021-04-03T03:44:19.702Z] 	at org.eclipse.osgi.internal.loader.BundleLoader.findClass(BundleLoader.java:414)
23:44:19 [2021-04-03T03:44:19.702Z] 	at org.eclipse.osgi.internal.loader.ModuleClassLoader.loadClass(ModuleClassLoader.java:153)
23:44:19 [2021-04-03T03:44:19.702Z] 	at java.base/java.lang.ClassLoader.loadClass(ClassLoader.java:522)
23:44:19 [2021-04-03T03:44:19.702Z] 	... 31 more
23:44:19 [2021-04-03T03:44:19.702Z] 
23:44:19 [2021-04-03T03:44:19.702Z] Apr 03, 2021 3:44:19 AM org.junit.platform.launcher.core.DefaultLauncher handleThrowable
23:44:19 [2021-04-03T03:44:19.702Z] WARNING: TestEngine with ID 'junit-vintage' failed to discover tests
23:44:19 [2021-04-03T03:44:19.702Z] java.lang.NoClassDefFoundError: org/junit/runners/model/RunnerBuilder
23:44:19 [2021-04-03T03:44:19.702Z] 	at org.junit.vintage.engine.discovery.VintageDiscoverer.<init>(VintageDiscoverer.java:48)
23:44:19 [2021-04-03T03:44:19.702Z] 	at org.junit.vintage.engine.VintageTestEngine.discover(VintageTestEngine.java:65)
23:44:19 [2021-04-03T03:44:19.702Z] 	at org.junit.platform.launcher.core.DefaultLauncher.discoverEngineRoot(DefaultLauncher.java:130)
23:44:19 [2021-04-03T03:44:19.702Z] 	at org.junit.platform.launcher.core.DefaultLauncher.discoverRoot(DefaultLauncher.java:117)
23:44:19 [2021-04-03T03:44:19.702Z] 	at org.junit.platform.launcher.core.DefaultLauncher.discover(DefaultLauncher.java:82)
23:44:19 [2021-04-03T03:44:19.702Z] 	at org.apache.maven.surefire.junitplatform.TestPlanScannerFilter.accept(TestPlanScannerFilter.java:56)
23:44:19 [2021-04-03T03:44:19.702Z] 	at org.apache.maven.surefire.util.DefaultScanResult.applyFilter(DefaultScanResult.java:102)
23:44:19 [2021-04-03T03:44:19.702Z] 	at org.apache.maven.surefire.junitplatform.JUnitPlatformProvider.scanClasspath(JUnitPlatformProvider.java:143)
23:44:19 [2021-04-03T03:44:19.702Z] 	at org.apache.maven.surefire.junitplatform.JUnitPlatformProvider.invoke(JUnitPlatformProvider.java:124)
23:44:19 [2021-04-03T03:44:19.702Z] 	at java.base/jdk.internal.reflect.NativeMethodAccessorImpl.invoke0(Native Method)
23:44:19 [2021-04-03T03:44:19.702Z] 	at java.base/jdk.internal.reflect.NativeMethodAccessorImpl.invoke(NativeMethodAccessorImpl.java:64)
23:44:19 [2021-04-03T03:44:19.702Z] 	at java.base/jdk.internal.reflect.DelegatingMethodAccessorImpl.invoke(DelegatingMethodAccessorImpl.java:43)
23:44:19 [2021-04-03T03:44:19.702Z] 	at java.base/java.lang.reflect.Method.invoke(Method.java:564)
23:44:19 [2021-04-03T03:44:19.702Z] 	at org.apache.maven.surefire.util.ReflectionUtils.invokeMethodWithArray2(ReflectionUtils.java:206)
23:44:19 [2021-04-03T03:44:19.702Z] 	at org.apache.maven.surefire.booter.ProviderFactory$ProviderProxy.invoke(ProviderFactory.java:161)
23:44:19 [2021-04-03T03:44:19.702Z] 	at org.apache.maven.surefire.booter.ProviderFactory.invokeProvider(ProviderFactory.java:84)
23:44:19 [2021-04-03T03:44:19.702Z] 	at org.eclipse.tycho.surefire.osgibooter.OsgiSurefireBooter.run(OsgiSurefireBooter.java:116)
23:44:19 [2021-04-03T03:44:19.702Z] 	at org.eclipse.tycho.surefire.osgibooter.HeadlessTestApplication.start(HeadlessTestApplication.java:23)
23:44:19 [2021-04-03T03:44:19.702Z] 	at org.eclipse.equinox.internal.app.EclipseAppHandle.run(EclipseAppHandle.java:203)
23:44:19 [2021-04-03T03:44:19.702Z] 	at org.eclipse.core.runtime.internal.adaptor.EclipseAppLauncher.runApplication(EclipseAppLauncher.java:137)
23:44:19 [2021-04-03T03:44:19.702Z] 	at org.eclipse.core.runtime.internal.adaptor.EclipseAppLauncher.start(EclipseAppLauncher.java:107)
23:44:19 [2021-04-03T03:44:19.702Z] 	at org.eclipse.core.runtime.adaptor.EclipseStarter.run(EclipseStarter.java:400)
23:44:19 [2021-04-03T03:44:19.702Z] 	at org.eclipse.core.runtime.adaptor.EclipseStarter.run(EclipseStarter.java:255)
23:44:19 [2021-04-03T03:44:19.702Z] 	at java.base/jdk.internal.reflect.NativeMethodAccessorImpl.invoke0(Native Method)
23:44:19 [2021-04-03T03:44:19.702Z] 	at java.base/jdk.internal.reflect.NativeMethodAccessorImpl.invoke(NativeMethodAccessorImpl.java:64)
23:44:19 [2021-04-03T03:44:19.702Z] 	at java.base/jdk.internal.reflect.DelegatingMethodAccessorImpl.invoke(DelegatingMethodAccessorImpl.java:43)
23:44:19 [2021-04-03T03:44:19.702Z] 	at java.base/java.lang.reflect.Method.invoke(Method.java:564)
23:44:19 [2021-04-03T03:44:19.702Z] 	at org.eclipse.equinox.launcher.Main.invokeFramework(Main.java:659)
23:44:19 [2021-04-03T03:44:19.702Z] 	at org.eclipse.equinox.launcher.Main.basicRun(Main.java:595)
23:44:19 [2021-04-03T03:44:19.702Z] 	at org.eclipse.equinox.launcher.Main.run(Main.java:1501)
23:44:19 [2021-04-03T03:44:19.702Z] 	at org.eclipse.equinox.launcher.Main.main(Main.java:1474)
23:44:19 [2021-04-03T03:44:19.702Z] Caused by: java.lang.ClassNotFoundException: org.junit.runners.model.RunnerBuilder cannot be found by org.eclipse.tycho.surefire.osgibooter_2.2.0
23:44:19 [2021-04-03T03:44:19.702Z] 	at org.eclipse.osgi.internal.loader.BundleLoader.findClassInternal(BundleLoader.java:511)
23:44:19 [2021-04-03T03:44:19.702Z] 	at org.eclipse.osgi.internal.loader.BundleLoader.findClass(BundleLoader.java:422)
23:44:19 [2021-04-03T03:44:19.702Z] 	at org.eclipse.osgi.internal.loader.BundleLoader.findClass(BundleLoader.java:414)
23:44:19 [2021-04-03T03:44:19.702Z] 	at org.eclipse.osgi.internal.loader.ModuleClassLoader.loadClass(ModuleClassLoader.java:153)
23:44:19 [2021-04-03T03:44:19.702Z] 	at java.base/java.lang.ClassLoader.loadClass(ClassLoader.java:522)
23:44:19 [2021-04-03T03:44:19.702Z] 	... 31 more
23:44:19 [2021-04-03T03:44:19.702Z] 
23:44:19 [2021-04-03T03:44:19.702Z] Apr 03, 2021 3:44:19 AM org.junit.platform.launcher.core.DefaultLauncher handleThrowable
23:44:19 [2021-04-03T03:44:19.702Z] WARNING: TestEngine with ID 'junit-vintage' failed to discover tests
23:44:19 [2021-04-03T03:44:19.702Z] java.lang.NoClassDefFoundError: org/junit/runners/model/RunnerBuilder
23:44:19 [2021-04-03T03:44:19.702Z] 	at org.junit.vintage.engine.discovery.VintageDiscoverer.<init>(VintageDiscoverer.java:48)
23:44:19 [2021-04-03T03:44:19.702Z] 	at org.junit.vintage.engine.VintageTestEngine.discover(VintageTestEngine.java:65)
23:44:19 [2021-04-03T03:44:19.702Z] 	at org.junit.platform.launcher.core.DefaultLauncher.discoverEngineRoot(DefaultLauncher.java:130)
23:44:19 [2021-04-03T03:44:19.702Z] 	at org.junit.platform.launcher.core.DefaultLauncher.discoverRoot(DefaultLauncher.java:117)
23:44:19 [2021-04-03T03:44:19.703Z] 	at org.junit.platform.launcher.core.DefaultLauncher.execute(DefaultLauncher.java:90)
23:44:19 [2021-04-03T03:44:19.703Z] 	at org.apache.maven.surefire.junitplatform.JUnitPlatformProvider.invokeAllTests(JUnitPlatformProvider.java:150)
23:44:19 [2021-04-03T03:44:19.703Z] 	at org.apache.maven.surefire.junitplatform.JUnitPlatformProvider.invoke(JUnitPlatformProvider.java:124)
23:44:19 [2021-04-03T03:44:19.703Z] 	at java.base/jdk.internal.reflect.NativeMethodAccessorImpl.invoke0(Native Method)
23:44:19 [2021-04-03T03:44:19.703Z] 	at java.base/jdk.internal.reflect.NativeMethodAccessorImpl.invoke(NativeMethodAccessorImpl.java:64)
23:44:19 [2021-04-03T03:44:19.703Z] 	at java.base/jdk.internal.reflect.DelegatingMethodAccessorImpl.invoke(DelegatingMethodAccessorImpl.java:43)
23:44:19 [2021-04-03T03:44:19.703Z] 	at java.base/java.lang.reflect.Method.invoke(Method.java:564)
23:44:19 [2021-04-03T03:44:19.703Z] 	at org.apache.maven.surefire.util.ReflectionUtils.invokeMethodWithArray2(ReflectionUtils.java:206)
23:44:19 [2021-04-03T03:44:19.703Z] 	at org.apache.maven.surefire.booter.ProviderFactory$ProviderProxy.invoke(ProviderFactory.java:161)
23:44:19 [2021-04-03T03:44:19.703Z] 	at org.apache.maven.surefire.booter.ProviderFactory.invokeProvider(ProviderFactory.java:84)
23:44:19 [2021-04-03T03:44:19.703Z] 	at org.eclipse.tycho.surefire.osgibooter.OsgiSurefireBooter.run(OsgiSurefireBooter.java:116)
23:44:19 [2021-04-03T03:44:19.703Z] 	at org.eclipse.tycho.surefire.osgibooter.HeadlessTestApplication.start(HeadlessTestApplication.java:23)
23:44:19 [2021-04-03T03:44:19.703Z] 	at org.eclipse.equinox.internal.app.EclipseAppHandle.run(EclipseAppHandle.java:203)
23:44:19 [2021-04-03T03:44:19.703Z] 	at org.eclipse.core.runtime.internal.adaptor.EclipseAppLauncher.runApplication(EclipseAppLauncher.java:137)
23:44:19 [2021-04-03T03:44:19.703Z] 	at org.eclipse.core.runtime.internal.adaptor.EclipseAppLauncher.start(EclipseAppLauncher.java:107)
23:44:19 [2021-04-03T03:44:19.703Z] 	at org.eclipse.core.runtime.adaptor.EclipseStarter.run(EclipseStarter.java:400)
23:44:19 [2021-04-03T03:44:19.703Z] 	at org.eclipse.core.runtime.adaptor.EclipseStarter.run(EclipseStarter.java:255)
23:44:19 [2021-04-03T03:44:19.703Z] 	at java.base/jdk.internal.reflect.NativeMethodAccessorImpl.invoke0(Native Method)
23:44:19 [2021-04-03T03:44:19.703Z] 	at java.base/jdk.internal.reflect.NativeMethodAccessorImpl.invoke(NativeMethodAccessorImpl.java:64)
23:44:19 [2021-04-03T03:44:19.703Z] 	at java.base/jdk.internal.reflect.DelegatingMethodAccessorImpl.invoke(DelegatingMethodAccessorImpl.java:43)
23:44:19 [2021-04-03T03:44:19.703Z] 	at java.base/java.lang.reflect.Method.invoke(Method.java:564)
23:44:19 [2021-04-03T03:44:19.703Z] 	at org.eclipse.equinox.launcher.Main.invokeFramework(Main.java:659)
23:44:19 [2021-04-03T03:44:19.703Z] 	at org.eclipse.equinox.launcher.Main.basicRun(Main.java:595)
23:44:19 [2021-04-03T03:44:19.703Z] 	at org.eclipse.equinox.launcher.Main.run(Main.java:1501)
23:44:19 [2021-04-03T03:44:19.703Z] 	at org.eclipse.equinox.launcher.Main.main(Main.java:1474)
23:44:19 [2021-04-03T03:44:19.703Z] Caused by: java.lang.ClassNotFoundException: org.junit.runners.model.RunnerBuilder cannot be found by org.eclipse.tycho.surefire.osgibooter_2.2.0
23:44:19 [2021-04-03T03:44:19.703Z] 	at org.eclipse.osgi.internal.loader.BundleLoader.findClassInternal(BundleLoader.java:511)
23:44:19 [2021-04-03T03:44:19.703Z] 	at org.eclipse.osgi.internal.loader.BundleLoader.findClass(BundleLoader.java:422)
23:44:19 [2021-04-03T03:44:19.703Z] 	at org.eclipse.osgi.internal.loader.BundleLoader.findClass(BundleLoader.java:414)
23:44:19 [2021-04-03T03:44:19.703Z] 	at org.eclipse.osgi.internal.loader.ModuleClassLoader.loadClass(ModuleClassLoader.java:153)
23:44:19 [2021-04-03T03:44:19.703Z] 	at java.base/java.lang.ClassLoader.loadClass(ClassLoader.java:522)
23:44:19 [2021-04-03T03:44:19.703Z] 	... 29 more
23:44:19 [2021-04-03T03:44:19.703Z] 
23:44:19 [2021-04-03T03:44:19.703Z] Running org.eclipse.ease.ui.views.shell.dropins.variables.VariablesComparatorTest
23:44:20 [2021-04-03T03:44:20.288Z] Tests run: 1, Failures: 0, Errors: 0, Skipped: 0, Time elapsed: 0.724 s - in org.eclipse.ease.ui.views.shell.dropins.variables.VariablesComparatorTest
23:44:20 [2021-04-03T03:44:20.288Z] lastExecutionResult_comes_before_debugVariable  Time elapsed: 0.719 s
23:44:20 [2021-04-03T03:44:20.288Z] Running org.eclipse.ease.ui.views.shell.dropins.variables.HiddenVariablesFilterTest
23:44:20 [2021-04-03T03:44:20.544Z] Tests run: 3, Failures: 0, Errors: 0, Skipped: 0, Time elapsed: 0.038 s - in org.eclipse.ease.ui.views.shell.dropins.variables.HiddenVariablesFilterTest
23:44:20 [2021-04-03T03:44:20.544Z] select_accepts_unknown_classes  Time elapsed: 0.001 s
23:44:20 [2021-04-03T03:44:20.544Z] select_accepts_script_variables  Time elapsed: 0.036 s
23:44:20 [2021-04-03T03:44:20.544Z] select_declines_hidden_script_variables  Time elapsed: 0.001 s
23:44:20 [2021-04-03T03:44:20.544Z] Running org.eclipse.ease.ui.views.shell.dropins.variables.ContentLabelProviderTest
23:44:20 [2021-04-03T03:44:20.544Z] Tests run: 1, Failures: 0, Errors: 0, Skipped: 0, Time elapsed: 0.042 s - in org.eclipse.ease.ui.views.shell.dropins.variables.ContentLabelProviderTest
23:44:20 [2021-04-03T03:44:20.544Z] getText_returns_variable_content  Time elapsed: 0.042 s
23:44:20 [2021-04-03T03:44:20.544Z] Running org.eclipse.ease.ui.views.shell.dropins.variables.VariablesLabelProviderTest
23:44:20 [2021-04-03T03:44:20.544Z] Tests run: 1, Failures: 0, Errors: 0, Skipped: 0, Time elapsed: 0.002 s - in org.eclipse.ease.ui.views.shell.dropins.variables.VariablesLabelProviderTest
23:44:20 [2021-04-03T03:44:20.544Z] getText_returns_variable_name  Time elapsed: 0.002 s
23:44:20 [2021-04-03T03:44:20.544Z] Running org.eclipse.ease.ui.views.shell.dropins.variables.VariablesContentProviderTest
23:44:20 [2021-04-03T03:44:20.544Z] Tests run: 5, Failures: 0, Errors: 0, Skipped: 0, Time elapsed: 0.062 s - in org.eclipse.ease.ui.views.shell.dropins.variables.VariablesContentProviderTest
23:44:20 [2021-04-03T03:44:20.544Z] hasChildren_true_when_child_nodes_are_available  Time elapsed: 0.001 s
23:44:20 [2021-04-03T03:44:20.544Z] getChildren_is_empty_when_no_child_nodes_are_available  Time elapsed: 0.002 s
23:44:20 [2021-04-03T03:44:20.544Z] getElements_contains_variables_from_engine  Time elapsed: 0.058 s
23:44:20 [2021-04-03T03:44:20.544Z] hasChildren_false_when_no_child_nodes_are_available  Time elapsed: 0 s
23:44:20 [2021-04-03T03:44:20.544Z] getChildren_not_empty_when_child_nodes_are_available  Time elapsed: 0.001 s
23:44:20 [2021-04-03T03:44:20.544Z] Running org.eclipse.ease.ui.views.shell.dropins.modules.ModulesStackContentProviderTest
23:44:20 [2021-04-03T03:44:20.544Z] Tests run: 2, Failures: 0, Errors: 0, Skipped: 0, Time elapsed: 0.083 s - in org.eclipse.ease.ui.views.shell.dropins.modules.ModulesStackContentProviderTest
23:44:20 [2021-04-03T03:44:20.544Z] getElements_returns_modules  Time elapsed: 0.081 s
23:44:20 [2021-04-03T03:44:20.544Z] getElements_returns_empty_list_without_environment  Time elapsed: 0 s
23:44:20 [2021-04-03T03:44:20.544Z] Running org.eclipse.ease.ui.views.shell.dropins.modules.ModulesStackLabelProviderTest
23:44:20 [2021-04-03T03:44:20.544Z] Tests run: 3, Failures: 0, Errors: 0, Skipped: 0, Time elapsed: 0.035 s - in org.eclipse.ease.ui.views.shell.dropins.modules.ModulesStackLabelProviderTest
23:44:20 [2021-04-03T03:44:20.544Z] getText_null_returns_empty_string  Time elapsed: 0.001 s
23:44:20 [2021-04-03T03:44:20.544Z] getText_returns_definition_name  Time elapsed: 0.033 s
23:44:20 [2021-04-03T03:44:20.544Z] getText_returns_full_class_name_name  Time elapsed: 0.001 s
23:44:20 [2021-04-03T03:44:20.544Z] Running org.eclipse.ease.ui.help.hovers.ModuleHelpTest
23:44:20 [2021-04-03T03:44:20.544Z] Tests run: 4, Failures: 0, Errors: 0, Skipped: 4, Time elapsed: 0.001 s - in org.eclipse.ease.ui.help.hovers.ModuleHelpTest
23:44:20 [2021-04-03T03:44:20.544Z] getModuleHelpLocation skipped
23:44:20 [2021-04-03T03:44:20.544Z] getModuleHelp skipped
23:44:20 [2021-04-03T03:44:20.544Z] getMethodHelp skipped
23:44:20 [2021-04-03T03:44:20.544Z] getConstantHelp skipped
23:44:20 [2021-04-03T03:44:20.544Z] Running org.eclipse.ease.ui.dnd.ModulesDropHandlerTest
23:44:20 [2021-04-03T03:44:20.800Z] Tests run: 2, Failures: 0, Errors: 0, Skipped: 0, Time elapsed: 0.014 s - in org.eclipse.ease.ui.dnd.ModulesDropHandlerTest
23:44:20 [2021-04-03T03:44:20.800Z] accepts_true_for_ModuleEntry  Time elapsed: 0.013 s
23:44:20 [2021-04-03T03:44:20.800Z] accepts_true_for_ModuleDefinition  Time elapsed: 0.001 s
23:44:20 [2021-04-03T03:44:20.800Z] Running org.eclipse.ease.ui.completion.CompletionContextTest
23:44:20 [2021-04-03T03:44:20.800Z] Tests run: 9, Failures: 0, Errors: 0, Skipped: 0, Time elapsed: 0.007 s - in org.eclipse.ease.ui.completion.CompletionContextTest
23:44:20 [2021-04-03T03:44:20.800Z] resolveStaticClass  Time elapsed: 0.004 s
23:44:20 [2021-04-03T03:44:20.800Z] resolveClassWithFilter  Time elapsed: 0.001 s
23:44:20 [2021-04-03T03:44:20.800Z] simplifyCalls  Time elapsed: 0 s
23:44:20 [2021-04-03T03:44:20.800Z] resolveClass  Time elapsed: 0 s
23:44:20 [2021-04-03T03:44:20.800Z] replaceEscapedStringLiterals  Time elapsed: 0 s
23:44:20 [2021-04-03T03:44:20.800Z] replaceSimpleStringLiterals  Time elapsed: 0 s
23:44:20 [2021-04-03T03:44:20.800Z] resolveStaticClassWithFilter  Time elapsed: 0 s
23:44:20 [2021-04-03T03:44:20.800Z] resolveClassWithParameters  Time elapsed: 0 s
23:44:20 [2021-04-03T03:44:20.800Z] replaceMultipleStringLiterals  Time elapsed: 0.001 s
23:44:20 [2021-04-03T03:44:20.800Z] Running org.eclipse.ease.ui.completion.provider.AbstractFileLocationCompletionProviderTest
23:44:20 [2021-04-03T03:44:20.800Z] Tests run: 8, Failures: 0, Errors: 0, Skipped: 8, Time elapsed: 0.053 s - in org.eclipse.ease.ui.completion.provider.AbstractFileLocationCompletionProviderTest
23:44:20 [2021-04-03T03:44:20.800Z] workspaceProjectProposals skipped
23:44:20 [2021-04-03T03:44:20.800Z] checkOperatingSystem skipped
23:44:20 [2021-04-03T03:44:20.800Z] absoluteRootWorkspaceProposals skipped
23:44:20 [2021-04-03T03:44:20.800Z] workspaceFolderProposals skipped
23:44:20 [2021-04-03T03:44:20.800Z] fileSystemFolderProposals skipped
23:44:20 [2021-04-03T03:44:20.800Z] workspaceProposals skipped
23:44:20 [2021-04-03T03:44:20.800Z] relativeRootWorkspaceProposals skipped
23:44:20 [2021-04-03T03:44:20.800Z] fileSystemRootProposals skipped
23:44:20 [2021-04-03T03:44:20.800Z] 
23:44:20 [2021-04-03T03:44:20.800Z] Results:
23:44:20 [2021-04-03T03:44:20.800Z] 
23:44:20 [2021-04-03T03:44:20.800Z] Tests run: 39, Failures: 0, Errors: 0, Skipped: 12
23:44:20 [2021-04-03T03:44:20.800Z] 
23:44:21 [2021-04-03T03:44:21.361Z] [INFO] All tests passed!
23:44:21 [2021-04-03T03:44:21.361Z] [INFO] ------------------------------------------------------------------------
23:44:21 [2021-04-03T03:44:21.361Z] [INFO] Reactor Summary for org.eclipse.ease.releng 0.8.0-SNAPSHOT:
23:44:21 [2021-04-03T03:44:21.361Z] [INFO] 
23:44:21 [2021-04-03T03:44:21.361Z] [INFO] org.eclipse.ease.releng ............................ SUCCESS [  0.002 s]
23:44:21 [2021-04-03T03:44:21.361Z] [INFO] org.eclipse.ease.releng.target ..................... SUCCESS [  0.103 s]
23:44:21 [2021-04-03T03:44:21.361Z] [INFO] org.eclipse.ease.test .............................. SUCCESS [  9.597 s]
23:44:21 [2021-04-03T03:44:21.361Z] [INFO] org.eclipse.ease.lang.javascript.rhino.test ........ SUCCESS [ 15.644 s]
23:44:21 [2021-04-03T03:44:21.361Z] [INFO] org.eclipse.ease.lang.javascript.test .............. SUCCESS [  3.549 s]
23:44:21 [2021-04-03T03:44:21.361Z] [INFO] org.eclipse.ease.lang.python.test .................. SUCCESS [  3.022 s]
23:44:21 [2021-04-03T03:44:21.361Z] [INFO] org.eclipse.ease.lang.python.jython.test ........... SUCCESS [ 18.498 s]
23:44:21 [2021-04-03T03:44:21.361Z] [INFO] org.eclipse.ease.lang.scriptarchive.test ........... SUCCESS [  3.909 s]
23:44:21 [2021-04-03T03:44:21.361Z] [INFO] org.eclipse.ease.ui.test ........................... SUCCESS [  4.636 s]
23:44:21 [2021-04-03T03:44:21.361Z] [INFO] ------------------------------------------------------------------------
23:44:21 [2021-04-03T03:44:21.361Z] [INFO] BUILD SUCCESS
23:44:21 [2021-04-03T03:44:21.361Z] [INFO] ------------------------------------------------------------------------
23:44:21 [2021-04-03T03:44:21.361Z] [INFO] Total time:  01:33 min
23:44:21 [2021-04-03T03:44:21.361Z] [INFO] Finished at: 2021-04-03T03:44:21Z
23:44:21 [2021-04-03T03:44:21.361Z] [INFO] ------------------------------------------------------------------------
23:44:21 [2021-04-03T03:44:21.361Z] [WARNING] [jenkins-event-spy] Unexpected Maven project file name 'target-tests-pom.xml', problems may occur
23:44:21 [2021-04-03T03:44:21.361Z] [INFO] [jenkins-event-spy] Generated /home/jenkins/agent/workspace/ease.verify.core.target.2018-12@tmp/withMaven758cb5fd/maven-spy-20210403-034247-5237214906167507345519.log