Console Output

Skipping 1,072 KB.. Full Log
23:43:30 [2021-03-20T03:43:30.448Z] 	at java.base/java.lang.reflect.Method.invoke(Method.java:564)
23:43:30 [2021-03-20T03:43:30.448Z] 	at org.apache.maven.surefire.util.ReflectionUtils.invokeMethodWithArray2(ReflectionUtils.java:206)
23:43:30 [2021-03-20T03:43:30.448Z] 	at org.apache.maven.surefire.booter.ProviderFactory$ProviderProxy.invoke(ProviderFactory.java:161)
23:43:30 [2021-03-20T03:43:30.448Z] 	at org.apache.maven.surefire.booter.ProviderFactory.invokeProvider(ProviderFactory.java:84)
23:43:30 [2021-03-20T03:43:30.448Z] 	at org.eclipse.tycho.surefire.osgibooter.OsgiSurefireBooter.run(OsgiSurefireBooter.java:116)
23:43:30 [2021-03-20T03:43:30.448Z] 	at org.eclipse.tycho.surefire.osgibooter.HeadlessTestApplication.start(HeadlessTestApplication.java:23)
23:43:30 [2021-03-20T03:43:30.448Z] 	at org.eclipse.equinox.internal.app.EclipseAppHandle.run(EclipseAppHandle.java:203)
23:43:30 [2021-03-20T03:43:30.448Z] 	at org.eclipse.core.runtime.internal.adaptor.EclipseAppLauncher.runApplication(EclipseAppLauncher.java:137)
23:43:30 [2021-03-20T03:43:30.448Z] 	at org.eclipse.core.runtime.internal.adaptor.EclipseAppLauncher.start(EclipseAppLauncher.java:107)
23:43:30 [2021-03-20T03:43:30.448Z] 	at org.eclipse.core.runtime.adaptor.EclipseStarter.run(EclipseStarter.java:400)
23:43:30 [2021-03-20T03:43:30.448Z] 	at org.eclipse.core.runtime.adaptor.EclipseStarter.run(EclipseStarter.java:255)
23:43:30 [2021-03-20T03:43:30.448Z] 	at java.base/jdk.internal.reflect.NativeMethodAccessorImpl.invoke0(Native Method)
23:43:30 [2021-03-20T03:43:30.448Z] 	at java.base/jdk.internal.reflect.NativeMethodAccessorImpl.invoke(NativeMethodAccessorImpl.java:64)
23:43:30 [2021-03-20T03:43:30.448Z] 	at java.base/jdk.internal.reflect.DelegatingMethodAccessorImpl.invoke(DelegatingMethodAccessorImpl.java:43)
23:43:30 [2021-03-20T03:43:30.448Z] 	at java.base/java.lang.reflect.Method.invoke(Method.java:564)
23:43:30 [2021-03-20T03:43:30.448Z] 	at org.eclipse.equinox.launcher.Main.invokeFramework(Main.java:659)
23:43:30 [2021-03-20T03:43:30.448Z] 	at org.eclipse.equinox.launcher.Main.basicRun(Main.java:595)
23:43:30 [2021-03-20T03:43:30.448Z] 	at org.eclipse.equinox.launcher.Main.run(Main.java:1501)
23:43:30 [2021-03-20T03:43:30.448Z] 	at org.eclipse.equinox.launcher.Main.main(Main.java:1474)
23:43:30 [2021-03-20T03:43:30.448Z] Caused by: java.lang.ClassNotFoundException: org.junit.runners.model.RunnerBuilder cannot be found by org.eclipse.tycho.surefire.osgibooter_2.2.0
23:43:30 [2021-03-20T03:43:30.448Z] 	at org.eclipse.osgi.internal.loader.BundleLoader.findClassInternal(BundleLoader.java:511)
23:43:30 [2021-03-20T03:43:30.448Z] 	at org.eclipse.osgi.internal.loader.BundleLoader.findClass(BundleLoader.java:422)
23:43:30 [2021-03-20T03:43:30.448Z] 	at org.eclipse.osgi.internal.loader.BundleLoader.findClass(BundleLoader.java:414)
23:43:30 [2021-03-20T03:43:30.448Z] 	at org.eclipse.osgi.internal.loader.ModuleClassLoader.loadClass(ModuleClassLoader.java:153)
23:43:30 [2021-03-20T03:43:30.448Z] 	at java.base/java.lang.ClassLoader.loadClass(ClassLoader.java:522)
23:43:30 [2021-03-20T03:43:30.448Z] 	... 31 more
23:43:30 [2021-03-20T03:43:30.448Z] 
23:43:30 [2021-03-20T03:43:30.448Z] Mar 20, 2021 3:43:30 AM org.junit.platform.launcher.core.DefaultLauncher handleThrowable
23:43:30 [2021-03-20T03:43:30.448Z] WARNING: TestEngine with ID 'junit-vintage' failed to discover tests
23:43:30 [2021-03-20T03:43:30.448Z] java.lang.NoClassDefFoundError: org/junit/runners/model/RunnerBuilder
23:43:30 [2021-03-20T03:43:30.448Z] 	at org.junit.vintage.engine.discovery.VintageDiscoverer.<init>(VintageDiscoverer.java:48)
23:43:30 [2021-03-20T03:43:30.448Z] 	at org.junit.vintage.engine.VintageTestEngine.discover(VintageTestEngine.java:65)
23:43:30 [2021-03-20T03:43:30.448Z] 	at org.junit.platform.launcher.core.DefaultLauncher.discoverEngineRoot(DefaultLauncher.java:130)
23:43:30 [2021-03-20T03:43:30.448Z] 	at org.junit.platform.launcher.core.DefaultLauncher.discoverRoot(DefaultLauncher.java:117)
23:43:30 [2021-03-20T03:43:30.448Z] 	at org.junit.platform.launcher.core.DefaultLauncher.discover(DefaultLauncher.java:82)
23:43:30 [2021-03-20T03:43:30.448Z] 	at org.apache.maven.surefire.junitplatform.TestPlanScannerFilter.accept(TestPlanScannerFilter.java:56)
23:43:30 [2021-03-20T03:43:30.448Z] 	at org.apache.maven.surefire.util.DefaultScanResult.applyFilter(DefaultScanResult.java:102)
23:43:30 [2021-03-20T03:43:30.448Z] 	at org.apache.maven.surefire.junitplatform.JUnitPlatformProvider.scanClasspath(JUnitPlatformProvider.java:143)
23:43:30 [2021-03-20T03:43:30.448Z] 	at org.apache.maven.surefire.junitplatform.JUnitPlatformProvider.invoke(JUnitPlatformProvider.java:124)
23:43:30 [2021-03-20T03:43:30.448Z] 	at java.base/jdk.internal.reflect.NativeMethodAccessorImpl.invoke0(Native Method)
23:43:30 [2021-03-20T03:43:30.448Z] 	at java.base/jdk.internal.reflect.NativeMethodAccessorImpl.invoke(NativeMethodAccessorImpl.java:64)
23:43:30 [2021-03-20T03:43:30.448Z] 	at java.base/jdk.internal.reflect.DelegatingMethodAccessorImpl.invoke(DelegatingMethodAccessorImpl.java:43)
23:43:30 [2021-03-20T03:43:30.448Z] 	at java.base/java.lang.reflect.Method.invoke(Method.java:564)
23:43:30 [2021-03-20T03:43:30.448Z] 	at org.apache.maven.surefire.util.ReflectionUtils.invokeMethodWithArray2(ReflectionUtils.java:206)
23:43:30 [2021-03-20T03:43:30.448Z] 	at org.apache.maven.surefire.booter.ProviderFactory$ProviderProxy.invoke(ProviderFactory.java:161)
23:43:30 [2021-03-20T03:43:30.448Z] 	at org.apache.maven.surefire.booter.ProviderFactory.invokeProvider(ProviderFactory.java:84)
23:43:30 [2021-03-20T03:43:30.448Z] 	at org.eclipse.tycho.surefire.osgibooter.OsgiSurefireBooter.run(OsgiSurefireBooter.java:116)
23:43:30 [2021-03-20T03:43:30.448Z] 	at org.eclipse.tycho.surefire.osgibooter.HeadlessTestApplication.start(HeadlessTestApplication.java:23)
23:43:30 [2021-03-20T03:43:30.449Z] 	at org.eclipse.equinox.internal.app.EclipseAppHandle.run(EclipseAppHandle.java:203)
23:43:30 [2021-03-20T03:43:30.449Z] 	at org.eclipse.core.runtime.internal.adaptor.EclipseAppLauncher.runApplication(EclipseAppLauncher.java:137)
23:43:30 [2021-03-20T03:43:30.449Z] 	at org.eclipse.core.runtime.internal.adaptor.EclipseAppLauncher.start(EclipseAppLauncher.java:107)
23:43:30 [2021-03-20T03:43:30.449Z] 	at org.eclipse.core.runtime.adaptor.EclipseStarter.run(EclipseStarter.java:400)
23:43:30 [2021-03-20T03:43:30.449Z] 	at org.eclipse.core.runtime.adaptor.EclipseStarter.run(EclipseStarter.java:255)
23:43:30 [2021-03-20T03:43:30.449Z] 	at java.base/jdk.internal.reflect.NativeMethodAccessorImpl.invoke0(Native Method)
23:43:30 [2021-03-20T03:43:30.449Z] 	at java.base/jdk.internal.reflect.NativeMethodAccessorImpl.invoke(NativeMethodAccessorImpl.java:64)
23:43:30 [2021-03-20T03:43:30.449Z] 	at java.base/jdk.internal.reflect.DelegatingMethodAccessorImpl.invoke(DelegatingMethodAccessorImpl.java:43)
23:43:30 [2021-03-20T03:43:30.449Z] 	at java.base/java.lang.reflect.Method.invoke(Method.java:564)
23:43:30 [2021-03-20T03:43:30.449Z] 	at org.eclipse.equinox.launcher.Main.invokeFramework(Main.java:659)
23:43:30 [2021-03-20T03:43:30.449Z] 	at org.eclipse.equinox.launcher.Main.basicRun(Main.java:595)
23:43:30 [2021-03-20T03:43:30.449Z] 	at org.eclipse.equinox.launcher.Main.run(Main.java:1501)
23:43:30 [2021-03-20T03:43:30.449Z] 	at org.eclipse.equinox.launcher.Main.main(Main.java:1474)
23:43:30 [2021-03-20T03:43:30.449Z] Caused by: java.lang.ClassNotFoundException: org.junit.runners.model.RunnerBuilder cannot be found by org.eclipse.tycho.surefire.osgibooter_2.2.0
23:43:30 [2021-03-20T03:43:30.449Z] 	at org.eclipse.osgi.internal.loader.BundleLoader.findClassInternal(BundleLoader.java:511)
23:43:30 [2021-03-20T03:43:30.449Z] 	at org.eclipse.osgi.internal.loader.BundleLoader.findClass(BundleLoader.java:422)
23:43:30 [2021-03-20T03:43:30.449Z] 	at org.eclipse.osgi.internal.loader.BundleLoader.findClass(BundleLoader.java:414)
23:43:30 [2021-03-20T03:43:30.449Z] 	at org.eclipse.osgi.internal.loader.ModuleClassLoader.loadClass(ModuleClassLoader.java:153)
23:43:30 [2021-03-20T03:43:30.449Z] 	at java.base/java.lang.ClassLoader.loadClass(ClassLoader.java:522)
23:43:30 [2021-03-20T03:43:30.449Z] 	... 31 more
23:43:30 [2021-03-20T03:43:30.449Z] 
23:43:30 [2021-03-20T03:43:30.449Z] Mar 20, 2021 3:43:30 AM org.junit.platform.launcher.core.DefaultLauncher handleThrowable
23:43:30 [2021-03-20T03:43:30.449Z] WARNING: TestEngine with ID 'junit-vintage' failed to discover tests
23:43:30 [2021-03-20T03:43:30.449Z] java.lang.NoClassDefFoundError: org/junit/runners/model/RunnerBuilder
23:43:30 [2021-03-20T03:43:30.449Z] 	at org.junit.vintage.engine.discovery.VintageDiscoverer.<init>(VintageDiscoverer.java:48)
23:43:30 [2021-03-20T03:43:30.449Z] 	at org.junit.vintage.engine.VintageTestEngine.discover(VintageTestEngine.java:65)
23:43:30 [2021-03-20T03:43:30.449Z] 	at org.junit.platform.launcher.core.DefaultLauncher.discoverEngineRoot(DefaultLauncher.java:130)
23:43:30 [2021-03-20T03:43:30.449Z] 	at org.junit.platform.launcher.core.DefaultLauncher.discoverRoot(DefaultLauncher.java:117)
23:43:30 [2021-03-20T03:43:30.449Z] 	at org.junit.platform.launcher.core.DefaultLauncher.discover(DefaultLauncher.java:82)
23:43:30 [2021-03-20T03:43:30.449Z] 	at org.apache.maven.surefire.junitplatform.TestPlanScannerFilter.accept(TestPlanScannerFilter.java:56)
23:43:30 [2021-03-20T03:43:30.449Z] 	at org.apache.maven.surefire.util.DefaultScanResult.applyFilter(DefaultScanResult.java:102)
23:43:30 [2021-03-20T03:43:30.449Z] 	at org.apache.maven.surefire.junitplatform.JUnitPlatformProvider.scanClasspath(JUnitPlatformProvider.java:143)
23:43:30 [2021-03-20T03:43:30.449Z] 	at org.apache.maven.surefire.junitplatform.JUnitPlatformProvider.invoke(JUnitPlatformProvider.java:124)
23:43:30 [2021-03-20T03:43:30.449Z] 	at java.base/jdk.internal.reflect.NativeMethodAccessorImpl.invoke0(Native Method)
23:43:30 [2021-03-20T03:43:30.449Z] 	at java.base/jdk.internal.reflect.NativeMethodAccessorImpl.invoke(NativeMethodAccessorImpl.java:64)
23:43:30 [2021-03-20T03:43:30.449Z] 	at java.base/jdk.internal.reflect.DelegatingMethodAccessorImpl.invoke(DelegatingMethodAccessorImpl.java:43)
23:43:30 [2021-03-20T03:43:30.449Z] 	at java.base/java.lang.reflect.Method.invoke(Method.java:564)
23:43:30 [2021-03-20T03:43:30.449Z] 	at org.apache.maven.surefire.util.ReflectionUtils.invokeMethodWithArray2(ReflectionUtils.java:206)
23:43:30 [2021-03-20T03:43:30.449Z] 	at org.apache.maven.surefire.booter.ProviderFactory$ProviderProxy.invoke(ProviderFactory.java:161)
23:43:30 [2021-03-20T03:43:30.449Z] 	at org.apache.maven.surefire.booter.ProviderFactory.invokeProvider(ProviderFactory.java:84)
23:43:30 [2021-03-20T03:43:30.449Z] 	at org.eclipse.tycho.surefire.osgibooter.OsgiSurefireBooter.run(OsgiSurefireBooter.java:116)
23:43:30 [2021-03-20T03:43:30.449Z] 	at org.eclipse.tycho.surefire.osgibooter.HeadlessTestApplication.start(HeadlessTestApplication.java:23)
23:43:30 [2021-03-20T03:43:30.449Z] 	at org.eclipse.equinox.internal.app.EclipseAppHandle.run(EclipseAppHandle.java:203)
23:43:30 [2021-03-20T03:43:30.449Z] 	at org.eclipse.core.runtime.internal.adaptor.EclipseAppLauncher.runApplication(EclipseAppLauncher.java:137)
23:43:30 [2021-03-20T03:43:30.449Z] 	at org.eclipse.core.runtime.internal.adaptor.EclipseAppLauncher.start(EclipseAppLauncher.java:107)
23:43:30 [2021-03-20T03:43:30.449Z] 	at org.eclipse.core.runtime.adaptor.EclipseStarter.run(EclipseStarter.java:400)
23:43:30 [2021-03-20T03:43:30.449Z] 	at org.eclipse.core.runtime.adaptor.EclipseStarter.run(EclipseStarter.java:255)
23:43:30 [2021-03-20T03:43:30.449Z] 	at java.base/jdk.internal.reflect.NativeMethodAccessorImpl.invoke0(Native Method)
23:43:30 [2021-03-20T03:43:30.449Z] 	at java.base/jdk.internal.reflect.NativeMethodAccessorImpl.invoke(NativeMethodAccessorImpl.java:64)
23:43:30 [2021-03-20T03:43:30.449Z] 	at java.base/jdk.internal.reflect.DelegatingMethodAccessorImpl.invoke(DelegatingMethodAccessorImpl.java:43)
23:43:30 [2021-03-20T03:43:30.449Z] 	at java.base/java.lang.reflect.Method.invoke(Method.java:564)
23:43:30 [2021-03-20T03:43:30.449Z] 	at org.eclipse.equinox.launcher.Main.invokeFramework(Main.java:659)
23:43:30 [2021-03-20T03:43:30.449Z] 	at org.eclipse.equinox.launcher.Main.basicRun(Main.java:595)
23:43:30 [2021-03-20T03:43:30.449Z] 	at org.eclipse.equinox.launcher.Main.run(Main.java:1501)
23:43:30 [2021-03-20T03:43:30.449Z] 	at org.eclipse.equinox.launcher.Main.main(Main.java:1474)
23:43:30 [2021-03-20T03:43:30.449Z] Caused by: java.lang.ClassNotFoundException: org.junit.runners.model.RunnerBuilder cannot be found by org.eclipse.tycho.surefire.osgibooter_2.2.0
23:43:30 [2021-03-20T03:43:30.449Z] 	at org.eclipse.osgi.internal.loader.BundleLoader.findClassInternal(BundleLoader.java:511)
23:43:30 [2021-03-20T03:43:30.449Z] 	at org.eclipse.osgi.internal.loader.BundleLoader.findClass(BundleLoader.java:422)
23:43:30 [2021-03-20T03:43:30.449Z] 	at org.eclipse.osgi.internal.loader.BundleLoader.findClass(BundleLoader.java:414)
23:43:30 [2021-03-20T03:43:30.449Z] 	at org.eclipse.osgi.internal.loader.ModuleClassLoader.loadClass(ModuleClassLoader.java:153)
23:43:30 [2021-03-20T03:43:30.449Z] 	at java.base/java.lang.ClassLoader.loadClass(ClassLoader.java:522)
23:43:30 [2021-03-20T03:43:30.449Z] 	... 31 more
23:43:30 [2021-03-20T03:43:30.449Z] 
23:43:30 [2021-03-20T03:43:30.449Z] Mar 20, 2021 3:43:30 AM org.junit.platform.launcher.core.DefaultLauncher handleThrowable
23:43:30 [2021-03-20T03:43:30.449Z] WARNING: TestEngine with ID 'junit-vintage' failed to discover tests
23:43:30 [2021-03-20T03:43:30.449Z] java.lang.NoClassDefFoundError: org/junit/runners/model/RunnerBuilder
23:43:30 [2021-03-20T03:43:30.449Z] 	at org.junit.vintage.engine.discovery.VintageDiscoverer.<init>(VintageDiscoverer.java:48)
23:43:30 [2021-03-20T03:43:30.449Z] 	at org.junit.vintage.engine.VintageTestEngine.discover(VintageTestEngine.java:65)
23:43:30 [2021-03-20T03:43:30.449Z] 	at org.junit.platform.launcher.core.DefaultLauncher.discoverEngineRoot(DefaultLauncher.java:130)
23:43:30 [2021-03-20T03:43:30.450Z] 	at org.junit.platform.launcher.core.DefaultLauncher.discoverRoot(DefaultLauncher.java:117)
23:43:30 [2021-03-20T03:43:30.450Z] 	at org.junit.platform.launcher.core.DefaultLauncher.discover(DefaultLauncher.java:82)
23:43:30 [2021-03-20T03:43:30.450Z] 	at org.apache.maven.surefire.junitplatform.TestPlanScannerFilter.accept(TestPlanScannerFilter.java:56)
23:43:30 [2021-03-20T03:43:30.450Z] 	at org.apache.maven.surefire.util.DefaultScanResult.applyFilter(DefaultScanResult.java:102)
23:43:30 [2021-03-20T03:43:30.450Z] 	at org.apache.maven.surefire.junitplatform.JUnitPlatformProvider.scanClasspath(JUnitPlatformProvider.java:143)
23:43:30 [2021-03-20T03:43:30.450Z] 	at org.apache.maven.surefire.junitplatform.JUnitPlatformProvider.invoke(JUnitPlatformProvider.java:124)
23:43:30 [2021-03-20T03:43:30.450Z] 	at java.base/jdk.internal.reflect.NativeMethodAccessorImpl.invoke0(Native Method)
23:43:30 [2021-03-20T03:43:30.450Z] 	at java.base/jdk.internal.reflect.NativeMethodAccessorImpl.invoke(NativeMethodAccessorImpl.java:64)
23:43:30 [2021-03-20T03:43:30.450Z] 	at java.base/jdk.internal.reflect.DelegatingMethodAccessorImpl.invoke(DelegatingMethodAccessorImpl.java:43)
23:43:30 [2021-03-20T03:43:30.450Z] 	at java.base/java.lang.reflect.Method.invoke(Method.java:564)
23:43:30 [2021-03-20T03:43:30.450Z] 	at org.apache.maven.surefire.util.ReflectionUtils.invokeMethodWithArray2(ReflectionUtils.java:206)
23:43:30 [2021-03-20T03:43:30.450Z] 	at org.apache.maven.surefire.booter.ProviderFactory$ProviderProxy.invoke(ProviderFactory.java:161)
23:43:30 [2021-03-20T03:43:30.450Z] 	at org.apache.maven.surefire.booter.ProviderFactory.invokeProvider(ProviderFactory.java:84)
23:43:30 [2021-03-20T03:43:30.450Z] 	at org.eclipse.tycho.surefire.osgibooter.OsgiSurefireBooter.run(OsgiSurefireBooter.java:116)
23:43:30 [2021-03-20T03:43:30.450Z] 	at org.eclipse.tycho.surefire.osgibooter.HeadlessTestApplication.start(HeadlessTestApplication.java:23)
23:43:30 [2021-03-20T03:43:30.450Z] 	at org.eclipse.equinox.internal.app.EclipseAppHandle.run(EclipseAppHandle.java:203)
23:43:30 [2021-03-20T03:43:30.450Z] 	at org.eclipse.core.runtime.internal.adaptor.EclipseAppLauncher.runApplication(EclipseAppLauncher.java:137)
23:43:30 [2021-03-20T03:43:30.450Z] 	at org.eclipse.core.runtime.internal.adaptor.EclipseAppLauncher.start(EclipseAppLauncher.java:107)
23:43:30 [2021-03-20T03:43:30.450Z] 	at org.eclipse.core.runtime.adaptor.EclipseStarter.run(EclipseStarter.java:400)
23:43:30 [2021-03-20T03:43:30.450Z] 	at org.eclipse.core.runtime.adaptor.EclipseStarter.run(EclipseStarter.java:255)
23:43:30 [2021-03-20T03:43:30.450Z] 	at java.base/jdk.internal.reflect.NativeMethodAccessorImpl.invoke0(Native Method)
23:43:30 [2021-03-20T03:43:30.450Z] 	at java.base/jdk.internal.reflect.NativeMethodAccessorImpl.invoke(NativeMethodAccessorImpl.java:64)
23:43:30 [2021-03-20T03:43:30.450Z] 	at java.base/jdk.internal.reflect.DelegatingMethodAccessorImpl.invoke(DelegatingMethodAccessorImpl.java:43)
23:43:30 [2021-03-20T03:43:30.450Z] 	at java.base/java.lang.reflect.Method.invoke(Method.java:564)
23:43:30 [2021-03-20T03:43:30.450Z] 	at org.eclipse.equinox.launcher.Main.invokeFramework(Main.java:659)
23:43:30 [2021-03-20T03:43:30.450Z] 	at org.eclipse.equinox.launcher.Main.basicRun(Main.java:595)
23:43:30 [2021-03-20T03:43:30.450Z] 	at org.eclipse.equinox.launcher.Main.run(Main.java:1501)
23:43:30 [2021-03-20T03:43:30.450Z] 	at org.eclipse.equinox.launcher.Main.main(Main.java:1474)
23:43:30 [2021-03-20T03:43:30.450Z] Caused by: java.lang.ClassNotFoundException: org.junit.runners.model.RunnerBuilder cannot be found by org.eclipse.tycho.surefire.osgibooter_2.2.0
23:43:30 [2021-03-20T03:43:30.450Z] 	at org.eclipse.osgi.internal.loader.BundleLoader.findClassInternal(BundleLoader.java:511)
23:43:30 [2021-03-20T03:43:30.450Z] 	at org.eclipse.osgi.internal.loader.BundleLoader.findClass(BundleLoader.java:422)
23:43:30 [2021-03-20T03:43:30.450Z] 	at org.eclipse.osgi.internal.loader.BundleLoader.findClass(BundleLoader.java:414)
23:43:30 [2021-03-20T03:43:30.450Z] 	at org.eclipse.osgi.internal.loader.ModuleClassLoader.loadClass(ModuleClassLoader.java:153)
23:43:30 [2021-03-20T03:43:30.450Z] 	at java.base/java.lang.ClassLoader.loadClass(ClassLoader.java:522)
23:43:30 [2021-03-20T03:43:30.450Z] 	... 31 more
23:43:30 [2021-03-20T03:43:30.450Z] 
23:43:30 [2021-03-20T03:43:30.450Z] Mar 20, 2021 3:43:30 AM org.junit.platform.launcher.core.DefaultLauncher handleThrowable
23:43:30 [2021-03-20T03:43:30.450Z] WARNING: TestEngine with ID 'junit-vintage' failed to discover tests
23:43:30 [2021-03-20T03:43:30.450Z] java.lang.NoClassDefFoundError: org/junit/runners/model/RunnerBuilder
23:43:30 [2021-03-20T03:43:30.450Z] 	at org.junit.vintage.engine.discovery.VintageDiscoverer.<init>(VintageDiscoverer.java:48)
23:43:30 [2021-03-20T03:43:30.450Z] 	at org.junit.vintage.engine.VintageTestEngine.discover(VintageTestEngine.java:65)
23:43:30 [2021-03-20T03:43:30.450Z] 	at org.junit.platform.launcher.core.DefaultLauncher.discoverEngineRoot(DefaultLauncher.java:130)
23:43:30 [2021-03-20T03:43:30.450Z] 	at org.junit.platform.launcher.core.DefaultLauncher.discoverRoot(DefaultLauncher.java:117)
23:43:30 [2021-03-20T03:43:30.450Z] 	at org.junit.platform.launcher.core.DefaultLauncher.discover(DefaultLauncher.java:82)
23:43:30 [2021-03-20T03:43:30.450Z] 	at org.apache.maven.surefire.junitplatform.TestPlanScannerFilter.accept(TestPlanScannerFilter.java:56)
23:43:30 [2021-03-20T03:43:30.450Z] 	at org.apache.maven.surefire.util.DefaultScanResult.applyFilter(DefaultScanResult.java:102)
23:43:30 [2021-03-20T03:43:30.450Z] 	at org.apache.maven.surefire.junitplatform.JUnitPlatformProvider.scanClasspath(JUnitPlatformProvider.java:143)
23:43:30 [2021-03-20T03:43:30.450Z] 	at org.apache.maven.surefire.junitplatform.JUnitPlatformProvider.invoke(JUnitPlatformProvider.java:124)
23:43:30 [2021-03-20T03:43:30.450Z] 	at java.base/jdk.internal.reflect.NativeMethodAccessorImpl.invoke0(Native Method)
23:43:30 [2021-03-20T03:43:30.450Z] 	at java.base/jdk.internal.reflect.NativeMethodAccessorImpl.invoke(NativeMethodAccessorImpl.java:64)
23:43:30 [2021-03-20T03:43:30.450Z] 	at java.base/jdk.internal.reflect.DelegatingMethodAccessorImpl.invoke(DelegatingMethodAccessorImpl.java:43)
23:43:30 [2021-03-20T03:43:30.450Z] 	at java.base/java.lang.reflect.Method.invoke(Method.java:564)
23:43:30 [2021-03-20T03:43:30.450Z] 	at org.apache.maven.surefire.util.ReflectionUtils.invokeMethodWithArray2(ReflectionUtils.java:206)
23:43:30 [2021-03-20T03:43:30.450Z] 	at org.apache.maven.surefire.booter.ProviderFactory$ProviderProxy.invoke(ProviderFactory.java:161)
23:43:30 [2021-03-20T03:43:30.450Z] 	at org.apache.maven.surefire.booter.ProviderFactory.invokeProvider(ProviderFactory.java:84)
23:43:30 [2021-03-20T03:43:30.450Z] 	at org.eclipse.tycho.surefire.osgibooter.OsgiSurefireBooter.run(OsgiSurefireBooter.java:116)
23:43:30 [2021-03-20T03:43:30.450Z] 	at org.eclipse.tycho.surefire.osgibooter.HeadlessTestApplication.start(HeadlessTestApplication.java:23)
23:43:30 [2021-03-20T03:43:30.450Z] 	at org.eclipse.equinox.internal.app.EclipseAppHandle.run(EclipseAppHandle.java:203)
23:43:30 [2021-03-20T03:43:30.450Z] 	at org.eclipse.core.runtime.internal.adaptor.EclipseAppLauncher.runApplication(EclipseAppLauncher.java:137)
23:43:30 [2021-03-20T03:43:30.450Z] 	at org.eclipse.core.runtime.internal.adaptor.EclipseAppLauncher.start(EclipseAppLauncher.java:107)
23:43:30 [2021-03-20T03:43:30.450Z] 	at org.eclipse.core.runtime.adaptor.EclipseStarter.run(EclipseStarter.java:400)
23:43:30 [2021-03-20T03:43:30.450Z] 	at org.eclipse.core.runtime.adaptor.EclipseStarter.run(EclipseStarter.java:255)
23:43:30 [2021-03-20T03:43:30.450Z] 	at java.base/jdk.internal.reflect.NativeMethodAccessorImpl.invoke0(Native Method)
23:43:30 [2021-03-20T03:43:30.450Z] 	at java.base/jdk.internal.reflect.NativeMethodAccessorImpl.invoke(NativeMethodAccessorImpl.java:64)
23:43:30 [2021-03-20T03:43:30.450Z] 	at java.base/jdk.internal.reflect.DelegatingMethodAccessorImpl.invoke(DelegatingMethodAccessorImpl.java:43)
23:43:30 [2021-03-20T03:43:30.450Z] 	at java.base/java.lang.reflect.Method.invoke(Method.java:564)
23:43:30 [2021-03-20T03:43:30.450Z] 	at org.eclipse.equinox.launcher.Main.invokeFramework(Main.java:659)
23:43:30 [2021-03-20T03:43:30.450Z] 	at org.eclipse.equinox.launcher.Main.basicRun(Main.java:595)
23:43:30 [2021-03-20T03:43:30.450Z] 	at org.eclipse.equinox.launcher.Main.run(Main.java:1501)
23:43:30 [2021-03-20T03:43:30.450Z] 	at org.eclipse.equinox.launcher.Main.main(Main.java:1474)
23:43:30 [2021-03-20T03:43:30.450Z] Caused by: java.lang.ClassNotFoundException: org.junit.runners.model.RunnerBuilder cannot be found by org.eclipse.tycho.surefire.osgibooter_2.2.0
23:43:30 [2021-03-20T03:43:30.450Z] 	at org.eclipse.osgi.internal.loader.BundleLoader.findClassInternal(BundleLoader.java:511)
23:43:30 [2021-03-20T03:43:30.451Z] 	at org.eclipse.osgi.internal.loader.BundleLoader.findClass(BundleLoader.java:422)
23:43:30 [2021-03-20T03:43:30.451Z] 	at org.eclipse.osgi.internal.loader.BundleLoader.findClass(BundleLoader.java:414)
23:43:30 [2021-03-20T03:43:30.451Z] 	at org.eclipse.osgi.internal.loader.ModuleClassLoader.loadClass(ModuleClassLoader.java:153)
23:43:30 [2021-03-20T03:43:30.451Z] 	at java.base/java.lang.ClassLoader.loadClass(ClassLoader.java:522)
23:43:30 [2021-03-20T03:43:30.451Z] 	... 31 more
23:43:30 [2021-03-20T03:43:30.451Z] 
23:43:30 [2021-03-20T03:43:30.451Z] Mar 20, 2021 3:43:30 AM org.junit.platform.launcher.core.DefaultLauncher handleThrowable
23:43:30 [2021-03-20T03:43:30.451Z] WARNING: TestEngine with ID 'junit-vintage' failed to discover tests
23:43:30 [2021-03-20T03:43:30.451Z] java.lang.NoClassDefFoundError: org/junit/runners/model/RunnerBuilder
23:43:30 [2021-03-20T03:43:30.451Z] 	at org.junit.vintage.engine.discovery.VintageDiscoverer.<init>(VintageDiscoverer.java:48)
23:43:30 [2021-03-20T03:43:30.451Z] 	at org.junit.vintage.engine.VintageTestEngine.discover(VintageTestEngine.java:65)
23:43:30 [2021-03-20T03:43:30.451Z] 	at org.junit.platform.launcher.core.DefaultLauncher.discoverEngineRoot(DefaultLauncher.java:130)
23:43:30 [2021-03-20T03:43:30.451Z] 	at org.junit.platform.launcher.core.DefaultLauncher.discoverRoot(DefaultLauncher.java:117)
23:43:30 [2021-03-20T03:43:30.451Z] 	at org.junit.platform.launcher.core.DefaultLauncher.discover(DefaultLauncher.java:82)
23:43:30 [2021-03-20T03:43:30.451Z] 	at org.apache.maven.surefire.junitplatform.TestPlanScannerFilter.accept(TestPlanScannerFilter.java:56)
23:43:30 [2021-03-20T03:43:30.451Z] 	at org.apache.maven.surefire.util.DefaultScanResult.applyFilter(DefaultScanResult.java:102)
23:43:30 [2021-03-20T03:43:30.451Z] 	at org.apache.maven.surefire.junitplatform.JUnitPlatformProvider.scanClasspath(JUnitPlatformProvider.java:143)
23:43:30 [2021-03-20T03:43:30.451Z] 	at org.apache.maven.surefire.junitplatform.JUnitPlatformProvider.invoke(JUnitPlatformProvider.java:124)
23:43:30 [2021-03-20T03:43:30.451Z] 	at java.base/jdk.internal.reflect.NativeMethodAccessorImpl.invoke0(Native Method)
23:43:30 [2021-03-20T03:43:30.451Z] 	at java.base/jdk.internal.reflect.NativeMethodAccessorImpl.invoke(NativeMethodAccessorImpl.java:64)
23:43:30 [2021-03-20T03:43:30.451Z] 	at java.base/jdk.internal.reflect.DelegatingMethodAccessorImpl.invoke(DelegatingMethodAccessorImpl.java:43)
23:43:30 [2021-03-20T03:43:30.451Z] 	at java.base/java.lang.reflect.Method.invoke(Method.java:564)
23:43:30 [2021-03-20T03:43:30.451Z] 	at org.apache.maven.surefire.util.ReflectionUtils.invokeMethodWithArray2(ReflectionUtils.java:206)
23:43:30 [2021-03-20T03:43:30.451Z] 	at org.apache.maven.surefire.booter.ProviderFactory$ProviderProxy.invoke(ProviderFactory.java:161)
23:43:30 [2021-03-20T03:43:30.451Z] 	at org.apache.maven.surefire.booter.ProviderFactory.invokeProvider(ProviderFactory.java:84)
23:43:30 [2021-03-20T03:43:30.451Z] 	at org.eclipse.tycho.surefire.osgibooter.OsgiSurefireBooter.run(OsgiSurefireBooter.java:116)
23:43:30 [2021-03-20T03:43:30.451Z] 	at org.eclipse.tycho.surefire.osgibooter.HeadlessTestApplication.start(HeadlessTestApplication.java:23)
23:43:30 [2021-03-20T03:43:30.451Z] 	at org.eclipse.equinox.internal.app.EclipseAppHandle.run(EclipseAppHandle.java:203)
23:43:30 [2021-03-20T03:43:30.451Z] 	at org.eclipse.core.runtime.internal.adaptor.EclipseAppLauncher.runApplication(EclipseAppLauncher.java:137)
23:43:30 [2021-03-20T03:43:30.451Z] 	at org.eclipse.core.runtime.internal.adaptor.EclipseAppLauncher.start(EclipseAppLauncher.java:107)
23:43:30 [2021-03-20T03:43:30.451Z] 	at org.eclipse.core.runtime.adaptor.EclipseStarter.run(EclipseStarter.java:400)
23:43:30 [2021-03-20T03:43:30.451Z] 	at org.eclipse.core.runtime.adaptor.EclipseStarter.run(EclipseStarter.java:255)
23:43:30 [2021-03-20T03:43:30.451Z] 	at java.base/jdk.internal.reflect.NativeMethodAccessorImpl.invoke0(Native Method)
23:43:30 [2021-03-20T03:43:30.451Z] 	at java.base/jdk.internal.reflect.NativeMethodAccessorImpl.invoke(NativeMethodAccessorImpl.java:64)
23:43:30 [2021-03-20T03:43:30.451Z] 	at java.base/jdk.internal.reflect.DelegatingMethodAccessorImpl.invoke(DelegatingMethodAccessorImpl.java:43)
23:43:30 [2021-03-20T03:43:30.451Z] 	at java.base/java.lang.reflect.Method.invoke(Method.java:564)
23:43:30 [2021-03-20T03:43:30.451Z] 	at org.eclipse.equinox.launcher.Main.invokeFramework(Main.java:659)
23:43:30 [2021-03-20T03:43:30.451Z] 	at org.eclipse.equinox.launcher.Main.basicRun(Main.java:595)
23:43:30 [2021-03-20T03:43:30.451Z] 	at org.eclipse.equinox.launcher.Main.run(Main.java:1501)
23:43:30 [2021-03-20T03:43:30.451Z] 	at org.eclipse.equinox.launcher.Main.main(Main.java:1474)
23:43:30 [2021-03-20T03:43:30.451Z] Caused by: java.lang.ClassNotFoundException: org.junit.runners.model.RunnerBuilder cannot be found by org.eclipse.tycho.surefire.osgibooter_2.2.0
23:43:30 [2021-03-20T03:43:30.451Z] 	at org.eclipse.osgi.internal.loader.BundleLoader.findClassInternal(BundleLoader.java:511)
23:43:30 [2021-03-20T03:43:30.451Z] 	at org.eclipse.osgi.internal.loader.BundleLoader.findClass(BundleLoader.java:422)
23:43:30 [2021-03-20T03:43:30.451Z] 	at org.eclipse.osgi.internal.loader.BundleLoader.findClass(BundleLoader.java:414)
23:43:30 [2021-03-20T03:43:30.451Z] 	at org.eclipse.osgi.internal.loader.ModuleClassLoader.loadClass(ModuleClassLoader.java:153)
23:43:30 [2021-03-20T03:43:30.451Z] 	at java.base/java.lang.ClassLoader.loadClass(ClassLoader.java:522)
23:43:30 [2021-03-20T03:43:30.451Z] 	... 31 more
23:43:30 [2021-03-20T03:43:30.451Z] 
23:43:30 [2021-03-20T03:43:30.451Z] Mar 20, 2021 3:43:30 AM org.junit.platform.launcher.core.DefaultLauncher handleThrowable
23:43:30 [2021-03-20T03:43:30.451Z] WARNING: TestEngine with ID 'junit-vintage' failed to discover tests
23:43:30 [2021-03-20T03:43:30.451Z] java.lang.NoClassDefFoundError: org/junit/runners/model/RunnerBuilder
23:43:30 [2021-03-20T03:43:30.451Z] 	at org.junit.vintage.engine.discovery.VintageDiscoverer.<init>(VintageDiscoverer.java:48)
23:43:30 [2021-03-20T03:43:30.451Z] 	at org.junit.vintage.engine.VintageTestEngine.discover(VintageTestEngine.java:65)
23:43:30 [2021-03-20T03:43:30.451Z] 	at org.junit.platform.launcher.core.DefaultLauncher.discoverEngineRoot(DefaultLauncher.java:130)
23:43:30 [2021-03-20T03:43:30.451Z] 	at org.junit.platform.launcher.core.DefaultLauncher.discoverRoot(DefaultLauncher.java:117)
23:43:30 [2021-03-20T03:43:30.451Z] 	at org.junit.platform.launcher.core.DefaultLauncher.discover(DefaultLauncher.java:82)
23:43:30 [2021-03-20T03:43:30.451Z] 	at org.apache.maven.surefire.junitplatform.TestPlanScannerFilter.accept(TestPlanScannerFilter.java:56)
23:43:30 [2021-03-20T03:43:30.451Z] 	at org.apache.maven.surefire.util.DefaultScanResult.applyFilter(DefaultScanResult.java:102)
23:43:30 [2021-03-20T03:43:30.451Z] 	at org.apache.maven.surefire.junitplatform.JUnitPlatformProvider.scanClasspath(JUnitPlatformProvider.java:143)
23:43:30 [2021-03-20T03:43:30.451Z] 	at org.apache.maven.surefire.junitplatform.JUnitPlatformProvider.invoke(JUnitPlatformProvider.java:124)
23:43:30 [2021-03-20T03:43:30.451Z] 	at java.base/jdk.internal.reflect.NativeMethodAccessorImpl.invoke0(Native Method)
23:43:30 [2021-03-20T03:43:30.451Z] 	at java.base/jdk.internal.reflect.NativeMethodAccessorImpl.invoke(NativeMethodAccessorImpl.java:64)
23:43:30 [2021-03-20T03:43:30.451Z] 	at java.base/jdk.internal.reflect.DelegatingMethodAccessorImpl.invoke(DelegatingMethodAccessorImpl.java:43)
23:43:30 [2021-03-20T03:43:30.451Z] 	at java.base/java.lang.reflect.Method.invoke(Method.java:564)
23:43:30 [2021-03-20T03:43:30.451Z] 	at org.apache.maven.surefire.util.ReflectionUtils.invokeMethodWithArray2(ReflectionUtils.java:206)
23:43:30 [2021-03-20T03:43:30.451Z] 	at org.apache.maven.surefire.booter.ProviderFactory$ProviderProxy.invoke(ProviderFactory.java:161)
23:43:30 [2021-03-20T03:43:30.451Z] 	at org.apache.maven.surefire.booter.ProviderFactory.invokeProvider(ProviderFactory.java:84)
23:43:30 [2021-03-20T03:43:30.451Z] 	at org.eclipse.tycho.surefire.osgibooter.OsgiSurefireBooter.run(OsgiSurefireBooter.java:116)
23:43:30 [2021-03-20T03:43:30.451Z] 	at org.eclipse.tycho.surefire.osgibooter.HeadlessTestApplication.start(HeadlessTestApplication.java:23)
23:43:30 [2021-03-20T03:43:30.451Z] 	at org.eclipse.equinox.internal.app.EclipseAppHandle.run(EclipseAppHandle.java:203)
23:43:30 [2021-03-20T03:43:30.451Z] 	at org.eclipse.core.runtime.internal.adaptor.EclipseAppLauncher.runApplication(EclipseAppLauncher.java:137)
23:43:30 [2021-03-20T03:43:30.451Z] 	at org.eclipse.core.runtime.internal.adaptor.EclipseAppLauncher.start(EclipseAppLauncher.java:107)
23:43:30 [2021-03-20T03:43:30.451Z] 	at org.eclipse.core.runtime.adaptor.EclipseStarter.run(EclipseStarter.java:400)
23:43:30 [2021-03-20T03:43:30.451Z] 	at org.eclipse.core.runtime.adaptor.EclipseStarter.run(EclipseStarter.java:255)
23:43:30 [2021-03-20T03:43:30.451Z] 	at java.base/jdk.internal.reflect.NativeMethodAccessorImpl.invoke0(Native Method)
23:43:30 [2021-03-20T03:43:30.452Z] 	at java.base/jdk.internal.reflect.NativeMethodAccessorImpl.invoke(NativeMethodAccessorImpl.java:64)
23:43:30 [2021-03-20T03:43:30.452Z] 	at java.base/jdk.internal.reflect.DelegatingMethodAccessorImpl.invoke(DelegatingMethodAccessorImpl.java:43)
23:43:30 [2021-03-20T03:43:30.452Z] 	at java.base/java.lang.reflect.Method.invoke(Method.java:564)
23:43:30 [2021-03-20T03:43:30.452Z] 	at org.eclipse.equinox.launcher.Main.invokeFramework(Main.java:659)
23:43:30 [2021-03-20T03:43:30.452Z] 	at org.eclipse.equinox.launcher.Main.basicRun(Main.java:595)
23:43:30 [2021-03-20T03:43:30.452Z] 	at org.eclipse.equinox.launcher.Main.run(Main.java:1501)
23:43:30 [2021-03-20T03:43:30.452Z] 	at org.eclipse.equinox.launcher.Main.main(Main.java:1474)
23:43:30 [2021-03-20T03:43:30.452Z] Caused by: java.lang.ClassNotFoundException: org.junit.runners.model.RunnerBuilder cannot be found by org.eclipse.tycho.surefire.osgibooter_2.2.0
23:43:30 [2021-03-20T03:43:30.452Z] 	at org.eclipse.osgi.internal.loader.BundleLoader.findClassInternal(BundleLoader.java:511)
23:43:30 [2021-03-20T03:43:30.452Z] 	at org.eclipse.osgi.internal.loader.BundleLoader.findClass(BundleLoader.java:422)
23:43:30 [2021-03-20T03:43:30.452Z] 	at org.eclipse.osgi.internal.loader.BundleLoader.findClass(BundleLoader.java:414)
23:43:30 [2021-03-20T03:43:30.452Z] 	at org.eclipse.osgi.internal.loader.ModuleClassLoader.loadClass(ModuleClassLoader.java:153)
23:43:30 [2021-03-20T03:43:30.452Z] 	at java.base/java.lang.ClassLoader.loadClass(ClassLoader.java:522)
23:43:30 [2021-03-20T03:43:30.452Z] 	... 31 more
23:43:30 [2021-03-20T03:43:30.452Z] 
23:43:30 [2021-03-20T03:43:30.452Z] Mar 20, 2021 3:43:30 AM org.junit.platform.launcher.core.DefaultLauncher handleThrowable
23:43:30 [2021-03-20T03:43:30.452Z] WARNING: TestEngine with ID 'junit-vintage' failed to discover tests
23:43:30 [2021-03-20T03:43:30.452Z] java.lang.NoClassDefFoundError: org/junit/runners/model/RunnerBuilder
23:43:30 [2021-03-20T03:43:30.452Z] 	at org.junit.vintage.engine.discovery.VintageDiscoverer.<init>(VintageDiscoverer.java:48)
23:43:30 [2021-03-20T03:43:30.452Z] 	at org.junit.vintage.engine.VintageTestEngine.discover(VintageTestEngine.java:65)
23:43:30 [2021-03-20T03:43:30.452Z] 	at org.junit.platform.launcher.core.DefaultLauncher.discoverEngineRoot(DefaultLauncher.java:130)
23:43:30 [2021-03-20T03:43:30.452Z] 	at org.junit.platform.launcher.core.DefaultLauncher.discoverRoot(DefaultLauncher.java:117)
23:43:30 [2021-03-20T03:43:30.452Z] 	at org.junit.platform.launcher.core.DefaultLauncher.discover(DefaultLauncher.java:82)
23:43:30 [2021-03-20T03:43:30.452Z] 	at org.apache.maven.surefire.junitplatform.TestPlanScannerFilter.accept(TestPlanScannerFilter.java:56)
23:43:30 [2021-03-20T03:43:30.452Z] 	at org.apache.maven.surefire.util.DefaultScanResult.applyFilter(DefaultScanResult.java:102)
23:43:30 [2021-03-20T03:43:30.452Z] 	at org.apache.maven.surefire.junitplatform.JUnitPlatformProvider.scanClasspath(JUnitPlatformProvider.java:143)
23:43:30 [2021-03-20T03:43:30.452Z] 	at org.apache.maven.surefire.junitplatform.JUnitPlatformProvider.invoke(JUnitPlatformProvider.java:124)
23:43:30 [2021-03-20T03:43:30.452Z] 	at java.base/jdk.internal.reflect.NativeMethodAccessorImpl.invoke0(Native Method)
23:43:30 [2021-03-20T03:43:30.452Z] 	at java.base/jdk.internal.reflect.NativeMethodAccessorImpl.invoke(NativeMethodAccessorImpl.java:64)
23:43:30 [2021-03-20T03:43:30.452Z] 	at java.base/jdk.internal.reflect.DelegatingMethodAccessorImpl.invoke(DelegatingMethodAccessorImpl.java:43)
23:43:30 [2021-03-20T03:43:30.452Z] 	at java.base/java.lang.reflect.Method.invoke(Method.java:564)
23:43:30 [2021-03-20T03:43:30.452Z] 	at org.apache.maven.surefire.util.ReflectionUtils.invokeMethodWithArray2(ReflectionUtils.java:206)
23:43:30 [2021-03-20T03:43:30.452Z] 	at org.apache.maven.surefire.booter.ProviderFactory$ProviderProxy.invoke(ProviderFactory.java:161)
23:43:30 [2021-03-20T03:43:30.452Z] 	at org.apache.maven.surefire.booter.ProviderFactory.invokeProvider(ProviderFactory.java:84)
23:43:30 [2021-03-20T03:43:30.452Z] 	at org.eclipse.tycho.surefire.osgibooter.OsgiSurefireBooter.run(OsgiSurefireBooter.java:116)
23:43:30 [2021-03-20T03:43:30.452Z] 	at org.eclipse.tycho.surefire.osgibooter.HeadlessTestApplication.start(HeadlessTestApplication.java:23)
23:43:30 [2021-03-20T03:43:30.452Z] 	at org.eclipse.equinox.internal.app.EclipseAppHandle.run(EclipseAppHandle.java:203)
23:43:30 [2021-03-20T03:43:30.452Z] 	at org.eclipse.core.runtime.internal.adaptor.EclipseAppLauncher.runApplication(EclipseAppLauncher.java:137)
23:43:30 [2021-03-20T03:43:30.452Z] 	at org.eclipse.core.runtime.internal.adaptor.EclipseAppLauncher.start(EclipseAppLauncher.java:107)
23:43:30 [2021-03-20T03:43:30.452Z] 	at org.eclipse.core.runtime.adaptor.EclipseStarter.run(EclipseStarter.java:400)
23:43:30 [2021-03-20T03:43:30.452Z] 	at org.eclipse.core.runtime.adaptor.EclipseStarter.run(EclipseStarter.java:255)
23:43:30 [2021-03-20T03:43:30.452Z] 	at java.base/jdk.internal.reflect.NativeMethodAccessorImpl.invoke0(Native Method)
23:43:30 [2021-03-20T03:43:30.452Z] 	at java.base/jdk.internal.reflect.NativeMethodAccessorImpl.invoke(NativeMethodAccessorImpl.java:64)
23:43:30 [2021-03-20T03:43:30.452Z] 	at java.base/jdk.internal.reflect.DelegatingMethodAccessorImpl.invoke(DelegatingMethodAccessorImpl.java:43)
23:43:30 [2021-03-20T03:43:30.452Z] 	at java.base/java.lang.reflect.Method.invoke(Method.java:564)
23:43:30 [2021-03-20T03:43:30.452Z] 	at org.eclipse.equinox.launcher.Main.invokeFramework(Main.java:659)
23:43:30 [2021-03-20T03:43:30.452Z] 	at org.eclipse.equinox.launcher.Main.basicRun(Main.java:595)
23:43:30 [2021-03-20T03:43:30.452Z] 	at org.eclipse.equinox.launcher.Main.run(Main.java:1501)
23:43:30 [2021-03-20T03:43:30.452Z] 	at org.eclipse.equinox.launcher.Main.main(Main.java:1474)
23:43:30 [2021-03-20T03:43:30.452Z] Caused by: java.lang.ClassNotFoundException: org.junit.runners.model.RunnerBuilder cannot be found by org.eclipse.tycho.surefire.osgibooter_2.2.0
23:43:30 [2021-03-20T03:43:30.452Z] 	at org.eclipse.osgi.internal.loader.BundleLoader.findClassInternal(BundleLoader.java:511)
23:43:30 [2021-03-20T03:43:30.452Z] 	at org.eclipse.osgi.internal.loader.BundleLoader.findClass(BundleLoader.java:422)
23:43:30 [2021-03-20T03:43:30.452Z] 	at org.eclipse.osgi.internal.loader.BundleLoader.findClass(BundleLoader.java:414)
23:43:30 [2021-03-20T03:43:30.452Z] 	at org.eclipse.osgi.internal.loader.ModuleClassLoader.loadClass(ModuleClassLoader.java:153)
23:43:30 [2021-03-20T03:43:30.452Z] 	at java.base/java.lang.ClassLoader.loadClass(ClassLoader.java:522)
23:43:30 [2021-03-20T03:43:30.452Z] 	... 31 more
23:43:30 [2021-03-20T03:43:30.452Z] 
23:43:30 [2021-03-20T03:43:30.452Z] Mar 20, 2021 3:43:30 AM org.junit.platform.launcher.core.DefaultLauncher handleThrowable
23:43:30 [2021-03-20T03:43:30.452Z] WARNING: TestEngine with ID 'junit-vintage' failed to discover tests
23:43:30 [2021-03-20T03:43:30.452Z] java.lang.NoClassDefFoundError: org/junit/runners/model/RunnerBuilder
23:43:30 [2021-03-20T03:43:30.452Z] 	at org.junit.vintage.engine.discovery.VintageDiscoverer.<init>(VintageDiscoverer.java:48)
23:43:30 [2021-03-20T03:43:30.452Z] 	at org.junit.vintage.engine.VintageTestEngine.discover(VintageTestEngine.java:65)
23:43:30 [2021-03-20T03:43:30.452Z] 	at org.junit.platform.launcher.core.DefaultLauncher.discoverEngineRoot(DefaultLauncher.java:130)
23:43:30 [2021-03-20T03:43:30.452Z] 	at org.junit.platform.launcher.core.DefaultLauncher.discoverRoot(DefaultLauncher.java:117)
23:43:30 [2021-03-20T03:43:30.452Z] 	at org.junit.platform.launcher.core.DefaultLauncher.discover(DefaultLauncher.java:82)
23:43:30 [2021-03-20T03:43:30.452Z] 	at org.apache.maven.surefire.junitplatform.TestPlanScannerFilter.accept(TestPlanScannerFilter.java:56)
23:43:30 [2021-03-20T03:43:30.452Z] 	at org.apache.maven.surefire.util.DefaultScanResult.applyFilter(DefaultScanResult.java:102)
23:43:30 [2021-03-20T03:43:30.452Z] 	at org.apache.maven.surefire.junitplatform.JUnitPlatformProvider.scanClasspath(JUnitPlatformProvider.java:143)
23:43:30 [2021-03-20T03:43:30.452Z] 	at org.apache.maven.surefire.junitplatform.JUnitPlatformProvider.invoke(JUnitPlatformProvider.java:124)
23:43:30 [2021-03-20T03:43:30.452Z] 	at java.base/jdk.internal.reflect.NativeMethodAccessorImpl.invoke0(Native Method)
23:43:30 [2021-03-20T03:43:30.452Z] 	at java.base/jdk.internal.reflect.NativeMethodAccessorImpl.invoke(NativeMethodAccessorImpl.java:64)
23:43:30 [2021-03-20T03:43:30.452Z] 	at java.base/jdk.internal.reflect.DelegatingMethodAccessorImpl.invoke(DelegatingMethodAccessorImpl.java:43)
23:43:30 [2021-03-20T03:43:30.452Z] 	at java.base/java.lang.reflect.Method.invoke(Method.java:564)
23:43:30 [2021-03-20T03:43:30.452Z] 	at org.apache.maven.surefire.util.ReflectionUtils.invokeMethodWithArray2(ReflectionUtils.java:206)
23:43:30 [2021-03-20T03:43:30.452Z] 	at org.apache.maven.surefire.booter.ProviderFactory$ProviderProxy.invoke(ProviderFactory.java:161)
23:43:30 [2021-03-20T03:43:30.453Z] 	at org.apache.maven.surefire.booter.ProviderFactory.invokeProvider(ProviderFactory.java:84)
23:43:30 [2021-03-20T03:43:30.453Z] 	at org.eclipse.tycho.surefire.osgibooter.OsgiSurefireBooter.run(OsgiSurefireBooter.java:116)
23:43:30 [2021-03-20T03:43:30.453Z] 	at org.eclipse.tycho.surefire.osgibooter.HeadlessTestApplication.start(HeadlessTestApplication.java:23)
23:43:30 [2021-03-20T03:43:30.453Z] 	at org.eclipse.equinox.internal.app.EclipseAppHandle.run(EclipseAppHandle.java:203)
23:43:30 [2021-03-20T03:43:30.453Z] 	at org.eclipse.core.runtime.internal.adaptor.EclipseAppLauncher.runApplication(EclipseAppLauncher.java:137)
23:43:30 [2021-03-20T03:43:30.453Z] 	at org.eclipse.core.runtime.internal.adaptor.EclipseAppLauncher.start(EclipseAppLauncher.java:107)
23:43:30 [2021-03-20T03:43:30.453Z] 	at org.eclipse.core.runtime.adaptor.EclipseStarter.run(EclipseStarter.java:400)
23:43:30 [2021-03-20T03:43:30.453Z] 	at org.eclipse.core.runtime.adaptor.EclipseStarter.run(EclipseStarter.java:255)
23:43:30 [2021-03-20T03:43:30.453Z] 	at java.base/jdk.internal.reflect.NativeMethodAccessorImpl.invoke0(Native Method)
23:43:30 [2021-03-20T03:43:30.453Z] 	at java.base/jdk.internal.reflect.NativeMethodAccessorImpl.invoke(NativeMethodAccessorImpl.java:64)
23:43:30 [2021-03-20T03:43:30.453Z] 	at java.base/jdk.internal.reflect.DelegatingMethodAccessorImpl.invoke(DelegatingMethodAccessorImpl.java:43)
23:43:30 [2021-03-20T03:43:30.453Z] 	at java.base/java.lang.reflect.Method.invoke(Method.java:564)
23:43:30 [2021-03-20T03:43:30.453Z] 	at org.eclipse.equinox.launcher.Main.invokeFramework(Main.java:659)
23:43:30 [2021-03-20T03:43:30.453Z] 	at org.eclipse.equinox.launcher.Main.basicRun(Main.java:595)
23:43:30 [2021-03-20T03:43:30.453Z] 	at org.eclipse.equinox.launcher.Main.run(Main.java:1501)
23:43:30 [2021-03-20T03:43:30.453Z] 	at org.eclipse.equinox.launcher.Main.main(Main.java:1474)
23:43:30 [2021-03-20T03:43:30.453Z] Caused by: java.lang.ClassNotFoundException: org.junit.runners.model.RunnerBuilder cannot be found by org.eclipse.tycho.surefire.osgibooter_2.2.0
23:43:30 [2021-03-20T03:43:30.453Z] 	at org.eclipse.osgi.internal.loader.BundleLoader.findClassInternal(BundleLoader.java:511)
23:43:30 [2021-03-20T03:43:30.453Z] 	at org.eclipse.osgi.internal.loader.BundleLoader.findClass(BundleLoader.java:422)
23:43:30 [2021-03-20T03:43:30.453Z] 	at org.eclipse.osgi.internal.loader.BundleLoader.findClass(BundleLoader.java:414)
23:43:30 [2021-03-20T03:43:30.453Z] 	at org.eclipse.osgi.internal.loader.ModuleClassLoader.loadClass(ModuleClassLoader.java:153)
23:43:30 [2021-03-20T03:43:30.453Z] 	at java.base/java.lang.ClassLoader.loadClass(ClassLoader.java:522)
23:43:30 [2021-03-20T03:43:30.453Z] 	... 31 more
23:43:30 [2021-03-20T03:43:30.453Z] 
23:43:30 [2021-03-20T03:43:30.453Z] Mar 20, 2021 3:43:30 AM org.junit.platform.launcher.core.DefaultLauncher handleThrowable
23:43:30 [2021-03-20T03:43:30.453Z] WARNING: TestEngine with ID 'junit-vintage' failed to discover tests
23:43:30 [2021-03-20T03:43:30.453Z] java.lang.NoClassDefFoundError: org/junit/runners/model/RunnerBuilder
23:43:30 [2021-03-20T03:43:30.453Z] 	at org.junit.vintage.engine.discovery.VintageDiscoverer.<init>(VintageDiscoverer.java:48)
23:43:30 [2021-03-20T03:43:30.453Z] 	at org.junit.vintage.engine.VintageTestEngine.discover(VintageTestEngine.java:65)
23:43:30 [2021-03-20T03:43:30.453Z] 	at org.junit.platform.launcher.core.DefaultLauncher.discoverEngineRoot(DefaultLauncher.java:130)
23:43:30 [2021-03-20T03:43:30.453Z] 	at org.junit.platform.launcher.core.DefaultLauncher.discoverRoot(DefaultLauncher.java:117)
23:43:30 [2021-03-20T03:43:30.453Z] 	at org.junit.platform.launcher.core.DefaultLauncher.discover(DefaultLauncher.java:82)
23:43:30 [2021-03-20T03:43:30.453Z] 	at org.apache.maven.surefire.junitplatform.TestPlanScannerFilter.accept(TestPlanScannerFilter.java:56)
23:43:30 [2021-03-20T03:43:30.453Z] 	at org.apache.maven.surefire.util.DefaultScanResult.applyFilter(DefaultScanResult.java:102)
23:43:30 [2021-03-20T03:43:30.453Z] 	at org.apache.maven.surefire.junitplatform.JUnitPlatformProvider.scanClasspath(JUnitPlatformProvider.java:143)
23:43:30 [2021-03-20T03:43:30.453Z] 	at org.apache.maven.surefire.junitplatform.JUnitPlatformProvider.invoke(JUnitPlatformProvider.java:124)
23:43:30 [2021-03-20T03:43:30.453Z] 	at java.base/jdk.internal.reflect.NativeMethodAccessorImpl.invoke0(Native Method)
23:43:30 [2021-03-20T03:43:30.453Z] 	at java.base/jdk.internal.reflect.NativeMethodAccessorImpl.invoke(NativeMethodAccessorImpl.java:64)
23:43:30 [2021-03-20T03:43:30.453Z] 	at java.base/jdk.internal.reflect.DelegatingMethodAccessorImpl.invoke(DelegatingMethodAccessorImpl.java:43)
23:43:30 [2021-03-20T03:43:30.453Z] 	at java.base/java.lang.reflect.Method.invoke(Method.java:564)
23:43:30 [2021-03-20T03:43:30.453Z] 	at org.apache.maven.surefire.util.ReflectionUtils.invokeMethodWithArray2(ReflectionUtils.java:206)
23:43:30 [2021-03-20T03:43:30.453Z] 	at org.apache.maven.surefire.booter.ProviderFactory$ProviderProxy.invoke(ProviderFactory.java:161)
23:43:30 [2021-03-20T03:43:30.453Z] 	at org.apache.maven.surefire.booter.ProviderFactory.invokeProvider(ProviderFactory.java:84)
23:43:30 [2021-03-20T03:43:30.453Z] 	at org.eclipse.tycho.surefire.osgibooter.OsgiSurefireBooter.run(OsgiSurefireBooter.java:116)
23:43:30 [2021-03-20T03:43:30.453Z] 	at org.eclipse.tycho.surefire.osgibooter.HeadlessTestApplication.start(HeadlessTestApplication.java:23)
23:43:30 [2021-03-20T03:43:30.453Z] 	at org.eclipse.equinox.internal.app.EclipseAppHandle.run(EclipseAppHandle.java:203)
23:43:30 [2021-03-20T03:43:30.453Z] 	at org.eclipse.core.runtime.internal.adaptor.EclipseAppLauncher.runApplication(EclipseAppLauncher.java:137)
23:43:30 [2021-03-20T03:43:30.453Z] 	at org.eclipse.core.runtime.internal.adaptor.EclipseAppLauncher.start(EclipseAppLauncher.java:107)
23:43:30 [2021-03-20T03:43:30.453Z] 	at org.eclipse.core.runtime.adaptor.EclipseStarter.run(EclipseStarter.java:400)
23:43:30 [2021-03-20T03:43:30.453Z] 	at org.eclipse.core.runtime.adaptor.EclipseStarter.run(EclipseStarter.java:255)
23:43:30 [2021-03-20T03:43:30.453Z] 	at java.base/jdk.internal.reflect.NativeMethodAccessorImpl.invoke0(Native Method)
23:43:30 [2021-03-20T03:43:30.453Z] 	at java.base/jdk.internal.reflect.NativeMethodAccessorImpl.invoke(NativeMethodAccessorImpl.java:64)
23:43:30 [2021-03-20T03:43:30.453Z] 	at java.base/jdk.internal.reflect.DelegatingMethodAccessorImpl.invoke(DelegatingMethodAccessorImpl.java:43)
23:43:30 [2021-03-20T03:43:30.453Z] 	at java.base/java.lang.reflect.Method.invoke(Method.java:564)
23:43:30 [2021-03-20T03:43:30.453Z] 	at org.eclipse.equinox.launcher.Main.invokeFramework(Main.java:659)
23:43:30 [2021-03-20T03:43:30.453Z] 	at org.eclipse.equinox.launcher.Main.basicRun(Main.java:595)
23:43:30 [2021-03-20T03:43:30.453Z] 	at org.eclipse.equinox.launcher.Main.run(Main.java:1501)
23:43:30 [2021-03-20T03:43:30.453Z] 	at org.eclipse.equinox.launcher.Main.main(Main.java:1474)
23:43:30 [2021-03-20T03:43:30.453Z] Caused by: java.lang.ClassNotFoundException: org.junit.runners.model.RunnerBuilder cannot be found by org.eclipse.tycho.surefire.osgibooter_2.2.0
23:43:30 [2021-03-20T03:43:30.453Z] 	at org.eclipse.osgi.internal.loader.BundleLoader.findClassInternal(BundleLoader.java:511)
23:43:30 [2021-03-20T03:43:30.453Z] 	at org.eclipse.osgi.internal.loader.BundleLoader.findClass(BundleLoader.java:422)
23:43:30 [2021-03-20T03:43:30.453Z] 	at org.eclipse.osgi.internal.loader.BundleLoader.findClass(BundleLoader.java:414)
23:43:30 [2021-03-20T03:43:30.453Z] 	at org.eclipse.osgi.internal.loader.ModuleClassLoader.loadClass(ModuleClassLoader.java:153)
23:43:30 [2021-03-20T03:43:30.453Z] 	at java.base/java.lang.ClassLoader.loadClass(ClassLoader.java:522)
23:43:30 [2021-03-20T03:43:30.453Z] 	... 31 more
23:43:30 [2021-03-20T03:43:30.453Z] 
23:43:30 [2021-03-20T03:43:30.453Z] Mar 20, 2021 3:43:30 AM org.junit.platform.launcher.core.DefaultLauncher handleThrowable
23:43:30 [2021-03-20T03:43:30.453Z] WARNING: TestEngine with ID 'junit-vintage' failed to discover tests
23:43:30 [2021-03-20T03:43:30.454Z] java.lang.NoClassDefFoundError: org/junit/runners/model/RunnerBuilder
23:43:30 [2021-03-20T03:43:30.454Z] 	at org.junit.vintage.engine.discovery.VintageDiscoverer.<init>(VintageDiscoverer.java:48)
23:43:30 [2021-03-20T03:43:30.454Z] 	at org.junit.vintage.engine.VintageTestEngine.discover(VintageTestEngine.java:65)
23:43:30 [2021-03-20T03:43:30.454Z] 	at org.junit.platform.launcher.core.DefaultLauncher.discoverEngineRoot(DefaultLauncher.java:130)
23:43:30 [2021-03-20T03:43:30.454Z] 	at org.junit.platform.launcher.core.DefaultLauncher.discoverRoot(DefaultLauncher.java:117)
23:43:30 [2021-03-20T03:43:30.454Z] 	at org.junit.platform.launcher.core.DefaultLauncher.discover(DefaultLauncher.java:82)
23:43:30 [2021-03-20T03:43:30.454Z] 	at org.apache.maven.surefire.junitplatform.TestPlanScannerFilter.accept(TestPlanScannerFilter.java:56)
23:43:30 [2021-03-20T03:43:30.454Z] 	at org.apache.maven.surefire.util.DefaultScanResult.applyFilter(DefaultScanResult.java:102)
23:43:30 [2021-03-20T03:43:30.454Z] 	at org.apache.maven.surefire.junitplatform.JUnitPlatformProvider.scanClasspath(JUnitPlatformProvider.java:143)
23:43:30 [2021-03-20T03:43:30.454Z] 	at org.apache.maven.surefire.junitplatform.JUnitPlatformProvider.invoke(JUnitPlatformProvider.java:124)
23:43:30 [2021-03-20T03:43:30.454Z] 	at java.base/jdk.internal.reflect.NativeMethodAccessorImpl.invoke0(Native Method)
23:43:30 [2021-03-20T03:43:30.454Z] 	at java.base/jdk.internal.reflect.NativeMethodAccessorImpl.invoke(NativeMethodAccessorImpl.java:64)
23:43:30 [2021-03-20T03:43:30.454Z] 	at java.base/jdk.internal.reflect.DelegatingMethodAccessorImpl.invoke(DelegatingMethodAccessorImpl.java:43)
23:43:30 [2021-03-20T03:43:30.454Z] 	at java.base/java.lang.reflect.Method.invoke(Method.java:564)
23:43:30 [2021-03-20T03:43:30.454Z] 	at org.apache.maven.surefire.util.ReflectionUtils.invokeMethodWithArray2(ReflectionUtils.java:206)
23:43:30 [2021-03-20T03:43:30.454Z] 	at org.apache.maven.surefire.booter.ProviderFactory$ProviderProxy.invoke(ProviderFactory.java:161)
23:43:30 [2021-03-20T03:43:30.454Z] 	at org.apache.maven.surefire.booter.ProviderFactory.invokeProvider(ProviderFactory.java:84)
23:43:30 [2021-03-20T03:43:30.454Z] 	at org.eclipse.tycho.surefire.osgibooter.OsgiSurefireBooter.run(OsgiSurefireBooter.java:116)
23:43:30 [2021-03-20T03:43:30.454Z] 	at org.eclipse.tycho.surefire.osgibooter.HeadlessTestApplication.start(HeadlessTestApplication.java:23)
23:43:30 [2021-03-20T03:43:30.454Z] 	at org.eclipse.equinox.internal.app.EclipseAppHandle.run(EclipseAppHandle.java:203)
23:43:30 [2021-03-20T03:43:30.454Z] 	at org.eclipse.core.runtime.internal.adaptor.EclipseAppLauncher.runApplication(EclipseAppLauncher.java:137)
23:43:30 [2021-03-20T03:43:30.454Z] 	at org.eclipse.core.runtime.internal.adaptor.EclipseAppLauncher.start(EclipseAppLauncher.java:107)
23:43:30 [2021-03-20T03:43:30.454Z] 	at org.eclipse.core.runtime.adaptor.EclipseStarter.run(EclipseStarter.java:400)
23:43:30 [2021-03-20T03:43:30.454Z] 	at org.eclipse.core.runtime.adaptor.EclipseStarter.run(EclipseStarter.java:255)
23:43:30 [2021-03-20T03:43:30.454Z] 	at java.base/jdk.internal.reflect.NativeMethodAccessorImpl.invoke0(Native Method)
23:43:30 [2021-03-20T03:43:30.454Z] 	at java.base/jdk.internal.reflect.NativeMethodAccessorImpl.invoke(NativeMethodAccessorImpl.java:64)
23:43:30 [2021-03-20T03:43:30.454Z] 	at java.base/jdk.internal.reflect.DelegatingMethodAccessorImpl.invoke(DelegatingMethodAccessorImpl.java:43)
23:43:30 [2021-03-20T03:43:30.454Z] 	at java.base/java.lang.reflect.Method.invoke(Method.java:564)
23:43:30 [2021-03-20T03:43:30.454Z] 	at org.eclipse.equinox.launcher.Main.invokeFramework(Main.java:659)
23:43:30 [2021-03-20T03:43:30.454Z] 	at org.eclipse.equinox.launcher.Main.basicRun(Main.java:595)
23:43:30 [2021-03-20T03:43:30.454Z] 	at org.eclipse.equinox.launcher.Main.run(Main.java:1501)
23:43:30 [2021-03-20T03:43:30.454Z] 	at org.eclipse.equinox.launcher.Main.main(Main.java:1474)
23:43:30 [2021-03-20T03:43:30.454Z] Caused by: java.lang.ClassNotFoundException: org.junit.runners.model.RunnerBuilder cannot be found by org.eclipse.tycho.surefire.osgibooter_2.2.0
23:43:30 [2021-03-20T03:43:30.454Z] 	at org.eclipse.osgi.internal.loader.BundleLoader.findClassInternal(BundleLoader.java:511)
23:43:30 [2021-03-20T03:43:30.454Z] 	at org.eclipse.osgi.internal.loader.BundleLoader.findClass(BundleLoader.java:422)
23:43:30 [2021-03-20T03:43:30.454Z] 	at org.eclipse.osgi.internal.loader.BundleLoader.findClass(BundleLoader.java:414)
23:43:30 [2021-03-20T03:43:30.454Z] 	at org.eclipse.osgi.internal.loader.ModuleClassLoader.loadClass(ModuleClassLoader.java:153)
23:43:30 [2021-03-20T03:43:30.454Z] 	at java.base/java.lang.ClassLoader.loadClass(ClassLoader.java:522)
23:43:30 [2021-03-20T03:43:30.454Z] 	... 31 more
23:43:30 [2021-03-20T03:43:30.454Z] 
23:43:30 [2021-03-20T03:43:30.454Z] Mar 20, 2021 3:43:30 AM org.junit.platform.launcher.core.DefaultLauncher handleThrowable
23:43:30 [2021-03-20T03:43:30.454Z] WARNING: TestEngine with ID 'junit-vintage' failed to discover tests
23:43:30 [2021-03-20T03:43:30.454Z] java.lang.NoClassDefFoundError: org/junit/runners/model/RunnerBuilder
23:43:30 [2021-03-20T03:43:30.454Z] 	at org.junit.vintage.engine.discovery.VintageDiscoverer.<init>(VintageDiscoverer.java:48)
23:43:30 [2021-03-20T03:43:30.454Z] 	at org.junit.vintage.engine.VintageTestEngine.discover(VintageTestEngine.java:65)
23:43:30 [2021-03-20T03:43:30.454Z] 	at org.junit.platform.launcher.core.DefaultLauncher.discoverEngineRoot(DefaultLauncher.java:130)
23:43:30 [2021-03-20T03:43:30.454Z] 	at org.junit.platform.launcher.core.DefaultLauncher.discoverRoot(DefaultLauncher.java:117)
23:43:30 [2021-03-20T03:43:30.454Z] 	at org.junit.platform.launcher.core.DefaultLauncher.discover(DefaultLauncher.java:82)
23:43:30 [2021-03-20T03:43:30.454Z] 	at org.apache.maven.surefire.junitplatform.TestPlanScannerFilter.accept(TestPlanScannerFilter.java:56)
23:43:30 [2021-03-20T03:43:30.454Z] 	at org.apache.maven.surefire.util.DefaultScanResult.applyFilter(DefaultScanResult.java:102)
23:43:30 [2021-03-20T03:43:30.454Z] 	at org.apache.maven.surefire.junitplatform.JUnitPlatformProvider.scanClasspath(JUnitPlatformProvider.java:143)
23:43:30 [2021-03-20T03:43:30.454Z] 	at org.apache.maven.surefire.junitplatform.JUnitPlatformProvider.invoke(JUnitPlatformProvider.java:124)
23:43:30 [2021-03-20T03:43:30.454Z] 	at java.base/jdk.internal.reflect.NativeMethodAccessorImpl.invoke0(Native Method)
23:43:30 [2021-03-20T03:43:30.454Z] 	at java.base/jdk.internal.reflect.NativeMethodAccessorImpl.invoke(NativeMethodAccessorImpl.java:64)
23:43:30 [2021-03-20T03:43:30.454Z] 	at java.base/jdk.internal.reflect.DelegatingMethodAccessorImpl.invoke(DelegatingMethodAccessorImpl.java:43)
23:43:30 [2021-03-20T03:43:30.454Z] 	at java.base/java.lang.reflect.Method.invoke(Method.java:564)
23:43:30 [2021-03-20T03:43:30.454Z] 	at org.apache.maven.surefire.util.ReflectionUtils.invokeMethodWithArray2(ReflectionUtils.java:206)
23:43:30 [2021-03-20T03:43:30.454Z] 	at org.apache.maven.surefire.booter.ProviderFactory$ProviderProxy.invoke(ProviderFactory.java:161)
23:43:30 [2021-03-20T03:43:30.454Z] 	at org.apache.maven.surefire.booter.ProviderFactory.invokeProvider(ProviderFactory.java:84)
23:43:30 [2021-03-20T03:43:30.454Z] 	at org.eclipse.tycho.surefire.osgibooter.OsgiSurefireBooter.run(OsgiSurefireBooter.java:116)
23:43:30 [2021-03-20T03:43:30.454Z] 	at org.eclipse.tycho.surefire.osgibooter.HeadlessTestApplication.start(HeadlessTestApplication.java:23)
23:43:30 [2021-03-20T03:43:30.454Z] 	at org.eclipse.equinox.internal.app.EclipseAppHandle.run(EclipseAppHandle.java:203)
23:43:30 [2021-03-20T03:43:30.454Z] 	at org.eclipse.core.runtime.internal.adaptor.EclipseAppLauncher.runApplication(EclipseAppLauncher.java:137)
23:43:30 [2021-03-20T03:43:30.454Z] 	at org.eclipse.core.runtime.internal.adaptor.EclipseAppLauncher.start(EclipseAppLauncher.java:107)
23:43:30 [2021-03-20T03:43:30.454Z] 	at org.eclipse.core.runtime.adaptor.EclipseStarter.run(EclipseStarter.java:400)
23:43:30 [2021-03-20T03:43:30.454Z] 	at org.eclipse.core.runtime.adaptor.EclipseStarter.run(EclipseStarter.java:255)
23:43:30 [2021-03-20T03:43:30.454Z] 	at java.base/jdk.internal.reflect.NativeMethodAccessorImpl.invoke0(Native Method)
23:43:30 [2021-03-20T03:43:30.455Z] 	at java.base/jdk.internal.reflect.NativeMethodAccessorImpl.invoke(NativeMethodAccessorImpl.java:64)
23:43:30 [2021-03-20T03:43:30.455Z] 	at java.base/jdk.internal.reflect.DelegatingMethodAccessorImpl.invoke(DelegatingMethodAccessorImpl.java:43)
23:43:30 [2021-03-20T03:43:30.455Z] 	at java.base/java.lang.reflect.Method.invoke(Method.java:564)
23:43:30 [2021-03-20T03:43:30.455Z] 	at org.eclipse.equinox.launcher.Main.invokeFramework(Main.java:659)
23:43:30 [2021-03-20T03:43:30.455Z] 	at org.eclipse.equinox.launcher.Main.basicRun(Main.java:595)
23:43:30 [2021-03-20T03:43:30.455Z] 	at org.eclipse.equinox.launcher.Main.run(Main.java:1501)
23:43:30 [2021-03-20T03:43:30.455Z] 	at org.eclipse.equinox.launcher.Main.main(Main.java:1474)
23:43:30 [2021-03-20T03:43:30.455Z] Caused by: java.lang.ClassNotFoundException: org.junit.runners.model.RunnerBuilder cannot be found by org.eclipse.tycho.surefire.osgibooter_2.2.0
23:43:30 [2021-03-20T03:43:30.455Z] 	at org.eclipse.osgi.internal.loader.BundleLoader.findClassInternal(BundleLoader.java:511)
23:43:30 [2021-03-20T03:43:30.455Z] 	at org.eclipse.osgi.internal.loader.BundleLoader.findClass(BundleLoader.java:422)
23:43:30 [2021-03-20T03:43:30.455Z] 	at org.eclipse.osgi.internal.loader.BundleLoader.findClass(BundleLoader.java:414)
23:43:30 [2021-03-20T03:43:30.455Z] 	at org.eclipse.osgi.internal.loader.ModuleClassLoader.loadClass(ModuleClassLoader.java:153)
23:43:30 [2021-03-20T03:43:30.455Z] 	at java.base/java.lang.ClassLoader.loadClass(ClassLoader.java:522)
23:43:30 [2021-03-20T03:43:30.455Z] 	... 31 more
23:43:30 [2021-03-20T03:43:30.455Z] 
23:43:30 [2021-03-20T03:43:30.455Z] Mar 20, 2021 3:43:30 AM org.junit.platform.launcher.core.DefaultLauncher handleThrowable
23:43:30 [2021-03-20T03:43:30.455Z] WARNING: TestEngine with ID 'junit-vintage' failed to discover tests
23:43:30 [2021-03-20T03:43:30.455Z] java.lang.NoClassDefFoundError: org/junit/runners/model/RunnerBuilder
23:43:30 [2021-03-20T03:43:30.455Z] 	at org.junit.vintage.engine.discovery.VintageDiscoverer.<init>(VintageDiscoverer.java:48)
23:43:30 [2021-03-20T03:43:30.455Z] 	at org.junit.vintage.engine.VintageTestEngine.discover(VintageTestEngine.java:65)
23:43:30 [2021-03-20T03:43:30.455Z] 	at org.junit.platform.launcher.core.DefaultLauncher.discoverEngineRoot(DefaultLauncher.java:130)
23:43:30 [2021-03-20T03:43:30.455Z] 	at org.junit.platform.launcher.core.DefaultLauncher.discoverRoot(DefaultLauncher.java:117)
23:43:30 [2021-03-20T03:43:30.455Z] 	at org.junit.platform.launcher.core.DefaultLauncher.discover(DefaultLauncher.java:82)
23:43:30 [2021-03-20T03:43:30.455Z] 	at org.apache.maven.surefire.junitplatform.TestPlanScannerFilter.accept(TestPlanScannerFilter.java:56)
23:43:30 [2021-03-20T03:43:30.455Z] 	at org.apache.maven.surefire.util.DefaultScanResult.applyFilter(DefaultScanResult.java:102)
23:43:30 [2021-03-20T03:43:30.455Z] 	at org.apache.maven.surefire.junitplatform.JUnitPlatformProvider.scanClasspath(JUnitPlatformProvider.java:143)
23:43:30 [2021-03-20T03:43:30.455Z] 	at org.apache.maven.surefire.junitplatform.JUnitPlatformProvider.invoke(JUnitPlatformProvider.java:124)
23:43:30 [2021-03-20T03:43:30.455Z] 	at java.base/jdk.internal.reflect.NativeMethodAccessorImpl.invoke0(Native Method)
23:43:30 [2021-03-20T03:43:30.455Z] 	at java.base/jdk.internal.reflect.NativeMethodAccessorImpl.invoke(NativeMethodAccessorImpl.java:64)
23:43:30 [2021-03-20T03:43:30.455Z] 	at java.base/jdk.internal.reflect.DelegatingMethodAccessorImpl.invoke(DelegatingMethodAccessorImpl.java:43)
23:43:30 [2021-03-20T03:43:30.455Z] 	at java.base/java.lang.reflect.Method.invoke(Method.java:564)
23:43:30 [2021-03-20T03:43:30.455Z] 	at org.apache.maven.surefire.util.ReflectionUtils.invokeMethodWithArray2(ReflectionUtils.java:206)
23:43:30 [2021-03-20T03:43:30.455Z] 	at org.apache.maven.surefire.booter.ProviderFactory$ProviderProxy.invoke(ProviderFactory.java:161)
23:43:30 [2021-03-20T03:43:30.455Z] 	at org.apache.maven.surefire.booter.ProviderFactory.invokeProvider(ProviderFactory.java:84)
23:43:30 [2021-03-20T03:43:30.455Z] 	at org.eclipse.tycho.surefire.osgibooter.OsgiSurefireBooter.run(OsgiSurefireBooter.java:116)
23:43:30 [2021-03-20T03:43:30.455Z] 	at org.eclipse.tycho.surefire.osgibooter.HeadlessTestApplication.start(HeadlessTestApplication.java:23)
23:43:30 [2021-03-20T03:43:30.455Z] 	at org.eclipse.equinox.internal.app.EclipseAppHandle.run(EclipseAppHandle.java:203)
23:43:30 [2021-03-20T03:43:30.455Z] 	at org.eclipse.core.runtime.internal.adaptor.EclipseAppLauncher.runApplication(EclipseAppLauncher.java:137)
23:43:30 [2021-03-20T03:43:30.455Z] 	at org.eclipse.core.runtime.internal.adaptor.EclipseAppLauncher.start(EclipseAppLauncher.java:107)
23:43:30 [2021-03-20T03:43:30.455Z] 	at org.eclipse.core.runtime.adaptor.EclipseStarter.run(EclipseStarter.java:400)
23:43:30 [2021-03-20T03:43:30.455Z] 	at org.eclipse.core.runtime.adaptor.EclipseStarter.run(EclipseStarter.java:255)
23:43:30 [2021-03-20T03:43:30.455Z] 	at java.base/jdk.internal.reflect.NativeMethodAccessorImpl.invoke0(Native Method)
23:43:30 [2021-03-20T03:43:30.455Z] 	at java.base/jdk.internal.reflect.NativeMethodAccessorImpl.invoke(NativeMethodAccessorImpl.java:64)
23:43:30 [2021-03-20T03:43:30.455Z] 	at java.base/jdk.internal.reflect.DelegatingMethodAccessorImpl.invoke(DelegatingMethodAccessorImpl.java:43)
23:43:30 [2021-03-20T03:43:30.455Z] 	at java.base/java.lang.reflect.Method.invoke(Method.java:564)
23:43:30 [2021-03-20T03:43:30.455Z] 	at org.eclipse.equinox.launcher.Main.invokeFramework(Main.java:659)
23:43:30 [2021-03-20T03:43:30.455Z] 	at org.eclipse.equinox.launcher.Main.basicRun(Main.java:595)
23:43:30 [2021-03-20T03:43:30.455Z] 	at org.eclipse.equinox.launcher.Main.run(Main.java:1501)
23:43:30 [2021-03-20T03:43:30.455Z] 	at org.eclipse.equinox.launcher.Main.main(Main.java:1474)
23:43:30 [2021-03-20T03:43:30.455Z] Caused by: java.lang.ClassNotFoundException: org.junit.runners.model.RunnerBuilder cannot be found by org.eclipse.tycho.surefire.osgibooter_2.2.0
23:43:30 [2021-03-20T03:43:30.455Z] 	at org.eclipse.osgi.internal.loader.BundleLoader.findClassInternal(BundleLoader.java:511)
23:43:30 [2021-03-20T03:43:30.455Z] 	at org.eclipse.osgi.internal.loader.BundleLoader.findClass(BundleLoader.java:422)
23:43:30 [2021-03-20T03:43:30.455Z] 	at org.eclipse.osgi.internal.loader.BundleLoader.findClass(BundleLoader.java:414)
23:43:30 [2021-03-20T03:43:30.455Z] 	at org.eclipse.osgi.internal.loader.ModuleClassLoader.loadClass(ModuleClassLoader.java:153)
23:43:30 [2021-03-20T03:43:30.455Z] 	at java.base/java.lang.ClassLoader.loadClass(ClassLoader.java:522)
23:43:30 [2021-03-20T03:43:30.455Z] 	... 31 more
23:43:30 [2021-03-20T03:43:30.455Z] 
23:43:30 [2021-03-20T03:43:30.455Z] Mar 20, 2021 3:43:30 AM org.junit.platform.launcher.core.DefaultLauncher handleThrowable
23:43:30 [2021-03-20T03:43:30.455Z] WARNING: TestEngine with ID 'junit-vintage' failed to discover tests
23:43:30 [2021-03-20T03:43:30.455Z] java.lang.NoClassDefFoundError: org/junit/runners/model/RunnerBuilder
23:43:30 [2021-03-20T03:43:30.455Z] 	at org.junit.vintage.engine.discovery.VintageDiscoverer.<init>(VintageDiscoverer.java:48)
23:43:30 [2021-03-20T03:43:30.455Z] 	at org.junit.vintage.engine.VintageTestEngine.discover(VintageTestEngine.java:65)
23:43:30 [2021-03-20T03:43:30.455Z] 	at org.junit.platform.launcher.core.DefaultLauncher.discoverEngineRoot(DefaultLauncher.java:130)
23:43:30 [2021-03-20T03:43:30.455Z] 	at org.junit.platform.launcher.core.DefaultLauncher.discoverRoot(DefaultLauncher.java:117)
23:43:30 [2021-03-20T03:43:30.455Z] 	at org.junit.platform.launcher.core.DefaultLauncher.execute(DefaultLauncher.java:90)
23:43:30 [2021-03-20T03:43:30.455Z] 	at org.apache.maven.surefire.junitplatform.JUnitPlatformProvider.invokeAllTests(JUnitPlatformProvider.java:150)
23:43:30 [2021-03-20T03:43:30.455Z] 	at org.apache.maven.surefire.junitplatform.JUnitPlatformProvider.invoke(JUnitPlatformProvider.java:124)
23:43:30 [2021-03-20T03:43:30.455Z] 	at java.base/jdk.internal.reflect.NativeMethodAccessorImpl.invoke0(Native Method)
23:43:30 [2021-03-20T03:43:30.455Z] 	at java.base/jdk.internal.reflect.NativeMethodAccessorImpl.invoke(NativeMethodAccessorImpl.java:64)
23:43:30 [2021-03-20T03:43:30.455Z] 	at java.base/jdk.internal.reflect.DelegatingMethodAccessorImpl.invoke(DelegatingMethodAccessorImpl.java:43)
23:43:30 [2021-03-20T03:43:30.455Z] 	at java.base/java.lang.reflect.Method.invoke(Method.java:564)
23:43:30 [2021-03-20T03:43:30.455Z] 	at org.apache.maven.surefire.util.ReflectionUtils.invokeMethodWithArray2(ReflectionUtils.java:206)
23:43:30 [2021-03-20T03:43:30.455Z] 	at org.apache.maven.surefire.booter.ProviderFactory$ProviderProxy.invoke(ProviderFactory.java:161)
23:43:30 [2021-03-20T03:43:30.456Z] 	at org.apache.maven.surefire.booter.ProviderFactory.invokeProvider(ProviderFactory.java:84)
23:43:30 [2021-03-20T03:43:30.456Z] 	at org.eclipse.tycho.surefire.osgibooter.OsgiSurefireBooter.run(OsgiSurefireBooter.java:116)
23:43:30 [2021-03-20T03:43:30.456Z] 	at org.eclipse.tycho.surefire.osgibooter.HeadlessTestApplication.start(HeadlessTestApplication.java:23)
23:43:30 [2021-03-20T03:43:30.456Z] 	at org.eclipse.equinox.internal.app.EclipseAppHandle.run(EclipseAppHandle.java:203)
23:43:30 [2021-03-20T03:43:30.456Z] 	at org.eclipse.core.runtime.internal.adaptor.EclipseAppLauncher.runApplication(EclipseAppLauncher.java:137)
23:43:30 [2021-03-20T03:43:30.456Z] 	at org.eclipse.core.runtime.internal.adaptor.EclipseAppLauncher.start(EclipseAppLauncher.java:107)
23:43:30 [2021-03-20T03:43:30.456Z] 	at org.eclipse.core.runtime.adaptor.EclipseStarter.run(EclipseStarter.java:400)
23:43:30 [2021-03-20T03:43:30.456Z] 	at org.eclipse.core.runtime.adaptor.EclipseStarter.run(EclipseStarter.java:255)
23:43:30 [2021-03-20T03:43:30.456Z] 	at java.base/jdk.internal.reflect.NativeMethodAccessorImpl.invoke0(Native Method)
23:43:30 [2021-03-20T03:43:30.456Z] 	at java.base/jdk.internal.reflect.NativeMethodAccessorImpl.invoke(NativeMethodAccessorImpl.java:64)
23:43:30 [2021-03-20T03:43:30.456Z] 	at java.base/jdk.internal.reflect.DelegatingMethodAccessorImpl.invoke(DelegatingMethodAccessorImpl.java:43)
23:43:30 [2021-03-20T03:43:30.456Z] 	at java.base/java.lang.reflect.Method.invoke(Method.java:564)
23:43:30 [2021-03-20T03:43:30.456Z] 	at org.eclipse.equinox.launcher.Main.invokeFramework(Main.java:659)
23:43:30 [2021-03-20T03:43:30.456Z] 	at org.eclipse.equinox.launcher.Main.basicRun(Main.java:595)
23:43:30 [2021-03-20T03:43:30.456Z] 	at org.eclipse.equinox.launcher.Main.run(Main.java:1501)
23:43:30 [2021-03-20T03:43:30.456Z] 	at org.eclipse.equinox.launcher.Main.main(Main.java:1474)
23:43:30 [2021-03-20T03:43:30.456Z] Caused by: java.lang.ClassNotFoundException: org.junit.runners.model.RunnerBuilder cannot be found by org.eclipse.tycho.surefire.osgibooter_2.2.0
23:43:30 [2021-03-20T03:43:30.456Z] 	at org.eclipse.osgi.internal.loader.BundleLoader.findClassInternal(BundleLoader.java:511)
23:43:30 [2021-03-20T03:43:30.456Z] 	at org.eclipse.osgi.internal.loader.BundleLoader.findClass(BundleLoader.java:422)
23:43:30 [2021-03-20T03:43:30.456Z] 	at org.eclipse.osgi.internal.loader.BundleLoader.findClass(BundleLoader.java:414)
23:43:30 [2021-03-20T03:43:30.456Z] 	at org.eclipse.osgi.internal.loader.ModuleClassLoader.loadClass(ModuleClassLoader.java:153)
23:43:30 [2021-03-20T03:43:30.456Z] 	at java.base/java.lang.ClassLoader.loadClass(ClassLoader.java:522)
23:43:30 [2021-03-20T03:43:30.456Z] 	... 29 more
23:43:30 [2021-03-20T03:43:30.456Z] 
23:43:30 [2021-03-20T03:43:30.712Z] Running org.eclipse.ease.AbstractCodeParserTest
23:43:30 [2021-03-20T03:43:30.712Z] Tests run: 5, Failures: 0, Errors: 0, Skipped: 0, Time elapsed: 0.016 s - in org.eclipse.ease.AbstractCodeParserTest
23:43:30 [2021-03-20T03:43:30.712Z] parseCode  Time elapsed: 0.007 s
23:43:30 [2021-03-20T03:43:30.712Z] parseLineHeader  Time elapsed: 0.003 s
23:43:30 [2021-03-20T03:43:30.712Z] parseBlockAfterWhitespace  Time elapsed: 0 s
23:43:30 [2021-03-20T03:43:30.712Z] parseEmpty  Time elapsed: 0 s
23:43:30 [2021-03-20T03:43:30.712Z] parseBlockHeader  Time elapsed: 0 s
23:43:30 [2021-03-20T03:43:30.712Z] Running org.eclipse.ease.sign.SignatureHelperTest
23:43:30 [2021-03-20T03:43:30.712Z] Tests run: 1, Failures: 0, Errors: 0, Skipped: 0, Time elapsed: 0.009 s - in org.eclipse.ease.sign.SignatureHelperTest
23:43:30 [2021-03-20T03:43:30.712Z] certificateTest  Time elapsed: 0.008 s
23:43:30 [2021-03-20T03:43:30.712Z] Running org.eclipse.ease.sign.VerifySignatureTest
23:43:30 [2021-03-20T03:43:30.968Z] Tests run: 1, Failures: 0, Errors: 0, Skipped: 0, Time elapsed: 0.387 s - in org.eclipse.ease.sign.VerifySignatureTest
23:43:30 [2021-03-20T03:43:30.968Z] testWithNonCodeParserScriptType  Time elapsed: 0.387 s
23:43:30 [2021-03-20T03:43:30.968Z] Running org.eclipse.ease.ScriptTest
23:43:31 [2021-03-20T03:43:31.223Z] Tests run: 13, Failures: 0, Errors: 0, Skipped: 0, Time elapsed: 0.088 s - in org.eclipse.ease.ScriptTest
23:43:31 [2021-03-20T03:43:31.223Z] codeFromScriptable  Time elapsed: 0.081 s
23:43:31 [2021-03-20T03:43:31.224Z] codeFromFilesystemFile  Time elapsed: 0.002 s
23:43:31 [2021-03-20T03:43:31.224Z] getCodeStream  Time elapsed: 0 s
23:43:31 [2021-03-20T03:43:31.224Z] getFile  Time elapsed: 0 s
23:43:31 [2021-03-20T03:43:31.224Z] codeFromStringBuilder  Time elapsed: 0.001 s
23:43:31 [2021-03-20T03:43:31.224Z] getResult  Time elapsed: 0 s
23:43:31 [2021-03-20T03:43:31.224Z] getException  Time elapsed: 0.001 s
23:43:31 [2021-03-20T03:43:31.224Z] codeFromWorkspaceFile  Time elapsed: 0 s
23:43:31 [2021-03-20T03:43:31.224Z] codeFromInputStream  Time elapsed: 0.001 s
23:43:31 [2021-03-20T03:43:31.224Z] getTitle  Time elapsed: 0 s
23:43:31 [2021-03-20T03:43:31.224Z] getCommand  Time elapsed: 0 s
23:43:31 [2021-03-20T03:43:31.224Z] codeFromReader  Time elapsed: 0 s
23:43:31 [2021-03-20T03:43:31.224Z] codeFromString  Time elapsed: 0 s
23:43:31 [2021-03-20T03:43:31.224Z] Running org.eclipse.ease.adapters.ScriptableAdapterTest
23:43:31 [2021-03-20T03:43:31.224Z] Tests run: 5, Failures: 0, Errors: 0, Skipped: 0, Time elapsed: 0.012 s - in org.eclipse.ease.adapters.ScriptableAdapterTest
23:43:31 [2021-03-20T03:43:31.224Z] adaptURI  Time elapsed: 0.01 s
23:43:31 [2021-03-20T03:43:31.224Z] adaptURL  Time elapsed: 0.001 s
23:43:31 [2021-03-20T03:43:31.224Z] adaptWorkspaceFile  Time elapsed: 0.001 s
23:43:31 [2021-03-20T03:43:31.224Z] getAdapterList  Time elapsed: 0 s
23:43:31 [2021-03-20T03:43:31.224Z] adaptFilesystemFile  Time elapsed: 0 s
23:43:31 [2021-03-20T03:43:31.224Z] Running org.eclipse.ease.AbstractReplScriptEngineTest
23:43:34 [2021-03-20T03:43:34.488Z] testorg.eclipse.ease.ScriptExecutionException: Engine got terminated
23:43:34 [2021-03-20T03:43:34.488Z] java.lang.RuntimeException: ERROR
23:43:34 [2021-03-20T03:43:34.488Z] 	at org.eclipse.ease.AbstractReplScriptEngineTest$MockedScriptEngine.execute(AbstractReplScriptEngineTest.java:60)
23:43:34 [2021-03-20T03:43:34.488Z] 	at org.eclipse.ease.AbstractScriptEngine.inject(AbstractScriptEngine.java:224)
23:43:34 [2021-03-20T03:43:34.488Z] 	at org.eclipse.ease.AbstractScriptEngine.run(AbstractScriptEngine.java:274)
23:43:34 [2021-03-20T03:43:34.488Z] 	at org.eclipse.core.internal.jobs.Worker.run(Worker.java:63)
23:43:35 [2021-03-20T03:43:35.416Z] 1Hello worldHello worldTests run: 20, Failures: 0, Errors: 0, Skipped: 0, Time elapsed: 4.053 s - in org.eclipse.ease.AbstractReplScriptEngineTest
23:43:35 [2021-03-20T03:43:35.416Z] extractEmptyArguments  Time elapsed: 0.025 s
23:43:35 [2021-03-20T03:43:35.416Z] setNotNullOutputStream  Time elapsed: 0 s
23:43:35 [2021-03-20T03:43:35.416Z] terminateViaMonitorCancellation  Time elapsed: 1.205 s
23:43:35 [2021-03-20T03:43:35.416Z] inject  Time elapsed: 0 s
23:43:35 [2021-03-20T03:43:35.416Z] extractArguments  Time elapsed: 0.002 s
23:43:35 [2021-03-20T03:43:35.416Z] executeSync  Time elapsed: 0 s
23:43:35 [2021-03-20T03:43:35.416Z] setNotNullErrorStream  Time elapsed: 0.001 s
23:43:35 [2021-03-20T03:43:35.416Z] setNullErrorStream  Time elapsed: 0 s
23:43:35 [2021-03-20T03:43:35.416Z] isJob  Time elapsed: 0 s
23:43:35 [2021-03-20T03:43:35.416Z] streamsAvailable  Time elapsed: 0 s
23:43:35 [2021-03-20T03:43:35.416Z] executeValidCodeAndTerminate  Time elapsed: 0.001 s
23:43:35 [2021-03-20T03:43:35.416Z] setNullOutputStream  Time elapsed: 0 s
23:43:35 [2021-03-20T03:43:35.416Z] terminateMultipleTimes  Time elapsed: 0.601 s
23:43:35 [2021-03-20T03:43:35.416Z] engineTerminatesWhenIdle  Time elapsed: 0.001 s
23:43:35 [2021-03-20T03:43:35.416Z] terminateViaTerminateMethod  Time elapsed: 1.201 s
23:43:35 [2021-03-20T03:43:35.416Z] terminateViaMethodCallback  Time elapsed: 0.001 s
23:43:35 [2021-03-20T03:43:35.416Z] executeErrorCodeAndTerminate  Time elapsed: 1.001 s
23:43:35 [2021-03-20T03:43:35.416Z] terminateOnIdleAfterSchedule  Time elapsed: 0.01 s
23:43:35 [2021-03-20T03:43:35.416Z] terminateEngine  Time elapsed: 0 s
23:43:35 [2021-03-20T03:43:35.416Z] keepRunningOnIdle  Time elapsed: 0.001 s
23:43:35 [2021-03-20T03:43:35.416Z] Running org.eclipse.ease.AbstractScriptEngineTest
23:43:37 [2021-03-20T03:43:37.931Z] testorg.eclipse.ease.ScriptExecutionException: Engine got terminated
23:43:37 [2021-03-20T03:43:37.931Z] java.lang.RuntimeException: ERROR
23:43:37 [2021-03-20T03:43:37.931Z] 	at org.eclipse.ease.AbstractScriptEngineTest$MockedScriptEngine.execute(AbstractScriptEngineTest.java:75)
23:43:37 [2021-03-20T03:43:37.931Z] 	at org.eclipse.ease.AbstractScriptEngine.inject(AbstractScriptEngine.java:224)
23:43:37 [2021-03-20T03:43:37.931Z] 	at org.eclipse.ease.AbstractScriptEngine.run(AbstractScriptEngine.java:274)
23:43:37 [2021-03-20T03:43:37.931Z] 	at org.eclipse.core.internal.jobs.Worker.run(Worker.java:63)
23:43:37 [2021-03-20T03:43:37.931Z] 1Tests run: 17, Failures: 0, Errors: 0, Skipped: 0, Time elapsed: 2.609 s - in org.eclipse.ease.AbstractScriptEngineTest
23:43:37 [2021-03-20T03:43:37.931Z] extractEmptyArguments  Time elapsed: 0 s
23:43:37 [2021-03-20T03:43:37.931Z] setNotNullOutputStream  Time elapsed: 0 s
23:43:37 [2021-03-20T03:43:37.931Z] terminateViaMonitorCancellation  Time elapsed: 1.201 s
23:43:37 [2021-03-20T03:43:37.931Z] inject  Time elapsed: 0 s
23:43:37 [2021-03-20T03:43:37.931Z] extractArguments  Time elapsed: 0 s
23:43:37 [2021-03-20T03:43:37.931Z] executeSync  Time elapsed: 0.001 s
23:43:37 [2021-03-20T03:43:37.931Z] setNotNullErrorStream  Time elapsed: 0 s
23:43:37 [2021-03-20T03:43:37.931Z] setNullErrorStream  Time elapsed: 0 s
23:43:37 [2021-03-20T03:43:37.931Z] isJob  Time elapsed: 0 s
23:43:37 [2021-03-20T03:43:37.931Z] streamsAvailable  Time elapsed: 0 s
23:43:37 [2021-03-20T03:43:37.931Z] executeValidCodeAndTerminate  Time elapsed: 0 s
23:43:37 [2021-03-20T03:43:37.931Z] setNullOutputStream  Time elapsed: 0 s
23:43:37 [2021-03-20T03:43:37.931Z] terminateMultipleTimes  Time elapsed: 0.3 s
23:43:37 [2021-03-20T03:43:37.931Z] engineTerminatesWhenIdle  Time elapsed: 0.001 s
23:43:37 [2021-03-20T03:43:37.931Z] terminateViaTerminateMethod  Time elapsed: 1.101 s
23:43:37 [2021-03-20T03:43:37.931Z] terminateViaMethodCallback  Time elapsed: 0.001 s
23:43:37 [2021-03-20T03:43:37.931Z] executeErrorCodeAndTerminate  Time elapsed: 0 s
23:43:37 [2021-03-20T03:43:37.931Z] Running org.eclipse.ease.AbstractCodeFactoryTest
23:43:37 [2021-03-20T03:43:37.931Z] Tests run: 1, Failures: 0, Errors: 0, Skipped: 0, Time elapsed: 0.086 s - in org.eclipse.ease.AbstractCodeFactoryTest
23:43:37 [2021-03-20T03:43:37.931Z] createNewKeywordHeader  Time elapsed: 0.086 s
23:43:37 [2021-03-20T03:43:37.931Z] Running org.eclipse.ease.modules.ScriptParameterTest
23:43:37 [2021-03-20T03:43:37.931Z] Tests run: 6, Failures: 0, Errors: 0, Skipped: 0, Time elapsed: 0.003 s - in org.eclipse.ease.modules.ScriptParameterTest
23:43:37 [2021-03-20T03:43:37.931Z] getDefaultValue_null_when_annotation_has_no_default_value  Time elapsed: 0.001 s
23:43:37 [2021-03-20T03:43:37.931Z] isOptional_false_when_annotation_is_missing  Time elapsed: 0 s
23:43:37 [2021-03-20T03:43:37.931Z] isOptional_false_when_annotation_has_no_default_value  Time elapsed: 0 s
23:43:37 [2021-03-20T03:43:37.931Z] getDefaultValue_has_value_when_annotation_with_default_value_exists  Time elapsed: 0 s
23:43:37 [2021-03-20T03:43:37.931Z] getDefaultValue_null_when_annotation_is_missing  Time elapsed: 0 s
23:43:37 [2021-03-20T03:43:37.931Z] isOptional_true_when_annotation_with_default_value_exists  Time elapsed: 0 s
23:43:37 [2021-03-20T03:43:37.931Z] Running org.eclipse.ease.ScriptResultTest
23:43:37 [2021-03-20T03:43:37.931Z] Tests run: 4, Failures: 0, Errors: 0, Skipped: 0, Time elapsed: 0.001 s - in org.eclipse.ease.ScriptResultTest
23:43:37 [2021-03-20T03:43:37.931Z] hasException  Time elapsed: 0 s
23:43:37 [2021-03-20T03:43:37.931Z] getResult  Time elapsed: 0 s
23:43:37 [2021-03-20T03:43:37.931Z] getException  Time elapsed: 0 s
23:43:37 [2021-03-20T03:43:37.931Z] isReady  Time elapsed: 0 s
23:43:37 [2021-03-20T03:43:37.931Z] Running org.eclipse.ease.tools.RunnableWithResultTest
23:43:37 [2021-03-20T03:43:37.931Z] Tests run: 2, Failures: 0, Errors: 0, Skipped: 0, Time elapsed: 0.001 s - in org.eclipse.ease.tools.RunnableWithResultTest
23:43:37 [2021-03-20T03:43:37.931Z] testException  Time elapsed: 0.001 s
23:43:37 [2021-03-20T03:43:37.931Z] testResult  Time elapsed: 0 s
23:43:37 [2021-03-20T03:43:37.931Z] Running org.eclipse.ease.tools.ResourceToolsTest
23:43:37 [2021-03-20T03:43:37.931Z] Tests run: 47, Failures: 0, Errors: 0, Skipped: 0, Time elapsed: 0.052 s - in org.eclipse.ease.tools.ResourceToolsTest
23:43:37 [2021-03-20T03:43:37.931Z] resolveScriptLocation  Time elapsed: 0.008 s
23:43:37 [2021-03-20T03:43:37.931Z] getWorkspaceInputStream  Time elapsed: 0.001 s
23:43:37 [2021-03-20T03:43:37.931Z] resolvePlatformURI  Time elapsed: 0 s
23:43:37 [2021-03-20T03:43:37.931Z] resolveScriptLocationWithSpacesInPath  Time elapsed: 0.002 s
23:43:37 [2021-03-20T03:43:37.931Z] resolveURL  Time elapsed: 0.001 s
23:43:37 [2021-03-20T03:43:37.931Z] invalidIsAbsolute  Time elapsed: 0 s
23:43:37 [2021-03-20T03:43:37.931Z] getFilesystemInputStream  Time elapsed: 0 s
23:43:37 [2021-03-20T03:43:37.931Z] toRelativeLocationInWorkspace  Time elapsed: 0 s
23:43:37 [2021-03-20T03:43:37.931Z] checkOperatingSystem  Time elapsed: 0 s
23:43:37 [2021-03-20T03:43:37.931Z] inputStreamToString  Time elapsed: 0 s
23:43:37 [2021-03-20T03:43:37.931Z] fileSystemToAbsoluteLocationOnLinux  Time elapsed: 0 s
23:43:37 [2021-03-20T03:43:37.931Z] exists  Time elapsed: 0 s
23:43:37 [2021-03-20T03:43:37.931Z] resolveRelativeInWorkspace  Time elapsed: 0.001 s
23:43:37 [2021-03-20T03:43:37.931Z] isFile  Time elapsed: 0 s
23:43:37 [2021-03-20T03:43:37.931Z] invalidToFile  Time elapsed: 0 s
23:43:37 [2021-03-20T03:43:37.931Z] resolveAbsoluteInFileSystem  Time elapsed: 0 s
23:43:37 [2021-03-20T03:43:37.931Z] resolveWindowsRoot  Time elapsed: 0 s
23:43:37 [2021-03-20T03:43:37.931Z] resolveRelativeInFileSystemOnWindows  Time elapsed: 0 s
23:43:37 [2021-03-20T03:43:37.931Z] isAbsoluteFileSystemPathOnWindows  Time elapsed: 0 s
23:43:37 [2021-03-20T03:43:37.931Z] readerToString  Time elapsed: 0 s
23:43:37 [2021-03-20T03:43:37.931Z] workspaceFileToString  Time elapsed: 0 s
23:43:37 [2021-03-20T03:43:37.931Z] toFile  Time elapsed: 0 s
23:43:37 [2021-03-20T03:43:37.931Z] toProjectRelativeLocation  Time elapsed: 0 s
23:43:37 [2021-03-20T03:43:37.931Z] getInvalidInputStream  Time elapsed: 0.004 s
23:43:37 [2021-03-20T03:43:37.931Z] resolveRelativeInFileSystemOnLinux  Time elapsed: 0 s
23:43:37 [2021-03-20T03:43:37.931Z] isFolder  Time elapsed: 0 s
23:43:37 [2021-03-20T03:43:37.931Z] fileSystemToAbsoluteLocationOnWindows  Time elapsed: 0.001 s
23:43:37 [2021-03-20T03:43:37.932Z] isAbsoluteWorkspacePath  Time elapsed: 0 s
23:43:37 [2021-03-20T03:43:37.932Z] isAbsoluteFileSystemPathOnLinux  Time elapsed: 0 s
23:43:37 [2021-03-20T03:43:37.932Z] resolveInvalid  Time elapsed: 0 s
23:43:37 [2021-03-20T03:43:37.932Z] resolveAbsoluteInFileSystemOnWindows  Time elapsed: 0 s
23:43:37 [2021-03-20T03:43:37.932Z] resolveScriptLocationWithSpacesInDomain  Time elapsed: 0.001 s
23:43:37 [2021-03-20T03:43:37.932Z] resolveRelativefromWorkspaceToFilesystem  Time elapsed: 0 s
23:43:37 [2021-03-20T03:43:37.932Z] resolveRelativeWithoutBaseFile  Time elapsed: 0 s
23:43:37 [2021-03-20T03:43:37.932Z] resolveInWorkspace  Time elapsed: 0.001 s
23:43:37 [2021-03-20T03:43:37.932Z] resolveScriptLocationWithSpecialCharactersInPath  Time elapsed: 0 s
23:43:37 [2021-03-20T03:43:37.932Z] filesystemFileToString  Time elapsed: 0 s
23:43:37 [2021-03-20T03:43:37.932Z] createURI  Time elapsed: 0 s
23:43:37 [2021-03-20T03:43:37.932Z] uriToAbsoluteLocation  Time elapsed: 0.001 s
23:43:37 [2021-03-20T03:43:37.932Z] createFolder  Time elapsed: 0.005 s
23:43:37 [2021-03-20T03:43:37.932Z] workspaceToAbsoluteLocation  Time elapsed: 0.001 s
23:43:37 [2021-03-20T03:43:37.932Z] resolveAbsoluteInFileSystemOnLinux  Time elapsed: 0 s
23:43:37 [2021-03-20T03:43:37.932Z] invalidToString  Time elapsed: 0 s
23:43:37 [2021-03-20T03:43:37.932Z] resolveRelativeURIs  Time elapsed: 0 s
23:43:37 [2021-03-20T03:43:37.932Z] resolveRelativeInFileSystem  Time elapsed: 0 s
23:43:37 [2021-03-20T03:43:37.932Z] resolveScriptLocationWithSpecialCharactersInDomain  Time elapsed: 0.003 s
23:43:37 [2021-03-20T03:43:37.932Z] isAbsoluteURL  Time elapsed: 0 s
23:43:37 [2021-03-20T03:43:37.932Z] Running org.eclipse.ease.tools.StringToolsTest
23:43:37 [2021-03-20T03:43:37.932Z] Tests run: 8, Failures: 0, Errors: 0, Skipped: 0, Time elapsed: 0.002 s - in org.eclipse.ease.tools.StringToolsTest
23:43:37 [2021-03-20T03:43:37.932Z] parseArgumentsNull  Time elapsed: 0 s
23:43:37 [2021-03-20T03:43:37.932Z] parseArgumentsQuotedSingle  Time elapsed: 0 s
23:43:37 [2021-03-20T03:43:37.932Z] parseArgumentsEmpty  Time elapsed: 0 s
23:43:37 [2021-03-20T03:43:37.932Z] parseArgumentsMixedMultiple  Time elapsed: 0 s
23:43:37 [2021-03-20T03:43:37.932Z] parseArgumentsMixedMultipleLines  Time elapsed: 0 s
23:43:37 [2021-03-20T03:43:37.932Z] parseArgumentsNonQuotedMultiple  Time elapsed: 0 s
23:43:37 [2021-03-20T03:43:37.932Z] parseArgumentsNonQuotedSingle  Time elapsed: 0 s
23:43:37 [2021-03-20T03:43:37.932Z] parseArgumentsQuotedMultiple  Time elapsed: 0 s
23:43:37 [2021-03-20T03:43:37.932Z] 
23:43:37 [2021-03-20T03:43:37.932Z] Results:
23:43:37 [2021-03-20T03:43:37.932Z] 
23:43:37 [2021-03-20T03:43:37.932Z] Tests run: 130, Failures: 0, Errors: 0, Skipped: 0
23:43:37 [2021-03-20T03:43:37.932Z] 
23:43:38 [2021-03-20T03:43:38.493Z] [INFO] All tests passed!
23:43:38 [2021-03-20T03:43:38.493Z] [INFO] 
23:43:38 [2021-03-20T03:43:38.493Z] [INFO] ----< org.eclipse.ease:org.eclipse.ease.lang.javascript.rhino.test >----
23:43:38 [2021-03-20T03:43:38.493Z] [INFO] Building org.eclipse.ease.lang.javascript.rhino.test 0.8.0-SNAPSHOT [4/9]
23:43:38 [2021-03-20T03:43:38.493Z] [INFO] ------------------------[ eclipse-test-plugin ]-------------------------
23:43:38 [2021-03-20T03:43:38.493Z] [INFO] 
23:43:38 [2021-03-20T03:43:38.493Z] [INFO] --- tycho-packaging-plugin:2.2.0:build-qualifier (default-build-qualifier) @ org.eclipse.ease.lang.javascript.rhino.test ---
23:43:38 [2021-03-20T03:43:38.493Z] [INFO] The project's OSGi version is 0.8.0.I202103030731
23:43:38 [2021-03-20T03:43:38.493Z] [INFO] 
23:43:38 [2021-03-20T03:43:38.493Z] [INFO] --- tycho-packaging-plugin:2.2.0:validate-id (default-validate-id) @ org.eclipse.ease.lang.javascript.rhino.test ---
23:43:38 [2021-03-20T03:43:38.493Z] [INFO] 
23:43:38 [2021-03-20T03:43:38.493Z] [INFO] --- tycho-packaging-plugin:2.2.0:validate-version (default-validate-version) @ org.eclipse.ease.lang.javascript.rhino.test ---
23:43:38 [2021-03-20T03:43:38.493Z] [INFO] 
23:43:38 [2021-03-20T03:43:38.493Z] [INFO] --- maven-resources-plugin:2.4.3:resources (default-resources) @ org.eclipse.ease.lang.javascript.rhino.test ---
23:43:38 [2021-03-20T03:43:38.493Z] [INFO] Using 'UTF-8' encoding to copy filtered resources.
23:43:38 [2021-03-20T03:43:38.493Z] [INFO] skip non existing resourceDirectory /home/jenkins/agent/workspace/ease.verify.core.target.2018-12/tests/org.eclipse.ease.lang.javascript.rhino.test/src/main/resources
23:43:38 [2021-03-20T03:43:38.493Z] [INFO] 
23:43:38 [2021-03-20T03:43:38.493Z] [INFO] --- tycho-compiler-plugin:2.2.0:compile (default-compile) @ org.eclipse.ease.lang.javascript.rhino.test ---
23:43:38 [2021-03-20T03:43:38.493Z] [INFO] Nothing to compile - all classes are up to date
23:43:38 [2021-03-20T03:43:38.493Z] [INFO] 
23:43:38 [2021-03-20T03:43:38.493Z] [INFO] --- maven-resources-plugin:2.4.3:testResources (default-testResources) @ org.eclipse.ease.lang.javascript.rhino.test ---
23:43:38 [2021-03-20T03:43:38.493Z] [INFO] Using 'UTF-8' encoding to copy filtered resources.
23:43:38 [2021-03-20T03:43:38.493Z] [INFO] skip non existing resourceDirectory /home/jenkins/agent/workspace/ease.verify.core.target.2018-12/tests/org.eclipse.ease.lang.javascript.rhino.test/src/test/resources
23:43:38 [2021-03-20T03:43:38.493Z] [INFO] 
23:43:38 [2021-03-20T03:43:38.493Z] [INFO] --- target-platform-configuration:2.2.0:target-platform (default-target-platform) @ org.eclipse.ease.lang.javascript.rhino.test ---
23:43:38 [2021-03-20T03:43:38.493Z] [INFO] 
23:43:38 [2021-03-20T03:43:38.493Z] [INFO] --- tycho-packaging-plugin:2.2.0:package-plugin (default-package-plugin) @ org.eclipse.ease.lang.javascript.rhino.test ---
23:43:38 [2021-03-20T03:43:38.493Z] [INFO] Building jar: /home/jenkins/agent/workspace/ease.verify.core.target.2018-12/tests/org.eclipse.ease.lang.javascript.rhino.test/target/org.eclipse.ease.lang.javascript.rhino.test-0.8.0-SNAPSHOT.jar
23:43:38 [2021-03-20T03:43:38.493Z] [INFO] 
23:43:38 [2021-03-20T03:43:38.493Z] [INFO] --- tycho-p2-plugin:2.2.0:p2-metadata-default (default-p2-metadata-default) @ org.eclipse.ease.lang.javascript.rhino.test ---
23:43:38 [2021-03-20T03:43:38.493Z] [INFO] 
23:43:38 [2021-03-20T03:43:38.493Z] [INFO] --- jacoco-maven-plugin:0.8.6:prepare-agent (jacoco-initialize) @ org.eclipse.ease.lang.javascript.rhino.test ---
23:43:38 [2021-03-20T03:43:38.493Z] [INFO] tycho.testArgLine set to -javaagent:/home/jenkins/.m2/repository/org/jacoco/org.jacoco.agent/0.8.6/org.jacoco.agent-0.8.6-runtime.jar=destfile=/home/jenkins/agent/workspace/ease.verify.core.target.2018-12/tests/org.eclipse.ease.lang.javascript.rhino.test/target/jacoco.exec,output=file
23:43:38 [2021-03-20T03:43:38.493Z] [INFO] 
23:43:38 [2021-03-20T03:43:38.494Z] [INFO] --- tycho-surefire-plugin:2.2.0:test (default-test) @ org.eclipse.ease.lang.javascript.rhino.test ---
23:43:38 [2021-03-20T03:43:38.494Z] [INFO] Executing Test Runtime with timeout 0, logs (if any) will be placed at: /home/jenkins/agent/workspace/ease.verify.core.target.2018-12/tests/org.eclipse.ease.lang.javascript.rhino.test/target/work/data/.metadata/.log
23:43:38 [2021-03-20T03:43:38.494Z] [INFO] Command line:
23:43:38 [2021-03-20T03:43:38.749Z] 	[/opt/tools/java/openjdk/jdk-15/15.0.2+7/bin/java, -Dosgi.noShutdown=false, -Dosgi.os=linux, -Dosgi.ws=gtk, -Dosgi.arch=x86_64, -javaagent:/home/jenkins/.m2/repository/org/jacoco/org.jacoco.agent/0.8.6/org.jacoco.agent-0.8.6-runtime.jar=destfile=/home/jenkins/agent/workspace/ease.verify.core.target.2018-12/tests/org.eclipse.ease.lang.javascript.rhino.test/target/jacoco.exec,output=file, -Dosgi.clean=true, -jar, /home/jenkins/.m2/repository/p2/osgi/bundle/org.eclipse.equinox.launcher/1.5.200.v20180922-1751/org.eclipse.equinox.launcher-1.5.200.v20180922-1751.jar, -data, /home/jenkins/agent/workspace/ease.verify.core.target.2018-12/tests/org.eclipse.ease.lang.javascript.rhino.test/target/work/data, -install, /home/jenkins/agent/workspace/ease.verify.core.target.2018-12/tests/org.eclipse.ease.lang.javascript.rhino.test/target/work, -configuration, /home/jenkins/agent/workspace/ease.verify.core.target.2018-12/tests/org.eclipse.ease.lang.javascript.rhino.test/target/work/configuration, -application, org.eclipse.tycho.surefire.osgibooter.headlesstest, -testproperties, /home/jenkins/agent/workspace/ease.verify.core.target.2018-12/tests/org.eclipse.ease.lang.javascript.rhino.test/target/surefire.properties]
23:43:38 [2021-03-20T03:43:38.749Z] Picked up JAVA_TOOL_OPTIONS: -Dmaven.ext.class.path="/home/jenkins/agent/workspace/ease.verify.core.target.2018-12@tmp/withMaven1aaadc52/pipeline-maven-spy.jar" -Dorg.jenkinsci.plugins.pipeline.maven.reportsFolder="/home/jenkins/agent/workspace/ease.verify.core.target.2018-12@tmp/withMaven1aaadc52" 
23:43:41 [2021-03-20T03:43:41.288Z] Mar 20, 2021 3:43:40 AM org.junit.platform.launcher.core.DefaultLauncher handleThrowable
23:43:41 [2021-03-20T03:43:41.288Z] WARNING: TestEngine with ID 'junit-vintage' failed to discover tests
23:43:41 [2021-03-20T03:43:41.288Z] java.lang.NoClassDefFoundError: org/junit/runners/model/RunnerBuilder
23:43:41 [2021-03-20T03:43:41.288Z] 	at org.junit.vintage.engine.discovery.VintageDiscoverer.<init>(VintageDiscoverer.java:48)
23:43:41 [2021-03-20T03:43:41.288Z] 	at org.junit.vintage.engine.VintageTestEngine.discover(VintageTestEngine.java:65)
23:43:41 [2021-03-20T03:43:41.288Z] 	at org.junit.platform.launcher.core.DefaultLauncher.discoverEngineRoot(DefaultLauncher.java:130)
23:43:41 [2021-03-20T03:43:41.288Z] 	at org.junit.platform.launcher.core.DefaultLauncher.discoverRoot(DefaultLauncher.java:117)
23:43:41 [2021-03-20T03:43:41.288Z] 	at org.junit.platform.launcher.core.DefaultLauncher.discover(DefaultLauncher.java:82)
23:43:41 [2021-03-20T03:43:41.288Z] 	at org.apache.maven.surefire.junitplatform.TestPlanScannerFilter.accept(TestPlanScannerFilter.java:56)
23:43:41 [2021-03-20T03:43:41.288Z] 	at org.apache.maven.surefire.util.DefaultScanResult.applyFilter(DefaultScanResult.java:102)
23:43:41 [2021-03-20T03:43:41.288Z] 	at org.apache.maven.surefire.junitplatform.JUnitPlatformProvider.scanClasspath(JUnitPlatformProvider.java:143)
23:43:41 [2021-03-20T03:43:41.288Z] 	at org.apache.maven.surefire.junitplatform.JUnitPlatformProvider.invoke(JUnitPlatformProvider.java:124)
23:43:41 [2021-03-20T03:43:41.288Z] 	at java.base/jdk.internal.reflect.NativeMethodAccessorImpl.invoke0(Native Method)
23:43:41 [2021-03-20T03:43:41.288Z] 	at java.base/jdk.internal.reflect.NativeMethodAccessorImpl.invoke(NativeMethodAccessorImpl.java:64)
23:43:41 [2021-03-20T03:43:41.288Z] 	at java.base/jdk.internal.reflect.DelegatingMethodAccessorImpl.invoke(DelegatingMethodAccessorImpl.java:43)
23:43:41 [2021-03-20T03:43:41.288Z] 	at java.base/java.lang.reflect.Method.invoke(Method.java:564)
23:43:41 [2021-03-20T03:43:41.288Z] 	at org.apache.maven.surefire.util.ReflectionUtils.invokeMethodWithArray2(ReflectionUtils.java:206)
23:43:41 [2021-03-20T03:43:41.288Z] 	at org.apache.maven.surefire.booter.ProviderFactory$ProviderProxy.invoke(ProviderFactory.java:161)
23:43:41 [2021-03-20T03:43:41.288Z] 	at org.apache.maven.surefire.booter.ProviderFactory.invokeProvider(ProviderFactory.java:84)
23:43:41 [2021-03-20T03:43:41.288Z] 	at org.eclipse.tycho.surefire.osgibooter.OsgiSurefireBooter.run(OsgiSurefireBooter.java:116)
23:43:41 [2021-03-20T03:43:41.288Z] 	at org.eclipse.tycho.surefire.osgibooter.HeadlessTestApplication.start(HeadlessTestApplication.java:23)
23:43:41 [2021-03-20T03:43:41.288Z] 	at org.eclipse.equinox.internal.app.EclipseAppHandle.run(EclipseAppHandle.java:203)
23:43:41 [2021-03-20T03:43:41.288Z] 	at org.eclipse.core.runtime.internal.adaptor.EclipseAppLauncher.runApplication(EclipseAppLauncher.java:137)
23:43:41 [2021-03-20T03:43:41.288Z] 	at org.eclipse.core.runtime.internal.adaptor.EclipseAppLauncher.start(EclipseAppLauncher.java:107)
23:43:41 [2021-03-20T03:43:41.288Z] 	at org.eclipse.core.runtime.adaptor.EclipseStarter.run(EclipseStarter.java:400)
23:43:41 [2021-03-20T03:43:41.288Z] 	at org.eclipse.core.runtime.adaptor.EclipseStarter.run(EclipseStarter.java:255)
23:43:41 [2021-03-20T03:43:41.288Z] 	at java.base/jdk.internal.reflect.NativeMethodAccessorImpl.invoke0(Native Method)
23:43:41 [2021-03-20T03:43:41.288Z] 	at java.base/jdk.internal.reflect.NativeMethodAccessorImpl.invoke(NativeMethodAccessorImpl.java:64)
23:43:41 [2021-03-20T03:43:41.288Z] 	at java.base/jdk.internal.reflect.DelegatingMethodAccessorImpl.invoke(DelegatingMethodAccessorImpl.java:43)
23:43:41 [2021-03-20T03:43:41.288Z] 	at java.base/java.lang.reflect.Method.invoke(Method.java:564)
23:43:41 [2021-03-20T03:43:41.288Z] 	at org.eclipse.equinox.launcher.Main.invokeFramework(Main.java:659)
23:43:41 [2021-03-20T03:43:41.288Z] 	at org.eclipse.equinox.launcher.Main.basicRun(Main.java:595)
23:43:41 [2021-03-20T03:43:41.288Z] 	at org.eclipse.equinox.launcher.Main.run(Main.java:1501)
23:43:41 [2021-03-20T03:43:41.288Z] 	at org.eclipse.equinox.launcher.Main.main(Main.java:1474)
23:43:41 [2021-03-20T03:43:41.288Z] Caused by: java.lang.ClassNotFoundException: org.junit.runners.model.RunnerBuilder cannot be found by org.eclipse.tycho.surefire.osgibooter_2.2.0
23:43:41 [2021-03-20T03:43:41.288Z] 	at org.eclipse.osgi.internal.loader.BundleLoader.findClassInternal(BundleLoader.java:511)
23:43:41 [2021-03-20T03:43:41.288Z] 	at org.eclipse.osgi.internal.loader.BundleLoader.findClass(BundleLoader.java:422)
23:43:41 [2021-03-20T03:43:41.288Z] 	at org.eclipse.osgi.internal.loader.BundleLoader.findClass(BundleLoader.java:414)
23:43:41 [2021-03-20T03:43:41.288Z] 	at org.eclipse.osgi.internal.loader.ModuleClassLoader.loadClass(ModuleClassLoader.java:153)
23:43:41 [2021-03-20T03:43:41.288Z] 	at java.base/java.lang.ClassLoader.loadClass(ClassLoader.java:522)
23:43:41 [2021-03-20T03:43:41.288Z] 	... 31 more
23:43:41 [2021-03-20T03:43:41.288Z] 
23:43:41 [2021-03-20T03:43:41.288Z] Mar 20, 2021 3:43:40 AM org.junit.platform.launcher.core.DefaultLauncher handleThrowable
23:43:41 [2021-03-20T03:43:41.288Z] WARNING: TestEngine with ID 'junit-vintage' failed to discover tests
23:43:41 [2021-03-20T03:43:41.288Z] java.lang.NoClassDefFoundError: org/junit/runners/model/RunnerBuilder
23:43:41 [2021-03-20T03:43:41.288Z] 	at org.junit.vintage.engine.discovery.VintageDiscoverer.<init>(VintageDiscoverer.java:48)
23:43:41 [2021-03-20T03:43:41.288Z] 	at org.junit.vintage.engine.VintageTestEngine.discover(VintageTestEngine.java:65)
23:43:41 [2021-03-20T03:43:41.288Z] 	at org.junit.platform.launcher.core.DefaultLauncher.discoverEngineRoot(DefaultLauncher.java:130)
23:43:41 [2021-03-20T03:43:41.288Z] 	at org.junit.platform.launcher.core.DefaultLauncher.discoverRoot(DefaultLauncher.java:117)
23:43:41 [2021-03-20T03:43:41.288Z] 	at org.junit.platform.launcher.core.DefaultLauncher.discover(DefaultLauncher.java:82)
23:43:41 [2021-03-20T03:43:41.288Z] 	at org.apache.maven.surefire.junitplatform.TestPlanScannerFilter.accept(TestPlanScannerFilter.java:56)
23:43:41 [2021-03-20T03:43:41.289Z] 	at org.apache.maven.surefire.util.DefaultScanResult.applyFilter(DefaultScanResult.java:102)
23:43:41 [2021-03-20T03:43:41.289Z] 	at org.apache.maven.surefire.junitplatform.JUnitPlatformProvider.scanClasspath(JUnitPlatformProvider.java:143)
23:43:41 [2021-03-20T03:43:41.289Z] 	at org.apache.maven.surefire.junitplatform.JUnitPlatformProvider.invoke(JUnitPlatformProvider.java:124)
23:43:41 [2021-03-20T03:43:41.289Z] 	at java.base/jdk.internal.reflect.NativeMethodAccessorImpl.invoke0(Native Method)
23:43:41 [2021-03-20T03:43:41.289Z] 	at java.base/jdk.internal.reflect.NativeMethodAccessorImpl.invoke(NativeMethodAccessorImpl.java:64)
23:43:41 [2021-03-20T03:43:41.289Z] 	at java.base/jdk.internal.reflect.DelegatingMethodAccessorImpl.invoke(DelegatingMethodAccessorImpl.java:43)
23:43:41 [2021-03-20T03:43:41.289Z] 	at java.base/java.lang.reflect.Method.invoke(Method.java:564)
23:43:41 [2021-03-20T03:43:41.289Z] 	at org.apache.maven.surefire.util.ReflectionUtils.invokeMethodWithArray2(ReflectionUtils.java:206)
23:43:41 [2021-03-20T03:43:41.289Z] 	at org.apache.maven.surefire.booter.ProviderFactory$ProviderProxy.invoke(ProviderFactory.java:161)
23:43:41 [2021-03-20T03:43:41.289Z] 	at org.apache.maven.surefire.booter.ProviderFactory.invokeProvider(ProviderFactory.java:84)
23:43:41 [2021-03-20T03:43:41.289Z] 	at org.eclipse.tycho.surefire.osgibooter.OsgiSurefireBooter.run(OsgiSurefireBooter.java:116)
23:43:41 [2021-03-20T03:43:41.289Z] 	at org.eclipse.tycho.surefire.osgibooter.HeadlessTestApplication.start(HeadlessTestApplication.java:23)
23:43:41 [2021-03-20T03:43:41.289Z] 	at org.eclipse.equinox.internal.app.EclipseAppHandle.run(EclipseAppHandle.java:203)
23:43:41 [2021-03-20T03:43:41.289Z] 	at org.eclipse.core.runtime.internal.adaptor.EclipseAppLauncher.runApplication(EclipseAppLauncher.java:137)
23:43:41 [2021-03-20T03:43:41.289Z] 	at org.eclipse.core.runtime.internal.adaptor.EclipseAppLauncher.start(EclipseAppLauncher.java:107)
23:43:41 [2021-03-20T03:43:41.289Z] 	at org.eclipse.core.runtime.adaptor.EclipseStarter.run(EclipseStarter.java:400)
23:43:41 [2021-03-20T03:43:41.289Z] 	at org.eclipse.core.runtime.adaptor.EclipseStarter.run(EclipseStarter.java:255)
23:43:41 [2021-03-20T03:43:41.289Z] 	at java.base/jdk.internal.reflect.NativeMethodAccessorImpl.invoke0(Native Method)
23:43:41 [2021-03-20T03:43:41.289Z] 	at java.base/jdk.internal.reflect.NativeMethodAccessorImpl.invoke(NativeMethodAccessorImpl.java:64)
23:43:41 [2021-03-20T03:43:41.289Z] 	at java.base/jdk.internal.reflect.DelegatingMethodAccessorImpl.invoke(DelegatingMethodAccessorImpl.java:43)
23:43:41 [2021-03-20T03:43:41.289Z] 	at java.base/java.lang.reflect.Method.invoke(Method.java:564)
23:43:41 [2021-03-20T03:43:41.289Z] 	at org.eclipse.equinox.launcher.Main.invokeFramework(Main.java:659)
23:43:41 [2021-03-20T03:43:41.289Z] 	at org.eclipse.equinox.launcher.Main.basicRun(Main.java:595)
23:43:41 [2021-03-20T03:43:41.289Z] 	at org.eclipse.equinox.launcher.Main.run(Main.java:1501)
23:43:41 [2021-03-20T03:43:41.289Z] 	at org.eclipse.equinox.launcher.Main.main(Main.java:1474)
23:43:41 [2021-03-20T03:43:41.289Z] Caused by: java.lang.ClassNotFoundException: org.junit.runners.model.RunnerBuilder cannot be found by org.eclipse.tycho.surefire.osgibooter_2.2.0
23:43:41 [2021-03-20T03:43:41.289Z] 	at org.eclipse.osgi.internal.loader.BundleLoader.findClassInternal(BundleLoader.java:511)
23:43:41 [2021-03-20T03:43:41.289Z] 	at org.eclipse.osgi.internal.loader.BundleLoader.findClass(BundleLoader.java:422)
23:43:41 [2021-03-20T03:43:41.289Z] 	at org.eclipse.osgi.internal.loader.BundleLoader.findClass(BundleLoader.java:414)
23:43:41 [2021-03-20T03:43:41.289Z] 	at org.eclipse.osgi.internal.loader.ModuleClassLoader.loadClass(ModuleClassLoader.java:153)
23:43:41 [2021-03-20T03:43:41.289Z] 	at java.base/java.lang.ClassLoader.loadClass(ClassLoader.java:522)
23:43:41 [2021-03-20T03:43:41.289Z] 	... 31 more
23:43:41 [2021-03-20T03:43:41.289Z] 
23:43:41 [2021-03-20T03:43:41.289Z] Mar 20, 2021 3:43:41 AM org.junit.platform.launcher.core.DefaultLauncher handleThrowable
23:43:41 [2021-03-20T03:43:41.289Z] WARNING: TestEngine with ID 'junit-vintage' failed to discover tests
23:43:41 [2021-03-20T03:43:41.289Z] java.lang.NoClassDefFoundError: org/junit/runners/model/RunnerBuilder
23:43:41 [2021-03-20T03:43:41.289Z] 	at org.junit.vintage.engine.discovery.VintageDiscoverer.<init>(VintageDiscoverer.java:48)
23:43:41 [2021-03-20T03:43:41.289Z] 	at org.junit.vintage.engine.VintageTestEngine.discover(VintageTestEngine.java:65)
23:43:41 [2021-03-20T03:43:41.289Z] 	at org.junit.platform.launcher.core.DefaultLauncher.discoverEngineRoot(DefaultLauncher.java:130)
23:43:41 [2021-03-20T03:43:41.289Z] 	at org.junit.platform.launcher.core.DefaultLauncher.discoverRoot(DefaultLauncher.java:117)
23:43:41 [2021-03-20T03:43:41.289Z] 	at org.junit.platform.launcher.core.DefaultLauncher.discover(DefaultLauncher.java:82)
23:43:41 [2021-03-20T03:43:41.289Z] 	at org.apache.maven.surefire.junitplatform.TestPlanScannerFilter.accept(TestPlanScannerFilter.java:56)
23:43:41 [2021-03-20T03:43:41.289Z] 	at org.apache.maven.surefire.util.DefaultScanResult.applyFilter(DefaultScanResult.java:102)
23:43:41 [2021-03-20T03:43:41.289Z] 	at org.apache.maven.surefire.junitplatform.JUnitPlatformProvider.scanClasspath(JUnitPlatformProvider.java:143)
23:43:41 [2021-03-20T03:43:41.289Z] 	at org.apache.maven.surefire.junitplatform.JUnitPlatformProvider.invoke(JUnitPlatformProvider.java:124)
23:43:41 [2021-03-20T03:43:41.289Z] 	at java.base/jdk.internal.reflect.NativeMethodAccessorImpl.invoke0(Native Method)
23:43:41 [2021-03-20T03:43:41.289Z] 	at java.base/jdk.internal.reflect.NativeMethodAccessorImpl.invoke(NativeMethodAccessorImpl.java:64)
23:43:41 [2021-03-20T03:43:41.289Z] 	at java.base/jdk.internal.reflect.DelegatingMethodAccessorImpl.invoke(DelegatingMethodAccessorImpl.java:43)
23:43:41 [2021-03-20T03:43:41.289Z] 	at java.base/java.lang.reflect.Method.invoke(Method.java:564)
23:43:41 [2021-03-20T03:43:41.289Z] 	at org.apache.maven.surefire.util.ReflectionUtils.invokeMethodWithArray2(ReflectionUtils.java:206)
23:43:41 [2021-03-20T03:43:41.289Z] 	at org.apache.maven.surefire.booter.ProviderFactory$ProviderProxy.invoke(ProviderFactory.java:161)
23:43:41 [2021-03-20T03:43:41.289Z] 	at org.apache.maven.surefire.booter.ProviderFactory.invokeProvider(ProviderFactory.java:84)
23:43:41 [2021-03-20T03:43:41.289Z] 	at org.eclipse.tycho.surefire.osgibooter.OsgiSurefireBooter.run(OsgiSurefireBooter.java:116)
23:43:41 [2021-03-20T03:43:41.289Z] 	at org.eclipse.tycho.surefire.osgibooter.HeadlessTestApplication.start(HeadlessTestApplication.java:23)
23:43:41 [2021-03-20T03:43:41.289Z] 	at org.eclipse.equinox.internal.app.EclipseAppHandle.run(EclipseAppHandle.java:203)
23:43:41 [2021-03-20T03:43:41.289Z] 	at org.eclipse.core.runtime.internal.adaptor.EclipseAppLauncher.runApplication(EclipseAppLauncher.java:137)
23:43:41 [2021-03-20T03:43:41.289Z] 	at org.eclipse.core.runtime.internal.adaptor.EclipseAppLauncher.start(EclipseAppLauncher.java:107)
23:43:41 [2021-03-20T03:43:41.289Z] 	at org.eclipse.core.runtime.adaptor.EclipseStarter.run(EclipseStarter.java:400)
23:43:41 [2021-03-20T03:43:41.289Z] 	at org.eclipse.core.runtime.adaptor.EclipseStarter.run(EclipseStarter.java:255)
23:43:41 [2021-03-20T03:43:41.289Z] 	at java.base/jdk.internal.reflect.NativeMethodAccessorImpl.invoke0(Native Method)
23:43:41 [2021-03-20T03:43:41.289Z] 	at java.base/jdk.internal.reflect.NativeMethodAccessorImpl.invoke(NativeMethodAccessorImpl.java:64)
23:43:41 [2021-03-20T03:43:41.289Z] 	at java.base/jdk.internal.reflect.DelegatingMethodAccessorImpl.invoke(DelegatingMethodAccessorImpl.java:43)
23:43:41 [2021-03-20T03:43:41.289Z] 	at java.base/java.lang.reflect.Method.invoke(Method.java:564)
23:43:41 [2021-03-20T03:43:41.289Z] 	at org.eclipse.equinox.launcher.Main.invokeFramework(Main.java:659)
23:43:41 [2021-03-20T03:43:41.289Z] 	at org.eclipse.equinox.launcher.Main.basicRun(Main.java:595)
23:43:41 [2021-03-20T03:43:41.289Z] 	at org.eclipse.equinox.launcher.Main.run(Main.java:1501)
23:43:41 [2021-03-20T03:43:41.289Z] 	at org.eclipse.equinox.launcher.Main.main(Main.java:1474)
23:43:41 [2021-03-20T03:43:41.289Z] Caused by: java.lang.ClassNotFoundException: org.junit.runners.model.RunnerBuilder cannot be found by org.eclipse.tycho.surefire.osgibooter_2.2.0
23:43:41 [2021-03-20T03:43:41.289Z] 	at org.eclipse.osgi.internal.loader.BundleLoader.findClassInternal(BundleLoader.java:511)
23:43:41 [2021-03-20T03:43:41.289Z] 	at org.eclipse.osgi.internal.loader.BundleLoader.findClass(BundleLoader.java:422)
23:43:41 [2021-03-20T03:43:41.289Z] 	at org.eclipse.osgi.internal.loader.BundleLoader.findClass(BundleLoader.java:414)
23:43:41 [2021-03-20T03:43:41.289Z] 	at org.eclipse.osgi.internal.loader.ModuleClassLoader.loadClass(ModuleClassLoader.java:153)
23:43:41 [2021-03-20T03:43:41.289Z] 	at java.base/java.lang.ClassLoader.loadClass(ClassLoader.java:522)
23:43:41 [2021-03-20T03:43:41.289Z] 	... 31 more
23:43:41 [2021-03-20T03:43:41.289Z] 
23:43:41 [2021-03-20T03:43:41.289Z] Mar 20, 2021 3:43:41 AM org.junit.platform.launcher.core.DefaultLauncher handleThrowable
23:43:41 [2021-03-20T03:43:41.289Z] WARNING: TestEngine with ID 'junit-vintage' failed to discover tests
23:43:41 [2021-03-20T03:43:41.290Z] java.lang.NoClassDefFoundError: org/junit/runners/model/RunnerBuilder
23:43:41 [2021-03-20T03:43:41.290Z] 	at org.junit.vintage.engine.discovery.VintageDiscoverer.<init>(VintageDiscoverer.java:48)
23:43:41 [2021-03-20T03:43:41.290Z] 	at org.junit.vintage.engine.VintageTestEngine.discover(VintageTestEngine.java:65)
23:43:41 [2021-03-20T03:43:41.290Z] 	at org.junit.platform.launcher.core.DefaultLauncher.discoverEngineRoot(DefaultLauncher.java:130)
23:43:41 [2021-03-20T03:43:41.290Z] 	at org.junit.platform.launcher.core.DefaultLauncher.discoverRoot(DefaultLauncher.java:117)
23:43:41 [2021-03-20T03:43:41.290Z] 	at org.junit.platform.launcher.core.DefaultLauncher.discover(DefaultLauncher.java:82)
23:43:41 [2021-03-20T03:43:41.290Z] 	at org.apache.maven.surefire.junitplatform.TestPlanScannerFilter.accept(TestPlanScannerFilter.java:56)
23:43:41 [2021-03-20T03:43:41.290Z] 	at org.apache.maven.surefire.util.DefaultScanResult.applyFilter(DefaultScanResult.java:102)
23:43:41 [2021-03-20T03:43:41.290Z] 	at org.apache.maven.surefire.junitplatform.JUnitPlatformProvider.scanClasspath(JUnitPlatformProvider.java:143)
23:43:41 [2021-03-20T03:43:41.290Z] 	at org.apache.maven.surefire.junitplatform.JUnitPlatformProvider.invoke(JUnitPlatformProvider.java:124)
23:43:41 [2021-03-20T03:43:41.290Z] 	at java.base/jdk.internal.reflect.NativeMethodAccessorImpl.invoke0(Native Method)
23:43:41 [2021-03-20T03:43:41.290Z] 	at java.base/jdk.internal.reflect.NativeMethodAccessorImpl.invoke(NativeMethodAccessorImpl.java:64)
23:43:41 [2021-03-20T03:43:41.290Z] 	at java.base/jdk.internal.reflect.DelegatingMethodAccessorImpl.invoke(DelegatingMethodAccessorImpl.java:43)
23:43:41 [2021-03-20T03:43:41.290Z] 	at java.base/java.lang.reflect.Method.invoke(Method.java:564)
23:43:41 [2021-03-20T03:43:41.290Z] 	at org.apache.maven.surefire.util.ReflectionUtils.invokeMethodWithArray2(ReflectionUtils.java:206)
23:43:41 [2021-03-20T03:43:41.290Z] 	at org.apache.maven.surefire.booter.ProviderFactory$ProviderProxy.invoke(ProviderFactory.java:161)
23:43:41 [2021-03-20T03:43:41.290Z] 	at org.apache.maven.surefire.booter.ProviderFactory.invokeProvider(ProviderFactory.java:84)
23:43:41 [2021-03-20T03:43:41.290Z] 	at org.eclipse.tycho.surefire.osgibooter.OsgiSurefireBooter.run(OsgiSurefireBooter.java:116)
23:43:41 [2021-03-20T03:43:41.290Z] 	at org.eclipse.tycho.surefire.osgibooter.HeadlessTestApplication.start(HeadlessTestApplication.java:23)
23:43:41 [2021-03-20T03:43:41.290Z] 	at org.eclipse.equinox.internal.app.EclipseAppHandle.run(EclipseAppHandle.java:203)
23:43:41 [2021-03-20T03:43:41.290Z] 	at org.eclipse.core.runtime.internal.adaptor.EclipseAppLauncher.runApplication(EclipseAppLauncher.java:137)
23:43:41 [2021-03-20T03:43:41.290Z] 	at org.eclipse.core.runtime.internal.adaptor.EclipseAppLauncher.start(EclipseAppLauncher.java:107)
23:43:41 [2021-03-20T03:43:41.290Z] 	at org.eclipse.core.runtime.adaptor.EclipseStarter.run(EclipseStarter.java:400)
23:43:41 [2021-03-20T03:43:41.290Z] 	at org.eclipse.core.runtime.adaptor.EclipseStarter.run(EclipseStarter.java:255)
23:43:41 [2021-03-20T03:43:41.290Z] 	at java.base/jdk.internal.reflect.NativeMethodAccessorImpl.invoke0(Native Method)
23:43:41 [2021-03-20T03:43:41.290Z] 	at java.base/jdk.internal.reflect.NativeMethodAccessorImpl.invoke(NativeMethodAccessorImpl.java:64)
23:43:41 [2021-03-20T03:43:41.290Z] 	at java.base/jdk.internal.reflect.DelegatingMethodAccessorImpl.invoke(DelegatingMethodAccessorImpl.java:43)
23:43:41 [2021-03-20T03:43:41.290Z] 	at java.base/java.lang.reflect.Method.invoke(Method.java:564)
23:43:41 [2021-03-20T03:43:41.290Z] 	at org.eclipse.equinox.launcher.Main.invokeFramework(Main.java:659)
23:43:41 [2021-03-20T03:43:41.290Z] 	at org.eclipse.equinox.launcher.Main.basicRun(Main.java:595)
23:43:41 [2021-03-20T03:43:41.290Z] 	at org.eclipse.equinox.launcher.Main.run(Main.java:1501)
23:43:41 [2021-03-20T03:43:41.290Z] 	at org.eclipse.equinox.launcher.Main.main(Main.java:1474)
23:43:41 [2021-03-20T03:43:41.290Z] Caused by: java.lang.ClassNotFoundException: org.junit.runners.model.RunnerBuilder cannot be found by org.eclipse.tycho.surefire.osgibooter_2.2.0
23:43:41 [2021-03-20T03:43:41.290Z] 	at org.eclipse.osgi.internal.loader.BundleLoader.findClassInternal(BundleLoader.java:511)
23:43:41 [2021-03-20T03:43:41.290Z] 	at org.eclipse.osgi.internal.loader.BundleLoader.findClass(BundleLoader.java:422)
23:43:41 [2021-03-20T03:43:41.290Z] 	at org.eclipse.osgi.internal.loader.BundleLoader.findClass(BundleLoader.java:414)
23:43:41 [2021-03-20T03:43:41.290Z] 	at org.eclipse.osgi.internal.loader.ModuleClassLoader.loadClass(ModuleClassLoader.java:153)
23:43:41 [2021-03-20T03:43:41.290Z] 	at java.base/java.lang.ClassLoader.loadClass(ClassLoader.java:522)
23:43:41 [2021-03-20T03:43:41.290Z] 	... 31 more
23:43:41 [2021-03-20T03:43:41.290Z] 
23:43:41 [2021-03-20T03:43:41.290Z] Mar 20, 2021 3:43:41 AM org.junit.platform.launcher.core.DefaultLauncher handleThrowable
23:43:41 [2021-03-20T03:43:41.290Z] WARNING: TestEngine with ID 'junit-vintage' failed to discover tests
23:43:41 [2021-03-20T03:43:41.290Z] java.lang.NoClassDefFoundError: org/junit/runners/model/RunnerBuilder
23:43:41 [2021-03-20T03:43:41.290Z] 	at org.junit.vintage.engine.discovery.VintageDiscoverer.<init>(VintageDiscoverer.java:48)
23:43:41 [2021-03-20T03:43:41.290Z] 	at org.junit.vintage.engine.VintageTestEngine.discover(VintageTestEngine.java:65)
23:43:41 [2021-03-20T03:43:41.290Z] 	at org.junit.platform.launcher.core.DefaultLauncher.discoverEngineRoot(DefaultLauncher.java:130)
23:43:41 [2021-03-20T03:43:41.290Z] 	at org.junit.platform.launcher.core.DefaultLauncher.discoverRoot(DefaultLauncher.java:117)
23:43:41 [2021-03-20T03:43:41.290Z] 	at org.junit.platform.launcher.core.DefaultLauncher.execute(DefaultLauncher.java:90)
23:43:41 [2021-03-20T03:43:41.290Z] 	at org.apache.maven.surefire.junitplatform.JUnitPlatformProvider.invokeAllTests(JUnitPlatformProvider.java:150)
23:43:41 [2021-03-20T03:43:41.290Z] 	at org.apache.maven.surefire.junitplatform.JUnitPlatformProvider.invoke(JUnitPlatformProvider.java:124)
23:43:41 [2021-03-20T03:43:41.290Z] 	at java.base/jdk.internal.reflect.NativeMethodAccessorImpl.invoke0(Native Method)
23:43:41 [2021-03-20T03:43:41.290Z] 	at java.base/jdk.internal.reflect.NativeMethodAccessorImpl.invoke(NativeMethodAccessorImpl.java:64)
23:43:41 [2021-03-20T03:43:41.290Z] 	at java.base/jdk.internal.reflect.DelegatingMethodAccessorImpl.invoke(DelegatingMethodAccessorImpl.java:43)
23:43:41 [2021-03-20T03:43:41.290Z] 	at java.base/java.lang.reflect.Method.invoke(Method.java:564)
23:43:41 [2021-03-20T03:43:41.290Z] 	at org.apache.maven.surefire.util.ReflectionUtils.invokeMethodWithArray2(ReflectionUtils.java:206)
23:43:41 [2021-03-20T03:43:41.290Z] 	at org.apache.maven.surefire.booter.ProviderFactory$ProviderProxy.invoke(ProviderFactory.java:161)
23:43:41 [2021-03-20T03:43:41.290Z] 	at org.apache.maven.surefire.booter.ProviderFactory.invokeProvider(ProviderFactory.java:84)
23:43:41 [2021-03-20T03:43:41.290Z] 	at org.eclipse.tycho.surefire.osgibooter.OsgiSurefireBooter.run(OsgiSurefireBooter.java:116)
23:43:41 [2021-03-20T03:43:41.290Z] 	at org.eclipse.tycho.surefire.osgibooter.HeadlessTestApplication.start(HeadlessTestApplication.java:23)
23:43:41 [2021-03-20T03:43:41.290Z] 	at org.eclipse.equinox.internal.app.EclipseAppHandle.run(EclipseAppHandle.java:203)
23:43:41 [2021-03-20T03:43:41.290Z] 	at org.eclipse.core.runtime.internal.adaptor.EclipseAppLauncher.runApplication(EclipseAppLauncher.java:137)
23:43:41 [2021-03-20T03:43:41.290Z] 	at org.eclipse.core.runtime.internal.adaptor.EclipseAppLauncher.start(EclipseAppLauncher.java:107)
23:43:41 [2021-03-20T03:43:41.290Z] 	at org.eclipse.core.runtime.adaptor.EclipseStarter.run(EclipseStarter.java:400)
23:43:41 [2021-03-20T03:43:41.290Z] 	at org.eclipse.core.runtime.adaptor.EclipseStarter.run(EclipseStarter.java:255)
23:43:41 [2021-03-20T03:43:41.290Z] 	at java.base/jdk.internal.reflect.NativeMethodAccessorImpl.invoke0(Native Method)
23:43:41 [2021-03-20T03:43:41.290Z] 	at java.base/jdk.internal.reflect.NativeMethodAccessorImpl.invoke(NativeMethodAccessorImpl.java:64)
23:43:41 [2021-03-20T03:43:41.290Z] 	at java.base/jdk.internal.reflect.DelegatingMethodAccessorImpl.invoke(DelegatingMethodAccessorImpl.java:43)
23:43:41 [2021-03-20T03:43:41.290Z] 	at java.base/java.lang.reflect.Method.invoke(Method.java:564)
23:43:41 [2021-03-20T03:43:41.290Z] 	at org.eclipse.equinox.launcher.Main.invokeFramework(Main.java:659)
23:43:41 [2021-03-20T03:43:41.290Z] 	at org.eclipse.equinox.launcher.Main.basicRun(Main.java:595)
23:43:41 [2021-03-20T03:43:41.290Z] 	at org.eclipse.equinox.launcher.Main.run(Main.java:1501)
23:43:41 [2021-03-20T03:43:41.290Z] 	at org.eclipse.equinox.launcher.Main.main(Main.java:1474)
23:43:41 [2021-03-20T03:43:41.291Z] Caused by: java.lang.ClassNotFoundException: org.junit.runners.model.RunnerBuilder cannot be found by org.eclipse.tycho.surefire.osgibooter_2.2.0
23:43:41 [2021-03-20T03:43:41.291Z] 	at org.eclipse.osgi.internal.loader.BundleLoader.findClassInternal(BundleLoader.java:511)
23:43:41 [2021-03-20T03:43:41.291Z] 	at org.eclipse.osgi.internal.loader.BundleLoader.findClass(BundleLoader.java:422)
23:43:41 [2021-03-20T03:43:41.291Z] 	at org.eclipse.osgi.internal.loader.BundleLoader.findClass(BundleLoader.java:414)
23:43:41 [2021-03-20T03:43:41.291Z] 	at org.eclipse.osgi.internal.loader.ModuleClassLoader.loadClass(ModuleClassLoader.java:153)
23:43:41 [2021-03-20T03:43:41.291Z] 	at java.base/java.lang.ClassLoader.loadClass(ClassLoader.java:522)
23:43:41 [2021-03-20T03:43:41.291Z] 	... 29 more
23:43:41 [2021-03-20T03:43:41.291Z] 
23:43:41 [2021-03-20T03:43:41.291Z] Running org.eclipse.ease.lang.javascript.rhino.RhinoEnvironmentTest
23:43:42 [2021-03-20T03:43:42.221Z] Tests run: 5, Failures: 0, Errors: 0, Skipped: 0, Time elapsed: 0.851 s - in org.eclipse.ease.lang.javascript.rhino.RhinoEnvironmentTest
23:43:42 [2021-03-20T03:43:42.221Z] reloadEnvironment  Time elapsed: 0.295 s
23:43:42 [2021-03-20T03:43:42.221Z] bootstrappedEnvironment  Time elapsed: 0.065 s
23:43:42 [2021-03-20T03:43:42.221Z] postMethodCallback  Time elapsed: 0.395 s
23:43:42 [2021-03-20T03:43:42.221Z] preMethodCallback  Time elapsed: 0.019 s
23:43:42 [2021-03-20T03:43:42.221Z] reloadFunctionDefinitions  Time elapsed: 0.069 s
23:43:42 [2021-03-20T03:43:42.221Z] Running org.eclipse.ease.lang.javascript.rhino.RhinoDebuggerEngineTest
23:43:42 [2021-03-20T03:43:42.477Z] org.eclipse.ease.ScriptExecutionException: JavaError: NotThere cannot be found by org.mozilla.javascript_1.7.5.v201504281450
23:43:42 [2021-03-20T03:43:42.477Z] 
23:43:42 [2021-03-20T03:43:42.477Z] Java Stacktrace:
23:43:42 [2021-03-20T03:43:42.477Z] java.lang.ClassNotFoundException: NotThere cannot be found by org.mozilla.javascript_1.7.5.v201504281450
23:43:42 [2021-03-20T03:43:42.477Z] 	at org.eclipse.osgi.internal.loader.BundleLoader.findClassInternal(BundleLoader.java:511)
23:43:42 [2021-03-20T03:43:42.477Z] 	at org.eclipse.osgi.internal.loader.BundleLoader.findClass(BundleLoader.java:422)
23:43:42 [2021-03-20T03:43:42.477Z] 	at org.eclipse.osgi.internal.loader.BundleLoader.findClass(BundleLoader.java:414)
23:43:42 [2021-03-20T03:43:42.477Z] 	at org.eclipse.osgi.internal.loader.ModuleClassLoader.loadClass(ModuleClassLoader.java:153)
23:43:42 [2021-03-20T03:43:42.477Z] 	at java.base/java.lang.ClassLoader.loadClass(ClassLoader.java:522)
23:43:42 [2021-03-20T03:43:42.477Z] 	at java.base/java.lang.Class.forName0(Native Method)
23:43:42 [2021-03-20T03:43:42.477Z] 	at java.base/java.lang.Class.forName(Class.java:377)
23:43:42 [2021-03-20T03:43:42.477Z] 	at java.base/jdk.internal.reflect.NativeMethodAccessorImpl.invoke0(Native Method)
23:43:42 [2021-03-20T03:43:42.477Z] 	at java.base/jdk.internal.reflect.NativeMethodAccessorImpl.invoke(NativeMethodAccessorImpl.java:64)
23:43:42 [2021-03-20T03:43:42.477Z] 	at java.base/jdk.internal.reflect.DelegatingMethodAccessorImpl.invoke(DelegatingMethodAccessorImpl.java:43)
23:43:42 [2021-03-20T03:43:42.477Z] 	at java.base/java.lang.reflect.Method.invoke(Method.java:564)
23:43:42 [2021-03-20T03:43:42.477Z] 	at org.mozilla.javascript.MemberBox.invoke(MemberBox.java:126)
23:43:42 [2021-03-20T03:43:42.477Z] 	at org.mozilla.javascript.NativeJavaMethod.call(NativeJavaMethod.java:225)
23:43:42 [2021-03-20T03:43:42.477Z] 	at org.mozilla.javascript.Interpreter.interpretLoop(Interpreter.java:1473)
23:43:42 [2021-03-20T03:43:42.477Z] 	at org.mozilla.javascript.Interpreter.interpret(Interpreter.java:815)
23:43:42 [2021-03-20T03:43:42.477Z] 	at org.mozilla.javascript.InterpretedFunction.call(InterpretedFunction.java:109)
23:43:42 [2021-03-20T03:43:42.477Z] 	at org.mozilla.javascript.ContextFactory.doTopCall(ContextFactory.java:394)
23:43:42 [2021-03-20T03:43:42.477Z] 	at org.mozilla.javascript.ScriptRuntime.doTopCall(ScriptRuntime.java:3091)
23:43:42 [2021-03-20T03:43:42.477Z] 	at org.mozilla.javascript.InterpretedFunction.exec(InterpretedFunction.java:120)
23:43:42 [2021-03-20T03:43:42.477Z] 	at org.mozilla.javascript.Context.evaluateReader(Context.java:1110)
23:43:42 [2021-03-20T03:43:42.477Z] 	at org.eclipse.ease.lang.javascript.rhino.RhinoScriptEngine.internalExecute(RhinoScriptEngine.java:222)
23:43:42 [2021-03-20T03:43:42.477Z] 	at org.eclipse.ease.lang.javascript.rhino.RhinoScriptEngine.execute(RhinoScriptEngine.java:201)
23:43:42 [2021-03-20T03:43:42.477Z] 	at org.eclipse.ease.AbstractScriptEngine.inject(AbstractScriptEngine.java:224)
23:43:42 [2021-03-20T03:43:42.477Z] 	at org.eclipse.ease.AbstractScriptEngine.run(AbstractScriptEngine.java:274)
23:43:42 [2021-03-20T03:43:42.477Z] 	at org.eclipse.core.internal.jobs.Worker.run(Worker.java:63)
23:43:42 [2021-03-20T03:43:42.477Z] org.eclipse.ease.ScriptExecutionException: TypeError: Cannot call method "foobar" of undefined
23:43:42 [2021-03-20T03:43:42.477Z] org.eclipse.ease.ScriptExecutionException: ScriptException: test
23:43:42 [2021-03-20T03:43:42.477Z] org.eclipse.ease.ScriptExecutionException: JavaError: java.lang.Exception
23:43:42 [2021-03-20T03:43:42.477Z] 
23:43:42 [2021-03-20T03:43:42.477Z] Java Stacktrace:
23:43:42 [2021-03-20T03:43:42.477Z] java.lang.Exception
23:43:42 [2021-03-20T03:43:42.477Z] 	at java.base/jdk.internal.reflect.NativeConstructorAccessorImpl.newInstance0(Native Method)
23:43:42 [2021-03-20T03:43:42.477Z] 	at java.base/jdk.internal.reflect.NativeConstructorAccessorImpl.newInstance(NativeConstructorAccessorImpl.java:64)
23:43:42 [2021-03-20T03:43:42.477Z] 	at java.base/jdk.internal.reflect.DelegatingConstructorAccessorImpl.newInstance(DelegatingConstructorAccessorImpl.java:45)
23:43:42 [2021-03-20T03:43:42.478Z] 	at java.base/java.lang.reflect.Constructor.newInstanceWithCaller(Constructor.java:500)
23:43:42 [2021-03-20T03:43:42.478Z] 	at java.base/java.lang.reflect.Constructor.newInstance(Constructor.java:481)
23:43:42 [2021-03-20T03:43:42.478Z] 	at org.mozilla.javascript.MemberBox.newInstance(MemberBox.java:159)
23:43:42 [2021-03-20T03:43:42.478Z] 	at org.mozilla.javascript.NativeJavaClass.constructInternal(NativeJavaClass.java:266)
23:43:42 [2021-03-20T03:43:42.478Z] 	at org.mozilla.javascript.NativeJavaClass.constructSpecific(NativeJavaClass.java:205)
23:43:42 [2021-03-20T03:43:42.478Z] 	at org.mozilla.javascript.NativeJavaClass.construct(NativeJavaClass.java:166)
23:43:42 [2021-03-20T03:43:42.478Z] 	at org.mozilla.javascript.Interpreter.interpretLoop(Interpreter.java:1519)
23:43:42 [2021-03-20T03:43:42.478Z] 	at org.mozilla.javascript.Interpreter.interpret(Interpreter.java:815)
23:43:42 [2021-03-20T03:43:42.478Z] 	at org.mozilla.javascript.InterpretedFunction.call(InterpretedFunction.java:109)
23:43:42 [2021-03-20T03:43:42.478Z] 	at org.mozilla.javascript.ContextFactory.doTopCall(ContextFactory.java:394)
23:43:42 [2021-03-20T03:43:42.478Z] 	at org.mozilla.javascript.ScriptRuntime.doTopCall(ScriptRuntime.java:3091)
23:43:42 [2021-03-20T03:43:42.478Z] 	at org.mozilla.javascript.InterpretedFunction.exec(InterpretedFunction.java:120)
23:43:42 [2021-03-20T03:43:42.478Z] 	at org.mozilla.javascript.Context.evaluateReader(Context.java:1110)
23:43:42 [2021-03-20T03:43:42.478Z] 	at org.eclipse.ease.lang.javascript.rhino.RhinoScriptEngine.internalExecute(RhinoScriptEngine.java:222)
23:43:42 [2021-03-20T03:43:42.478Z] 	at org.eclipse.ease.lang.javascript.rhino.RhinoScriptEngine.execute(RhinoScriptEngine.java:201)
23:43:42 [2021-03-20T03:43:42.478Z] 	at org.eclipse.ease.AbstractScriptEngine.inject(AbstractScriptEngine.java:224)
23:43:42 [2021-03-20T03:43:42.478Z] 	at org.eclipse.ease.AbstractScriptEngine.run(AbstractScriptEngine.java:274)
23:43:42 [2021-03-20T03:43:42.478Z] 	at org.eclipse.core.internal.jobs.Worker.run(Worker.java:63)
23:43:42 [2021-03-20T03:43:42.733Z] org.eclipse.ease.ScriptExecutionException: ScriptException: JavaScript
23:43:42 [2021-03-20T03:43:42.733Z] org.eclipse.ease.ScriptExecutionException: SyntaxError: unterminated string literal (#1)
23:43:42 [2021-03-20T03:43:42.733Z] 'asdf
23:43:42 [2021-03-20T03:43:42.733Z]     ^
23:43:42 [2021-03-20T03:43:42.733Z] 	at <unknown source>:1
23:43:42 [2021-03-20T03:43:42.733Z] Tests run: 12, Failures: 0, Errors: 0, Skipped: 0, Time elapsed: 0.44 s - in org.eclipse.ease.lang.javascript.rhino.RhinoDebuggerEngineTest
23:43:42 [2021-03-20T03:43:42.733Z] getExceptionStackTrace  Time elapsed: 0.146 s
23:43:42 [2021-03-20T03:43:42.733Z] causeWrappedException  Time elapsed: 0.044 s
23:43:42 [2021-03-20T03:43:42.733Z] optionalModuleParameters  Time elapsed: 0.021 s
23:43:42 [2021-03-20T03:43:42.733Z] simpleScriptCode  Time elapsed: 0.02 s
23:43:42 [2021-03-20T03:43:42.733Z] causeRuntimeErrorException  Time elapsed: 0.05 s
23:43:42 [2021-03-20T03:43:42.733Z] callModuleCode  Time elapsed: 0.016 s
23:43:42 [2021-03-20T03:43:42.733Z] throwJavaClass  Time elapsed: 0.033 s
23:43:42 [2021-03-20T03:43:42.733Z] throwJavaException  Time elapsed: 0.02 s
23:43:42 [2021-03-20T03:43:42.733Z] accessJavaClasses  Time elapsed: 0.039 s
23:43:42 [2021-03-20T03:43:42.733Z] accessEclipseClasses  Time elapsed: 0.013 s
23:43:42 [2021-03-20T03:43:42.733Z] throwJavaScriptException  Time elapsed: 0.018 s
23:43:42 [2021-03-20T03:43:42.733Z] causeSyntaxErrorException  Time elapsed: 0.016 s
23:43:42 [2021-03-20T03:43:42.733Z] Running org.eclipse.ease.lang.javascript.rhino.RhinoDebugTest
23:43:42 [2021-03-20T03:43:42.989Z] Start of script
23:43:42 [2021-03-20T03:43:42.989Z] include file start
23:43:42 [2021-03-20T03:43:42.989Z] Include file processed
23:43:42 [2021-03-20T03:43:42.989Z] line after include file
23:43:42 [2021-03-20T03:43:42.989Z] Result of testMethod = 5
23:43:42 [2021-03-20T03:43:42.989Z] End of script
23:43:42 [2021-03-20T03:43:42.989Z] Start of script
23:43:42 [2021-03-20T03:43:42.989Z] include file start
23:43:42 [2021-03-20T03:43:42.989Z] Include file processed
23:43:42 [2021-03-20T03:43:42.989Z] line after include file
23:43:42 [2021-03-20T03:43:42.989Z] Result of testMethod = 5
23:43:42 [2021-03-20T03:43:42.989Z] End of script
23:43:43 [2021-03-20T03:43:43.244Z] Start of script
23:43:43 [2021-03-20T03:43:43.244Z] include file start
23:43:43 [2021-03-20T03:43:43.244Z] Include file processed
23:43:43 [2021-03-20T03:43:43.244Z] line after include file
23:43:43 [2021-03-20T03:43:43.244Z] Result of testMethod = 5
23:43:43 [2021-03-20T03:43:43.501Z] Start of script
23:43:43 [2021-03-20T03:43:43.501Z] include file start
23:43:43 [2021-03-20T03:43:43.501Z] Include file processed
23:43:43 [2021-03-20T03:43:43.501Z] line after include file
23:43:43 [2021-03-20T03:43:43.756Z] Result of testMethod = 5
23:43:43 [2021-03-20T03:43:43.756Z] End of script
23:43:44 [2021-03-20T03:43:44.011Z] Start of script
23:43:44 [2021-03-20T03:43:44.011Z] include file start
23:43:44 [2021-03-20T03:43:44.011Z] Include file processed
23:43:44 [2021-03-20T03:43:44.011Z] line after include file
23:43:44 [2021-03-20T03:43:44.011Z] Result of testMethod = 5
23:43:44 [2021-03-20T03:43:44.011Z] End of script
23:43:44 [2021-03-20T03:43:44.011Z] Start of script
23:43:44 [2021-03-20T03:43:44.011Z] include file start
23:43:44 [2021-03-20T03:43:44.011Z] Include file processed
23:43:44 [2021-03-20T03:43:44.011Z] line after include file
23:43:44 [2021-03-20T03:43:44.267Z] Result of testMethod = 5
23:43:44 [2021-03-20T03:43:44.267Z] End of script
23:43:44 [2021-03-20T03:43:44.522Z] Start of script
23:43:44 [2021-03-20T03:43:44.522Z] include file start
23:43:44 [2021-03-20T03:43:44.522Z] Include file processed
23:43:44 [2021-03-20T03:43:44.522Z] line after include file
23:43:44 [2021-03-20T03:43:44.522Z] Result of testMethod = 5
23:43:44 [2021-03-20T03:43:44.778Z] Start of script
23:43:44 [2021-03-20T03:43:44.778Z] include file start
23:43:44 [2021-03-20T03:43:44.778Z] Include file processed
23:43:44 [2021-03-20T03:43:44.778Z] line after include file
23:43:45 [2021-03-20T03:43:45.034Z] Result of testMethod = 5
23:43:45 [2021-03-20T03:43:45.034Z] End of script
23:43:45 [2021-03-20T03:43:45.034Z] Start of script
23:43:45 [2021-03-20T03:43:45.034Z] include file start
23:43:45 [2021-03-20T03:43:45.034Z] Include file processed
23:43:45 [2021-03-20T03:43:45.034Z] line after include file
23:43:45 [2021-03-20T03:43:45.034Z] Result of testMethod = 5
23:43:45 [2021-03-20T03:43:45.034Z] End of script
23:43:45 [2021-03-20T03:43:45.289Z] Start of script
23:43:45 [2021-03-20T03:43:45.290Z] include file start
23:43:45 [2021-03-20T03:43:45.290Z] Include file processed
23:43:45 [2021-03-20T03:43:45.290Z] line after include file
23:43:45 [2021-03-20T03:43:45.545Z] Start of script
23:43:45 [2021-03-20T03:43:45.545Z] include file start
23:43:45 [2021-03-20T03:43:45.800Z] Include file processed
23:43:45 [2021-03-20T03:43:45.800Z] line after include file
23:43:45 [2021-03-20T03:43:45.800Z] Result of testMethod = 5
23:43:45 [2021-03-20T03:43:45.800Z] End of script
23:43:45 [2021-03-20T03:43:45.800Z] Start of script
23:43:45 [2021-03-20T03:43:45.800Z] include file start
23:43:45 [2021-03-20T03:43:45.800Z] Include file processed
23:43:45 [2021-03-20T03:43:45.800Z] line after include file
23:43:46 [2021-03-20T03:43:46.056Z] Result of testMethod = 5
23:43:46 [2021-03-20T03:43:46.056Z] End of script
23:43:46 [2021-03-20T03:43:46.312Z] Start of script
23:43:46 [2021-03-20T03:43:46.567Z] include file start
23:43:46 [2021-03-20T03:43:46.567Z] Include file processed
23:43:46 [2021-03-20T03:43:46.567Z] line after include file
23:43:46 [2021-03-20T03:43:46.567Z] Result of testMethod = 5
23:43:46 [2021-03-20T03:43:46.567Z] End of script
23:43:46 [2021-03-20T03:43:46.567Z] Start of script
23:43:46 [2021-03-20T03:43:46.567Z] include file start
23:43:46 [2021-03-20T03:43:46.567Z] Include file processed
23:43:46 [2021-03-20T03:43:46.567Z] line after include file
23:43:46 [2021-03-20T03:43:46.822Z] Result of testMethod = 5
23:43:46 [2021-03-20T03:43:46.822Z] End of script
23:43:46 [2021-03-20T03:43:46.822Z] Start of script
23:43:46 [2021-03-20T03:43:46.822Z] include file start
23:43:46 [2021-03-20T03:43:46.822Z] Include file processed
23:43:46 [2021-03-20T03:43:46.822Z] line after include file
23:43:46 [2021-03-20T03:43:46.822Z] Result of testMethod = 5
23:43:47 [2021-03-20T03:43:47.078Z] Start of script
23:43:47 [2021-03-20T03:43:47.078Z] include file start
23:43:47 [2021-03-20T03:43:47.078Z] Include file processed
23:43:47 [2021-03-20T03:43:47.078Z] line after include file
23:43:47 [2021-03-20T03:43:47.334Z] Result of testMethod = 5
23:43:47 [2021-03-20T03:43:47.334Z] End of script
23:43:47 [2021-03-20T03:43:47.592Z] Start of script
23:43:47 [2021-03-20T03:43:47.592Z] include file start
23:43:47 [2021-03-20T03:43:47.592Z] Include file processed
23:43:47 [2021-03-20T03:43:47.592Z] line after include file
23:43:47 [2021-03-20T03:43:47.592Z] Result of testMethod = 5
23:43:47 [2021-03-20T03:43:47.848Z] End of script
23:43:47 [2021-03-20T03:43:47.848Z] Start of script
23:43:47 [2021-03-20T03:43:47.848Z] include file start
23:43:47 [2021-03-20T03:43:47.848Z] Include file processed
23:43:47 [2021-03-20T03:43:47.848Z] line after include file
23:43:48 [2021-03-20T03:43:48.104Z] Result of testMethod = 5
23:43:48 [2021-03-20T03:43:48.104Z] End of script
23:43:48 [2021-03-20T03:43:48.359Z] Start of script
23:43:48 [2021-03-20T03:43:48.359Z] include file start
23:43:48 [2021-03-20T03:43:48.359Z] Include file processed
23:43:48 [2021-03-20T03:43:48.359Z] line after include file
23:43:48 [2021-03-20T03:43:48.615Z] Result of testMethod = 5
23:43:48 [2021-03-20T03:43:48.615Z] End of script
23:43:48 [2021-03-20T03:43:48.615Z] Start of script
23:43:48 [2021-03-20T03:43:48.615Z] include file start
23:43:48 [2021-03-20T03:43:48.615Z] Include file processed
23:43:48 [2021-03-20T03:43:48.615Z] line after include file
23:43:48 [2021-03-20T03:43:48.615Z] Result of testMethod = 5
23:43:48 [2021-03-20T03:43:48.871Z] WARNING: An illegal reflective access operation has occurred
23:43:48 [2021-03-20T03:43:48.871Z] WARNING: Illegal reflective access by org.eclipse.ease.debugging.model.EaseDebugValue (file:/home/jenkins/.m2/repository/org/eclipse/ease/org.eclipse.ease/0.8.0-SNAPSHOT/org.eclipse.ease-0.8.0-SNAPSHOT.jar) to field java.lang.String.hash
23:43:48 [2021-03-20T03:43:48.871Z] WARNING: Please consider reporting this to the maintainers of org.eclipse.ease.debugging.model.EaseDebugValue
23:43:48 [2021-03-20T03:43:48.871Z] WARNING: Use --illegal-access=warn to enable warnings of further illegal reflective access operations
23:43:48 [2021-03-20T03:43:48.871Z] WARNING: All illegal access operations will be denied in a future release
23:43:49 [2021-03-20T03:43:49.126Z] Start of script
23:43:49 [2021-03-20T03:43:49.126Z] include file start
23:43:49 [2021-03-20T03:43:49.126Z] Include file processed
23:43:49 [2021-03-20T03:43:49.127Z] line after include file
23:43:49 [2021-03-20T03:43:49.127Z] Result of testMethod = 5
23:43:49 [2021-03-20T03:43:49.127Z] End of script
23:43:49 [2021-03-20T03:43:49.127Z] Start of script
23:43:49 [2021-03-20T03:43:49.127Z] include file start
23:43:49 [2021-03-20T03:43:49.127Z] Include file processed
23:43:49 [2021-03-20T03:43:49.127Z] line after include file
23:43:49 [2021-03-20T03:43:49.381Z] Result of testMethod = 5
23:43:49 [2021-03-20T03:43:49.381Z] End of script
23:43:49 [2021-03-20T03:43:49.637Z] Start of script
23:43:49 [2021-03-20T03:43:49.637Z] include file start
23:43:49 [2021-03-20T03:43:49.637Z] Include file processed
23:43:49 [2021-03-20T03:43:49.637Z] line after include file
23:43:49 [2021-03-20T03:43:49.637Z] Result of testMethod = 5
23:43:49 [2021-03-20T03:43:49.637Z] End of script
23:43:49 [2021-03-20T03:43:49.637Z] Start of script
23:43:49 [2021-03-20T03:43:49.637Z] include file start
23:43:49 [2021-03-20T03:43:49.637Z] Include file processed
23:43:49 [2021-03-20T03:43:49.915Z] line after include file
23:43:49 [2021-03-20T03:43:49.915Z] Result of testMethod = 5
23:43:49 [2021-03-20T03:43:49.915Z] End of script
23:43:49 [2021-03-20T03:43:49.915Z] Start of script
23:43:49 [2021-03-20T03:43:49.915Z] include file start
23:43:49 [2021-03-20T03:43:49.915Z] Include file processed
23:43:49 [2021-03-20T03:43:49.915Z] line after include file
23:43:50 [2021-03-20T03:43:50.171Z] Start of script
23:43:50 [2021-03-20T03:43:50.426Z] include file start
23:43:50 [2021-03-20T03:43:50.426Z] Include file processed
23:43:50 [2021-03-20T03:43:50.426Z] line after include file
23:43:50 [2021-03-20T03:43:50.427Z] Result of testMethod = 5
23:43:50 [2021-03-20T03:43:50.427Z] End of script
23:43:50 [2021-03-20T03:43:50.427Z] Start of script
23:43:50 [2021-03-20T03:43:50.427Z] include file start
23:43:50 [2021-03-20T03:43:50.427Z] Include file processed
23:43:50 [2021-03-20T03:43:50.427Z] line after include file
23:43:50 [2021-03-20T03:43:50.427Z] Result of testMethod = 5
23:43:50 [2021-03-20T03:43:50.989Z] Start of script
23:43:50 [2021-03-20T03:43:50.989Z] include file start
23:43:50 [2021-03-20T03:43:50.989Z] Include file processed
23:43:50 [2021-03-20T03:43:50.989Z] line after include file
23:43:50 [2021-03-20T03:43:50.989Z] Result of testMethod = 5
23:43:50 [2021-03-20T03:43:50.989Z] End of script
23:43:50 [2021-03-20T03:43:50.989Z] Start of script
23:43:50 [2021-03-20T03:43:50.989Z] include file start
23:43:50 [2021-03-20T03:43:50.989Z] Include file processed
23:43:50 [2021-03-20T03:43:50.989Z] line after include file
23:43:51 [2021-03-20T03:43:51.244Z] Result of testMethod = 5
23:43:51 [2021-03-20T03:43:51.244Z] End of script
23:43:51 [2021-03-20T03:43:51.244Z] Start of script
23:43:51 [2021-03-20T03:43:51.244Z] include file start
23:43:51 [2021-03-20T03:43:51.244Z] Include file processed
23:43:51 [2021-03-20T03:43:51.244Z] line after include file
23:43:51 [2021-03-20T03:43:51.500Z] java.util.ConcurrentModificationException
23:43:51 [2021-03-20T03:43:51.500Z] 	at java.base/java.util.ArrayList$Itr.checkForComodification(ArrayList.java:1013)
23:43:51 [2021-03-20T03:43:51.500Z] 	at java.base/java.util.ArrayList$Itr.next(ArrayList.java:967)
23:43:51 [2021-03-20T03:43:51.500Z] 	at org.eclipse.ease.debugging.AbstractEaseDebugger.getBreakpoint(AbstractEaseDebugger.java:409)
23:43:51 [2021-03-20T03:43:51.500Z] 	at org.eclipse.ease.debugging.AbstractEaseDebugger.isActiveBreakpoint(AbstractEaseDebugger.java:527)
23:43:51 [2021-03-20T03:43:51.500Z] 	at org.eclipse.ease.debugging.AbstractEaseDebugger.processLine(AbstractEaseDebugger.java:489)
23:43:51 [2021-03-20T03:43:51.500Z] 	at org.eclipse.ease.lang.javascript.rhino.debugger.RhinoDebugger.access$4(RhinoDebugger.java:1)
23:43:51 [2021-03-20T03:43:51.500Z] 	at org.eclipse.ease.lang.javascript.rhino.debugger.RhinoDebugger$RhinoDebugFrame.onLineChange(RhinoDebugger.java:122)
23:43:51 [2021-03-20T03:43:51.500Z] 	at org.mozilla.javascript.Interpreter.interpretLoop(Interpreter.java:1824)
23:43:51 [2021-03-20T03:43:51.500Z] 	at org.mozilla.javascript.Interpreter.interpret(Interpreter.java:815)
23:43:51 [2021-03-20T03:43:51.500Z] 	at org.mozilla.javascript.InterpretedFunction.call(InterpretedFunction.java:109)
23:43:51 [2021-03-20T03:43:51.500Z] 	at org.mozilla.javascript.ContextFactory.doTopCall(ContextFactory.java:394)
23:43:51 [2021-03-20T03:43:51.500Z] 	at org.mozilla.javascript.ScriptRuntime.doTopCall(ScriptRuntime.java:3091)
23:43:51 [2021-03-20T03:43:51.500Z] 	at org.mozilla.javascript.InterpretedFunction.exec(InterpretedFunction.java:120)
23:43:51 [2021-03-20T03:43:51.500Z] 	at org.mozilla.javascript.Context.evaluateReader(Context.java:1110)
23:43:51 [2021-03-20T03:43:51.500Z] 	at org.eclipse.ease.lang.javascript.rhino.RhinoScriptEngine.internalExecute(RhinoScriptEngine.java:222)
23:43:51 [2021-03-20T03:43:51.500Z] 	at org.eclipse.ease.lang.javascript.rhino.RhinoScriptEngine.execute(RhinoScriptEngine.java:201)
23:43:51 [2021-03-20T03:43:51.500Z] 	at org.eclipse.ease.AbstractScriptEngine.inject(AbstractScriptEngine.java:224)
23:43:51 [2021-03-20T03:43:51.500Z] 	at org.eclipse.ease.AbstractScriptEngine.run(AbstractScriptEngine.java:274)
23:43:51 [2021-03-20T03:43:51.500Z] 	at org.eclipse.core.internal.jobs.Worker.run(Worker.java:63)
23:43:51 [2021-03-20T03:43:51.500Z] Start of script
23:43:51 [2021-03-20T03:43:51.500Z] include file start
23:43:51 [2021-03-20T03:43:51.500Z] Include file processed
23:43:51 [2021-03-20T03:43:51.500Z] line after include file
23:43:51 [2021-03-20T03:43:51.500Z] Result of testMethod = 5
23:43:51 [2021-03-20T03:43:51.756Z] End of script
23:43:51 [2021-03-20T03:43:51.756Z] Start of script
23:43:51 [2021-03-20T03:43:51.756Z] include file start
23:43:51 [2021-03-20T03:43:51.756Z] Include file processed
23:43:51 [2021-03-20T03:43:51.756Z] line after include file
23:43:51 [2021-03-20T03:43:51.756Z] Result of testMethod = 5
23:43:52 [2021-03-20T03:43:52.011Z] Start of script
23:43:52 [2021-03-20T03:43:52.011Z] include file start
23:43:52 [2021-03-20T03:43:52.011Z] Include file processed
23:43:52 [2021-03-20T03:43:52.011Z] line after include file
23:43:52 [2021-03-20T03:43:52.011Z] Result of testMethod = 5
23:43:52 [2021-03-20T03:43:52.267Z] End of script
23:43:52 [2021-03-20T03:43:52.267Z] Start of script
23:43:52 [2021-03-20T03:43:52.267Z] include file start
23:43:52 [2021-03-20T03:43:52.267Z] Include file processed
23:43:52 [2021-03-20T03:43:52.267Z] line after include file
23:43:52 [2021-03-20T03:43:52.267Z] Result of testMethod = 5
23:43:52 [2021-03-20T03:43:52.828Z] Start of script
23:43:52 [2021-03-20T03:43:52.828Z] include file start
23:43:52 [2021-03-20T03:43:52.828Z] Include file processed
23:43:52 [2021-03-20T03:43:52.828Z] line after include file
23:43:52 [2021-03-20T03:43:52.828Z] Result of testMethod = 5
23:43:52 [2021-03-20T03:43:52.828Z] End of script
23:43:53 [2021-03-20T03:43:53.084Z] Start of script
23:43:53 [2021-03-20T03:43:53.084Z] include file start
23:43:53 [2021-03-20T03:43:53.084Z] Include file processed
23:43:53 [2021-03-20T03:43:53.084Z] line after include file
23:43:53 [2021-03-20T03:43:53.084Z] Result of testMethod = 5
23:43:53 [2021-03-20T03:43:53.084Z] End of script
23:43:53 [2021-03-20T03:43:53.339Z] Start of script
23:43:53 [2021-03-20T03:43:53.339Z] include file start
23:43:53 [2021-03-20T03:43:53.339Z] Include file processed
23:43:53 [2021-03-20T03:43:53.339Z] line after include file
23:43:53 [2021-03-20T03:43:53.339Z] Result of testMethod = 5
23:43:53 [2021-03-20T03:43:53.339Z] End of script
23:43:53 [2021-03-20T03:43:53.595Z] Tests run: 42, Failures: 1, Errors: 0, Skipped: 0, Time elapsed: 10.82 s <<< FAILURE! - in org.eclipse.ease.lang.javascript.rhino.RhinoDebugTest
23:43:53 [2021-03-20T03:43:53.595Z] disconnectProcessInSuspendedState  Time elapsed: 0.288 s
23:43:53 [2021-03-20T03:43:53.595Z] stepReturnIncludeCommand  Time elapsed: 0.207 s
23:43:53 [2021-03-20T03:43:53.595Z] arrayVariableSorting  Time elapsed: 0.306 s
23:43:53 [2021-03-20T03:43:53.595Z] stepOverOnDebugTarget  Time elapsed: 0.306 s
23:43:53 [2021-03-20T03:43:53.595Z] hasDebugTarget  Time elapsed: 0.103 s
23:43:53 [2021-03-20T03:43:53.595Z] disconnectThreadInSuspendedState  Time elapsed: 0.209 s
23:43:53 [2021-03-20T03:43:53.595Z] stepReturnOnDebugTarget  Time elapsed: 0.308 s
23:43:53 [2021-03-20T03:43:53.595Z] nullVariable  Time elapsed: 0.306 s
23:43:53 [2021-03-20T03:43:53.595Z] stepOverOnStackFrame  Time elapsed: 0.306 s
23:43:53 [2021-03-20T03:43:53.595Z] resumeOnDebugTarget  Time elapsed: 0.204 s
23:43:53 [2021-03-20T03:43:53.595Z] modifyVariableKeepingType  Time elapsed: 0.405 s
23:43:53 [2021-03-20T03:43:53.595Z] resumeOnLastIncludeLine  Time elapsed: 0.204 s
23:43:53 [2021-03-20T03:43:53.595Z] stepReturnOnStackFrame  Time elapsed: 0.305 s
23:43:53 [2021-03-20T03:43:53.595Z] terminateStackFrameInSuspendedState  Time elapsed: 0.204 s
23:43:53 [2021-03-20T03:43:53.595Z] breakpointLocation  Time elapsed: 0.204 s
23:43:53 [2021-03-20T03:43:53.595Z] stepReturnOnThread  Time elapsed: 0.305 s
23:43:53 [2021-03-20T03:43:53.595Z] javaClassVariable  Time elapsed: 0.305 s
23:43:53 [2021-03-20T03:43:53.595Z] stepIntoOnThread  Time elapsed: 0.305 s
23:43:53 [2021-03-20T03:43:53.595Z] terminateThreadInSuspendedState  Time elapsed: 0.204 s
23:43:53 [2021-03-20T03:43:53.595Z] resumeOnThread  Time elapsed: 0.205 s
23:43:53 [2021-03-20T03:43:53.595Z] stepIntoOnStackFrame  Time elapsed: 0.305 s
23:43:53 [2021-03-20T03:43:53.595Z] terminateProcessInSuspendedState  Time elapsed: 0.204 s
23:43:53 [2021-03-20T03:43:53.595Z] stepOverOnProcess  Time elapsed: 0.305 s
23:43:53 [2021-03-20T03:43:53.595Z] nativeArrayVariable  Time elapsed: 0.306 s
23:43:53 [2021-03-20T03:43:53.595Z] disconnectDebugTargetInSuspendedState  Time elapsed: 0.204 s
23:43:53 [2021-03-20T03:43:53.595Z] stepIntoOnProcess  Time elapsed: 0.305 s
23:43:53 [2021-03-20T03:43:53.595Z] terminatedState  Time elapsed: 0.103 s
23:43:53 [2021-03-20T03:43:53.595Z] stepOverIncludeCommand  Time elapsed: 0.305 s
23:43:53 [2021-03-20T03:43:53.595Z] innerScopeVariableBeforeOuterScopeVariable  Time elapsed: 0.305 s
23:43:53 [2021-03-20T03:43:53.595Z] stepIntoIncludeCommand  Time elapsed: 0.305 s
23:43:53 [2021-03-20T03:43:53.595Z] primitiveStringVariable  Time elapsed: 0.304 s
23:43:53 [2021-03-20T03:43:53.595Z] resumeOnProcess  Time elapsed: 0.204 s
23:43:53 [2021-03-20T03:43:53.595Z] stepIntoOnDebugTarget  Time elapsed: 0.305 s
23:43:53 [2021-03-20T03:43:53.595Z] stepOverOnThread  Time elapsed: 0.206 s  <<< FAILURE!
23:43:53 [2021-03-20T03:43:53.595Z] org.opentest4j.AssertionFailedError: expected: <2> but was: <1>
23:43:53 [2021-03-20T03:43:53.595Z] 	at org.eclipse.ease.testhelper.AbstractDebugTest.stepOverTestTemplate(AbstractDebugTest.java:188)
23:43:53 [2021-03-20T03:43:53.595Z] 	at org.eclipse.ease.testhelper.AbstractDebugTest.stepOverOnThread(AbstractDebugTest.java:206)
23:43:53 [2021-03-20T03:43:53.595Z] 
23:43:53 [2021-03-20T03:43:53.595Z] suspendedState  Time elapsed: 0.203 s
23:43:53 [2021-03-20T03:43:53.595Z] primitiveDoubleVariable  Time elapsed: 0.303 s
23:43:53 [2021-03-20T03:43:53.595Z] resumeOnStackFrame  Time elapsed: 0.204 s
23:43:53 [2021-03-20T03:43:53.595Z] nativeObjectVariable  Time elapsed: 0.304 s
23:43:53 [2021-03-20T03:43:53.595Z] terminateDebugTargetInSuspendedState  Time elapsed: 0.203 s
23:43:53 [2021-03-20T03:43:53.595Z] disconnectStackFrameInSuspendedState  Time elapsed: 0.205 s
23:43:53 [2021-03-20T03:43:53.595Z] stepReturnOnProcess  Time elapsed: 0.305 s
23:43:53 [2021-03-20T03:43:53.596Z] evaluateWatchExpression  Time elapsed: 0.215 s
23:43:53 [2021-03-20T03:43:53.596Z] Running org.eclipse.ease.lang.javascript.rhino.RhinoScriptEngineTest
23:43:53 [2021-03-20T03:43:53.596Z] org.eclipse.ease.ScriptExecutionException: JavaError: NotThere cannot be found by org.mozilla.javascript_1.7.5.v201504281450
23:43:53 [2021-03-20T03:43:53.596Z] 	at <unknown source>
23:43:53 [2021-03-20T03:43:53.596Z] 
23:43:53 [2021-03-20T03:43:53.596Z] Java Stacktrace:
23:43:53 [2021-03-20T03:43:53.596Z] java.lang.ClassNotFoundException: NotThere cannot be found by org.mozilla.javascript_1.7.5.v201504281450
23:43:53 [2021-03-20T03:43:53.596Z] 	at org.eclipse.osgi.internal.loader.BundleLoader.findClassInternal(BundleLoader.java:511)
23:43:53 [2021-03-20T03:43:53.596Z] 	at org.eclipse.osgi.internal.loader.BundleLoader.findClass(BundleLoader.java:422)
23:43:53 [2021-03-20T03:43:53.596Z] 	at org.eclipse.osgi.internal.loader.BundleLoader.findClass(BundleLoader.java:414)
23:43:53 [2021-03-20T03:43:53.596Z] 	at org.eclipse.osgi.internal.loader.ModuleClassLoader.loadClass(ModuleClassLoader.java:153)
23:43:53 [2021-03-20T03:43:53.596Z] 	at java.base/java.lang.ClassLoader.loadClass(ClassLoader.java:522)
23:43:53 [2021-03-20T03:43:53.596Z] 	at java.base/java.lang.Class.forName0(Native Method)
23:43:53 [2021-03-20T03:43:53.596Z] 	at java.base/java.lang.Class.forName(Class.java:377)
23:43:53 [2021-03-20T03:43:53.596Z] 	at java.base/jdk.internal.reflect.NativeMethodAccessorImpl.invoke0(Native Method)
23:43:53 [2021-03-20T03:43:53.596Z] 	at java.base/jdk.internal.reflect.NativeMethodAccessorImpl.invoke(NativeMethodAccessorImpl.java:64)
23:43:53 [2021-03-20T03:43:53.596Z] 	at java.base/jdk.internal.reflect.DelegatingMethodAccessorImpl.invoke(DelegatingMethodAccessorImpl.java:43)
23:43:53 [2021-03-20T03:43:53.596Z] 	at java.base/java.lang.reflect.Method.invoke(Method.java:564)
23:43:53 [2021-03-20T03:43:53.596Z] 	at org.mozilla.javascript.MemberBox.invoke(MemberBox.java:126)
23:43:53 [2021-03-20T03:43:53.596Z] 	at org.mozilla.javascript.NativeJavaMethod.call(NativeJavaMethod.java:225)
23:43:53 [2021-03-20T03:43:53.596Z] 	at org.mozilla.javascript.optimizer.OptRuntime.call1(OptRuntime.java:32)
23:43:53 [2021-03-20T03:43:53.596Z] 	at org.mozilla.javascript.gen.c_27._c_script_0(Unknown Source)
23:43:53 [2021-03-20T03:43:53.596Z] 	at org.mozilla.javascript.gen.c_27.call(Unknown Source)
23:43:53 [2021-03-20T03:43:53.596Z] 	at org.mozilla.javascript.ContextFactory.doTopCall(ContextFactory.java:394)
23:43:53 [2021-03-20T03:43:53.596Z] 	at org.mozilla.javascript.ScriptRuntime.doTopCall(ScriptRuntime.java:3091)
23:43:53 [2021-03-20T03:43:53.596Z] 	at org.mozilla.javascript.gen.c_27.call(Unknown Source)
23:43:53 [2021-03-20T03:43:53.596Z] 	at org.mozilla.javascript.gen.c_27.exec(Unknown Source)
23:43:53 [2021-03-20T03:43:53.596Z] 	at org.mozilla.javascript.Context.evaluateReader(Context.java:1110)
23:43:53 [2021-03-20T03:43:53.596Z] 	at org.eclipse.ease.lang.javascript.rhino.RhinoScriptEngine.internalExecute(RhinoScriptEngine.java:222)
23:43:53 [2021-03-20T03:43:53.596Z] 	at org.eclipse.ease.lang.javascript.rhino.RhinoScriptEngine.execute(RhinoScriptEngine.java:201)
23:43:53 [2021-03-20T03:43:53.596Z] 	at org.eclipse.ease.AbstractScriptEngine.inject(AbstractScriptEngine.java:224)
23:43:53 [2021-03-20T03:43:53.596Z] 	at org.eclipse.ease.AbstractScriptEngine.run(AbstractScriptEngine.java:274)
23:43:53 [2021-03-20T03:43:53.596Z] 	at org.eclipse.core.internal.jobs.Worker.run(Worker.java:63)
23:43:53 [2021-03-20T03:43:53.596Z] org.eclipse.ease.ScriptExecutionException: TypeError: Cannot call method "foobar" of undefined
23:43:53 [2021-03-20T03:43:53.596Z] 	at <unknown source>
23:43:53 [2021-03-20T03:43:53.596Z] org.eclipse.ease.ScriptExecutionException: ScriptException: test
23:43:53 [2021-03-20T03:43:53.596Z] 	at <unknown source>
23:43:53 [2021-03-20T03:43:53.596Z] org.eclipse.ease.ScriptExecutionException: JavaError: java.lang.Exception
23:43:53 [2021-03-20T03:43:53.596Z] 	at <unknown source>
23:43:53 [2021-03-20T03:43:53.596Z] 
23:43:53 [2021-03-20T03:43:53.596Z] Java Stacktrace:
23:43:53 [2021-03-20T03:43:53.596Z] java.lang.Exception
23:43:53 [2021-03-20T03:43:53.596Z] 	at java.base/jdk.internal.reflect.NativeConstructorAccessorImpl.newInstance0(Native Method)
23:43:53 [2021-03-20T03:43:53.596Z] 	at java.base/jdk.internal.reflect.NativeConstructorAccessorImpl.newInstance(NativeConstructorAccessorImpl.java:64)
23:43:53 [2021-03-20T03:43:53.596Z] 	at java.base/jdk.internal.reflect.DelegatingConstructorAccessorImpl.newInstance(DelegatingConstructorAccessorImpl.java:45)
23:43:53 [2021-03-20T03:43:53.596Z] 	at java.base/java.lang.reflect.Constructor.newInstanceWithCaller(Constructor.java:500)
23:43:53 [2021-03-20T03:43:53.596Z] 	at java.base/java.lang.reflect.Constructor.newInstance(Constructor.java:481)
23:43:53 [2021-03-20T03:43:53.596Z] 	at org.mozilla.javascript.MemberBox.newInstance(MemberBox.java:159)
23:43:53 [2021-03-20T03:43:53.596Z] 	at org.mozilla.javascript.NativeJavaClass.constructInternal(NativeJavaClass.java:266)
23:43:53 [2021-03-20T03:43:53.596Z] 	at org.mozilla.javascript.NativeJavaClass.constructSpecific(NativeJavaClass.java:205)
23:43:53 [2021-03-20T03:43:53.596Z] 	at org.mozilla.javascript.NativeJavaClass.construct(NativeJavaClass.java:166)
23:43:53 [2021-03-20T03:43:53.596Z] 	at org.mozilla.javascript.ScriptRuntime.newObject(ScriptRuntime.java:2349)
23:43:53 [2021-03-20T03:43:53.596Z] 	at org.mozilla.javascript.gen.c_45._c_script_0(Unknown Source)
23:43:53 [2021-03-20T03:43:53.596Z] 	at org.mozilla.javascript.gen.c_45.call(Unknown Source)
23:43:53 [2021-03-20T03:43:53.596Z] 	at org.mozilla.javascript.ContextFactory.doTopCall(ContextFactory.java:394)
23:43:53 [2021-03-20T03:43:53.596Z] 	at org.mozilla.javascript.ScriptRuntime.doTopCall(ScriptRuntime.java:3091)
23:43:53 [2021-03-20T03:43:53.596Z] 	at org.mozilla.javascript.gen.c_45.call(Unknown Source)
23:43:53 [2021-03-20T03:43:53.596Z] 	at org.mozilla.javascript.gen.c_45.exec(Unknown Source)
23:43:53 [2021-03-20T03:43:53.596Z] 	at org.mozilla.javascript.Context.evaluateReader(Context.java:1110)
23:43:53 [2021-03-20T03:43:53.596Z] 	at org.eclipse.ease.lang.javascript.rhino.RhinoScriptEngine.internalExecute(RhinoScriptEngine.java:222)
23:43:53 [2021-03-20T03:43:53.596Z] 	at org.eclipse.ease.lang.javascript.rhino.RhinoScriptEngine.execute(RhinoScriptEngine.java:201)
23:43:53 [2021-03-20T03:43:53.596Z] 	at org.eclipse.ease.AbstractScriptEngine.inject(AbstractScriptEngine.java:224)
23:43:53 [2021-03-20T03:43:53.596Z] 	at org.eclipse.ease.AbstractScriptEngine.run(AbstractScriptEngine.java:274)
23:43:53 [2021-03-20T03:43:53.596Z] 	at org.eclipse.core.internal.jobs.Worker.run(Worker.java:63)
23:43:53 [2021-03-20T03:43:53.596Z] org.eclipse.ease.ScriptExecutionException: ScriptException: JavaScript
23:43:53 [2021-03-20T03:43:53.596Z] 	at <unknown source>
23:43:53 [2021-03-20T03:43:53.596Z] org.eclipse.ease.ScriptExecutionException: SyntaxError: unterminated string literal (#1)
23:43:53 [2021-03-20T03:43:53.596Z] 'asdf
23:43:53 [2021-03-20T03:43:53.596Z]     ^
23:43:53 [2021-03-20T03:43:53.596Z] 	at <unknown source>
23:43:53 [2021-03-20T03:43:53.596Z] Tests run: 11, Failures: 0, Errors: 0, Skipped: 0, Time elapsed: 0.139 s - in org.eclipse.ease.lang.javascript.rhino.RhinoScriptEngineTest
23:43:53 [2021-03-20T03:43:53.596Z] causeWrappedException  Time elapsed: 0.018 s
23:43:53 [2021-03-20T03:43:53.596Z] optionalModuleParameters  Time elapsed: 0.01 s
23:43:53 [2021-03-20T03:43:53.596Z] simpleScriptCode  Time elapsed: 0.01 s
23:43:53 [2021-03-20T03:43:53.596Z] causeRuntimeErrorException  Time elapsed: 0.009 s
23:43:53 [2021-03-20T03:43:53.596Z] callModuleCode  Time elapsed: 0.013 s
23:43:53 [2021-03-20T03:43:53.596Z] throwJavaClass  Time elapsed: 0.009 s
23:43:53 [2021-03-20T03:43:53.596Z] throwJavaException  Time elapsed: 0.037 s
23:43:53 [2021-03-20T03:43:53.596Z] accessJavaClasses  Time elapsed: 0.009 s
23:43:53 [2021-03-20T03:43:53.597Z] accessEclipseClasses  Time elapsed: 0.008 s
23:43:53 [2021-03-20T03:43:53.597Z] throwJavaScriptException  Time elapsed: 0.008 s
23:43:53 [2021-03-20T03:43:53.597Z] causeSyntaxErrorException  Time elapsed: 0.008 s
23:43:53 [2021-03-20T03:43:53.597Z] 
23:43:53 [2021-03-20T03:43:53.597Z] Results:
23:43:53 [2021-03-20T03:43:53.597Z] 
23:43:53 [2021-03-20T03:43:53.597Z] Failures: 
23:43:53 [2021-03-20T03:43:53.597Z]   AbstractDebugTest.stepOverOnThread:206->stepOverTestTemplate:188 expected: <2> but was: <1>
23:43:53 [2021-03-20T03:43:53.597Z] 
23:43:53 [2021-03-20T03:43:53.597Z] Tests run: 70, Failures: 1, Errors: 0, Skipped: 0
23:43:53 [2021-03-20T03:43:53.597Z] 
23:43:54 [2021-03-20T03:43:54.158Z] [INFO] ------------------------------------------------------------------------
23:43:54 [2021-03-20T03:43:54.158Z] [INFO] Reactor Summary for org.eclipse.ease.releng 0.8.0-SNAPSHOT:
23:43:54 [2021-03-20T03:43:54.158Z] [INFO] 
23:43:54 [2021-03-20T03:43:54.158Z] [INFO] org.eclipse.ease.releng ............................ SUCCESS [  0.001 s]
23:43:54 [2021-03-20T03:43:54.158Z] [INFO] org.eclipse.ease.releng.target ..................... SUCCESS [  0.110 s]
23:43:54 [2021-03-20T03:43:54.158Z] [INFO] org.eclipse.ease.test .............................. SUCCESS [ 11.540 s]
23:43:54 [2021-03-20T03:43:54.158Z] [INFO] org.eclipse.ease.lang.javascript.rhino.test ........ FAILURE [ 15.715 s]
23:43:54 [2021-03-20T03:43:54.158Z] [INFO] org.eclipse.ease.lang.javascript.test .............. SKIPPED
23:43:54 [2021-03-20T03:43:54.158Z] [INFO] org.eclipse.ease.lang.python.test .................. SKIPPED
23:43:54 [2021-03-20T03:43:54.158Z] [INFO] org.eclipse.ease.lang.python.jython.test ........... SKIPPED
23:43:54 [2021-03-20T03:43:54.158Z] [INFO] org.eclipse.ease.lang.scriptarchive.test ........... SKIPPED
23:43:54 [2021-03-20T03:43:54.158Z] [INFO] org.eclipse.ease.ui.test ........................... SKIPPED
23:43:54 [2021-03-20T03:43:54.158Z] [INFO] ------------------------------------------------------------------------
23:43:54 [2021-03-20T03:43:54.158Z] [INFO] BUILD FAILURE
23:43:54 [2021-03-20T03:43:54.158Z] [INFO] ------------------------------------------------------------------------
23:43:54 [2021-03-20T03:43:54.158Z] [INFO] Total time:  01:10 min
23:43:54 [2021-03-20T03:43:54.158Z] [INFO] Finished at: 2021-03-20T03:43:54Z
23:43:54 [2021-03-20T03:43:54.158Z] [INFO] ------------------------------------------------------------------------
23:43:54 [2021-03-20T03:43:54.158Z] [WARNING] [jenkins-event-spy] Unexpected Maven project file name 'target-tests-pom.xml', problems may occur
23:43:54 [2021-03-20T03:43:54.158Z] [INFO] [jenkins-event-spy] Generated /home/jenkins/agent/workspace/ease.verify.core.target.2018-12@tmp/withMaven1aaadc52/maven-spy-20210320-034243-42515871437496114896167.log
23:43:54 [2021-03-20T03:43:54.158Z] [ERROR] Failed to execute goal org.eclipse.tycho:tycho-surefire-plugin:2.2.0:test (default-test) on project org.eclipse.ease.lang.javascript.rhino.test: There are test failures.
23:43:54 [2021-03-20T03:43:54.158Z] [ERROR] 
23:43:54 [2021-03-20T03:43:54.158Z] [ERROR] Please refer to /home/jenkins/agent/workspace/ease.verify.core.target.2018-12/tests/org.eclipse.ease.lang.javascript.rhino.test/target/surefire-reports for the individual test results.
23:43:54 [2021-03-20T03:43:54.158Z] [ERROR] -> [Help 1]
23:43:54 [2021-03-20T03:43:54.158Z] [ERROR] 
23:43:54 [2021-03-20T03:43:54.158Z] [ERROR] To see the full stack trace of the errors, re-run Maven with the -e switch.
23:43:54 [2021-03-20T03:43:54.158Z] [ERROR] Re-run Maven using the -X switch to enable full debug logging.
23:43:54 [2021-03-20T03:43:54.158Z] [ERROR] 
23:43:54 [2021-03-20T03:43:54.158Z] [ERROR] For more information about the errors and possible solutions, please read the following articles:
23:43:54 [2021-03-20T03:43:54.158Z] [ERROR] [Help 1] http://cwiki.apache.org/confluence/display/MAVEN/MojoFailureException
23:43:54 [2021-03-20T03:43:54.158Z] [ERROR] 
23:43:54 [2021-03-20T03:43:54.158Z] [ERROR] After correcting the problems, you can resume the build with the command
23:43:54 [2021-03-20T03:43:54.158Z] [ERROR]   mvn <args> -rf :org.eclipse.ease.lang.javascript.rhino.test
[Pipeline] }
23:43:54 [2021-03-20T03:43:54.742Z] [withMaven] junitPublisher - Archive test results for Maven artifact org.eclipse.ease:org.eclipse.ease.test:eclipse-test-plugin:0.8.0-SNAPSHOT generated by tycho-surefire-plugin:test (default-test): tests/org.eclipse.ease.test/target/surefire-reports/*.xml
23:43:54 [2021-03-20T03:43:54.743Z] [withMaven] junitPublisher - Archive test results for Maven artifact org.eclipse.ease:org.eclipse.ease.lang.javascript.rhino.test:eclipse-test-plugin:0.8.0-SNAPSHOT generated by tycho-surefire-plugin:test (default-test): tests/org.eclipse.ease.lang.javascript.rhino.test/target/surefire-reports/*.xml
23:43:54 [2021-03-20T03:43:54.745Z] [withMaven] junitPublisher - Jenkins JUnit Attachments Plugin not found, can't publish test attachments.Recording test results
23:43:54 [2021-03-20T03:43:54.915Z] [withMaven] Jenkins JaCoCo Plugin not found, don't display org.jacoco:jacoco-maven-plugin:findbugs results in pipeline screen.
23:43:54 [2021-03-20T03:43:54.917Z] [withMaven] Publishers: Pipeline Graph Publisher: 1 ms, Junit Publisher: 165 ms, Jacoco Publisher: 1 ms
[Pipeline] // withMaven
[Pipeline] }
[Pipeline] // stage
[Pipeline] stage
[Pipeline] { (Declarative: Post Actions)
[Pipeline] archiveArtifacts
23:43:54 [2021-03-20T03:43:54.949Z] Archiving artifacts
[Pipeline] emailext
23:44:11 [2021-03-20T03:44:11.081Z] Sending email to: christian.pontesegger@web.de
[Pipeline] }
[Pipeline] // stage
[Pipeline] }
[Pipeline] // timeout
[Pipeline] }
[Pipeline] // timestamps
[Pipeline] }
[Pipeline] // node
[Pipeline] End of Pipeline
ERROR: script returned exit code 1
Finished: FAILURE