SuccessConsole Output

Skipping 155 KB.. Full Log
oScriptEngineTest
23:43:45 [2020-10-24T03:43:45.229Z] org.eclipse.ease.ScriptExecutionException: JavaError: NotThere cannot be found by org.mozilla.javascript_1.7.5.v201504281450
23:43:45 [2020-10-24T03:43:45.229Z] 	at <unknown source>
23:43:45 [2020-10-24T03:43:45.229Z] 
23:43:45 [2020-10-24T03:43:45.229Z] Java Stacktrace:
23:43:45 [2020-10-24T03:43:45.229Z] java.lang.ClassNotFoundException: NotThere cannot be found by org.mozilla.javascript_1.7.5.v201504281450
23:43:45 [2020-10-24T03:43:45.229Z] 	at org.eclipse.osgi.internal.loader.BundleLoader.findClassInternal(BundleLoader.java:511)
23:43:45 [2020-10-24T03:43:45.229Z] 	at org.eclipse.osgi.internal.loader.BundleLoader.findClass(BundleLoader.java:422)
23:43:45 [2020-10-24T03:43:45.229Z] 	at org.eclipse.osgi.internal.loader.BundleLoader.findClass(BundleLoader.java:414)
23:43:45 [2020-10-24T03:43:45.229Z] 	at org.eclipse.osgi.internal.loader.ModuleClassLoader.loadClass(ModuleClassLoader.java:153)
23:43:45 [2020-10-24T03:43:45.229Z] 	at java.base/java.lang.ClassLoader.loadClass(ClassLoader.java:521)
23:43:45 [2020-10-24T03:43:45.229Z] 	at java.base/java.lang.Class.forName0(Native Method)
23:43:45 [2020-10-24T03:43:45.229Z] 	at java.base/java.lang.Class.forName(Class.java:315)
23:43:45 [2020-10-24T03:43:45.229Z] 	at java.base/jdk.internal.reflect.NativeMethodAccessorImpl.invoke0(Native Method)
23:43:45 [2020-10-24T03:43:45.229Z] 	at java.base/jdk.internal.reflect.NativeMethodAccessorImpl.invoke(NativeMethodAccessorImpl.java:62)
23:43:45 [2020-10-24T03:43:45.229Z] 	at java.base/jdk.internal.reflect.DelegatingMethodAccessorImpl.invoke(DelegatingMethodAccessorImpl.java:43)
23:43:45 [2020-10-24T03:43:45.229Z] 	at java.base/java.lang.reflect.Method.invoke(Method.java:566)
23:43:45 [2020-10-24T03:43:45.229Z] 	at org.mozilla.javascript.MemberBox.invoke(MemberBox.java:126)
23:43:45 [2020-10-24T03:43:45.229Z] 	at org.mozilla.javascript.NativeJavaMethod.call(NativeJavaMethod.java:225)
23:43:45 [2020-10-24T03:43:45.229Z] 	at org.mozilla.javascript.optimizer.OptRuntime.call1(OptRuntime.java:32)
23:43:45 [2020-10-24T03:43:45.229Z] 	at org.mozilla.javascript.gen.c_27._c_script_0(Unknown Source)
23:43:45 [2020-10-24T03:43:45.229Z] 	at org.mozilla.javascript.gen.c_27.call(Unknown Source)
23:43:45 [2020-10-24T03:43:45.229Z] 	at org.mozilla.javascript.ContextFactory.doTopCall(ContextFactory.java:394)
23:43:45 [2020-10-24T03:43:45.229Z] 	at org.mozilla.javascript.ScriptRuntime.doTopCall(ScriptRuntime.java:3091)
23:43:45 [2020-10-24T03:43:45.229Z] 	at org.mozilla.javascript.gen.c_27.call(Unknown Source)
23:43:45 [2020-10-24T03:43:45.229Z] 	at org.mozilla.javascript.gen.c_27.exec(Unknown Source)
23:43:45 [2020-10-24T03:43:45.229Z] 	at org.mozilla.javascript.Context.evaluateReader(Context.java:1110)
23:43:45 [2020-10-24T03:43:45.229Z] 	at org.eclipse.ease.lang.javascript.rhino.RhinoScriptEngine.internalExecute(RhinoScriptEngine.java:222)
23:43:45 [2020-10-24T03:43:45.229Z] 	at org.eclipse.ease.lang.javascript.rhino.RhinoScriptEngine.execute(RhinoScriptEngine.java:201)
23:43:45 [2020-10-24T03:43:45.229Z] 	at org.eclipse.ease.AbstractScriptEngine.inject(AbstractScriptEngine.java:224)
23:43:45 [2020-10-24T03:43:45.229Z] 	at org.eclipse.ease.AbstractScriptEngine.run(AbstractScriptEngine.java:274)
23:43:45 [2020-10-24T03:43:45.229Z] 	at org.eclipse.core.internal.jobs.Worker.run(Worker.java:63)
23:43:45 [2020-10-24T03:43:45.229Z] org.eclipse.ease.ScriptExecutionException: TypeError: Cannot call method "foobar" of undefined
23:43:45 [2020-10-24T03:43:45.229Z] 	at <unknown source>
23:43:45 [2020-10-24T03:43:45.229Z] org.eclipse.ease.ScriptExecutionException: ScriptException: test
23:43:45 [2020-10-24T03:43:45.229Z] 	at <unknown source>
23:43:45 [2020-10-24T03:43:45.229Z] org.eclipse.ease.ScriptExecutionException: JavaError: java.lang.Exception
23:43:45 [2020-10-24T03:43:45.229Z] 	at <unknown source>
23:43:45 [2020-10-24T03:43:45.229Z] 
23:43:45 [2020-10-24T03:43:45.229Z] Java Stacktrace:
23:43:45 [2020-10-24T03:43:45.229Z] java.lang.Exception
23:43:45 [2020-10-24T03:43:45.229Z] 	at java.base/jdk.internal.reflect.NativeConstructorAccessorImpl.newInstance0(Native Method)
23:43:45 [2020-10-24T03:43:45.229Z] 	at java.base/jdk.internal.reflect.NativeConstructorAccessorImpl.newInstance(NativeConstructorAccessorImpl.java:62)
23:43:45 [2020-10-24T03:43:45.229Z] 	at java.base/jdk.internal.reflect.DelegatingConstructorAccessorImpl.newInstance(DelegatingConstructorAccessorImpl.java:45)
23:43:45 [2020-10-24T03:43:45.229Z] 	at java.base/java.lang.reflect.Constructor.newInstance(Constructor.java:490)
23:43:45 [2020-10-24T03:43:45.229Z] 	at org.mozilla.javascript.MemberBox.newInstance(MemberBox.java:159)
23:43:45 [2020-10-24T03:43:45.229Z] 	at org.mozilla.javascript.NativeJavaClass.constructInternal(NativeJavaClass.java:266)
23:43:45 [2020-10-24T03:43:45.229Z] 	at org.mozilla.javascript.NativeJavaClass.constructSpecific(NativeJavaClass.java:205)
23:43:45 [2020-10-24T03:43:45.229Z] 	at org.mozilla.javascript.NativeJavaClass.construct(NativeJavaClass.java:166)
23:43:45 [2020-10-24T03:43:45.229Z] 	at org.mozilla.javascript.ScriptRuntime.newObject(ScriptRuntime.java:2349)
23:43:45 [2020-10-24T03:43:45.229Z] 	at org.mozilla.javascript.gen.c_45._c_script_0(Unknown Source)
23:43:45 [2020-10-24T03:43:45.229Z] 	at org.mozilla.javascript.gen.c_45.call(Unknown Source)
23:43:45 [2020-10-24T03:43:45.229Z] 	at org.mozilla.javascript.ContextFactory.doTopCall(ContextFactory.java:394)
23:43:45 [2020-10-24T03:43:45.229Z] 	at org.mozilla.javascript.ScriptRuntime.doTopCall(ScriptRuntime.java:3091)
23:43:45 [2020-10-24T03:43:45.229Z] 	at org.mozilla.javascript.gen.c_45.call(Unknown Source)
23:43:45 [2020-10-24T03:43:45.229Z] 	at org.mozilla.javascript.gen.c_45.exec(Unknown Source)
23:43:45 [2020-10-24T03:43:45.229Z] 	at org.mozilla.javascript.Context.evaluateReader(Context.java:1110)
23:43:45 [2020-10-24T03:43:45.229Z] 	at org.eclipse.ease.lang.javascript.rhino.RhinoScriptEngine.internalExecute(RhinoScriptEngine.java:222)
23:43:45 [2020-10-24T03:43:45.229Z] 	at org.eclipse.ease.lang.javascript.rhino.RhinoScriptEngine.execute(RhinoScriptEngine.java:201)
23:43:45 [2020-10-24T03:43:45.229Z] 	at org.eclipse.ease.AbstractScriptEngine.inject(AbstractScriptEngine.java:224)
23:43:45 [2020-10-24T03:43:45.229Z] 	at org.eclipse.ease.AbstractScriptEngine.run(AbstractScriptEngine.java:274)
23:43:45 [2020-10-24T03:43:45.229Z] 	at org.eclipse.core.internal.jobs.Worker.run(Worker.java:63)
23:43:45 [2020-10-24T03:43:45.229Z] org.eclipse.ease.ScriptExecutionException: ScriptException: JavaScript
23:43:45 [2020-10-24T03:43:45.229Z] 	at <unknown source>
23:43:45 [2020-10-24T03:43:45.229Z] org.eclipse.ease.ScriptExecutionException: SyntaxError: unterminated string literal (#1)
23:43:45 [2020-10-24T03:43:45.229Z] 'asdf
23:43:45 [2020-10-24T03:43:45.229Z]     ^
23:43:45 [2020-10-24T03:43:45.229Z] 	at <unknown source>
23:43:45 [2020-10-24T03:43:45.229Z] Tests run: 11, Failures: 0, Errors: 0, Skipped: 0, Time elapsed: 0.079 s - in org.eclipse.ease.lang.javascript.rhino.RhinoScriptEngineTest
23:43:45 [2020-10-24T03:43:45.229Z] causeWrappedException(org.eclipse.ease.lang.javascript.rhino.RhinoScriptEngineTest)  Time elapsed: 0.008 s
23:43:45 [2020-10-24T03:43:45.229Z] optionalModuleParameters(org.eclipse.ease.lang.javascript.rhino.RhinoScriptEngineTest)  Time elapsed: 0.007 s
23:43:45 [2020-10-24T03:43:45.229Z] simpleScriptCode(org.eclipse.ease.lang.javascript.rhino.RhinoScriptEngineTest)  Time elapsed: 0.007 s
23:43:45 [2020-10-24T03:43:45.229Z] causeRuntimeErrorException(org.eclipse.ease.lang.javascript.rhino.RhinoScriptEngineTest)  Time elapsed: 0.008 s
23:43:45 [2020-10-24T03:43:45.229Z] callModuleCode(org.eclipse.ease.lang.javascript.rhino.RhinoScriptEngineTest)  Time elapsed: 0.007 s
23:43:45 [2020-10-24T03:43:45.229Z] throwJavaClass(org.eclipse.ease.lang.javascript.rhino.RhinoScriptEngineTest)  Time elapsed: 0.007 s
23:43:45 [2020-10-24T03:43:45.229Z] throwJavaException(org.eclipse.ease.lang.javascript.rhino.RhinoScriptEngineTest)  Time elapsed: 0.007 s
23:43:45 [2020-10-24T03:43:45.229Z] accessJavaClasses(org.eclipse.ease.lang.javascript.rhino.RhinoScriptEngineTest)  Time elapsed: 0.008 s
23:43:45 [2020-10-24T03:43:45.229Z] accessEclipseClasses(org.eclipse.ease.lang.javascript.rhino.RhinoScriptEngineTest)  Time elapsed: 0.006 s
23:43:45 [2020-10-24T03:43:45.229Z] throwJavaScriptException(org.eclipse.ease.lang.javascript.rhino.RhinoScriptEngineTest)  Time elapsed: 0.005 s
23:43:45 [2020-10-24T03:43:45.229Z] causeSyntaxErrorException(org.eclipse.ease.lang.javascript.rhino.RhinoScriptEngineTest)  Time elapsed: 0.005 s
23:43:45 [2020-10-24T03:43:45.229Z] 
23:43:45 [2020-10-24T03:43:45.229Z] Results:
23:43:45 [2020-10-24T03:43:45.229Z] 
23:43:45 [2020-10-24T03:43:45.229Z] Tests run: 70, Failures: 0, Errors: 0, Skipped: 0
23:43:45 [2020-10-24T03:43:45.229Z] 
23:43:45 [2020-10-24T03:43:45.797Z] [INFO] All tests passed!
23:43:45 [2020-10-24T03:43:45.797Z] [INFO] 
23:43:45 [2020-10-24T03:43:45.797Z] [INFO] -------< org.eclipse.ease:org.eclipse.ease.lang.javascript.test >-------
23:43:45 [2020-10-24T03:43:45.797Z] [INFO] Building org.eclipse.ease.lang.javascript.test 0.8.0-SNAPSHOT     [6/11]
23:43:45 [2020-10-24T03:43:45.797Z] [INFO] ------------------------[ eclipse-test-plugin ]-------------------------
23:43:45 [2020-10-24T03:43:45.797Z] [INFO] 
23:43:45 [2020-10-24T03:43:45.797Z] [INFO] --- tycho-packaging-plugin:1.5.0:build-qualifier (default-build-qualifier) @ org.eclipse.ease.lang.javascript.test ---
23:43:45 [2020-10-24T03:43:45.797Z] [INFO] The project's OSGi version is 0.8.0.I201910171213
23:43:45 [2020-10-24T03:43:45.797Z] [INFO] 
23:43:45 [2020-10-24T03:43:45.797Z] [INFO] --- tycho-packaging-plugin:1.5.0:validate-id (default-validate-id) @ org.eclipse.ease.lang.javascript.test ---
23:43:45 [2020-10-24T03:43:45.797Z] [INFO] 
23:43:45 [2020-10-24T03:43:45.797Z] [INFO] --- tycho-packaging-plugin:1.5.0:validate-version (default-validate-version) @ org.eclipse.ease.lang.javascript.test ---
23:43:45 [2020-10-24T03:43:45.797Z] [INFO] 
23:43:45 [2020-10-24T03:43:45.797Z] [INFO] --- maven-resources-plugin:2.4.3:resources (default-resources) @ org.eclipse.ease.lang.javascript.test ---
23:43:45 [2020-10-24T03:43:45.797Z] [INFO] Using 'UTF-8' encoding to copy filtered resources.
23:43:45 [2020-10-24T03:43:45.797Z] [INFO] skip non existing resourceDirectory /home/jenkins/agent/workspace/ease.verify.core.target.2018-12/tests/org.eclipse.ease.lang.javascript.test/src/main/resources
23:43:45 [2020-10-24T03:43:45.797Z] [INFO] 
23:43:45 [2020-10-24T03:43:45.797Z] [INFO] --- tycho-compiler-plugin:1.5.0:compile (default-compile) @ org.eclipse.ease.lang.javascript.test ---
23:43:45 [2020-10-24T03:43:45.797Z] [INFO] Nothing to compile - all classes are up to date
23:43:45 [2020-10-24T03:43:45.797Z] [INFO] 
23:43:45 [2020-10-24T03:43:45.797Z] [INFO] --- maven-resources-plugin:2.4.3:testResources (default-testResources) @ org.eclipse.ease.lang.javascript.test ---
23:43:45 [2020-10-24T03:43:45.797Z] [INFO] Using 'UTF-8' encoding to copy filtered resources.
23:43:45 [2020-10-24T03:43:45.797Z] [INFO] skip non existing resourceDirectory /home/jenkins/agent/workspace/ease.verify.core.target.2018-12/tests/org.eclipse.ease.lang.javascript.test/src/test/resources
23:43:45 [2020-10-24T03:43:45.797Z] [INFO] 
23:43:45 [2020-10-24T03:43:45.797Z] [INFO] --- tycho-source-plugin:1.5.0:plugin-source (plugin-source) @ org.eclipse.ease.lang.javascript.test ---
23:43:45 [2020-10-24T03:43:45.797Z] [WARNING] Bundle-Vendor header not found in /home/jenkins/agent/workspace/ease.verify.core.target.2018-12/tests/org.eclipse.ease.lang.javascript.test/META-INF/MANIFEST.MF, fallback to 'unknown' for source bundle
23:43:45 [2020-10-24T03:43:45.797Z] [INFO] Building jar: /home/jenkins/agent/workspace/ease.verify.core.target.2018-12/tests/org.eclipse.ease.lang.javascript.test/target/org.eclipse.ease.lang.javascript.test-0.8.0-SNAPSHOT-sources.jar
23:43:45 [2020-10-24T03:43:45.797Z] [INFO] 
23:43:45 [2020-10-24T03:43:45.797Z] [INFO] --- target-platform-configuration:1.5.0:target-platform (default-target-platform) @ org.eclipse.ease.lang.javascript.test ---
23:43:45 [2020-10-24T03:43:45.797Z] [INFO] 
23:43:45 [2020-10-24T03:43:45.797Z] [INFO] --- tycho-packaging-plugin:1.5.0:package-plugin (default-package-plugin) @ org.eclipse.ease.lang.javascript.test ---
23:43:45 [2020-10-24T03:43:45.797Z] [INFO] Building jar: /home/jenkins/agent/workspace/ease.verify.core.target.2018-12/tests/org.eclipse.ease.lang.javascript.test/target/org.eclipse.ease.lang.javascript.test-0.8.0-SNAPSHOT.jar
23:43:45 [2020-10-24T03:43:45.797Z] [INFO] 
23:43:45 [2020-10-24T03:43:45.797Z] [INFO] --- tycho-p2-plugin:1.5.0:p2-metadata-default (default-p2-metadata-default) @ org.eclipse.ease.lang.javascript.test ---
23:43:45 [2020-10-24T03:43:45.797Z] [INFO] 
23:43:45 [2020-10-24T03:43:45.797Z] [INFO] --- tycho-source-feature-plugin:1.5.0:source-feature (source-feature) @ org.eclipse.ease.lang.javascript.test ---
23:43:45 [2020-10-24T03:43:45.797Z] [INFO] 
23:43:45 [2020-10-24T03:43:45.798Z] [INFO] --- tycho-p2-plugin:1.5.0:p2-metadata (attached-p2-metadata) @ org.eclipse.ease.lang.javascript.test ---
23:43:45 [2020-10-24T03:43:45.798Z] [INFO] 
23:43:45 [2020-10-24T03:43:45.798Z] [INFO] --- tycho-surefire-plugin:1.5.0:test (default-test) @ org.eclipse.ease.lang.javascript.test ---
23:43:46 [2020-10-24T03:43:46.095Z] [INFO] Expected eclipse log file: /home/jenkins/agent/workspace/ease.verify.core.target.2018-12/tests/org.eclipse.ease.lang.javascript.test/target/work/data/.metadata/.log
23:43:46 [2020-10-24T03:43:46.095Z] [INFO] Command line:
23:43:46 [2020-10-24T03:43:46.095Z] 	[/opt/tools/java/openjdk/jdk-11/11.0.2+9/bin/java, -Dosgi.noShutdown=false, -Dosgi.os=linux, -Dosgi.ws=gtk, -Dosgi.arch=x86_64, -Dosgi.clean=true, -jar, /home/jenkins/.m2/repository/p2/osgi/bundle/org.eclipse.equinox.launcher/1.5.200.v20180922-1751/org.eclipse.equinox.launcher-1.5.200.v20180922-1751.jar, -data, /home/jenkins/agent/workspace/ease.verify.core.target.2018-12/tests/org.eclipse.ease.lang.javascript.test/target/work/data, -install, /home/jenkins/agent/workspace/ease.verify.core.target.2018-12/tests/org.eclipse.ease.lang.javascript.test/target/work, -configuration, /home/jenkins/agent/workspace/ease.verify.core.target.2018-12/tests/org.eclipse.ease.lang.javascript.test/target/work/configuration, -application, org.eclipse.tycho.surefire.osgibooter.headlesstest, -testproperties, /home/jenkins/agent/workspace/ease.verify.core.target.2018-12/tests/org.eclipse.ease.lang.javascript.test/target/surefire.properties]
23:43:46 [2020-10-24T03:43:46.095Z] Picked up JAVA_TOOL_OPTIONS: -Dmaven.ext.class.path="/home/jenkins/agent/workspace/ease.verify.core.target.2018-12@tmp/withMaven402b50fb/pipeline-maven-spy.jar" -Dorg.jenkinsci.plugins.pipeline.maven.reportsFolder="/home/jenkins/agent/workspace/ease.verify.core.target.2018-12@tmp/withMaven402b50fb" 
23:43:48 [2020-10-24T03:43:48.017Z] Running org.eclipse.ease.lang.javascript.JavaScriptCodeFactoryTest
23:43:48 [2020-10-24T03:43:48.017Z] Tests run: 1, Failures: 0, Errors: 0, Skipped: 0, Time elapsed: 0.123 s - in org.eclipse.ease.lang.javascript.JavaScriptCodeFactoryTest
23:43:48 [2020-10-24T03:43:48.017Z] testCommentCreator(org.eclipse.ease.lang.javascript.JavaScriptCodeFactoryTest)  Time elapsed: 0.004 s
23:43:48 [2020-10-24T03:43:48.017Z] Running org.eclipse.ease.lang.javascript.JavaScriptCompletionContextTest
23:43:48 [2020-10-24T03:43:48.017Z] Tests run: 8, Failures: 0, Errors: 0, Skipped: 0, Time elapsed: 0.151 s - in org.eclipse.ease.lang.javascript.JavaScriptCompletionContextTest
23:43:48 [2020-10-24T03:43:48.017Z] verifyStaticClassTypes(org.eclipse.ease.lang.javascript.JavaScriptCompletionContextTest)  Time elapsed: 0.028 s
23:43:48 [2020-10-24T03:43:48.017Z] verifyClassInstanceTypes(org.eclipse.ease.lang.javascript.JavaScriptCompletionContextTest)  Time elapsed: 0.008 s
23:43:48 [2020-10-24T03:43:48.017Z] verifyTypesForScriptEngine(org.eclipse.ease.lang.javascript.JavaScriptCompletionContextTest)  Time elapsed: 0.109 s
23:43:48 [2020-10-24T03:43:48.017Z] verifyPackageTypes(org.eclipse.ease.lang.javascript.JavaScriptCompletionContextTest)  Time elapsed: 0.001 s
23:43:48 [2020-10-24T03:43:48.017Z] definedVariableTypes(org.eclipse.ease.lang.javascript.JavaScriptCompletionContextTest)  Time elapsed: 0 s
23:43:48 [2020-10-24T03:43:48.017Z] verifyStringLiteralTypes(org.eclipse.ease.lang.javascript.JavaScriptCompletionContextTest)  Time elapsed: 0 s
23:43:48 [2020-10-24T03:43:48.017Z] verifyUnknownTypes(org.eclipse.ease.lang.javascript.JavaScriptCompletionContextTest)  Time elapsed: 0 s
23:43:48 [2020-10-24T03:43:48.017Z] verifyNoneTypes(org.eclipse.ease.lang.javascript.JavaScriptCompletionContextTest)  Time elapsed: 0 s
23:43:48 [2020-10-24T03:43:48.017Z] 
23:43:48 [2020-10-24T03:43:48.017Z] Results:
23:43:48 [2020-10-24T03:43:48.017Z] 
23:43:48 [2020-10-24T03:43:48.017Z] Tests run: 9, Failures: 0, Errors: 0, Skipped: 0
23:43:48 [2020-10-24T03:43:48.017Z] 
23:43:48 [2020-10-24T03:43:48.597Z] [INFO] All tests passed!
23:43:48 [2020-10-24T03:43:48.597Z] [INFO] 
23:43:48 [2020-10-24T03:43:48.597Z] [INFO] ---------< org.eclipse.ease:org.eclipse.ease.lang.python.test >---------
23:43:48 [2020-10-24T03:43:48.597Z] [INFO] Building org.eclipse.ease.lang.python.test 0.8.0-SNAPSHOT         [7/11]
23:43:48 [2020-10-24T03:43:48.597Z] [INFO] ------------------------[ eclipse-test-plugin ]-------------------------
23:43:48 [2020-10-24T03:43:48.597Z] [INFO] 
23:43:48 [2020-10-24T03:43:48.597Z] [INFO] --- tycho-packaging-plugin:1.5.0:build-qualifier (default-build-qualifier) @ org.eclipse.ease.lang.python.test ---
23:43:48 [2020-10-24T03:43:48.597Z] [INFO] The project's OSGi version is 0.8.0.I201910171213
23:43:48 [2020-10-24T03:43:48.597Z] [INFO] 
23:43:48 [2020-10-24T03:43:48.597Z] [INFO] --- tycho-packaging-plugin:1.5.0:validate-id (default-validate-id) @ org.eclipse.ease.lang.python.test ---
23:43:48 [2020-10-24T03:43:48.597Z] [INFO] 
23:43:48 [2020-10-24T03:43:48.597Z] [INFO] --- tycho-packaging-plugin:1.5.0:validate-version (default-validate-version) @ org.eclipse.ease.lang.python.test ---
23:43:48 [2020-10-24T03:43:48.597Z] [INFO] 
23:43:48 [2020-10-24T03:43:48.597Z] [INFO] --- maven-resources-plugin:2.4.3:resources (default-resources) @ org.eclipse.ease.lang.python.test ---
23:43:48 [2020-10-24T03:43:48.597Z] [INFO] Using 'UTF-8' encoding to copy filtered resources.
23:43:48 [2020-10-24T03:43:48.597Z] [INFO] skip non existing resourceDirectory /home/jenkins/agent/workspace/ease.verify.core.target.2018-12/tests/org.eclipse.ease.lang.python.test/src/main/resources
23:43:48 [2020-10-24T03:43:48.597Z] [INFO] 
23:43:48 [2020-10-24T03:43:48.597Z] [INFO] --- tycho-compiler-plugin:1.5.0:compile (default-compile) @ org.eclipse.ease.lang.python.test ---
23:43:48 [2020-10-24T03:43:48.597Z] [INFO] Nothing to compile - all classes are up to date
23:43:48 [2020-10-24T03:43:48.597Z] [INFO] 
23:43:48 [2020-10-24T03:43:48.597Z] [INFO] --- maven-resources-plugin:2.4.3:testResources (default-testResources) @ org.eclipse.ease.lang.python.test ---
23:43:48 [2020-10-24T03:43:48.597Z] [INFO] Using 'UTF-8' encoding to copy filtered resources.
23:43:48 [2020-10-24T03:43:48.597Z] [INFO] skip non existing resourceDirectory /home/jenkins/agent/workspace/ease.verify.core.target.2018-12/tests/org.eclipse.ease.lang.python.test/src/test/resources
23:43:48 [2020-10-24T03:43:48.597Z] [INFO] 
23:43:48 [2020-10-24T03:43:48.597Z] [INFO] --- tycho-source-plugin:1.5.0:plugin-source (plugin-source) @ org.eclipse.ease.lang.python.test ---
23:43:48 [2020-10-24T03:43:48.597Z] [WARNING] Bundle-Vendor header not found in /home/jenkins/agent/workspace/ease.verify.core.target.2018-12/tests/org.eclipse.ease.lang.python.test/META-INF/MANIFEST.MF, fallback to 'unknown' for source bundle
23:43:48 [2020-10-24T03:43:48.597Z] [INFO] Building jar: /home/jenkins/agent/workspace/ease.verify.core.target.2018-12/tests/org.eclipse.ease.lang.python.test/target/org.eclipse.ease.lang.python.test-0.8.0-SNAPSHOT-sources.jar
23:43:48 [2020-10-24T03:43:48.597Z] [INFO] 
23:43:48 [2020-10-24T03:43:48.597Z] [INFO] --- target-platform-configuration:1.5.0:target-platform (default-target-platform) @ org.eclipse.ease.lang.python.test ---
23:43:48 [2020-10-24T03:43:48.597Z] [INFO] 
23:43:48 [2020-10-24T03:43:48.597Z] [INFO] --- tycho-packaging-plugin:1.5.0:package-plugin (default-package-plugin) @ org.eclipse.ease.lang.python.test ---
23:43:48 [2020-10-24T03:43:48.597Z] [INFO] Building jar: /home/jenkins/agent/workspace/ease.verify.core.target.2018-12/tests/org.eclipse.ease.lang.python.test/target/org.eclipse.ease.lang.python.test-0.8.0-SNAPSHOT.jar
23:43:48 [2020-10-24T03:43:48.597Z] [INFO] 
23:43:48 [2020-10-24T03:43:48.597Z] [INFO] --- tycho-p2-plugin:1.5.0:p2-metadata-default (default-p2-metadata-default) @ org.eclipse.ease.lang.python.test ---
23:43:48 [2020-10-24T03:43:48.597Z] [INFO] 
23:43:48 [2020-10-24T03:43:48.597Z] [INFO] --- tycho-source-feature-plugin:1.5.0:source-feature (source-feature) @ org.eclipse.ease.lang.python.test ---
23:43:48 [2020-10-24T03:43:48.597Z] [INFO] 
23:43:48 [2020-10-24T03:43:48.597Z] [INFO] --- tycho-p2-plugin:1.5.0:p2-metadata (attached-p2-metadata) @ org.eclipse.ease.lang.python.test ---
23:43:48 [2020-10-24T03:43:48.597Z] [INFO] 
23:43:48 [2020-10-24T03:43:48.598Z] [INFO] --- tycho-surefire-plugin:1.5.0:test (default-test) @ org.eclipse.ease.lang.python.test ---
23:43:48 [2020-10-24T03:43:48.854Z] [INFO] Expected eclipse log file: /home/jenkins/agent/workspace/ease.verify.core.target.2018-12/tests/org.eclipse.ease.lang.python.test/target/work/data/.metadata/.log
23:43:48 [2020-10-24T03:43:48.854Z] [INFO] Command line:
23:43:48 [2020-10-24T03:43:48.854Z] 	[/opt/tools/java/openjdk/jdk-11/11.0.2+9/bin/java, -Dosgi.noShutdown=false, -Dosgi.os=linux, -Dosgi.ws=gtk, -Dosgi.arch=x86_64, -Dosgi.clean=true, -jar, /home/jenkins/.m2/repository/p2/osgi/bundle/org.eclipse.equinox.launcher/1.5.200.v20180922-1751/org.eclipse.equinox.launcher-1.5.200.v20180922-1751.jar, -data, /home/jenkins/agent/workspace/ease.verify.core.target.2018-12/tests/org.eclipse.ease.lang.python.test/target/work/data, -install, /home/jenkins/agent/workspace/ease.verify.core.target.2018-12/tests/org.eclipse.ease.lang.python.test/target/work, -configuration, /home/jenkins/agent/workspace/ease.verify.core.target.2018-12/tests/org.eclipse.ease.lang.python.test/target/work/configuration, -application, org.eclipse.tycho.surefire.osgibooter.headlesstest, -testproperties, /home/jenkins/agent/workspace/ease.verify.core.target.2018-12/tests/org.eclipse.ease.lang.python.test/target/surefire.properties]
23:43:48 [2020-10-24T03:43:48.854Z] Picked up JAVA_TOOL_OPTIONS: -Dmaven.ext.class.path="/home/jenkins/agent/workspace/ease.verify.core.target.2018-12@tmp/withMaven402b50fb/pipeline-maven-spy.jar" -Dorg.jenkinsci.plugins.pipeline.maven.reportsFolder="/home/jenkins/agent/workspace/ease.verify.core.target.2018-12@tmp/withMaven402b50fb" 
23:43:50 [2020-10-24T03:43:50.233Z] Running org.eclipse.ease.lang.python.PythonCodeFactoryTest
23:43:50 [2020-10-24T03:43:50.488Z] Tests run: 1, Failures: 0, Errors: 0, Skipped: 0, Time elapsed: 0.061 s - in org.eclipse.ease.lang.python.PythonCodeFactoryTest
23:43:50 [2020-10-24T03:43:50.488Z] testCommentCreator(org.eclipse.ease.lang.python.PythonCodeFactoryTest)  Time elapsed: 0.004 s
23:43:50 [2020-10-24T03:43:50.488Z] 
23:43:50 [2020-10-24T03:43:50.488Z] Results:
23:43:50 [2020-10-24T03:43:50.488Z] 
23:43:50 [2020-10-24T03:43:50.488Z] Tests run: 1, Failures: 0, Errors: 0, Skipped: 0
23:43:50 [2020-10-24T03:43:50.488Z] 
23:43:50 [2020-10-24T03:43:50.744Z] [INFO] All tests passed!
23:43:50 [2020-10-24T03:43:50.744Z] [INFO] 
23:43:50 [2020-10-24T03:43:50.744Z] [INFO] -----< org.eclipse.ease:org.eclipse.ease.lang.python.jython.test >------
23:43:50 [2020-10-24T03:43:50.744Z] [INFO] Building org.eclipse.ease.lang.python.jython.test 0.8.0-SNAPSHOT  [8/11]
23:43:50 [2020-10-24T03:43:50.744Z] [INFO] ------------------------[ eclipse-test-plugin ]-------------------------
23:43:50 [2020-10-24T03:43:50.744Z] [INFO] 
23:43:50 [2020-10-24T03:43:50.744Z] [INFO] --- tycho-packaging-plugin:1.5.0:build-qualifier (default-build-qualifier) @ org.eclipse.ease.lang.python.jython.test ---
23:43:50 [2020-10-24T03:43:50.744Z] [INFO] The project's OSGi version is 0.8.0.I201911291239
23:43:50 [2020-10-24T03:43:50.744Z] [INFO] 
23:43:50 [2020-10-24T03:43:50.744Z] [INFO] --- tycho-packaging-plugin:1.5.0:validate-id (default-validate-id) @ org.eclipse.ease.lang.python.jython.test ---
23:43:50 [2020-10-24T03:43:50.744Z] [INFO] 
23:43:50 [2020-10-24T03:43:50.744Z] [INFO] --- tycho-packaging-plugin:1.5.0:validate-version (default-validate-version) @ org.eclipse.ease.lang.python.jython.test ---
23:43:50 [2020-10-24T03:43:50.744Z] [INFO] 
23:43:50 [2020-10-24T03:43:50.744Z] [INFO] --- maven-resources-plugin:2.4.3:resources (default-resources) @ org.eclipse.ease.lang.python.jython.test ---
23:43:50 [2020-10-24T03:43:50.744Z] [INFO] Using 'UTF-8' encoding to copy filtered resources.
23:43:50 [2020-10-24T03:43:50.744Z] [INFO] skip non existing resourceDirectory /home/jenkins/agent/workspace/ease.verify.core.target.2018-12/tests/org.eclipse.ease.lang.python.jython.test/src/main/resources
23:43:50 [2020-10-24T03:43:50.744Z] [INFO] 
23:43:50 [2020-10-24T03:43:50.744Z] [INFO] --- tycho-compiler-plugin:1.5.0:compile (default-compile) @ org.eclipse.ease.lang.python.jython.test ---
23:43:50 [2020-10-24T03:43:50.744Z] [INFO] Nothing to compile - all classes are up to date
23:43:51 [2020-10-24T03:43:51.004Z] [INFO] 
23:43:51 [2020-10-24T03:43:51.004Z] [INFO] --- maven-resources-plugin:2.4.3:testResources (default-testResources) @ org.eclipse.ease.lang.python.jython.test ---
23:43:51 [2020-10-24T03:43:51.004Z] [INFO] Using 'UTF-8' encoding to copy filtered resources.
23:43:51 [2020-10-24T03:43:51.004Z] [INFO] skip non existing resourceDirectory /home/jenkins/agent/workspace/ease.verify.core.target.2018-12/tests/org.eclipse.ease.lang.python.jython.test/src/test/resources
23:43:51 [2020-10-24T03:43:51.004Z] [INFO] 
23:43:51 [2020-10-24T03:43:51.004Z] [INFO] --- tycho-source-plugin:1.5.0:plugin-source (plugin-source) @ org.eclipse.ease.lang.python.jython.test ---
23:43:51 [2020-10-24T03:43:51.004Z] [WARNING] Bundle-Vendor header not found in /home/jenkins/agent/workspace/ease.verify.core.target.2018-12/tests/org.eclipse.ease.lang.python.jython.test/META-INF/MANIFEST.MF, fallback to 'unknown' for source bundle
23:43:51 [2020-10-24T03:43:51.004Z] [INFO] Building jar: /home/jenkins/agent/workspace/ease.verify.core.target.2018-12/tests/org.eclipse.ease.lang.python.jython.test/target/org.eclipse.ease.lang.python.jython.test-0.8.0-SNAPSHOT-sources.jar
23:43:51 [2020-10-24T03:43:51.004Z] [INFO] 
23:43:51 [2020-10-24T03:43:51.004Z] [INFO] --- target-platform-configuration:1.5.0:target-platform (default-target-platform) @ org.eclipse.ease.lang.python.jython.test ---
23:43:51 [2020-10-24T03:43:51.004Z] [INFO] 
23:43:51 [2020-10-24T03:43:51.004Z] [INFO] --- tycho-packaging-plugin:1.5.0:package-plugin (default-package-plugin) @ org.eclipse.ease.lang.python.jython.test ---
23:43:51 [2020-10-24T03:43:51.004Z] [INFO] Building jar: /home/jenkins/agent/workspace/ease.verify.core.target.2018-12/tests/org.eclipse.ease.lang.python.jython.test/target/org.eclipse.ease.lang.python.jython.test-0.8.0-SNAPSHOT.jar
23:43:51 [2020-10-24T03:43:51.004Z] [INFO] 
23:43:51 [2020-10-24T03:43:51.004Z] [INFO] --- tycho-p2-plugin:1.5.0:p2-metadata-default (default-p2-metadata-default) @ org.eclipse.ease.lang.python.jython.test ---
23:43:51 [2020-10-24T03:43:51.004Z] [INFO] 
23:43:51 [2020-10-24T03:43:51.004Z] [INFO] --- tycho-source-feature-plugin:1.5.0:source-feature (source-feature) @ org.eclipse.ease.lang.python.jython.test ---
23:43:51 [2020-10-24T03:43:51.004Z] [INFO] 
23:43:51 [2020-10-24T03:43:51.004Z] [INFO] --- tycho-p2-plugin:1.5.0:p2-metadata (attached-p2-metadata) @ org.eclipse.ease.lang.python.jython.test ---
23:43:51 [2020-10-24T03:43:51.004Z] [INFO] 
23:43:51 [2020-10-24T03:43:51.004Z] [INFO] --- tycho-surefire-plugin:1.5.0:test (default-test) @ org.eclipse.ease.lang.python.jython.test ---
23:43:51 [2020-10-24T03:43:51.566Z] [INFO] Expected eclipse log file: /home/jenkins/agent/workspace/ease.verify.core.target.2018-12/tests/org.eclipse.ease.lang.python.jython.test/target/work/data/.metadata/.log
23:43:51 [2020-10-24T03:43:51.566Z] [INFO] Command line:
23:43:51 [2020-10-24T03:43:51.566Z] 	[/opt/tools/java/openjdk/jdk-11/11.0.2+9/bin/java, -Dosgi.noShutdown=false, -Dosgi.os=linux, -Dosgi.ws=gtk, -Dosgi.arch=x86_64, -Dosgi.clean=true, -jar, /home/jenkins/.m2/repository/p2/osgi/bundle/org.eclipse.equinox.launcher/1.5.200.v20180922-1751/org.eclipse.equinox.launcher-1.5.200.v20180922-1751.jar, -data, /home/jenkins/agent/workspace/ease.verify.core.target.2018-12/tests/org.eclipse.ease.lang.python.jython.test/target/work/data, -install, /home/jenkins/agent/workspace/ease.verify.core.target.2018-12/tests/org.eclipse.ease.lang.python.jython.test/target/work, -configuration, /home/jenkins/agent/workspace/ease.verify.core.target.2018-12/tests/org.eclipse.ease.lang.python.jython.test/target/work/configuration, -application, org.eclipse.tycho.surefire.osgibooter.headlesstest, -testproperties, /home/jenkins/agent/workspace/ease.verify.core.target.2018-12/tests/org.eclipse.ease.lang.python.jython.test/target/surefire.properties]
23:43:51 [2020-10-24T03:43:51.566Z] Picked up JAVA_TOOL_OPTIONS: -Dmaven.ext.class.path="/home/jenkins/agent/workspace/ease.verify.core.target.2018-12@tmp/withMaven402b50fb/pipeline-maven-spy.jar" -Dorg.jenkinsci.plugins.pipeline.maven.reportsFolder="/home/jenkins/agent/workspace/ease.verify.core.target.2018-12@tmp/withMaven402b50fb" 
23:43:53 [2020-10-24T03:43:53.453Z] WARNING: An illegal reflective access operation has occurred
23:43:53 [2020-10-24T03:43:53.453Z] WARNING: Illegal reflective access by org.python.core.PySystemState (file:/home/jenkins/agent/workspace/ease.verify.core.target.2018-12/tests/org.eclipse.ease.lang.python.jython.test/target/work/plugins/org.jython_2.7.0.I201609090924/jython.jar) to method java.io.Console.encoding()
23:43:53 [2020-10-24T03:43:53.453Z] WARNING: Please consider reporting this to the maintainers of org.python.core.PySystemState
23:43:53 [2020-10-24T03:43:53.453Z] WARNING: Use --illegal-access=warn to enable warnings of further illegal reflective access operations
23:43:53 [2020-10-24T03:43:53.453Z] WARNING: All illegal access operations will be denied in a future release
23:43:53 [2020-10-24T03:43:53.709Z] Running org.eclipse.ease.lang.python.jython.debugger.JythonDebugTest
23:43:55 [2020-10-24T03:43:55.104Z] Start of script
23:43:55 [2020-10-24T03:43:55.104Z] include file start
23:43:55 [2020-10-24T03:43:55.104Z] include file processed
23:43:55 [2020-10-24T03:43:55.104Z] Result of testMethod = 5
23:43:55 [2020-10-24T03:43:55.104Z] End of script
23:43:55 [2020-10-24T03:43:55.359Z] Start of script
23:43:55 [2020-10-24T03:43:55.359Z] include file start
23:43:55 [2020-10-24T03:43:55.359Z] include file processed
23:43:55 [2020-10-24T03:43:55.359Z] Result of testMethod = 5
23:43:55 [2020-10-24T03:43:55.359Z] End of script
23:43:55 [2020-10-24T03:43:55.615Z] Start of script
23:43:55 [2020-10-24T03:43:55.615Z] include file start
23:43:55 [2020-10-24T03:43:55.615Z] include file processed
23:43:55 [2020-10-24T03:43:55.615Z] Result of testMethod = 5
23:43:55 [2020-10-24T03:43:55.615Z] Traceback (most recent call last):
23:43:55 [2020-10-24T03:43:55.615Z]   File "(none)", line 184, in run
23:43:55 [2020-10-24T03:43:55.615Z]   File "__ref_L/Debug Test/Main.py_sxubsoxkow", line 23, in <module>
23:43:55 [2020-10-24T03:43:55.615Z]   File "(none)", line 161, in trace_dispatch
23:43:55 [2020-10-24T03:43:55.615Z] org.eclipse.ease.ExitException: 
23:43:55 [2020-10-24T03:43:55.615Z] 
23:43:55 [2020-10-24T03:43:55.615Z] org.eclipse.ease.ExitException: org.eclipse.ease.ExitException: 
23:43:55 [2020-10-24T03:43:55.871Z] Start of script
23:43:55 [2020-10-24T03:43:55.871Z] include file start
23:43:55 [2020-10-24T03:43:55.871Z] include file processed
23:43:56 [2020-10-24T03:43:56.127Z] Result of testMethod = 5
23:43:56 [2020-10-24T03:43:56.127Z] End of script
23:43:56 [2020-10-24T03:43:56.383Z] Start of script
23:43:56 [2020-10-24T03:43:56.383Z] include file start
23:43:56 [2020-10-24T03:43:56.383Z] include file processed
23:43:56 [2020-10-24T03:43:56.383Z] Result of testMethod = 5
23:43:56 [2020-10-24T03:43:56.383Z] End of script
23:43:56 [2020-10-24T03:43:56.383Z] Start of script
23:43:56 [2020-10-24T03:43:56.383Z] include file start
23:43:56 [2020-10-24T03:43:56.383Z] include file processed
23:43:56 [2020-10-24T03:43:56.638Z] Result of testMethod = 5
23:43:56 [2020-10-24T03:43:56.638Z] End of script
23:43:56 [2020-10-24T03:43:56.894Z] Start of script
23:43:56 [2020-10-24T03:43:56.894Z] include file start
23:43:56 [2020-10-24T03:43:56.894Z] include file processed
23:43:56 [2020-10-24T03:43:56.894Z] Result of testMethod = 5
23:43:56 [2020-10-24T03:43:56.894Z] Traceback (most recent call last):
23:43:56 [2020-10-24T03:43:56.894Z]   File "(none)", line 184, in run
23:43:56 [2020-10-24T03:43:56.894Z]   File "__ref_L/Debug Test/Main.py_ebebltzgyz", line 23, in <module>
23:43:56 [2020-10-24T03:43:56.894Z]   File "(none)", line 161, in trace_dispatch
23:43:56 [2020-10-24T03:43:56.894Z] org.eclipse.ease.ExitException: 
23:43:56 [2020-10-24T03:43:56.894Z] 
23:43:56 [2020-10-24T03:43:56.894Z] org.eclipse.ease.ExitException: org.eclipse.ease.ExitException: 
23:43:57 [2020-10-24T03:43:57.150Z] Start of script
23:43:57 [2020-10-24T03:43:57.150Z] include file start
23:43:57 [2020-10-24T03:43:57.150Z] include file processed
23:43:57 [2020-10-24T03:43:57.150Z] Result of testMethod = 5
23:43:57 [2020-10-24T03:43:57.150Z] End of script
23:43:57 [2020-10-24T03:43:57.405Z] Start of script
23:43:57 [2020-10-24T03:43:57.405Z] include file start
23:43:57 [2020-10-24T03:43:57.405Z] include file processed
23:43:57 [2020-10-24T03:43:57.405Z] Result of testMethod = 5
23:43:57 [2020-10-24T03:43:57.405Z] End of script
23:43:57 [2020-10-24T03:43:57.661Z] Start of script
23:43:57 [2020-10-24T03:43:57.661Z] include file start
23:43:57 [2020-10-24T03:43:57.661Z] include file processed
23:43:57 [2020-10-24T03:43:57.916Z] Traceback (most recent call last):
23:43:57 [2020-10-24T03:43:57.916Z]   File "(none)", line 184, in run
23:43:57 [2020-10-24T03:43:57.916Z]   File "__ref_L/Debug Test/Main.py_fbemxkumhb", line 22, in <module>
23:43:57 [2020-10-24T03:43:57.916Z]   File "(none)", line 161, in trace_dispatch
23:43:57 [2020-10-24T03:43:57.916Z] org.eclipse.ease.ExitException: 
23:43:57 [2020-10-24T03:43:57.916Z] 
23:43:57 [2020-10-24T03:43:57.916Z] org.eclipse.ease.ExitException: org.eclipse.ease.ExitException: 
23:43:58 [2020-10-24T03:43:58.171Z] Start of script
23:43:58 [2020-10-24T03:43:58.171Z] include file start
23:43:58 [2020-10-24T03:43:58.171Z] include file processed
23:43:58 [2020-10-24T03:43:58.171Z] Result of testMethod = 5
23:43:58 [2020-10-24T03:43:58.171Z] End of script
23:43:58 [2020-10-24T03:43:58.427Z] Start of script
23:43:58 [2020-10-24T03:43:58.427Z] include file start
23:43:58 [2020-10-24T03:43:58.427Z] include file processed
23:43:58 [2020-10-24T03:43:58.427Z] Result of testMethod = 5
23:43:58 [2020-10-24T03:43:58.427Z] End of script
23:43:58 [2020-10-24T03:43:58.683Z] Traceback (most recent call last):
23:43:58 [2020-10-24T03:43:58.683Z]   File "(none)", line 184, in run
23:43:58 [2020-10-24T03:43:58.683Z]   File "__ref_L/Debug Test/Main.py_bvnyibjtta", line 1, in <module>
23:43:58 [2020-10-24T03:43:58.683Z]   File "(none)", line 161, in trace_dispatch
23:43:58 [2020-10-24T03:43:58.683Z] org.eclipse.ease.ExitException: 
23:43:58 [2020-10-24T03:43:58.683Z] 
23:43:58 [2020-10-24T03:43:58.683Z] org.eclipse.ease.ExitException: org.eclipse.ease.ExitException: 
23:43:58 [2020-10-24T03:43:58.938Z] Start of script
23:43:58 [2020-10-24T03:43:58.938Z] include file start
23:43:58 [2020-10-24T03:43:58.938Z] include file processed
23:43:58 [2020-10-24T03:43:58.938Z] Result of testMethod = 5
23:43:58 [2020-10-24T03:43:58.938Z] End of script
23:43:58 [2020-10-24T03:43:58.938Z] Start of script
23:43:58 [2020-10-24T03:43:58.938Z] include file start
23:43:58 [2020-10-24T03:43:58.938Z] include file processed
23:43:59 [2020-10-24T03:43:59.193Z] Result of testMethod = 5
23:43:59 [2020-10-24T03:43:59.193Z] End of script
23:43:59 [2020-10-24T03:43:59.449Z] Start of script
23:43:59 [2020-10-24T03:43:59.449Z] include file start
23:43:59 [2020-10-24T03:43:59.449Z] include file processed
23:43:59 [2020-10-24T03:43:59.449Z] Result of testMethod = 5
23:43:59 [2020-10-24T03:43:59.449Z] Traceback (most recent call last):
23:43:59 [2020-10-24T03:43:59.449Z]   File "(none)", line 184, in run
23:43:59 [2020-10-24T03:43:59.449Z]   File "__ref_L/Debug Test/Main.py_pdzgsdzatm", line 23, in <module>
23:43:59 [2020-10-24T03:43:59.449Z]   File "(none)", line 161, in trace_dispatch
23:43:59 [2020-10-24T03:43:59.449Z] org.eclipse.ease.ExitException: 
23:43:59 [2020-10-24T03:43:59.449Z] 
23:43:59 [2020-10-24T03:43:59.449Z] org.eclipse.ease.ExitException: org.eclipse.ease.ExitException: 
23:43:59 [2020-10-24T03:43:59.704Z] Start of script
23:43:59 [2020-10-24T03:43:59.704Z] include file start
23:43:59 [2020-10-24T03:43:59.704Z] include file processed
23:43:59 [2020-10-24T03:43:59.960Z] Result of testMethod = 5
23:43:59 [2020-10-24T03:43:59.960Z] End of script
23:43:59 [2020-10-24T03:43:59.960Z] Traceback (most recent call last):
23:43:59 [2020-10-24T03:43:59.960Z]   File "(none)", line 184, in run
23:43:59 [2020-10-24T03:43:59.960Z]   File "__ref_L/Debug Test/Main.py_axzebnhpkl", line 1, in <module>
23:43:59 [2020-10-24T03:43:59.960Z]   File "(none)", line 161, in trace_dispatch
23:43:59 [2020-10-24T03:43:59.960Z] org.eclipse.ease.ExitException: 
23:43:59 [2020-10-24T03:43:59.960Z] 
23:43:59 [2020-10-24T03:43:59.960Z] org.eclipse.ease.ExitException: org.eclipse.ease.ExitException: 
23:44:00 [2020-10-24T03:44:00.216Z] Start of script
23:44:00 [2020-10-24T03:44:00.216Z] include file start
23:44:00 [2020-10-24T03:44:00.216Z] include file processed
23:44:00 [2020-10-24T03:44:00.216Z] Result of testMethod = 5
23:44:00 [2020-10-24T03:44:00.216Z] End of script
23:44:00 [2020-10-24T03:44:00.471Z] Start of script
23:44:00 [2020-10-24T03:44:00.471Z] include file start
23:44:00 [2020-10-24T03:44:00.471Z] include file processed
23:44:00 [2020-10-24T03:44:00.471Z] Result of testMethod = 5
23:44:00 [2020-10-24T03:44:00.471Z] End of script
23:44:00 [2020-10-24T03:44:00.727Z] Traceback (most recent call last):
23:44:00 [2020-10-24T03:44:00.727Z]   File "(none)", line 184, in run
23:44:00 [2020-10-24T03:44:00.727Z]   File "__ref_L/Debug Test/Main.py_madzavtmaz", line 1, in <module>
23:44:00 [2020-10-24T03:44:00.727Z]   File "(none)", line 161, in trace_dispatch
23:44:00 [2020-10-24T03:44:00.727Z] org.eclipse.ease.ExitException: 
23:44:00 [2020-10-24T03:44:00.727Z] 
23:44:00 [2020-10-24T03:44:00.727Z] org.eclipse.ease.ExitException: org.eclipse.ease.ExitException: 
23:44:00 [2020-10-24T03:44:00.982Z] Start of script
23:44:00 [2020-10-24T03:44:00.982Z] include file start
23:44:00 [2020-10-24T03:44:00.982Z] include file processed
23:44:00 [2020-10-24T03:44:00.982Z] Result of testMethod = 5
23:44:00 [2020-10-24T03:44:00.982Z] End of script
23:44:01 [2020-10-24T03:44:01.237Z] Start of script
23:44:01 [2020-10-24T03:44:01.237Z] include file start
23:44:01 [2020-10-24T03:44:01.237Z] include file processed
23:44:01 [2020-10-24T03:44:01.237Z] Result of testMethod = 5
23:44:01 [2020-10-24T03:44:01.493Z] Traceback (most recent call last):
23:44:01 [2020-10-24T03:44:01.493Z]   File "(none)", line 184, in run
23:44:01 [2020-10-24T03:44:01.493Z]   File "__ref_L/Debug Test/Main.py_itfzttfnaa", line 23, in <module>
23:44:01 [2020-10-24T03:44:01.493Z]   File "(none)", line 161, in trace_dispatch
23:44:01 [2020-10-24T03:44:01.493Z] org.eclipse.ease.ExitException: 
23:44:01 [2020-10-24T03:44:01.493Z] 
23:44:01 [2020-10-24T03:44:01.493Z] org.eclipse.ease.ExitException: org.eclipse.ease.ExitException: 
23:44:01 [2020-10-24T03:44:01.493Z] Start of script
23:44:01 [2020-10-24T03:44:01.493Z] include file start
23:44:01 [2020-10-24T03:44:01.493Z] include file processed
23:44:01 [2020-10-24T03:44:01.493Z] Result of testMethod = 5
23:44:01 [2020-10-24T03:44:01.493Z] End of script
23:44:01 [2020-10-24T03:44:01.748Z] Start of script
23:44:01 [2020-10-24T03:44:01.748Z] include file start
23:44:01 [2020-10-24T03:44:01.748Z] include file processed
23:44:02 [2020-10-24T03:44:02.004Z] Result of testMethod = 5
23:44:02 [2020-10-24T03:44:02.004Z] End of script
23:44:02 [2020-10-24T03:44:02.004Z] Start of script
23:44:02 [2020-10-24T03:44:02.004Z] include file start
23:44:02 [2020-10-24T03:44:02.004Z] include file processed
23:44:02 [2020-10-24T03:44:02.004Z] Result of testMethod = 5
23:44:02 [2020-10-24T03:44:02.004Z] End of script
23:44:02 [2020-10-24T03:44:02.260Z] Start of script
23:44:02 [2020-10-24T03:44:02.260Z] include file start
23:44:02 [2020-10-24T03:44:02.260Z] include file processed
23:44:02 [2020-10-24T03:44:02.260Z] Result of testMethod = 5
23:44:02 [2020-10-24T03:44:02.260Z] End of script
23:44:02 [2020-10-24T03:44:02.522Z] Start of script
23:44:02 [2020-10-24T03:44:02.522Z] include file start
23:44:02 [2020-10-24T03:44:02.522Z] include file processed
23:44:02 [2020-10-24T03:44:02.522Z] Traceback (most recent call last):
23:44:02 [2020-10-24T03:44:02.522Z]   File "(none)", line 184, in run
23:44:02 [2020-10-24T03:44:02.522Z]   File "__ref_L/Debug Test/Main.py_kentzmjqzc", line 21, in <module>
23:44:02 [2020-10-24T03:44:02.522Z]   File "__ref_L/Debug Test/Main.py_kentzmjqzc", line 18, in testMethod
23:44:02 [2020-10-24T03:44:02.522Z]   File "(none)", line 161, in trace_dispatch
23:44:02 [2020-10-24T03:44:02.522Z] org.eclipse.ease.ExitException: 
23:44:02 [2020-10-24T03:44:02.522Z] 
23:44:02 [2020-10-24T03:44:02.522Z] org.eclipse.ease.ExitException: org.eclipse.ease.ExitException: 
23:44:02 [2020-10-24T03:44:02.796Z] Start of script
23:44:03 [2020-10-24T03:44:03.052Z] include file start
23:44:03 [2020-10-24T03:44:03.052Z] include file processed
23:44:03 [2020-10-24T03:44:03.052Z] Result of testMethod = 5
23:44:03 [2020-10-24T03:44:03.052Z] End of script
23:44:03 [2020-10-24T03:44:03.052Z] Start of script
23:44:03 [2020-10-24T03:44:03.052Z] include file start
23:44:03 [2020-10-24T03:44:03.052Z] include file processed
23:44:03 [2020-10-24T03:44:03.052Z] Result of testMethod = 5
23:44:03 [2020-10-24T03:44:03.308Z] Traceback (most recent call last):
23:44:03 [2020-10-24T03:44:03.308Z]   File "(none)", line 184, in run
23:44:03 [2020-10-24T03:44:03.308Z]   File "__ref_L/Debug Test/Main.py_tmxxjmbmce", line 23, in <module>
23:44:03 [2020-10-24T03:44:03.308Z]   File "(none)", line 161, in trace_dispatch
23:44:03 [2020-10-24T03:44:03.308Z] org.eclipse.ease.ExitException: 
23:44:03 [2020-10-24T03:44:03.308Z] 
23:44:03 [2020-10-24T03:44:03.308Z] org.eclipse.ease.ExitException: org.eclipse.ease.ExitException: 
23:44:03 [2020-10-24T03:44:03.308Z] Start of script
23:44:03 [2020-10-24T03:44:03.308Z] include file start
23:44:03 [2020-10-24T03:44:03.308Z] include file processed
23:44:03 [2020-10-24T03:44:03.308Z] Result of testMethod = 5
23:44:03 [2020-10-24T03:44:03.564Z] End of script
23:44:03 [2020-10-24T03:44:03.564Z] Start of script
23:44:03 [2020-10-24T03:44:03.564Z] include file start
23:44:03 [2020-10-24T03:44:03.564Z] include file processed
23:44:03 [2020-10-24T03:44:03.820Z] Result of testMethod = 5
23:44:03 [2020-10-24T03:44:03.820Z] End of script
23:44:03 [2020-10-24T03:44:03.820Z] Start of script
23:44:03 [2020-10-24T03:44:03.820Z] include file start
23:44:03 [2020-10-24T03:44:03.820Z] include file processed
23:44:04 [2020-10-24T03:44:04.075Z] Result of testMethod = 5
23:44:04 [2020-10-24T03:44:04.075Z] End of script
23:44:04 [2020-10-24T03:44:04.075Z] Start of script
23:44:04 [2020-10-24T03:44:04.075Z] include file start
23:44:04 [2020-10-24T03:44:04.075Z] include file processed
23:44:04 [2020-10-24T03:44:04.075Z] Result of testMethod = 5
23:44:04 [2020-10-24T03:44:04.331Z] End of script
23:44:04 [2020-10-24T03:44:04.331Z] Start of script
23:44:04 [2020-10-24T03:44:04.331Z] include file start
23:44:04 [2020-10-24T03:44:04.331Z] include file processed
23:44:04 [2020-10-24T03:44:04.331Z] Result of testMethod = 5
23:44:04 [2020-10-24T03:44:04.587Z] Traceback (most recent call last):
23:44:04 [2020-10-24T03:44:04.587Z]   File "(none)", line 184, in run
23:44:04 [2020-10-24T03:44:04.587Z]   File "__ref_L/Debug Test/Main.py_cdfrbleawb", line 23, in <module>
23:44:04 [2020-10-24T03:44:04.587Z]   File "(none)", line 161, in trace_dispatch
23:44:04 [2020-10-24T03:44:04.587Z] org.eclipse.ease.ExitException: 
23:44:04 [2020-10-24T03:44:04.587Z] 
23:44:04 [2020-10-24T03:44:04.587Z] org.eclipse.ease.ExitException: org.eclipse.ease.ExitException: 
23:44:04 [2020-10-24T03:44:04.587Z] Start of script
23:44:04 [2020-10-24T03:44:04.587Z] include file start
23:44:04 [2020-10-24T03:44:04.587Z] include file processed
23:44:04 [2020-10-24T03:44:04.587Z] Result of testMethod = 5
23:44:04 [2020-10-24T03:44:04.844Z] End of script
23:44:04 [2020-10-24T03:44:04.844Z] Start of script
23:44:04 [2020-10-24T03:44:04.844Z] include file start
23:44:04 [2020-10-24T03:44:04.844Z] include file processed
23:44:04 [2020-10-24T03:44:04.844Z] Result of testMethod = 5
23:44:05 [2020-10-24T03:44:05.100Z] Traceback (most recent call last):
23:44:05 [2020-10-24T03:44:05.100Z]   File "(none)", line 184, in run
23:44:05 [2020-10-24T03:44:05.100Z]   File "__ref_L/Debug Test/Main.py_vfiiqvqpbv", line 23, in <module>
23:44:05 [2020-10-24T03:44:05.100Z]   File "(none)", line 161, in trace_dispatch
23:44:05 [2020-10-24T03:44:05.100Z] org.eclipse.ease.ExitException: 
23:44:05 [2020-10-24T03:44:05.100Z] 
23:44:05 [2020-10-24T03:44:05.100Z] org.eclipse.ease.ExitException: org.eclipse.ease.ExitException: 
23:44:05 [2020-10-24T03:44:05.356Z] Traceback (most recent call last):
23:44:05 [2020-10-24T03:44:05.356Z]   File "(none)", line 184, in run
23:44:05 [2020-10-24T03:44:05.356Z]   File "__ref_L/Debug Test/Main.py_ckijyuwsyf", line 1, in <module>
23:44:05 [2020-10-24T03:44:05.356Z]   File "(none)", line 161, in trace_dispatch
23:44:05 [2020-10-24T03:44:05.356Z] org.eclipse.ease.ExitException: 
23:44:05 [2020-10-24T03:44:05.356Z] 
23:44:05 [2020-10-24T03:44:05.356Z] org.eclipse.ease.ExitException: org.eclipse.ease.ExitException: 
23:44:05 [2020-10-24T03:44:05.612Z] Start of script
23:44:05 [2020-10-24T03:44:05.612Z] include file start
23:44:05 [2020-10-24T03:44:05.612Z] include file processed
23:44:05 [2020-10-24T03:44:05.612Z] Result of testMethod = 5
23:44:05 [2020-10-24T03:44:05.612Z] End of script
23:44:05 [2020-10-24T03:44:05.612Z] Start of script
23:44:05 [2020-10-24T03:44:05.612Z] include file start
23:44:05 [2020-10-24T03:44:05.612Z] include file processed
23:44:05 [2020-10-24T03:44:05.867Z] Result of testMethod = 5
23:44:05 [2020-10-24T03:44:05.867Z] End of script
23:44:05 [2020-10-24T03:44:05.867Z] Start of script
23:44:05 [2020-10-24T03:44:05.867Z] include file start
23:44:05 [2020-10-24T03:44:05.867Z] include file processed
23:44:05 [2020-10-24T03:44:05.867Z] Result of testMethod = 5
23:44:06 [2020-10-24T03:44:06.123Z] End of script
23:44:06 [2020-10-24T03:44:06.123Z] Tests run: 42, Failures: 0, Errors: 0, Skipped: 0, Time elapsed: 12.481 s - in org.eclipse.ease.lang.python.jython.debugger.JythonDebugTest
23:44:06 [2020-10-24T03:44:06.123Z] disconnectProcessInSuspendedState(org.eclipse.ease.lang.python.jython.debugger.JythonDebugTest)  Time elapsed: 1.636 s
23:44:06 [2020-10-24T03:44:06.123Z] stepReturnIncludeCommand(org.eclipse.ease.lang.python.jython.debugger.JythonDebugTest)  Time elapsed: 0.21 s
23:44:06 [2020-10-24T03:44:06.123Z] arrayVariableSorting(org.eclipse.ease.lang.python.jython.debugger.JythonDebugTest)  Time elapsed: 0.309 s
23:44:06 [2020-10-24T03:44:06.123Z] stepOverOnDebugTarget(org.eclipse.ease.lang.python.jython.debugger.JythonDebugTest)  Time elapsed: 0.308 s
23:44:06 [2020-10-24T03:44:06.123Z] hasDebugTarget(org.eclipse.ease.lang.python.jython.debugger.JythonDebugTest)  Time elapsed: 0.106 s
23:44:06 [2020-10-24T03:44:06.123Z] disconnectThreadInSuspendedState(org.eclipse.ease.lang.python.jython.debugger.JythonDebugTest)  Time elapsed: 0.207 s
23:44:06 [2020-10-24T03:44:06.123Z] stepReturnOnDebugTarget(org.eclipse.ease.lang.python.jython.debugger.JythonDebugTest)  Time elapsed: 0.317 s
23:44:06 [2020-10-24T03:44:06.123Z] nullVariable(org.eclipse.ease.lang.python.jython.debugger.JythonDebugTest)  Time elapsed: 0.309 s
23:44:06 [2020-10-24T03:44:06.123Z] stepOverOnStackFrame(org.eclipse.ease.lang.python.jython.debugger.JythonDebugTest)  Time elapsed: 0.309 s
23:44:06 [2020-10-24T03:44:06.123Z] resumeOnDebugTarget(org.eclipse.ease.lang.python.jython.debugger.JythonDebugTest)  Time elapsed: 0.207 s
23:44:06 [2020-10-24T03:44:06.123Z] modifyVariableKeepingType(org.eclipse.ease.lang.python.jython.debugger.JythonDebugTest)  Time elapsed: 0.508 s
23:44:06 [2020-10-24T03:44:06.123Z] resumeOnLastIncludeLine(org.eclipse.ease.lang.python.jython.debugger.JythonDebugTest)  Time elapsed: 0.208 s
23:44:06 [2020-10-24T03:44:06.123Z] stepReturnOnStackFrame(org.eclipse.ease.lang.python.jython.debugger.JythonDebugTest)  Time elapsed: 0.307 s
23:44:06 [2020-10-24T03:44:06.123Z] terminateStackFrameInSuspendedState(org.eclipse.ease.lang.python.jython.debugger.JythonDebugTest)  Time elapsed: 0.207 s
23:44:06 [2020-10-24T03:44:06.123Z] breakpointLocation(org.eclipse.ease.lang.python.jython.debugger.JythonDebugTest)  Time elapsed: 0.21 s
23:44:06 [2020-10-24T03:44:06.123Z] stepReturnOnThread(org.eclipse.ease.lang.python.jython.debugger.JythonDebugTest)  Time elapsed: 0.309 s
23:44:06 [2020-10-24T03:44:06.123Z] javaClassVariable(org.eclipse.ease.lang.python.jython.debugger.JythonDebugTest)  Time elapsed: 0.309 s
23:44:06 [2020-10-24T03:44:06.123Z] stepIntoOnThread(org.eclipse.ease.lang.python.jython.debugger.JythonDebugTest)  Time elapsed: 0.315 s
23:44:06 [2020-10-24T03:44:06.123Z] terminateThreadInSuspendedState(org.eclipse.ease.lang.python.jython.debugger.JythonDebugTest)  Time elapsed: 0.208 s
23:44:06 [2020-10-24T03:44:06.123Z] resumeOnThread(org.eclipse.ease.lang.python.jython.debugger.JythonDebugTest)  Time elapsed: 0.206 s
23:44:06 [2020-10-24T03:44:06.123Z] stepIntoOnStackFrame(org.eclipse.ease.lang.python.jython.debugger.JythonDebugTest)  Time elapsed: 0.308 s
23:44:06 [2020-10-24T03:44:06.123Z] terminateProcessInSuspendedState(org.eclipse.ease.lang.python.jython.debugger.JythonDebugTest)  Time elapsed: 0.207 s
23:44:06 [2020-10-24T03:44:06.123Z] stepOverOnProcess(org.eclipse.ease.lang.python.jython.debugger.JythonDebugTest)  Time elapsed: 0.308 s
23:44:06 [2020-10-24T03:44:06.123Z] nativeArrayVariable(org.eclipse.ease.lang.python.jython.debugger.JythonDebugTest)  Time elapsed: 0.306 s
23:44:06 [2020-10-24T03:44:06.123Z] disconnectDebugTargetInSuspendedState(org.eclipse.ease.lang.python.jython.debugger.JythonDebugTest)  Time elapsed: 0.206 s
23:44:06 [2020-10-24T03:44:06.124Z] stepIntoOnProcess(org.eclipse.ease.lang.python.jython.debugger.JythonDebugTest)  Time elapsed: 0.306 s
23:44:06 [2020-10-24T03:44:06.124Z] terminatedState(org.eclipse.ease.lang.python.jython.debugger.JythonDebugTest)  Time elapsed: 0.104 s
23:44:06 [2020-10-24T03:44:06.124Z] stepOverIncludeCommand(org.eclipse.ease.lang.python.jython.debugger.JythonDebugTest)  Time elapsed: 0.31 s
23:44:06 [2020-10-24T03:44:06.124Z] innerScopeVariableBeforeOuterScopeVariable(org.eclipse.ease.lang.python.jython.debugger.JythonDebugTest)  Time elapsed: 0.311 s
23:44:06 [2020-10-24T03:44:06.124Z] stepIntoIncludeCommand(org.eclipse.ease.lang.python.jython.debugger.JythonDebugTest)  Time elapsed: 0.304 s
23:44:06 [2020-10-24T03:44:06.124Z] primitiveStringVariable(org.eclipse.ease.lang.python.jython.debugger.JythonDebugTest)  Time elapsed: 0.305 s
23:44:06 [2020-10-24T03:44:06.124Z] resumeOnProcess(org.eclipse.ease.lang.python.jython.debugger.JythonDebugTest)  Time elapsed: 0.205 s
23:44:06 [2020-10-24T03:44:06.124Z] stepIntoOnDebugTarget(org.eclipse.ease.lang.python.jython.debugger.JythonDebugTest)  Time elapsed: 0.306 s
23:44:06 [2020-10-24T03:44:06.124Z] stepOverOnThread(org.eclipse.ease.lang.python.jython.debugger.JythonDebugTest)  Time elapsed: 0.306 s
23:44:06 [2020-10-24T03:44:06.124Z] suspendedState(org.eclipse.ease.lang.python.jython.debugger.JythonDebugTest)  Time elapsed: 0.206 s
23:44:06 [2020-10-24T03:44:06.124Z] primitiveDoubleVariable(org.eclipse.ease.lang.python.jython.debugger.JythonDebugTest)  Time elapsed: 0.307 s
23:44:06 [2020-10-24T03:44:06.124Z] resumeOnStackFrame(org.eclipse.ease.lang.python.jython.debugger.JythonDebugTest)  Time elapsed: 0.207 s
23:44:06 [2020-10-24T03:44:06.124Z] nativeObjectVariable(org.eclipse.ease.lang.python.jython.debugger.JythonDebugTest)  Time elapsed: 0.306 s
23:44:06 [2020-10-24T03:44:06.124Z] terminateDebugTargetInSuspendedState(org.eclipse.ease.lang.python.jython.debugger.JythonDebugTest)  Time elapsed: 0.207 s
23:44:06 [2020-10-24T03:44:06.124Z] disconnectStackFrameInSuspendedState(org.eclipse.ease.lang.python.jython.debugger.JythonDebugTest)  Time elapsed: 0.206 s
23:44:06 [2020-10-24T03:44:06.124Z] stepReturnOnProcess(org.eclipse.ease.lang.python.jython.debugger.JythonDebugTest)  Time elapsed: 0.307 s
23:44:06 [2020-10-24T03:44:06.124Z] evaluateWatchExpression(org.eclipse.ease.lang.python.jython.debugger.JythonDebugTest)  Time elapsed: 0.207 s
23:44:06 [2020-10-24T03:44:06.124Z] 
23:44:06 [2020-10-24T03:44:06.124Z] Results:
23:44:06 [2020-10-24T03:44:06.124Z] 
23:44:06 [2020-10-24T03:44:06.124Z] Tests run: 42, Failures: 0, Errors: 0, Skipped: 0
23:44:06 [2020-10-24T03:44:06.124Z] 
23:44:06 [2020-10-24T03:44:06.685Z] [INFO] All tests passed!
23:44:06 [2020-10-24T03:44:06.685Z] [INFO] 
23:44:06 [2020-10-24T03:44:06.685Z] [INFO] ------< org.eclipse.ease:org.eclipse.ease.lang.python.py4j.test >-------
23:44:06 [2020-10-24T03:44:06.685Z] [INFO] Building org.eclipse.ease.lang.python.py4j.test 0.8.0-SNAPSHOT    [9/11]
23:44:06 [2020-10-24T03:44:06.685Z] [INFO] ------------------------[ eclipse-test-plugin ]-------------------------
23:44:06 [2020-10-24T03:44:06.685Z] [INFO] 
23:44:06 [2020-10-24T03:44:06.685Z] [INFO] --- tycho-packaging-plugin:1.5.0:build-qualifier (default-build-qualifier) @ org.eclipse.ease.lang.python.py4j.test ---
23:44:06 [2020-10-24T03:44:06.685Z] [INFO] The project's OSGi version is 0.8.0.I201912021001
23:44:06 [2020-10-24T03:44:06.685Z] [INFO] 
23:44:06 [2020-10-24T03:44:06.685Z] [INFO] --- tycho-packaging-plugin:1.5.0:validate-id (default-validate-id) @ org.eclipse.ease.lang.python.py4j.test ---
23:44:06 [2020-10-24T03:44:06.685Z] [INFO] 
23:44:06 [2020-10-24T03:44:06.685Z] [INFO] --- tycho-packaging-plugin:1.5.0:validate-version (default-validate-version) @ org.eclipse.ease.lang.python.py4j.test ---
23:44:06 [2020-10-24T03:44:06.685Z] [INFO] 
23:44:06 [2020-10-24T03:44:06.685Z] [INFO] --- maven-resources-plugin:2.4.3:resources (default-resources) @ org.eclipse.ease.lang.python.py4j.test ---
23:44:06 [2020-10-24T03:44:06.685Z] [INFO] Using 'UTF-8' encoding to copy filtered resources.
23:44:06 [2020-10-24T03:44:06.685Z] [INFO] skip non existing resourceDirectory /home/jenkins/agent/workspace/ease.verify.core.target.2018-12/tests/org.eclipse.ease.lang.python.py4j.test/src/main/resources
23:44:06 [2020-10-24T03:44:06.685Z] [INFO] 
23:44:06 [2020-10-24T03:44:06.685Z] [INFO] --- tycho-compiler-plugin:1.5.0:compile (default-compile) @ org.eclipse.ease.lang.python.py4j.test ---
23:44:06 [2020-10-24T03:44:06.685Z] [INFO] Compiling 10 source files to /home/jenkins/agent/workspace/ease.verify.core.target.2018-12/tests/org.eclipse.ease.lang.python.py4j.test/target/classes
23:44:07 [2020-10-24T03:44:07.618Z] [INFO] 
23:44:07 [2020-10-24T03:44:07.618Z] [INFO] --- maven-resources-plugin:2.4.3:testResources (default-testResources) @ org.eclipse.ease.lang.python.py4j.test ---
23:44:07 [2020-10-24T03:44:07.618Z] [INFO] Using 'UTF-8' encoding to copy filtered resources.
23:44:07 [2020-10-24T03:44:07.618Z] [INFO] skip non existing resourceDirectory /home/jenkins/agent/workspace/ease.verify.core.target.2018-12/tests/org.eclipse.ease.lang.python.py4j.test/src/test/resources
23:44:07 [2020-10-24T03:44:07.618Z] [INFO] 
23:44:07 [2020-10-24T03:44:07.618Z] [INFO] --- tycho-source-plugin:1.5.0:plugin-source (plugin-source) @ org.eclipse.ease.lang.python.py4j.test ---
23:44:07 [2020-10-24T03:44:07.618Z] [INFO] Building jar: /home/jenkins/agent/workspace/ease.verify.core.target.2018-12/tests/org.eclipse.ease.lang.python.py4j.test/target/org.eclipse.ease.lang.python.py4j.test-0.8.0-SNAPSHOT-sources.jar
23:44:07 [2020-10-24T03:44:07.618Z] [INFO] 
23:44:07 [2020-10-24T03:44:07.618Z] [INFO] --- target-platform-configuration:1.5.0:target-platform (default-target-platform) @ org.eclipse.ease.lang.python.py4j.test ---
23:44:07 [2020-10-24T03:44:07.618Z] [INFO] 
23:44:07 [2020-10-24T03:44:07.618Z] [INFO] --- tycho-packaging-plugin:1.5.0:package-plugin (default-package-plugin) @ org.eclipse.ease.lang.python.py4j.test ---
23:44:07 [2020-10-24T03:44:07.618Z] [INFO] Building jar: /home/jenkins/agent/workspace/ease.verify.core.target.2018-12/tests/org.eclipse.ease.lang.python.py4j.test/target/org.eclipse.ease.lang.python.py4j.test-0.8.0-SNAPSHOT.jar
23:44:07 [2020-10-24T03:44:07.618Z] [INFO] 
23:44:07 [2020-10-24T03:44:07.618Z] [INFO] --- tycho-p2-plugin:1.5.0:p2-metadata-default (default-p2-metadata-default) @ org.eclipse.ease.lang.python.py4j.test ---
23:44:07 [2020-10-24T03:44:07.618Z] [INFO] 
23:44:07 [2020-10-24T03:44:07.618Z] [INFO] --- tycho-source-feature-plugin:1.5.0:source-feature (source-feature) @ org.eclipse.ease.lang.python.py4j.test ---
23:44:07 [2020-10-24T03:44:07.618Z] [INFO] 
23:44:07 [2020-10-24T03:44:07.618Z] [INFO] --- tycho-p2-plugin:1.5.0:p2-metadata (attached-p2-metadata) @ org.eclipse.ease.lang.python.py4j.test ---
23:44:07 [2020-10-24T03:44:07.618Z] [INFO] 
23:44:07 [2020-10-24T03:44:07.618Z] [INFO] --- tycho-surefire-plugin:1.5.0:test (default-test) @ org.eclipse.ease.lang.python.py4j.test ---
23:44:07 [2020-10-24T03:44:07.874Z] [INFO] Expected eclipse log file: /home/jenkins/agent/workspace/ease.verify.core.target.2018-12/tests/org.eclipse.ease.lang.python.py4j.test/target/work/data/.metadata/.log
23:44:07 [2020-10-24T03:44:07.874Z] [INFO] Command line:
23:44:07 [2020-10-24T03:44:07.874Z] 	[/opt/tools/java/openjdk/jdk-11/11.0.2+9/bin/java, -Dosgi.noShutdown=false, -Dosgi.os=linux, -Dosgi.ws=gtk, -Dosgi.arch=x86_64, -Dosgi.clean=true, -jar, /home/jenkins/.m2/repository/p2/osgi/bundle/org.eclipse.equinox.launcher/1.5.200.v20180922-1751/org.eclipse.equinox.launcher-1.5.200.v20180922-1751.jar, -data, /home/jenkins/agent/workspace/ease.verify.core.target.2018-12/tests/org.eclipse.ease.lang.python.py4j.test/target/work/data, -install, /home/jenkins/agent/workspace/ease.verify.core.target.2018-12/tests/org.eclipse.ease.lang.python.py4j.test/target/work, -configuration, /home/jenkins/agent/workspace/ease.verify.core.target.2018-12/tests/org.eclipse.ease.lang.python.py4j.test/target/work/configuration, -application, org.eclipse.tycho.surefire.osgibooter.headlesstest, -testproperties, /home/jenkins/agent/workspace/ease.verify.core.target.2018-12/tests/org.eclipse.ease.lang.python.py4j.test/target/surefire.properties]
23:44:07 [2020-10-24T03:44:07.874Z] Picked up JAVA_TOOL_OPTIONS: -Dmaven.ext.class.path="/home/jenkins/agent/workspace/ease.verify.core.target.2018-12@tmp/withMaven402b50fb/pipeline-maven-spy.jar" -Dorg.jenkinsci.plugins.pipeline.maven.reportsFolder="/home/jenkins/agent/workspace/ease.verify.core.target.2018-12@tmp/withMaven402b50fb" 
23:44:09 [2020-10-24T03:44:09.853Z] Running org.eclipse.ease.lang.python.py4j.ScriptModeEngineTest
23:44:09 [2020-10-24T03:44:09.853Z] ----------------------------------------------
23:44:09 [2020-10-24T03:44:09.853Z] Starting test: invalidSyntax(org.eclipse.ease.lang.python.py4j.ScriptModeEngineTest)
23:44:09 [2020-10-24T03:44:09.853Z] org.eclipse.ease.ScriptExecutionException: Traceback (most recent call last):
23:44:09 [2020-10-24T03:44:09.853Z]   File "/usr/lib64/python2.7/ast.py", line 37, in parse
23:44:09 [2020-10-24T03:44:09.853Z]     return compile(source, filename, mode, PyCF_ONLY_AST)
23:44:09 [2020-10-24T03:44:09.853Z]   File "<unknown>", line 1
23:44:09 [2020-10-24T03:44:09.853Z]     1++
23:44:09 [2020-10-24T03:44:09.853Z]       ^
23:44:09 [2020-10-24T03:44:09.853Z] SyntaxError: invalid syntax
23:44:09 [2020-10-24T03:44:09.854Z] 
23:44:10 [2020-10-24T03:44:10.108Z] 
23:44:10 [2020-10-24T03:44:10.109Z] Finished test: invalidSyntax(org.eclipse.ease.lang.python.py4j.ScriptModeEngineTest)
23:44:10 [2020-10-24T03:44:10.109Z] ----------------------------------------------
23:44:10 [2020-10-24T03:44:10.109Z] ----------------------------------------------
23:44:10 [2020-10-24T03:44:10.109Z] Starting test: getScriptEngine(org.eclipse.ease.lang.python.py4j.ScriptModeEngineTest)
23:44:11 [2020-10-24T03:44:11.472Z] 132244032
23:44:11 [2020-10-24T03:44:11.472Z] Finished test: getScriptEngine(org.eclipse.ease.lang.python.py4j.ScriptModeEngineTest)
23:44:11 [2020-10-24T03:44:11.472Z] ----------------------------------------------
23:44:11 [2020-10-24T03:44:11.472Z] ----------------------------------------------
23:44:11 [2020-10-24T03:44:11.472Z] Starting test: incompleteStatement(org.eclipse.ease.lang.python.py4j.ScriptModeEngineTest)
23:44:11 [2020-10-24T03:44:11.472Z] org.eclipse.ease.ScriptExecutionException: Traceback (most recent call last):
23:44:11 [2020-10-24T03:44:11.472Z]   File "/usr/lib64/python2.7/ast.py", line 37, in parse
23:44:11 [2020-10-24T03:44:11.472Z]     return compile(source, filename, mode, PyCF_ONLY_AST)
23:44:11 [2020-10-24T03:44:11.472Z]   File "<unknown>", line 1
23:44:11 [2020-10-24T03:44:11.472Z]     def a():
23:44:11 [2020-10-24T03:44:11.472Z]            ^
23:44:11 [2020-10-24T03:44:11.472Z] SyntaxError: unexpected EOF while parsing
23:44:11 [2020-10-24T03:44:11.472Z] 
23:44:11 [2020-10-24T03:44:11.472Z] 
23:44:11 [2020-10-24T03:44:11.472Z] Finished test: incompleteStatement(org.eclipse.ease.lang.python.py4j.ScriptModeEngineTest)
23:44:11 [2020-10-24T03:44:11.472Z] ----------------------------------------------
23:44:11 [2020-10-24T03:44:11.472Z] ----------------------------------------------
23:44:11 [2020-10-24T03:44:11.472Z] Starting test: multiLineStatement(org.eclipse.ease.lang.python.py4j.ScriptModeEngineTest)
23:44:11 [2020-10-24T03:44:11.727Z] 
23:44:11 [2020-10-24T03:44:11.727Z] Finished test: multiLineStatement(org.eclipse.ease.lang.python.py4j.ScriptModeEngineTest)
23:44:11 [2020-10-24T03:44:11.727Z] ----------------------------------------------
23:44:11 [2020-10-24T03:44:11.727Z] ----------------------------------------------
23:44:11 [2020-10-24T03:44:11.727Z] Starting test: runtimeError(org.eclipse.ease.lang.python.py4j.ScriptModeEngineTest)
23:44:11 [2020-10-24T03:44:11.727Z] org.eclipse.ease.ScriptExecutionException: Traceback (most recent call last):
23:44:11 [2020-10-24T03:44:11.727Z]   File "<...>", line 1, in <module>
23:44:11 [2020-10-24T03:44:11.727Z] NameError: name 'a' is not defined
23:44:11 [2020-10-24T03:44:11.727Z] 
23:44:11 [2020-10-24T03:44:11.982Z] 
23:44:11 [2020-10-24T03:44:11.982Z] Finished test: runtimeError(org.eclipse.ease.lang.python.py4j.ScriptModeEngineTest)
23:44:11 [2020-10-24T03:44:11.982Z] ----------------------------------------------
23:44:11 [2020-10-24T03:44:11.982Z] ----------------------------------------------
23:44:11 [2020-10-24T03:44:11.982Z] Starting test: javaIntArray(org.eclipse.ease.lang.python.py4j.ScriptModeEngineTest)
23:44:11 [2020-10-24T03:44:11.982Z] 
23:44:11 [2020-10-24T03:44:11.982Z] Finished test: javaIntArray(org.eclipse.ease.lang.python.py4j.ScriptModeEngineTest)
23:44:11 [2020-10-24T03:44:11.982Z] ----------------------------------------------
23:44:11 [2020-10-24T03:44:11.982Z] ----------------------------------------------
23:44:11 [2020-10-24T03:44:11.982Z] Starting test: javaDoubleArray(org.eclipse.ease.lang.python.py4j.ScriptModeEngineTest)
23:44:12 [2020-10-24T03:44:12.238Z] 
23:44:12 [2020-10-24T03:44:12.238Z] Finished test: javaDoubleArray(org.eclipse.ease.lang.python.py4j.ScriptModeEngineTest)
23:44:12 [2020-10-24T03:44:12.238Z] ----------------------------------------------
23:44:12 [2020-10-24T03:44:12.238Z] ----------------------------------------------
23:44:12 [2020-10-24T03:44:12.238Z] Starting test: pythonSet(org.eclipse.ease.lang.python.py4j.ScriptModeEngineTest)
23:44:12 [2020-10-24T03:44:12.494Z] 
23:44:12 [2020-10-24T03:44:12.494Z] Finished test: pythonSet(org.eclipse.ease.lang.python.py4j.ScriptModeEngineTest)
23:44:12 [2020-10-24T03:44:12.494Z] ----------------------------------------------
23:44:12 [2020-10-24T03:44:12.494Z] ----------------------------------------------
23:44:12 [2020-10-24T03:44:12.494Z] Starting test: javaStringArray(org.eclipse.ease.lang.python.py4j.ScriptModeEngineTest)
23:44:12 [2020-10-24T03:44:12.749Z] 
23:44:12 [2020-10-24T03:44:12.749Z] Finished test: javaStringArray(org.eclipse.ease.lang.python.py4j.ScriptModeEngineTest)
23:44:12 [2020-10-24T03:44:12.749Z] ----------------------------------------------
23:44:12 [2020-10-24T03:44:12.749Z] ----------------------------------------------
23:44:12 [2020-10-24T03:44:12.749Z] Starting test: javaShortArray(org.eclipse.ease.lang.python.py4j.ScriptModeEngineTest)
23:44:13 [2020-10-24T03:44:13.004Z] 
23:44:13 [2020-10-24T03:44:13.004Z] Finished test: javaShortArray(org.eclipse.ease.lang.python.py4j.ScriptModeEngineTest)
23:44:13 [2020-10-24T03:44:13.004Z] ----------------------------------------------
23:44:13 [2020-10-24T03:44:13.004Z] ----------------------------------------------
23:44:13 [2020-10-24T03:44:13.004Z] Starting test: javaBooleanArray(org.eclipse.ease.lang.python.py4j.ScriptModeEngineTest)
23:44:13 [2020-10-24T03:44:13.004Z] 
23:44:13 [2020-10-24T03:44:13.004Z] Finished test: javaBooleanArray(org.eclipse.ease.lang.python.py4j.ScriptModeEngineTest)
23:44:13 [2020-10-24T03:44:13.004Z] ----------------------------------------------
23:44:13 [2020-10-24T03:44:13.004Z] ----------------------------------------------
23:44:13 [2020-10-24T03:44:13.004Z] Starting test: javaObjectArray(org.eclipse.ease.lang.python.py4j.ScriptModeEngineTest)
23:44:13 [2020-10-24T03:44:13.260Z] 
23:44:13 [2020-10-24T03:44:13.260Z] Finished test: javaObjectArray(org.eclipse.ease.lang.python.py4j.ScriptModeEngineTest)
23:44:13 [2020-10-24T03:44:13.260Z] ----------------------------------------------
23:44:13 [2020-10-24T03:44:13.260Z] ----------------------------------------------
23:44:13 [2020-10-24T03:44:13.260Z] Starting test: javaIntegerArray(org.eclipse.ease.lang.python.py4j.ScriptModeEngineTest)
23:44:13 [2020-10-24T03:44:13.515Z] 
23:44:13 [2020-10-24T03:44:13.515Z] Finished test: javaIntegerArray(org.eclipse.ease.lang.python.py4j.ScriptModeEngineTest)
23:44:13 [2020-10-24T03:44:13.515Z] ----------------------------------------------
23:44:13 [2020-10-24T03:44:13.515Z] ----------------------------------------------
23:44:13 [2020-10-24T03:44:13.515Z] Starting test: javaInteger(org.eclipse.ease.lang.python.py4j.ScriptModeEngineTest)
23:44:13 [2020-10-24T03:44:13.771Z] 
23:44:13 [2020-10-24T03:44:13.771Z] Finished test: javaInteger(org.eclipse.ease.lang.python.py4j.ScriptModeEngineTest)
23:44:13 [2020-10-24T03:44:13.771Z] ----------------------------------------------
23:44:13 [2020-10-24T03:44:13.771Z] ----------------------------------------------
23:44:13 [2020-10-24T03:44:13.771Z] Starting test: javaString(org.eclipse.ease.lang.python.py4j.ScriptModeEngineTest)
23:44:14 [2020-10-24T03:44:14.026Z] 
23:44:14 [2020-10-24T03:44:14.026Z] Finished test: javaString(org.eclipse.ease.lang.python.py4j.ScriptModeEngineTest)
23:44:14 [2020-10-24T03:44:14.026Z] ----------------------------------------------
23:44:14 [2020-10-24T03:44:14.026Z] ----------------------------------------------
23:44:14 [2020-10-24T03:44:14.026Z] Starting test: javaByteArray(org.eclipse.ease.lang.python.py4j.ScriptModeEngineTest)
23:44:14 [2020-10-24T03:44:14.026Z] 
23:44:14 [2020-10-24T03:44:14.026Z] Finished test: javaByteArray(org.eclipse.ease.lang.python.py4j.ScriptModeEngineTest)
23:44:14 [2020-10-24T03:44:14.026Z] ----------------------------------------------
23:44:14 [2020-10-24T03:44:14.026Z] ----------------------------------------------
23:44:14 [2020-10-24T03:44:14.026Z] Starting test: createEclipseClass(org.eclipse.ease.lang.python.py4j.ScriptModeEngineTest)
23:44:14 [2020-10-24T03:44:14.281Z] 
23:44:14 [2020-10-24T03:44:14.281Z] Finished test: createEclipseClass(org.eclipse.ease.lang.python.py4j.ScriptModeEngineTest)
23:44:14 [2020-10-24T03:44:14.281Z] ----------------------------------------------
23:44:14 [2020-10-24T03:44:14.281Z] ----------------------------------------------
23:44:14 [2020-10-24T03:44:14.281Z] Starting test: pythonString(org.eclipse.ease.lang.python.py4j.ScriptModeEngineTest)
23:44:14 [2020-10-24T03:44:14.537Z] 
23:44:14 [2020-10-24T03:44:14.537Z] Finished test: pythonString(org.eclipse.ease.lang.python.py4j.ScriptModeEngineTest)
23:44:14 [2020-10-24T03:44:14.537Z] ----------------------------------------------
23:44:14 [2020-10-24T03:44:14.537Z] ----------------------------------------------
23:44:14 [2020-10-24T03:44:14.537Z] Starting test: varargs(org.eclipse.ease.lang.python.py4j.ScriptModeEngineTest)
23:44:14 [2020-10-24T03:44:14.792Z] 
23:44:14 [2020-10-24T03:44:14.792Z] Finished test: varargs(org.eclipse.ease.lang.python.py4j.ScriptModeEngineTest)
23:44:14 [2020-10-24T03:44:14.792Z] ----------------------------------------------
23:44:14 [2020-10-24T03:44:14.792Z] ----------------------------------------------
23:44:14 [2020-10-24T03:44:14.792Z] Starting test: createJavaType(org.eclipse.ease.lang.python.py4j.ScriptModeEngineTest)
23:44:15 [2020-10-24T03:44:15.049Z] 
23:44:15 [2020-10-24T03:44:15.049Z] Finished test: createJavaType(org.eclipse.ease.lang.python.py4j.ScriptModeEngineTest)
23:44:15 [2020-10-24T03:44:15.049Z] ----------------------------------------------
23:44:15 [2020-10-24T03:44:15.049Z] ----------------------------------------------
23:44:15 [2020-10-24T03:44:15.049Z] Starting test: javaFloatArray(org.eclipse.ease.lang.python.py4j.ScriptModeEngineTest)
23:44:15 [2020-10-24T03:44:15.049Z] 
23:44:15 [2020-10-24T03:44:15.049Z] Finished test: javaFloatArray(org.eclipse.ease.lang.python.py4j.ScriptModeEngineTest)
23:44:15 [2020-10-24T03:44:15.049Z] ----------------------------------------------
23:44:15 [2020-10-24T03:44:15.049Z] ----------------------------------------------
23:44:15 [2020-10-24T03:44:15.049Z] Starting test: implementJavaInterface(org.eclipse.ease.lang.python.py4j.ScriptModeEngineTest)
23:44:15 [2020-10-24T03:44:15.305Z] 
23:44:15 [2020-10-24T03:44:15.305Z] Finished test: implementJavaInterface(org.eclipse.ease.lang.python.py4j.ScriptModeEngineTest)
23:44:15 [2020-10-24T03:44:15.305Z] ----------------------------------------------
23:44:15 [2020-10-24T03:44:15.305Z] ----------------------------------------------
23:44:15 [2020-10-24T03:44:15.305Z] Starting test: pythonDict(org.eclipse.ease.lang.python.py4j.ScriptModeEngineTest)
23:44:15 [2020-10-24T03:44:15.564Z] 
23:44:15 [2020-10-24T03:44:15.564Z] Finished test: pythonDict(org.eclipse.ease.lang.python.py4j.ScriptModeEngineTest)
23:44:15 [2020-10-24T03:44:15.564Z] ----------------------------------------------
23:44:15 [2020-10-24T03:44:15.564Z] ----------------------------------------------
23:44:15 [2020-10-24T03:44:15.564Z] Starting test: pythonList(org.eclipse.ease.lang.python.py4j.ScriptModeEngineTest)
23:44:15 [2020-10-24T03:44:15.822Z] 
23:44:15 [2020-10-24T03:44:15.822Z] Finished test: pythonList(org.eclipse.ease.lang.python.py4j.ScriptModeEngineTest)
23:44:15 [2020-10-24T03:44:15.822Z] ----------------------------------------------
23:44:15 [2020-10-24T03:44:15.822Z] ----------------------------------------------
23:44:15 [2020-10-24T03:44:15.822Z] Starting test: testMultiple(org.eclipse.ease.lang.python.py4j.ScriptModeEngineTest)
23:44:16 [2020-10-24T03:44:16.078Z] 
23:44:16 [2020-10-24T03:44:16.078Z] Finished test: testMultiple(org.eclipse.ease.lang.python.py4j.ScriptModeEngineTest)
23:44:16 [2020-10-24T03:44:16.078Z] ----------------------------------------------
23:44:16 [2020-10-24T03:44:16.078Z] ----------------------------------------------
23:44:16 [2020-10-24T03:44:16.078Z] Starting test: javaLongArray(org.eclipse.ease.lang.python.py4j.ScriptModeEngineTest)
23:44:16 [2020-10-24T03:44:16.078Z] 
23:44:16 [2020-10-24T03:44:16.078Z] Finished test: javaLongArray(org.eclipse.ease.lang.python.py4j.ScriptModeEngineTest)
23:44:16 [2020-10-24T03:44:16.078Z] ----------------------------------------------
23:44:16 [2020-10-24T03:44:16.078Z] ----------------------------------------------
23:44:16 [2020-10-24T03:44:16.078Z] Starting test: createPythonObject(org.eclipse.ease.lang.python.py4j.ScriptModeEngineTest)
23:44:16 [2020-10-24T03:44:16.333Z] 
23:44:16 [2020-10-24T03:44:16.333Z] Finished test: createPythonObject(org.eclipse.ease.lang.python.py4j.ScriptModeEngineTest)
23:44:16 [2020-10-24T03:44:16.333Z] ----------------------------------------------
23:44:16 [2020-10-24T03:44:16.333Z] ----------------------------------------------
23:44:16 [2020-10-24T03:44:16.333Z] Starting test: pythonInteger(org.eclipse.ease.lang.python.py4j.ScriptModeEngineTest)
23:44:16 [2020-10-24T03:44:16.588Z] 
23:44:16 [2020-10-24T03:44:16.588Z] Finished test: pythonInteger(org.eclipse.ease.lang.python.py4j.ScriptModeEngineTest)
23:44:16 [2020-10-24T03:44:16.588Z] ----------------------------------------------
23:44:16 [2020-10-24T03:44:16.588Z] Tests run: 30, Failures: 0, Errors: 0, Skipped: 2, Time elapsed: 6.922 s - in org.eclipse.ease.lang.python.py4j.ScriptModeEngineTest
23:44:16 [2020-10-24T03:44:16.588Z] invalidSyntax(org.eclipse.ease.lang.python.py4j.ScriptModeEngineTest)  Time elapsed: 0.349 s
23:44:16 [2020-10-24T03:44:16.588Z] getScriptEngine(org.eclipse.ease.lang.python.py4j.ScriptModeEngineTest)  Time elapsed: 1.207 s
23:44:16 [2020-10-24T03:44:16.588Z] callExit(org.eclipse.ease.lang.python.py4j.ScriptModeEngineTest) skipped
23:44:16 [2020-10-24T03:44:16.588Z] multiLinesOfCode(org.eclipse.ease.lang.python.py4j.ScriptModeEngineTest) skipped
23:44:16 [2020-10-24T03:44:16.588Z] incompleteStatement(org.eclipse.ease.lang.python.py4j.ScriptModeEngineTest)  Time elapsed: 0.208 s
23:44:16 [2020-10-24T03:44:16.588Z] multiLineStatement(org.eclipse.ease.lang.python.py4j.ScriptModeEngineTest)  Time elapsed: 0.209 s
23:44:16 [2020-10-24T03:44:16.588Z] runtimeError(org.eclipse.ease.lang.python.py4j.ScriptModeEngineTest)  Time elapsed: 0.209 s
23:44:16 [2020-10-24T03:44:16.588Z] javaIntArray(org.eclipse.ease.lang.python.py4j.ScriptModeEngineTest)  Time elapsed: 0.206 s
23:44:16 [2020-10-24T03:44:16.588Z] javaDoubleArray(org.eclipse.ease.lang.python.py4j.ScriptModeEngineTest)  Time elapsed: 0.207 s
23:44:16 [2020-10-24T03:44:16.588Z] pythonSet(org.eclipse.ease.lang.python.py4j.ScriptModeEngineTest)  Time elapsed: 0.206 s
23:44:16 [2020-10-24T03:44:16.588Z] javaStringArray(org.eclipse.ease.lang.python.py4j.ScriptModeEngineTest)  Time elapsed: 0.203 s
23:44:16 [2020-10-24T03:44:16.588Z] javaShortArray(org.eclipse.ease.lang.python.py4j.ScriptModeEngineTest)  Time elapsed: 0.201 s
23:44:16 [2020-10-24T03:44:16.588Z] javaBooleanArray(org.eclipse.ease.lang.python.py4j.ScriptModeEngineTest)  Time elapsed: 0.201 s
23:44:16 [2020-10-24T03:44:16.588Z] javaObjectArray(org.eclipse.ease.lang.python.py4j.ScriptModeEngineTest)  Time elapsed: 0.21 s
23:44:16 [2020-10-24T03:44:16.588Z] javaIntegerArray(org.eclipse.ease.lang.python.py4j.ScriptModeEngineTest)  Time elapsed: 0.207 s
23:44:16 [2020-10-24T03:44:16.588Z] javaInteger(org.eclipse.ease.lang.python.py4j.ScriptModeEngineTest)  Time elapsed: 0.207 s
23:44:16 [2020-10-24T03:44:16.588Z] javaString(org.eclipse.ease.lang.python.py4j.ScriptModeEngineTest)  Time elapsed: 0.209 s
23:44:16 [2020-10-24T03:44:16.588Z] javaByteArray(org.eclipse.ease.lang.python.py4j.ScriptModeEngineTest)  Time elapsed: 0.204 s
23:44:16 [2020-10-24T03:44:16.588Z] createEclipseClass(org.eclipse.ease.lang.python.py4j.ScriptModeEngineTest)  Time elapsed: 0.211 s
23:44:16 [2020-10-24T03:44:16.588Z] pythonString(org.eclipse.ease.lang.python.py4j.ScriptModeEngineTest)  Time elapsed: 0.216 s
23:44:16 [2020-10-24T03:44:16.588Z] varargs(org.eclipse.ease.lang.python.py4j.ScriptModeEngineTest)  Time elapsed: 0.205 s
23:44:16 [2020-10-24T03:44:16.588Z] createJavaType(org.eclipse.ease.lang.python.py4j.ScriptModeEngineTest)  Time elapsed: 0.204 s
23:44:16 [2020-10-24T03:44:16.588Z] javaFloatArray(org.eclipse.ease.lang.python.py4j.ScriptModeEngineTest)  Time elapsed: 0.201 s
23:44:16 [2020-10-24T03:44:16.589Z] implementJavaInterface(org.eclipse.ease.lang.python.py4j.ScriptModeEngineTest)  Time elapsed: 0.2 s
23:44:16 [2020-10-24T03:44:16.589Z] pythonDict(org.eclipse.ease.lang.python.py4j.ScriptModeEngineTest)  Time elapsed: 0.202 s
23:44:16 [2020-10-24T03:44:16.589Z] pythonList(org.eclipse.ease.lang.python.py4j.ScriptModeEngineTest)  Time elapsed: 0.201 s
23:44:16 [2020-10-24T03:44:16.589Z] testMultiple(org.eclipse.ease.lang.python.py4j.ScriptModeEngineTest)  Time elapsed: 0.204 s
23:44:16 [2020-10-24T03:44:16.589Z] javaLongArray(org.eclipse.ease.lang.python.py4j.ScriptModeEngineTest)  Time elapsed: 0.202 s
23:44:16 [2020-10-24T03:44:16.589Z] createPythonObject(org.eclipse.ease.lang.python.py4j.ScriptModeEngineTest)  Time elapsed: 0.201 s
23:44:16 [2020-10-24T03:44:16.589Z] pythonInteger(org.eclipse.ease.lang.python.py4j.ScriptModeEngineTest)  Time elapsed: 0.202 s
23:44:16 [2020-10-24T03:44:16.589Z] Running org.eclipse.ease.lang.python.py4j.ShellModeEngineTest
23:44:16 [2020-10-24T03:44:16.589Z] ----------------------------------------------
23:44:16 [2020-10-24T03:44:16.589Z] Starting test: invalidSyntax(org.eclipse.ease.lang.python.py4j.ShellModeEngineTest)
23:44:16 [2020-10-24T03:44:16.589Z] org.eclipse.ease.ScriptExecutionException:   File "<console>", line 1
23:44:16 [2020-10-24T03:44:16.589Z]     1++
23:44:16 [2020-10-24T03:44:16.589Z]       ^
23:44:16 [2020-10-24T03:44:16.589Z] SyntaxError: invalid syntax
23:44:16 [2020-10-24T03:44:16.589Z] 
23:44:16 [2020-10-24T03:44:16.844Z] 
23:44:16 [2020-10-24T03:44:16.844Z] Finished test: invalidSyntax(org.eclipse.ease.lang.python.py4j.ShellModeEngineTest)
23:44:16 [2020-10-24T03:44:16.844Z] ----------------------------------------------
23:44:16 [2020-10-24T03:44:16.844Z] ----------------------------------------------
23:44:16 [2020-10-24T03:44:16.844Z] Starting test: optionalModuleParameters(org.eclipse.ease.lang.python.py4j.ShellModeEngineTest)
23:44:17 [2020-10-24T03:44:17.100Z] 
23:44:17 [2020-10-24T03:44:17.100Z] Finished test: optionalModuleParameters(org.eclipse.ease.lang.python.py4j.ShellModeEngineTest)
23:44:17 [2020-10-24T03:44:17.100Z] ----------------------------------------------
23:44:17 [2020-10-24T03:44:17.100Z] ----------------------------------------------
23:44:17 [2020-10-24T03:44:17.100Z] Starting test: getScriptEngine(org.eclipse.ease.lang.python.py4j.ShellModeEngineTest)
23:44:17 [2020-10-24T03:44:17.100Z] 
23:44:17 [2020-10-24T03:44:17.100Z] Finished test: getScriptEngine(org.eclipse.ease.lang.python.py4j.ShellModeEngineTest)
23:44:17 [2020-10-24T03:44:17.100Z] ----------------------------------------------
23:44:17 [2020-10-24T03:44:17.100Z] ----------------------------------------------
23:44:17 [2020-10-24T03:44:17.100Z] Starting test: callModuleCode(org.eclipse.ease.lang.python.py4j.ShellModeEngineTest)
23:44:17 [2020-10-24T03:44:17.355Z] 
23:44:17 [2020-10-24T03:44:17.355Z] Finished test: callModuleCode(org.eclipse.ease.lang.python.py4j.ShellModeEngineTest)
23:44:17 [2020-10-24T03:44:17.355Z] ----------------------------------------------
23:44:17 [2020-10-24T03:44:17.355Z] ----------------------------------------------
23:44:17 [2020-10-24T03:44:17.355Z] Starting test: incompleteStatement(org.eclipse.ease.lang.python.py4j.ShellModeEngineTest)
23:44:17 [2020-10-24T03:44:17.611Z] 
23:44:17 [2020-10-24T03:44:17.611Z] Finished test: incompleteStatement(org.eclipse.ease.lang.python.py4j.ShellModeEngineTest)
23:44:17 [2020-10-24T03:44:17.611Z] ----------------------------------------------
23:44:17 [2020-10-24T03:44:17.611Z] ----------------------------------------------
23:44:17 [2020-10-24T03:44:17.611Z] Starting test: multiLineStatement(org.eclipse.ease.lang.python.py4j.ShellModeEngineTest)
23:44:17 [2020-10-24T03:44:17.866Z] 
23:44:17 [2020-10-24T03:44:17.866Z] Finished test: multiLineStatement(org.eclipse.ease.lang.python.py4j.ShellModeEngineTest)
23:44:17 [2020-10-24T03:44:17.866Z] ----------------------------------------------
23:44:17 [2020-10-24T03:44:17.866Z] ----------------------------------------------
23:44:17 [2020-10-24T03:44:17.866Z] Starting test: runtimeError(org.eclipse.ease.lang.python.py4j.ShellModeEngineTest)
23:44:17 [2020-10-24T03:44:17.866Z] org.eclipse.ease.ScriptExecutionException: Traceback (most recent call last):
23:44:17 [2020-10-24T03:44:17.866Z]   File "<console>", line 1, in <module>
23:44:17 [2020-10-24T03:44:17.866Z] NameError: name 'x' is not defined
23:44:17 [2020-10-24T03:44:17.866Z] 
23:44:18 [2020-10-24T03:44:18.121Z] 
23:44:18 [2020-10-24T03:44:18.121Z] Finished test: runtimeError(org.eclipse.ease.lang.python.py4j.ShellModeEngineTest)
23:44:18 [2020-10-24T03:44:18.121Z] ----------------------------------------------
23:44:18 [2020-10-24T03:44:18.121Z] ----------------------------------------------
23:44:18 [2020-10-24T03:44:18.121Z] Starting test: javaIntArray(org.eclipse.ease.lang.python.py4j.ShellModeEngineTest)
23:44:18 [2020-10-24T03:44:18.121Z] 
23:44:18 [2020-10-24T03:44:18.121Z] Finished test: javaIntArray(org.eclipse.ease.lang.python.py4j.ShellModeEngineTest)
23:44:18 [2020-10-24T03:44:18.121Z] ----------------------------------------------
23:44:18 [2020-10-24T03:44:18.121Z] ----------------------------------------------
23:44:18 [2020-10-24T03:44:18.121Z] Starting test: javaDoubleArray(org.eclipse.ease.lang.python.py4j.ShellModeEngineTest)
23:44:18 [2020-10-24T03:44:18.376Z] 
23:44:18 [2020-10-24T03:44:18.376Z] Finished test: javaDoubleArray(org.eclipse.ease.lang.python.py4j.ShellModeEngineTest)
23:44:18 [2020-10-24T03:44:18.376Z] ----------------------------------------------
23:44:18 [2020-10-24T03:44:18.376Z] ----------------------------------------------
23:44:18 [2020-10-24T03:44:18.376Z] Starting test: pythonSet(org.eclipse.ease.lang.python.py4j.ShellModeEngineTest)
23:44:18 [2020-10-24T03:44:18.632Z] 
23:44:18 [2020-10-24T03:44:18.632Z] Finished test: pythonSet(org.eclipse.ease.lang.python.py4j.ShellModeEngineTest)
23:44:18 [2020-10-24T03:44:18.632Z] ----------------------------------------------
23:44:18 [2020-10-24T03:44:18.632Z] ----------------------------------------------
23:44:18 [2020-10-24T03:44:18.632Z] Starting test: javaStringArray(org.eclipse.ease.lang.python.py4j.ShellModeEngineTest)
23:44:18 [2020-10-24T03:44:18.887Z] 
23:44:18 [2020-10-24T03:44:18.887Z] Finished test: javaStringArray(org.eclipse.ease.lang.python.py4j.ShellModeEngineTest)
23:44:18 [2020-10-24T03:44:18.887Z] ----------------------------------------------
23:44:18 [2020-10-24T03:44:18.887Z] ----------------------------------------------
23:44:18 [2020-10-24T03:44:18.887Z] Starting test: javaShortArray(org.eclipse.ease.lang.python.py4j.ShellModeEngineTest)
23:44:19 [2020-10-24T03:44:19.143Z] 
23:44:19 [2020-10-24T03:44:19.143Z] Finished test: javaShortArray(org.eclipse.ease.lang.python.py4j.ShellModeEngineTest)
23:44:19 [2020-10-24T03:44:19.143Z] ----------------------------------------------
23:44:19 [2020-10-24T03:44:19.143Z] ----------------------------------------------
23:44:19 [2020-10-24T03:44:19.143Z] Starting test: javaBooleanArray(org.eclipse.ease.lang.python.py4j.ShellModeEngineTest)
23:44:19 [2020-10-24T03:44:19.143Z] 
23:44:19 [2020-10-24T03:44:19.143Z] Finished test: javaBooleanArray(org.eclipse.ease.lang.python.py4j.ShellModeEngineTest)
23:44:19 [2020-10-24T03:44:19.143Z] ----------------------------------------------
23:44:19 [2020-10-24T03:44:19.143Z] ----------------------------------------------
23:44:19 [2020-10-24T03:44:19.143Z] Starting test: javaObjectArray(org.eclipse.ease.lang.python.py4j.ShellModeEngineTest)
23:44:19 [2020-10-24T03:44:19.398Z] 
23:44:19 [2020-10-24T03:44:19.398Z] Finished test: javaObjectArray(org.eclipse.ease.lang.python.py4j.ShellModeEngineTest)
23:44:19 [2020-10-24T03:44:19.398Z] ----------------------------------------------
23:44:19 [2020-10-24T03:44:19.398Z] ----------------------------------------------
23:44:19 [2020-10-24T03:44:19.398Z] Starting test: javaIntegerArray(org.eclipse.ease.lang.python.py4j.ShellModeEngineTest)
23:44:19 [2020-10-24T03:44:19.653Z] 
23:44:19 [2020-10-24T03:44:19.653Z] Finished test: javaIntegerArray(org.eclipse.ease.lang.python.py4j.ShellModeEngineTest)
23:44:19 [2020-10-24T03:44:19.653Z] ----------------------------------------------
23:44:19 [2020-10-24T03:44:19.653Z] ----------------------------------------------
23:44:19 [2020-10-24T03:44:19.653Z] Starting test: javaInteger(org.eclipse.ease.lang.python.py4j.ShellModeEngineTest)
23:44:19 [2020-10-24T03:44:19.908Z] 
23:44:19 [2020-10-24T03:44:19.908Z] Finished test: javaInteger(org.eclipse.ease.lang.python.py4j.ShellModeEngineTest)
23:44:19 [2020-10-24T03:44:19.908Z] ----------------------------------------------
23:44:19 [2020-10-24T03:44:19.908Z] ----------------------------------------------
23:44:19 [2020-10-24T03:44:19.908Z] Starting test: javaString(org.eclipse.ease.lang.python.py4j.ShellModeEngineTest)
23:44:20 [2020-10-24T03:44:20.164Z] 
23:44:20 [2020-10-24T03:44:20.164Z] Finished test: javaString(org.eclipse.ease.lang.python.py4j.ShellModeEngineTest)
23:44:20 [2020-10-24T03:44:20.164Z] ----------------------------------------------
23:44:20 [2020-10-24T03:44:20.164Z] ----------------------------------------------
23:44:20 [2020-10-24T03:44:20.164Z] Starting test: javaByteArray(org.eclipse.ease.lang.python.py4j.ShellModeEngineTest)
23:44:20 [2020-10-24T03:44:20.164Z] 
23:44:20 [2020-10-24T03:44:20.164Z] Finished test: javaByteArray(org.eclipse.ease.lang.python.py4j.ShellModeEngineTest)
23:44:20 [2020-10-24T03:44:20.164Z] ----------------------------------------------
23:44:20 [2020-10-24T03:44:20.164Z] ----------------------------------------------
23:44:20 [2020-10-24T03:44:20.164Z] Starting test: createEclipseClass(org.eclipse.ease.lang.python.py4j.ShellModeEngineTest)
23:44:20 [2020-10-24T03:44:20.419Z] 
23:44:20 [2020-10-24T03:44:20.419Z] Finished test: createEclipseClass(org.eclipse.ease.lang.python.py4j.ShellModeEngineTest)
23:44:20 [2020-10-24T03:44:20.419Z] ----------------------------------------------
23:44:20 [2020-10-24T03:44:20.419Z] ----------------------------------------------
23:44:20 [2020-10-24T03:44:20.419Z] Starting test: pythonString(org.eclipse.ease.lang.python.py4j.ShellModeEngineTest)
23:44:20 [2020-10-24T03:44:20.675Z] 
23:44:20 [2020-10-24T03:44:20.675Z] Finished test: pythonString(org.eclipse.ease.lang.python.py4j.ShellModeEngineTest)
23:44:20 [2020-10-24T03:44:20.675Z] ----------------------------------------------
23:44:20 [2020-10-24T03:44:20.675Z] ----------------------------------------------
23:44:20 [2020-10-24T03:44:20.675Z] Starting test: varargs(org.eclipse.ease.lang.python.py4j.ShellModeEngineTest)
23:44:20 [2020-10-24T03:44:20.930Z] 
23:44:20 [2020-10-24T03:44:20.930Z] Finished test: varargs(org.eclipse.ease.lang.python.py4j.ShellModeEngineTest)
23:44:20 [2020-10-24T03:44:20.930Z] ----------------------------------------------
23:44:20 [2020-10-24T03:44:20.930Z] ----------------------------------------------
23:44:20 [2020-10-24T03:44:20.930Z] Starting test: createJavaType(org.eclipse.ease.lang.python.py4j.ShellModeEngineTest)
23:44:20 [2020-10-24T03:44:20.930Z] 
23:44:20 [2020-10-24T03:44:20.930Z] Finished test: createJavaType(org.eclipse.ease.lang.python.py4j.ShellModeEngineTest)
23:44:20 [2020-10-24T03:44:20.930Z] ----------------------------------------------
23:44:20 [2020-10-24T03:44:20.930Z] ----------------------------------------------
23:44:20 [2020-10-24T03:44:20.930Z] Starting test: javaFloatArray(org.eclipse.ease.lang.python.py4j.ShellModeEngineTest)
23:44:21 [2020-10-24T03:44:21.186Z] 
23:44:21 [2020-10-24T03:44:21.186Z] Finished test: javaFloatArray(org.eclipse.ease.lang.python.py4j.ShellModeEngineTest)
23:44:21 [2020-10-24T03:44:21.186Z] ----------------------------------------------
23:44:21 [2020-10-24T03:44:21.186Z] ----------------------------------------------
23:44:21 [2020-10-24T03:44:21.186Z] Starting test: implementJavaInterface(org.eclipse.ease.lang.python.py4j.ShellModeEngineTest)
23:44:21 [2020-10-24T03:44:21.441Z] 
23:44:21 [2020-10-24T03:44:21.441Z] Finished test: implementJavaInterface(org.eclipse.ease.lang.python.py4j.ShellModeEngineTest)
23:44:21 [2020-10-24T03:44:21.441Z] ----------------------------------------------
23:44:21 [2020-10-24T03:44:21.441Z] ----------------------------------------------
23:44:21 [2020-10-24T03:44:21.441Z] Starting test: pythonDict(org.eclipse.ease.lang.python.py4j.ShellModeEngineTest)
23:44:21 [2020-10-24T03:44:21.697Z] 
23:44:21 [2020-10-24T03:44:21.697Z] Finished test: pythonDict(org.eclipse.ease.lang.python.py4j.ShellModeEngineTest)
23:44:21 [2020-10-24T03:44:21.697Z] ----------------------------------------------
23:44:21 [2020-10-24T03:44:21.697Z] ----------------------------------------------
23:44:21 [2020-10-24T03:44:21.697Z] Starting test: pythonList(org.eclipse.ease.lang.python.py4j.ShellModeEngineTest)
23:44:21 [2020-10-24T03:44:21.954Z] 
23:44:21 [2020-10-24T03:44:21.954Z] Finished test: pythonList(org.eclipse.ease.lang.python.py4j.ShellModeEngineTest)
23:44:21 [2020-10-24T03:44:21.954Z] ----------------------------------------------
23:44:21 [2020-10-24T03:44:21.954Z] ----------------------------------------------
23:44:21 [2020-10-24T03:44:21.954Z] Starting test: testMultiple(org.eclipse.ease.lang.python.py4j.ShellModeEngineTest)
23:44:21 [2020-10-24T03:44:21.954Z] 
23:44:21 [2020-10-24T03:44:21.954Z] Finished test: testMultiple(org.eclipse.ease.lang.python.py4j.ShellModeEngineTest)
23:44:21 [2020-10-24T03:44:21.954Z] ----------------------------------------------
23:44:21 [2020-10-24T03:44:21.954Z] ----------------------------------------------
23:44:21 [2020-10-24T03:44:21.954Z] Starting test: javaLongArray(org.eclipse.ease.lang.python.py4j.ShellModeEngineTest)
23:44:22 [2020-10-24T03:44:22.210Z] 
23:44:22 [2020-10-24T03:44:22.210Z] Finished test: javaLongArray(org.eclipse.ease.lang.python.py4j.ShellModeEngineTest)
23:44:22 [2020-10-24T03:44:22.210Z] ----------------------------------------------
23:44:22 [2020-10-24T03:44:22.210Z] ----------------------------------------------
23:44:22 [2020-10-24T03:44:22.210Z] Starting test: createPythonObject(org.eclipse.ease.lang.python.py4j.ShellModeEngineTest)
23:44:22 [2020-10-24T03:44:22.465Z] 
23:44:22 [2020-10-24T03:44:22.465Z] Finished test: createPythonObject(org.eclipse.ease.lang.python.py4j.ShellModeEngineTest)
23:44:22 [2020-10-24T03:44:22.465Z] ----------------------------------------------
23:44:22 [2020-10-24T03:44:22.465Z] ----------------------------------------------
23:44:22 [2020-10-24T03:44:22.465Z] Starting test: pythonInteger(org.eclipse.ease.lang.python.py4j.ShellModeEngineTest)
23:44:22 [2020-10-24T03:44:22.721Z] 
23:44:22 [2020-10-24T03:44:22.721Z] Finished test: pythonInteger(org.eclipse.ease.lang.python.py4j.ShellModeEngineTest)
23:44:22 [2020-10-24T03:44:22.721Z] ----------------------------------------------
23:44:22 [2020-10-24T03:44:22.721Z] Tests run: 34, Failures: 0, Errors: 0, Skipped: 4, Time elapsed: 6.077 s - in org.eclipse.ease.lang.python.py4j.ShellModeEngineTest
23:44:22 [2020-10-24T03:44:22.721Z] invalidSyntax(org.eclipse.ease.lang.python.py4j.ShellModeEngineTest)  Time elapsed: 0.2 s
23:44:22 [2020-10-24T03:44:22.721Z] print_(org.eclipse.ease.lang.python.py4j.ShellModeEngineTest) skipped
23:44:22 [2020-10-24T03:44:22.721Z] optionalModuleParameters(org.eclipse.ease.lang.python.py4j.ShellModeEngineTest)  Time elapsed: 0.199 s
23:44:22 [2020-10-24T03:44:22.721Z] print_TextNoNewline(org.eclipse.ease.lang.python.py4j.ShellModeEngineTest) skipped
23:44:22 [2020-10-24T03:44:22.721Z] getScriptEngine(org.eclipse.ease.lang.python.py4j.ShellModeEngineTest)  Time elapsed: 0.199 s
23:44:22 [2020-10-24T03:44:22.721Z] print_Text(org.eclipse.ease.lang.python.py4j.ShellModeEngineTest) skipped
23:44:22 [2020-10-24T03:44:22.721Z] callModuleCode(org.eclipse.ease.lang.python.py4j.ShellModeEngineTest)  Time elapsed: 0.2 s
23:44:22 [2020-10-24T03:44:22.721Z] print_NoNewline(org.eclipse.ease.lang.python.py4j.ShellModeEngineTest) skipped
23:44:22 [2020-10-24T03:44:22.721Z] incompleteStatement(org.eclipse.ease.lang.python.py4j.ShellModeEngineTest)  Time elapsed: 0.201 s
23:44:22 [2020-10-24T03:44:22.721Z] multiLineStatement(org.eclipse.ease.lang.python.py4j.ShellModeEngineTest)  Time elapsed: 0.201 s
23:44:22 [2020-10-24T03:44:22.721Z] runtimeError(org.eclipse.ease.lang.python.py4j.ShellModeEngineTest)  Time elapsed: 0.202 s
23:44:22 [2020-10-24T03:44:22.721Z] javaIntArray(org.eclipse.ease.lang.python.py4j.ShellModeEngineTest)  Time elapsed: 0.202 s
23:44:22 [2020-10-24T03:44:22.721Z] javaDoubleArray(org.eclipse.ease.lang.python.py4j.ShellModeEngineTest)  Time elapsed: 0.22 s
23:44:22 [2020-10-24T03:44:22.721Z] pythonSet(org.eclipse.ease.lang.python.py4j.ShellModeEngineTest)  Time elapsed: 0.202 s
23:44:22 [2020-10-24T03:44:22.721Z] javaStringArray(org.eclipse.ease.lang.python.py4j.ShellModeEngineTest)  Time elapsed: 0.2 s
23:44:22 [2020-10-24T03:44:22.721Z] javaShortArray(org.eclipse.ease.lang.python.py4j.ShellModeEngineTest)  Time elapsed: 0.204 s
23:44:22 [2020-10-24T03:44:22.721Z] javaBooleanArray(org.eclipse.ease.lang.python.py4j.ShellModeEngineTest)  Time elapsed: 0.199 s
23:44:22 [2020-10-24T03:44:22.721Z] javaObjectArray(org.eclipse.ease.lang.python.py4j.ShellModeEngineTest)  Time elapsed: 0.204 s
23:44:22 [2020-10-24T03:44:22.721Z] javaIntegerArray(org.eclipse.ease.lang.python.py4j.ShellModeEngineTest)  Time elapsed: 0.201 s
23:44:22 [2020-10-24T03:44:22.721Z] javaInteger(org.eclipse.ease.lang.python.py4j.ShellModeEngineTest)  Time elapsed: 0.2 s
23:44:22 [2020-10-24T03:44:22.721Z] javaString(org.eclipse.ease.lang.python.py4j.ShellModeEngineTest)  Time elapsed: 0.2 s
23:44:22 [2020-10-24T03:44:22.721Z] javaByteArray(org.eclipse.ease.lang.python.py4j.ShellModeEngineTest)  Time elapsed: 0.208 s
23:44:22 [2020-10-24T03:44:22.721Z] createEclipseClass(org.eclipse.ease.lang.python.py4j.ShellModeEngineTest)  Time elapsed: 0.198 s
23:44:22 [2020-10-24T03:44:22.721Z] pythonString(org.eclipse.ease.lang.python.py4j.ShellModeEngineTest)  Time elapsed: 0.199 s
23:44:22 [2020-10-24T03:44:22.721Z] varargs(org.eclipse.ease.lang.python.py4j.ShellModeEngineTest)  Time elapsed: 0.2 s
23:44:22 [2020-10-24T03:44:22.721Z] createJavaType(org.eclipse.ease.lang.python.py4j.ShellModeEngineTest)  Time elapsed: 0.201 s
23:44:22 [2020-10-24T03:44:22.721Z] javaFloatArray(org.eclipse.ease.lang.python.py4j.ShellModeEngineTest)  Time elapsed: 0.199 s
23:44:22 [2020-10-24T03:44:22.721Z] implementJavaInterface(org.eclipse.ease.lang.python.py4j.ShellModeEngineTest)  Time elapsed: 0.2 s
23:44:22 [2020-10-24T03:44:22.721Z] pythonDict(org.eclipse.ease.lang.python.py4j.ShellModeEngineTest)  Time elapsed: 0.205 s
23:44:22 [2020-10-24T03:44:22.721Z] pythonList(org.eclipse.ease.lang.python.py4j.ShellModeEngineTest)  Time elapsed: 0.212 s
23:44:22 [2020-10-24T03:44:22.721Z] testMultiple(org.eclipse.ease.lang.python.py4j.ShellModeEngineTest)  Time elapsed: 0.209 s
23:44:22 [2020-10-24T03:44:22.721Z] javaLongArray(org.eclipse.ease.lang.python.py4j.ShellModeEngineTest)  Time elapsed: 0.204 s
23:44:22 [2020-10-24T03:44:22.721Z] createPythonObject(org.eclipse.ease.lang.python.py4j.ShellModeEngineTest)  Time elapsed: 0.208 s
23:44:22 [2020-10-24T03:44:22.721Z] pythonInteger(org.eclipse.ease.lang.python.py4j.ShellModeEngineTest)  Time elapsed: 0.198 s
23:44:22 [2020-10-24T03:44:22.721Z] Running org.eclipse.ease.lang.python.py4j.Py4JEngineTest
23:44:22 [2020-10-24T03:44:22.721Z] Tests run: 3, Failures: 0, Errors: 0, Skipped: 3, Time elapsed: 0.001 s - in org.eclipse.ease.lang.python.py4j.Py4JEngineTest
23:44:22 [2020-10-24T03:44:22.721Z] print(org.eclipse.ease.lang.python.py4j.Py4JEngineTest) skipped
23:44:22 [2020-10-24T03:44:22.721Z] mixedMode(org.eclipse.ease.lang.python.py4j.Py4JEngineTest) skipped
23:44:22 [2020-10-24T03:44:22.721Z] cleanShutdown(org.eclipse.ease.lang.python.py4j.Py4JEngineTest) skipped
23:44:22 [2020-10-24T03:44:22.721Z] Running org.eclipse.ease.lang.python.py4j.Py4jDebugTest
23:44:22 [2020-10-24T03:44:22.721Z] WARNING: An illegal reflective access operation has occurred
23:44:22 [2020-10-24T03:44:22.721Z] WARNING: Illegal reflective access by org.mockito.cglib.core.ReflectUtils$2 (file:/home/jenkins/.m2/repository/p2/osgi/bundle/org.mockito/1.9.5.v201605172210/org.mockito-1.9.5.v201605172210.jar) to method java.lang.ClassLoader.defineClass(java.lang.String,byte[],int,int,java.security.ProtectionDomain)
23:44:22 [2020-10-24T03:44:22.721Z] WARNING: Please consider reporting this to the maintainers of org.mockito.cglib.core.ReflectUtils$2
23:44:22 [2020-10-24T03:44:22.721Z] WARNING: Use --illegal-access=warn to enable warnings of further illegal reflective access operations
23:44:22 [2020-10-24T03:44:22.721Z] WARNING: All illegal access operations will be denied in a future release
23:44:22 [2020-10-24T03:44:22.977Z] Start of script
23:44:22 [2020-10-24T03:44:22.977Z] include file start
23:44:22 [2020-10-24T03:44:22.977Z] include file processed
23:44:22 [2020-10-24T03:44:22.977Z] Result of testMethod = 5
23:44:22 [2020-10-24T03:44:22.977Z] End of script
23:44:23 [2020-10-24T03:44:23.232Z] Start of script
23:44:23 [2020-10-24T03:44:23.233Z] include file start
23:44:23 [2020-10-24T03:44:23.233Z] include file processed
23:44:23 [2020-10-24T03:44:23.233Z] Result of testMethod = 5
23:44:23 [2020-10-24T03:44:23.233Z] End of script
23:44:23 [2020-10-24T03:44:23.488Z] Start of script
23:44:23 [2020-10-24T03:44:23.488Z] include file start
23:44:23 [2020-10-24T03:44:23.488Z] include file processed
23:44:23 [2020-10-24T03:44:23.488Z] Result of testMethod = 5
23:44:23 [2020-10-24T03:44:23.743Z] py4j.Py4JException: An exception was raised by the Python Proxy. Return Message: x
23:44:23 [2020-10-24T03:44:23.743Z] 	at py4j.Protocol.getReturnValue(Protocol.java:438)
23:44:23 [2020-10-24T03:44:23.743Z] 	at py4j.reflection.PythonProxyHandler.invoke(PythonProxyHandler.java:105)
23:44:23 [2020-10-24T03:44:23.743Z] 	at com.sun.proxy.$Proxy18.run(Unknown Source)
23:44:23 [2020-10-24T03:44:23.743Z] 	at org.eclipse.ease.lang.python.py4j.internal.Py4jDebugger.execute(Py4jDebugger.java:106)
23:44:23 [2020-10-24T03:44:23.743Z] 	at org.eclipse.ease.lang.python.py4j.internal.Py4jDebuggerEngine.internalExecute(Py4jDebuggerEngine.java:85)
23:44:23 [2020-10-24T03:44:23.743Z] 	at org.eclipse.ease.lang.python.py4j.internal.Py4jScriptEngine.execute(Py4jScriptEngine.java:226)
23:44:23 [2020-10-24T03:44:23.743Z] 	at org.eclipse.ease.AbstractScriptEngine.inject(AbstractScriptEngine.java:224)
23:44:23 [2020-10-24T03:44:23.743Z] 	at org.eclipse.ease.AbstractScriptEngine.run(AbstractScriptEngine.java:274)
23:44:23 [2020-10-24T03:44:23.743Z] 	at org.eclipse.core.internal.jobs.Worker.run(Worker.java:63)
23:44:23 [2020-10-24T03:44:23.998Z] Start of script
23:44:23 [2020-10-24T03:44:23.998Z] include file start
23:44:23 [2020-10-24T03:44:23.998Z] include file processed
23:44:24 [2020-10-24T03:44:24.253Z] Result of testMethod = 5
23:44:24 [2020-10-24T03:44:24.253Z] End of script
23:44:24 [2020-10-24T03:44:24.509Z] Start of script
23:44:24 [2020-10-24T03:44:24.509Z] include file start
23:44:24 [2020-10-24T03:44:24.509Z] include file processed
23:44:24 [2020-10-24T03:44:24.509Z] Result of testMethod = 5
23:44:24 [2020-10-24T03:44:24.509Z] End of script
23:44:24 [2020-10-24T03:44:24.764Z] Start of script
23:44:24 [2020-10-24T03:44:24.764Z] include file start
23:44:24 [2020-10-24T03:44:24.764Z] include file processed
23:44:25 [2020-10-24T03:44:25.020Z] Result of testMethod = 5
23:44:25 [2020-10-24T03:44:25.020Z] End of script
23:44:25 [2020-10-24T03:44:25.276Z] Start of script
23:44:25 [2020-10-24T03:44:25.276Z] include file start
23:44:25 [2020-10-24T03:44:25.276Z] include file processed
23:44:25 [2020-10-24T03:44:25.276Z] Result of testMethod = 5
23:44:25 [2020-10-24T03:44:25.276Z] py4j.Py4JException: An exception was raised by the Python Proxy. Return Message: x
23:44:25 [2020-10-24T03:44:25.276Z] 	at py4j.Protocol.getReturnValue(Protocol.java:438)
23:44:25 [2020-10-24T03:44:25.276Z] 	at py4j.reflection.PythonProxyHandler.invoke(PythonProxyHandler.java:105)
23:44:25 [2020-10-24T03:44:25.276Z] 	at com.sun.proxy.$Proxy18.run(Unknown Source)
23:44:25 [2020-10-24T03:44:25.276Z] 	at org.eclipse.ease.lang.python.py4j.internal.Py4jDebugger.execute(Py4jDebugger.java:106)
23:44:25 [2020-10-24T03:44:25.276Z] 	at org.eclipse.ease.lang.python.py4j.internal.Py4jDebuggerEngine.internalExecute(Py4jDebuggerEngine.java:85)
23:44:25 [2020-10-24T03:44:25.276Z] 	at org.eclipse.ease.lang.python.py4j.internal.Py4jScriptEngine.execute(Py4jScriptEngine.java:226)
23:44:25 [2020-10-24T03:44:25.276Z] 	at org.eclipse.ease.AbstractScriptEngine.inject(AbstractScriptEngine.java:224)
23:44:25 [2020-10-24T03:44:25.276Z] 	at org.eclipse.ease.AbstractScriptEngine.run(AbstractScriptEngine.java:274)
23:44:25 [2020-10-24T03:44:25.276Z] 	at org.eclipse.core.internal.jobs.Worker.run(Worker.java:63)
23:44:25 [2020-10-24T03:44:25.532Z] Start of script
23:44:25 [2020-10-24T03:44:25.532Z] include file start
23:44:25 [2020-10-24T03:44:25.532Z] include file processed
23:44:25 [2020-10-24T03:44:25.787Z] Result of testMethod = 5
23:44:25 [2020-10-24T03:44:25.787Z] End of script
23:44:26 [2020-10-24T03:44:26.043Z] Start of script
23:44:26 [2020-10-24T03:44:26.043Z] include file start
23:44:26 [2020-10-24T03:44:26.043Z] include file processed
23:44:26 [2020-10-24T03:44:26.043Z] Result of testMethod = 5
23:44:26 [2020-10-24T03:44:26.043Z] End of script
23:44:26 [2020-10-24T03:44:26.298Z] Start of script
23:44:26 [2020-10-24T03:44:26.298Z] include file start
23:44:26 [2020-10-24T03:44:26.298Z] include file processed
23:44:26 [2020-10-24T03:44:26.859Z] py4j.Py4JException: An exception was raised by the Python Proxy. Return Message: x
23:44:26 [2020-10-24T03:44:26.859Z] 	at py4j.Protocol.getReturnValue(Protocol.java:438)
23:44:26 [2020-10-24T03:44:26.859Z] 	at py4j.reflection.PythonProxyHandler.invoke(PythonProxyHandler.java:105)
23:44:26 [2020-10-24T03:44:26.859Z] 	at com.sun.proxy.$Proxy18.run(Unknown Source)
23:44:26 [2020-10-24T03:44:26.859Z] 	at org.eclipse.ease.lang.python.py4j.internal.Py4jDebugger.execute(Py4jDebugger.java:106)
23:44:26 [2020-10-24T03:44:26.859Z] 	at org.eclipse.ease.lang.python.py4j.internal.Py4jDebuggerEngine.internalExecute(Py4jDebuggerEngine.java:85)
23:44:26 [2020-10-24T03:44:26.859Z] 	at org.eclipse.ease.lang.python.py4j.internal.Py4jScriptEngine.execute(Py4jScriptEngine.java:226)
23:44:26 [2020-10-24T03:44:26.859Z] 	at org.eclipse.ease.AbstractScriptEngine.inject(AbstractScriptEngine.java:224)
23:44:26 [2020-10-24T03:44:26.859Z] 	at org.eclipse.ease.AbstractScriptEngine.run(AbstractScriptEngine.java:274)
23:44:26 [2020-10-24T03:44:26.859Z] 	at org.eclipse.core.internal.jobs.Worker.run(Worker.java:63)
23:44:26 [2020-10-24T03:44:26.859Z] Start of script
23:44:26 [2020-10-24T03:44:26.859Z] include file start
23:44:26 [2020-10-24T03:44:26.859Z] include file processed
23:44:27 [2020-10-24T03:44:27.115Z] Result of testMethod = 5
23:44:27 [2020-10-24T03:44:27.115Z] End of script
23:44:27 [2020-10-24T03:44:27.372Z] py4j.Py4JException: An exception was raised by the Python Proxy. Return Message: x
23:44:27 [2020-10-24T03:44:27.372Z] 	at py4j.Protocol.getReturnValue(Protocol.java:438)
23:44:27 [2020-10-24T03:44:27.372Z] 	at py4j.reflection.PythonProxyHandler.invoke(PythonProxyHandler.java:105)
23:44:27 [2020-10-24T03:44:27.372Z] 	at com.sun.proxy.$Proxy18.run(Unknown Source)
23:44:27 [2020-10-24T03:44:27.372Z] 	at org.eclipse.ease.lang.python.py4j.internal.Py4jDebugger.execute(Py4jDebugger.java:106)
23:44:27 [2020-10-24T03:44:27.372Z] 	at org.eclipse.ease.lang.python.py4j.internal.Py4jDebuggerEngine.internalExecute(Py4jDebuggerEngine.java:85)
23:44:27 [2020-10-24T03:44:27.372Z] 	at org.eclipse.ease.lang.python.py4j.internal.Py4jScriptEngine.execute(Py4jScriptEngine.java:226)
23:44:27 [2020-10-24T03:44:27.372Z] 	at org.eclipse.ease.AbstractScriptEngine.inject(AbstractScriptEngine.java:224)
23:44:27 [2020-10-24T03:44:27.372Z] 	at org.eclipse.ease.AbstractScriptEngine.run(AbstractScriptEngine.java:274)
23:44:27 [2020-10-24T03:44:27.372Z] 	at org.eclipse.core.internal.jobs.Worker.run(Worker.java:63)
23:44:27 [2020-10-24T03:44:27.629Z] Start of script
23:44:27 [2020-10-24T03:44:27.629Z] include file start
23:44:27 [2020-10-24T03:44:27.629Z] include file processed
23:44:27 [2020-10-24T03:44:27.629Z] Result of testMethod = 5
23:44:27 [2020-10-24T03:44:27.629Z] End of script
23:44:27 [2020-10-24T03:44:27.884Z] Start of script
23:44:27 [2020-10-24T03:44:27.884Z] include file start
23:44:27 [2020-10-24T03:44:27.884Z] include file processed
23:44:28 [2020-10-24T03:44:28.139Z] Result of testMethod = 5
23:44:28 [2020-10-24T03:44:28.139Z] End of script
23:44:28 [2020-10-24T03:44:28.394Z] Start of script
23:44:28 [2020-10-24T03:44:28.394Z] include file start
23:44:28 [2020-10-24T03:44:28.394Z] include file processed
23:44:28 [2020-10-24T03:44:28.394Z] Result of testMethod = 5
23:44:28 [2020-10-24T03:44:28.649Z] py4j.Py4JException: An exception was raised by the Python Proxy. Return Message: x
23:44:28 [2020-10-24T03:44:28.649Z] 	at py4j.Protocol.getReturnValue(Protocol.java:438)
23:44:28 [2020-10-24T03:44:28.649Z] 	at py4j.reflection.PythonProxyHandler.invoke(PythonProxyHandler.java:105)
23:44:28 [2020-10-24T03:44:28.649Z] 	at com.sun.proxy.$Proxy18.run(Unknown Source)
23:44:28 [2020-10-24T03:44:28.649Z] 	at org.eclipse.ease.lang.python.py4j.internal.Py4jDebugger.execute(Py4jDebugger.java:106)
23:44:28 [2020-10-24T03:44:28.649Z] 	at org.eclipse.ease.lang.python.py4j.internal.Py4jDebuggerEngine.internalExecute(Py4jDebuggerEngine.java:85)
23:44:28 [2020-10-24T03:44:28.649Z] 	at org.eclipse.ease.lang.python.py4j.internal.Py4jScriptEngine.execute(Py4jScriptEngine.java:226)
23:44:28 [2020-10-24T03:44:28.649Z] 	at org.eclipse.ease.AbstractScriptEngine.inject(AbstractScriptEngine.java:224)
23:44:28 [2020-10-24T03:44:28.649Z] 	at org.eclipse.ease.AbstractScriptEngine.run(AbstractScriptEngine.java:274)
23:44:28 [2020-10-24T03:44:28.649Z] 	at org.eclipse.core.internal.jobs.Worker.run(Worker.java:63)
23:44:28 [2020-10-24T03:44:28.649Z] Start of script
23:44:28 [2020-10-24T03:44:28.649Z] include file start
23:44:28 [2020-10-24T03:44:28.649Z] include file processed
23:44:28 [2020-10-24T03:44:28.905Z] Result of testMethod = 5
23:44:28 [2020-10-24T03:44:28.905Z] End of script
23:44:29 [2020-10-24T03:44:29.161Z] py4j.Py4JException: An exception was raised by the Python Proxy. Return Message: x
23:44:29 [2020-10-24T03:44:29.161Z] 	at py4j.Protocol.getReturnValue(Protocol.java:438)
23:44:29 [2020-10-24T03:44:29.161Z] 	at py4j.reflection.PythonProxyHandler.invoke(PythonProxyHandler.java:105)
23:44:29 [2020-10-24T03:44:29.161Z] 	at com.sun.proxy.$Proxy18.run(Unknown Source)
23:44:29 [2020-10-24T03:44:29.161Z] 	at org.eclipse.ease.lang.python.py4j.internal.Py4jDebugger.execute(Py4jDebugger.java:106)
23:44:29 [2020-10-24T03:44:29.161Z] 	at org.eclipse.ease.lang.python.py4j.internal.Py4jDebuggerEngine.internalExecute(Py4jDebuggerEngine.java:85)
23:44:29 [2020-10-24T03:44:29.161Z] 	at org.eclipse.ease.lang.python.py4j.internal.Py4jScriptEngine.execute(Py4jScriptEngine.java:226)
23:44:29 [2020-10-24T03:44:29.161Z] 	at org.eclipse.ease.AbstractScriptEngine.inject(AbstractScriptEngine.java:224)
23:44:29 [2020-10-24T03:44:29.161Z] 	at org.eclipse.ease.AbstractScriptEngine.run(AbstractScriptEngine.java:274)
23:44:29 [2020-10-24T03:44:29.161Z] 	at org.eclipse.core.internal.jobs.Worker.run(Worker.java:63)
23:44:29 [2020-10-24T03:44:29.417Z] Start of script
23:44:29 [2020-10-24T03:44:29.417Z] include file start
23:44:29 [2020-10-24T03:44:29.417Z] include file processed
23:44:29 [2020-10-24T03:44:29.417Z] Result of testMethod = 5
23:44:29 [2020-10-24T03:44:29.417Z] End of script
23:44:29 [2020-10-24T03:44:29.672Z] Start of script
23:44:29 [2020-10-24T03:44:29.673Z] include file start
23:44:29 [2020-10-24T03:44:29.673Z] include file processed
23:44:29 [2020-10-24T03:44:29.928Z] Result of testMethod = 5
23:44:29 [2020-10-24T03:44:29.928Z] End of script
23:44:30 [2020-10-24T03:44:30.185Z] py4j.Py4JException: An exception was raised by the Python Proxy. Return Message: x
23:44:30 [2020-10-24T03:44:30.185Z] 	at py4j.Protocol.getReturnValue(Protocol.java:438)
23:44:30 [2020-10-24T03:44:30.186Z] 	at py4j.reflection.PythonProxyHandler.invoke(PythonProxyHandler.java:105)
23:44:30 [2020-10-24T03:44:30.186Z] 	at com.sun.proxy.$Proxy18.run(Unknown Source)
23:44:30 [2020-10-24T03:44:30.186Z] 	at org.eclipse.ease.lang.python.py4j.internal.Py4jDebugger.execute(Py4jDebugger.java:106)
23:44:30 [2020-10-24T03:44:30.186Z] 	at org.eclipse.ease.lang.python.py4j.internal.Py4jDebuggerEngine.internalExecute(Py4jDebuggerEngine.java:85)
23:44:30 [2020-10-24T03:44:30.186Z] 	at org.eclipse.ease.lang.python.py4j.internal.Py4jScriptEngine.execute(Py4jScriptEngine.java:226)
23:44:30 [2020-10-24T03:44:30.186Z] 	at org.eclipse.ease.AbstractScriptEngine.inject(AbstractScriptEngine.java:224)
23:44:30 [2020-10-24T03:44:30.186Z] 	at org.eclipse.ease.AbstractScriptEngine.run(AbstractScriptEngine.java:274)
23:44:30 [2020-10-24T03:44:30.186Z] 	at org.eclipse.core.internal.jobs.Worker.run(Worker.java:63)
23:44:30 [2020-10-24T03:44:30.441Z] Start of script
23:44:30 [2020-10-24T03:44:30.441Z] include file start
23:44:30 [2020-10-24T03:44:30.441Z] include file processed
23:44:30 [2020-10-24T03:44:30.697Z] Result of testMethod = 5
23:44:30 [2020-10-24T03:44:30.697Z] End of script
23:44:30 [2020-10-24T03:44:30.953Z] Start of script
23:44:30 [2020-10-24T03:44:30.953Z] include file start
23:44:30 [2020-10-24T03:44:30.953Z] include file processed
23:44:30 [2020-10-24T03:44:30.953Z] Result of testMethod = 5
23:44:30 [2020-10-24T03:44:30.953Z] End of script
23:44:31 [2020-10-24T03:44:31.208Z] Start of script
23:44:31 [2020-10-24T03:44:31.208Z] include file start
23:44:31 [2020-10-24T03:44:31.208Z] include file processed
23:44:31 [2020-10-24T03:44:31.208Z] Result of testMethod = 5
23:44:31 [2020-10-24T03:44:31.208Z] End of script
23:44:31 [2020-10-24T03:44:31.464Z] Start of script
23:44:31 [2020-10-24T03:44:31.464Z] include file start
23:44:31 [2020-10-24T03:44:31.464Z] include file processed
23:44:31 [2020-10-24T03:44:31.464Z] Result of testMethod = 5
23:44:31 [2020-10-24T03:44:31.464Z] End of script
23:44:31 [2020-10-24T03:44:31.720Z] Start of script
23:44:31 [2020-10-24T03:44:31.720Z] include file start
23:44:31 [2020-10-24T03:44:31.720Z] include file processed
23:44:31 [2020-10-24T03:44:31.976Z] Result of testMethod = 5
23:44:31 [2020-10-24T03:44:31.976Z] End of script
23:44:32 [2020-10-24T03:44:32.231Z] Start of script
23:44:32 [2020-10-24T03:44:32.231Z] include file start
23:44:32 [2020-10-24T03:44:32.231Z] include file processed
23:44:32 [2020-10-24T03:44:32.231Z] py4j.Py4JException: An exception was raised by the Python Proxy. Return Message: x
23:44:32 [2020-10-24T03:44:32.231Z] 	at py4j.Protocol.getReturnValue(Protocol.java:438)
23:44:32 [2020-10-24T03:44:32.231Z] 	at py4j.reflection.PythonProxyHandler.invoke(PythonProxyHandler.java:105)
23:44:32 [2020-10-24T03:44:32.231Z] 	at com.sun.proxy.$Proxy18.run(Unknown Source)
23:44:32 [2020-10-24T03:44:32.231Z] 	at org.eclipse.ease.lang.python.py4j.internal.Py4jDebugger.execute(Py4jDebugger.java:106)
23:44:32 [2020-10-24T03:44:32.231Z] 	at org.eclipse.ease.lang.python.py4j.internal.Py4jDebuggerEngine.internalExecute(Py4jDebuggerEngine.java:85)
23:44:32 [2020-10-24T03:44:32.231Z] 	at org.eclipse.ease.lang.python.py4j.internal.Py4jScriptEngine.execute(Py4jScriptEngine.java:226)
23:44:32 [2020-10-24T03:44:32.231Z] 	at org.eclipse.ease.AbstractScriptEngine.inject(AbstractScriptEngine.java:224)
23:44:32 [2020-10-24T03:44:32.231Z] 	at org.eclipse.ease.AbstractScriptEngine.run(AbstractScriptEngine.java:274)
23:44:32 [2020-10-24T03:44:32.231Z] 	at org.eclipse.core.internal.jobs.Worker.run(Worker.java:63)
23:44:32 [2020-10-24T03:44:32.486Z] Start of script
23:44:32 [2020-10-24T03:44:32.486Z] include file start
23:44:32 [2020-10-24T03:44:32.486Z] include file processed
23:44:32 [2020-10-24T03:44:32.486Z] Result of testMethod = 5
23:44:32 [2020-10-24T03:44:32.741Z] py4j.Py4JException: An exception was raised by the Python Proxy. Return Message: x
23:44:32 [2020-10-24T03:44:32.741Z] 	at py4j.Protocol.getReturnValue(Protocol.java:438)
23:44:32 [2020-10-24T03:44:32.741Z] 	at py4j.reflection.PythonProxyHandler.invoke(PythonProxyHandler.java:105)
23:44:32 [2020-10-24T03:44:32.741Z] 	at com.sun.proxy.$Proxy18.run(Unknown Source)
23:44:32 [2020-10-24T03:44:32.742Z] 	at org.eclipse.ease.lang.python.py4j.internal.Py4jDebugger.execute(Py4jDebugger.java:106)
23:44:32 [2020-10-24T03:44:32.742Z] 	at org.eclipse.ease.lang.python.py4j.internal.Py4jDebuggerEngine.internalExecute(Py4jDebuggerEngine.java:85)
23:44:32 [2020-10-24T03:44:32.742Z] 	at org.eclipse.ease.lang.python.py4j.internal.Py4jScriptEngine.execute(Py4jScriptEngine.java:226)
23:44:32 [2020-10-24T03:44:32.742Z] 	at org.eclipse.ease.AbstractScriptEngine.inject(AbstractScriptEngine.java:224)
23:44:32 [2020-10-24T03:44:32.742Z] 	at org.eclipse.ease.AbstractScriptEngine.run(AbstractScriptEngine.java:274)
23:44:32 [2020-10-24T03:44:32.742Z] 	at org.eclipse.core.internal.jobs.Worker.run(Worker.java:63)
23:44:32 [2020-10-24T03:44:32.997Z] Start of script
23:44:32 [2020-10-24T03:44:32.997Z] include file start
23:44:32 [2020-10-24T03:44:32.997Z] include file processed
23:44:32 [2020-10-24T03:44:32.997Z] Result of testMethod = 5
23:44:32 [2020-10-24T03:44:32.997Z] End of script
23:44:33 [2020-10-24T03:44:33.253Z] Start of script
23:44:33 [2020-10-24T03:44:33.253Z] include file start
23:44:33 [2020-10-24T03:44:33.253Z] include file processed
23:44:33 [2020-10-24T03:44:33.509Z] Result of testMethod = 5
23:44:33 [2020-10-24T03:44:33.509Z] End of script
23:44:33 [2020-10-24T03:44:33.765Z] Start of script
23:44:33 [2020-10-24T03:44:33.765Z] include file start
23:44:33 [2020-10-24T03:44:33.765Z] include file processed
23:44:33 [2020-10-24T03:44:33.765Z] Result of testMethod = 5
23:44:33 [2020-10-24T03:44:33.765Z] End of script
23:44:34 [2020-10-24T03:44:34.020Z] Start of script
23:44:34 [2020-10-24T03:44:34.020Z] include file start
23:44:34 [2020-10-24T03:44:34.020Z] include file processed
23:44:34 [2020-10-24T03:44:34.020Z] Result of testMethod = 5
23:44:34 [2020-10-24T03:44:34.020Z] End of script
23:44:34 [2020-10-24T03:44:34.276Z] Start of script
23:44:34 [2020-10-24T03:44:34.276Z] include file start
23:44:34 [2020-10-24T03:44:34.276Z] include file processed
23:44:34 [2020-10-24T03:44:34.276Z] Result of testMethod = 5
23:44:34 [2020-10-24T03:44:34.531Z] py4j.Py4JException: An exception was raised by the Python Proxy. Return Message: x
23:44:34 [2020-10-24T03:44:34.531Z] 	at py4j.Protocol.getReturnValue(Protocol.java:438)
23:44:34 [2020-10-24T03:44:34.531Z] 	at py4j.reflection.PythonProxyHandler.invoke(PythonProxyHandler.java:105)
23:44:34 [2020-10-24T03:44:34.531Z] 	at com.sun.proxy.$Proxy18.run(Unknown Source)
23:44:34 [2020-10-24T03:44:34.531Z] 	at org.eclipse.ease.lang.python.py4j.internal.Py4jDebugger.execute(Py4jDebugger.java:106)
23:44:34 [2020-10-24T03:44:34.531Z] 	at org.eclipse.ease.lang.python.py4j.internal.Py4jDebuggerEngine.internalExecute(Py4jDebuggerEngine.java:85)
23:44:34 [2020-10-24T03:44:34.532Z] 	at org.eclipse.ease.lang.python.py4j.internal.Py4jScriptEngine.execute(Py4jScriptEngine.java:226)
23:44:34 [2020-10-24T03:44:34.532Z] 	at org.eclipse.ease.AbstractScriptEngine.inject(AbstractScriptEngine.java:224)
23:44:34 [2020-10-24T03:44:34.532Z] 	at org.eclipse.ease.AbstractScriptEngine.run(AbstractScriptEngine.java:274)
23:44:34 [2020-10-24T03:44:34.532Z] 	at org.eclipse.core.internal.jobs.Worker.run(Worker.java:63)
23:44:34 [2020-10-24T03:44:34.787Z] Start of script
23:44:34 [2020-10-24T03:44:34.787Z] include file start
23:44:34 [2020-10-24T03:44:34.787Z] include file processed
23:44:34 [2020-10-24T03:44:34.787Z] Result of testMethod = 5
23:44:34 [2020-10-24T03:44:34.787Z] End of script
23:44:35 [2020-10-24T03:44:35.042Z] py4j.Py4JException: An exception was raised by the Python Proxy. Return Message: x
23:44:35 [2020-10-24T03:44:35.042Z] 	at py4j.Protocol.getReturnValue(Protocol.java:438)
23:44:35 [2020-10-24T03:44:35.042Z] 	at py4j.reflection.PythonProxyHandler.invoke(PythonProxyHandler.java:105)
23:44:35 [2020-10-24T03:44:35.042Z] 	at com.sun.proxy.$Proxy18.run(Unknown Source)
23:44:35 [2020-10-24T03:44:35.042Z] 	at org.eclipse.ease.lang.python.py4j.internal.Py4jDebugger.execute(Py4jDebugger.java:106)
23:44:35 [2020-10-24T03:44:35.042Z] 	at org.eclipse.ease.lang.python.py4j.internal.Py4jDebuggerEngine.internalExecute(Py4jDebuggerEngine.java:85)
23:44:35 [2020-10-24T03:44:35.042Z] 	at org.eclipse.ease.lang.python.py4j.internal.Py4jScriptEngine.execute(Py4jScriptEngine.java:226)
23:44:35 [2020-10-24T03:44:35.042Z] 	at org.eclipse.ease.AbstractScriptEngine.inject(AbstractScriptEngine.java:224)
23:44:35 [2020-10-24T03:44:35.042Z] 	at org.eclipse.ease.AbstractScriptEngine.run(AbstractScriptEngine.java:274)
23:44:35 [2020-10-24T03:44:35.042Z] 	at org.eclipse.core.internal.jobs.Worker.run(Worker.java:63)
23:44:35 [2020-10-24T03:44:35.604Z] Start of script
23:44:35 [2020-10-24T03:44:35.604Z] include file start
23:44:35 [2020-10-24T03:44:35.604Z] include file processed
23:44:35 [2020-10-24T03:44:35.604Z] Result of testMethod = 5
23:44:35 [2020-10-24T03:44:35.604Z] End of script
23:44:35 [2020-10-24T03:44:35.604Z] Start of script
23:44:35 [2020-10-24T03:44:35.604Z] include file start
23:44:35 [2020-10-24T03:44:35.604Z] include file processed
23:44:35 [2020-10-24T03:44:35.859Z] Result of testMethod = 5
23:44:35 [2020-10-24T03:44:35.859Z] End of script
23:44:36 [2020-10-24T03:44:36.114Z] Start of script
23:44:36 [2020-10-24T03:44:36.114Z] include file start
23:44:36 [2020-10-24T03:44:36.114Z] include file processed
23:44:36 [2020-10-24T03:44:36.114Z] Result of testMethod = 5
23:44:36 [2020-10-24T03:44:36.114Z] End of script
23:44:36 [2020-10-24T03:44:36.369Z] Tests run: 42, Failures: 0, Errors: 0, Skipped: 4, Time elapsed: 13.573 s - in org.eclipse.ease.lang.python.py4j.Py4jDebugTest
23:44:36 [2020-10-24T03:44:36.370Z] resumeOnLastIncludeLine(org.eclipse.ease.lang.python.py4j.Py4jDebugTest) skipped
23:44:36 [2020-10-24T03:44:36.370Z] nativeArrayVariable(org.eclipse.ease.lang.python.py4j.Py4jDebugTest) skipped
23:44:36 [2020-10-24T03:44:36.370Z] stepIntoIncludeCommand(org.eclipse.ease.lang.python.py4j.Py4jDebugTest) skipped
23:44:36 [2020-10-24T03:44:36.370Z] nativeObjectVariable(org.eclipse.ease.lang.python.py4j.Py4jDebugTest) skipped
23:44:36 [2020-10-24T03:44:36.370Z] disconnectProcessInSuspendedState(org.eclipse.ease.lang.python.py4j.Py4jDebugTest)  Time elapsed: 0.414 s
23:44:36 [2020-10-24T03:44:36.370Z] stepReturnIncludeCommand(org.eclipse.ease.lang.python.py4j.Py4jDebugTest)  Time elapsed: 0.31 s
23:44:36 [2020-10-24T03:44:36.370Z] arrayVariableSorting(org.eclipse.ease.lang.python.py4j.Py4jDebugTest)  Time elapsed: 0.408 s
23:44:36 [2020-10-24T03:44:36.370Z] stepOverOnDebugTarget(org.eclipse.ease.lang.python.py4j.Py4jDebugTest)  Time elapsed: 0.409 s
23:44:36 [2020-10-24T03:44:36.370Z] hasDebugTarget(org.eclipse.ease.lang.python.py4j.Py4jDebugTest)  Time elapsed: 0.207 s
23:44:36 [2020-10-24T03:44:36.370Z] disconnectThreadInSuspendedState(org.eclipse.ease.lang.python.py4j.Py4jDebugTest)  Time elapsed: 0.209 s
23:44:36 [2020-10-24T03:44:36.370Z] stepReturnOnDebugTarget(org.eclipse.ease.lang.python.py4j.Py4jDebugTest)  Time elapsed: 0.408 s
23:44:36 [2020-10-24T03:44:36.370Z] nullVariable(org.eclipse.ease.lang.python.py4j.Py4jDebugTest)  Time elapsed: 0.409 s
23:44:36 [2020-10-24T03:44:36.370Z] stepOverOnStackFrame(org.eclipse.ease.lang.python.py4j.Py4jDebugTest)  Time elapsed: 0.407 s
23:44:36 [2020-10-24T03:44:36.370Z] resumeOnDebugTarget(org.eclipse.ease.lang.python.py4j.Py4jDebugTest)  Time elapsed: 0.306 s
23:44:36 [2020-10-24T03:44:36.370Z] modifyVariableKeepingType(org.eclipse.ease.lang.python.py4j.Py4jDebugTest)  Time elapsed: 0.606 s
23:44:36 [2020-10-24T03:44:36.370Z] stepReturnOnStackFrame(org.eclipse.ease.lang.python.py4j.Py4jDebugTest)  Time elapsed: 0.41 s
23:44:36 [2020-10-24T03:44:36.370Z] terminateStackFrameInSuspendedState(org.eclipse.ease.lang.python.py4j.Py4jDebugTest)  Time elapsed: 0.309 s
23:44:36 [2020-10-24T03:44:36.370Z] breakpointLocation(org.eclipse.ease.lang.python.py4j.Py4jDebugTest)  Time elapsed: 0.308 s
23:44:36 [2020-10-24T03:44:36.370Z] stepReturnOnThread(org.eclipse.ease.lang.python.py4j.Py4jDebugTest)  Time elapsed: 0.407 s
23:44:36 [2020-10-24T03:44:36.370Z] javaClassVariable(org.eclipse.ease.lang.python.py4j.Py4jDebugTest)  Time elapsed: 0.409 s
23:44:36 [2020-10-24T03:44:36.370Z] stepIntoOnThread(org.eclipse.ease.lang.python.py4j.Py4jDebugTest)  Time elapsed: 0.408 s
23:44:36 [2020-10-24T03:44:36.370Z] terminateThreadInSuspendedState(org.eclipse.ease.lang.python.py4j.Py4jDebugTest)  Time elapsed: 0.205 s
23:44:36 [2020-10-24T03:44:36.370Z] resumeOnThread(org.eclipse.ease.lang.python.py4j.Py4jDebugTest)  Time elapsed: 0.305 s
23:44:36 [2020-10-24T03:44:36.370Z] stepIntoOnStackFrame(org.eclipse.ease.lang.python.py4j.Py4jDebugTest)  Time elapsed: 0.407 s
23:44:36 [2020-10-24T03:44:36.370Z] terminateProcessInSuspendedState(org.eclipse.ease.lang.python.py4j.Py4jDebugTest)  Time elapsed: 0.306 s
23:44:36 [2020-10-24T03:44:36.370Z] stepOverOnProcess(org.eclipse.ease.lang.python.py4j.Py4jDebugTest)  Time elapsed: 0.407 s
23:44:36 [2020-10-24T03:44:36.370Z] disconnectDebugTargetInSuspendedState(org.eclipse.ease.lang.python.py4j.Py4jDebugTest)  Time elapsed: 0.307 s
23:44:36 [2020-10-24T03:44:36.370Z] stepIntoOnProcess(org.eclipse.ease.lang.python.py4j.Py4jDebugTest)  Time elapsed: 0.406 s
23:44:36 [2020-10-24T03:44:36.370Z] terminatedState(org.eclipse.ease.lang.python.py4j.Py4jDebugTest)  Time elapsed: 0.204 s
23:44:36 [2020-10-24T03:44:36.370Z] stepOverIncludeCommand(org.eclipse.ease.lang.python.py4j.Py4jDebugTest)  Time elapsed: 0.406 s
23:44:36 [2020-10-24T03:44:36.370Z] innerScopeVariableBeforeOuterScopeVariable(org.eclipse.ease.lang.python.py4j.Py4jDebugTest)  Time elapsed: 0.405 s
23:44:36 [2020-10-24T03:44:36.370Z] primitiveStringVariable(org.eclipse.ease.lang.python.py4j.Py4jDebugTest)  Time elapsed: 0.406 s
23:44:36 [2020-10-24T03:44:36.370Z] resumeOnProcess(org.eclipse.ease.lang.python.py4j.Py4jDebugTest)  Time elapsed: 0.305 s
23:44:36 [2020-10-24T03:44:36.370Z] stepIntoOnDebugTarget(org.eclipse.ease.lang.python.py4j.Py4jDebugTest)  Time elapsed: 0.406 s
23:44:36 [2020-10-24T03:44:36.370Z] stepOverOnThread(org.eclipse.ease.lang.python.py4j.Py4jDebugTest)  Time elapsed: 0.407 s
23:44:36 [2020-10-24T03:44:36.370Z] suspendedState(org.eclipse.ease.lang.python.py4j.Py4jDebugTest)  Time elapsed: 0.306 s
23:44:36 [2020-10-24T03:44:36.370Z] primitiveDoubleVariable(org.eclipse.ease.lang.python.py4j.Py4jDebugTest)  Time elapsed: 0.405 s
23:44:36 [2020-10-24T03:44:36.370Z] resumeOnStackFrame(org.eclipse.ease.lang.python.py4j.Py4jDebugTest)  Time elapsed: 0.305 s
23:44:36 [2020-10-24T03:44:36.370Z] terminateDebugTargetInSuspendedState(org.eclipse.ease.lang.python.py4j.Py4jDebugTest)  Time elapsed: 0.305 s
23:44:36 [2020-10-24T03:44:36.370Z] disconnectStackFrameInSuspendedState(org.eclipse.ease.lang.python.py4j.Py4jDebugTest)  Time elapsed: 0.306 s
23:44:36 [2020-10-24T03:44:36.370Z] stepReturnOnProcess(org.eclipse.ease.lang.python.py4j.Py4jDebugTest)  Time elapsed: 0.406 s
23:44:36 [2020-10-24T03:44:36.370Z] evaluateWatchExpression(org.eclipse.ease.lang.python.py4j.Py4jDebugTest)  Time elapsed: 0.308 s
23:44:36 [2020-10-24T03:44:36.370Z] Running org.eclipse.ease.lang.python.py4j.StartStopTest
23:44:36 [2020-10-24T03:44:36.370Z] ----------------------------------------------
23:44:36 [2020-10-24T03:44:36.370Z] Starting test: startStop(org.eclipse.ease.lang.python.py4j.StartStopTest)
23:44:36 [2020-10-24T03:44:36.370Z] 
23:44:36 [2020-10-24T03:44:36.370Z] Finished test: startStop(org.eclipse.ease.lang.python.py4j.StartStopTest)
23:44:36 [2020-10-24T03:44:36.370Z] ----------------------------------------------
23:44:36 [2020-10-24T03:44:36.370Z] ----------------------------------------------
23:44:36 [2020-10-24T03:44:36.370Z] Starting test: startStopShellNoBootstrap(org.eclipse.ease.lang.python.py4j.StartStopTest)
23:44:36 [2020-10-24T03:44:36.625Z] 
23:44:36 [2020-10-24T03:44:36.625Z] Finished test: startStopShellNoBootstrap(org.eclipse.ease.lang.python.py4j.StartStopTest)
23:44:36 [2020-10-24T03:44:36.625Z] ----------------------------------------------
23:44:36 [2020-10-24T03:44:36.625Z] ----------------------------------------------
23:44:36 [2020-10-24T03:44:36.625Z] Starting test: multiStartStop(org.eclipse.ease.lang.python.py4j.StartStopTest)
23:44:36 [2020-10-24T03:44:36.881Z] 
23:44:36 [2020-10-24T03:44:36.881Z] Finished test: multiStartStop(org.eclipse.ease.lang.python.py4j.StartStopTest)
23:44:36 [2020-10-24T03:44:36.881Z] ----------------------------------------------
23:44:36 [2020-10-24T03:44:36.881Z] Tests run: 3, Failures: 0, Errors: 0, Skipped: 0, Time elapsed: 0.605 s - in org.eclipse.ease.lang.python.py4j.StartStopTest
23:44:36 [2020-10-24T03:44:36.881Z] startStop(org.eclipse.ease.lang.python.py4j.StartStopTest)  Time elapsed: 0.201 s
23:44:36 [2020-10-24T03:44:36.881Z] startStopShellNoBootstrap(org.eclipse.ease.lang.python.py4j.StartStopTest)  Time elapsed: 0.201 s
23:44:36 [2020-10-24T03:44:36.881Z] multiStartStop(org.eclipse.ease.lang.python.py4j.StartStopTest)  Time elapsed: 0.202 s
23:44:36 [2020-10-24T03:44:36.881Z] Running org.eclipse.ease.lang.python.py4j.Py4JPep302ModuleLoadingTest
23:44:37 [2020-10-24T03:44:37.136Z] org.eclipse.ease.ScriptExecutionException: Traceback (most recent call last):
23:44:37 [2020-10-24T03:44:37.136Z]   File "<...>", line 1, in <module>
23:44:37 [2020-10-24T03:44:37.136Z]   File "<...>", line 81, in load_module
23:44:37 [2020-10-24T03:44:37.136Z] ImportError: No EASE module named 'eclipse.test.notthere'
23:44:37 [2020-10-24T03:44:37.136Z] 
23:44:37 [2020-10-24T03:44:37.391Z] Tests run: 8, Failures: 0, Errors: 0, Skipped: 0, Time elapsed: 0.452 s - in org.eclipse.ease.lang.python.py4j.Py4JPep302ModuleLoadingTest
23:44:37 [2020-10-24T03:44:37.391Z] loadSimpleModule(org.eclipse.ease.lang.python.py4j.Py4JPep302ModuleLoadingTest)  Time elapsed: 0.059 s
23:44:37 [2020-10-24T03:44:37.391Z] loadModuleWithDependencies(org.eclipse.ease.lang.python.py4j.Py4JPep302ModuleLoadingTest)  Time elapsed: 0.054 s
23:44:37 [2020-10-24T03:44:37.391Z] accessAdvancedModule(org.eclipse.ease.lang.python.py4j.Py4JPep302ModuleLoadingTest)  Time elapsed: 0.057 s
23:44:37 [2020-10-24T03:44:37.391Z] importAs(org.eclipse.ease.lang.python.py4j.Py4JPep302ModuleLoadingTest)  Time elapsed: 0.055 s
23:44:37 [2020-10-24T03:44:37.391Z] fromBasicImportMethod(org.eclipse.ease.lang.python.py4j.Py4JPep302ModuleLoadingTest)  Time elapsed: 0.055 s
23:44:37 [2020-10-24T03:44:37.391Z] loadNotExistingModule(org.eclipse.ease.lang.python.py4j.Py4JPep302ModuleLoadingTest)  Time elapsed: 0.054 s
23:44:37 [2020-10-24T03:44:37.391Z] fromBasicImportAll(org.eclipse.ease.lang.python.py4j.Py4JPep302ModuleLoadingTest)  Time elapsed: 0.059 s
23:44:37 [2020-10-24T03:44:37.391Z] accessModule(org.eclipse.ease.lang.python.py4j.Py4JPep302ModuleLoadingTest)  Time elapsed: 0.059 s
23:44:37 [2020-10-24T03:44:37.391Z] 
23:44:37 [2020-10-24T03:44:37.391Z] Results:
23:44:37 [2020-10-24T03:44:37.391Z] 
23:44:37 [2020-10-24T03:44:37.391Z] Tests run: 120, Failures: 0, Errors: 0, Skipped: 13
23:44:37 [2020-10-24T03:44:37.391Z] 
23:44:37 [2020-10-24T03:44:37.953Z] [INFO] All tests passed!
23:44:37 [2020-10-24T03:44:37.953Z] [INFO] 
23:44:37 [2020-10-24T03:44:37.953Z] [INFO] -----< org.eclipse.ease:org.eclipse.ease.lang.scriptarchive.test >------
23:44:37 [2020-10-24T03:44:37.953Z] [INFO] Building org.eclipse.ease.lang.scriptarchive.test 0.8.0-SNAPSHOT [10/11]
23:44:37 [2020-10-24T03:44:37.953Z] [INFO] ------------------------[ eclipse-test-plugin ]-------------------------
23:44:37 [2020-10-24T03:44:37.953Z] [INFO] 
23:44:37 [2020-10-24T03:44:37.953Z] [INFO] --- tycho-packaging-plugin:1.5.0:build-qualifier (default-build-qualifier) @ org.eclipse.ease.lang.scriptarchive.test ---
23:44:37 [2020-10-24T03:44:37.953Z] [INFO] The project's OSGi version is 0.8.0.I201910171213
23:44:37 [2020-10-24T03:44:37.953Z] [INFO] 
23:44:37 [2020-10-24T03:44:37.953Z] [INFO] --- tycho-packaging-plugin:1.5.0:validate-id (default-validate-id) @ org.eclipse.ease.lang.scriptarchive.test ---
23:44:37 [2020-10-24T03:44:37.953Z] [INFO] 
23:44:37 [2020-10-24T03:44:37.953Z] [INFO] --- tycho-packaging-plugin:1.5.0:validate-version (default-validate-version) @ org.eclipse.ease.lang.scriptarchive.test ---
23:44:37 [2020-10-24T03:44:37.953Z] [INFO] 
23:44:37 [2020-10-24T03:44:37.953Z] [INFO] --- maven-resources-plugin:2.4.3:resources (default-resources) @ org.eclipse.ease.lang.scriptarchive.test ---
23:44:37 [2020-10-24T03:44:37.953Z] [INFO] Using 'UTF-8' encoding to copy filtered resources.
23:44:37 [2020-10-24T03:44:37.953Z] [INFO] skip non existing resourceDirectory /home/jenkins/agent/workspace/ease.verify.core.target.2018-12/tests/org.eclipse.ease.lang.scriptarchive.test/src/main/resources
23:44:37 [2020-10-24T03:44:37.953Z] [INFO] 
23:44:37 [2020-10-24T03:44:37.953Z] [INFO] --- tycho-compiler-plugin:1.5.0:compile (default-compile) @ org.eclipse.ease.lang.scriptarchive.test ---
23:44:37 [2020-10-24T03:44:37.953Z] [INFO] Nothing to compile - all classes are up to date
23:44:37 [2020-10-24T03:44:37.953Z] [INFO] 
23:44:37 [2020-10-24T03:44:37.953Z] [INFO] --- maven-resources-plugin:2.4.3:testResources (default-testResources) @ org.eclipse.ease.lang.scriptarchive.test ---
23:44:37 [2020-10-24T03:44:37.953Z] [INFO] Using 'UTF-8' encoding to copy filtered resources.
23:44:37 [2020-10-24T03:44:37.953Z] [INFO] skip non existing resourceDirectory /home/jenkins/agent/workspace/ease.verify.core.target.2018-12/tests/org.eclipse.ease.lang.scriptarchive.test/src/test/resources
23:44:37 [2020-10-24T03:44:37.953Z] [INFO] 
23:44:37 [2020-10-24T03:44:37.953Z] [INFO] --- tycho-source-plugin:1.5.0:plugin-source (plugin-source) @ org.eclipse.ease.lang.scriptarchive.test ---
23:44:37 [2020-10-24T03:44:37.953Z] [INFO] Building jar: /home/jenkins/agent/workspace/ease.verify.core.target.2018-12/tests/org.eclipse.ease.lang.scriptarchive.test/target/org.eclipse.ease.lang.scriptarchive.test-0.8.0-SNAPSHOT-sources.jar
23:44:37 [2020-10-24T03:44:37.953Z] [INFO] 
23:44:37 [2020-10-24T03:44:37.953Z] [INFO] --- target-platform-configuration:1.5.0:target-platform (default-target-platform) @ org.eclipse.ease.lang.scriptarchive.test ---
23:44:37 [2020-10-24T03:44:37.953Z] [INFO] 
23:44:37 [2020-10-24T03:44:37.953Z] [INFO] --- tycho-packaging-plugin:1.5.0:package-plugin (default-package-plugin) @ org.eclipse.ease.lang.scriptarchive.test ---
23:44:37 [2020-10-24T03:44:37.953Z] [INFO] Building jar: /home/jenkins/agent/workspace/ease.verify.core.target.2018-12/tests/org.eclipse.ease.lang.scriptarchive.test/target/org.eclipse.ease.lang.scriptarchive.test-0.8.0-SNAPSHOT.jar
23:44:37 [2020-10-24T03:44:37.953Z] [INFO] 
23:44:37 [2020-10-24T03:44:37.953Z] [INFO] --- tycho-p2-plugin:1.5.0:p2-metadata-default (default-p2-metadata-default) @ org.eclipse.ease.lang.scriptarchive.test ---
23:44:37 [2020-10-24T03:44:37.953Z] [INFO] 
23:44:37 [2020-10-24T03:44:37.953Z] [INFO] --- tycho-source-feature-plugin:1.5.0:source-feature (source-feature) @ org.eclipse.ease.lang.scriptarchive.test ---
23:44:37 [2020-10-24T03:44:37.953Z] [INFO] 
23:44:37 [2020-10-24T03:44:37.954Z] [INFO] --- tycho-p2-plugin:1.5.0:p2-metadata (attached-p2-metadata) @ org.eclipse.ease.lang.scriptarchive.test ---
23:44:37 [2020-10-24T03:44:37.954Z] [INFO] 
23:44:37 [2020-10-24T03:44:37.954Z] [INFO] --- tycho-surefire-plugin:1.5.0:test (default-test) @ org.eclipse.ease.lang.scriptarchive.test ---
23:44:38 [2020-10-24T03:44:38.208Z] [INFO] Expected eclipse log file: /home/jenkins/agent/workspace/ease.verify.core.target.2018-12/tests/org.eclipse.ease.lang.scriptarchive.test/target/work/data/.metadata/.log
23:44:38 [2020-10-24T03:44:38.209Z] [INFO] Command line:
23:44:38 [2020-10-24T03:44:38.209Z] 	[/opt/tools/java/openjdk/jdk-11/11.0.2+9/bin/java, -Dosgi.noShutdown=false, -Dosgi.os=linux, -Dosgi.ws=gtk, -Dosgi.arch=x86_64, -Dosgi.clean=true, -jar, /home/jenkins/.m2/repository/p2/osgi/bundle/org.eclipse.equinox.launcher/1.5.200.v20180922-1751/org.eclipse.equinox.launcher-1.5.200.v20180922-1751.jar, -data, /home/jenkins/agent/workspace/ease.verify.core.target.2018-12/tests/org.eclipse.ease.lang.scriptarchive.test/target/work/data, -install, /home/jenkins/agent/workspace/ease.verify.core.target.2018-12/tests/org.eclipse.ease.lang.scriptarchive.test/target/work, -configuration, /home/jenkins/agent/workspace/ease.verify.core.target.2018-12/tests/org.eclipse.ease.lang.scriptarchive.test/target/work/configuration, -application, org.eclipse.tycho.surefire.osgibooter.headlesstest, -testproperties, /home/jenkins/agent/workspace/ease.verify.core.target.2018-12/tests/org.eclipse.ease.lang.scriptarchive.test/target/surefire.properties]
23:44:38 [2020-10-24T03:44:38.209Z] Picked up JAVA_TOOL_OPTIONS: -Dmaven.ext.class.path="/home/jenkins/agent/workspace/ease.verify.core.target.2018-12@tmp/withMaven402b50fb/pipeline-maven-spy.jar" -Dorg.jenkinsci.plugins.pipeline.maven.reportsFolder="/home/jenkins/agent/workspace/ease.verify.core.target.2018-12@tmp/withMaven402b50fb" 
23:44:40 [2020-10-24T03:44:40.126Z] Running org.eclipse.ease.lang.scriptarchive.ArchiveEngineTest
23:44:40 [2020-10-24T03:44:40.395Z] We are running from a zip file!
23:44:40 [2020-10-24T03:44:40.395Z] org.eclipse.ease.ScriptExecutionException: SyntaxError: missing ; before statement (workspace://__EASE_ScriptArchive_1/scripts/Master.js#3)
23:44:40 [2020-10-24T03:44:40.395Z] this is an error
23:44:40 [2020-10-24T03:44:40.395Z]        ^
23:44:40 [2020-10-24T03:44:40.395Z] 	at Master.js,workspace://__EASE_ScriptArchive_1/scripts/Master.js
23:44:40 [2020-10-24T03:44:40.395Z] org.eclipse.ease.ScriptExecutionException: SyntaxError: missing ; before statement (workspace://__EASE_ScriptArchive_1/scripts/Master.js#3)
23:44:40 [2020-10-24T03:44:40.395Z] this is an error
23:44:40 [2020-10-24T03:44:40.395Z]        ^
23:44:40 [2020-10-24T03:44:40.395Z] 	at Master.js,workspace://__EASE_ScriptArchive_1/scripts/Master.js
23:44:40 [2020-10-24T03:44:40.395Z] Tests run: 7, Failures: 0, Errors: 0, Skipped: 0, Time elapsed: 0.47 s - in org.eclipse.ease.lang.scriptarchive.ArchiveEngineTest
23:44:40 [2020-10-24T03:44:40.395Z] executeWithManifest(org.eclipse.ease.lang.scriptarchive.ArchiveEngineTest)  Time elapsed: 0.304 s
23:44:40 [2020-10-24T03:44:40.395Z] zipFileRegistration(org.eclipse.ease.lang.scriptarchive.ArchiveEngineTest)  Time elapsed: 0.005 s
23:44:40 [2020-10-24T03:44:40.395Z] engineIdRegistration(org.eclipse.ease.lang.scriptarchive.ArchiveEngineTest)  Time elapsed: 0 s
23:44:40 [2020-10-24T03:44:40.395Z] jarFileRegistration(org.eclipse.ease.lang.scriptarchive.ArchiveEngineTest)  Time elapsed: 0 s
23:44:40 [2020-10-24T03:44:40.395Z] sarFileRegistration(org.eclipse.ease.lang.scriptarchive.ArchiveEngineTest)  Time elapsed: 0 s
23:44:40 [2020-10-24T03:44:40.395Z] executeWithErrors(org.eclipse.ease.lang.scriptarchive.ArchiveEngineTest)  Time elapsed: 0.07 s
23:44:40 [2020-10-24T03:44:40.395Z] executeWithIncludes(org.eclipse.ease.lang.scriptarchive.ArchiveEngineTest)  Time elapsed: 0.072 s
23:44:40 [2020-10-24T03:44:40.395Z] 
23:44:40 [2020-10-24T03:44:40.395Z] Results:
23:44:40 [2020-10-24T03:44:40.395Z] 
23:44:40 [2020-10-24T03:44:40.395Z] Tests run: 7, Failures: 0, Errors: 0, Skipped: 0
23:44:40 [2020-10-24T03:44:40.395Z] 
23:44:40 [2020-10-24T03:44:40.957Z] [INFO] All tests passed!
23:44:40 [2020-10-24T03:44:40.957Z] [INFO] 
23:44:40 [2020-10-24T03:44:40.957Z] [INFO] -------------< org.eclipse.ease:org.eclipse.ease.ui.test >--------------
23:44:40 [2020-10-24T03:44:40.957Z] [INFO] Building org.eclipse.ease.ui.test 0.8.0-SNAPSHOT                 [11/11]
23:44:40 [2020-10-24T03:44:40.957Z] [INFO] ------------------------[ eclipse-test-plugin ]-------------------------
23:44:40 [2020-10-24T03:44:40.957Z] [INFO] 
23:44:40 [2020-10-24T03:44:40.957Z] [INFO] --- tycho-packaging-plugin:1.5.0:build-qualifier (default-build-qualifier) @ org.eclipse.ease.ui.test ---
23:44:40 [2020-10-24T03:44:40.957Z] [INFO] The project's OSGi version is 0.8.0.I201910171213
23:44:40 [2020-10-24T03:44:40.957Z] [INFO] 
23:44:40 [2020-10-24T03:44:40.957Z] [INFO] --- tycho-packaging-plugin:1.5.0:validate-id (default-validate-id) @ org.eclipse.ease.ui.test ---
23:44:40 [2020-10-24T03:44:40.957Z] [INFO] 
23:44:40 [2020-10-24T03:44:40.957Z] [INFO] --- tycho-packaging-plugin:1.5.0:validate-version (default-validate-version) @ org.eclipse.ease.ui.test ---
23:44:40 [2020-10-24T03:44:40.957Z] [INFO] 
23:44:40 [2020-10-24T03:44:40.957Z] [INFO] --- maven-resources-plugin:2.4.3:resources (default-resources) @ org.eclipse.ease.ui.test ---
23:44:40 [2020-10-24T03:44:40.957Z] [INFO] Using 'UTF-8' encoding to copy filtered resources.
23:44:40 [2020-10-24T03:44:40.957Z] [INFO] skip non existing resourceDirectory /home/jenkins/agent/workspace/ease.verify.core.target.2018-12/tests/org.eclipse.ease.ui.test/src/main/resources
23:44:40 [2020-10-24T03:44:40.957Z] [INFO] 
23:44:40 [2020-10-24T03:44:40.957Z] [INFO] --- tycho-compiler-plugin:1.5.0:compile (default-compile) @ org.eclipse.ease.ui.test ---
23:44:40 [2020-10-24T03:44:40.957Z] [INFO] Nothing to compile - all classes are up to date
23:44:40 [2020-10-24T03:44:40.957Z] [INFO] 
23:44:40 [2020-10-24T03:44:40.957Z] [INFO] --- maven-resources-plugin:2.4.3:testResources (default-testResources) @ org.eclipse.ease.ui.test ---
23:44:40 [2020-10-24T03:44:40.957Z] [INFO] Using 'UTF-8' encoding to copy filtered resources.
23:44:40 [2020-10-24T03:44:40.957Z] [INFO] skip non existing resourceDirectory /home/jenkins/agent/workspace/ease.verify.core.target.2018-12/tests/org.eclipse.ease.ui.test/src/test/resources
23:44:40 [2020-10-24T03:44:40.957Z] [INFO] 
23:44:40 [2020-10-24T03:44:40.957Z] [INFO] --- tycho-source-plugin:1.5.0:plugin-source (plugin-source) @ org.eclipse.ease.ui.test ---
23:44:40 [2020-10-24T03:44:40.957Z] [WARNING] Bundle-Vendor header not found in /home/jenkins/agent/workspace/ease.verify.core.target.2018-12/tests/org.eclipse.ease.ui.test/META-INF/MANIFEST.MF, fallback to 'unknown' for source bundle
23:44:40 [2020-10-24T03:44:40.957Z] [INFO] Building jar: /home/jenkins/agent/workspace/ease.verify.core.target.2018-12/tests/org.eclipse.ease.ui.test/target/org.eclipse.ease.ui.test-0.8.0-SNAPSHOT-sources.jar
23:44:40 [2020-10-24T03:44:40.957Z] [INFO] 
23:44:40 [2020-10-24T03:44:40.957Z] [INFO] --- target-platform-configuration:1.5.0:target-platform (default-target-platform) @ org.eclipse.ease.ui.test ---
23:44:40 [2020-10-24T03:44:40.957Z] [INFO] 
23:44:40 [2020-10-24T03:44:40.957Z] [INFO] --- tycho-packaging-plugin:1.5.0:package-plugin (default-package-plugin) @ org.eclipse.ease.ui.test ---
23:44:40 [2020-10-24T03:44:40.957Z] [INFO] Building jar: /home/jenkins/agent/workspace/ease.verify.core.target.2018-12/tests/org.eclipse.ease.ui.test/target/org.eclipse.ease.ui.test-0.8.0-SNAPSHOT.jar
23:44:40 [2020-10-24T03:44:40.957Z] [INFO] 
23:44:40 [2020-10-24T03:44:40.957Z] [INFO] --- tycho-p2-plugin:1.5.0:p2-metadata-default (default-p2-metadata-default) @ org.eclipse.ease.ui.test ---
23:44:40 [2020-10-24T03:44:40.957Z] [INFO] 
23:44:40 [2020-10-24T03:44:40.958Z] [INFO] --- tycho-source-feature-plugin:1.5.0:source-feature (source-feature) @ org.eclipse.ease.ui.test ---
23:44:40 [2020-10-24T03:44:40.958Z] [INFO] 
23:44:40 [2020-10-24T03:44:40.958Z] [INFO] --- tycho-p2-plugin:1.5.0:p2-metadata (attached-p2-metadata) @ org.eclipse.ease.ui.test ---
23:44:40 [2020-10-24T03:44:40.958Z] [INFO] 
23:44:40 [2020-10-24T03:44:40.958Z] [INFO] --- tycho-surefire-plugin:1.5.0:test (default-test) @ org.eclipse.ease.ui.test ---
23:44:41 [2020-10-24T03:44:41.213Z] [INFO] Expected eclipse log file: /home/jenkins/agent/workspace/ease.verify.core.target.2018-12/tests/org.eclipse.ease.ui.test/target/work/data/.metadata/.log
23:44:41 [2020-10-24T03:44:41.213Z] [INFO] Command line:
23:44:41 [2020-10-24T03:44:41.213Z] 	[/opt/tools/java/openjdk/jdk-11/11.0.2+9/bin/java, -Dosgi.noShutdown=false, -Dosgi.os=linux, -Dosgi.ws=gtk, -Dosgi.arch=x86_64, -Dosgi.clean=true, -jar, /home/jenkins/.m2/repository/p2/osgi/bundle/org.eclipse.equinox.launcher/1.5.200.v20180922-1751/org.eclipse.equinox.launcher-1.5.200.v20180922-1751.jar, -data, /home/jenkins/agent/workspace/ease.verify.core.target.2018-12/tests/org.eclipse.ease.ui.test/target/work/data, -install, /home/jenkins/agent/workspace/ease.verify.core.target.2018-12/tests/org.eclipse.ease.ui.test/target/work, -configuration, /home/jenkins/agent/workspace/ease.verify.core.target.2018-12/tests/org.eclipse.ease.ui.test/target/work/configuration, -application, org.eclipse.tycho.surefire.osgibooter.headlesstest, -testproperties, /home/jenkins/agent/workspace/ease.verify.core.target.2018-12/tests/org.eclipse.ease.ui.test/target/surefire.properties]
23:44:41 [2020-10-24T03:44:41.213Z] Picked up JAVA_TOOL_OPTIONS: -Dmaven.ext.class.path="/home/jenkins/agent/workspace/ease.verify.core.target.2018-12@tmp/withMaven402b50fb/pipeline-maven-spy.jar" -Dorg.jenkinsci.plugins.pipeline.maven.reportsFolder="/home/jenkins/agent/workspace/ease.verify.core.target.2018-12@tmp/withMaven402b50fb" 
23:44:43 [2020-10-24T03:44:43.129Z] Running org.eclipse.ease.ui.completions.java.provider.JavaClassCompletionsProviderTest
23:44:43 [2020-10-24T03:44:43.129Z] WARNING: An illegal reflective access operation has occurred
23:44:43 [2020-10-24T03:44:43.129Z] WARNING: Illegal reflective access by org.mockito.cglib.core.ReflectUtils$2 (file:/home/jenkins/.m2/repository/p2/osgi/bundle/org.mockito/1.9.5.v201605172210/org.mockito-1.9.5.v201605172210.jar) to method java.lang.ClassLoader.defineClass(java.lang.String,byte[],int,int,java.security.ProtectionDomain)
23:44:43 [2020-10-24T03:44:43.129Z] WARNING: Please consider reporting this to the maintainers of org.mockito.cglib.core.ReflectUtils$2
23:44:43 [2020-10-24T03:44:43.129Z] WARNING: Use --illegal-access=warn to enable warnings of further illegal reflective access operations
23:44:43 [2020-10-24T03:44:43.129Z] WARNING: All illegal access operations will be denied in a future release
23:44:49 [2020-10-24T03:44:49.684Z] Tests run: 6, Failures: 0, Errors: 0, Skipped: 0, Time elapsed: 6.062 s - in org.eclipse.ease.ui.completions.java.provider.JavaClassCompletionsProviderTest
23:44:49 [2020-10-24T03:44:49.684Z] containsPackageFileCompletion(org.eclipse.ease.ui.completions.java.provider.JavaClassCompletionsProviderTest)  Time elapsed: 0.131 s
23:44:49 [2020-10-24T03:44:49.684Z] containsGlobalFileCompletion(org.eclipse.ease.ui.completions.java.provider.JavaClassCompletionsProviderTest)  Time elapsed: 0.13 s
23:44:49 [2020-10-24T03:44:49.684Z] containsJavaLangPackageProposal(org.eclipse.ease.ui.completions.java.provider.JavaClassCompletionsProviderTest)  Time elapsed: 0.25 s
23:44:49 [2020-10-24T03:44:49.684Z] containsOrgRootPackageProposal(org.eclipse.ease.ui.completions.java.provider.JavaClassCompletionsProviderTest)  Time elapsed: 0.018 s
23:44:49 [2020-10-24T03:44:49.685Z] containsJavaRootPackageProposal(org.eclipse.ease.ui.completions.java.provider.JavaClassCompletionsProviderTest)  Time elapsed: 0.009 s
23:44:49 [2020-10-24T03:44:49.685Z] containsOrgEclipsePackageProposal(org.eclipse.ease.ui.completions.java.provider.JavaClassCompletionsProviderTest)  Time elapsed: 0.097 s
23:44:49 [2020-10-24T03:44:49.685Z] Running org.eclipse.ease.ui.completions.java.provider.JavaPackagesCompletionsProviderTest
23:44:54 [2020-10-24T03:44:54.926Z] Tests run: 4, Failures: 0, Errors: 0, Skipped: 0, Time elapsed: 5.139 s - in org.eclipse.ease.ui.completions.java.provider.JavaPackagesCompletionsProviderTest
23:44:54 [2020-10-24T03:44:54.926Z] containsJavaLangPackageProposal(org.eclipse.ease.ui.completions.java.provider.JavaPackagesCompletionsProviderTest)  Time elapsed: 0.072 s
23:44:54 [2020-10-24T03:44:54.926Z] containsOrgRootPackageProposal(org.eclipse.ease.ui.completions.java.provider.JavaPackagesCompletionsProviderTest)  Time elapsed: 0.007 s
23:44:54 [2020-10-24T03:44:54.926Z] containsJavaRootPackageProposal(org.eclipse.ease.ui.completions.java.provider.JavaPackagesCompletionsProviderTest)  Time elapsed: 0.007 s
23:44:54 [2020-10-24T03:44:54.926Z] containsOrgEclipsePackageProposal(org.eclipse.ease.ui.completions.java.provider.JavaPackagesCompletionsProviderTest)  Time elapsed: 0.044 s
23:44:54 [2020-10-24T03:44:54.926Z] Running org.eclipse.ease.ui.help.hovers.ModuleHelpTest
23:44:54 [2020-10-24T03:44:54.926Z] Tests run: 4, Failures: 0, Errors: 0, Skipped: 4, Time elapsed: 0.002 s - in org.eclipse.ease.ui.help.hovers.ModuleHelpTest
23:44:54 [2020-10-24T03:44:54.926Z] getModuleHelpLocation(org.eclipse.ease.ui.help.hovers.ModuleHelpTest) skipped
23:44:54 [2020-10-24T03:44:54.926Z] getModuleHelp(org.eclipse.ease.ui.help.hovers.ModuleHelpTest) skipped
23:44:54 [2020-10-24T03:44:54.926Z] getMethodHelp(org.eclipse.ease.ui.help.hovers.ModuleHelpTest) skipped
23:44:54 [2020-10-24T03:44:54.926Z] getConstantHelp(org.eclipse.ease.ui.help.hovers.ModuleHelpTest) skipped
23:44:54 [2020-10-24T03:44:54.926Z] Running org.eclipse.ease.ui.completion.CompletionContextTest
23:44:54 [2020-10-24T03:44:54.926Z] Tests run: 9, Failures: 0, Errors: 0, Skipped: 0, Time elapsed: 0.006 s - in org.eclipse.ease.ui.completion.CompletionContextTest
23:44:54 [2020-10-24T03:44:54.926Z] resolveStaticClass(org.eclipse.ease.ui.completion.CompletionContextTest)  Time elapsed: 0.002 s
23:44:54 [2020-10-24T03:44:54.926Z] resolveClassWithFilter(org.eclipse.ease.ui.completion.CompletionContextTest)  Time elapsed: 0 s
23:44:54 [2020-10-24T03:44:54.926Z] simplifyCalls(org.eclipse.ease.ui.completion.CompletionContextTest)  Time elapsed: 0 s
23:44:54 [2020-10-24T03:44:54.926Z] resolveClass(org.eclipse.ease.ui.completion.CompletionContextTest)  Time elapsed: 0 s
23:44:54 [2020-10-24T03:44:54.926Z] replaceEscapedStringLiterals(org.eclipse.ease.ui.completion.CompletionContextTest)  Time elapsed: 0 s
23:44:54 [2020-10-24T03:44:54.926Z] replaceSimpleStringLiterals(org.eclipse.ease.ui.completion.CompletionContextTest)  Time elapsed: 0 s
23:44:54 [2020-10-24T03:44:54.926Z] resolveStaticClassWithFilter(org.eclipse.ease.ui.completion.CompletionContextTest)  Time elapsed: 0 s
23:44:54 [2020-10-24T03:44:54.926Z] resolveClassWithParameters(org.eclipse.ease.ui.completion.CompletionContextTest)  Time elapsed: 0.001 s
23:44:54 [2020-10-24T03:44:54.926Z] replaceMultipleStringLiterals(org.eclipse.ease.ui.completion.CompletionContextTest)  Time elapsed: 0 s
23:44:54 [2020-10-24T03:44:54.926Z] Running org.eclipse.ease.ui.completion.provider.AbstractFileLocationCompletionProviderTest
23:44:54 [2020-10-24T03:44:54.926Z] Tests run: 8, Failures: 0, Errors: 0, Skipped: 8, Time elapsed: 0.002 s - in org.eclipse.ease.ui.completion.provider.AbstractFileLocationCompletionProviderTest
23:44:54 [2020-10-24T03:44:54.926Z] workspaceProjectProposals(org.eclipse.ease.ui.completion.provider.AbstractFileLocationCompletionProviderTest) skipped
23:44:54 [2020-10-24T03:44:54.926Z] checkOperatingSystem(org.eclipse.ease.ui.completion.provider.AbstractFileLocationCompletionProviderTest) skipped
23:44:54 [2020-10-24T03:44:54.926Z] absoluteRootWorkspaceProposals(org.eclipse.ease.ui.completion.provider.AbstractFileLocationCompletionProviderTest) skipped
23:44:54 [2020-10-24T03:44:54.926Z] workspaceFolderProposals(org.eclipse.ease.ui.completion.provider.AbstractFileLocationCompletionProviderTest) skipped
23:44:54 [2020-10-24T03:44:54.926Z] fileSystemFolderProposals(org.eclipse.ease.ui.completion.provider.AbstractFileLocationCompletionProviderTest) skipped
23:44:54 [2020-10-24T03:44:54.926Z] workspaceProposals(org.eclipse.ease.ui.completion.provider.AbstractFileLocationCompletionProviderTest) skipped
23:44:54 [2020-10-24T03:44:54.926Z] relativeRootWorkspaceProposals(org.eclipse.ease.ui.completion.provider.AbstractFileLocationCompletionProviderTest) skipped
23:44:54 [2020-10-24T03:44:54.926Z] fileSystemRootProposals(org.eclipse.ease.ui.completion.provider.AbstractFileLocationCompletionProviderTest) skipped
23:44:54 [2020-10-24T03:44:54.926Z] 
23:44:54 [2020-10-24T03:44:54.926Z] Results:
23:44:54 [2020-10-24T03:44:54.926Z] 
23:44:54 [2020-10-24T03:44:54.926Z] Tests run: 31, Failures: 0, Errors: 0, Skipped: 12
23:44:54 [2020-10-24T03:44:54.926Z] 
23:44:54 [2020-10-24T03:44:54.926Z] [INFO] All tests passed!
23:44:54 [2020-10-24T03:44:54.927Z] [INFO] ------------------------------------------------------------------------
23:44:54 [2020-10-24T03:44:54.927Z] [INFO] Reactor Summary for org.eclipse.ease.releng 0.8.0-SNAPSHOT:
23:44:54 [2020-10-24T03:44:54.927Z] [INFO] 
23:44:54 [2020-10-24T03:44:54.927Z] [INFO] org.eclipse.ease.releng ............................ SUCCESS [  0.002 s]
23:44:54 [2020-10-24T03:44:54.927Z] [INFO] org.eclipse.ease.releng.target ..................... SUCCESS [  0.202 s]
23:44:54 [2020-10-24T03:44:54.927Z] [INFO] org.eclipse.ease.test .............................. SUCCESS [ 17.216 s]
23:44:54 [2020-10-24T03:44:54.927Z] [INFO] org.eclipse.ease.lang.javascript.nashorn.test ...... SUCCESS [  3.259 s]
23:44:54 [2020-10-24T03:44:54.927Z] [INFO] org.eclipse.ease.lang.javascript.rhino.test ........ SUCCESS [ 14.305 s]
23:44:54 [2020-10-24T03:44:54.927Z] [INFO] org.eclipse.ease.lang.javascript.test .............. SUCCESS [  2.750 s]
23:44:54 [2020-10-24T03:44:54.927Z] [INFO] org.eclipse.ease.lang.python.test .................. SUCCESS [  2.330 s]
23:44:54 [2020-10-24T03:44:54.927Z] [INFO] org.eclipse.ease.lang.python.jython.test ........... SUCCESS [ 15.751 s]
23:44:54 [2020-10-24T03:44:54.927Z] [INFO] org.eclipse.ease.lang.python.py4j.test ............. SUCCESS [ 31.379 s]
23:44:54 [2020-10-24T03:44:54.927Z] [INFO] org.eclipse.ease.lang.scriptarchive.test ........... SUCCESS [  2.933 s]
23:44:54 [2020-10-24T03:44:54.927Z] [INFO] org.eclipse.ease.ui.test ........................... SUCCESS [ 14.134 s]
23:44:54 [2020-10-24T03:44:54.927Z] [INFO] ------------------------------------------------------------------------
23:44:54 [2020-10-24T03:44:54.927Z] [INFO] BUILD SUCCESS
23:44:54 [2020-10-24T03:44:54.927Z] [INFO] ------------------------------------------------------------------------
23:44:54 [2020-10-24T03:44:54.927Z] [INFO] Total time:  02:30 min
23:44:54 [2020-10-24T03:44:54.927Z] [INFO] Finished at: 2020-10-24T03:44:54Z
23:44:54 [2020-10-24T03:44:54.927Z] [INFO] ------------------------------------------------------------------------
23:44:54 [2020-10-24T03:44:54.927Z] [WARNING] [jenkins-event-spy] Unexpected Maven project file name 'target-tests-pom.xml', problems may occur
23:44:54 [2020-10-24T03:44:54.927Z] [INFO] [jenkins-event-spy] Generated /home/jenkins/agent/workspace/ease.verify.core.target.2018-12@tmp/withMaven402b50fb/maven-spy-20201024-034224-35210064701723638696529.log