SuccessConsole Output

Skipping 725 KB.. Full Log
vascript.test/target/surefire.properties]
23:40:39 [2020-10-24T03:40:39.991Z] Picked up JAVA_TOOL_OPTIONS: -Dmaven.ext.class.path="/home/jenkins/agent/workspace/ease.verify.core.target.2018-12@tmp/withMavenbe6870a0/pipeline-maven-spy.jar" -Dorg.jenkinsci.plugins.pipeline.maven.reportsFolder="/home/jenkins/agent/workspace/ease.verify.core.target.2018-12@tmp/withMavenbe6870a0" 
23:40:41 [2020-10-24T03:40:41.882Z] Running org.eclipse.ease.lang.javascript.JavaScriptCodeFactoryTest
23:40:41 [2020-10-24T03:40:41.882Z] Tests run: 1, Failures: 0, Errors: 0, Skipped: 0, Time elapsed: 0.154 s - in org.eclipse.ease.lang.javascript.JavaScriptCodeFactoryTest
23:40:41 [2020-10-24T03:40:41.882Z] testCommentCreator(org.eclipse.ease.lang.javascript.JavaScriptCodeFactoryTest)  Time elapsed: 0.003 s
23:40:41 [2020-10-24T03:40:41.882Z] Running org.eclipse.ease.lang.javascript.JavaScriptCompletionContextTest
23:40:41 [2020-10-24T03:40:41.882Z] Tests run: 8, Failures: 0, Errors: 0, Skipped: 0, Time elapsed: 0.133 s - in org.eclipse.ease.lang.javascript.JavaScriptCompletionContextTest
23:40:41 [2020-10-24T03:40:41.882Z] verifyStaticClassTypes(org.eclipse.ease.lang.javascript.JavaScriptCompletionContextTest)  Time elapsed: 0.003 s
23:40:41 [2020-10-24T03:40:41.882Z] verifyClassInstanceTypes(org.eclipse.ease.lang.javascript.JavaScriptCompletionContextTest)  Time elapsed: 0.005 s
23:40:41 [2020-10-24T03:40:41.882Z] verifyTypesForScriptEngine(org.eclipse.ease.lang.javascript.JavaScriptCompletionContextTest)  Time elapsed: 0.119 s
23:40:41 [2020-10-24T03:40:41.882Z] verifyPackageTypes(org.eclipse.ease.lang.javascript.JavaScriptCompletionContextTest)  Time elapsed: 0 s
23:40:41 [2020-10-24T03:40:41.882Z] definedVariableTypes(org.eclipse.ease.lang.javascript.JavaScriptCompletionContextTest)  Time elapsed: 0.001 s
23:40:41 [2020-10-24T03:40:41.882Z] verifyStringLiteralTypes(org.eclipse.ease.lang.javascript.JavaScriptCompletionContextTest)  Time elapsed: 0 s
23:40:41 [2020-10-24T03:40:41.882Z] verifyUnknownTypes(org.eclipse.ease.lang.javascript.JavaScriptCompletionContextTest)  Time elapsed: 0 s
23:40:41 [2020-10-24T03:40:41.882Z] verifyNoneTypes(org.eclipse.ease.lang.javascript.JavaScriptCompletionContextTest)  Time elapsed: 0.001 s
23:40:41 [2020-10-24T03:40:41.882Z] 
23:40:41 [2020-10-24T03:40:41.882Z] Results:
23:40:41 [2020-10-24T03:40:41.882Z] 
23:40:41 [2020-10-24T03:40:41.882Z] Tests run: 9, Failures: 0, Errors: 0, Skipped: 0
23:40:41 [2020-10-24T03:40:41.882Z] 
23:40:42 [2020-10-24T03:40:42.444Z] [INFO] All tests passed!
23:40:42 [2020-10-24T03:40:42.444Z] [INFO] 
23:40:42 [2020-10-24T03:40:42.444Z] [INFO] --- maven-install-plugin:2.3.1:install (default-install) @ org.eclipse.ease.lang.javascript.test ---
23:40:42 [2020-10-24T03:40:42.444Z] [INFO] Installing /home/jenkins/agent/workspace/ease.verify.core.target.2018-12/tests/org.eclipse.ease.lang.javascript.test/target/org.eclipse.ease.lang.javascript.test-0.8.0-SNAPSHOT.jar to /home/jenkins/.m2/repository/org/eclipse/ease/org.eclipse.ease.lang.javascript.test/0.8.0-SNAPSHOT/org.eclipse.ease.lang.javascript.test-0.8.0-SNAPSHOT.jar
23:40:42 [2020-10-24T03:40:42.444Z] [INFO] Installing /home/jenkins/agent/workspace/ease.verify.core.target.2018-12/tests/org.eclipse.ease.lang.javascript.test/pom.xml to /home/jenkins/.m2/repository/org/eclipse/ease/org.eclipse.ease.lang.javascript.test/0.8.0-SNAPSHOT/org.eclipse.ease.lang.javascript.test-0.8.0-SNAPSHOT.pom
23:40:42 [2020-10-24T03:40:42.444Z] [INFO] Installing /home/jenkins/agent/workspace/ease.verify.core.target.2018-12/tests/org.eclipse.ease.lang.javascript.test/target/org.eclipse.ease.lang.javascript.test-0.8.0-SNAPSHOT-sources.jar to /home/jenkins/.m2/repository/org/eclipse/ease/org.eclipse.ease.lang.javascript.test/0.8.0-SNAPSHOT/org.eclipse.ease.lang.javascript.test-0.8.0-SNAPSHOT-sources.jar
23:40:42 [2020-10-24T03:40:42.444Z] [INFO] Installing /home/jenkins/agent/workspace/ease.verify.core.target.2018-12/tests/org.eclipse.ease.lang.javascript.test/target/p2content.xml to /home/jenkins/.m2/repository/org/eclipse/ease/org.eclipse.ease.lang.javascript.test/0.8.0-SNAPSHOT/org.eclipse.ease.lang.javascript.test-0.8.0-SNAPSHOT-p2metadata.xml
23:40:42 [2020-10-24T03:40:42.444Z] [INFO] Installing /home/jenkins/agent/workspace/ease.verify.core.target.2018-12/tests/org.eclipse.ease.lang.javascript.test/target/p2artifacts.xml to /home/jenkins/.m2/repository/org/eclipse/ease/org.eclipse.ease.lang.javascript.test/0.8.0-SNAPSHOT/org.eclipse.ease.lang.javascript.test-0.8.0-SNAPSHOT-p2artifacts.xml
23:40:42 [2020-10-24T03:40:42.444Z] [INFO] Installing /home/jenkins/agent/workspace/ease.verify.core.target.2018-12/tests/org.eclipse.ease.lang.javascript.test/target/p2content.xml to /home/jenkins/.m2/repository/org/eclipse/ease/org.eclipse.ease.lang.javascript.test/0.8.0-SNAPSHOT/org.eclipse.ease.lang.javascript.test-0.8.0-SNAPSHOT-p2metadata.xml
23:40:42 [2020-10-24T03:40:42.444Z] [INFO] Installing /home/jenkins/agent/workspace/ease.verify.core.target.2018-12/tests/org.eclipse.ease.lang.javascript.test/target/p2artifacts.xml to /home/jenkins/.m2/repository/org/eclipse/ease/org.eclipse.ease.lang.javascript.test/0.8.0-SNAPSHOT/org.eclipse.ease.lang.javascript.test-0.8.0-SNAPSHOT-p2artifacts.xml
23:40:42 [2020-10-24T03:40:42.444Z] [INFO] 
23:40:42 [2020-10-24T03:40:42.444Z] [INFO] --- tycho-p2-plugin:1.5.0:update-local-index (default-update-local-index) @ org.eclipse.ease.lang.javascript.test ---
23:40:42 [2020-10-24T03:40:42.444Z] [INFO] 
23:40:42 [2020-10-24T03:40:42.444Z] [INFO] ---------< org.eclipse.ease:org.eclipse.ease.lang.python.test >---------
23:40:42 [2020-10-24T03:40:42.444Z] [INFO] Building org.eclipse.ease.lang.python.test 0.8.0-SNAPSHOT        [42/48]
23:40:42 [2020-10-24T03:40:42.444Z] [INFO] ------------------------[ eclipse-test-plugin ]-------------------------
23:40:42 [2020-10-24T03:40:42.444Z] [INFO] 
23:40:42 [2020-10-24T03:40:42.444Z] [INFO] --- maven-clean-plugin:2.5:clean (default-clean) @ org.eclipse.ease.lang.python.test ---
23:40:42 [2020-10-24T03:40:42.444Z] [INFO] 
23:40:42 [2020-10-24T03:40:42.444Z] [INFO] --- tycho-packaging-plugin:1.5.0:build-qualifier (default-build-qualifier) @ org.eclipse.ease.lang.python.test ---
23:40:42 [2020-10-24T03:40:42.444Z] [INFO] The project's OSGi version is 0.8.0.I201910171213
23:40:42 [2020-10-24T03:40:42.444Z] [INFO] 
23:40:42 [2020-10-24T03:40:42.444Z] [INFO] --- tycho-packaging-plugin:1.5.0:validate-id (default-validate-id) @ org.eclipse.ease.lang.python.test ---
23:40:42 [2020-10-24T03:40:42.445Z] [INFO] 
23:40:42 [2020-10-24T03:40:42.445Z] [INFO] --- tycho-packaging-plugin:1.5.0:validate-version (default-validate-version) @ org.eclipse.ease.lang.python.test ---
23:40:42 [2020-10-24T03:40:42.445Z] [INFO] 
23:40:42 [2020-10-24T03:40:42.445Z] [INFO] >>> maven-javadoc-plugin:2.9.1:javadoc (build-docs) > generate-sources @ org.eclipse.ease.lang.python.test >>>
23:40:42 [2020-10-24T03:40:42.445Z] [INFO] 
23:40:42 [2020-10-24T03:40:42.445Z] [INFO] --- tycho-packaging-plugin:1.5.0:build-qualifier (default-build-qualifier) @ org.eclipse.ease.lang.python.test ---
23:40:42 [2020-10-24T03:40:42.445Z] [INFO] The project's OSGi version is 0.8.0.I201910171213
23:40:42 [2020-10-24T03:40:42.445Z] [INFO] 
23:40:42 [2020-10-24T03:40:42.445Z] [INFO] --- tycho-packaging-plugin:1.5.0:validate-id (default-validate-id) @ org.eclipse.ease.lang.python.test ---
23:40:42 [2020-10-24T03:40:42.445Z] [INFO] 
23:40:42 [2020-10-24T03:40:42.445Z] [INFO] --- tycho-packaging-plugin:1.5.0:validate-version (default-validate-version) @ org.eclipse.ease.lang.python.test ---
23:40:42 [2020-10-24T03:40:42.445Z] [INFO] 
23:40:42 [2020-10-24T03:40:42.445Z] [INFO] <<< maven-javadoc-plugin:2.9.1:javadoc (build-docs) < generate-sources @ org.eclipse.ease.lang.python.test <<<
23:40:42 [2020-10-24T03:40:42.445Z] [INFO] 
23:40:42 [2020-10-24T03:40:42.445Z] [INFO] 
23:40:42 [2020-10-24T03:40:42.445Z] [INFO] --- maven-javadoc-plugin:2.9.1:javadoc (build-docs) @ org.eclipse.ease.lang.python.test ---
23:40:42 [2020-10-24T03:40:42.704Z] [ERROR] Error fetching link: http://help.eclipse.org/oxygen/topic/org.eclipse.platform.doc.isv/reference/api/package-list. Ignored it.
23:40:42 [2020-10-24T03:40:42.704Z] [ERROR] Error fetching link: https://ci.eclipse.org/ease/job/ease.build.core/JavaDoc/package-list. Ignored it.
23:40:43 [2020-10-24T03:40:43.675Z] [INFO] 
23:40:43 [2020-10-24T03:40:43.675Z] Loading source files for package org.eclipse.ease.lang.python...
23:40:43 [2020-10-24T03:40:43.675Z] Constructing Javadoc information...
23:40:43 [2020-10-24T03:40:43.675Z] WARNING: Cannot open location "/home/jenkins/agent/workspace/ease.verify.core.target.2018-12/tests/org.eclipse.ease.lang.python.test/target/javadoc-bundle-options/package-list"
23:40:43 [2020-10-24T03:40:43.675Z] No plugin definition found, skipping
23:40:43 [2020-10-24T03:40:43.675Z] No plugin definition found, skipping
23:40:43 [2020-10-24T03:40:43.675Z] [WARNING] Javadoc Warnings
23:40:43 [2020-10-24T03:40:43.675Z] [WARNING] Picked up JAVA_TOOL_OPTIONS: -Dmaven.ext.class.path="/home/jenkins/agent/workspace/ease.verify.core.target.2018-12@tmp/withMavenbe6870a0/pipeline-maven-spy.jar" -Dorg.jenkinsci.plugins.pipeline.maven.reportsFolder="/home/jenkins/agent/workspace/ease.verify.core.target.2018-12@tmp/withMavenbe6870a0"
23:40:43 [2020-10-24T03:40:43.675Z] [WARNING] javadoc: warning - The old Doclet and Taglet APIs in the packages
23:40:43 [2020-10-24T03:40:43.675Z] [WARNING] com.sun.javadoc, com.sun.tools.doclets and their implementations
23:40:43 [2020-10-24T03:40:43.676Z] [WARNING] are planned to be removed in a future JDK release. These
23:40:43 [2020-10-24T03:40:43.676Z] [WARNING] components have been superseded by the new APIs in jdk.javadoc.doclet.
23:40:43 [2020-10-24T03:40:43.676Z] [WARNING] Users are strongly recommended to migrate to the new APIs.
23:40:43 [2020-10-24T03:40:43.676Z] [INFO] 
23:40:43 [2020-10-24T03:40:43.676Z] [INFO] --- build-helper-maven-plugin:1.9.1:add-resource (add_help) @ org.eclipse.ease.lang.python.test ---
23:40:43 [2020-10-24T03:40:43.676Z] [INFO] 
23:40:43 [2020-10-24T03:40:43.676Z] [INFO] --- maven-resources-plugin:2.4.3:resources (default-resources) @ org.eclipse.ease.lang.python.test ---
23:40:43 [2020-10-24T03:40:43.676Z] [INFO] Using 'UTF-8' encoding to copy filtered resources.
23:40:43 [2020-10-24T03:40:43.676Z] [INFO] skip non existing resourceDirectory /home/jenkins/agent/workspace/ease.verify.core.target.2018-12/tests/org.eclipse.ease.lang.python.test/src/main/resources
23:40:43 [2020-10-24T03:40:43.676Z] [INFO] skip non existing resourceDirectory /home/jenkins/agent/workspace/ease.verify.core.target.2018-12/tests/org.eclipse.ease.lang.python.test/help
23:40:43 [2020-10-24T03:40:43.676Z] [INFO] 
23:40:43 [2020-10-24T03:40:43.676Z] [INFO] --- tycho-compiler-plugin:1.5.0:compile (default-compile) @ org.eclipse.ease.lang.python.test ---
23:40:43 [2020-10-24T03:40:43.676Z] [INFO] Compiling 1 source file to /home/jenkins/agent/workspace/ease.verify.core.target.2018-12/tests/org.eclipse.ease.lang.python.test/target/classes
23:40:43 [2020-10-24T03:40:43.945Z] [INFO] 
23:40:43 [2020-10-24T03:40:43.945Z] [INFO] --- maven-resources-plugin:2.4.3:testResources (default-testResources) @ org.eclipse.ease.lang.python.test ---
23:40:43 [2020-10-24T03:40:43.945Z] [INFO] Using 'UTF-8' encoding to copy filtered resources.
23:40:43 [2020-10-24T03:40:43.945Z] [INFO] skip non existing resourceDirectory /home/jenkins/agent/workspace/ease.verify.core.target.2018-12/tests/org.eclipse.ease.lang.python.test/src/test/resources
23:40:43 [2020-10-24T03:40:43.945Z] [INFO] 
23:40:43 [2020-10-24T03:40:43.945Z] [INFO] --- tycho-source-plugin:1.5.0:plugin-source (plugin-source) @ org.eclipse.ease.lang.python.test ---
23:40:43 [2020-10-24T03:40:43.945Z] [WARNING] Bundle-Vendor header not found in /home/jenkins/agent/workspace/ease.verify.core.target.2018-12/tests/org.eclipse.ease.lang.python.test/META-INF/MANIFEST.MF, fallback to 'unknown' for source bundle
23:40:43 [2020-10-24T03:40:43.945Z] [INFO] Building jar: /home/jenkins/agent/workspace/ease.verify.core.target.2018-12/tests/org.eclipse.ease.lang.python.test/target/org.eclipse.ease.lang.python.test-0.8.0-SNAPSHOT-sources.jar
23:40:43 [2020-10-24T03:40:43.945Z] [INFO] 
23:40:43 [2020-10-24T03:40:43.946Z] [INFO] --- target-platform-configuration:1.5.0:target-platform (default-target-platform) @ org.eclipse.ease.lang.python.test ---
23:40:43 [2020-10-24T03:40:43.946Z] [INFO] 
23:40:43 [2020-10-24T03:40:43.946Z] [INFO] --- tycho-packaging-plugin:1.5.0:package-plugin (default-package-plugin) @ org.eclipse.ease.lang.python.test ---
23:40:43 [2020-10-24T03:40:43.946Z] [INFO] Building jar: /home/jenkins/agent/workspace/ease.verify.core.target.2018-12/tests/org.eclipse.ease.lang.python.test/target/org.eclipse.ease.lang.python.test-0.8.0-SNAPSHOT.jar
23:40:43 [2020-10-24T03:40:43.946Z] [INFO] 
23:40:43 [2020-10-24T03:40:43.946Z] [INFO] --- tycho-p2-plugin:1.5.0:p2-metadata-default (default-p2-metadata-default) @ org.eclipse.ease.lang.python.test ---
23:40:43 [2020-10-24T03:40:43.946Z] [INFO] 
23:40:43 [2020-10-24T03:40:43.946Z] [INFO] --- tycho-source-feature-plugin:1.5.0:source-feature (source-feature) @ org.eclipse.ease.lang.python.test ---
23:40:43 [2020-10-24T03:40:43.946Z] [INFO] 
23:40:43 [2020-10-24T03:40:43.946Z] [INFO] --- tycho-p2-plugin:1.5.0:p2-metadata (attached-p2-metadata) @ org.eclipse.ease.lang.python.test ---
23:40:43 [2020-10-24T03:40:43.946Z] [INFO] 
23:40:43 [2020-10-24T03:40:43.946Z] [INFO] --- tycho-surefire-plugin:1.5.0:test (default-test) @ org.eclipse.ease.lang.python.test ---
23:40:44 [2020-10-24T03:40:44.254Z] [INFO] Expected eclipse log file: /home/jenkins/agent/workspace/ease.verify.core.target.2018-12/tests/org.eclipse.ease.lang.python.test/target/work/data/.metadata/.log
23:40:44 [2020-10-24T03:40:44.254Z] [INFO] Command line:
23:40:44 [2020-10-24T03:40:44.254Z] 	[/opt/tools/java/openjdk/jdk-11/11.0.2+9/bin/java, -Dosgi.noShutdown=false, -Dosgi.os=linux, -Dosgi.ws=gtk, -Dosgi.arch=x86_64, -Dosgi.clean=true, -jar, /home/jenkins/.m2/repository/p2/osgi/bundle/org.eclipse.equinox.launcher/1.5.800.v20200727-1323/org.eclipse.equinox.launcher-1.5.800.v20200727-1323.jar, -data, /home/jenkins/agent/workspace/ease.verify.core.target.2018-12/tests/org.eclipse.ease.lang.python.test/target/work/data, -install, /home/jenkins/agent/workspace/ease.verify.core.target.2018-12/tests/org.eclipse.ease.lang.python.test/target/work, -configuration, /home/jenkins/agent/workspace/ease.verify.core.target.2018-12/tests/org.eclipse.ease.lang.python.test/target/work/configuration, -application, org.eclipse.tycho.surefire.osgibooter.headlesstest, -testproperties, /home/jenkins/agent/workspace/ease.verify.core.target.2018-12/tests/org.eclipse.ease.lang.python.test/target/surefire.properties]
23:40:44 [2020-10-24T03:40:44.254Z] Picked up JAVA_TOOL_OPTIONS: -Dmaven.ext.class.path="/home/jenkins/agent/workspace/ease.verify.core.target.2018-12@tmp/withMavenbe6870a0/pipeline-maven-spy.jar" -Dorg.jenkinsci.plugins.pipeline.maven.reportsFolder="/home/jenkins/agent/workspace/ease.verify.core.target.2018-12@tmp/withMavenbe6870a0" 
23:40:46 [2020-10-24T03:40:46.158Z] Running org.eclipse.ease.lang.python.PythonCodeFactoryTest
23:40:46 [2020-10-24T03:40:46.158Z] Tests run: 1, Failures: 0, Errors: 0, Skipped: 0, Time elapsed: 0.028 s - in org.eclipse.ease.lang.python.PythonCodeFactoryTest
23:40:46 [2020-10-24T03:40:46.158Z] testCommentCreator(org.eclipse.ease.lang.python.PythonCodeFactoryTest)  Time elapsed: 0.003 s
23:40:46 [2020-10-24T03:40:46.158Z] 
23:40:46 [2020-10-24T03:40:46.158Z] Results:
23:40:46 [2020-10-24T03:40:46.158Z] 
23:40:46 [2020-10-24T03:40:46.158Z] Tests run: 1, Failures: 0, Errors: 0, Skipped: 0
23:40:46 [2020-10-24T03:40:46.158Z] 
23:40:46 [2020-10-24T03:40:46.414Z] [INFO] All tests passed!
23:40:46 [2020-10-24T03:40:46.414Z] [INFO] 
23:40:46 [2020-10-24T03:40:46.414Z] [INFO] --- maven-install-plugin:2.3.1:install (default-install) @ org.eclipse.ease.lang.python.test ---
23:40:46 [2020-10-24T03:40:46.414Z] [INFO] Installing /home/jenkins/agent/workspace/ease.verify.core.target.2018-12/tests/org.eclipse.ease.lang.python.test/target/org.eclipse.ease.lang.python.test-0.8.0-SNAPSHOT.jar to /home/jenkins/.m2/repository/org/eclipse/ease/org.eclipse.ease.lang.python.test/0.8.0-SNAPSHOT/org.eclipse.ease.lang.python.test-0.8.0-SNAPSHOT.jar
23:40:46 [2020-10-24T03:40:46.414Z] [INFO] Installing /home/jenkins/agent/workspace/ease.verify.core.target.2018-12/tests/org.eclipse.ease.lang.python.test/pom.xml to /home/jenkins/.m2/repository/org/eclipse/ease/org.eclipse.ease.lang.python.test/0.8.0-SNAPSHOT/org.eclipse.ease.lang.python.test-0.8.0-SNAPSHOT.pom
23:40:46 [2020-10-24T03:40:46.414Z] [INFO] Installing /home/jenkins/agent/workspace/ease.verify.core.target.2018-12/tests/org.eclipse.ease.lang.python.test/target/org.eclipse.ease.lang.python.test-0.8.0-SNAPSHOT-sources.jar to /home/jenkins/.m2/repository/org/eclipse/ease/org.eclipse.ease.lang.python.test/0.8.0-SNAPSHOT/org.eclipse.ease.lang.python.test-0.8.0-SNAPSHOT-sources.jar
23:40:46 [2020-10-24T03:40:46.414Z] [INFO] Installing /home/jenkins/agent/workspace/ease.verify.core.target.2018-12/tests/org.eclipse.ease.lang.python.test/target/p2content.xml to /home/jenkins/.m2/repository/org/eclipse/ease/org.eclipse.ease.lang.python.test/0.8.0-SNAPSHOT/org.eclipse.ease.lang.python.test-0.8.0-SNAPSHOT-p2metadata.xml
23:40:46 [2020-10-24T03:40:46.414Z] [INFO] Installing /home/jenkins/agent/workspace/ease.verify.core.target.2018-12/tests/org.eclipse.ease.lang.python.test/target/p2artifacts.xml to /home/jenkins/.m2/repository/org/eclipse/ease/org.eclipse.ease.lang.python.test/0.8.0-SNAPSHOT/org.eclipse.ease.lang.python.test-0.8.0-SNAPSHOT-p2artifacts.xml
23:40:46 [2020-10-24T03:40:46.414Z] [INFO] Installing /home/jenkins/agent/workspace/ease.verify.core.target.2018-12/tests/org.eclipse.ease.lang.python.test/target/p2content.xml to /home/jenkins/.m2/repository/org/eclipse/ease/org.eclipse.ease.lang.python.test/0.8.0-SNAPSHOT/org.eclipse.ease.lang.python.test-0.8.0-SNAPSHOT-p2metadata.xml
23:40:46 [2020-10-24T03:40:46.414Z] [INFO] Installing /home/jenkins/agent/workspace/ease.verify.core.target.2018-12/tests/org.eclipse.ease.lang.python.test/target/p2artifacts.xml to /home/jenkins/.m2/repository/org/eclipse/ease/org.eclipse.ease.lang.python.test/0.8.0-SNAPSHOT/org.eclipse.ease.lang.python.test-0.8.0-SNAPSHOT-p2artifacts.xml
23:40:46 [2020-10-24T03:40:46.414Z] [INFO] 
23:40:46 [2020-10-24T03:40:46.415Z] [INFO] --- tycho-p2-plugin:1.5.0:update-local-index (default-update-local-index) @ org.eclipse.ease.lang.python.test ---
23:40:46 [2020-10-24T03:40:46.415Z] [INFO] 
23:40:46 [2020-10-24T03:40:46.415Z] [INFO] -----< org.eclipse.ease:org.eclipse.ease.lang.python.jython.test >------
23:40:46 [2020-10-24T03:40:46.415Z] [INFO] Building org.eclipse.ease.lang.python.jython.test 0.8.0-SNAPSHOT [43/48]
23:40:46 [2020-10-24T03:40:46.415Z] [INFO] ------------------------[ eclipse-test-plugin ]-------------------------
23:40:46 [2020-10-24T03:40:46.415Z] [INFO] 
23:40:46 [2020-10-24T03:40:46.415Z] [INFO] --- maven-clean-plugin:2.5:clean (default-clean) @ org.eclipse.ease.lang.python.jython.test ---
23:40:46 [2020-10-24T03:40:46.415Z] [INFO] 
23:40:46 [2020-10-24T03:40:46.415Z] [INFO] --- tycho-packaging-plugin:1.5.0:build-qualifier (default-build-qualifier) @ org.eclipse.ease.lang.python.jython.test ---
23:40:46 [2020-10-24T03:40:46.415Z] [INFO] The project's OSGi version is 0.8.0.I201911291239
23:40:46 [2020-10-24T03:40:46.415Z] [INFO] 
23:40:46 [2020-10-24T03:40:46.415Z] [INFO] --- tycho-packaging-plugin:1.5.0:validate-id (default-validate-id) @ org.eclipse.ease.lang.python.jython.test ---
23:40:46 [2020-10-24T03:40:46.415Z] [INFO] 
23:40:46 [2020-10-24T03:40:46.415Z] [INFO] --- tycho-packaging-plugin:1.5.0:validate-version (default-validate-version) @ org.eclipse.ease.lang.python.jython.test ---
23:40:46 [2020-10-24T03:40:46.415Z] [INFO] 
23:40:46 [2020-10-24T03:40:46.415Z] [INFO] >>> maven-javadoc-plugin:2.9.1:javadoc (build-docs) > generate-sources @ org.eclipse.ease.lang.python.jython.test >>>
23:40:46 [2020-10-24T03:40:46.415Z] [INFO] 
23:40:46 [2020-10-24T03:40:46.415Z] [INFO] --- tycho-packaging-plugin:1.5.0:build-qualifier (default-build-qualifier) @ org.eclipse.ease.lang.python.jython.test ---
23:40:46 [2020-10-24T03:40:46.415Z] [INFO] The project's OSGi version is 0.8.0.I201911291239
23:40:46 [2020-10-24T03:40:46.415Z] [INFO] 
23:40:46 [2020-10-24T03:40:46.415Z] [INFO] --- tycho-packaging-plugin:1.5.0:validate-id (default-validate-id) @ org.eclipse.ease.lang.python.jython.test ---
23:40:46 [2020-10-24T03:40:46.415Z] [INFO] 
23:40:46 [2020-10-24T03:40:46.415Z] [INFO] --- tycho-packaging-plugin:1.5.0:validate-version (default-validate-version) @ org.eclipse.ease.lang.python.jython.test ---
23:40:46 [2020-10-24T03:40:46.415Z] [INFO] 
23:40:46 [2020-10-24T03:40:46.415Z] [INFO] <<< maven-javadoc-plugin:2.9.1:javadoc (build-docs) < generate-sources @ org.eclipse.ease.lang.python.jython.test <<<
23:40:46 [2020-10-24T03:40:46.415Z] [INFO] 
23:40:46 [2020-10-24T03:40:46.415Z] [INFO] 
23:40:46 [2020-10-24T03:40:46.415Z] [INFO] --- maven-javadoc-plugin:2.9.1:javadoc (build-docs) @ org.eclipse.ease.lang.python.jython.test ---
23:40:46 [2020-10-24T03:40:46.671Z] [ERROR] Error fetching link: http://help.eclipse.org/oxygen/topic/org.eclipse.platform.doc.isv/reference/api/package-list. Ignored it.
23:40:46 [2020-10-24T03:40:46.671Z] [ERROR] Error fetching link: https://ci.eclipse.org/ease/job/ease.build.core/JavaDoc/package-list. Ignored it.
23:40:47 [2020-10-24T03:40:47.598Z] [INFO] 
23:40:47 [2020-10-24T03:40:47.598Z] Loading source files for package org.eclipse.ease.lang.python.jython.debugger...
23:40:47 [2020-10-24T03:40:47.598Z] Constructing Javadoc information...
23:40:47 [2020-10-24T03:40:47.598Z] WARNING: Cannot open location "/home/jenkins/agent/workspace/ease.verify.core.target.2018-12/tests/org.eclipse.ease.lang.python.jython.test/target/javadoc-bundle-options/package-list"
23:40:47 [2020-10-24T03:40:47.598Z] No plugin definition found, skipping
23:40:47 [2020-10-24T03:40:47.598Z] No plugin definition found, skipping
23:40:47 [2020-10-24T03:40:47.598Z] [WARNING] Javadoc Warnings
23:40:47 [2020-10-24T03:40:47.598Z] [WARNING] Picked up JAVA_TOOL_OPTIONS: -Dmaven.ext.class.path="/home/jenkins/agent/workspace/ease.verify.core.target.2018-12@tmp/withMavenbe6870a0/pipeline-maven-spy.jar" -Dorg.jenkinsci.plugins.pipeline.maven.reportsFolder="/home/jenkins/agent/workspace/ease.verify.core.target.2018-12@tmp/withMavenbe6870a0"
23:40:47 [2020-10-24T03:40:47.598Z] [WARNING] javadoc: warning - The old Doclet and Taglet APIs in the packages
23:40:47 [2020-10-24T03:40:47.598Z] [WARNING] com.sun.javadoc, com.sun.tools.doclets and their implementations
23:40:47 [2020-10-24T03:40:47.598Z] [WARNING] are planned to be removed in a future JDK release. These
23:40:47 [2020-10-24T03:40:47.598Z] [WARNING] components have been superseded by the new APIs in jdk.javadoc.doclet.
23:40:47 [2020-10-24T03:40:47.598Z] [WARNING] Users are strongly recommended to migrate to the new APIs.
23:40:47 [2020-10-24T03:40:47.598Z] [INFO] 
23:40:47 [2020-10-24T03:40:47.598Z] [INFO] --- build-helper-maven-plugin:1.9.1:add-resource (add_help) @ org.eclipse.ease.lang.python.jython.test ---
23:40:47 [2020-10-24T03:40:47.598Z] [INFO] 
23:40:47 [2020-10-24T03:40:47.598Z] [INFO] --- maven-resources-plugin:2.4.3:resources (default-resources) @ org.eclipse.ease.lang.python.jython.test ---
23:40:47 [2020-10-24T03:40:47.598Z] [INFO] Using 'UTF-8' encoding to copy filtered resources.
23:40:47 [2020-10-24T03:40:47.598Z] [INFO] skip non existing resourceDirectory /home/jenkins/agent/workspace/ease.verify.core.target.2018-12/tests/org.eclipse.ease.lang.python.jython.test/src/main/resources
23:40:47 [2020-10-24T03:40:47.598Z] [INFO] skip non existing resourceDirectory /home/jenkins/agent/workspace/ease.verify.core.target.2018-12/tests/org.eclipse.ease.lang.python.jython.test/help
23:40:47 [2020-10-24T03:40:47.598Z] [INFO] 
23:40:47 [2020-10-24T03:40:47.598Z] [INFO] --- tycho-compiler-plugin:1.5.0:compile (default-compile) @ org.eclipse.ease.lang.python.jython.test ---
23:40:47 [2020-10-24T03:40:47.598Z] [INFO] Compiling 1 source file to /home/jenkins/agent/workspace/ease.verify.core.target.2018-12/tests/org.eclipse.ease.lang.python.jython.test/target/classes
23:40:47 [2020-10-24T03:40:47.895Z] [INFO] 
23:40:47 [2020-10-24T03:40:47.896Z] [INFO] --- maven-resources-plugin:2.4.3:testResources (default-testResources) @ org.eclipse.ease.lang.python.jython.test ---
23:40:47 [2020-10-24T03:40:47.896Z] [INFO] Using 'UTF-8' encoding to copy filtered resources.
23:40:47 [2020-10-24T03:40:47.896Z] [INFO] skip non existing resourceDirectory /home/jenkins/agent/workspace/ease.verify.core.target.2018-12/tests/org.eclipse.ease.lang.python.jython.test/src/test/resources
23:40:47 [2020-10-24T03:40:47.896Z] [INFO] 
23:40:47 [2020-10-24T03:40:47.896Z] [INFO] --- tycho-source-plugin:1.5.0:plugin-source (plugin-source) @ org.eclipse.ease.lang.python.jython.test ---
23:40:47 [2020-10-24T03:40:47.896Z] [WARNING] Bundle-Vendor header not found in /home/jenkins/agent/workspace/ease.verify.core.target.2018-12/tests/org.eclipse.ease.lang.python.jython.test/META-INF/MANIFEST.MF, fallback to 'unknown' for source bundle
23:40:47 [2020-10-24T03:40:47.896Z] [INFO] Building jar: /home/jenkins/agent/workspace/ease.verify.core.target.2018-12/tests/org.eclipse.ease.lang.python.jython.test/target/org.eclipse.ease.lang.python.jython.test-0.8.0-SNAPSHOT-sources.jar
23:40:47 [2020-10-24T03:40:47.896Z] [INFO] 
23:40:47 [2020-10-24T03:40:47.896Z] [INFO] --- target-platform-configuration:1.5.0:target-platform (default-target-platform) @ org.eclipse.ease.lang.python.jython.test ---
23:40:47 [2020-10-24T03:40:47.896Z] [INFO] 
23:40:47 [2020-10-24T03:40:47.896Z] [INFO] --- tycho-packaging-plugin:1.5.0:package-plugin (default-package-plugin) @ org.eclipse.ease.lang.python.jython.test ---
23:40:47 [2020-10-24T03:40:47.896Z] [INFO] Building jar: /home/jenkins/agent/workspace/ease.verify.core.target.2018-12/tests/org.eclipse.ease.lang.python.jython.test/target/org.eclipse.ease.lang.python.jython.test-0.8.0-SNAPSHOT.jar
23:40:47 [2020-10-24T03:40:47.896Z] [INFO] 
23:40:47 [2020-10-24T03:40:47.896Z] [INFO] --- tycho-p2-plugin:1.5.0:p2-metadata-default (default-p2-metadata-default) @ org.eclipse.ease.lang.python.jython.test ---
23:40:47 [2020-10-24T03:40:47.896Z] [INFO] 
23:40:47 [2020-10-24T03:40:47.896Z] [INFO] --- tycho-source-feature-plugin:1.5.0:source-feature (source-feature) @ org.eclipse.ease.lang.python.jython.test ---
23:40:47 [2020-10-24T03:40:47.896Z] [INFO] 
23:40:47 [2020-10-24T03:40:47.896Z] [INFO] --- tycho-p2-plugin:1.5.0:p2-metadata (attached-p2-metadata) @ org.eclipse.ease.lang.python.jython.test ---
23:40:47 [2020-10-24T03:40:47.896Z] [INFO] 
23:40:47 [2020-10-24T03:40:47.896Z] [INFO] --- tycho-surefire-plugin:1.5.0:test (default-test) @ org.eclipse.ease.lang.python.jython.test ---
23:40:48 [2020-10-24T03:40:48.457Z] [INFO] Expected eclipse log file: /home/jenkins/agent/workspace/ease.verify.core.target.2018-12/tests/org.eclipse.ease.lang.python.jython.test/target/work/data/.metadata/.log
23:40:48 [2020-10-24T03:40:48.457Z] [INFO] Command line:
23:40:48 [2020-10-24T03:40:48.458Z] 	[/opt/tools/java/openjdk/jdk-11/11.0.2+9/bin/java, -Dosgi.noShutdown=false, -Dosgi.os=linux, -Dosgi.ws=gtk, -Dosgi.arch=x86_64, -Dosgi.clean=true, -jar, /home/jenkins/.m2/repository/p2/osgi/bundle/org.eclipse.equinox.launcher/1.5.800.v20200727-1323/org.eclipse.equinox.launcher-1.5.800.v20200727-1323.jar, -data, /home/jenkins/agent/workspace/ease.verify.core.target.2018-12/tests/org.eclipse.ease.lang.python.jython.test/target/work/data, -install, /home/jenkins/agent/workspace/ease.verify.core.target.2018-12/tests/org.eclipse.ease.lang.python.jython.test/target/work, -configuration, /home/jenkins/agent/workspace/ease.verify.core.target.2018-12/tests/org.eclipse.ease.lang.python.jython.test/target/work/configuration, -application, org.eclipse.tycho.surefire.osgibooter.headlesstest, -testproperties, /home/jenkins/agent/workspace/ease.verify.core.target.2018-12/tests/org.eclipse.ease.lang.python.jython.test/target/surefire.properties]
23:40:48 [2020-10-24T03:40:48.458Z] Picked up JAVA_TOOL_OPTIONS: -Dmaven.ext.class.path="/home/jenkins/agent/workspace/ease.verify.core.target.2018-12@tmp/withMavenbe6870a0/pipeline-maven-spy.jar" -Dorg.jenkinsci.plugins.pipeline.maven.reportsFolder="/home/jenkins/agent/workspace/ease.verify.core.target.2018-12@tmp/withMavenbe6870a0" 
23:40:50 [2020-10-24T03:40:50.359Z] WARNING: An illegal reflective access operation has occurred
23:40:50 [2020-10-24T03:40:50.359Z] WARNING: Illegal reflective access by org.python.core.PySystemState (file:/home/jenkins/agent/workspace/ease.verify.core.target.2018-12/tests/org.eclipse.ease.lang.python.jython.test/target/work/plugins/org.jython_2.7.0.I201609090924/jython.jar) to method java.io.Console.encoding()
23:40:50 [2020-10-24T03:40:50.359Z] WARNING: Please consider reporting this to the maintainers of org.python.core.PySystemState
23:40:50 [2020-10-24T03:40:50.359Z] WARNING: Use --illegal-access=warn to enable warnings of further illegal reflective access operations
23:40:50 [2020-10-24T03:40:50.359Z] WARNING: All illegal access operations will be denied in a future release
23:40:50 [2020-10-24T03:40:50.359Z] Running org.eclipse.ease.lang.python.jython.debugger.JythonDebugTest
23:40:52 [2020-10-24T03:40:52.260Z] Start of script
23:40:52 [2020-10-24T03:40:52.260Z] include file start
23:40:52 [2020-10-24T03:40:52.260Z] include file processed
23:40:52 [2020-10-24T03:40:52.260Z] Result of testMethod = 5
23:40:52 [2020-10-24T03:40:52.260Z] End of script
23:40:52 [2020-10-24T03:40:52.260Z] Start of script
23:40:52 [2020-10-24T03:40:52.260Z] include file start
23:40:52 [2020-10-24T03:40:52.260Z] include file processed
23:40:52 [2020-10-24T03:40:52.260Z] Result of testMethod = 5
23:40:52 [2020-10-24T03:40:52.260Z] End of script
23:40:52 [2020-10-24T03:40:52.260Z] Start of script
23:40:52 [2020-10-24T03:40:52.260Z] include file start
23:40:52 [2020-10-24T03:40:52.260Z] include file processed
23:40:52 [2020-10-24T03:40:52.260Z] Result of testMethod = 5
23:40:52 [2020-10-24T03:40:52.515Z] Traceback (most recent call last):
23:40:52 [2020-10-24T03:40:52.515Z]   File "(none)", line 184, in run
23:40:52 [2020-10-24T03:40:52.515Z]   File "__ref_L/Debug Test/Main.py_zgofdakagg", line 23, in <module>
23:40:52 [2020-10-24T03:40:52.515Z]   File "(none)", line 161, in trace_dispatch
23:40:52 [2020-10-24T03:40:52.515Z] org.eclipse.ease.ExitException: 
23:40:52 [2020-10-24T03:40:52.515Z] 
23:40:52 [2020-10-24T03:40:52.515Z] org.eclipse.ease.ExitException: org.eclipse.ease.ExitException: 
23:40:52 [2020-10-24T03:40:52.515Z] Start of script
23:40:52 [2020-10-24T03:40:52.515Z] include file start
23:40:52 [2020-10-24T03:40:52.515Z] include file processed
23:40:52 [2020-10-24T03:40:52.771Z] Result of testMethod = 5
23:40:52 [2020-10-24T03:40:52.771Z] End of script
23:40:53 [2020-10-24T03:40:53.026Z] Start of script
23:40:53 [2020-10-24T03:40:53.026Z] include file start
23:40:53 [2020-10-24T03:40:53.026Z] include file processed
23:40:53 [2020-10-24T03:40:53.026Z] Result of testMethod = 5
23:40:53 [2020-10-24T03:40:53.026Z] End of script
23:40:53 [2020-10-24T03:40:53.281Z] Start of script
23:40:53 [2020-10-24T03:40:53.281Z] include file start
23:40:53 [2020-10-24T03:40:53.281Z] include file processed
23:40:53 [2020-10-24T03:40:53.281Z] Result of testMethod = 5
23:40:53 [2020-10-24T03:40:53.281Z] End of script
23:40:53 [2020-10-24T03:40:53.536Z] Start of script
23:40:53 [2020-10-24T03:40:53.536Z] include file start
23:40:53 [2020-10-24T03:40:53.536Z] include file processed
23:40:53 [2020-10-24T03:40:53.536Z] Result of testMethod = 5
23:40:53 [2020-10-24T03:40:53.792Z] Traceback (most recent call last):
23:40:53 [2020-10-24T03:40:53.792Z]   File "(none)", line 184, in run
23:40:53 [2020-10-24T03:40:53.792Z]   File "__ref_L/Debug Test/Main.py_mjvkzebptq", line 23, in <module>
23:40:53 [2020-10-24T03:40:53.792Z]   File "(none)", line 161, in trace_dispatch
23:40:53 [2020-10-24T03:40:53.792Z] org.eclipse.ease.ExitException: 
23:40:53 [2020-10-24T03:40:53.792Z] 
23:40:53 [2020-10-24T03:40:53.792Z] org.eclipse.ease.ExitException: org.eclipse.ease.ExitException: 
23:40:53 [2020-10-24T03:40:53.792Z] Start of script
23:40:53 [2020-10-24T03:40:53.792Z] include file start
23:40:53 [2020-10-24T03:40:53.792Z] include file processed
23:40:54 [2020-10-24T03:40:54.047Z] Result of testMethod = 5
23:40:54 [2020-10-24T03:40:54.047Z] End of script
23:40:54 [2020-10-24T03:40:54.047Z] Start of script
23:40:54 [2020-10-24T03:40:54.047Z] include file start
23:40:54 [2020-10-24T03:40:54.047Z] include file processed
23:40:54 [2020-10-24T03:40:54.047Z] Result of testMethod = 5
23:40:54 [2020-10-24T03:40:54.303Z] End of script
23:40:54 [2020-10-24T03:40:54.303Z] Start of script
23:40:54 [2020-10-24T03:40:54.303Z] include file start
23:40:54 [2020-10-24T03:40:54.303Z] include file processed
23:40:54 [2020-10-24T03:40:54.863Z] Traceback (most recent call last):
23:40:54 [2020-10-24T03:40:54.863Z]   File "(none)", line 184, in run
23:40:54 [2020-10-24T03:40:54.863Z]   File "__ref_L/Debug Test/Main.py_jgeiakksyn", line 22, in <module>
23:40:54 [2020-10-24T03:40:54.863Z]   File "(none)", line 161, in trace_dispatch
23:40:54 [2020-10-24T03:40:54.863Z] org.eclipse.ease.ExitException: 
23:40:54 [2020-10-24T03:40:54.863Z] 
23:40:54 [2020-10-24T03:40:54.863Z] org.eclipse.ease.ExitException: org.eclipse.ease.ExitException: 
23:40:54 [2020-10-24T03:40:54.863Z] Start of script
23:40:54 [2020-10-24T03:40:54.864Z] include file start
23:40:54 [2020-10-24T03:40:54.864Z] include file processed
23:40:54 [2020-10-24T03:40:54.864Z] Result of testMethod = 5
23:40:54 [2020-10-24T03:40:54.864Z] End of script
23:40:55 [2020-10-24T03:40:55.119Z] Start of script
23:40:55 [2020-10-24T03:40:55.119Z] include file start
23:40:55 [2020-10-24T03:40:55.119Z] include file processed
23:40:55 [2020-10-24T03:40:55.119Z] Result of testMethod = 5
23:40:55 [2020-10-24T03:40:55.119Z] End of script
23:40:55 [2020-10-24T03:40:55.374Z] Traceback (most recent call last):
23:40:55 [2020-10-24T03:40:55.374Z]   File "(none)", line 184, in run
23:40:55 [2020-10-24T03:40:55.374Z]   File "__ref_L/Debug Test/Main.py_qdafaiaioq", line 1, in <module>
23:40:55 [2020-10-24T03:40:55.374Z]   File "(none)", line 161, in trace_dispatch
23:40:55 [2020-10-24T03:40:55.374Z] org.eclipse.ease.ExitException: 
23:40:55 [2020-10-24T03:40:55.374Z] 
23:40:55 [2020-10-24T03:40:55.374Z] org.eclipse.ease.ExitException: org.eclipse.ease.ExitException: 
23:40:55 [2020-10-24T03:40:55.634Z] Start of script
23:40:55 [2020-10-24T03:40:55.634Z] include file start
23:40:55 [2020-10-24T03:40:55.634Z] include file processed
23:40:55 [2020-10-24T03:40:55.634Z] Result of testMethod = 5
23:40:55 [2020-10-24T03:40:55.634Z] End of script
23:40:55 [2020-10-24T03:40:55.889Z] Start of script
23:40:55 [2020-10-24T03:40:55.889Z] include file start
23:40:55 [2020-10-24T03:40:55.889Z] include file processed
23:40:55 [2020-10-24T03:40:55.889Z] Result of testMethod = 5
23:40:55 [2020-10-24T03:40:55.889Z] End of script
23:40:56 [2020-10-24T03:40:56.145Z] Start of script
23:40:56 [2020-10-24T03:40:56.145Z] include file start
23:40:56 [2020-10-24T03:40:56.145Z] include file processed
23:40:56 [2020-10-24T03:40:56.145Z] Result of testMethod = 5
23:40:56 [2020-10-24T03:40:56.400Z] Traceback (most recent call last):
23:40:56 [2020-10-24T03:40:56.400Z]   File "(none)", line 184, in run
23:40:56 [2020-10-24T03:40:56.400Z]   File "__ref_L/Debug Test/Main.py_haqatynien", line 23, in <module>
23:40:56 [2020-10-24T03:40:56.400Z]   File "(none)", line 161, in trace_dispatch
23:40:56 [2020-10-24T03:40:56.400Z] org.eclipse.ease.ExitException: 
23:40:56 [2020-10-24T03:40:56.400Z] 
23:40:56 [2020-10-24T03:40:56.400Z] org.eclipse.ease.ExitException: org.eclipse.ease.ExitException: 
23:40:56 [2020-10-24T03:40:56.400Z] Start of script
23:40:56 [2020-10-24T03:40:56.400Z] include file start
23:40:56 [2020-10-24T03:40:56.400Z] include file processed
23:40:56 [2020-10-24T03:40:56.656Z] Result of testMethod = 5
23:40:56 [2020-10-24T03:40:56.656Z] End of script
23:40:56 [2020-10-24T03:40:56.911Z] Traceback (most recent call last):
23:40:56 [2020-10-24T03:40:56.911Z]   File "(none)", line 184, in run
23:40:56 [2020-10-24T03:40:56.911Z]   File "__ref_L/Debug Test/Main.py_dgqllapggd", line 1, in <module>
23:40:56 [2020-10-24T03:40:56.911Z]   File "(none)", line 161, in trace_dispatch
23:40:56 [2020-10-24T03:40:56.911Z] org.eclipse.ease.ExitException: 
23:40:56 [2020-10-24T03:40:56.911Z] 
23:40:56 [2020-10-24T03:40:56.911Z] org.eclipse.ease.ExitException: org.eclipse.ease.ExitException: 
23:40:56 [2020-10-24T03:40:56.911Z] Start of script
23:40:56 [2020-10-24T03:40:56.911Z] include file start
23:40:56 [2020-10-24T03:40:56.911Z] include file processed
23:40:56 [2020-10-24T03:40:56.911Z] Result of testMethod = 5
23:40:56 [2020-10-24T03:40:56.911Z] End of script
23:40:57 [2020-10-24T03:40:57.166Z] Start of script
23:40:57 [2020-10-24T03:40:57.166Z] include file start
23:40:57 [2020-10-24T03:40:57.166Z] include file processed
23:40:57 [2020-10-24T03:40:57.422Z] Result of testMethod = 5
23:40:57 [2020-10-24T03:40:57.422Z] End of script
23:40:57 [2020-10-24T03:40:57.422Z] Traceback (most recent call last):
23:40:57 [2020-10-24T03:40:57.422Z]   File "(none)", line 184, in run
23:40:57 [2020-10-24T03:40:57.422Z]   File "__ref_L/Debug Test/Main.py_eyrlgfpusw", line 1, in <module>
23:40:57 [2020-10-24T03:40:57.422Z]   File "(none)", line 161, in trace_dispatch
23:40:57 [2020-10-24T03:40:57.422Z] org.eclipse.ease.ExitException: 
23:40:57 [2020-10-24T03:40:57.422Z] 
23:40:57 [2020-10-24T03:40:57.422Z] org.eclipse.ease.ExitException: org.eclipse.ease.ExitException: 
23:40:57 [2020-10-24T03:40:57.677Z] Start of script
23:40:57 [2020-10-24T03:40:57.677Z] include file start
23:40:57 [2020-10-24T03:40:57.677Z] include file processed
23:40:57 [2020-10-24T03:40:57.933Z] Result of testMethod = 5
23:40:57 [2020-10-24T03:40:57.933Z] End of script
23:40:57 [2020-10-24T03:40:57.933Z] Start of script
23:40:57 [2020-10-24T03:40:57.933Z] include file start
23:40:57 [2020-10-24T03:40:57.933Z] include file processed
23:40:57 [2020-10-24T03:40:57.933Z] Result of testMethod = 5
23:40:58 [2020-10-24T03:40:58.189Z] Traceback (most recent call last):
23:40:58 [2020-10-24T03:40:58.189Z]   File "(none)", line 184, in run
23:40:58 [2020-10-24T03:40:58.189Z]   File "__ref_L/Debug Test/Main.py_jzksbfdbqk", line 23, in <module>
23:40:58 [2020-10-24T03:40:58.189Z]   File "(none)", line 161, in trace_dispatch
23:40:58 [2020-10-24T03:40:58.189Z] org.eclipse.ease.ExitException: 
23:40:58 [2020-10-24T03:40:58.189Z] 
23:40:58 [2020-10-24T03:40:58.189Z] org.eclipse.ease.ExitException: org.eclipse.ease.ExitException: 
23:40:58 [2020-10-24T03:40:58.444Z] Start of script
23:40:58 [2020-10-24T03:40:58.444Z] include file start
23:40:58 [2020-10-24T03:40:58.444Z] include file processed
23:40:58 [2020-10-24T03:40:58.444Z] Result of testMethod = 5
23:40:58 [2020-10-24T03:40:58.444Z] End of script
23:40:58 [2020-10-24T03:40:58.444Z] Start of script
23:40:58 [2020-10-24T03:40:58.444Z] include file start
23:40:58 [2020-10-24T03:40:58.444Z] include file processed
23:40:58 [2020-10-24T03:40:58.700Z] Result of testMethod = 5
23:40:58 [2020-10-24T03:40:58.700Z] End of script
23:40:58 [2020-10-24T03:40:58.700Z] Start of script
23:40:58 [2020-10-24T03:40:58.700Z] include file start
23:40:58 [2020-10-24T03:40:58.700Z] include file processed
23:40:58 [2020-10-24T03:40:58.700Z] Result of testMethod = 5
23:40:58 [2020-10-24T03:40:58.700Z] End of script
23:40:58 [2020-10-24T03:40:58.955Z] Start of script
23:40:58 [2020-10-24T03:40:58.955Z] include file start
23:40:58 [2020-10-24T03:40:58.955Z] include file processed
23:40:58 [2020-10-24T03:40:58.955Z] Result of testMethod = 5
23:40:58 [2020-10-24T03:40:58.955Z] End of script
23:40:59 [2020-10-24T03:40:59.211Z] Start of script
23:40:59 [2020-10-24T03:40:59.211Z] include file start
23:40:59 [2020-10-24T03:40:59.211Z] include file processed
23:40:59 [2020-10-24T03:40:59.466Z] Traceback (most recent call last):
23:40:59 [2020-10-24T03:40:59.466Z]   File "(none)", line 184, in run
23:40:59 [2020-10-24T03:40:59.466Z]   File "__ref_L/Debug Test/Main.py_kmclfljqgl", line 21, in <module>
23:40:59 [2020-10-24T03:40:59.466Z]   File "__ref_L/Debug Test/Main.py_kmclfljqgl", line 18, in testMethod
23:40:59 [2020-10-24T03:40:59.466Z]   File "(none)", line 161, in trace_dispatch
23:40:59 [2020-10-24T03:40:59.466Z] org.eclipse.ease.ExitException: 
23:40:59 [2020-10-24T03:40:59.466Z] 
23:40:59 [2020-10-24T03:40:59.466Z] org.eclipse.ease.ExitException: org.eclipse.ease.ExitException: 
23:40:59 [2020-10-24T03:40:59.466Z] Start of script
23:40:59 [2020-10-24T03:40:59.722Z] include file start
23:40:59 [2020-10-24T03:40:59.722Z] include file processed
23:40:59 [2020-10-24T03:40:59.722Z] Result of testMethod = 5
23:40:59 [2020-10-24T03:40:59.722Z] End of script
23:40:59 [2020-10-24T03:40:59.722Z] Start of script
23:40:59 [2020-10-24T03:40:59.722Z] include file start
23:40:59 [2020-10-24T03:40:59.722Z] include file processed
23:40:59 [2020-10-24T03:40:59.722Z] Result of testMethod = 5
23:40:59 [2020-10-24T03:40:59.977Z] Traceback (most recent call last):
23:40:59 [2020-10-24T03:40:59.977Z]   File "(none)", line 184, in run
23:40:59 [2020-10-24T03:40:59.977Z]   File "__ref_L/Debug Test/Main.py_tdbhbibmnl", line 23, in <module>
23:40:59 [2020-10-24T03:40:59.977Z]   File "(none)", line 161, in trace_dispatch
23:40:59 [2020-10-24T03:40:59.977Z] org.eclipse.ease.ExitException: 
23:40:59 [2020-10-24T03:40:59.977Z] 
23:40:59 [2020-10-24T03:40:59.977Z] org.eclipse.ease.ExitException: org.eclipse.ease.ExitException: 
23:40:59 [2020-10-24T03:40:59.977Z] Start of script
23:40:59 [2020-10-24T03:40:59.977Z] include file start
23:40:59 [2020-10-24T03:40:59.977Z] include file processed
23:40:59 [2020-10-24T03:40:59.977Z] Result of testMethod = 5
23:41:00 [2020-10-24T03:41:00.233Z] End of script
23:41:00 [2020-10-24T03:41:00.233Z] Start of script
23:41:00 [2020-10-24T03:41:00.233Z] include file start
23:41:00 [2020-10-24T03:41:00.233Z] include file processed
23:41:00 [2020-10-24T03:41:00.488Z] Result of testMethod = 5
23:41:00 [2020-10-24T03:41:00.488Z] End of script
23:41:00 [2020-10-24T03:41:00.488Z] Start of script
23:41:00 [2020-10-24T03:41:00.488Z] include file start
23:41:00 [2020-10-24T03:41:00.488Z] include file processed
23:41:00 [2020-10-24T03:41:00.744Z] Result of testMethod = 5
23:41:00 [2020-10-24T03:41:00.744Z] End of script
23:41:01 [2020-10-24T03:41:01.000Z] Start of script
23:41:01 [2020-10-24T03:41:01.000Z] include file start
23:41:01 [2020-10-24T03:41:01.000Z] include file processed
23:41:01 [2020-10-24T03:41:01.000Z] Result of testMethod = 5
23:41:01 [2020-10-24T03:41:01.000Z] End of script
23:41:01 [2020-10-24T03:41:01.000Z] Start of script
23:41:01 [2020-10-24T03:41:01.000Z] include file start
23:41:01 [2020-10-24T03:41:01.000Z] include file processed
23:41:01 [2020-10-24T03:41:01.000Z] Result of testMethod = 5
23:41:01 [2020-10-24T03:41:01.256Z] Traceback (most recent call last):
23:41:01 [2020-10-24T03:41:01.256Z]   File "(none)", line 184, in run
23:41:01 [2020-10-24T03:41:01.256Z]   File "__ref_L/Debug Test/Main.py_qzcbcwighd", line 23, in <module>
23:41:01 [2020-10-24T03:41:01.256Z]   File "(none)", line 161, in trace_dispatch
23:41:01 [2020-10-24T03:41:01.256Z] org.eclipse.ease.ExitException: 
23:41:01 [2020-10-24T03:41:01.256Z] 
23:41:01 [2020-10-24T03:41:01.256Z] org.eclipse.ease.ExitException: org.eclipse.ease.ExitException: 
23:41:01 [2020-10-24T03:41:01.511Z] Start of script
23:41:01 [2020-10-24T03:41:01.511Z] include file start
23:41:01 [2020-10-24T03:41:01.511Z] include file processed
23:41:01 [2020-10-24T03:41:01.511Z] Result of testMethod = 5
23:41:01 [2020-10-24T03:41:01.511Z] End of script
23:41:01 [2020-10-24T03:41:01.511Z] Start of script
23:41:01 [2020-10-24T03:41:01.767Z] include file start
23:41:01 [2020-10-24T03:41:01.767Z] include file processed
23:41:01 [2020-10-24T03:41:01.767Z] Result of testMethod = 5
23:41:01 [2020-10-24T03:41:01.767Z] Traceback (most recent call last):
23:41:01 [2020-10-24T03:41:01.767Z]   File "(none)", line 184, in run
23:41:01 [2020-10-24T03:41:01.767Z]   File "__ref_L/Debug Test/Main.py_amcsudrcfr", line 23, in <module>
23:41:01 [2020-10-24T03:41:01.767Z]   File "(none)", line 161, in trace_dispatch
23:41:01 [2020-10-24T03:41:01.767Z] org.eclipse.ease.ExitException: 
23:41:01 [2020-10-24T03:41:01.767Z] 
23:41:01 [2020-10-24T03:41:01.767Z] org.eclipse.ease.ExitException: org.eclipse.ease.ExitException: 
23:41:02 [2020-10-24T03:41:02.022Z] Traceback (most recent call last):
23:41:02 [2020-10-24T03:41:02.022Z]   File "(none)", line 184, in run
23:41:02 [2020-10-24T03:41:02.022Z]   File "__ref_L/Debug Test/Main.py_kxkaikyuan", line 1, in <module>
23:41:02 [2020-10-24T03:41:02.022Z]   File "(none)", line 161, in trace_dispatch
23:41:02 [2020-10-24T03:41:02.022Z] org.eclipse.ease.ExitException: 
23:41:02 [2020-10-24T03:41:02.022Z] 
23:41:02 [2020-10-24T03:41:02.022Z] org.eclipse.ease.ExitException: org.eclipse.ease.ExitException: 
23:41:02 [2020-10-24T03:41:02.277Z] Start of script
23:41:02 [2020-10-24T03:41:02.277Z] include file start
23:41:02 [2020-10-24T03:41:02.277Z] include file processed
23:41:02 [2020-10-24T03:41:02.277Z] Result of testMethod = 5
23:41:02 [2020-10-24T03:41:02.277Z] End of script
23:41:02 [2020-10-24T03:41:02.277Z] Start of script
23:41:02 [2020-10-24T03:41:02.277Z] include file start
23:41:02 [2020-10-24T03:41:02.277Z] include file processed
23:41:02 [2020-10-24T03:41:02.533Z] Result of testMethod = 5
23:41:02 [2020-10-24T03:41:02.533Z] End of script
23:41:02 [2020-10-24T03:41:02.533Z] Start of script
23:41:02 [2020-10-24T03:41:02.533Z] include file start
23:41:02 [2020-10-24T03:41:02.533Z] include file processed
23:41:02 [2020-10-24T03:41:02.533Z] Result of testMethod = 5
23:41:02 [2020-10-24T03:41:02.788Z] End of script
23:41:02 [2020-10-24T03:41:02.788Z] Tests run: 42, Failures: 0, Errors: 0, Skipped: 0, Time elapsed: 12.359 s - in org.eclipse.ease.lang.python.jython.debugger.JythonDebugTest
23:41:02 [2020-10-24T03:41:02.788Z] disconnectProcessInSuspendedState(org.eclipse.ease.lang.python.jython.debugger.JythonDebugTest)  Time elapsed: 1.546 s
23:41:02 [2020-10-24T03:41:02.788Z] stepReturnIncludeCommand(org.eclipse.ease.lang.python.jython.debugger.JythonDebugTest)  Time elapsed: 0.211 s
23:41:02 [2020-10-24T03:41:02.788Z] arrayVariableSorting(org.eclipse.ease.lang.python.jython.debugger.JythonDebugTest)  Time elapsed: 0.308 s
23:41:02 [2020-10-24T03:41:02.789Z] stepOverOnDebugTarget(org.eclipse.ease.lang.python.jython.debugger.JythonDebugTest)  Time elapsed: 0.309 s
23:41:02 [2020-10-24T03:41:02.789Z] hasDebugTarget(org.eclipse.ease.lang.python.jython.debugger.JythonDebugTest)  Time elapsed: 0.105 s
23:41:02 [2020-10-24T03:41:02.789Z] disconnectThreadInSuspendedState(org.eclipse.ease.lang.python.jython.debugger.JythonDebugTest)  Time elapsed: 0.208 s
23:41:02 [2020-10-24T03:41:02.789Z] stepReturnOnDebugTarget(org.eclipse.ease.lang.python.jython.debugger.JythonDebugTest)  Time elapsed: 0.309 s
23:41:02 [2020-10-24T03:41:02.789Z] nullVariable(org.eclipse.ease.lang.python.jython.debugger.JythonDebugTest)  Time elapsed: 0.307 s
23:41:02 [2020-10-24T03:41:02.789Z] stepOverOnStackFrame(org.eclipse.ease.lang.python.jython.debugger.JythonDebugTest)  Time elapsed: 0.307 s
23:41:02 [2020-10-24T03:41:02.789Z] resumeOnDebugTarget(org.eclipse.ease.lang.python.jython.debugger.JythonDebugTest)  Time elapsed: 0.207 s
23:41:02 [2020-10-24T03:41:02.789Z] modifyVariableKeepingType(org.eclipse.ease.lang.python.jython.debugger.JythonDebugTest)  Time elapsed: 0.506 s
23:41:02 [2020-10-24T03:41:02.789Z] resumeOnLastIncludeLine(org.eclipse.ease.lang.python.jython.debugger.JythonDebugTest)  Time elapsed: 0.207 s
23:41:02 [2020-10-24T03:41:02.789Z] stepReturnOnStackFrame(org.eclipse.ease.lang.python.jython.debugger.JythonDebugTest)  Time elapsed: 0.308 s
23:41:02 [2020-10-24T03:41:02.789Z] terminateStackFrameInSuspendedState(org.eclipse.ease.lang.python.jython.debugger.JythonDebugTest)  Time elapsed: 0.207 s
23:41:02 [2020-10-24T03:41:02.789Z] breakpointLocation(org.eclipse.ease.lang.python.jython.debugger.JythonDebugTest)  Time elapsed: 0.206 s
23:41:02 [2020-10-24T03:41:02.789Z] stepReturnOnThread(org.eclipse.ease.lang.python.jython.debugger.JythonDebugTest)  Time elapsed: 0.317 s
23:41:02 [2020-10-24T03:41:02.789Z] javaClassVariable(org.eclipse.ease.lang.python.jython.debugger.JythonDebugTest)  Time elapsed: 0.309 s
23:41:02 [2020-10-24T03:41:02.789Z] stepIntoOnThread(org.eclipse.ease.lang.python.jython.debugger.JythonDebugTest)  Time elapsed: 0.307 s
23:41:02 [2020-10-24T03:41:02.789Z] terminateThreadInSuspendedState(org.eclipse.ease.lang.python.jython.debugger.JythonDebugTest)  Time elapsed: 0.207 s
23:41:02 [2020-10-24T03:41:02.789Z] resumeOnThread(org.eclipse.ease.lang.python.jython.debugger.JythonDebugTest)  Time elapsed: 0.207 s
23:41:02 [2020-10-24T03:41:02.789Z] stepIntoOnStackFrame(org.eclipse.ease.lang.python.jython.debugger.JythonDebugTest)  Time elapsed: 0.306 s
23:41:02 [2020-10-24T03:41:02.789Z] terminateProcessInSuspendedState(org.eclipse.ease.lang.python.jython.debugger.JythonDebugTest)  Time elapsed: 0.208 s
23:41:02 [2020-10-24T03:41:02.789Z] stepOverOnProcess(org.eclipse.ease.lang.python.jython.debugger.JythonDebugTest)  Time elapsed: 0.31 s
23:41:02 [2020-10-24T03:41:02.789Z] nativeArrayVariable(org.eclipse.ease.lang.python.jython.debugger.JythonDebugTest)  Time elapsed: 0.305 s
23:41:02 [2020-10-24T03:41:02.789Z] disconnectDebugTargetInSuspendedState(org.eclipse.ease.lang.python.jython.debugger.JythonDebugTest)  Time elapsed: 0.206 s
23:41:02 [2020-10-24T03:41:02.789Z] stepIntoOnProcess(org.eclipse.ease.lang.python.jython.debugger.JythonDebugTest)  Time elapsed: 0.311 s
23:41:02 [2020-10-24T03:41:02.789Z] terminatedState(org.eclipse.ease.lang.python.jython.debugger.JythonDebugTest)  Time elapsed: 0.104 s
23:41:02 [2020-10-24T03:41:02.789Z] stepOverIncludeCommand(org.eclipse.ease.lang.python.jython.debugger.JythonDebugTest)  Time elapsed: 0.305 s
23:41:02 [2020-10-24T03:41:02.789Z] innerScopeVariableBeforeOuterScopeVariable(org.eclipse.ease.lang.python.jython.debugger.JythonDebugTest)  Time elapsed: 0.305 s
23:41:02 [2020-10-24T03:41:02.789Z] stepIntoIncludeCommand(org.eclipse.ease.lang.python.jython.debugger.JythonDebugTest)  Time elapsed: 0.305 s
23:41:02 [2020-10-24T03:41:02.789Z] primitiveStringVariable(org.eclipse.ease.lang.python.jython.debugger.JythonDebugTest)  Time elapsed: 0.305 s
23:41:02 [2020-10-24T03:41:02.789Z] resumeOnProcess(org.eclipse.ease.lang.python.jython.debugger.JythonDebugTest)  Time elapsed: 0.206 s
23:41:02 [2020-10-24T03:41:02.789Z] stepIntoOnDebugTarget(org.eclipse.ease.lang.python.jython.debugger.JythonDebugTest)  Time elapsed: 0.307 s
23:41:02 [2020-10-24T03:41:02.789Z] stepOverOnThread(org.eclipse.ease.lang.python.jython.debugger.JythonDebugTest)  Time elapsed: 0.305 s
23:41:02 [2020-10-24T03:41:02.789Z] suspendedState(org.eclipse.ease.lang.python.jython.debugger.JythonDebugTest)  Time elapsed: 0.205 s
23:41:02 [2020-10-24T03:41:02.789Z] primitiveDoubleVariable(org.eclipse.ease.lang.python.jython.debugger.JythonDebugTest)  Time elapsed: 0.305 s
23:41:02 [2020-10-24T03:41:02.789Z] resumeOnStackFrame(org.eclipse.ease.lang.python.jython.debugger.JythonDebugTest)  Time elapsed: 0.206 s
23:41:02 [2020-10-24T03:41:02.789Z] nativeObjectVariable(org.eclipse.ease.lang.python.jython.debugger.JythonDebugTest)  Time elapsed: 0.306 s
23:41:02 [2020-10-24T03:41:02.789Z] terminateDebugTargetInSuspendedState(org.eclipse.ease.lang.python.jython.debugger.JythonDebugTest)  Time elapsed: 0.206 s
23:41:02 [2020-10-24T03:41:02.789Z] disconnectStackFrameInSuspendedState(org.eclipse.ease.lang.python.jython.debugger.JythonDebugTest)  Time elapsed: 0.205 s
23:41:02 [2020-10-24T03:41:02.789Z] stepReturnOnProcess(org.eclipse.ease.lang.python.jython.debugger.JythonDebugTest)  Time elapsed: 0.307 s
23:41:02 [2020-10-24T03:41:02.789Z] evaluateWatchExpression(org.eclipse.ease.lang.python.jython.debugger.JythonDebugTest)  Time elapsed: 0.209 s
23:41:02 [2020-10-24T03:41:02.789Z] 
23:41:02 [2020-10-24T03:41:02.789Z] Results:
23:41:02 [2020-10-24T03:41:02.789Z] 
23:41:02 [2020-10-24T03:41:02.789Z] Tests run: 42, Failures: 0, Errors: 0, Skipped: 0
23:41:02 [2020-10-24T03:41:02.789Z] 
23:41:03 [2020-10-24T03:41:03.715Z] [INFO] All tests passed!
23:41:03 [2020-10-24T03:41:03.715Z] [INFO] 
23:41:03 [2020-10-24T03:41:03.715Z] [INFO] --- maven-install-plugin:2.3.1:install (default-install) @ org.eclipse.ease.lang.python.jython.test ---
23:41:03 [2020-10-24T03:41:03.715Z] [INFO] Installing /home/jenkins/agent/workspace/ease.verify.core.target.2018-12/tests/org.eclipse.ease.lang.python.jython.test/target/org.eclipse.ease.lang.python.jython.test-0.8.0-SNAPSHOT.jar to /home/jenkins/.m2/repository/org/eclipse/ease/org.eclipse.ease.lang.python.jython.test/0.8.0-SNAPSHOT/org.eclipse.ease.lang.python.jython.test-0.8.0-SNAPSHOT.jar
23:41:03 [2020-10-24T03:41:03.715Z] [INFO] Installing /home/jenkins/agent/workspace/ease.verify.core.target.2018-12/tests/org.eclipse.ease.lang.python.jython.test/pom.xml to /home/jenkins/.m2/repository/org/eclipse/ease/org.eclipse.ease.lang.python.jython.test/0.8.0-SNAPSHOT/org.eclipse.ease.lang.python.jython.test-0.8.0-SNAPSHOT.pom
23:41:03 [2020-10-24T03:41:03.716Z] [INFO] Installing /home/jenkins/agent/workspace/ease.verify.core.target.2018-12/tests/org.eclipse.ease.lang.python.jython.test/target/org.eclipse.ease.lang.python.jython.test-0.8.0-SNAPSHOT-sources.jar to /home/jenkins/.m2/repository/org/eclipse/ease/org.eclipse.ease.lang.python.jython.test/0.8.0-SNAPSHOT/org.eclipse.ease.lang.python.jython.test-0.8.0-SNAPSHOT-sources.jar
23:41:03 [2020-10-24T03:41:03.716Z] [INFO] Installing /home/jenkins/agent/workspace/ease.verify.core.target.2018-12/tests/org.eclipse.ease.lang.python.jython.test/target/p2content.xml to /home/jenkins/.m2/repository/org/eclipse/ease/org.eclipse.ease.lang.python.jython.test/0.8.0-SNAPSHOT/org.eclipse.ease.lang.python.jython.test-0.8.0-SNAPSHOT-p2metadata.xml
23:41:03 [2020-10-24T03:41:03.716Z] [INFO] Installing /home/jenkins/agent/workspace/ease.verify.core.target.2018-12/tests/org.eclipse.ease.lang.python.jython.test/target/p2artifacts.xml to /home/jenkins/.m2/repository/org/eclipse/ease/org.eclipse.ease.lang.python.jython.test/0.8.0-SNAPSHOT/org.eclipse.ease.lang.python.jython.test-0.8.0-SNAPSHOT-p2artifacts.xml
23:41:03 [2020-10-24T03:41:03.716Z] [INFO] Installing /home/jenkins/agent/workspace/ease.verify.core.target.2018-12/tests/org.eclipse.ease.lang.python.jython.test/target/p2content.xml to /home/jenkins/.m2/repository/org/eclipse/ease/org.eclipse.ease.lang.python.jython.test/0.8.0-SNAPSHOT/org.eclipse.ease.lang.python.jython.test-0.8.0-SNAPSHOT-p2metadata.xml
23:41:03 [2020-10-24T03:41:03.716Z] [INFO] Installing /home/jenkins/agent/workspace/ease.verify.core.target.2018-12/tests/org.eclipse.ease.lang.python.jython.test/target/p2artifacts.xml to /home/jenkins/.m2/repository/org/eclipse/ease/org.eclipse.ease.lang.python.jython.test/0.8.0-SNAPSHOT/org.eclipse.ease.lang.python.jython.test-0.8.0-SNAPSHOT-p2artifacts.xml
23:41:03 [2020-10-24T03:41:03.716Z] [INFO] 
23:41:03 [2020-10-24T03:41:03.716Z] [INFO] --- tycho-p2-plugin:1.5.0:update-local-index (default-update-local-index) @ org.eclipse.ease.lang.python.jython.test ---
23:41:03 [2020-10-24T03:41:03.716Z] [INFO] 
23:41:03 [2020-10-24T03:41:03.716Z] [INFO] -----< org.eclipse.ease:org.eclipse.ease.lang.scriptarchive.test >------
23:41:03 [2020-10-24T03:41:03.716Z] [INFO] Building org.eclipse.ease.lang.scriptarchive.test 0.8.0-SNAPSHOT [44/48]
23:41:03 [2020-10-24T03:41:03.716Z] [INFO] ------------------------[ eclipse-test-plugin ]-------------------------
23:41:03 [2020-10-24T03:41:03.716Z] [INFO] 
23:41:03 [2020-10-24T03:41:03.716Z] [INFO] --- maven-clean-plugin:2.5:clean (default-clean) @ org.eclipse.ease.lang.scriptarchive.test ---
23:41:03 [2020-10-24T03:41:03.716Z] [INFO] 
23:41:03 [2020-10-24T03:41:03.716Z] [INFO] --- tycho-packaging-plugin:1.5.0:build-qualifier (default-build-qualifier) @ org.eclipse.ease.lang.scriptarchive.test ---
23:41:03 [2020-10-24T03:41:03.716Z] [INFO] The project's OSGi version is 0.8.0.I201910171213
23:41:03 [2020-10-24T03:41:03.716Z] [INFO] 
23:41:03 [2020-10-24T03:41:03.716Z] [INFO] --- tycho-packaging-plugin:1.5.0:validate-id (default-validate-id) @ org.eclipse.ease.lang.scriptarchive.test ---
23:41:03 [2020-10-24T03:41:03.716Z] [INFO] 
23:41:03 [2020-10-24T03:41:03.716Z] [INFO] --- tycho-packaging-plugin:1.5.0:validate-version (default-validate-version) @ org.eclipse.ease.lang.scriptarchive.test ---
23:41:03 [2020-10-24T03:41:03.716Z] [INFO] 
23:41:03 [2020-10-24T03:41:03.716Z] [INFO] >>> maven-javadoc-plugin:2.9.1:javadoc (build-docs) > generate-sources @ org.eclipse.ease.lang.scriptarchive.test >>>
23:41:03 [2020-10-24T03:41:03.716Z] [INFO] 
23:41:03 [2020-10-24T03:41:03.716Z] [INFO] --- tycho-packaging-plugin:1.5.0:build-qualifier (default-build-qualifier) @ org.eclipse.ease.lang.scriptarchive.test ---
23:41:03 [2020-10-24T03:41:03.716Z] [INFO] The project's OSGi version is 0.8.0.I201910171213
23:41:03 [2020-10-24T03:41:03.716Z] [INFO] 
23:41:03 [2020-10-24T03:41:03.716Z] [INFO] --- tycho-packaging-plugin:1.5.0:validate-id (default-validate-id) @ org.eclipse.ease.lang.scriptarchive.test ---
23:41:03 [2020-10-24T03:41:03.716Z] [INFO] 
23:41:03 [2020-10-24T03:41:03.716Z] [INFO] --- tycho-packaging-plugin:1.5.0:validate-version (default-validate-version) @ org.eclipse.ease.lang.scriptarchive.test ---
23:41:03 [2020-10-24T03:41:03.716Z] [INFO] 
23:41:03 [2020-10-24T03:41:03.716Z] [INFO] <<< maven-javadoc-plugin:2.9.1:javadoc (build-docs) < generate-sources @ org.eclipse.ease.lang.scriptarchive.test <<<
23:41:03 [2020-10-24T03:41:03.716Z] [INFO] 
23:41:03 [2020-10-24T03:41:03.716Z] [INFO] 
23:41:03 [2020-10-24T03:41:03.716Z] [INFO] --- maven-javadoc-plugin:2.9.1:javadoc (build-docs) @ org.eclipse.ease.lang.scriptarchive.test ---
23:41:03 [2020-10-24T03:41:03.716Z] [ERROR] Error fetching link: http://help.eclipse.org/oxygen/topic/org.eclipse.platform.doc.isv/reference/api/package-list. Ignored it.
23:41:03 [2020-10-24T03:41:03.716Z] [ERROR] Error fetching link: https://ci.eclipse.org/ease/job/ease.build.core/JavaDoc/package-list. Ignored it.
23:41:04 [2020-10-24T03:41:04.662Z] [INFO] 
23:41:04 [2020-10-24T03:41:04.662Z] Loading source files for package org.eclipse.ease.lang.scriptarchive...
23:41:04 [2020-10-24T03:41:04.662Z] Constructing Javadoc information...
23:41:04 [2020-10-24T03:41:04.662Z] WARNING: Cannot open location "/home/jenkins/agent/workspace/ease.verify.core.target.2018-12/tests/org.eclipse.ease.lang.scriptarchive.test/target/javadoc-bundle-options/package-list"
23:41:04 [2020-10-24T03:41:04.662Z] No plugin definition found, skipping
23:41:04 [2020-10-24T03:41:04.662Z] No plugin definition found, skipping
23:41:04 [2020-10-24T03:41:04.662Z] [WARNING] Javadoc Warnings
23:41:04 [2020-10-24T03:41:04.662Z] [WARNING] Picked up JAVA_TOOL_OPTIONS: -Dmaven.ext.class.path="/home/jenkins/agent/workspace/ease.verify.core.target.2018-12@tmp/withMavenbe6870a0/pipeline-maven-spy.jar" -Dorg.jenkinsci.plugins.pipeline.maven.reportsFolder="/home/jenkins/agent/workspace/ease.verify.core.target.2018-12@tmp/withMavenbe6870a0"
23:41:04 [2020-10-24T03:41:04.662Z] [WARNING] javadoc: warning - The old Doclet and Taglet APIs in the packages
23:41:04 [2020-10-24T03:41:04.662Z] [WARNING] com.sun.javadoc, com.sun.tools.doclets and their implementations
23:41:04 [2020-10-24T03:41:04.662Z] [WARNING] are planned to be removed in a future JDK release. These
23:41:04 [2020-10-24T03:41:04.662Z] [WARNING] components have been superseded by the new APIs in jdk.javadoc.doclet.
23:41:04 [2020-10-24T03:41:04.662Z] [WARNING] Users are strongly recommended to migrate to the new APIs.
23:41:04 [2020-10-24T03:41:04.662Z] [INFO] 
23:41:04 [2020-10-24T03:41:04.662Z] [INFO] --- build-helper-maven-plugin:1.9.1:add-resource (add_help) @ org.eclipse.ease.lang.scriptarchive.test ---
23:41:04 [2020-10-24T03:41:04.918Z] [INFO] 
23:41:04 [2020-10-24T03:41:04.918Z] [INFO] --- maven-resources-plugin:2.4.3:resources (default-resources) @ org.eclipse.ease.lang.scriptarchive.test ---
23:41:04 [2020-10-24T03:41:04.918Z] [INFO] Using 'UTF-8' encoding to copy filtered resources.
23:41:04 [2020-10-24T03:41:04.918Z] [INFO] skip non existing resourceDirectory /home/jenkins/agent/workspace/ease.verify.core.target.2018-12/tests/org.eclipse.ease.lang.scriptarchive.test/src/main/resources
23:41:04 [2020-10-24T03:41:04.918Z] [INFO] skip non existing resourceDirectory /home/jenkins/agent/workspace/ease.verify.core.target.2018-12/tests/org.eclipse.ease.lang.scriptarchive.test/help
23:41:04 [2020-10-24T03:41:04.918Z] [INFO] 
23:41:04 [2020-10-24T03:41:04.918Z] [INFO] --- tycho-compiler-plugin:1.5.0:compile (default-compile) @ org.eclipse.ease.lang.scriptarchive.test ---
23:41:04 [2020-10-24T03:41:04.918Z] [INFO] Compiling 1 source file to /home/jenkins/agent/workspace/ease.verify.core.target.2018-12/tests/org.eclipse.ease.lang.scriptarchive.test/target/classes
23:41:04 [2020-10-24T03:41:04.918Z] [INFO] 
23:41:04 [2020-10-24T03:41:04.919Z] [INFO] --- maven-resources-plugin:2.4.3:testResources (default-testResources) @ org.eclipse.ease.lang.scriptarchive.test ---
23:41:04 [2020-10-24T03:41:04.919Z] [INFO] Using 'UTF-8' encoding to copy filtered resources.
23:41:04 [2020-10-24T03:41:04.919Z] [INFO] skip non existing resourceDirectory /home/jenkins/agent/workspace/ease.verify.core.target.2018-12/tests/org.eclipse.ease.lang.scriptarchive.test/src/test/resources
23:41:04 [2020-10-24T03:41:04.919Z] [INFO] 
23:41:04 [2020-10-24T03:41:04.919Z] [INFO] --- tycho-source-plugin:1.5.0:plugin-source (plugin-source) @ org.eclipse.ease.lang.scriptarchive.test ---
23:41:04 [2020-10-24T03:41:04.919Z] [INFO] Building jar: /home/jenkins/agent/workspace/ease.verify.core.target.2018-12/tests/org.eclipse.ease.lang.scriptarchive.test/target/org.eclipse.ease.lang.scriptarchive.test-0.8.0-SNAPSHOT-sources.jar
23:41:04 [2020-10-24T03:41:04.919Z] [INFO] 
23:41:04 [2020-10-24T03:41:04.919Z] [INFO] --- target-platform-configuration:1.5.0:target-platform (default-target-platform) @ org.eclipse.ease.lang.scriptarchive.test ---
23:41:04 [2020-10-24T03:41:04.919Z] [INFO] 
23:41:04 [2020-10-24T03:41:04.919Z] [INFO] --- tycho-packaging-plugin:1.5.0:package-plugin (default-package-plugin) @ org.eclipse.ease.lang.scriptarchive.test ---
23:41:04 [2020-10-24T03:41:04.919Z] [INFO] Building jar: /home/jenkins/agent/workspace/ease.verify.core.target.2018-12/tests/org.eclipse.ease.lang.scriptarchive.test/target/org.eclipse.ease.lang.scriptarchive.test-0.8.0-SNAPSHOT.jar
23:41:04 [2020-10-24T03:41:04.919Z] [INFO] 
23:41:04 [2020-10-24T03:41:04.919Z] [INFO] --- tycho-p2-plugin:1.5.0:p2-metadata-default (default-p2-metadata-default) @ org.eclipse.ease.lang.scriptarchive.test ---
23:41:04 [2020-10-24T03:41:04.919Z] [INFO] 
23:41:04 [2020-10-24T03:41:04.919Z] [INFO] --- tycho-source-feature-plugin:1.5.0:source-feature (source-feature) @ org.eclipse.ease.lang.scriptarchive.test ---
23:41:04 [2020-10-24T03:41:04.919Z] [INFO] 
23:41:04 [2020-10-24T03:41:04.919Z] [INFO] --- tycho-p2-plugin:1.5.0:p2-metadata (attached-p2-metadata) @ org.eclipse.ease.lang.scriptarchive.test ---
23:41:04 [2020-10-24T03:41:04.919Z] [INFO] 
23:41:04 [2020-10-24T03:41:04.919Z] [INFO] --- tycho-surefire-plugin:1.5.0:test (default-test) @ org.eclipse.ease.lang.scriptarchive.test ---
23:41:05 [2020-10-24T03:41:05.174Z] [INFO] Expected eclipse log file: /home/jenkins/agent/workspace/ease.verify.core.target.2018-12/tests/org.eclipse.ease.lang.scriptarchive.test/target/work/data/.metadata/.log
23:41:05 [2020-10-24T03:41:05.174Z] [INFO] Command line:
23:41:05 [2020-10-24T03:41:05.175Z] 	[/opt/tools/java/openjdk/jdk-11/11.0.2+9/bin/java, -Dosgi.noShutdown=false, -Dosgi.os=linux, -Dosgi.ws=gtk, -Dosgi.arch=x86_64, -Dosgi.clean=true, -jar, /home/jenkins/.m2/repository/p2/osgi/bundle/org.eclipse.equinox.launcher/1.5.800.v20200727-1323/org.eclipse.equinox.launcher-1.5.800.v20200727-1323.jar, -data, /home/jenkins/agent/workspace/ease.verify.core.target.2018-12/tests/org.eclipse.ease.lang.scriptarchive.test/target/work/data, -install, /home/jenkins/agent/workspace/ease.verify.core.target.2018-12/tests/org.eclipse.ease.lang.scriptarchive.test/target/work, -configuration, /home/jenkins/agent/workspace/ease.verify.core.target.2018-12/tests/org.eclipse.ease.lang.scriptarchive.test/target/work/configuration, -application, org.eclipse.tycho.surefire.osgibooter.headlesstest, -testproperties, /home/jenkins/agent/workspace/ease.verify.core.target.2018-12/tests/org.eclipse.ease.lang.scriptarchive.test/target/surefire.properties]
23:41:05 [2020-10-24T03:41:05.175Z] Picked up JAVA_TOOL_OPTIONS: -Dmaven.ext.class.path="/home/jenkins/agent/workspace/ease.verify.core.target.2018-12@tmp/withMavenbe6870a0/pipeline-maven-spy.jar" -Dorg.jenkinsci.plugins.pipeline.maven.reportsFolder="/home/jenkins/agent/workspace/ease.verify.core.target.2018-12@tmp/withMavenbe6870a0" 
23:41:07 [2020-10-24T03:41:07.166Z] Running org.eclipse.ease.lang.scriptarchive.ArchiveEngineTest
23:41:07 [2020-10-24T03:41:07.422Z] We are running from a zip file!
23:41:07 [2020-10-24T03:41:07.422Z] org.eclipse.ease.ScriptExecutionException: SyntaxError: missing ; before statement (workspace://__EASE_ScriptArchive_1/scripts/Master.js#3)
23:41:07 [2020-10-24T03:41:07.422Z] this is an error
23:41:07 [2020-10-24T03:41:07.422Z]        ^
23:41:07 [2020-10-24T03:41:07.422Z] 	at Master.js,workspace://__EASE_ScriptArchive_1/scripts/Master.js
23:41:07 [2020-10-24T03:41:07.422Z] org.eclipse.ease.ScriptExecutionException: SyntaxError: missing ; before statement (workspace://__EASE_ScriptArchive_1/scripts/Master.js#3)
23:41:07 [2020-10-24T03:41:07.422Z] this is an error
23:41:07 [2020-10-24T03:41:07.422Z]        ^
23:41:07 [2020-10-24T03:41:07.422Z] 	at Master.js,workspace://__EASE_ScriptArchive_1/scripts/Master.js
23:41:07 [2020-10-24T03:41:07.677Z] Tests run: 7, Failures: 0, Errors: 0, Skipped: 0, Time elapsed: 0.44 s - in org.eclipse.ease.lang.scriptarchive.ArchiveEngineTest
23:41:07 [2020-10-24T03:41:07.677Z] executeWithManifest(org.eclipse.ease.lang.scriptarchive.ArchiveEngineTest)  Time elapsed: 0.305 s
23:41:07 [2020-10-24T03:41:07.677Z] zipFileRegistration(org.eclipse.ease.lang.scriptarchive.ArchiveEngineTest)  Time elapsed: 0.006 s
23:41:07 [2020-10-24T03:41:07.677Z] engineIdRegistration(org.eclipse.ease.lang.scriptarchive.ArchiveEngineTest)  Time elapsed: 0 s
23:41:07 [2020-10-24T03:41:07.677Z] jarFileRegistration(org.eclipse.ease.lang.scriptarchive.ArchiveEngineTest)  Time elapsed: 0 s
23:41:07 [2020-10-24T03:41:07.677Z] sarFileRegistration(org.eclipse.ease.lang.scriptarchive.ArchiveEngineTest)  Time elapsed: 0 s
23:41:07 [2020-10-24T03:41:07.677Z] executeWithErrors(org.eclipse.ease.lang.scriptarchive.ArchiveEngineTest)  Time elapsed: 0.069 s
23:41:07 [2020-10-24T03:41:07.677Z] executeWithIncludes(org.eclipse.ease.lang.scriptarchive.ArchiveEngineTest)  Time elapsed: 0.04 s
23:41:07 [2020-10-24T03:41:07.677Z] 
23:41:07 [2020-10-24T03:41:07.677Z] Results:
23:41:07 [2020-10-24T03:41:07.677Z] 
23:41:07 [2020-10-24T03:41:07.677Z] Tests run: 7, Failures: 0, Errors: 0, Skipped: 0
23:41:07 [2020-10-24T03:41:07.678Z] 
23:41:08 [2020-10-24T03:41:08.238Z] [INFO] All tests passed!
23:41:08 [2020-10-24T03:41:08.238Z] [INFO] 
23:41:08 [2020-10-24T03:41:08.238Z] [INFO] --- maven-install-plugin:2.3.1:install (default-install) @ org.eclipse.ease.lang.scriptarchive.test ---
23:41:08 [2020-10-24T03:41:08.238Z] [INFO] Installing /home/jenkins/agent/workspace/ease.verify.core.target.2018-12/tests/org.eclipse.ease.lang.scriptarchive.test/target/org.eclipse.ease.lang.scriptarchive.test-0.8.0-SNAPSHOT.jar to /home/jenkins/.m2/repository/org/eclipse/ease/org.eclipse.ease.lang.scriptarchive.test/0.8.0-SNAPSHOT/org.eclipse.ease.lang.scriptarchive.test-0.8.0-SNAPSHOT.jar
23:41:08 [2020-10-24T03:41:08.238Z] [INFO] Installing /home/jenkins/agent/workspace/ease.verify.core.target.2018-12/tests/org.eclipse.ease.lang.scriptarchive.test/pom.xml to /home/jenkins/.m2/repository/org/eclipse/ease/org.eclipse.ease.lang.scriptarchive.test/0.8.0-SNAPSHOT/org.eclipse.ease.lang.scriptarchive.test-0.8.0-SNAPSHOT.pom
23:41:08 [2020-10-24T03:41:08.238Z] [INFO] Installing /home/jenkins/agent/workspace/ease.verify.core.target.2018-12/tests/org.eclipse.ease.lang.scriptarchive.test/target/org.eclipse.ease.lang.scriptarchive.test-0.8.0-SNAPSHOT-sources.jar to /home/jenkins/.m2/repository/org/eclipse/ease/org.eclipse.ease.lang.scriptarchive.test/0.8.0-SNAPSHOT/org.eclipse.ease.lang.scriptarchive.test-0.8.0-SNAPSHOT-sources.jar
23:41:08 [2020-10-24T03:41:08.238Z] [INFO] Installing /home/jenkins/agent/workspace/ease.verify.core.target.2018-12/tests/org.eclipse.ease.lang.scriptarchive.test/target/p2content.xml to /home/jenkins/.m2/repository/org/eclipse/ease/org.eclipse.ease.lang.scriptarchive.test/0.8.0-SNAPSHOT/org.eclipse.ease.lang.scriptarchive.test-0.8.0-SNAPSHOT-p2metadata.xml
23:41:08 [2020-10-24T03:41:08.238Z] [INFO] Installing /home/jenkins/agent/workspace/ease.verify.core.target.2018-12/tests/org.eclipse.ease.lang.scriptarchive.test/target/p2artifacts.xml to /home/jenkins/.m2/repository/org/eclipse/ease/org.eclipse.ease.lang.scriptarchive.test/0.8.0-SNAPSHOT/org.eclipse.ease.lang.scriptarchive.test-0.8.0-SNAPSHOT-p2artifacts.xml
23:41:08 [2020-10-24T03:41:08.238Z] [INFO] Installing /home/jenkins/agent/workspace/ease.verify.core.target.2018-12/tests/org.eclipse.ease.lang.scriptarchive.test/target/p2content.xml to /home/jenkins/.m2/repository/org/eclipse/ease/org.eclipse.ease.lang.scriptarchive.test/0.8.0-SNAPSHOT/org.eclipse.ease.lang.scriptarchive.test-0.8.0-SNAPSHOT-p2metadata.xml
23:41:08 [2020-10-24T03:41:08.238Z] [INFO] Installing /home/jenkins/agent/workspace/ease.verify.core.target.2018-12/tests/org.eclipse.ease.lang.scriptarchive.test/target/p2artifacts.xml to /home/jenkins/.m2/repository/org/eclipse/ease/org.eclipse.ease.lang.scriptarchive.test/0.8.0-SNAPSHOT/org.eclipse.ease.lang.scriptarchive.test-0.8.0-SNAPSHOT-p2artifacts.xml
23:41:08 [2020-10-24T03:41:08.238Z] [INFO] 
23:41:08 [2020-10-24T03:41:08.238Z] [INFO] --- tycho-p2-plugin:1.5.0:update-local-index (default-update-local-index) @ org.eclipse.ease.lang.scriptarchive.test ---
23:41:08 [2020-10-24T03:41:08.238Z] [INFO] 
23:41:08 [2020-10-24T03:41:08.238Z] [INFO] --------< org.eclipse.ease:org.eclipse.ease.lang.unittest.test >--------
23:41:08 [2020-10-24T03:41:08.238Z] [INFO] Building org.eclipse.ease.lang.unittest.test 0.8.0-SNAPSHOT      [45/48]
23:41:08 [2020-10-24T03:41:08.238Z] [INFO] ------------------------[ eclipse-test-plugin ]-------------------------
23:41:08 [2020-10-24T03:41:08.238Z] [INFO] 
23:41:08 [2020-10-24T03:41:08.238Z] [INFO] --- maven-clean-plugin:2.5:clean (default-clean) @ org.eclipse.ease.lang.unittest.test ---
23:41:08 [2020-10-24T03:41:08.238Z] [INFO] 
23:41:08 [2020-10-24T03:41:08.239Z] [INFO] --- tycho-packaging-plugin:1.5.0:build-qualifier (default-build-qualifier) @ org.eclipse.ease.lang.unittest.test ---
23:41:08 [2020-10-24T03:41:08.239Z] [INFO] The project's OSGi version is 0.8.0.I202009240747
23:41:08 [2020-10-24T03:41:08.239Z] [INFO] 
23:41:08 [2020-10-24T03:41:08.239Z] [INFO] --- tycho-packaging-plugin:1.5.0:validate-id (default-validate-id) @ org.eclipse.ease.lang.unittest.test ---
23:41:08 [2020-10-24T03:41:08.239Z] [INFO] 
23:41:08 [2020-10-24T03:41:08.239Z] [INFO] --- tycho-packaging-plugin:1.5.0:validate-version (default-validate-version) @ org.eclipse.ease.lang.unittest.test ---
23:41:08 [2020-10-24T03:41:08.239Z] [INFO] 
23:41:08 [2020-10-24T03:41:08.239Z] [INFO] >>> maven-javadoc-plugin:2.9.1:javadoc (build-docs) > generate-sources @ org.eclipse.ease.lang.unittest.test >>>
23:41:08 [2020-10-24T03:41:08.239Z] [INFO] 
23:41:08 [2020-10-24T03:41:08.239Z] [INFO] --- tycho-packaging-plugin:1.5.0:build-qualifier (default-build-qualifier) @ org.eclipse.ease.lang.unittest.test ---
23:41:08 [2020-10-24T03:41:08.239Z] [INFO] The project's OSGi version is 0.8.0.I202009240747
23:41:08 [2020-10-24T03:41:08.239Z] [INFO] 
23:41:08 [2020-10-24T03:41:08.239Z] [INFO] --- tycho-packaging-plugin:1.5.0:validate-id (default-validate-id) @ org.eclipse.ease.lang.unittest.test ---
23:41:08 [2020-10-24T03:41:08.239Z] [INFO] 
23:41:08 [2020-10-24T03:41:08.239Z] [INFO] --- tycho-packaging-plugin:1.5.0:validate-version (default-validate-version) @ org.eclipse.ease.lang.unittest.test ---
23:41:08 [2020-10-24T03:41:08.239Z] [INFO] 
23:41:08 [2020-10-24T03:41:08.239Z] [INFO] <<< maven-javadoc-plugin:2.9.1:javadoc (build-docs) < generate-sources @ org.eclipse.ease.lang.unittest.test <<<
23:41:08 [2020-10-24T03:41:08.239Z] [INFO] 
23:41:08 [2020-10-24T03:41:08.239Z] [INFO] 
23:41:08 [2020-10-24T03:41:08.239Z] [INFO] --- maven-javadoc-plugin:2.9.1:javadoc (build-docs) @ org.eclipse.ease.lang.unittest.test ---
23:41:08 [2020-10-24T03:41:08.494Z] [ERROR] Error fetching link: http://help.eclipse.org/oxygen/topic/org.eclipse.platform.doc.isv/reference/api/package-list. Ignored it.
23:41:08 [2020-10-24T03:41:08.494Z] [ERROR] Error fetching link: https://ci.eclipse.org/ease/job/ease.build.core/JavaDoc/package-list. Ignored it.
23:41:09 [2020-10-24T03:41:09.894Z] [INFO] 
23:41:09 [2020-10-24T03:41:09.894Z] Loading source files for package org.eclipse.ease.lang.unittest...
23:41:09 [2020-10-24T03:41:09.894Z] Constructing Javadoc information...
23:41:09 [2020-10-24T03:41:09.894Z] WARNING: Cannot open location "/home/jenkins/agent/workspace/ease.verify.core.target.2018-12/tests/org.eclipse.ease.lang.unittest.test/target/javadoc-bundle-options/package-list"
23:41:09 [2020-10-24T03:41:09.894Z] No plugin definition found, skipping
23:41:09 [2020-10-24T03:41:09.894Z] No plugin definition found, skipping
23:41:09 [2020-10-24T03:41:09.894Z] [WARNING] Javadoc Warnings
23:41:09 [2020-10-24T03:41:09.894Z] [WARNING] Picked up JAVA_TOOL_OPTIONS: -Dmaven.ext.class.path="/home/jenkins/agent/workspace/ease.verify.core.target.2018-12@tmp/withMavenbe6870a0/pipeline-maven-spy.jar" -Dorg.jenkinsci.plugins.pipeline.maven.reportsFolder="/home/jenkins/agent/workspace/ease.verify.core.target.2018-12@tmp/withMavenbe6870a0"
23:41:09 [2020-10-24T03:41:09.894Z] [WARNING] javadoc: warning - The old Doclet and Taglet APIs in the packages
23:41:09 [2020-10-24T03:41:09.894Z] [WARNING] com.sun.javadoc, com.sun.tools.doclets and their implementations
23:41:09 [2020-10-24T03:41:09.894Z] [WARNING] are planned to be removed in a future JDK release. These
23:41:09 [2020-10-24T03:41:09.894Z] [WARNING] components have been superseded by the new APIs in jdk.javadoc.doclet.
23:41:09 [2020-10-24T03:41:09.894Z] [WARNING] Users are strongly recommended to migrate to the new APIs.
23:41:09 [2020-10-24T03:41:09.894Z] [INFO] 
23:41:09 [2020-10-24T03:41:09.894Z] [INFO] --- build-helper-maven-plugin:1.9.1:add-resource (add_help) @ org.eclipse.ease.lang.unittest.test ---
23:41:09 [2020-10-24T03:41:09.894Z] [INFO] 
23:41:09 [2020-10-24T03:41:09.894Z] [INFO] --- maven-resources-plugin:2.4.3:resources (default-resources) @ org.eclipse.ease.lang.unittest.test ---
23:41:09 [2020-10-24T03:41:09.894Z] [INFO] Using 'UTF-8' encoding to copy filtered resources.
23:41:09 [2020-10-24T03:41:09.894Z] [INFO] skip non existing resourceDirectory /home/jenkins/agent/workspace/ease.verify.core.target.2018-12/tests/org.eclipse.ease.lang.unittest.test/src/main/resources
23:41:09 [2020-10-24T03:41:09.894Z] [INFO] skip non existing resourceDirectory /home/jenkins/agent/workspace/ease.verify.core.target.2018-12/tests/org.eclipse.ease.lang.unittest.test/help
23:41:09 [2020-10-24T03:41:09.894Z] [INFO] 
23:41:09 [2020-10-24T03:41:09.894Z] [INFO] --- tycho-compiler-plugin:1.5.0:compile (default-compile) @ org.eclipse.ease.lang.unittest.test ---
23:41:09 [2020-10-24T03:41:09.894Z] [INFO] Compiling 3 source files to /home/jenkins/agent/workspace/ease.verify.core.target.2018-12/tests/org.eclipse.ease.lang.unittest.test/target/classes
23:41:09 [2020-10-24T03:41:09.894Z] [INFO] 
23:41:09 [2020-10-24T03:41:09.894Z] [INFO] --- maven-resources-plugin:2.4.3:testResources (default-testResources) @ org.eclipse.ease.lang.unittest.test ---
23:41:09 [2020-10-24T03:41:09.894Z] [INFO] Using 'UTF-8' encoding to copy filtered resources.
23:41:09 [2020-10-24T03:41:09.894Z] [INFO] skip non existing resourceDirectory /home/jenkins/agent/workspace/ease.verify.core.target.2018-12/tests/org.eclipse.ease.lang.unittest.test/src/test/resources
23:41:09 [2020-10-24T03:41:09.894Z] [INFO] 
23:41:09 [2020-10-24T03:41:09.895Z] [INFO] --- tycho-source-plugin:1.5.0:plugin-source (plugin-source) @ org.eclipse.ease.lang.unittest.test ---
23:41:09 [2020-10-24T03:41:09.895Z] [WARNING] Bundle-Name header not found in /home/jenkins/agent/workspace/ease.verify.core.target.2018-12/tests/org.eclipse.ease.lang.unittest.test/META-INF/MANIFEST.MF, fallback to Bundle-SymbolicName for source bundle
23:41:09 [2020-10-24T03:41:09.895Z] [WARNING] Bundle-Vendor header not found in /home/jenkins/agent/workspace/ease.verify.core.target.2018-12/tests/org.eclipse.ease.lang.unittest.test/META-INF/MANIFEST.MF, fallback to 'unknown' for source bundle
23:41:09 [2020-10-24T03:41:09.895Z] [INFO] Building jar: /home/jenkins/agent/workspace/ease.verify.core.target.2018-12/tests/org.eclipse.ease.lang.unittest.test/target/org.eclipse.ease.lang.unittest.test-0.8.0-SNAPSHOT-sources.jar
23:41:09 [2020-10-24T03:41:09.895Z] [INFO] 
23:41:09 [2020-10-24T03:41:09.895Z] [INFO] --- target-platform-configuration:1.5.0:target-platform (default-target-platform) @ org.eclipse.ease.lang.unittest.test ---
23:41:09 [2020-10-24T03:41:09.895Z] [INFO] 
23:41:09 [2020-10-24T03:41:09.895Z] [INFO] --- tycho-packaging-plugin:1.5.0:package-plugin (default-package-plugin) @ org.eclipse.ease.lang.unittest.test ---
23:41:09 [2020-10-24T03:41:09.895Z] [INFO] Building jar: /home/jenkins/agent/workspace/ease.verify.core.target.2018-12/tests/org.eclipse.ease.lang.unittest.test/target/org.eclipse.ease.lang.unittest.test-0.8.0-SNAPSHOT.jar
23:41:09 [2020-10-24T03:41:09.895Z] [INFO] 
23:41:09 [2020-10-24T03:41:09.895Z] [INFO] --- tycho-p2-plugin:1.5.0:p2-metadata-default (default-p2-metadata-default) @ org.eclipse.ease.lang.unittest.test ---
23:41:09 [2020-10-24T03:41:09.895Z] [INFO] 
23:41:09 [2020-10-24T03:41:09.895Z] [INFO] --- tycho-source-feature-plugin:1.5.0:source-feature (source-feature) @ org.eclipse.ease.lang.unittest.test ---
23:41:09 [2020-10-24T03:41:09.895Z] [INFO] 
23:41:09 [2020-10-24T03:41:09.895Z] [INFO] --- tycho-p2-plugin:1.5.0:p2-metadata (attached-p2-metadata) @ org.eclipse.ease.lang.unittest.test ---
23:41:09 [2020-10-24T03:41:09.895Z] [INFO] 
23:41:09 [2020-10-24T03:41:09.895Z] [INFO] --- tycho-surefire-plugin:1.5.0:test (default-test) @ org.eclipse.ease.lang.unittest.test ---
23:41:09 [2020-10-24T03:41:09.895Z] [INFO] Expected eclipse log file: /home/jenkins/agent/workspace/ease.verify.core.target.2018-12/tests/org.eclipse.ease.lang.unittest.test/target/work/data/.metadata/.log
23:41:09 [2020-10-24T03:41:09.895Z] [INFO] Command line:
23:41:10 [2020-10-24T03:41:10.151Z] 	[/opt/tools/java/openjdk/jdk-11/11.0.2+9/bin/java, -Dosgi.noShutdown=false, -Dosgi.os=linux, -Dosgi.ws=gtk, -Dosgi.arch=x86_64, -Dosgi.clean=true, -jar, /home/jenkins/.m2/repository/p2/osgi/bundle/org.eclipse.equinox.launcher/1.5.800.v20200727-1323/org.eclipse.equinox.launcher-1.5.800.v20200727-1323.jar, -data, /home/jenkins/agent/workspace/ease.verify.core.target.2018-12/tests/org.eclipse.ease.lang.unittest.test/target/work/data, -install, /home/jenkins/agent/workspace/ease.verify.core.target.2018-12/tests/org.eclipse.ease.lang.unittest.test/target/work, -configuration, /home/jenkins/agent/workspace/ease.verify.core.target.2018-12/tests/org.eclipse.ease.lang.unittest.test/target/work/configuration, -application, org.eclipse.tycho.surefire.osgibooter.headlesstest, -testproperties, /home/jenkins/agent/workspace/ease.verify.core.target.2018-12/tests/org.eclipse.ease.lang.unittest.test/target/surefire.properties]
23:41:10 [2020-10-24T03:41:10.151Z] Picked up JAVA_TOOL_OPTIONS: -Dmaven.ext.class.path="/home/jenkins/agent/workspace/ease.verify.core.target.2018-12@tmp/withMavenbe6870a0/pipeline-maven-spy.jar" -Dorg.jenkinsci.plugins.pipeline.maven.reportsFolder="/home/jenkins/agent/workspace/ease.verify.core.target.2018-12@tmp/withMavenbe6870a0" 
23:41:12 [2020-10-24T03:41:12.119Z] Running org.eclipse.ease.lang.unittest.ModernJavaScriptTest
23:41:14 [2020-10-24T03:41:14.058Z] Tests run: 8, Failures: 0, Errors: 0, Skipped: 0, Time elapsed: 1.747 s - in org.eclipse.ease.lang.unittest.ModernJavaScriptTest
23:41:14 [2020-10-24T03:41:14.058Z] folderStatus(org.eclipse.ease.lang.unittest.ModernJavaScriptTest)  Time elapsed: 0.704 s
23:41:14 [2020-10-24T03:41:14.058Z] verifyOutput(org.eclipse.ease.lang.unittest.ModernJavaScriptTest)  Time elapsed: 0.198 s
23:41:14 [2020-10-24T03:41:14.058Z] suiteStatus(org.eclipse.ease.lang.unittest.ModernJavaScriptTest)  Time elapsed: 0.146 s
23:41:14 [2020-10-24T03:41:14.058Z] ignoreTestStatus(org.eclipse.ease.lang.unittest.ModernJavaScriptTest)  Time elapsed: 0.17 s
23:41:14 [2020-10-24T03:41:14.058Z] ignoreTestClassStatus(org.eclipse.ease.lang.unittest.ModernJavaScriptTest)  Time elapsed: 0.111 s
23:41:14 [2020-10-24T03:41:14.058Z] failureTestClassStatus(org.eclipse.ease.lang.unittest.ModernJavaScriptTest)  Time elapsed: 0.117 s
23:41:14 [2020-10-24T03:41:14.058Z] errorTestClassStatus(org.eclipse.ease.lang.unittest.ModernJavaScriptTest)  Time elapsed: 0.102 s
23:41:14 [2020-10-24T03:41:14.058Z] passTestClassStatus(org.eclipse.ease.lang.unittest.ModernJavaScriptTest)  Time elapsed: 0.104 s
23:41:14 [2020-10-24T03:41:14.058Z] Running org.eclipse.ease.lang.unittest.ClassicJavaScriptTest
23:41:14 [2020-10-24T03:41:14.620Z] Tests run: 7, Failures: 0, Errors: 0, Skipped: 0, Time elapsed: 0.512 s - in org.eclipse.ease.lang.unittest.ClassicJavaScriptTest
23:41:14 [2020-10-24T03:41:14.620Z] folderStatus(org.eclipse.ease.lang.unittest.ClassicJavaScriptTest)  Time elapsed: 0.061 s
23:41:14 [2020-10-24T03:41:14.620Z] errorTestStatus(org.eclipse.ease.lang.unittest.ClassicJavaScriptTest)  Time elapsed: 0.085 s
23:41:14 [2020-10-24T03:41:14.620Z] failureTestStatus(org.eclipse.ease.lang.unittest.ClassicJavaScriptTest)  Time elapsed: 0.081 s
23:41:14 [2020-10-24T03:41:14.620Z] verifyOutput(org.eclipse.ease.lang.unittest.ClassicJavaScriptTest)  Time elapsed: 0.079 s
23:41:14 [2020-10-24T03:41:14.620Z] suiteStatus(org.eclipse.ease.lang.unittest.ClassicJavaScriptTest)  Time elapsed: 0.058 s
23:41:14 [2020-10-24T03:41:14.620Z] ignoreTestStatus(org.eclipse.ease.lang.unittest.ClassicJavaScriptTest)  Time elapsed: 0.077 s
23:41:14 [2020-10-24T03:41:14.620Z] passTestStatus(org.eclipse.ease.lang.unittest.ClassicJavaScriptTest)  Time elapsed: 0.07 s
23:41:14 [2020-10-24T03:41:14.620Z] 
23:41:14 [2020-10-24T03:41:14.620Z] Results:
23:41:14 [2020-10-24T03:41:14.620Z] 
23:41:14 [2020-10-24T03:41:14.620Z] Tests run: 15, Failures: 0, Errors: 0, Skipped: 0
23:41:14 [2020-10-24T03:41:14.620Z] 
23:41:15 [2020-10-24T03:41:15.181Z] [INFO] All tests passed!
23:41:15 [2020-10-24T03:41:15.181Z] [INFO] 
23:41:15 [2020-10-24T03:41:15.181Z] [INFO] --- maven-install-plugin:2.3.1:install (default-install) @ org.eclipse.ease.lang.unittest.test ---
23:41:15 [2020-10-24T03:41:15.181Z] [INFO] Installing /home/jenkins/agent/workspace/ease.verify.core.target.2018-12/tests/org.eclipse.ease.lang.unittest.test/target/org.eclipse.ease.lang.unittest.test-0.8.0-SNAPSHOT.jar to /home/jenkins/.m2/repository/org/eclipse/ease/org.eclipse.ease.lang.unittest.test/0.8.0-SNAPSHOT/org.eclipse.ease.lang.unittest.test-0.8.0-SNAPSHOT.jar
23:41:15 [2020-10-24T03:41:15.181Z] [INFO] Installing /home/jenkins/agent/workspace/ease.verify.core.target.2018-12/tests/org.eclipse.ease.lang.unittest.test/pom.xml to /home/jenkins/.m2/repository/org/eclipse/ease/org.eclipse.ease.lang.unittest.test/0.8.0-SNAPSHOT/org.eclipse.ease.lang.unittest.test-0.8.0-SNAPSHOT.pom
23:41:15 [2020-10-24T03:41:15.182Z] [INFO] Installing /home/jenkins/agent/workspace/ease.verify.core.target.2018-12/tests/org.eclipse.ease.lang.unittest.test/target/org.eclipse.ease.lang.unittest.test-0.8.0-SNAPSHOT-sources.jar to /home/jenkins/.m2/repository/org/eclipse/ease/org.eclipse.ease.lang.unittest.test/0.8.0-SNAPSHOT/org.eclipse.ease.lang.unittest.test-0.8.0-SNAPSHOT-sources.jar
23:41:15 [2020-10-24T03:41:15.182Z] [INFO] Installing /home/jenkins/agent/workspace/ease.verify.core.target.2018-12/tests/org.eclipse.ease.lang.unittest.test/target/p2content.xml to /home/jenkins/.m2/repository/org/eclipse/ease/org.eclipse.ease.lang.unittest.test/0.8.0-SNAPSHOT/org.eclipse.ease.lang.unittest.test-0.8.0-SNAPSHOT-p2metadata.xml
23:41:15 [2020-10-24T03:41:15.182Z] [INFO] Installing /home/jenkins/agent/workspace/ease.verify.core.target.2018-12/tests/org.eclipse.ease.lang.unittest.test/target/p2artifacts.xml to /home/jenkins/.m2/repository/org/eclipse/ease/org.eclipse.ease.lang.unittest.test/0.8.0-SNAPSHOT/org.eclipse.ease.lang.unittest.test-0.8.0-SNAPSHOT-p2artifacts.xml
23:41:15 [2020-10-24T03:41:15.182Z] [INFO] Installing /home/jenkins/agent/workspace/ease.verify.core.target.2018-12/tests/org.eclipse.ease.lang.unittest.test/target/p2content.xml to /home/jenkins/.m2/repository/org/eclipse/ease/org.eclipse.ease.lang.unittest.test/0.8.0-SNAPSHOT/org.eclipse.ease.lang.unittest.test-0.8.0-SNAPSHOT-p2metadata.xml
23:41:15 [2020-10-24T03:41:15.182Z] [INFO] Installing /home/jenkins/agent/workspace/ease.verify.core.target.2018-12/tests/org.eclipse.ease.lang.unittest.test/target/p2artifacts.xml to /home/jenkins/.m2/repository/org/eclipse/ease/org.eclipse.ease.lang.unittest.test/0.8.0-SNAPSHOT/org.eclipse.ease.lang.unittest.test-0.8.0-SNAPSHOT-p2artifacts.xml
23:41:15 [2020-10-24T03:41:15.182Z] [INFO] 
23:41:15 [2020-10-24T03:41:15.182Z] [INFO] --- tycho-p2-plugin:1.5.0:update-local-index (default-update-local-index) @ org.eclipse.ease.lang.unittest.test ---
23:41:15 [2020-10-24T03:41:15.182Z] [INFO] 
23:41:15 [2020-10-24T03:41:15.182Z] [INFO] ---------< org.eclipse.ease:org.eclipse.ease.ui.scripts.test >----------
23:41:15 [2020-10-24T03:41:15.182Z] [INFO] Building org.eclipse.ease.ui.scripts.test 0.8.0-SNAPSHOT         [46/48]
23:41:15 [2020-10-24T03:41:15.182Z] [INFO] ------------------------[ eclipse-test-plugin ]-------------------------
23:41:15 [2020-10-24T03:41:15.182Z] [INFO] 
23:41:15 [2020-10-24T03:41:15.182Z] [INFO] --- maven-clean-plugin:2.5:clean (default-clean) @ org.eclipse.ease.ui.scripts.test ---
23:41:15 [2020-10-24T03:41:15.182Z] [INFO] 
23:41:15 [2020-10-24T03:41:15.182Z] [INFO] --- tycho-packaging-plugin:1.5.0:build-qualifier (default-build-qualifier) @ org.eclipse.ease.ui.scripts.test ---
23:41:15 [2020-10-24T03:41:15.182Z] [INFO] The project's OSGi version is 0.8.0.I202009240747
23:41:15 [2020-10-24T03:41:15.182Z] [INFO] 
23:41:15 [2020-10-24T03:41:15.182Z] [INFO] --- tycho-packaging-plugin:1.5.0:validate-id (default-validate-id) @ org.eclipse.ease.ui.scripts.test ---
23:41:15 [2020-10-24T03:41:15.182Z] [INFO] 
23:41:15 [2020-10-24T03:41:15.182Z] [INFO] --- tycho-packaging-plugin:1.5.0:validate-version (default-validate-version) @ org.eclipse.ease.ui.scripts.test ---
23:41:15 [2020-10-24T03:41:15.182Z] [INFO] 
23:41:15 [2020-10-24T03:41:15.182Z] [INFO] >>> maven-javadoc-plugin:2.9.1:javadoc (build-docs) > generate-sources @ org.eclipse.ease.ui.scripts.test >>>
23:41:15 [2020-10-24T03:41:15.182Z] [INFO] 
23:41:15 [2020-10-24T03:41:15.182Z] [INFO] --- tycho-packaging-plugin:1.5.0:build-qualifier (default-build-qualifier) @ org.eclipse.ease.ui.scripts.test ---
23:41:15 [2020-10-24T03:41:15.182Z] [INFO] The project's OSGi version is 0.8.0.I202009240747
23:41:15 [2020-10-24T03:41:15.182Z] [INFO] 
23:41:15 [2020-10-24T03:41:15.182Z] [INFO] --- tycho-packaging-plugin:1.5.0:validate-id (default-validate-id) @ org.eclipse.ease.ui.scripts.test ---
23:41:15 [2020-10-24T03:41:15.182Z] [INFO] 
23:41:15 [2020-10-24T03:41:15.182Z] [INFO] --- tycho-packaging-plugin:1.5.0:validate-version (default-validate-version) @ org.eclipse.ease.ui.scripts.test ---
23:41:15 [2020-10-24T03:41:15.182Z] [INFO] 
23:41:15 [2020-10-24T03:41:15.182Z] [INFO] <<< maven-javadoc-plugin:2.9.1:javadoc (build-docs) < generate-sources @ org.eclipse.ease.ui.scripts.test <<<
23:41:15 [2020-10-24T03:41:15.182Z] [INFO] 
23:41:15 [2020-10-24T03:41:15.182Z] [INFO] 
23:41:15 [2020-10-24T03:41:15.182Z] [INFO] --- maven-javadoc-plugin:2.9.1:javadoc (build-docs) @ org.eclipse.ease.ui.scripts.test ---
23:41:15 [2020-10-24T03:41:15.182Z] [ERROR] Error fetching link: http://help.eclipse.org/oxygen/topic/org.eclipse.platform.doc.isv/reference/api/package-list. Ignored it.
23:41:15 [2020-10-24T03:41:15.182Z] [ERROR] Error fetching link: https://ci.eclipse.org/ease/job/ease.build.core/JavaDoc/package-list. Ignored it.
23:41:16 [2020-10-24T03:41:16.109Z] [INFO] 
23:41:16 [2020-10-24T03:41:16.109Z] Loading source files for package org.eclipse.ease.ui.scripts.expressions.definitions...
23:41:16 [2020-10-24T03:41:16.109Z] Constructing Javadoc information...
23:41:16 [2020-10-24T03:41:16.109Z] WARNING: Cannot open location "/home/jenkins/agent/workspace/ease.verify.core.target.2018-12/tests/org.eclipse.ease.ui.scripts.test/target/javadoc-bundle-options/package-list"
23:41:16 [2020-10-24T03:41:16.109Z] No plugin definition found, skipping
23:41:16 [2020-10-24T03:41:16.109Z] No plugin definition found, skipping
23:41:16 [2020-10-24T03:41:16.109Z] [WARNING] Javadoc Warnings
23:41:16 [2020-10-24T03:41:16.109Z] [WARNING] Picked up JAVA_TOOL_OPTIONS: -Dmaven.ext.class.path="/home/jenkins/agent/workspace/ease.verify.core.target.2018-12@tmp/withMavenbe6870a0/pipeline-maven-spy.jar" -Dorg.jenkinsci.plugins.pipeline.maven.reportsFolder="/home/jenkins/agent/workspace/ease.verify.core.target.2018-12@tmp/withMavenbe6870a0"
23:41:16 [2020-10-24T03:41:16.109Z] [WARNING] javadoc: warning - The old Doclet and Taglet APIs in the packages
23:41:16 [2020-10-24T03:41:16.109Z] [WARNING] com.sun.javadoc, com.sun.tools.doclets and their implementations
23:41:16 [2020-10-24T03:41:16.109Z] [WARNING] are planned to be removed in a future JDK release. These
23:41:16 [2020-10-24T03:41:16.109Z] [WARNING] components have been superseded by the new APIs in jdk.javadoc.doclet.
23:41:16 [2020-10-24T03:41:16.109Z] [WARNING] Users are strongly recommended to migrate to the new APIs.
23:41:16 [2020-10-24T03:41:16.109Z] [INFO] 
23:41:16 [2020-10-24T03:41:16.109Z] [INFO] --- build-helper-maven-plugin:1.9.1:add-resource (add_help) @ org.eclipse.ease.ui.scripts.test ---
23:41:16 [2020-10-24T03:41:16.109Z] [INFO] 
23:41:16 [2020-10-24T03:41:16.109Z] [INFO] --- maven-resources-plugin:2.4.3:resources (default-resources) @ org.eclipse.ease.ui.scripts.test ---
23:41:16 [2020-10-24T03:41:16.109Z] [INFO] Using 'UTF-8' encoding to copy filtered resources.
23:41:16 [2020-10-24T03:41:16.109Z] [INFO] skip non existing resourceDirectory /home/jenkins/agent/workspace/ease.verify.core.target.2018-12/tests/org.eclipse.ease.ui.scripts.test/src/main/resources
23:41:16 [2020-10-24T03:41:16.109Z] [INFO] skip non existing resourceDirectory /home/jenkins/agent/workspace/ease.verify.core.target.2018-12/tests/org.eclipse.ease.ui.scripts.test/help
23:41:16 [2020-10-24T03:41:16.109Z] [INFO] 
23:41:16 [2020-10-24T03:41:16.109Z] [INFO] --- tycho-compiler-plugin:1.5.0:compile (default-compile) @ org.eclipse.ease.ui.scripts.test ---
23:41:16 [2020-10-24T03:41:16.109Z] [INFO] Compiling 1 source file to /home/jenkins/agent/workspace/ease.verify.core.target.2018-12/tests/org.eclipse.ease.ui.scripts.test/target/classes
23:41:16 [2020-10-24T03:41:16.365Z] [INFO] 
23:41:16 [2020-10-24T03:41:16.365Z] [INFO] --- maven-resources-plugin:2.4.3:testResources (default-testResources) @ org.eclipse.ease.ui.scripts.test ---
23:41:16 [2020-10-24T03:41:16.365Z] [INFO] Using 'UTF-8' encoding to copy filtered resources.
23:41:16 [2020-10-24T03:41:16.365Z] [INFO] skip non existing resourceDirectory /home/jenkins/agent/workspace/ease.verify.core.target.2018-12/tests/org.eclipse.ease.ui.scripts.test/src/test/resources
23:41:16 [2020-10-24T03:41:16.365Z] [INFO] 
23:41:16 [2020-10-24T03:41:16.365Z] [INFO] --- tycho-source-plugin:1.5.0:plugin-source (plugin-source) @ org.eclipse.ease.ui.scripts.test ---
23:41:16 [2020-10-24T03:41:16.365Z] [INFO] Building jar: /home/jenkins/agent/workspace/ease.verify.core.target.2018-12/tests/org.eclipse.ease.ui.scripts.test/target/org.eclipse.ease.ui.scripts.test-0.8.0-SNAPSHOT-sources.jar
23:41:16 [2020-10-24T03:41:16.365Z] [INFO] 
23:41:16 [2020-10-24T03:41:16.365Z] [INFO] --- target-platform-configuration:1.5.0:target-platform (default-target-platform) @ org.eclipse.ease.ui.scripts.test ---
23:41:16 [2020-10-24T03:41:16.365Z] [INFO] 
23:41:16 [2020-10-24T03:41:16.365Z] [INFO] --- tycho-packaging-plugin:1.5.0:package-plugin (default-package-plugin) @ org.eclipse.ease.ui.scripts.test ---
23:41:16 [2020-10-24T03:41:16.365Z] [INFO] Building jar: /home/jenkins/agent/workspace/ease.verify.core.target.2018-12/tests/org.eclipse.ease.ui.scripts.test/target/org.eclipse.ease.ui.scripts.test-0.8.0-SNAPSHOT.jar
23:41:16 [2020-10-24T03:41:16.365Z] [INFO] 
23:41:16 [2020-10-24T03:41:16.365Z] [INFO] --- tycho-p2-plugin:1.5.0:p2-metadata-default (default-p2-metadata-default) @ org.eclipse.ease.ui.scripts.test ---
23:41:16 [2020-10-24T03:41:16.365Z] [INFO] 
23:41:16 [2020-10-24T03:41:16.366Z] [INFO] --- tycho-source-feature-plugin:1.5.0:source-feature (source-feature) @ org.eclipse.ease.ui.scripts.test ---
23:41:16 [2020-10-24T03:41:16.366Z] [INFO] 
23:41:16 [2020-10-24T03:41:16.366Z] [INFO] --- tycho-p2-plugin:1.5.0:p2-metadata (attached-p2-metadata) @ org.eclipse.ease.ui.scripts.test ---
23:41:16 [2020-10-24T03:41:16.366Z] [INFO] 
23:41:16 [2020-10-24T03:41:16.366Z] [INFO] --- tycho-surefire-plugin:1.5.0:test (default-test) @ org.eclipse.ease.ui.scripts.test ---
23:41:16 [2020-10-24T03:41:16.366Z] [INFO] Expected eclipse log file: /home/jenkins/agent/workspace/ease.verify.core.target.2018-12/tests/org.eclipse.ease.ui.scripts.test/target/work/data/.metadata/.log
23:41:16 [2020-10-24T03:41:16.366Z] [INFO] Command line:
23:41:16 [2020-10-24T03:41:16.366Z] 	[/opt/tools/java/openjdk/jdk-11/11.0.2+9/bin/java, -Dosgi.noShutdown=false, -Dosgi.os=linux, -Dosgi.ws=gtk, -Dosgi.arch=x86_64, -Dosgi.clean=true, -jar, /home/jenkins/.m2/repository/p2/osgi/bundle/org.eclipse.equinox.launcher/1.5.800.v20200727-1323/org.eclipse.equinox.launcher-1.5.800.v20200727-1323.jar, -data, /home/jenkins/agent/workspace/ease.verify.core.target.2018-12/tests/org.eclipse.ease.ui.scripts.test/target/work/data, -install, /home/jenkins/agent/workspace/ease.verify.core.target.2018-12/tests/org.eclipse.ease.ui.scripts.test/target/work, -configuration, /home/jenkins/agent/workspace/ease.verify.core.target.2018-12/tests/org.eclipse.ease.ui.scripts.test/target/work/configuration, -application, org.eclipse.tycho.surefire.osgibooter.headlesstest, -testproperties, /home/jenkins/agent/workspace/ease.verify.core.target.2018-12/tests/org.eclipse.ease.ui.scripts.test/target/surefire.properties]
23:41:16 [2020-10-24T03:41:16.366Z] Picked up JAVA_TOOL_OPTIONS: -Dmaven.ext.class.path="/home/jenkins/agent/workspace/ease.verify.core.target.2018-12@tmp/withMavenbe6870a0/pipeline-maven-spy.jar" -Dorg.jenkinsci.plugins.pipeline.maven.reportsFolder="/home/jenkins/agent/workspace/ease.verify.core.target.2018-12@tmp/withMavenbe6870a0" 
23:41:18 [2020-10-24T03:41:18.260Z] Running org.eclipse.ease.ui.scripts.expressions.definitions.ExpressionFactoryTest
23:41:18 [2020-10-24T03:41:18.260Z] Tests run: 14, Failures: 0, Errors: 0, Skipped: 0, Time elapsed: 0.023 s - in org.eclipse.ease.ui.scripts.expressions.definitions.ExpressionFactoryTest
23:41:18 [2020-10-24T03:41:18.260Z] loadClassWithExpression  Time elapsed: 0.008 s
23:41:18 [2020-10-24T03:41:18.260Z] createWithExpression  Time elapsed: 0.001 s
23:41:18 [2020-10-24T03:41:18.260Z] createReferenceExpression  Time elapsed: 0.001 s
23:41:18 [2020-10-24T03:41:18.260Z] loadClassReferenceExpression  Time elapsed: 0 s
23:41:18 [2020-10-24T03:41:18.260Z] loadClassTestExpression  Time elapsed: 0.001 s
23:41:18 [2020-10-24T03:41:18.260Z] createEqualsExpression  Time elapsed: 0.001 s
23:41:18 [2020-10-24T03:41:18.260Z] loadClassCountExpression  Time elapsed: 0 s
23:41:18 [2020-10-24T03:41:18.260Z] loadClassOrExpression  Time elapsed: 0 s
23:41:18 [2020-10-24T03:41:18.260Z] createTestExpression  Time elapsed: 0.002 s
23:41:18 [2020-10-24T03:41:18.260Z] createOrExpression  Time elapsed: 0 s
23:41:18 [2020-10-24T03:41:18.260Z] loadClassAndExpression  Time elapsed: 0 s
23:41:18 [2020-10-24T03:41:18.260Z] createAndExpression  Time elapsed: 0.001 s
23:41:18 [2020-10-24T03:41:18.260Z] loadClassEqualsExpression  Time elapsed: 0 s
23:41:18 [2020-10-24T03:41:18.260Z] createCountExpression  Time elapsed: 0.001 s
23:41:18 [2020-10-24T03:41:18.260Z] 
23:41:18 [2020-10-24T03:41:18.260Z] Results:
23:41:18 [2020-10-24T03:41:18.260Z] 
23:41:18 [2020-10-24T03:41:18.260Z] Tests run: 14, Failures: 0, Errors: 0, Skipped: 0
23:41:18 [2020-10-24T03:41:18.260Z] 
23:41:18 [2020-10-24T03:41:18.821Z] [INFO] All tests passed!
23:41:18 [2020-10-24T03:41:18.821Z] [INFO] 
23:41:18 [2020-10-24T03:41:18.821Z] [INFO] --- maven-install-plugin:2.3.1:install (default-install) @ org.eclipse.ease.ui.scripts.test ---
23:41:18 [2020-10-24T03:41:18.821Z] [INFO] Installing /home/jenkins/agent/workspace/ease.verify.core.target.2018-12/tests/org.eclipse.ease.ui.scripts.test/target/org.eclipse.ease.ui.scripts.test-0.8.0-SNAPSHOT.jar to /home/jenkins/.m2/repository/org/eclipse/ease/org.eclipse.ease.ui.scripts.test/0.8.0-SNAPSHOT/org.eclipse.ease.ui.scripts.test-0.8.0-SNAPSHOT.jar
23:41:18 [2020-10-24T03:41:18.822Z] [INFO] Installing /home/jenkins/agent/workspace/ease.verify.core.target.2018-12/tests/org.eclipse.ease.ui.scripts.test/pom.xml to /home/jenkins/.m2/repository/org/eclipse/ease/org.eclipse.ease.ui.scripts.test/0.8.0-SNAPSHOT/org.eclipse.ease.ui.scripts.test-0.8.0-SNAPSHOT.pom
23:41:18 [2020-10-24T03:41:18.822Z] [INFO] Installing /home/jenkins/agent/workspace/ease.verify.core.target.2018-12/tests/org.eclipse.ease.ui.scripts.test/target/org.eclipse.ease.ui.scripts.test-0.8.0-SNAPSHOT-sources.jar to /home/jenkins/.m2/repository/org/eclipse/ease/org.eclipse.ease.ui.scripts.test/0.8.0-SNAPSHOT/org.eclipse.ease.ui.scripts.test-0.8.0-SNAPSHOT-sources.jar
23:41:18 [2020-10-24T03:41:18.822Z] [INFO] Installing /home/jenkins/agent/workspace/ease.verify.core.target.2018-12/tests/org.eclipse.ease.ui.scripts.test/target/p2content.xml to /home/jenkins/.m2/repository/org/eclipse/ease/org.eclipse.ease.ui.scripts.test/0.8.0-SNAPSHOT/org.eclipse.ease.ui.scripts.test-0.8.0-SNAPSHOT-p2metadata.xml
23:41:18 [2020-10-24T03:41:18.822Z] [INFO] Installing /home/jenkins/agent/workspace/ease.verify.core.target.2018-12/tests/org.eclipse.ease.ui.scripts.test/target/p2artifacts.xml to /home/jenkins/.m2/repository/org/eclipse/ease/org.eclipse.ease.ui.scripts.test/0.8.0-SNAPSHOT/org.eclipse.ease.ui.scripts.test-0.8.0-SNAPSHOT-p2artifacts.xml
23:41:18 [2020-10-24T03:41:18.822Z] [INFO] Installing /home/jenkins/agent/workspace/ease.verify.core.target.2018-12/tests/org.eclipse.ease.ui.scripts.test/target/p2content.xml to /home/jenkins/.m2/repository/org/eclipse/ease/org.eclipse.ease.ui.scripts.test/0.8.0-SNAPSHOT/org.eclipse.ease.ui.scripts.test-0.8.0-SNAPSHOT-p2metadata.xml
23:41:18 [2020-10-24T03:41:18.822Z] [INFO] Installing /home/jenkins/agent/workspace/ease.verify.core.target.2018-12/tests/org.eclipse.ease.ui.scripts.test/target/p2artifacts.xml to /home/jenkins/.m2/repository/org/eclipse/ease/org.eclipse.ease.ui.scripts.test/0.8.0-SNAPSHOT/org.eclipse.ease.ui.scripts.test-0.8.0-SNAPSHOT-p2artifacts.xml
23:41:18 [2020-10-24T03:41:18.822Z] [INFO] 
23:41:18 [2020-10-24T03:41:18.822Z] [INFO] --- tycho-p2-plugin:1.5.0:update-local-index (default-update-local-index) @ org.eclipse.ease.ui.scripts.test ---
23:41:18 [2020-10-24T03:41:18.822Z] [INFO] 
23:41:18 [2020-10-24T03:41:18.822Z] [INFO] -------------< org.eclipse.ease:org.eclipse.ease.ui.test >--------------
23:41:18 [2020-10-24T03:41:18.822Z] [INFO] Building org.eclipse.ease.ui.test 0.8.0-SNAPSHOT                 [47/48]
23:41:18 [2020-10-24T03:41:18.822Z] [INFO] ------------------------[ eclipse-test-plugin ]-------------------------
23:41:18 [2020-10-24T03:41:18.822Z] [INFO] 
23:41:18 [2020-10-24T03:41:18.822Z] [INFO] --- maven-clean-plugin:2.5:clean (default-clean) @ org.eclipse.ease.ui.test ---
23:41:18 [2020-10-24T03:41:18.822Z] [INFO] 
23:41:18 [2020-10-24T03:41:18.822Z] [INFO] --- tycho-packaging-plugin:1.5.0:build-qualifier (default-build-qualifier) @ org.eclipse.ease.ui.test ---
23:41:18 [2020-10-24T03:41:18.822Z] [INFO] The project's OSGi version is 0.8.0.I201910171213
23:41:18 [2020-10-24T03:41:18.822Z] [INFO] 
23:41:18 [2020-10-24T03:41:18.822Z] [INFO] --- tycho-packaging-plugin:1.5.0:validate-id (default-validate-id) @ org.eclipse.ease.ui.test ---
23:41:18 [2020-10-24T03:41:18.822Z] [INFO] 
23:41:18 [2020-10-24T03:41:18.822Z] [INFO] --- tycho-packaging-plugin:1.5.0:validate-version (default-validate-version) @ org.eclipse.ease.ui.test ---
23:41:18 [2020-10-24T03:41:18.822Z] [INFO] 
23:41:18 [2020-10-24T03:41:18.822Z] [INFO] >>> maven-javadoc-plugin:2.9.1:javadoc (build-docs) > generate-sources @ org.eclipse.ease.ui.test >>>
23:41:18 [2020-10-24T03:41:18.822Z] [INFO] 
23:41:18 [2020-10-24T03:41:18.822Z] [INFO] --- tycho-packaging-plugin:1.5.0:build-qualifier (default-build-qualifier) @ org.eclipse.ease.ui.test ---
23:41:18 [2020-10-24T03:41:18.822Z] [INFO] The project's OSGi version is 0.8.0.I201910171213
23:41:18 [2020-10-24T03:41:18.822Z] [INFO] 
23:41:18 [2020-10-24T03:41:18.822Z] [INFO] --- tycho-packaging-plugin:1.5.0:validate-id (default-validate-id) @ org.eclipse.ease.ui.test ---
23:41:18 [2020-10-24T03:41:18.822Z] [INFO] 
23:41:18 [2020-10-24T03:41:18.822Z] [INFO] --- tycho-packaging-plugin:1.5.0:validate-version (default-validate-version) @ org.eclipse.ease.ui.test ---
23:41:18 [2020-10-24T03:41:18.822Z] [INFO] 
23:41:18 [2020-10-24T03:41:18.822Z] [INFO] <<< maven-javadoc-plugin:2.9.1:javadoc (build-docs) < generate-sources @ org.eclipse.ease.ui.test <<<
23:41:18 [2020-10-24T03:41:18.822Z] [INFO] 
23:41:18 [2020-10-24T03:41:18.822Z] [INFO] 
23:41:18 [2020-10-24T03:41:18.822Z] [INFO] --- maven-javadoc-plugin:2.9.1:javadoc (build-docs) @ org.eclipse.ease.ui.test ---
23:41:19 [2020-10-24T03:41:19.078Z] [ERROR] Error fetching link: http://help.eclipse.org/oxygen/topic/org.eclipse.platform.doc.isv/reference/api/package-list. Ignored it.
23:41:19 [2020-10-24T03:41:19.078Z] [ERROR] Error fetching link: https://ci.eclipse.org/ease/job/ease.build.core/JavaDoc/package-list. Ignored it.
23:41:20 [2020-10-24T03:41:20.442Z] [INFO] 
23:41:20 [2020-10-24T03:41:20.442Z] Loading source files for package org.eclipse.ease.ui.completion...
23:41:20 [2020-10-24T03:41:20.442Z] Loading source files for package org.eclipse.ease.ui.completion.provider...
23:41:20 [2020-10-24T03:41:20.442Z] Loading source files for package org.eclipse.ease.ui.completions.java.provider...
23:41:20 [2020-10-24T03:41:20.442Z] Loading source files for package org.eclipse.ease.ui.help.hovers...
23:41:20 [2020-10-24T03:41:20.442Z] Constructing Javadoc information...
23:41:20 [2020-10-24T03:41:20.442Z] WARNING: Cannot open location "/home/jenkins/agent/workspace/ease.verify.core.target.2018-12/tests/org.eclipse.ease.ui.test/target/javadoc-bundle-options/package-list"
23:41:20 [2020-10-24T03:41:20.442Z] [WARNING] Javadoc Warnings
23:41:20 [2020-10-24T03:41:20.442Z] [WARNING] Picked up JAVA_TOOL_OPTIONS: -Dmaven.ext.class.path="/home/jenkins/agent/workspace/ease.verify.core.target.2018-12@tmp/withMavenbe6870a0/pipeline-maven-spy.jar" -Dorg.jenkinsci.plugins.pipeline.maven.reportsFolder="/home/jenkins/agent/workspace/ease.verify.core.target.2018-12@tmp/withMavenbe6870a0"
23:41:20 [2020-10-24T03:41:20.442Z] [WARNING] javadoc: warning - The old Doclet and Taglet APIs in the packages
23:41:20 [2020-10-24T03:41:20.442Z] [WARNING] com.sun.javadoc, com.sun.tools.doclets and their implementations
23:41:20 [2020-10-24T03:41:20.442Z] [WARNING] are planned to be removed in a future JDK release. These
23:41:20 [2020-10-24T03:41:20.442Z] [WARNING] components have been superseded by the new APIs in jdk.javadoc.doclet.
23:41:20 [2020-10-24T03:41:20.442Z] [WARNING] Users are strongly recommended to migrate to the new APIs.
23:41:20 [2020-10-24T03:41:20.442Z] [INFO] 
23:41:20 [2020-10-24T03:41:20.442Z] [INFO] --- build-helper-maven-plugin:1.9.1:add-resource (add_help) @ org.eclipse.ease.ui.test ---
23:41:20 [2020-10-24T03:41:20.442Z] [INFO] 
23:41:20 [2020-10-24T03:41:20.442Z] [INFO] --- maven-resources-plugin:2.4.3:resources (default-resources) @ org.eclipse.ease.ui.test ---
23:41:20 [2020-10-24T03:41:20.442Z] [INFO] Using 'UTF-8' encoding to copy filtered resources.
23:41:20 [2020-10-24T03:41:20.442Z] [INFO] skip non existing resourceDirectory /home/jenkins/agent/workspace/ease.verify.core.target.2018-12/tests/org.eclipse.ease.ui.test/src/main/resources
23:41:20 [2020-10-24T03:41:20.442Z] [INFO] Copying 2 resources to help
23:41:20 [2020-10-24T03:41:20.442Z] [INFO] 
23:41:20 [2020-10-24T03:41:20.442Z] [INFO] --- tycho-compiler-plugin:1.5.0:compile (default-compile) @ org.eclipse.ease.ui.test ---
23:41:20 [2020-10-24T03:41:20.442Z] [INFO] Compiling 6 source files to /home/jenkins/agent/workspace/ease.verify.core.target.2018-12/tests/org.eclipse.ease.ui.test/target/classes
23:41:20 [2020-10-24T03:41:20.442Z] [INFO] 
23:41:20 [2020-10-24T03:41:20.442Z] [INFO] --- maven-resources-plugin:2.4.3:testResources (default-testResources) @ org.eclipse.ease.ui.test ---
23:41:20 [2020-10-24T03:41:20.442Z] [INFO] Using 'UTF-8' encoding to copy filtered resources.
23:41:20 [2020-10-24T03:41:20.442Z] [INFO] skip non existing resourceDirectory /home/jenkins/agent/workspace/ease.verify.core.target.2018-12/tests/org.eclipse.ease.ui.test/src/test/resources
23:41:20 [2020-10-24T03:41:20.442Z] [INFO] 
23:41:20 [2020-10-24T03:41:20.442Z] [INFO] --- tycho-source-plugin:1.5.0:plugin-source (plugin-source) @ org.eclipse.ease.ui.test ---
23:41:20 [2020-10-24T03:41:20.442Z] [WARNING] Bundle-Vendor header not found in /home/jenkins/agent/workspace/ease.verify.core.target.2018-12/tests/org.eclipse.ease.ui.test/META-INF/MANIFEST.MF, fallback to 'unknown' for source bundle
23:41:20 [2020-10-24T03:41:20.442Z] [INFO] Building jar: /home/jenkins/agent/workspace/ease.verify.core.target.2018-12/tests/org.eclipse.ease.ui.test/target/org.eclipse.ease.ui.test-0.8.0-SNAPSHOT-sources.jar
23:41:20 [2020-10-24T03:41:20.442Z] [INFO] 
23:41:20 [2020-10-24T03:41:20.442Z] [INFO] --- target-platform-configuration:1.5.0:target-platform (default-target-platform) @ org.eclipse.ease.ui.test ---
23:41:20 [2020-10-24T03:41:20.442Z] [INFO] 
23:41:20 [2020-10-24T03:41:20.442Z] [INFO] --- tycho-packaging-plugin:1.5.0:package-plugin (default-package-plugin) @ org.eclipse.ease.ui.test ---
23:41:20 [2020-10-24T03:41:20.442Z] [INFO] Building jar: /home/jenkins/agent/workspace/ease.verify.core.target.2018-12/tests/org.eclipse.ease.ui.test/target/org.eclipse.ease.ui.test-0.8.0-SNAPSHOT.jar
23:41:20 [2020-10-24T03:41:20.443Z] [INFO] 
23:41:20 [2020-10-24T03:41:20.443Z] [INFO] --- tycho-p2-plugin:1.5.0:p2-metadata-default (default-p2-metadata-default) @ org.eclipse.ease.ui.test ---
23:41:20 [2020-10-24T03:41:20.443Z] [INFO] 
23:41:20 [2020-10-24T03:41:20.443Z] [INFO] --- tycho-source-feature-plugin:1.5.0:source-feature (source-feature) @ org.eclipse.ease.ui.test ---
23:41:20 [2020-10-24T03:41:20.443Z] [INFO] 
23:41:20 [2020-10-24T03:41:20.443Z] [INFO] --- tycho-p2-plugin:1.5.0:p2-metadata (attached-p2-metadata) @ org.eclipse.ease.ui.test ---
23:41:20 [2020-10-24T03:41:20.443Z] [INFO] 
23:41:20 [2020-10-24T03:41:20.443Z] [INFO] --- tycho-surefire-plugin:1.5.0:test (default-test) @ org.eclipse.ease.ui.test ---
23:41:20 [2020-10-24T03:41:20.698Z] [INFO] Expected eclipse log file: /home/jenkins/agent/workspace/ease.verify.core.target.2018-12/tests/org.eclipse.ease.ui.test/target/work/data/.metadata/.log
23:41:20 [2020-10-24T03:41:20.698Z] [INFO] Command line:
23:41:20 [2020-10-24T03:41:20.699Z] 	[/opt/tools/java/openjdk/jdk-11/11.0.2+9/bin/java, -Dosgi.noShutdown=false, -Dosgi.os=linux, -Dosgi.ws=gtk, -Dosgi.arch=x86_64, -Dosgi.clean=true, -jar, /home/jenkins/.m2/repository/p2/osgi/bundle/org.eclipse.equinox.launcher/1.5.800.v20200727-1323/org.eclipse.equinox.launcher-1.5.800.v20200727-1323.jar, -data, /home/jenkins/agent/workspace/ease.verify.core.target.2018-12/tests/org.eclipse.ease.ui.test/target/work/data, -install, /home/jenkins/agent/workspace/ease.verify.core.target.2018-12/tests/org.eclipse.ease.ui.test/target/work, -configuration, /home/jenkins/agent/workspace/ease.verify.core.target.2018-12/tests/org.eclipse.ease.ui.test/target/work/configuration, -application, org.eclipse.tycho.surefire.osgibooter.headlesstest, -testproperties, /home/jenkins/agent/workspace/ease.verify.core.target.2018-12/tests/org.eclipse.ease.ui.test/target/surefire.properties]
23:41:20 [2020-10-24T03:41:20.699Z] Picked up JAVA_TOOL_OPTIONS: -Dmaven.ext.class.path="/home/jenkins/agent/workspace/ease.verify.core.target.2018-12@tmp/withMavenbe6870a0/pipeline-maven-spy.jar" -Dorg.jenkinsci.plugins.pipeline.maven.reportsFolder="/home/jenkins/agent/workspace/ease.verify.core.target.2018-12@tmp/withMavenbe6870a0" 
23:41:22 [2020-10-24T03:41:22.597Z] Running org.eclipse.ease.ui.completions.java.provider.JavaClassCompletionsProviderTest
23:41:22 [2020-10-24T03:41:22.597Z] WARNING: An illegal reflective access operation has occurred
23:41:22 [2020-10-24T03:41:22.597Z] WARNING: Illegal reflective access by org.mockito.cglib.core.ReflectUtils$2 (file:/home/jenkins/.m2/repository/p2/osgi/bundle/org.mockito/1.9.5.v201605172210/org.mockito-1.9.5.v201605172210.jar) to method java.lang.ClassLoader.defineClass(java.lang.String,byte[],int,int,java.security.ProtectionDomain)
23:41:22 [2020-10-24T03:41:22.597Z] WARNING: Please consider reporting this to the maintainers of org.mockito.cglib.core.ReflectUtils$2
23:41:22 [2020-10-24T03:41:22.597Z] WARNING: Use --illegal-access=warn to enable warnings of further illegal reflective access operations
23:41:22 [2020-10-24T03:41:22.597Z] WARNING: All illegal access operations will be denied in a future release
23:41:29 [2020-10-24T03:41:29.132Z] Tests run: 6, Failures: 0, Errors: 0, Skipped: 0, Time elapsed: 6.303 s - in org.eclipse.ease.ui.completions.java.provider.JavaClassCompletionsProviderTest
23:41:29 [2020-10-24T03:41:29.132Z] containsPackageFileCompletion(org.eclipse.ease.ui.completions.java.provider.JavaClassCompletionsProviderTest)  Time elapsed: 0.144 s
23:41:29 [2020-10-24T03:41:29.132Z] containsGlobalFileCompletion(org.eclipse.ease.ui.completions.java.provider.JavaClassCompletionsProviderTest)  Time elapsed: 0.191 s
23:41:29 [2020-10-24T03:41:29.132Z] containsJavaLangPackageProposal(org.eclipse.ease.ui.completions.java.provider.JavaClassCompletionsProviderTest)  Time elapsed: 0.33 s
23:41:29 [2020-10-24T03:41:29.132Z] containsOrgRootPackageProposal(org.eclipse.ease.ui.completions.java.provider.JavaClassCompletionsProviderTest)  Time elapsed: 0.009 s
23:41:29 [2020-10-24T03:41:29.132Z] containsJavaRootPackageProposal(org.eclipse.ease.ui.completions.java.provider.JavaClassCompletionsProviderTest)  Time elapsed: 0.021 s
23:41:29 [2020-10-24T03:41:29.132Z] containsOrgEclipsePackageProposal(org.eclipse.ease.ui.completions.java.provider.JavaClassCompletionsProviderTest)  Time elapsed: 0.053 s
23:41:29 [2020-10-24T03:41:29.132Z] Running org.eclipse.ease.ui.completions.java.provider.JavaPackagesCompletionsProviderTest
23:41:34 [2020-10-24T03:41:34.375Z] Tests run: 4, Failures: 0, Errors: 0, Skipped: 0, Time elapsed: 5.136 s - in org.eclipse.ease.ui.completions.java.provider.JavaPackagesCompletionsProviderTest
23:41:34 [2020-10-24T03:41:34.375Z] containsJavaLangPackageProposal(org.eclipse.ease.ui.completions.java.provider.JavaPackagesCompletionsProviderTest)  Time elapsed: 0.063 s
23:41:34 [2020-10-24T03:41:34.375Z] containsOrgRootPackageProposal(org.eclipse.ease.ui.completions.java.provider.JavaPackagesCompletionsProviderTest)  Time elapsed: 0.006 s
23:41:34 [2020-10-24T03:41:34.375Z] containsJavaRootPackageProposal(org.eclipse.ease.ui.completions.java.provider.JavaPackagesCompletionsProviderTest)  Time elapsed: 0.005 s
23:41:34 [2020-10-24T03:41:34.375Z] containsOrgEclipsePackageProposal(org.eclipse.ease.ui.completions.java.provider.JavaPackagesCompletionsProviderTest)  Time elapsed: 0.054 s
23:41:34 [2020-10-24T03:41:34.375Z] Running org.eclipse.ease.ui.help.hovers.ModuleHelpTest
23:41:34 [2020-10-24T03:41:34.375Z] Tests run: 4, Failures: 0, Errors: 0, Skipped: 4, Time elapsed: 0.002 s - in org.eclipse.ease.ui.help.hovers.ModuleHelpTest
23:41:34 [2020-10-24T03:41:34.375Z] getModuleHelpLocation(org.eclipse.ease.ui.help.hovers.ModuleHelpTest) skipped
23:41:34 [2020-10-24T03:41:34.375Z] getModuleHelp(org.eclipse.ease.ui.help.hovers.ModuleHelpTest) skipped
23:41:34 [2020-10-24T03:41:34.375Z] getMethodHelp(org.eclipse.ease.ui.help.hovers.ModuleHelpTest) skipped
23:41:34 [2020-10-24T03:41:34.375Z] getConstantHelp(org.eclipse.ease.ui.help.hovers.ModuleHelpTest) skipped
23:41:34 [2020-10-24T03:41:34.375Z] Running org.eclipse.ease.ui.completion.CompletionContextTest
23:41:34 [2020-10-24T03:41:34.375Z] Tests run: 9, Failures: 0, Errors: 0, Skipped: 0, Time elapsed: 0.004 s - in org.eclipse.ease.ui.completion.CompletionContextTest
23:41:34 [2020-10-24T03:41:34.375Z] resolveStaticClass(org.eclipse.ease.ui.completion.CompletionContextTest)  Time elapsed: 0.002 s
23:41:34 [2020-10-24T03:41:34.375Z] resolveClassWithFilter(org.eclipse.ease.ui.completion.CompletionContextTest)  Time elapsed: 0 s
23:41:34 [2020-10-24T03:41:34.375Z] simplifyCalls(org.eclipse.ease.ui.completion.CompletionContextTest)  Time elapsed: 0 s
23:41:34 [2020-10-24T03:41:34.375Z] resolveClass(org.eclipse.ease.ui.completion.CompletionContextTest)  Time elapsed: 0.001 s
23:41:34 [2020-10-24T03:41:34.375Z] replaceEscapedStringLiterals(org.eclipse.ease.ui.completion.CompletionContextTest)  Time elapsed: 0 s
23:41:34 [2020-10-24T03:41:34.375Z] replaceSimpleStringLiterals(org.eclipse.ease.ui.completion.CompletionContextTest)  Time elapsed: 0 s
23:41:34 [2020-10-24T03:41:34.375Z] resolveStaticClassWithFilter(org.eclipse.ease.ui.completion.CompletionContextTest)  Time elapsed: 0 s
23:41:34 [2020-10-24T03:41:34.375Z] resolveClassWithParameters(org.eclipse.ease.ui.completion.CompletionContextTest)  Time elapsed: 0 s
23:41:34 [2020-10-24T03:41:34.375Z] replaceMultipleStringLiterals(org.eclipse.ease.ui.completion.CompletionContextTest)  Time elapsed: 0 s
23:41:34 [2020-10-24T03:41:34.375Z] Running org.eclipse.ease.ui.completion.provider.AbstractFileLocationCompletionProviderTest
23:41:34 [2020-10-24T03:41:34.375Z] Tests run: 8, Failures: 0, Errors: 0, Skipped: 8, Time elapsed: 0.002 s - in org.eclipse.ease.ui.completion.provider.AbstractFileLocationCompletionProviderTest
23:41:34 [2020-10-24T03:41:34.375Z] workspaceProjectProposals(org.eclipse.ease.ui.completion.provider.AbstractFileLocationCompletionProviderTest) skipped
23:41:34 [2020-10-24T03:41:34.375Z] checkOperatingSystem(org.eclipse.ease.ui.completion.provider.AbstractFileLocationCompletionProviderTest) skipped
23:41:34 [2020-10-24T03:41:34.375Z] absoluteRootWorkspaceProposals(org.eclipse.ease.ui.completion.provider.AbstractFileLocationCompletionProviderTest) skipped
23:41:34 [2020-10-24T03:41:34.375Z] workspaceFolderProposals(org.eclipse.ease.ui.completion.provider.AbstractFileLocationCompletionProviderTest) skipped
23:41:34 [2020-10-24T03:41:34.375Z] fileSystemFolderProposals(org.eclipse.ease.ui.completion.provider.AbstractFileLocationCompletionProviderTest) skipped
23:41:34 [2020-10-24T03:41:34.375Z] workspaceProposals(org.eclipse.ease.ui.completion.provider.AbstractFileLocationCompletionProviderTest) skipped
23:41:34 [2020-10-24T03:41:34.375Z] relativeRootWorkspaceProposals(org.eclipse.ease.ui.completion.provider.AbstractFileLocationCompletionProviderTest) skipped
23:41:34 [2020-10-24T03:41:34.375Z] fileSystemRootProposals(org.eclipse.ease.ui.completion.provider.AbstractFileLocationCompletionProviderTest) skipped
23:41:34 [2020-10-24T03:41:34.375Z] 
23:41:34 [2020-10-24T03:41:34.375Z] Results:
23:41:34 [2020-10-24T03:41:34.375Z] 
23:41:34 [2020-10-24T03:41:34.375Z] Tests run: 31, Failures: 0, Errors: 0, Skipped: 12
23:41:34 [2020-10-24T03:41:34.375Z] 
23:41:35 [2020-10-24T03:41:35.312Z] [INFO] All tests passed!
23:41:35 [2020-10-24T03:41:35.312Z] [INFO] 
23:41:35 [2020-10-24T03:41:35.312Z] [INFO] --- maven-install-plugin:2.3.1:install (default-install) @ org.eclipse.ease.ui.test ---
23:41:35 [2020-10-24T03:41:35.312Z] [INFO] Installing /home/jenkins/agent/workspace/ease.verify.core.target.2018-12/tests/org.eclipse.ease.ui.test/target/org.eclipse.ease.ui.test-0.8.0-SNAPSHOT.jar to /home/jenkins/.m2/repository/org/eclipse/ease/org.eclipse.ease.ui.test/0.8.0-SNAPSHOT/org.eclipse.ease.ui.test-0.8.0-SNAPSHOT.jar
23:41:35 [2020-10-24T03:41:35.313Z] [INFO] Installing /home/jenkins/agent/workspace/ease.verify.core.target.2018-12/tests/org.eclipse.ease.ui.test/pom.xml to /home/jenkins/.m2/repository/org/eclipse/ease/org.eclipse.ease.ui.test/0.8.0-SNAPSHOT/org.eclipse.ease.ui.test-0.8.0-SNAPSHOT.pom
23:41:35 [2020-10-24T03:41:35.313Z] [INFO] Installing /home/jenkins/agent/workspace/ease.verify.core.target.2018-12/tests/org.eclipse.ease.ui.test/target/org.eclipse.ease.ui.test-0.8.0-SNAPSHOT-sources.jar to /home/jenkins/.m2/repository/org/eclipse/ease/org.eclipse.ease.ui.test/0.8.0-SNAPSHOT/org.eclipse.ease.ui.test-0.8.0-SNAPSHOT-sources.jar
23:41:35 [2020-10-24T03:41:35.313Z] [INFO] Installing /home/jenkins/agent/workspace/ease.verify.core.target.2018-12/tests/org.eclipse.ease.ui.test/target/p2content.xml to /home/jenkins/.m2/repository/org/eclipse/ease/org.eclipse.ease.ui.test/0.8.0-SNAPSHOT/org.eclipse.ease.ui.test-0.8.0-SNAPSHOT-p2metadata.xml
23:41:35 [2020-10-24T03:41:35.313Z] [INFO] Installing /home/jenkins/agent/workspace/ease.verify.core.target.2018-12/tests/org.eclipse.ease.ui.test/target/p2artifacts.xml to /home/jenkins/.m2/repository/org/eclipse/ease/org.eclipse.ease.ui.test/0.8.0-SNAPSHOT/org.eclipse.ease.ui.test-0.8.0-SNAPSHOT-p2artifacts.xml
23:41:35 [2020-10-24T03:41:35.313Z] [INFO] Installing /home/jenkins/agent/workspace/ease.verify.core.target.2018-12/tests/org.eclipse.ease.ui.test/target/p2content.xml to /home/jenkins/.m2/repository/org/eclipse/ease/org.eclipse.ease.ui.test/0.8.0-SNAPSHOT/org.eclipse.ease.ui.test-0.8.0-SNAPSHOT-p2metadata.xml
23:41:35 [2020-10-24T03:41:35.313Z] [INFO] Installing /home/jenkins/agent/workspace/ease.verify.core.target.2018-12/tests/org.eclipse.ease.ui.test/target/p2artifacts.xml to /home/jenkins/.m2/repository/org/eclipse/ease/org.eclipse.ease.ui.test/0.8.0-SNAPSHOT/org.eclipse.ease.ui.test-0.8.0-SNAPSHOT-p2artifacts.xml
23:41:35 [2020-10-24T03:41:35.313Z] [INFO] 
23:41:35 [2020-10-24T03:41:35.313Z] [INFO] --- tycho-p2-plugin:1.5.0:update-local-index (default-update-local-index) @ org.eclipse.ease.ui.test ---
23:41:35 [2020-10-24T03:41:35.313Z] [INFO] 
23:41:35 [2020-10-24T03:41:35.313Z] [INFO] ---------------------< org.eclipse.ease:ease.core >---------------------
23:41:35 [2020-10-24T03:41:35.313Z] [INFO] Building EASE (Incubation) 0.4.0-SNAPSHOT                        [48/48]
23:41:35 [2020-10-24T03:41:35.313Z] [INFO] --------------------------------[ pom ]---------------------------------
23:41:35 [2020-10-24T03:41:35.313Z] [INFO] 
23:41:35 [2020-10-24T03:41:35.313Z] [INFO] --- maven-clean-plugin:2.5:clean (default-clean) @ ease.core ---
23:41:35 [2020-10-24T03:41:35.313Z] [INFO] 
23:41:35 [2020-10-24T03:41:35.313Z] [INFO] --- maven-install-plugin:2.4:install (default-install) @ ease.core ---
23:41:35 [2020-10-24T03:41:35.313Z] [INFO] Installing /home/jenkins/agent/workspace/ease.verify.core.target.2018-12/pom.xml to /home/jenkins/.m2/repository/org/eclipse/ease/ease.core/0.4.0-SNAPSHOT/ease.core-0.4.0-SNAPSHOT.pom
23:41:35 [2020-10-24T03:41:35.313Z] [INFO] ------------------------------------------------------------------------
23:41:35 [2020-10-24T03:41:35.313Z] [INFO] Reactor Summary:
23:41:35 [2020-10-24T03:41:35.313Z] [INFO] 
23:41:35 [2020-10-24T03:41:35.313Z] [INFO] org.eclipse.ease.releng 0.8.0-SNAPSHOT ............. SUCCESS [  5.814 s]
23:41:35 [2020-10-24T03:41:35.313Z] [INFO] org.eclipse.ease.classloader 0.8.0-SNAPSHOT ........ SUCCESS [  7.803 s]
23:41:35 [2020-10-24T03:41:35.313Z] [INFO] org.eclipse.ease 0.8.0-SNAPSHOT .................... SUCCESS [  3.142 s]
23:41:35 [2020-10-24T03:41:35.313Z] [INFO] org.eclipse.ease.ui 0.8.0-SNAPSHOT ................. SUCCESS [  3.499 s]
23:41:35 [2020-10-24T03:41:35.313Z] [INFO] org.eclipse.ease.ui.completions.java 0.8.0-SNAPSHOT  SUCCESS [  2.684 s]
23:41:35 [2020-10-24T03:41:35.313Z] [INFO] org.eclipse.ease.ui.scripts 0.8.0-SNAPSHOT ......... SUCCESS [  3.114 s]
23:41:35 [2020-10-24T03:41:35.313Z] [INFO] org.eclipse.ease.lang.javascript 0.8.0-SNAPSHOT .... SUCCESS [  1.783 s]
23:41:35 [2020-10-24T03:41:35.313Z] [INFO] org.eclipse.ease.lang.scriptarchive 0.8.0-SNAPSHOT . SUCCESS [  1.786 s]
23:41:35 [2020-10-24T03:41:35.313Z] [INFO] org.eclipse.ease.lang.python 0.8.0-SNAPSHOT ........ SUCCESS [  2.014 s]
23:41:35 [2020-10-24T03:41:35.313Z] [INFO] org.eclipse.ease.lang.python.py4j 0.8.0-SNAPSHOT ... SUCCESS [  1.876 s]
23:41:35 [2020-10-24T03:41:35.313Z] [INFO] org.eclipse.ease.lang.groovy 0.8.0-SNAPSHOT ........ SUCCESS [  1.626 s]
23:41:35 [2020-10-24T03:41:35.313Z] [INFO] org.eclipse.ease.lang.groovy.interpreter 0.8.0-SNAPSHOT SUCCESS [  1.444 s]
23:41:35 [2020-10-24T03:41:35.313Z] [INFO] org.eclipse.ease.lang.unittest 0.8.0-SNAPSHOT ...... SUCCESS [  2.353 s]
23:41:35 [2020-10-24T03:41:35.313Z] [INFO] org.eclipse.ease.lang.unittest.ui 0.8.0-SNAPSHOT ... SUCCESS [  2.183 s]
23:41:35 [2020-10-24T03:41:35.313Z] [INFO] org.eclipse.ease.lang.ruby 0.8.0-SNAPSHOT .......... SUCCESS [  1.629 s]
23:41:35 [2020-10-24T03:41:35.313Z] [INFO] org.eclipse.ease.lang.ruby.jruby 0.8.0-SNAPSHOT .... SUCCESS [  1.753 s]
23:41:35 [2020-10-24T03:41:35.313Z] [INFO] org.eclipse.ease.lang.javascript.nashorn 0.8.0-SNAPSHOT SUCCESS [  1.490 s]
23:41:35 [2020-10-24T03:41:35.313Z] [INFO] org.eclipse.ease.lang.javascript.rhino 0.8.0-SNAPSHOT SUCCESS [  2.003 s]
23:41:35 [2020-10-24T03:41:35.313Z] [INFO] org.eclipse.ease.lang.python.jython 0.8.0-SNAPSHOT . SUCCESS [  1.798 s]
23:41:35 [2020-10-24T03:41:35.313Z] [INFO] org.eclipse.ease.lang.javascript.ui 0.8.0-SNAPSHOT . SUCCESS [  1.815 s]
23:41:35 [2020-10-24T03:41:35.313Z] [INFO] org.eclipse.ease.lang.jvm.compiled 0.8.0-SNAPSHOT .. SUCCESS [  1.404 s]
23:41:35 [2020-10-24T03:41:35.313Z] [INFO] org.eclipse.ease.lang.scriptarchive.ui 0.8.0-SNAPSHOT SUCCESS [  1.730 s]
23:41:35 [2020-10-24T03:41:35.313Z] [INFO] org.eclipse.ease.help 0.8.0-SNAPSHOT ............... SUCCESS [  0.177 s]
23:41:35 [2020-10-24T03:41:35.313Z] [INFO] org.eclipse.ease.feature 0.8.0-SNAPSHOT ............ SUCCESS [  0.199 s]
23:41:35 [2020-10-24T03:41:35.313Z] [INFO] org.eclipse.ease.ui.feature 0.8.0-SNAPSHOT ......... SUCCESS [  0.243 s]
23:41:35 [2020-10-24T03:41:35.313Z] [INFO] org.eclipse.ease.lang.javascript.feature 0.8.0-SNAPSHOT SUCCESS [  0.139 s]
23:41:35 [2020-10-24T03:41:35.313Z] [INFO] org.eclipse.ease.lang.python.feature 0.8.0-SNAPSHOT  SUCCESS [  0.123 s]
23:41:35 [2020-10-24T03:41:35.313Z] [INFO] org.eclipse.ease.python.jython.feature 0.8.0-SNAPSHOT SUCCESS [  0.099 s]
23:41:35 [2020-10-24T03:41:35.313Z] [INFO] org.eclipse.ease.lang.python.py4j.feature 0.8.0-SNAPSHOT SUCCESS [  0.093 s]
23:41:35 [2020-10-24T03:41:35.313Z] [INFO] org.eclipse.ease.lang.jvm.feature 0.8.0-SNAPSHOT ... SUCCESS [  0.097 s]
23:41:35 [2020-10-24T03:41:35.313Z] [INFO] org.eclipse.ease.lang.groovy.feature 0.8.0-SNAPSHOT  SUCCESS [  0.121 s]
23:41:35 [2020-10-24T03:41:35.313Z] [INFO] org.eclipse.ease.lang.ruby.feature 0.8.0-SNAPSHOT .. SUCCESS [  0.167 s]
23:41:35 [2020-10-24T03:41:35.313Z] [INFO] org.eclipse.ease.lang.scriptarchive.feature 0.8.0-SNAPSHOT SUCCESS [  0.122 s]
23:41:35 [2020-10-24T03:41:35.313Z] [INFO] org.eclipse.ease.lang.unittest.feature 0.8.0-SNAPSHOT SUCCESS [  0.162 s]
23:41:35 [2020-10-24T03:41:35.313Z] [INFO] org.eclipse.ease.releng.target 0.8.0-SNAPSHOT ...... SUCCESS [  0.032 s]
23:41:35 [2020-10-24T03:41:35.313Z] [INFO] org.eclipse.ease.releng.p2 0.8.0-SNAPSHOT .......... SUCCESS [  3.499 s]
23:41:35 [2020-10-24T03:41:35.313Z] [INFO] org.eclipse.ease.testhelper 0.8.0-SNAPSHOT ......... SUCCESS [  1.676 s]
23:41:35 [2020-10-24T03:41:35.313Z] [INFO] org.eclipse.ease.test 0.8.0-SNAPSHOT ............... SUCCESS [ 17.477 s]
23:41:35 [2020-10-24T03:41:35.313Z] [INFO] org.eclipse.ease.lang.javascript.nashorn.test 0.8.0-SNAPSHOT SUCCESS [  4.873 s]
23:41:35 [2020-10-24T03:41:35.313Z] [INFO] org.eclipse.ease.lang.javascript.rhino.test 0.8.0-SNAPSHOT SUCCESS [ 16.189 s]
23:41:35 [2020-10-24T03:41:35.313Z] [INFO] org.eclipse.ease.lang.javascript.test 0.8.0-SNAPSHOT SUCCESS [  4.341 s]
23:41:35 [2020-10-24T03:41:35.313Z] [INFO] org.eclipse.ease.lang.python.test 0.8.0-SNAPSHOT ... SUCCESS [  3.965 s]
23:41:35 [2020-10-24T03:41:35.313Z] [INFO] org.eclipse.ease.lang.python.jython.test 0.8.0-SNAPSHOT SUCCESS [ 17.045 s]
23:41:35 [2020-10-24T03:41:35.313Z] [INFO] org.eclipse.ease.lang.scriptarchive.test 0.8.0-SNAPSHOT SUCCESS [  4.737 s]
23:41:35 [2020-10-24T03:41:35.313Z] [INFO] org.eclipse.ease.lang.unittest.test 0.8.0-SNAPSHOT . SUCCESS [  6.815 s]
23:41:35 [2020-10-24T03:41:35.313Z] [INFO] org.eclipse.ease.ui.scripts.test 0.8.0-SNAPSHOT .... SUCCESS [  3.849 s]
23:41:35 [2020-10-24T03:41:35.313Z] [INFO] org.eclipse.ease.ui.test 0.8.0-SNAPSHOT ............ SUCCESS [ 16.239 s]
23:41:35 [2020-10-24T03:41:35.313Z] [INFO] EASE (Incubation) 0.4.0-SNAPSHOT ................... SUCCESS [  0.212 s]
23:41:35 [2020-10-24T03:41:35.313Z] [INFO] ------------------------------------------------------------------------
23:41:35 [2020-10-24T03:41:35.314Z] [INFO] BUILD SUCCESS
23:41:35 [2020-10-24T03:41:35.314Z] [INFO] ------------------------------------------------------------------------
23:41:35 [2020-10-24T03:41:35.314Z] [INFO] Total time:  05:06 min
23:41:35 [2020-10-24T03:41:35.314Z] [INFO] Finished at: 2020-10-24T03:41:35Z
23:41:35 [2020-10-24T03:41:35.314Z] [INFO] ------------------------------------------------------------------------
23:41:35 [2020-10-24T03:41:35.314Z] [INFO] [jenkins-event-spy] Generated /home/jenkins/agent/workspace/ease.verify.core.target.2018-12@tmp/withMavenbe6870a0/maven-spy-20201024-033628-6076140246095229257269.log