Console Output

Skipping 528 KB.. Full Log
23:41:08 [2022-05-21T03:41:08.251Z] Generating ./org/eclipse/ease/lang/python/py4j/internal/package-tree.html...
23:41:08 [2022-05-21T03:41:08.251Z] Generating ./org/eclipse/ease/lang/python/py4j/internal/ui/package-summary.html...
23:41:08 [2022-05-21T03:41:08.251Z] Generating ./org/eclipse/ease/lang/python/py4j/internal/ui/package-tree.html...
23:41:08 [2022-05-21T03:41:08.251Z] Generating ./org/eclipse/ease/lang/python/ui/completion/package-summary.html...
23:41:08 [2022-05-21T03:41:08.251Z] Generating ./org/eclipse/ease/lang/python/ui/completion/package-tree.html...
23:41:08 [2022-05-21T03:41:08.251Z] Generating ./org/eclipse/ease/lang/ruby/package-summary.html...
23:41:08 [2022-05-21T03:41:08.251Z] Generating ./org/eclipse/ease/lang/ruby/package-tree.html...
23:41:08 [2022-05-21T03:41:08.251Z] Generating ./org/eclipse/ease/lang/scriptarchive/package-summary.html...
23:41:08 [2022-05-21T03:41:08.251Z] Generating ./org/eclipse/ease/lang/scriptarchive/package-tree.html...
23:41:08 [2022-05-21T03:41:08.251Z] Generating ./org/eclipse/ease/lang/unittest/package-summary.html...
23:41:08 [2022-05-21T03:41:08.251Z] Generating ./org/eclipse/ease/lang/unittest/package-tree.html...
23:41:08 [2022-05-21T03:41:08.251Z] Generating ./org/eclipse/ease/lang/unittest/definition/package-summary.html...
23:41:08 [2022-05-21T03:41:08.251Z] Generating ./org/eclipse/ease/lang/unittest/definition/package-tree.html...
23:41:08 [2022-05-21T03:41:08.251Z] Generating ./org/eclipse/ease/lang/unittest/definition/impl/package-summary.html...
23:41:08 [2022-05-21T03:41:08.251Z] Generating ./org/eclipse/ease/lang/unittest/definition/impl/package-tree.html...
23:41:08 [2022-05-21T03:41:08.251Z] Generating ./org/eclipse/ease/lang/unittest/definition/provider/package-summary.html...
23:41:08 [2022-05-21T03:41:08.252Z] Generating ./org/eclipse/ease/lang/unittest/definition/provider/package-tree.html...
23:41:08 [2022-05-21T03:41:08.252Z] Generating ./org/eclipse/ease/lang/unittest/definition/util/package-summary.html...
23:41:08 [2022-05-21T03:41:08.252Z] Generating ./org/eclipse/ease/lang/unittest/definition/util/package-tree.html...
23:41:08 [2022-05-21T03:41:08.252Z] Generating ./org/eclipse/ease/lang/unittest/reporters/package-summary.html...
23:41:08 [2022-05-21T03:41:08.252Z] Generating ./org/eclipse/ease/lang/unittest/reporters/package-tree.html...
23:41:08 [2022-05-21T03:41:08.252Z] Generating ./org/eclipse/ease/lang/unittest/runtime/package-summary.html...
23:41:08 [2022-05-21T03:41:08.252Z] Generating ./org/eclipse/ease/lang/unittest/runtime/package-tree.html...
23:41:08 [2022-05-21T03:41:08.252Z] Generating ./org/eclipse/ease/lang/unittest/runtime/impl/package-summary.html...
23:41:08 [2022-05-21T03:41:08.252Z] Generating ./org/eclipse/ease/lang/unittest/runtime/impl/package-tree.html...
23:41:08 [2022-05-21T03:41:08.252Z] Generating ./org/eclipse/ease/lang/unittest/runtime/util/package-summary.html...
23:41:08 [2022-05-21T03:41:08.252Z] Generating ./org/eclipse/ease/lang/unittest/runtime/util/package-tree.html...
23:41:08 [2022-05-21T03:41:08.252Z] Generating ./org/eclipse/ease/lang/unittest/ui/editor/package-summary.html...
23:41:08 [2022-05-21T03:41:08.252Z] Generating ./org/eclipse/ease/lang/unittest/ui/editor/package-tree.html...
23:41:08 [2022-05-21T03:41:08.252Z] Generating ./org/eclipse/ease/lang/unittest/ui/views/package-summary.html...
23:41:08 [2022-05-21T03:41:08.252Z] Generating ./org/eclipse/ease/lang/unittest/ui/views/package-tree.html...
23:41:08 [2022-05-21T03:41:08.252Z] Generating ./org/eclipse/ease/modules/package-summary.html...
23:41:08 [2022-05-21T03:41:08.252Z] Generating ./org/eclipse/ease/modules/package-tree.html...
23:41:08 [2022-05-21T03:41:08.252Z] Generating ./org/eclipse/ease/service/package-summary.html...
23:41:08 [2022-05-21T03:41:08.252Z] Generating ./org/eclipse/ease/service/package-tree.html...
23:41:08 [2022-05-21T03:41:08.252Z] Generating ./org/eclipse/ease/sign/package-summary.html...
23:41:08 [2022-05-21T03:41:08.252Z] Generating ./org/eclipse/ease/sign/package-tree.html...
23:41:08 [2022-05-21T03:41:08.252Z] Generating ./org/eclipse/ease/tools/package-summary.html...
23:41:08 [2022-05-21T03:41:08.252Z] Generating ./org/eclipse/ease/tools/package-tree.html...
23:41:08 [2022-05-21T03:41:08.252Z] Generating ./org/eclipse/ease/ui/package-summary.html...
23:41:08 [2022-05-21T03:41:08.252Z] Generating ./org/eclipse/ease/ui/package-tree.html...
23:41:08 [2022-05-21T03:41:08.252Z] Generating ./org/eclipse/ease/ui/completion/package-summary.html...
23:41:08 [2022-05-21T03:41:08.252Z] Generating ./org/eclipse/ease/ui/completion/package-tree.html...
23:41:08 [2022-05-21T03:41:08.252Z] Generating ./org/eclipse/ease/ui/completion/provider/package-summary.html...
23:41:08 [2022-05-21T03:41:08.252Z] Generating ./org/eclipse/ease/ui/completion/provider/package-tree.html...
23:41:08 [2022-05-21T03:41:08.252Z] Generating ./org/eclipse/ease/ui/completion/tokenizer/package-summary.html...
23:41:08 [2022-05-21T03:41:08.252Z] Generating ./org/eclipse/ease/ui/completion/tokenizer/package-tree.html...
23:41:08 [2022-05-21T03:41:08.252Z] Generating ./org/eclipse/ease/ui/console/package-summary.html...
23:41:08 [2022-05-21T03:41:08.252Z] Generating ./org/eclipse/ease/ui/console/package-tree.html...
23:41:08 [2022-05-21T03:41:08.252Z] Generating ./org/eclipse/ease/ui/console/actions/package-summary.html...
23:41:08 [2022-05-21T03:41:08.252Z] Generating ./org/eclipse/ease/ui/console/actions/package-tree.html...
23:41:08 [2022-05-21T03:41:08.252Z] Generating ./org/eclipse/ease/ui/debugging/model/package-summary.html...
23:41:08 [2022-05-21T03:41:08.252Z] Generating ./org/eclipse/ease/ui/debugging/model/package-tree.html...
23:41:08 [2022-05-21T03:41:08.252Z] Generating ./org/eclipse/ease/ui/dnd/package-summary.html...
23:41:08 [2022-05-21T03:41:08.252Z] Generating ./org/eclipse/ease/ui/dnd/package-tree.html...
23:41:08 [2022-05-21T03:41:08.252Z] Generating ./org/eclipse/ease/ui/handler/package-summary.html...
23:41:08 [2022-05-21T03:41:08.252Z] Generating ./org/eclipse/ease/ui/handler/package-tree.html...
23:41:08 [2022-05-21T03:41:08.252Z] Generating ./org/eclipse/ease/ui/help/hovers/package-summary.html...
23:41:08 [2022-05-21T03:41:08.252Z] Generating ./org/eclipse/ease/ui/help/hovers/package-tree.html...
23:41:08 [2022-05-21T03:41:08.253Z] Generating ./org/eclipse/ease/ui/launching/package-summary.html...
23:41:08 [2022-05-21T03:41:08.253Z] Generating ./org/eclipse/ease/ui/launching/package-tree.html...
23:41:08 [2022-05-21T03:41:08.253Z] Generating ./org/eclipse/ease/ui/modules/ui/package-summary.html...
23:41:08 [2022-05-21T03:41:08.253Z] Generating ./org/eclipse/ease/ui/modules/ui/package-tree.html...
23:41:08 [2022-05-21T03:41:08.253Z] Generating ./org/eclipse/ease/ui/perspectives/package-summary.html...
23:41:08 [2022-05-21T03:41:08.253Z] Generating ./org/eclipse/ease/ui/perspectives/package-tree.html...
23:41:08 [2022-05-21T03:41:08.253Z] Generating ./org/eclipse/ease/ui/preferences/package-summary.html...
23:41:08 [2022-05-21T03:41:08.253Z] Generating ./org/eclipse/ease/ui/preferences/package-tree.html...
23:41:08 [2022-05-21T03:41:08.253Z] Generating ./org/eclipse/ease/ui/propertytester/package-summary.html...
23:41:08 [2022-05-21T03:41:08.253Z] Generating ./org/eclipse/ease/ui/propertytester/package-tree.html...
23:41:08 [2022-05-21T03:41:08.253Z] Generating ./org/eclipse/ease/ui/scripts/package-summary.html...
23:41:08 [2022-05-21T03:41:08.253Z] Generating ./org/eclipse/ease/ui/scripts/package-tree.html...
23:41:08 [2022-05-21T03:41:08.253Z] Generating ./org/eclipse/ease/ui/scripts/expressions/package-summary.html...
23:41:08 [2022-05-21T03:41:08.253Z] Generating ./org/eclipse/ease/ui/scripts/expressions/package-tree.html...
23:41:08 [2022-05-21T03:41:08.253Z] Generating ./org/eclipse/ease/ui/scripts/expressions/definitions/package-summary.html...
23:41:08 [2022-05-21T03:41:08.253Z] Generating ./org/eclipse/ease/ui/scripts/expressions/definitions/package-tree.html...
23:41:08 [2022-05-21T03:41:08.253Z] Generating ./org/eclipse/ease/ui/scripts/expressions/handler/package-summary.html...
23:41:08 [2022-05-21T03:41:08.253Z] Generating ./org/eclipse/ease/ui/scripts/expressions/handler/package-tree.html...
23:41:08 [2022-05-21T03:41:08.253Z] Generating ./org/eclipse/ease/ui/scripts/expressions/ui/package-summary.html...
23:41:08 [2022-05-21T03:41:08.253Z] Generating ./org/eclipse/ease/ui/scripts/expressions/ui/package-tree.html...
23:41:08 [2022-05-21T03:41:08.253Z] Generating ./org/eclipse/ease/ui/scripts/keywordhandler/package-summary.html...
23:41:08 [2022-05-21T03:41:08.253Z] Generating ./org/eclipse/ease/ui/scripts/keywordhandler/package-tree.html...
23:41:08 [2022-05-21T03:41:08.253Z] Generating ./org/eclipse/ease/ui/scripts/preferences/package-summary.html...
23:41:08 [2022-05-21T03:41:08.253Z] Generating ./org/eclipse/ease/ui/scripts/preferences/package-tree.html...
23:41:08 [2022-05-21T03:41:08.253Z] Generating ./org/eclipse/ease/ui/scripts/repository/package-summary.html...
23:41:08 [2022-05-21T03:41:08.253Z] Generating ./org/eclipse/ease/ui/scripts/repository/package-tree.html...
23:41:08 [2022-05-21T03:41:08.253Z] Generating ./org/eclipse/ease/ui/scripts/ui/package-summary.html...
23:41:08 [2022-05-21T03:41:08.253Z] Generating ./org/eclipse/ease/ui/scripts/ui/package-tree.html...
23:41:08 [2022-05-21T03:41:08.253Z] Generating ./org/eclipse/ease/ui/tools/package-summary.html...
23:41:08 [2022-05-21T03:41:08.253Z] Generating ./org/eclipse/ease/ui/tools/package-tree.html...
23:41:08 [2022-05-21T03:41:08.253Z] Generating ./org/eclipse/ease/ui/view/package-summary.html...
23:41:08 [2022-05-21T03:41:08.253Z] Generating ./org/eclipse/ease/ui/view/package-tree.html...
23:41:08 [2022-05-21T03:41:08.253Z] Generating ./org/eclipse/ease/ui/views/shell/dropins/package-summary.html...
23:41:08 [2022-05-21T03:41:08.253Z] Generating ./org/eclipse/ease/ui/views/shell/dropins/package-tree.html...
23:41:08 [2022-05-21T03:41:08.253Z] Generating ./org/eclipse/ease/urlhandler/package-summary.html...
23:41:08 [2022-05-21T03:41:08.253Z] Generating ./org/eclipse/ease/urlhandler/package-tree.html...
23:41:08 [2022-05-21T03:41:08.253Z] Generating ./constant-values.html...
23:41:08 [2022-05-21T03:41:08.253Z] Generating ./serialized-form.html...
23:41:08 [2022-05-21T03:41:08.253Z] Generating ./overview-tree.html...
23:41:08 [2022-05-21T03:41:08.253Z] Generating ./deprecated-list.html...
23:41:08 [2022-05-21T03:41:08.522Z] Generating ./index.html...
23:41:08 [2022-05-21T03:41:08.522Z] Building index for all the packages and classes...
23:41:08 [2022-05-21T03:41:08.522Z] Generating ./index-all.html...
23:41:08 [2022-05-21T03:41:08.790Z] Building index for all classes...
23:41:08 [2022-05-21T03:41:08.790Z] Generating ./allclasses-index.html...
23:41:08 [2022-05-21T03:41:08.790Z] Generating ./allpackages-index.html...
23:41:08 [2022-05-21T03:41:08.790Z] Generating ./overview-summary.html...
23:41:08 [2022-05-21T03:41:08.790Z] Generating ./help-doc.html...
23:41:08 [2022-05-21T03:41:08.790Z] 100 errors
23:41:08 [2022-05-21T03:41:08.790Z] 100 warnings
23:41:08 [2022-05-21T03:41:08.790Z] [INFO] execution failed with rc = 1
23:41:08 [2022-05-21T03:41:08.790Z] [INFO] Make relative - base: /home/jenkins/agent/workspace/ease.verify.core.target.2018-12/plugins/org.eclipse.ease.help, file: /home/jenkins/agent/workspace/ease.verify.core.target.2018-12/plugins/org.eclipse.ease.help/help/api-docs/javadoc/overview-summary.html -> help/api-docs/javadoc/overview-summary.html
23:41:08 [2022-05-21T03:41:08.790Z] [INFO] Make relative - base: /home/jenkins/agent/workspace/ease.verify.core.target.2018-12/plugins/org.eclipse.ease.help, file: /home/jenkins/agent/workspace/ease.verify.core.target.2018-12/plugins/org.eclipse.ease.help/help/api-docs/javadoc/constant-values.html -> help/api-docs/javadoc/constant-values.html
23:41:08 [2022-05-21T03:41:08.790Z] [INFO] Make relative - base: /home/jenkins/agent/workspace/ease.verify.core.target.2018-12/plugins/org.eclipse.ease.help, file: /home/jenkins/agent/workspace/ease.verify.core.target.2018-12/plugins/org.eclipse.ease.help/help/api-docs/javadoc/deprecated-list.html -> help/api-docs/javadoc/deprecated-list.html
23:41:08 [2022-05-21T03:41:08.790Z] [INFO] Make relative - base: /home/jenkins/agent/workspace/ease.verify.core.target.2018-12/plugins/org.eclipse.ease.help, file: /home/jenkins/agent/workspace/ease.verify.core.target.2018-12/plugins/org.eclipse.ease.help/help/api-docs/javadoc/org/eclipse/ease/package-summary.html -> help/api-docs/javadoc/org/eclipse/ease/package-summary.html
23:41:08 [2022-05-21T03:41:08.790Z] [INFO] Make relative - base: /home/jenkins/agent/workspace/ease.verify.core.target.2018-12/plugins/org.eclipse.ease.help, file: /home/jenkins/agent/workspace/ease.verify.core.target.2018-12/plugins/org.eclipse.ease.help/help/api-docs/javadoc/org/eclipse/ease/classloader/package-summary.html -> help/api-docs/javadoc/org/eclipse/ease/classloader/package-summary.html
23:41:08 [2022-05-21T03:41:08.790Z] [INFO] Make relative - base: /home/jenkins/agent/workspace/ease.verify.core.target.2018-12/plugins/org.eclipse.ease.help, file: /home/jenkins/agent/workspace/ease.verify.core.target.2018-12/plugins/org.eclipse.ease.help/help/api-docs/javadoc/org/eclipse/ease/debugging/package-summary.html -> help/api-docs/javadoc/org/eclipse/ease/debugging/package-summary.html
23:41:08 [2022-05-21T03:41:08.790Z] [INFO] Make relative - base: /home/jenkins/agent/workspace/ease.verify.core.target.2018-12/plugins/org.eclipse.ease.help, file: /home/jenkins/agent/workspace/ease.verify.core.target.2018-12/plugins/org.eclipse.ease.help/help/api-docs/javadoc/org/eclipse/ease/debugging/dispatcher/package-summary.html -> help/api-docs/javadoc/org/eclipse/ease/debugging/dispatcher/package-summary.html
23:41:08 [2022-05-21T03:41:08.790Z] [INFO] Make relative - base: /home/jenkins/agent/workspace/ease.verify.core.target.2018-12/plugins/org.eclipse.ease.help, file: /home/jenkins/agent/workspace/ease.verify.core.target.2018-12/plugins/org.eclipse.ease.help/help/api-docs/javadoc/org/eclipse/ease/debugging/events/package-summary.html -> help/api-docs/javadoc/org/eclipse/ease/debugging/events/package-summary.html
23:41:08 [2022-05-21T03:41:08.790Z] [INFO] Make relative - base: /home/jenkins/agent/workspace/ease.verify.core.target.2018-12/plugins/org.eclipse.ease.help, file: /home/jenkins/agent/workspace/ease.verify.core.target.2018-12/plugins/org.eclipse.ease.help/help/api-docs/javadoc/org/eclipse/ease/debugging/events/debugger/package-summary.html -> help/api-docs/javadoc/org/eclipse/ease/debugging/events/debugger/package-summary.html
23:41:08 [2022-05-21T03:41:08.790Z] [INFO] Make relative - base: /home/jenkins/agent/workspace/ease.verify.core.target.2018-12/plugins/org.eclipse.ease.help, file: /home/jenkins/agent/workspace/ease.verify.core.target.2018-12/plugins/org.eclipse.ease.help/help/api-docs/javadoc/org/eclipse/ease/debugging/events/model/package-summary.html -> help/api-docs/javadoc/org/eclipse/ease/debugging/events/model/package-summary.html
23:41:08 [2022-05-21T03:41:08.791Z] [INFO] Make relative - base: /home/jenkins/agent/workspace/ease.verify.core.target.2018-12/plugins/org.eclipse.ease.help, file: /home/jenkins/agent/workspace/ease.verify.core.target.2018-12/plugins/org.eclipse.ease.help/help/api-docs/javadoc/org/eclipse/ease/debugging/model/package-summary.html -> help/api-docs/javadoc/org/eclipse/ease/debugging/model/package-summary.html
23:41:08 [2022-05-21T03:41:08.791Z] [INFO] Make relative - base: /home/jenkins/agent/workspace/ease.verify.core.target.2018-12/plugins/org.eclipse.ease.help, file: /home/jenkins/agent/workspace/ease.verify.core.target.2018-12/plugins/org.eclipse.ease.help/help/api-docs/javadoc/org/eclipse/ease/lang/groovy/package-summary.html -> help/api-docs/javadoc/org/eclipse/ease/lang/groovy/package-summary.html
23:41:08 [2022-05-21T03:41:08.791Z] [INFO] Make relative - base: /home/jenkins/agent/workspace/ease.verify.core.target.2018-12/plugins/org.eclipse.ease.help, file: /home/jenkins/agent/workspace/ease.verify.core.target.2018-12/plugins/org.eclipse.ease.help/help/api-docs/javadoc/org/eclipse/ease/lang/javascript/package-summary.html -> help/api-docs/javadoc/org/eclipse/ease/lang/javascript/package-summary.html
23:41:08 [2022-05-21T03:41:08.791Z] [INFO] Make relative - base: /home/jenkins/agent/workspace/ease.verify.core.target.2018-12/plugins/org.eclipse.ease.help, file: /home/jenkins/agent/workspace/ease.verify.core.target.2018-12/plugins/org.eclipse.ease.help/help/api-docs/javadoc/org/eclipse/ease/lang/javascript/nashorn/package-summary.html -> help/api-docs/javadoc/org/eclipse/ease/lang/javascript/nashorn/package-summary.html
23:41:08 [2022-05-21T03:41:08.791Z] [INFO] Make relative - base: /home/jenkins/agent/workspace/ease.verify.core.target.2018-12/plugins/org.eclipse.ease.help, file: /home/jenkins/agent/workspace/ease.verify.core.target.2018-12/plugins/org.eclipse.ease.help/help/api-docs/javadoc/org/eclipse/ease/lang/javascript/rhino/package-summary.html -> help/api-docs/javadoc/org/eclipse/ease/lang/javascript/rhino/package-summary.html
23:41:08 [2022-05-21T03:41:08.791Z] [INFO] Make relative - base: /home/jenkins/agent/workspace/ease.verify.core.target.2018-12/plugins/org.eclipse.ease.help, file: /home/jenkins/agent/workspace/ease.verify.core.target.2018-12/plugins/org.eclipse.ease.help/help/api-docs/javadoc/org/eclipse/ease/lang/jvm/compiled/package-summary.html -> help/api-docs/javadoc/org/eclipse/ease/lang/jvm/compiled/package-summary.html
23:41:08 [2022-05-21T03:41:08.791Z] [INFO] Make relative - base: /home/jenkins/agent/workspace/ease.verify.core.target.2018-12/plugins/org.eclipse.ease.help, file: /home/jenkins/agent/workspace/ease.verify.core.target.2018-12/plugins/org.eclipse.ease.help/help/api-docs/javadoc/org/eclipse/ease/lang/python/package-summary.html -> help/api-docs/javadoc/org/eclipse/ease/lang/python/package-summary.html
23:41:08 [2022-05-21T03:41:08.791Z] [INFO] Make relative - base: /home/jenkins/agent/workspace/ease.verify.core.target.2018-12/plugins/org.eclipse.ease.help, file: /home/jenkins/agent/workspace/ease.verify.core.target.2018-12/plugins/org.eclipse.ease.help/help/api-docs/javadoc/org/eclipse/ease/lang/python/debug/package-summary.html -> help/api-docs/javadoc/org/eclipse/ease/lang/python/debug/package-summary.html
23:41:08 [2022-05-21T03:41:08.791Z] [INFO] Make relative - base: /home/jenkins/agent/workspace/ease.verify.core.target.2018-12/plugins/org.eclipse.ease.help, file: /home/jenkins/agent/workspace/ease.verify.core.target.2018-12/plugins/org.eclipse.ease.help/help/api-docs/javadoc/org/eclipse/ease/lang/python/debugger/package-summary.html -> help/api-docs/javadoc/org/eclipse/ease/lang/python/debugger/package-summary.html
23:41:08 [2022-05-21T03:41:08.791Z] [INFO] Make relative - base: /home/jenkins/agent/workspace/ease.verify.core.target.2018-12/plugins/org.eclipse.ease.help, file: /home/jenkins/agent/workspace/ease.verify.core.target.2018-12/plugins/org.eclipse.ease.help/help/api-docs/javadoc/org/eclipse/ease/lang/python/debugger/actions/package-summary.html -> help/api-docs/javadoc/org/eclipse/ease/lang/python/debugger/actions/package-summary.html
23:41:08 [2022-05-21T03:41:08.791Z] [INFO] Make relative - base: /home/jenkins/agent/workspace/ease.verify.core.target.2018-12/plugins/org.eclipse.ease.help, file: /home/jenkins/agent/workspace/ease.verify.core.target.2018-12/plugins/org.eclipse.ease.help/help/api-docs/javadoc/org/eclipse/ease/lang/python/debugger/model/package-summary.html -> help/api-docs/javadoc/org/eclipse/ease/lang/python/debugger/model/package-summary.html
23:41:08 [2022-05-21T03:41:08.791Z] [INFO] Make relative - base: /home/jenkins/agent/workspace/ease.verify.core.target.2018-12/plugins/org.eclipse.ease.help, file: /home/jenkins/agent/workspace/ease.verify.core.target.2018-12/plugins/org.eclipse.ease.help/help/api-docs/javadoc/org/eclipse/ease/lang/python/jython/package-summary.html -> help/api-docs/javadoc/org/eclipse/ease/lang/python/jython/package-summary.html
23:41:08 [2022-05-21T03:41:08.791Z] [INFO] Make relative - base: /home/jenkins/agent/workspace/ease.verify.core.target.2018-12/plugins/org.eclipse.ease.help, file: /home/jenkins/agent/workspace/ease.verify.core.target.2018-12/plugins/org.eclipse.ease.help/help/api-docs/javadoc/org/eclipse/ease/lang/python/preferences/package-summary.html -> help/api-docs/javadoc/org/eclipse/ease/lang/python/preferences/package-summary.html
23:41:08 [2022-05-21T03:41:08.792Z] [INFO] Make relative - base: /home/jenkins/agent/workspace/ease.verify.core.target.2018-12/plugins/org.eclipse.ease.help, file: /home/jenkins/agent/workspace/ease.verify.core.target.2018-12/plugins/org.eclipse.ease.help/help/api-docs/javadoc/org/eclipse/ease/lang/python/py4j/internal/package-summary.html -> help/api-docs/javadoc/org/eclipse/ease/lang/python/py4j/internal/package-summary.html
23:41:08 [2022-05-21T03:41:08.792Z] [INFO] Make relative - base: /home/jenkins/agent/workspace/ease.verify.core.target.2018-12/plugins/org.eclipse.ease.help, file: /home/jenkins/agent/workspace/ease.verify.core.target.2018-12/plugins/org.eclipse.ease.help/help/api-docs/javadoc/org/eclipse/ease/lang/python/py4j/internal/ui/package-summary.html -> help/api-docs/javadoc/org/eclipse/ease/lang/python/py4j/internal/ui/package-summary.html
23:41:08 [2022-05-21T03:41:08.792Z] [INFO] Make relative - base: /home/jenkins/agent/workspace/ease.verify.core.target.2018-12/plugins/org.eclipse.ease.help, file: /home/jenkins/agent/workspace/ease.verify.core.target.2018-12/plugins/org.eclipse.ease.help/help/api-docs/javadoc/org/eclipse/ease/lang/python/ui/completion/package-summary.html -> help/api-docs/javadoc/org/eclipse/ease/lang/python/ui/completion/package-summary.html
23:41:08 [2022-05-21T03:41:08.792Z] [INFO] Make relative - base: /home/jenkins/agent/workspace/ease.verify.core.target.2018-12/plugins/org.eclipse.ease.help, file: /home/jenkins/agent/workspace/ease.verify.core.target.2018-12/plugins/org.eclipse.ease.help/help/api-docs/javadoc/org/eclipse/ease/lang/ruby/package-summary.html -> help/api-docs/javadoc/org/eclipse/ease/lang/ruby/package-summary.html
23:41:08 [2022-05-21T03:41:08.792Z] [INFO] Make relative - base: /home/jenkins/agent/workspace/ease.verify.core.target.2018-12/plugins/org.eclipse.ease.help, file: /home/jenkins/agent/workspace/ease.verify.core.target.2018-12/plugins/org.eclipse.ease.help/help/api-docs/javadoc/org/eclipse/ease/lang/scriptarchive/package-summary.html -> help/api-docs/javadoc/org/eclipse/ease/lang/scriptarchive/package-summary.html
23:41:08 [2022-05-21T03:41:08.792Z] [INFO] Make relative - base: /home/jenkins/agent/workspace/ease.verify.core.target.2018-12/plugins/org.eclipse.ease.help, file: /home/jenkins/agent/workspace/ease.verify.core.target.2018-12/plugins/org.eclipse.ease.help/help/api-docs/javadoc/org/eclipse/ease/lang/unittest/package-summary.html -> help/api-docs/javadoc/org/eclipse/ease/lang/unittest/package-summary.html
23:41:08 [2022-05-21T03:41:08.792Z] [INFO] Make relative - base: /home/jenkins/agent/workspace/ease.verify.core.target.2018-12/plugins/org.eclipse.ease.help, file: /home/jenkins/agent/workspace/ease.verify.core.target.2018-12/plugins/org.eclipse.ease.help/help/api-docs/javadoc/org/eclipse/ease/lang/unittest/definition/package-summary.html -> help/api-docs/javadoc/org/eclipse/ease/lang/unittest/definition/package-summary.html
23:41:08 [2022-05-21T03:41:08.792Z] [INFO] Make relative - base: /home/jenkins/agent/workspace/ease.verify.core.target.2018-12/plugins/org.eclipse.ease.help, file: /home/jenkins/agent/workspace/ease.verify.core.target.2018-12/plugins/org.eclipse.ease.help/help/api-docs/javadoc/org/eclipse/ease/lang/unittest/definition/impl/package-summary.html -> help/api-docs/javadoc/org/eclipse/ease/lang/unittest/definition/impl/package-summary.html
23:41:08 [2022-05-21T03:41:08.792Z] [INFO] Make relative - base: /home/jenkins/agent/workspace/ease.verify.core.target.2018-12/plugins/org.eclipse.ease.help, file: /home/jenkins/agent/workspace/ease.verify.core.target.2018-12/plugins/org.eclipse.ease.help/help/api-docs/javadoc/org/eclipse/ease/lang/unittest/definition/provider/package-summary.html -> help/api-docs/javadoc/org/eclipse/ease/lang/unittest/definition/provider/package-summary.html
23:41:08 [2022-05-21T03:41:08.792Z] [INFO] Make relative - base: /home/jenkins/agent/workspace/ease.verify.core.target.2018-12/plugins/org.eclipse.ease.help, file: /home/jenkins/agent/workspace/ease.verify.core.target.2018-12/plugins/org.eclipse.ease.help/help/api-docs/javadoc/org/eclipse/ease/lang/unittest/definition/util/package-summary.html -> help/api-docs/javadoc/org/eclipse/ease/lang/unittest/definition/util/package-summary.html
23:41:08 [2022-05-21T03:41:08.792Z] [INFO] Make relative - base: /home/jenkins/agent/workspace/ease.verify.core.target.2018-12/plugins/org.eclipse.ease.help, file: /home/jenkins/agent/workspace/ease.verify.core.target.2018-12/plugins/org.eclipse.ease.help/help/api-docs/javadoc/org/eclipse/ease/lang/unittest/reporters/package-summary.html -> help/api-docs/javadoc/org/eclipse/ease/lang/unittest/reporters/package-summary.html
23:41:08 [2022-05-21T03:41:08.792Z] [INFO] Make relative - base: /home/jenkins/agent/workspace/ease.verify.core.target.2018-12/plugins/org.eclipse.ease.help, file: /home/jenkins/agent/workspace/ease.verify.core.target.2018-12/plugins/org.eclipse.ease.help/help/api-docs/javadoc/org/eclipse/ease/lang/unittest/runtime/package-summary.html -> help/api-docs/javadoc/org/eclipse/ease/lang/unittest/runtime/package-summary.html
23:41:08 [2022-05-21T03:41:08.793Z] [INFO] Make relative - base: /home/jenkins/agent/workspace/ease.verify.core.target.2018-12/plugins/org.eclipse.ease.help, file: /home/jenkins/agent/workspace/ease.verify.core.target.2018-12/plugins/org.eclipse.ease.help/help/api-docs/javadoc/org/eclipse/ease/lang/unittest/runtime/impl/package-summary.html -> help/api-docs/javadoc/org/eclipse/ease/lang/unittest/runtime/impl/package-summary.html
23:41:08 [2022-05-21T03:41:08.793Z] [INFO] Make relative - base: /home/jenkins/agent/workspace/ease.verify.core.target.2018-12/plugins/org.eclipse.ease.help, file: /home/jenkins/agent/workspace/ease.verify.core.target.2018-12/plugins/org.eclipse.ease.help/help/api-docs/javadoc/org/eclipse/ease/lang/unittest/runtime/util/package-summary.html -> help/api-docs/javadoc/org/eclipse/ease/lang/unittest/runtime/util/package-summary.html
23:41:08 [2022-05-21T03:41:08.793Z] [INFO] Make relative - base: /home/jenkins/agent/workspace/ease.verify.core.target.2018-12/plugins/org.eclipse.ease.help, file: /home/jenkins/agent/workspace/ease.verify.core.target.2018-12/plugins/org.eclipse.ease.help/help/api-docs/javadoc/org/eclipse/ease/lang/unittest/ui/editor/package-summary.html -> help/api-docs/javadoc/org/eclipse/ease/lang/unittest/ui/editor/package-summary.html
23:41:08 [2022-05-21T03:41:08.793Z] [INFO] Make relative - base: /home/jenkins/agent/workspace/ease.verify.core.target.2018-12/plugins/org.eclipse.ease.help, file: /home/jenkins/agent/workspace/ease.verify.core.target.2018-12/plugins/org.eclipse.ease.help/help/api-docs/javadoc/org/eclipse/ease/lang/unittest/ui/views/package-summary.html -> help/api-docs/javadoc/org/eclipse/ease/lang/unittest/ui/views/package-summary.html
23:41:08 [2022-05-21T03:41:08.793Z] [INFO] Make relative - base: /home/jenkins/agent/workspace/ease.verify.core.target.2018-12/plugins/org.eclipse.ease.help, file: /home/jenkins/agent/workspace/ease.verify.core.target.2018-12/plugins/org.eclipse.ease.help/help/api-docs/javadoc/org/eclipse/ease/modules/package-summary.html -> help/api-docs/javadoc/org/eclipse/ease/modules/package-summary.html
23:41:08 [2022-05-21T03:41:08.793Z] [INFO] Make relative - base: /home/jenkins/agent/workspace/ease.verify.core.target.2018-12/plugins/org.eclipse.ease.help, file: /home/jenkins/agent/workspace/ease.verify.core.target.2018-12/plugins/org.eclipse.ease.help/help/api-docs/javadoc/org/eclipse/ease/service/package-summary.html -> help/api-docs/javadoc/org/eclipse/ease/service/package-summary.html
23:41:08 [2022-05-21T03:41:08.793Z] [INFO] Make relative - base: /home/jenkins/agent/workspace/ease.verify.core.target.2018-12/plugins/org.eclipse.ease.help, file: /home/jenkins/agent/workspace/ease.verify.core.target.2018-12/plugins/org.eclipse.ease.help/help/api-docs/javadoc/org/eclipse/ease/sign/package-summary.html -> help/api-docs/javadoc/org/eclipse/ease/sign/package-summary.html
23:41:08 [2022-05-21T03:41:08.793Z] [INFO] Make relative - base: /home/jenkins/agent/workspace/ease.verify.core.target.2018-12/plugins/org.eclipse.ease.help, file: /home/jenkins/agent/workspace/ease.verify.core.target.2018-12/plugins/org.eclipse.ease.help/help/api-docs/javadoc/org/eclipse/ease/tools/package-summary.html -> help/api-docs/javadoc/org/eclipse/ease/tools/package-summary.html
23:41:08 [2022-05-21T03:41:08.793Z] [INFO] Make relative - base: /home/jenkins/agent/workspace/ease.verify.core.target.2018-12/plugins/org.eclipse.ease.help, file: /home/jenkins/agent/workspace/ease.verify.core.target.2018-12/plugins/org.eclipse.ease.help/help/api-docs/javadoc/org/eclipse/ease/ui/package-summary.html -> help/api-docs/javadoc/org/eclipse/ease/ui/package-summary.html
23:41:08 [2022-05-21T03:41:08.793Z] [INFO] Make relative - base: /home/jenkins/agent/workspace/ease.verify.core.target.2018-12/plugins/org.eclipse.ease.help, file: /home/jenkins/agent/workspace/ease.verify.core.target.2018-12/plugins/org.eclipse.ease.help/help/api-docs/javadoc/org/eclipse/ease/ui/completion/package-summary.html -> help/api-docs/javadoc/org/eclipse/ease/ui/completion/package-summary.html
23:41:08 [2022-05-21T03:41:08.793Z] [INFO] Make relative - base: /home/jenkins/agent/workspace/ease.verify.core.target.2018-12/plugins/org.eclipse.ease.help, file: /home/jenkins/agent/workspace/ease.verify.core.target.2018-12/plugins/org.eclipse.ease.help/help/api-docs/javadoc/org/eclipse/ease/ui/completion/provider/package-summary.html -> help/api-docs/javadoc/org/eclipse/ease/ui/completion/provider/package-summary.html
23:41:08 [2022-05-21T03:41:08.793Z] [INFO] Make relative - base: /home/jenkins/agent/workspace/ease.verify.core.target.2018-12/plugins/org.eclipse.ease.help, file: /home/jenkins/agent/workspace/ease.verify.core.target.2018-12/plugins/org.eclipse.ease.help/help/api-docs/javadoc/org/eclipse/ease/ui/completion/tokenizer/package-summary.html -> help/api-docs/javadoc/org/eclipse/ease/ui/completion/tokenizer/package-summary.html
23:41:08 [2022-05-21T03:41:08.793Z] [INFO] Make relative - base: /home/jenkins/agent/workspace/ease.verify.core.target.2018-12/plugins/org.eclipse.ease.help, file: /home/jenkins/agent/workspace/ease.verify.core.target.2018-12/plugins/org.eclipse.ease.help/help/api-docs/javadoc/org/eclipse/ease/ui/console/package-summary.html -> help/api-docs/javadoc/org/eclipse/ease/ui/console/package-summary.html
23:41:08 [2022-05-21T03:41:08.793Z] [INFO] Make relative - base: /home/jenkins/agent/workspace/ease.verify.core.target.2018-12/plugins/org.eclipse.ease.help, file: /home/jenkins/agent/workspace/ease.verify.core.target.2018-12/plugins/org.eclipse.ease.help/help/api-docs/javadoc/org/eclipse/ease/ui/console/actions/package-summary.html -> help/api-docs/javadoc/org/eclipse/ease/ui/console/actions/package-summary.html
23:41:08 [2022-05-21T03:41:08.794Z] [INFO] Make relative - base: /home/jenkins/agent/workspace/ease.verify.core.target.2018-12/plugins/org.eclipse.ease.help, file: /home/jenkins/agent/workspace/ease.verify.core.target.2018-12/plugins/org.eclipse.ease.help/help/api-docs/javadoc/org/eclipse/ease/ui/debugging/model/package-summary.html -> help/api-docs/javadoc/org/eclipse/ease/ui/debugging/model/package-summary.html
23:41:08 [2022-05-21T03:41:08.794Z] [INFO] Make relative - base: /home/jenkins/agent/workspace/ease.verify.core.target.2018-12/plugins/org.eclipse.ease.help, file: /home/jenkins/agent/workspace/ease.verify.core.target.2018-12/plugins/org.eclipse.ease.help/help/api-docs/javadoc/org/eclipse/ease/ui/dnd/package-summary.html -> help/api-docs/javadoc/org/eclipse/ease/ui/dnd/package-summary.html
23:41:08 [2022-05-21T03:41:08.794Z] [INFO] Make relative - base: /home/jenkins/agent/workspace/ease.verify.core.target.2018-12/plugins/org.eclipse.ease.help, file: /home/jenkins/agent/workspace/ease.verify.core.target.2018-12/plugins/org.eclipse.ease.help/help/api-docs/javadoc/org/eclipse/ease/ui/handler/package-summary.html -> help/api-docs/javadoc/org/eclipse/ease/ui/handler/package-summary.html
23:41:08 [2022-05-21T03:41:08.794Z] [INFO] Make relative - base: /home/jenkins/agent/workspace/ease.verify.core.target.2018-12/plugins/org.eclipse.ease.help, file: /home/jenkins/agent/workspace/ease.verify.core.target.2018-12/plugins/org.eclipse.ease.help/help/api-docs/javadoc/org/eclipse/ease/ui/help/hovers/package-summary.html -> help/api-docs/javadoc/org/eclipse/ease/ui/help/hovers/package-summary.html
23:41:08 [2022-05-21T03:41:08.794Z] [INFO] Make relative - base: /home/jenkins/agent/workspace/ease.verify.core.target.2018-12/plugins/org.eclipse.ease.help, file: /home/jenkins/agent/workspace/ease.verify.core.target.2018-12/plugins/org.eclipse.ease.help/help/api-docs/javadoc/org/eclipse/ease/ui/launching/package-summary.html -> help/api-docs/javadoc/org/eclipse/ease/ui/launching/package-summary.html
23:41:08 [2022-05-21T03:41:08.794Z] [INFO] Make relative - base: /home/jenkins/agent/workspace/ease.verify.core.target.2018-12/plugins/org.eclipse.ease.help, file: /home/jenkins/agent/workspace/ease.verify.core.target.2018-12/plugins/org.eclipse.ease.help/help/api-docs/javadoc/org/eclipse/ease/ui/modules/ui/package-summary.html -> help/api-docs/javadoc/org/eclipse/ease/ui/modules/ui/package-summary.html
23:41:08 [2022-05-21T03:41:08.794Z] [INFO] Make relative - base: /home/jenkins/agent/workspace/ease.verify.core.target.2018-12/plugins/org.eclipse.ease.help, file: /home/jenkins/agent/workspace/ease.verify.core.target.2018-12/plugins/org.eclipse.ease.help/help/api-docs/javadoc/org/eclipse/ease/ui/perspectives/package-summary.html -> help/api-docs/javadoc/org/eclipse/ease/ui/perspectives/package-summary.html
23:41:08 [2022-05-21T03:41:08.794Z] [INFO] Make relative - base: /home/jenkins/agent/workspace/ease.verify.core.target.2018-12/plugins/org.eclipse.ease.help, file: /home/jenkins/agent/workspace/ease.verify.core.target.2018-12/plugins/org.eclipse.ease.help/help/api-docs/javadoc/org/eclipse/ease/ui/preferences/package-summary.html -> help/api-docs/javadoc/org/eclipse/ease/ui/preferences/package-summary.html
23:41:08 [2022-05-21T03:41:08.794Z] [INFO] Make relative - base: /home/jenkins/agent/workspace/ease.verify.core.target.2018-12/plugins/org.eclipse.ease.help, file: /home/jenkins/agent/workspace/ease.verify.core.target.2018-12/plugins/org.eclipse.ease.help/help/api-docs/javadoc/org/eclipse/ease/ui/propertytester/package-summary.html -> help/api-docs/javadoc/org/eclipse/ease/ui/propertytester/package-summary.html
23:41:08 [2022-05-21T03:41:08.794Z] [INFO] Make relative - base: /home/jenkins/agent/workspace/ease.verify.core.target.2018-12/plugins/org.eclipse.ease.help, file: /home/jenkins/agent/workspace/ease.verify.core.target.2018-12/plugins/org.eclipse.ease.help/help/api-docs/javadoc/org/eclipse/ease/ui/scripts/package-summary.html -> help/api-docs/javadoc/org/eclipse/ease/ui/scripts/package-summary.html
23:41:08 [2022-05-21T03:41:08.794Z] [INFO] Make relative - base: /home/jenkins/agent/workspace/ease.verify.core.target.2018-12/plugins/org.eclipse.ease.help, file: /home/jenkins/agent/workspace/ease.verify.core.target.2018-12/plugins/org.eclipse.ease.help/help/api-docs/javadoc/org/eclipse/ease/ui/scripts/expressions/package-summary.html -> help/api-docs/javadoc/org/eclipse/ease/ui/scripts/expressions/package-summary.html
23:41:08 [2022-05-21T03:41:08.794Z] [INFO] Make relative - base: /home/jenkins/agent/workspace/ease.verify.core.target.2018-12/plugins/org.eclipse.ease.help, file: /home/jenkins/agent/workspace/ease.verify.core.target.2018-12/plugins/org.eclipse.ease.help/help/api-docs/javadoc/org/eclipse/ease/ui/scripts/expressions/definitions/package-summary.html -> help/api-docs/javadoc/org/eclipse/ease/ui/scripts/expressions/definitions/package-summary.html
23:41:08 [2022-05-21T03:41:08.794Z] [INFO] Make relative - base: /home/jenkins/agent/workspace/ease.verify.core.target.2018-12/plugins/org.eclipse.ease.help, file: /home/jenkins/agent/workspace/ease.verify.core.target.2018-12/plugins/org.eclipse.ease.help/help/api-docs/javadoc/org/eclipse/ease/ui/scripts/expressions/handler/package-summary.html -> help/api-docs/javadoc/org/eclipse/ease/ui/scripts/expressions/handler/package-summary.html
23:41:08 [2022-05-21T03:41:08.795Z] [INFO] Make relative - base: /home/jenkins/agent/workspace/ease.verify.core.target.2018-12/plugins/org.eclipse.ease.help, file: /home/jenkins/agent/workspace/ease.verify.core.target.2018-12/plugins/org.eclipse.ease.help/help/api-docs/javadoc/org/eclipse/ease/ui/scripts/expressions/ui/package-summary.html -> help/api-docs/javadoc/org/eclipse/ease/ui/scripts/expressions/ui/package-summary.html
23:41:08 [2022-05-21T03:41:08.795Z] [INFO] Make relative - base: /home/jenkins/agent/workspace/ease.verify.core.target.2018-12/plugins/org.eclipse.ease.help, file: /home/jenkins/agent/workspace/ease.verify.core.target.2018-12/plugins/org.eclipse.ease.help/help/api-docs/javadoc/org/eclipse/ease/ui/scripts/keywordhandler/package-summary.html -> help/api-docs/javadoc/org/eclipse/ease/ui/scripts/keywordhandler/package-summary.html
23:41:08 [2022-05-21T03:41:08.795Z] [INFO] Make relative - base: /home/jenkins/agent/workspace/ease.verify.core.target.2018-12/plugins/org.eclipse.ease.help, file: /home/jenkins/agent/workspace/ease.verify.core.target.2018-12/plugins/org.eclipse.ease.help/help/api-docs/javadoc/org/eclipse/ease/ui/scripts/preferences/package-summary.html -> help/api-docs/javadoc/org/eclipse/ease/ui/scripts/preferences/package-summary.html
23:41:08 [2022-05-21T03:41:08.795Z] [INFO] Make relative - base: /home/jenkins/agent/workspace/ease.verify.core.target.2018-12/plugins/org.eclipse.ease.help, file: /home/jenkins/agent/workspace/ease.verify.core.target.2018-12/plugins/org.eclipse.ease.help/help/api-docs/javadoc/org/eclipse/ease/ui/scripts/repository/package-summary.html -> help/api-docs/javadoc/org/eclipse/ease/ui/scripts/repository/package-summary.html
23:41:08 [2022-05-21T03:41:08.795Z] [INFO] Make relative - base: /home/jenkins/agent/workspace/ease.verify.core.target.2018-12/plugins/org.eclipse.ease.help, file: /home/jenkins/agent/workspace/ease.verify.core.target.2018-12/plugins/org.eclipse.ease.help/help/api-docs/javadoc/org/eclipse/ease/ui/scripts/ui/package-summary.html -> help/api-docs/javadoc/org/eclipse/ease/ui/scripts/ui/package-summary.html
23:41:08 [2022-05-21T03:41:08.795Z] [INFO] Make relative - base: /home/jenkins/agent/workspace/ease.verify.core.target.2018-12/plugins/org.eclipse.ease.help, file: /home/jenkins/agent/workspace/ease.verify.core.target.2018-12/plugins/org.eclipse.ease.help/help/api-docs/javadoc/org/eclipse/ease/ui/tools/package-summary.html -> help/api-docs/javadoc/org/eclipse/ease/ui/tools/package-summary.html
23:41:08 [2022-05-21T03:41:08.795Z] [INFO] Make relative - base: /home/jenkins/agent/workspace/ease.verify.core.target.2018-12/plugins/org.eclipse.ease.help, file: /home/jenkins/agent/workspace/ease.verify.core.target.2018-12/plugins/org.eclipse.ease.help/help/api-docs/javadoc/org/eclipse/ease/ui/view/package-summary.html -> help/api-docs/javadoc/org/eclipse/ease/ui/view/package-summary.html
23:41:08 [2022-05-21T03:41:08.795Z] [INFO] Make relative - base: /home/jenkins/agent/workspace/ease.verify.core.target.2018-12/plugins/org.eclipse.ease.help, file: /home/jenkins/agent/workspace/ease.verify.core.target.2018-12/plugins/org.eclipse.ease.help/help/api-docs/javadoc/org/eclipse/ease/ui/views/shell/dropins/package-summary.html -> help/api-docs/javadoc/org/eclipse/ease/ui/views/shell/dropins/package-summary.html
23:41:08 [2022-05-21T03:41:08.795Z] [INFO] Make relative - base: /home/jenkins/agent/workspace/ease.verify.core.target.2018-12/plugins/org.eclipse.ease.help, file: /home/jenkins/agent/workspace/ease.verify.core.target.2018-12/plugins/org.eclipse.ease.help/help/api-docs/javadoc/org/eclipse/ease/urlhandler/package-summary.html -> help/api-docs/javadoc/org/eclipse/ease/urlhandler/package-summary.html
23:41:09 [2022-05-21T03:41:09.279Z] [INFO] 
23:41:09 [2022-05-21T03:41:09.279Z] [INFO] --- maven-resources-plugin:2.4.3:resources (default-resources) @ org.eclipse.ease.help ---
23:41:09 [2022-05-21T03:41:09.279Z] [INFO] Using 'UTF-8' encoding to copy filtered resources.
23:41:09 [2022-05-21T03:41:09.279Z] [INFO] skip non existing resourceDirectory /home/jenkins/agent/workspace/ease.verify.core.target.2018-12/plugins/org.eclipse.ease.help/src/main/resources
23:41:09 [2022-05-21T03:41:09.279Z] [INFO] 
23:41:09 [2022-05-21T03:41:09.279Z] [INFO] --- tycho-compiler-plugin:2.2.0:compile (default-compile) @ org.eclipse.ease.help ---
23:41:09 [2022-05-21T03:41:09.279Z] [INFO] 
23:41:09 [2022-05-21T03:41:09.279Z] [INFO] --- maven-resources-plugin:2.4.3:testResources (default-testResources) @ org.eclipse.ease.help ---
23:41:09 [2022-05-21T03:41:09.279Z] [INFO] Using 'UTF-8' encoding to copy filtered resources.
23:41:09 [2022-05-21T03:41:09.279Z] [INFO] skip non existing resourceDirectory /home/jenkins/agent/workspace/ease.verify.core.target.2018-12/plugins/org.eclipse.ease.help/src/test/resources
23:41:09 [2022-05-21T03:41:09.279Z] [INFO] 
23:41:09 [2022-05-21T03:41:09.279Z] [INFO] --- target-platform-configuration:2.2.0:target-platform (default-target-platform) @ org.eclipse.ease.help ---
23:41:09 [2022-05-21T03:41:09.279Z] [INFO] 
23:41:09 [2022-05-21T03:41:09.279Z] [INFO] --- tycho-packaging-plugin:2.2.0:package-plugin (default-package-plugin) @ org.eclipse.ease.help ---
23:41:09 [2022-05-21T03:41:09.279Z] [INFO] Building jar: /home/jenkins/agent/workspace/ease.verify.core.target.2018-12/plugins/org.eclipse.ease.help/target/org.eclipse.ease.help-0.9.0-SNAPSHOT.jar
23:41:09 [2022-05-21T03:41:09.279Z] [INFO] 
23:41:09 [2022-05-21T03:41:09.279Z] [INFO] --- tycho-p2-plugin:2.2.0:p2-metadata-default (default-p2-metadata-default) @ org.eclipse.ease.help ---
23:41:09 [2022-05-21T03:41:09.279Z] [INFO] 
23:41:09 [2022-05-21T03:41:09.279Z] [INFO] --- maven-install-plugin:2.3.1:install (default-install) @ org.eclipse.ease.help ---
23:41:09 [2022-05-21T03:41:09.280Z] [INFO] Installing /home/jenkins/agent/workspace/ease.verify.core.target.2018-12/plugins/org.eclipse.ease.help/target/org.eclipse.ease.help-0.9.0-SNAPSHOT.jar to /home/jenkins/.m2/repository/org/eclipse/ease/org.eclipse.ease.help/0.9.0-SNAPSHOT/org.eclipse.ease.help-0.9.0-SNAPSHOT.jar
23:41:09 [2022-05-21T03:41:09.280Z] [INFO] Installing /home/jenkins/agent/workspace/ease.verify.core.target.2018-12/plugins/org.eclipse.ease.help/pom.xml to /home/jenkins/.m2/repository/org/eclipse/ease/org.eclipse.ease.help/0.9.0-SNAPSHOT/org.eclipse.ease.help-0.9.0-SNAPSHOT.pom
23:41:09 [2022-05-21T03:41:09.280Z] [INFO] Installing /home/jenkins/agent/workspace/ease.verify.core.target.2018-12/plugins/org.eclipse.ease.help/target/p2content.xml to /home/jenkins/.m2/repository/org/eclipse/ease/org.eclipse.ease.help/0.9.0-SNAPSHOT/org.eclipse.ease.help-0.9.0-SNAPSHOT-p2metadata.xml
23:41:09 [2022-05-21T03:41:09.280Z] [INFO] Installing /home/jenkins/agent/workspace/ease.verify.core.target.2018-12/plugins/org.eclipse.ease.help/target/p2artifacts.xml to /home/jenkins/.m2/repository/org/eclipse/ease/org.eclipse.ease.help/0.9.0-SNAPSHOT/org.eclipse.ease.help-0.9.0-SNAPSHOT-p2artifacts.xml
23:41:09 [2022-05-21T03:41:09.280Z] [INFO] 
23:41:09 [2022-05-21T03:41:09.280Z] [INFO] --- tycho-p2-plugin:2.2.0:update-local-index (default-update-local-index) @ org.eclipse.ease.help ---
23:41:09 [2022-05-21T03:41:09.280Z] [INFO] 
23:41:09 [2022-05-21T03:41:09.280Z] [INFO] -------------< org.eclipse.ease:org.eclipse.ease.feature >--------------
23:41:09 [2022-05-21T03:41:09.280Z] [INFO] Building org.eclipse.ease.feature 0.9.0-SNAPSHOT                 [24/49]
23:41:09 [2022-05-21T03:41:09.280Z] [INFO] --------------------------[ eclipse-feature ]---------------------------
23:41:09 [2022-05-21T03:41:09.280Z] [INFO] 
23:41:09 [2022-05-21T03:41:09.280Z] [INFO] --- maven-clean-plugin:2.5:clean (default-clean) @ org.eclipse.ease.feature ---
23:41:09 [2022-05-21T03:41:09.280Z] [INFO] Deleting /home/jenkins/agent/workspace/ease.verify.core.target.2018-12/features/org.eclipse.ease.feature/target
23:41:09 [2022-05-21T03:41:09.280Z] [INFO] 
23:41:09 [2022-05-21T03:41:09.280Z] [INFO] --- tycho-packaging-plugin:2.2.0:build-qualifier-aggregator (default-build-qualifier-aggregator) @ org.eclipse.ease.feature ---
23:41:09 [2022-05-21T03:41:09.280Z] [INFO] The project's OSGi version is 0.9.0.I202204290941
23:41:09 [2022-05-21T03:41:09.280Z] [INFO] 
23:41:09 [2022-05-21T03:41:09.280Z] [INFO] --- tycho-packaging-plugin:2.2.0:validate-id (default-validate-id) @ org.eclipse.ease.feature ---
23:41:09 [2022-05-21T03:41:09.280Z] [INFO] 
23:41:09 [2022-05-21T03:41:09.280Z] [INFO] --- tycho-packaging-plugin:2.2.0:validate-version (default-validate-version) @ org.eclipse.ease.feature ---
23:41:09 [2022-05-21T03:41:09.280Z] [INFO] 
23:41:09 [2022-05-21T03:41:09.280Z] [INFO] --- target-platform-configuration:2.2.0:target-platform (default-target-platform) @ org.eclipse.ease.feature ---
23:41:09 [2022-05-21T03:41:09.280Z] [INFO] 
23:41:09 [2022-05-21T03:41:09.280Z] [INFO] --- tycho-packaging-plugin:2.2.0:package-feature (default-package-feature) @ org.eclipse.ease.feature ---
23:41:09 [2022-05-21T03:41:09.280Z] [INFO] Building jar: /home/jenkins/agent/workspace/ease.verify.core.target.2018-12/features/org.eclipse.ease.feature/target/org.eclipse.ease.feature-0.9.0-SNAPSHOT.jar
23:41:09 [2022-05-21T03:41:09.280Z] [INFO] 
23:41:09 [2022-05-21T03:41:09.280Z] [INFO] --- tycho-p2-plugin:2.2.0:p2-metadata-default (default-p2-metadata-default) @ org.eclipse.ease.feature ---
23:41:09 [2022-05-21T03:41:09.280Z] [INFO] 
23:41:09 [2022-05-21T03:41:09.280Z] [INFO] --- tycho-p2-plugin:2.2.0:feature-p2-metadata (default-feature-p2-metadata) @ org.eclipse.ease.feature ---
23:41:09 [2022-05-21T03:41:09.280Z] [INFO] 
23:41:09 [2022-05-21T03:41:09.280Z] [INFO] --- tycho-source-feature-plugin:2.2.0:source-feature (source-feature) @ org.eclipse.ease.feature ---
23:41:09 [2022-05-21T03:41:09.281Z] [WARNING] Mojo tycho-source-feature-plugin:source-feature is replaced by the tycho-source-plugin:feature-source which offers equivalent and even enhanced functionality
23:41:09 [2022-05-21T03:41:09.544Z] [INFO] Building jar: /home/jenkins/agent/workspace/ease.verify.core.target.2018-12/features/org.eclipse.ease.feature/target/org.eclipse.ease.feature-0.9.0-SNAPSHOT-sources-feature.jar
23:41:09 [2022-05-21T03:41:09.544Z] [INFO] 
23:41:09 [2022-05-21T03:41:09.544Z] [INFO] --- tycho-p2-plugin:2.2.0:p2-metadata (attached-p2-metadata) @ org.eclipse.ease.feature ---
23:41:09 [2022-05-21T03:41:09.544Z] [WARNING] artifact org.eclipse.ease:org.eclipse.ease.feature:xml:p2metadata:0.9.0-SNAPSHOT already attached, replace previous instance
23:41:09 [2022-05-21T03:41:09.544Z] [WARNING] artifact org.eclipse.ease:org.eclipse.ease.feature:xml:p2artifacts:0.9.0-SNAPSHOT already attached, replace previous instance
23:41:09 [2022-05-21T03:41:09.544Z] [INFO] 
23:41:09 [2022-05-21T03:41:09.545Z] [INFO] --- maven-install-plugin:2.3.1:install (default-install) @ org.eclipse.ease.feature ---
23:41:09 [2022-05-21T03:41:09.545Z] [INFO] Installing /home/jenkins/agent/workspace/ease.verify.core.target.2018-12/features/org.eclipse.ease.feature/target/org.eclipse.ease.feature-0.9.0-SNAPSHOT.jar to /home/jenkins/.m2/repository/org/eclipse/ease/org.eclipse.ease.feature/0.9.0-SNAPSHOT/org.eclipse.ease.feature-0.9.0-SNAPSHOT.jar
23:41:09 [2022-05-21T03:41:09.545Z] [INFO] Installing /home/jenkins/agent/workspace/ease.verify.core.target.2018-12/features/org.eclipse.ease.feature/pom.xml to /home/jenkins/.m2/repository/org/eclipse/ease/org.eclipse.ease.feature/0.9.0-SNAPSHOT/org.eclipse.ease.feature-0.9.0-SNAPSHOT.pom
23:41:09 [2022-05-21T03:41:09.545Z] [INFO] Installing /home/jenkins/agent/workspace/ease.verify.core.target.2018-12/features/org.eclipse.ease.feature/target/p2content.xml to /home/jenkins/.m2/repository/org/eclipse/ease/org.eclipse.ease.feature/0.9.0-SNAPSHOT/org.eclipse.ease.feature-0.9.0-SNAPSHOT-p2metadata.xml
23:41:09 [2022-05-21T03:41:09.545Z] [INFO] Installing /home/jenkins/agent/workspace/ease.verify.core.target.2018-12/features/org.eclipse.ease.feature/target/p2artifacts.xml to /home/jenkins/.m2/repository/org/eclipse/ease/org.eclipse.ease.feature/0.9.0-SNAPSHOT/org.eclipse.ease.feature-0.9.0-SNAPSHOT-p2artifacts.xml
23:41:09 [2022-05-21T03:41:09.545Z] [INFO] Installing /home/jenkins/agent/workspace/ease.verify.core.target.2018-12/features/org.eclipse.ease.feature/target/org.eclipse.ease.feature-0.9.0-SNAPSHOT-sources-feature.jar to /home/jenkins/.m2/repository/org/eclipse/ease/org.eclipse.ease.feature/0.9.0-SNAPSHOT/org.eclipse.ease.feature-0.9.0-SNAPSHOT-sources-feature.jar
23:41:09 [2022-05-21T03:41:09.545Z] [INFO] 
23:41:09 [2022-05-21T03:41:09.545Z] [INFO] --- tycho-p2-plugin:2.2.0:update-local-index (default-update-local-index) @ org.eclipse.ease.feature ---
23:41:09 [2022-05-21T03:41:09.545Z] [INFO] 
23:41:09 [2022-05-21T03:41:09.545Z] [INFO] ------------< org.eclipse.ease:org.eclipse.ease.ui.feature >------------
23:41:09 [2022-05-21T03:41:09.545Z] [INFO] Building org.eclipse.ease.ui.feature 0.9.0-SNAPSHOT              [25/49]
23:41:09 [2022-05-21T03:41:09.545Z] [INFO] --------------------------[ eclipse-feature ]---------------------------
23:41:09 [2022-05-21T03:41:09.545Z] [INFO] 
23:41:09 [2022-05-21T03:41:09.545Z] [INFO] --- maven-clean-plugin:2.5:clean (default-clean) @ org.eclipse.ease.ui.feature ---
23:41:09 [2022-05-21T03:41:09.545Z] [INFO] Deleting /home/jenkins/agent/workspace/ease.verify.core.target.2018-12/features/org.eclipse.ease.ui.feature/target
23:41:09 [2022-05-21T03:41:09.545Z] [INFO] 
23:41:09 [2022-05-21T03:41:09.545Z] [INFO] --- tycho-packaging-plugin:2.2.0:build-qualifier-aggregator (default-build-qualifier-aggregator) @ org.eclipse.ease.ui.feature ---
23:41:09 [2022-05-21T03:41:09.545Z] [INFO] The project's OSGi version is 0.9.0.I202205210336
23:41:09 [2022-05-21T03:41:09.545Z] [INFO] 
23:41:09 [2022-05-21T03:41:09.545Z] [INFO] --- tycho-packaging-plugin:2.2.0:validate-id (default-validate-id) @ org.eclipse.ease.ui.feature ---
23:41:09 [2022-05-21T03:41:09.545Z] [INFO] 
23:41:09 [2022-05-21T03:41:09.545Z] [INFO] --- tycho-packaging-plugin:2.2.0:validate-version (default-validate-version) @ org.eclipse.ease.ui.feature ---
23:41:09 [2022-05-21T03:41:09.545Z] [INFO] 
23:41:09 [2022-05-21T03:41:09.545Z] [INFO] --- target-platform-configuration:2.2.0:target-platform (default-target-platform) @ org.eclipse.ease.ui.feature ---
23:41:09 [2022-05-21T03:41:09.545Z] [INFO] 
23:41:09 [2022-05-21T03:41:09.545Z] [INFO] --- tycho-packaging-plugin:2.2.0:package-feature (default-package-feature) @ org.eclipse.ease.ui.feature ---
23:41:09 [2022-05-21T03:41:09.545Z] [INFO] Building jar: /home/jenkins/agent/workspace/ease.verify.core.target.2018-12/features/org.eclipse.ease.ui.feature/target/org.eclipse.ease.ui.feature-0.9.0-SNAPSHOT.jar
23:41:09 [2022-05-21T03:41:09.545Z] [INFO] 
23:41:09 [2022-05-21T03:41:09.545Z] [INFO] --- tycho-p2-plugin:2.2.0:p2-metadata-default (default-p2-metadata-default) @ org.eclipse.ease.ui.feature ---
23:41:09 [2022-05-21T03:41:09.545Z] [INFO] 
23:41:09 [2022-05-21T03:41:09.546Z] [INFO] --- tycho-p2-plugin:2.2.0:feature-p2-metadata (default-feature-p2-metadata) @ org.eclipse.ease.ui.feature ---
23:41:09 [2022-05-21T03:41:09.546Z] [INFO] 
23:41:09 [2022-05-21T03:41:09.546Z] [INFO] --- tycho-source-feature-plugin:2.2.0:source-feature (source-feature) @ org.eclipse.ease.ui.feature ---
23:41:09 [2022-05-21T03:41:09.546Z] [WARNING] Mojo tycho-source-feature-plugin:source-feature is replaced by the tycho-source-plugin:feature-source which offers equivalent and even enhanced functionality
23:41:09 [2022-05-21T03:41:09.546Z] [INFO] Building jar: /home/jenkins/agent/workspace/ease.verify.core.target.2018-12/features/org.eclipse.ease.ui.feature/target/org.eclipse.ease.ui.feature-0.9.0-SNAPSHOT-sources-feature.jar
23:41:09 [2022-05-21T03:41:09.546Z] [INFO] 
23:41:09 [2022-05-21T03:41:09.546Z] [INFO] --- tycho-p2-plugin:2.2.0:p2-metadata (attached-p2-metadata) @ org.eclipse.ease.ui.feature ---
23:41:09 [2022-05-21T03:41:09.815Z] [WARNING] artifact org.eclipse.ease:org.eclipse.ease.ui.feature:xml:p2metadata:0.9.0-SNAPSHOT already attached, replace previous instance
23:41:09 [2022-05-21T03:41:09.815Z] [WARNING] artifact org.eclipse.ease:org.eclipse.ease.ui.feature:xml:p2artifacts:0.9.0-SNAPSHOT already attached, replace previous instance
23:41:09 [2022-05-21T03:41:09.815Z] [INFO] 
23:41:09 [2022-05-21T03:41:09.815Z] [INFO] --- maven-install-plugin:2.3.1:install (default-install) @ org.eclipse.ease.ui.feature ---
23:41:09 [2022-05-21T03:41:09.815Z] [INFO] Installing /home/jenkins/agent/workspace/ease.verify.core.target.2018-12/features/org.eclipse.ease.ui.feature/target/org.eclipse.ease.ui.feature-0.9.0-SNAPSHOT.jar to /home/jenkins/.m2/repository/org/eclipse/ease/org.eclipse.ease.ui.feature/0.9.0-SNAPSHOT/org.eclipse.ease.ui.feature-0.9.0-SNAPSHOT.jar
23:41:09 [2022-05-21T03:41:09.815Z] [INFO] Installing /home/jenkins/agent/workspace/ease.verify.core.target.2018-12/features/org.eclipse.ease.ui.feature/pom.xml to /home/jenkins/.m2/repository/org/eclipse/ease/org.eclipse.ease.ui.feature/0.9.0-SNAPSHOT/org.eclipse.ease.ui.feature-0.9.0-SNAPSHOT.pom
23:41:09 [2022-05-21T03:41:09.815Z] [INFO] Installing /home/jenkins/agent/workspace/ease.verify.core.target.2018-12/features/org.eclipse.ease.ui.feature/target/p2content.xml to /home/jenkins/.m2/repository/org/eclipse/ease/org.eclipse.ease.ui.feature/0.9.0-SNAPSHOT/org.eclipse.ease.ui.feature-0.9.0-SNAPSHOT-p2metadata.xml
23:41:09 [2022-05-21T03:41:09.815Z] [INFO] Installing /home/jenkins/agent/workspace/ease.verify.core.target.2018-12/features/org.eclipse.ease.ui.feature/target/p2artifacts.xml to /home/jenkins/.m2/repository/org/eclipse/ease/org.eclipse.ease.ui.feature/0.9.0-SNAPSHOT/org.eclipse.ease.ui.feature-0.9.0-SNAPSHOT-p2artifacts.xml
23:41:09 [2022-05-21T03:41:09.815Z] [INFO] Installing /home/jenkins/agent/workspace/ease.verify.core.target.2018-12/features/org.eclipse.ease.ui.feature/target/org.eclipse.ease.ui.feature-0.9.0-SNAPSHOT-sources-feature.jar to /home/jenkins/.m2/repository/org/eclipse/ease/org.eclipse.ease.ui.feature/0.9.0-SNAPSHOT/org.eclipse.ease.ui.feature-0.9.0-SNAPSHOT-sources-feature.jar
23:41:09 [2022-05-21T03:41:09.815Z] [INFO] 
23:41:09 [2022-05-21T03:41:09.815Z] [INFO] --- tycho-p2-plugin:2.2.0:update-local-index (default-update-local-index) @ org.eclipse.ease.ui.feature ---
23:41:09 [2022-05-21T03:41:09.815Z] [INFO] 
23:41:09 [2022-05-21T03:41:09.815Z] [INFO] -----< org.eclipse.ease:org.eclipse.ease.lang.javascript.feature >------
23:41:09 [2022-05-21T03:41:09.815Z] [INFO] Building org.eclipse.ease.lang.javascript.feature 0.9.0-SNAPSHOT [26/49]
23:41:09 [2022-05-21T03:41:09.815Z] [INFO] --------------------------[ eclipse-feature ]---------------------------
23:41:09 [2022-05-21T03:41:09.815Z] [INFO] 
23:41:09 [2022-05-21T03:41:09.815Z] [INFO] --- maven-clean-plugin:2.5:clean (default-clean) @ org.eclipse.ease.lang.javascript.feature ---
23:41:09 [2022-05-21T03:41:09.815Z] [INFO] Deleting /home/jenkins/agent/workspace/ease.verify.core.target.2018-12/features/org.eclipse.ease.lang.javascript.feature/target
23:41:09 [2022-05-21T03:41:09.815Z] [INFO] 
23:41:09 [2022-05-21T03:41:09.815Z] [INFO] --- tycho-packaging-plugin:2.2.0:build-qualifier-aggregator (default-build-qualifier-aggregator) @ org.eclipse.ease.lang.javascript.feature ---
23:41:09 [2022-05-21T03:41:09.815Z] [INFO] The project's OSGi version is 0.9.0.I202204261218
23:41:09 [2022-05-21T03:41:09.815Z] [INFO] 
23:41:09 [2022-05-21T03:41:09.815Z] [INFO] --- tycho-packaging-plugin:2.2.0:validate-id (default-validate-id) @ org.eclipse.ease.lang.javascript.feature ---
23:41:09 [2022-05-21T03:41:09.815Z] [INFO] 
23:41:09 [2022-05-21T03:41:09.815Z] [INFO] --- tycho-packaging-plugin:2.2.0:validate-version (default-validate-version) @ org.eclipse.ease.lang.javascript.feature ---
23:41:09 [2022-05-21T03:41:09.816Z] [INFO] 
23:41:09 [2022-05-21T03:41:09.816Z] [INFO] --- target-platform-configuration:2.2.0:target-platform (default-target-platform) @ org.eclipse.ease.lang.javascript.feature ---
23:41:09 [2022-05-21T03:41:09.816Z] [INFO] 
23:41:09 [2022-05-21T03:41:09.816Z] [INFO] --- tycho-packaging-plugin:2.2.0:package-feature (default-package-feature) @ org.eclipse.ease.lang.javascript.feature ---
23:41:09 [2022-05-21T03:41:09.816Z] [INFO] Building jar: /home/jenkins/agent/workspace/ease.verify.core.target.2018-12/features/org.eclipse.ease.lang.javascript.feature/target/org.eclipse.ease.lang.javascript.feature-0.9.0-SNAPSHOT.jar
23:41:09 [2022-05-21T03:41:09.816Z] [INFO] 
23:41:09 [2022-05-21T03:41:09.816Z] [INFO] --- tycho-p2-plugin:2.2.0:p2-metadata-default (default-p2-metadata-default) @ org.eclipse.ease.lang.javascript.feature ---
23:41:09 [2022-05-21T03:41:09.816Z] [INFO] 
23:41:09 [2022-05-21T03:41:09.816Z] [INFO] --- tycho-p2-plugin:2.2.0:feature-p2-metadata (default-feature-p2-metadata) @ org.eclipse.ease.lang.javascript.feature ---
23:41:09 [2022-05-21T03:41:09.816Z] [INFO] 
23:41:09 [2022-05-21T03:41:09.816Z] [INFO] --- tycho-source-feature-plugin:2.2.0:source-feature (source-feature) @ org.eclipse.ease.lang.javascript.feature ---
23:41:09 [2022-05-21T03:41:09.816Z] [WARNING] Mojo tycho-source-feature-plugin:source-feature is replaced by the tycho-source-plugin:feature-source which offers equivalent and even enhanced functionality
23:41:09 [2022-05-21T03:41:09.816Z] [INFO] Building jar: /home/jenkins/agent/workspace/ease.verify.core.target.2018-12/features/org.eclipse.ease.lang.javascript.feature/target/org.eclipse.ease.lang.javascript.feature-0.9.0-SNAPSHOT-sources-feature.jar
23:41:09 [2022-05-21T03:41:09.816Z] [INFO] 
23:41:09 [2022-05-21T03:41:09.816Z] [INFO] --- tycho-p2-plugin:2.2.0:p2-metadata (attached-p2-metadata) @ org.eclipse.ease.lang.javascript.feature ---
23:41:09 [2022-05-21T03:41:09.816Z] [WARNING] artifact org.eclipse.ease:org.eclipse.ease.lang.javascript.feature:xml:p2metadata:0.9.0-SNAPSHOT already attached, replace previous instance
23:41:09 [2022-05-21T03:41:09.816Z] [WARNING] artifact org.eclipse.ease:org.eclipse.ease.lang.javascript.feature:xml:p2artifacts:0.9.0-SNAPSHOT already attached, replace previous instance
23:41:09 [2022-05-21T03:41:09.816Z] [INFO] 
23:41:09 [2022-05-21T03:41:09.816Z] [INFO] --- maven-install-plugin:2.3.1:install (default-install) @ org.eclipse.ease.lang.javascript.feature ---
23:41:09 [2022-05-21T03:41:09.816Z] [INFO] Installing /home/jenkins/agent/workspace/ease.verify.core.target.2018-12/features/org.eclipse.ease.lang.javascript.feature/target/org.eclipse.ease.lang.javascript.feature-0.9.0-SNAPSHOT.jar to /home/jenkins/.m2/repository/org/eclipse/ease/org.eclipse.ease.lang.javascript.feature/0.9.0-SNAPSHOT/org.eclipse.ease.lang.javascript.feature-0.9.0-SNAPSHOT.jar
23:41:09 [2022-05-21T03:41:09.816Z] [INFO] Installing /home/jenkins/agent/workspace/ease.verify.core.target.2018-12/features/org.eclipse.ease.lang.javascript.feature/pom.xml to /home/jenkins/.m2/repository/org/eclipse/ease/org.eclipse.ease.lang.javascript.feature/0.9.0-SNAPSHOT/org.eclipse.ease.lang.javascript.feature-0.9.0-SNAPSHOT.pom
23:41:09 [2022-05-21T03:41:09.816Z] [INFO] Installing /home/jenkins/agent/workspace/ease.verify.core.target.2018-12/features/org.eclipse.ease.lang.javascript.feature/target/p2content.xml to /home/jenkins/.m2/repository/org/eclipse/ease/org.eclipse.ease.lang.javascript.feature/0.9.0-SNAPSHOT/org.eclipse.ease.lang.javascript.feature-0.9.0-SNAPSHOT-p2metadata.xml
23:41:09 [2022-05-21T03:41:09.817Z] [INFO] Installing /home/jenkins/agent/workspace/ease.verify.core.target.2018-12/features/org.eclipse.ease.lang.javascript.feature/target/p2artifacts.xml to /home/jenkins/.m2/repository/org/eclipse/ease/org.eclipse.ease.lang.javascript.feature/0.9.0-SNAPSHOT/org.eclipse.ease.lang.javascript.feature-0.9.0-SNAPSHOT-p2artifacts.xml
23:41:09 [2022-05-21T03:41:09.817Z] [INFO] Installing /home/jenkins/agent/workspace/ease.verify.core.target.2018-12/features/org.eclipse.ease.lang.javascript.feature/target/org.eclipse.ease.lang.javascript.feature-0.9.0-SNAPSHOT-sources-feature.jar to /home/jenkins/.m2/repository/org/eclipse/ease/org.eclipse.ease.lang.javascript.feature/0.9.0-SNAPSHOT/org.eclipse.ease.lang.javascript.feature-0.9.0-SNAPSHOT-sources-feature.jar
23:41:09 [2022-05-21T03:41:09.817Z] [INFO] 
23:41:09 [2022-05-21T03:41:09.817Z] [INFO] --- tycho-p2-plugin:2.2.0:update-local-index (default-update-local-index) @ org.eclipse.ease.lang.javascript.feature ---
23:41:09 [2022-05-21T03:41:09.817Z] [INFO] 
23:41:09 [2022-05-21T03:41:09.817Z] [INFO] -------< org.eclipse.ease:org.eclipse.ease.lang.python.feature >--------
23:41:09 [2022-05-21T03:41:09.817Z] [INFO] Building org.eclipse.ease.lang.python.feature 0.9.0-SNAPSHOT     [27/49]
23:41:09 [2022-05-21T03:41:09.817Z] [INFO] --------------------------[ eclipse-feature ]---------------------------
23:41:09 [2022-05-21T03:41:09.817Z] [INFO] 
23:41:09 [2022-05-21T03:41:09.817Z] [INFO] --- maven-clean-plugin:2.5:clean (default-clean) @ org.eclipse.ease.lang.python.feature ---
23:41:09 [2022-05-21T03:41:09.817Z] [INFO] Deleting /home/jenkins/agent/workspace/ease.verify.core.target.2018-12/features/org.eclipse.ease.lang.python.feature/target
23:41:09 [2022-05-21T03:41:09.817Z] [INFO] 
23:41:09 [2022-05-21T03:41:09.817Z] [INFO] --- tycho-packaging-plugin:2.2.0:build-qualifier-aggregator (default-build-qualifier-aggregator) @ org.eclipse.ease.lang.python.feature ---
23:41:09 [2022-05-21T03:41:09.817Z] [INFO] The project's OSGi version is 0.9.0.I202204261218
23:41:09 [2022-05-21T03:41:09.817Z] [INFO] 
23:41:09 [2022-05-21T03:41:09.817Z] [INFO] --- tycho-packaging-plugin:2.2.0:validate-id (default-validate-id) @ org.eclipse.ease.lang.python.feature ---
23:41:09 [2022-05-21T03:41:09.817Z] [INFO] 
23:41:09 [2022-05-21T03:41:09.817Z] [INFO] --- tycho-packaging-plugin:2.2.0:validate-version (default-validate-version) @ org.eclipse.ease.lang.python.feature ---
23:41:09 [2022-05-21T03:41:09.817Z] [INFO] 
23:41:09 [2022-05-21T03:41:09.817Z] [INFO] --- target-platform-configuration:2.2.0:target-platform (default-target-platform) @ org.eclipse.ease.lang.python.feature ---
23:41:09 [2022-05-21T03:41:09.817Z] [INFO] 
23:41:09 [2022-05-21T03:41:09.817Z] [INFO] --- tycho-packaging-plugin:2.2.0:package-feature (default-package-feature) @ org.eclipse.ease.lang.python.feature ---
23:41:09 [2022-05-21T03:41:09.817Z] [INFO] Building jar: /home/jenkins/agent/workspace/ease.verify.core.target.2018-12/features/org.eclipse.ease.lang.python.feature/target/org.eclipse.ease.lang.python.feature-0.9.0-SNAPSHOT.jar
23:41:09 [2022-05-21T03:41:09.817Z] [INFO] 
23:41:09 [2022-05-21T03:41:09.817Z] [INFO] --- tycho-p2-plugin:2.2.0:p2-metadata-default (default-p2-metadata-default) @ org.eclipse.ease.lang.python.feature ---
23:41:09 [2022-05-21T03:41:09.817Z] [INFO] 
23:41:09 [2022-05-21T03:41:09.817Z] [INFO] --- tycho-p2-plugin:2.2.0:feature-p2-metadata (default-feature-p2-metadata) @ org.eclipse.ease.lang.python.feature ---
23:41:09 [2022-05-21T03:41:09.817Z] [INFO] 
23:41:09 [2022-05-21T03:41:09.817Z] [INFO] --- tycho-source-feature-plugin:2.2.0:source-feature (source-feature) @ org.eclipse.ease.lang.python.feature ---
23:41:09 [2022-05-21T03:41:09.817Z] [WARNING] Mojo tycho-source-feature-plugin:source-feature is replaced by the tycho-source-plugin:feature-source which offers equivalent and even enhanced functionality
23:41:09 [2022-05-21T03:41:09.818Z] [INFO] Building jar: /home/jenkins/agent/workspace/ease.verify.core.target.2018-12/features/org.eclipse.ease.lang.python.feature/target/org.eclipse.ease.lang.python.feature-0.9.0-SNAPSHOT-sources-feature.jar
23:41:09 [2022-05-21T03:41:09.818Z] [INFO] 
23:41:09 [2022-05-21T03:41:09.818Z] [INFO] --- tycho-p2-plugin:2.2.0:p2-metadata (attached-p2-metadata) @ org.eclipse.ease.lang.python.feature ---
23:41:09 [2022-05-21T03:41:09.818Z] [WARNING] artifact org.eclipse.ease:org.eclipse.ease.lang.python.feature:xml:p2metadata:0.9.0-SNAPSHOT already attached, replace previous instance
23:41:09 [2022-05-21T03:41:09.818Z] [WARNING] artifact org.eclipse.ease:org.eclipse.ease.lang.python.feature:xml:p2artifacts:0.9.0-SNAPSHOT already attached, replace previous instance
23:41:09 [2022-05-21T03:41:09.818Z] [INFO] 
23:41:09 [2022-05-21T03:41:09.818Z] [INFO] --- maven-install-plugin:2.3.1:install (default-install) @ org.eclipse.ease.lang.python.feature ---
23:41:09 [2022-05-21T03:41:09.818Z] [INFO] Installing /home/jenkins/agent/workspace/ease.verify.core.target.2018-12/features/org.eclipse.ease.lang.python.feature/target/org.eclipse.ease.lang.python.feature-0.9.0-SNAPSHOT.jar to /home/jenkins/.m2/repository/org/eclipse/ease/org.eclipse.ease.lang.python.feature/0.9.0-SNAPSHOT/org.eclipse.ease.lang.python.feature-0.9.0-SNAPSHOT.jar
23:41:09 [2022-05-21T03:41:09.818Z] [INFO] Installing /home/jenkins/agent/workspace/ease.verify.core.target.2018-12/features/org.eclipse.ease.lang.python.feature/pom.xml to /home/jenkins/.m2/repository/org/eclipse/ease/org.eclipse.ease.lang.python.feature/0.9.0-SNAPSHOT/org.eclipse.ease.lang.python.feature-0.9.0-SNAPSHOT.pom
23:41:09 [2022-05-21T03:41:09.818Z] [INFO] Installing /home/jenkins/agent/workspace/ease.verify.core.target.2018-12/features/org.eclipse.ease.lang.python.feature/target/p2content.xml to /home/jenkins/.m2/repository/org/eclipse/ease/org.eclipse.ease.lang.python.feature/0.9.0-SNAPSHOT/org.eclipse.ease.lang.python.feature-0.9.0-SNAPSHOT-p2metadata.xml
23:41:09 [2022-05-21T03:41:09.818Z] [INFO] Installing /home/jenkins/agent/workspace/ease.verify.core.target.2018-12/features/org.eclipse.ease.lang.python.feature/target/p2artifacts.xml to /home/jenkins/.m2/repository/org/eclipse/ease/org.eclipse.ease.lang.python.feature/0.9.0-SNAPSHOT/org.eclipse.ease.lang.python.feature-0.9.0-SNAPSHOT-p2artifacts.xml
23:41:09 [2022-05-21T03:41:09.818Z] [INFO] Installing /home/jenkins/agent/workspace/ease.verify.core.target.2018-12/features/org.eclipse.ease.lang.python.feature/target/org.eclipse.ease.lang.python.feature-0.9.0-SNAPSHOT-sources-feature.jar to /home/jenkins/.m2/repository/org/eclipse/ease/org.eclipse.ease.lang.python.feature/0.9.0-SNAPSHOT/org.eclipse.ease.lang.python.feature-0.9.0-SNAPSHOT-sources-feature.jar
23:41:09 [2022-05-21T03:41:09.818Z] [INFO] 
23:41:09 [2022-05-21T03:41:09.818Z] [INFO] --- tycho-p2-plugin:2.2.0:update-local-index (default-update-local-index) @ org.eclipse.ease.lang.python.feature ---
23:41:09 [2022-05-21T03:41:09.818Z] [INFO] 
23:41:09 [2022-05-21T03:41:09.818Z] [INFO] ------< org.eclipse.ease:org.eclipse.ease.python.jython.feature >-------
23:41:09 [2022-05-21T03:41:09.818Z] [INFO] Building org.eclipse.ease.python.jython.feature 0.9.0-SNAPSHOT   [28/49]
23:41:09 [2022-05-21T03:41:09.818Z] [INFO] --------------------------[ eclipse-feature ]---------------------------
23:41:09 [2022-05-21T03:41:09.818Z] [INFO] 
23:41:09 [2022-05-21T03:41:09.818Z] [INFO] --- maven-clean-plugin:2.5:clean (default-clean) @ org.eclipse.ease.python.jython.feature ---
23:41:09 [2022-05-21T03:41:09.818Z] [INFO] Deleting /home/jenkins/agent/workspace/ease.verify.core.target.2018-12/features/org.eclipse.ease.lang.python.jython.feature/target
23:41:09 [2022-05-21T03:41:09.818Z] [INFO] 
23:41:09 [2022-05-21T03:41:09.818Z] [INFO] --- tycho-packaging-plugin:2.2.0:build-qualifier-aggregator (default-build-qualifier-aggregator) @ org.eclipse.ease.python.jython.feature ---
23:41:09 [2022-05-21T03:41:09.818Z] [INFO] The project's OSGi version is 0.9.0.I202112011324
23:41:09 [2022-05-21T03:41:09.818Z] [INFO] 
23:41:09 [2022-05-21T03:41:09.819Z] [INFO] --- tycho-packaging-plugin:2.2.0:validate-id (default-validate-id) @ org.eclipse.ease.python.jython.feature ---
23:41:09 [2022-05-21T03:41:09.819Z] [INFO] 
23:41:09 [2022-05-21T03:41:09.819Z] [INFO] --- tycho-packaging-plugin:2.2.0:validate-version (default-validate-version) @ org.eclipse.ease.python.jython.feature ---
23:41:09 [2022-05-21T03:41:09.819Z] [INFO] 
23:41:09 [2022-05-21T03:41:09.819Z] [INFO] --- target-platform-configuration:2.2.0:target-platform (default-target-platform) @ org.eclipse.ease.python.jython.feature ---
23:41:09 [2022-05-21T03:41:09.819Z] [INFO] 
23:41:09 [2022-05-21T03:41:09.819Z] [INFO] --- tycho-packaging-plugin:2.2.0:package-feature (default-package-feature) @ org.eclipse.ease.python.jython.feature ---
23:41:09 [2022-05-21T03:41:09.819Z] [INFO] Building jar: /home/jenkins/agent/workspace/ease.verify.core.target.2018-12/features/org.eclipse.ease.lang.python.jython.feature/target/org.eclipse.ease.python.jython.feature-0.9.0-SNAPSHOT.jar
23:41:09 [2022-05-21T03:41:09.819Z] [INFO] 
23:41:09 [2022-05-21T03:41:09.819Z] [INFO] --- tycho-p2-plugin:2.2.0:p2-metadata-default (default-p2-metadata-default) @ org.eclipse.ease.python.jython.feature ---
23:41:09 [2022-05-21T03:41:09.819Z] [INFO] 
23:41:09 [2022-05-21T03:41:09.819Z] [INFO] --- tycho-p2-plugin:2.2.0:feature-p2-metadata (default-feature-p2-metadata) @ org.eclipse.ease.python.jython.feature ---
23:41:09 [2022-05-21T03:41:09.819Z] [INFO] 
23:41:09 [2022-05-21T03:41:09.819Z] [INFO] --- tycho-source-feature-plugin:2.2.0:source-feature (source-feature) @ org.eclipse.ease.python.jython.feature ---
23:41:09 [2022-05-21T03:41:09.819Z] [WARNING] Mojo tycho-source-feature-plugin:source-feature is replaced by the tycho-source-plugin:feature-source which offers equivalent and even enhanced functionality
23:41:09 [2022-05-21T03:41:09.819Z] [INFO] Building jar: /home/jenkins/agent/workspace/ease.verify.core.target.2018-12/features/org.eclipse.ease.lang.python.jython.feature/target/org.eclipse.ease.python.jython.feature-0.9.0-SNAPSHOT-sources-feature.jar
23:41:10 [2022-05-21T03:41:10.089Z] [INFO] 
23:41:10 [2022-05-21T03:41:10.089Z] [INFO] --- tycho-p2-plugin:2.2.0:p2-metadata (attached-p2-metadata) @ org.eclipse.ease.python.jython.feature ---
23:41:10 [2022-05-21T03:41:10.089Z] [WARNING] artifact org.eclipse.ease:org.eclipse.ease.python.jython.feature:xml:p2metadata:0.9.0-SNAPSHOT already attached, replace previous instance
23:41:10 [2022-05-21T03:41:10.089Z] [WARNING] artifact org.eclipse.ease:org.eclipse.ease.python.jython.feature:xml:p2artifacts:0.9.0-SNAPSHOT already attached, replace previous instance
23:41:10 [2022-05-21T03:41:10.089Z] [INFO] 
23:41:10 [2022-05-21T03:41:10.089Z] [INFO] --- maven-install-plugin:2.3.1:install (default-install) @ org.eclipse.ease.python.jython.feature ---
23:41:10 [2022-05-21T03:41:10.089Z] [INFO] Installing /home/jenkins/agent/workspace/ease.verify.core.target.2018-12/features/org.eclipse.ease.lang.python.jython.feature/target/org.eclipse.ease.python.jython.feature-0.9.0-SNAPSHOT.jar to /home/jenkins/.m2/repository/org/eclipse/ease/org.eclipse.ease.python.jython.feature/0.9.0-SNAPSHOT/org.eclipse.ease.python.jython.feature-0.9.0-SNAPSHOT.jar
23:41:10 [2022-05-21T03:41:10.089Z] [INFO] Installing /home/jenkins/agent/workspace/ease.verify.core.target.2018-12/features/org.eclipse.ease.lang.python.jython.feature/pom.xml to /home/jenkins/.m2/repository/org/eclipse/ease/org.eclipse.ease.python.jython.feature/0.9.0-SNAPSHOT/org.eclipse.ease.python.jython.feature-0.9.0-SNAPSHOT.pom
23:41:10 [2022-05-21T03:41:10.089Z] [INFO] Installing /home/jenkins/agent/workspace/ease.verify.core.target.2018-12/features/org.eclipse.ease.lang.python.jython.feature/target/p2content.xml to /home/jenkins/.m2/repository/org/eclipse/ease/org.eclipse.ease.python.jython.feature/0.9.0-SNAPSHOT/org.eclipse.ease.python.jython.feature-0.9.0-SNAPSHOT-p2metadata.xml
23:41:10 [2022-05-21T03:41:10.089Z] [INFO] Installing /home/jenkins/agent/workspace/ease.verify.core.target.2018-12/features/org.eclipse.ease.lang.python.jython.feature/target/p2artifacts.xml to /home/jenkins/.m2/repository/org/eclipse/ease/org.eclipse.ease.python.jython.feature/0.9.0-SNAPSHOT/org.eclipse.ease.python.jython.feature-0.9.0-SNAPSHOT-p2artifacts.xml
23:41:10 [2022-05-21T03:41:10.089Z] [INFO] Installing /home/jenkins/agent/workspace/ease.verify.core.target.2018-12/features/org.eclipse.ease.lang.python.jython.feature/target/org.eclipse.ease.python.jython.feature-0.9.0-SNAPSHOT-sources-feature.jar to /home/jenkins/.m2/repository/org/eclipse/ease/org.eclipse.ease.python.jython.feature/0.9.0-SNAPSHOT/org.eclipse.ease.python.jython.feature-0.9.0-SNAPSHOT-sources-feature.jar
23:41:10 [2022-05-21T03:41:10.089Z] [INFO] 
23:41:10 [2022-05-21T03:41:10.089Z] [INFO] --- tycho-p2-plugin:2.2.0:update-local-index (default-update-local-index) @ org.eclipse.ease.python.jython.feature ---
23:41:10 [2022-05-21T03:41:10.089Z] [INFO] 
23:41:10 [2022-05-21T03:41:10.090Z] [INFO] -----< org.eclipse.ease:org.eclipse.ease.lang.python.py4j.feature >-----
23:41:10 [2022-05-21T03:41:10.090Z] [INFO] Building org.eclipse.ease.lang.python.py4j.feature 0.9.0-SNAPSHOT [29/49]
23:41:10 [2022-05-21T03:41:10.090Z] [INFO] --------------------------[ eclipse-feature ]---------------------------
23:41:10 [2022-05-21T03:41:10.090Z] [INFO] 
23:41:10 [2022-05-21T03:41:10.090Z] [INFO] --- maven-clean-plugin:2.5:clean (default-clean) @ org.eclipse.ease.lang.python.py4j.feature ---
23:41:10 [2022-05-21T03:41:10.090Z] [INFO] Deleting /home/jenkins/agent/workspace/ease.verify.core.target.2018-12/features/org.eclipse.ease.lang.python.py4j.feature/target
23:41:10 [2022-05-21T03:41:10.090Z] [INFO] 
23:41:10 [2022-05-21T03:41:10.090Z] [INFO] --- tycho-packaging-plugin:2.2.0:build-qualifier-aggregator (default-build-qualifier-aggregator) @ org.eclipse.ease.lang.python.py4j.feature ---
23:41:10 [2022-05-21T03:41:10.090Z] [INFO] The project's OSGi version is 0.9.0.I202201181916
23:41:10 [2022-05-21T03:41:10.090Z] [INFO] 
23:41:10 [2022-05-21T03:41:10.090Z] [INFO] --- tycho-packaging-plugin:2.2.0:validate-id (default-validate-id) @ org.eclipse.ease.lang.python.py4j.feature ---
23:41:10 [2022-05-21T03:41:10.090Z] [INFO] 
23:41:10 [2022-05-21T03:41:10.090Z] [INFO] --- tycho-packaging-plugin:2.2.0:validate-version (default-validate-version) @ org.eclipse.ease.lang.python.py4j.feature ---
23:41:10 [2022-05-21T03:41:10.090Z] [INFO] 
23:41:10 [2022-05-21T03:41:10.090Z] [INFO] --- target-platform-configuration:2.2.0:target-platform (default-target-platform) @ org.eclipse.ease.lang.python.py4j.feature ---
23:41:10 [2022-05-21T03:41:10.090Z] [INFO] 
23:41:10 [2022-05-21T03:41:10.090Z] [INFO] --- tycho-packaging-plugin:2.2.0:package-feature (default-package-feature) @ org.eclipse.ease.lang.python.py4j.feature ---
23:41:10 [2022-05-21T03:41:10.090Z] [INFO] Building jar: /home/jenkins/agent/workspace/ease.verify.core.target.2018-12/features/org.eclipse.ease.lang.python.py4j.feature/target/org.eclipse.ease.lang.python.py4j.feature-0.9.0-SNAPSHOT.jar
23:41:10 [2022-05-21T03:41:10.090Z] [INFO] 
23:41:10 [2022-05-21T03:41:10.090Z] [INFO] --- tycho-p2-plugin:2.2.0:p2-metadata-default (default-p2-metadata-default) @ org.eclipse.ease.lang.python.py4j.feature ---
23:41:10 [2022-05-21T03:41:10.090Z] [INFO] 
23:41:10 [2022-05-21T03:41:10.090Z] [INFO] --- tycho-p2-plugin:2.2.0:feature-p2-metadata (default-feature-p2-metadata) @ org.eclipse.ease.lang.python.py4j.feature ---
23:41:10 [2022-05-21T03:41:10.090Z] [INFO] 
23:41:10 [2022-05-21T03:41:10.090Z] [INFO] --- tycho-source-feature-plugin:2.2.0:source-feature (source-feature) @ org.eclipse.ease.lang.python.py4j.feature ---
23:41:10 [2022-05-21T03:41:10.090Z] [WARNING] Mojo tycho-source-feature-plugin:source-feature is replaced by the tycho-source-plugin:feature-source which offers equivalent and even enhanced functionality
23:41:10 [2022-05-21T03:41:10.090Z] [INFO] Building jar: /home/jenkins/agent/workspace/ease.verify.core.target.2018-12/features/org.eclipse.ease.lang.python.py4j.feature/target/org.eclipse.ease.lang.python.py4j.feature-0.9.0-SNAPSHOT-sources-feature.jar
23:41:10 [2022-05-21T03:41:10.090Z] [INFO] 
23:41:10 [2022-05-21T03:41:10.090Z] [INFO] --- tycho-p2-plugin:2.2.0:p2-metadata (attached-p2-metadata) @ org.eclipse.ease.lang.python.py4j.feature ---
23:41:10 [2022-05-21T03:41:10.090Z] [WARNING] artifact org.eclipse.ease:org.eclipse.ease.lang.python.py4j.feature:xml:p2metadata:0.9.0-SNAPSHOT already attached, replace previous instance
23:41:10 [2022-05-21T03:41:10.091Z] [WARNING] artifact org.eclipse.ease:org.eclipse.ease.lang.python.py4j.feature:xml:p2artifacts:0.9.0-SNAPSHOT already attached, replace previous instance
23:41:10 [2022-05-21T03:41:10.091Z] [INFO] 
23:41:10 [2022-05-21T03:41:10.091Z] [INFO] --- maven-install-plugin:2.3.1:install (default-install) @ org.eclipse.ease.lang.python.py4j.feature ---
23:41:10 [2022-05-21T03:41:10.091Z] [INFO] Installing /home/jenkins/agent/workspace/ease.verify.core.target.2018-12/features/org.eclipse.ease.lang.python.py4j.feature/target/org.eclipse.ease.lang.python.py4j.feature-0.9.0-SNAPSHOT.jar to /home/jenkins/.m2/repository/org/eclipse/ease/org.eclipse.ease.lang.python.py4j.feature/0.9.0-SNAPSHOT/org.eclipse.ease.lang.python.py4j.feature-0.9.0-SNAPSHOT.jar
23:41:10 [2022-05-21T03:41:10.091Z] [INFO] Installing /home/jenkins/agent/workspace/ease.verify.core.target.2018-12/features/org.eclipse.ease.lang.python.py4j.feature/pom.xml to /home/jenkins/.m2/repository/org/eclipse/ease/org.eclipse.ease.lang.python.py4j.feature/0.9.0-SNAPSHOT/org.eclipse.ease.lang.python.py4j.feature-0.9.0-SNAPSHOT.pom
23:41:10 [2022-05-21T03:41:10.091Z] [INFO] Installing /home/jenkins/agent/workspace/ease.verify.core.target.2018-12/features/org.eclipse.ease.lang.python.py4j.feature/target/p2content.xml to /home/jenkins/.m2/repository/org/eclipse/ease/org.eclipse.ease.lang.python.py4j.feature/0.9.0-SNAPSHOT/org.eclipse.ease.lang.python.py4j.feature-0.9.0-SNAPSHOT-p2metadata.xml
23:41:10 [2022-05-21T03:41:10.091Z] [INFO] Installing /home/jenkins/agent/workspace/ease.verify.core.target.2018-12/features/org.eclipse.ease.lang.python.py4j.feature/target/p2artifacts.xml to /home/jenkins/.m2/repository/org/eclipse/ease/org.eclipse.ease.lang.python.py4j.feature/0.9.0-SNAPSHOT/org.eclipse.ease.lang.python.py4j.feature-0.9.0-SNAPSHOT-p2artifacts.xml
23:41:10 [2022-05-21T03:41:10.091Z] [INFO] Installing /home/jenkins/agent/workspace/ease.verify.core.target.2018-12/features/org.eclipse.ease.lang.python.py4j.feature/target/org.eclipse.ease.lang.python.py4j.feature-0.9.0-SNAPSHOT-sources-feature.jar to /home/jenkins/.m2/repository/org/eclipse/ease/org.eclipse.ease.lang.python.py4j.feature/0.9.0-SNAPSHOT/org.eclipse.ease.lang.python.py4j.feature-0.9.0-SNAPSHOT-sources-feature.jar
23:41:10 [2022-05-21T03:41:10.091Z] [INFO] 
23:41:10 [2022-05-21T03:41:10.091Z] [INFO] --- tycho-p2-plugin:2.2.0:update-local-index (default-update-local-index) @ org.eclipse.ease.lang.python.py4j.feature ---
23:41:10 [2022-05-21T03:41:10.091Z] [INFO] 
23:41:10 [2022-05-21T03:41:10.091Z] [INFO] ---------< org.eclipse.ease:org.eclipse.ease.lang.jvm.feature >---------
23:41:10 [2022-05-21T03:41:10.091Z] [INFO] Building org.eclipse.ease.lang.jvm.feature 0.9.0-SNAPSHOT        [30/49]
23:41:10 [2022-05-21T03:41:10.091Z] [INFO] --------------------------[ eclipse-feature ]---------------------------
23:41:10 [2022-05-21T03:41:10.091Z] [INFO] 
23:41:10 [2022-05-21T03:41:10.091Z] [INFO] --- maven-clean-plugin:2.5:clean (default-clean) @ org.eclipse.ease.lang.jvm.feature ---
23:41:10 [2022-05-21T03:41:10.091Z] [INFO] Deleting /home/jenkins/agent/workspace/ease.verify.core.target.2018-12/features/org.eclipse.ease.lang.jvm.feature/target
23:41:10 [2022-05-21T03:41:10.091Z] [INFO] 
23:41:10 [2022-05-21T03:41:10.091Z] [INFO] --- tycho-packaging-plugin:2.2.0:build-qualifier-aggregator (default-build-qualifier-aggregator) @ org.eclipse.ease.lang.jvm.feature ---
23:41:10 [2022-05-21T03:41:10.091Z] [INFO] The project's OSGi version is 0.9.0.I202111181115
23:41:10 [2022-05-21T03:41:10.091Z] [INFO] 
23:41:10 [2022-05-21T03:41:10.091Z] [INFO] --- tycho-packaging-plugin:2.2.0:validate-id (default-validate-id) @ org.eclipse.ease.lang.jvm.feature ---
23:41:10 [2022-05-21T03:41:10.091Z] [INFO] 
23:41:10 [2022-05-21T03:41:10.091Z] [INFO] --- tycho-packaging-plugin:2.2.0:validate-version (default-validate-version) @ org.eclipse.ease.lang.jvm.feature ---
23:41:10 [2022-05-21T03:41:10.091Z] [INFO] 
23:41:10 [2022-05-21T03:41:10.091Z] [INFO] --- target-platform-configuration:2.2.0:target-platform (default-target-platform) @ org.eclipse.ease.lang.jvm.feature ---
23:41:10 [2022-05-21T03:41:10.092Z] [INFO] 
23:41:10 [2022-05-21T03:41:10.092Z] [INFO] --- tycho-packaging-plugin:2.2.0:package-feature (default-package-feature) @ org.eclipse.ease.lang.jvm.feature ---
23:41:10 [2022-05-21T03:41:10.092Z] [INFO] Building jar: /home/jenkins/agent/workspace/ease.verify.core.target.2018-12/features/org.eclipse.ease.lang.jvm.feature/target/org.eclipse.ease.lang.jvm.feature-0.9.0-SNAPSHOT.jar
23:41:10 [2022-05-21T03:41:10.092Z] [INFO] 
23:41:10 [2022-05-21T03:41:10.092Z] [INFO] --- tycho-p2-plugin:2.2.0:p2-metadata-default (default-p2-metadata-default) @ org.eclipse.ease.lang.jvm.feature ---
23:41:10 [2022-05-21T03:41:10.092Z] [INFO] 
23:41:10 [2022-05-21T03:41:10.092Z] [INFO] --- tycho-p2-plugin:2.2.0:feature-p2-metadata (default-feature-p2-metadata) @ org.eclipse.ease.lang.jvm.feature ---
23:41:10 [2022-05-21T03:41:10.092Z] [INFO] 
23:41:10 [2022-05-21T03:41:10.092Z] [INFO] --- tycho-source-feature-plugin:2.2.0:source-feature (source-feature) @ org.eclipse.ease.lang.jvm.feature ---
23:41:10 [2022-05-21T03:41:10.092Z] [WARNING] Mojo tycho-source-feature-plugin:source-feature is replaced by the tycho-source-plugin:feature-source which offers equivalent and even enhanced functionality
23:41:10 [2022-05-21T03:41:10.092Z] [INFO] Building jar: /home/jenkins/agent/workspace/ease.verify.core.target.2018-12/features/org.eclipse.ease.lang.jvm.feature/target/org.eclipse.ease.lang.jvm.feature-0.9.0-SNAPSHOT-sources-feature.jar
23:41:10 [2022-05-21T03:41:10.092Z] [INFO] 
23:41:10 [2022-05-21T03:41:10.092Z] [INFO] --- tycho-p2-plugin:2.2.0:p2-metadata (attached-p2-metadata) @ org.eclipse.ease.lang.jvm.feature ---
23:41:10 [2022-05-21T03:41:10.092Z] [WARNING] artifact org.eclipse.ease:org.eclipse.ease.lang.jvm.feature:xml:p2metadata:0.9.0-SNAPSHOT already attached, replace previous instance
23:41:10 [2022-05-21T03:41:10.092Z] [WARNING] artifact org.eclipse.ease:org.eclipse.ease.lang.jvm.feature:xml:p2artifacts:0.9.0-SNAPSHOT already attached, replace previous instance
23:41:10 [2022-05-21T03:41:10.092Z] [INFO] 
23:41:10 [2022-05-21T03:41:10.092Z] [INFO] --- maven-install-plugin:2.3.1:install (default-install) @ org.eclipse.ease.lang.jvm.feature ---
23:41:10 [2022-05-21T03:41:10.092Z] [INFO] Installing /home/jenkins/agent/workspace/ease.verify.core.target.2018-12/features/org.eclipse.ease.lang.jvm.feature/target/org.eclipse.ease.lang.jvm.feature-0.9.0-SNAPSHOT.jar to /home/jenkins/.m2/repository/org/eclipse/ease/org.eclipse.ease.lang.jvm.feature/0.9.0-SNAPSHOT/org.eclipse.ease.lang.jvm.feature-0.9.0-SNAPSHOT.jar
23:41:10 [2022-05-21T03:41:10.092Z] [INFO] Installing /home/jenkins/agent/workspace/ease.verify.core.target.2018-12/features/org.eclipse.ease.lang.jvm.feature/pom.xml to /home/jenkins/.m2/repository/org/eclipse/ease/org.eclipse.ease.lang.jvm.feature/0.9.0-SNAPSHOT/org.eclipse.ease.lang.jvm.feature-0.9.0-SNAPSHOT.pom
23:41:10 [2022-05-21T03:41:10.092Z] [INFO] Installing /home/jenkins/agent/workspace/ease.verify.core.target.2018-12/features/org.eclipse.ease.lang.jvm.feature/target/p2content.xml to /home/jenkins/.m2/repository/org/eclipse/ease/org.eclipse.ease.lang.jvm.feature/0.9.0-SNAPSHOT/org.eclipse.ease.lang.jvm.feature-0.9.0-SNAPSHOT-p2metadata.xml
23:41:10 [2022-05-21T03:41:10.092Z] [INFO] Installing /home/jenkins/agent/workspace/ease.verify.core.target.2018-12/features/org.eclipse.ease.lang.jvm.feature/target/p2artifacts.xml to /home/jenkins/.m2/repository/org/eclipse/ease/org.eclipse.ease.lang.jvm.feature/0.9.0-SNAPSHOT/org.eclipse.ease.lang.jvm.feature-0.9.0-SNAPSHOT-p2artifacts.xml
23:41:10 [2022-05-21T03:41:10.093Z] [INFO] Installing /home/jenkins/agent/workspace/ease.verify.core.target.2018-12/features/org.eclipse.ease.lang.jvm.feature/target/org.eclipse.ease.lang.jvm.feature-0.9.0-SNAPSHOT-sources-feature.jar to /home/jenkins/.m2/repository/org/eclipse/ease/org.eclipse.ease.lang.jvm.feature/0.9.0-SNAPSHOT/org.eclipse.ease.lang.jvm.feature-0.9.0-SNAPSHOT-sources-feature.jar
23:41:10 [2022-05-21T03:41:10.093Z] [INFO] 
23:41:10 [2022-05-21T03:41:10.093Z] [INFO] --- tycho-p2-plugin:2.2.0:update-local-index (default-update-local-index) @ org.eclipse.ease.lang.jvm.feature ---
23:41:10 [2022-05-21T03:41:10.093Z] [INFO] 
23:41:10 [2022-05-21T03:41:10.093Z] [INFO] -------< org.eclipse.ease:org.eclipse.ease.lang.groovy.feature >--------
23:41:10 [2022-05-21T03:41:10.093Z] [INFO] Building org.eclipse.ease.lang.groovy.feature 0.9.0-SNAPSHOT     [31/49]
23:41:10 [2022-05-21T03:41:10.093Z] [INFO] --------------------------[ eclipse-feature ]---------------------------
23:41:10 [2022-05-21T03:41:10.093Z] [INFO] 
23:41:10 [2022-05-21T03:41:10.093Z] [INFO] --- maven-clean-plugin:2.5:clean (default-clean) @ org.eclipse.ease.lang.groovy.feature ---
23:41:10 [2022-05-21T03:41:10.093Z] [INFO] Deleting /home/jenkins/agent/workspace/ease.verify.core.target.2018-12/features/org.eclipse.ease.lang.groovy.feature/target
23:41:10 [2022-05-21T03:41:10.093Z] [INFO] 
23:41:10 [2022-05-21T03:41:10.093Z] [INFO] --- tycho-packaging-plugin:2.2.0:build-qualifier-aggregator (default-build-qualifier-aggregator) @ org.eclipse.ease.lang.groovy.feature ---
23:41:10 [2022-05-21T03:41:10.093Z] [INFO] The project's OSGi version is 0.9.0.I202111181115
23:41:10 [2022-05-21T03:41:10.093Z] [INFO] 
23:41:10 [2022-05-21T03:41:10.093Z] [INFO] --- tycho-packaging-plugin:2.2.0:validate-id (default-validate-id) @ org.eclipse.ease.lang.groovy.feature ---
23:41:10 [2022-05-21T03:41:10.093Z] [INFO] 
23:41:10 [2022-05-21T03:41:10.093Z] [INFO] --- tycho-packaging-plugin:2.2.0:validate-version (default-validate-version) @ org.eclipse.ease.lang.groovy.feature ---
23:41:10 [2022-05-21T03:41:10.093Z] [INFO] 
23:41:10 [2022-05-21T03:41:10.093Z] [INFO] --- target-platform-configuration:2.2.0:target-platform (default-target-platform) @ org.eclipse.ease.lang.groovy.feature ---
23:41:10 [2022-05-21T03:41:10.093Z] [INFO] 
23:41:10 [2022-05-21T03:41:10.093Z] [INFO] --- tycho-packaging-plugin:2.2.0:package-feature (default-package-feature) @ org.eclipse.ease.lang.groovy.feature ---
23:41:10 [2022-05-21T03:41:10.093Z] [INFO] Building jar: /home/jenkins/agent/workspace/ease.verify.core.target.2018-12/features/org.eclipse.ease.lang.groovy.feature/target/org.eclipse.ease.lang.groovy.feature-0.9.0-SNAPSHOT.jar
23:41:10 [2022-05-21T03:41:10.093Z] [INFO] 
23:41:10 [2022-05-21T03:41:10.093Z] [INFO] --- tycho-p2-plugin:2.2.0:p2-metadata-default (default-p2-metadata-default) @ org.eclipse.ease.lang.groovy.feature ---
23:41:10 [2022-05-21T03:41:10.094Z] [INFO] 
23:41:10 [2022-05-21T03:41:10.094Z] [INFO] --- tycho-p2-plugin:2.2.0:feature-p2-metadata (default-feature-p2-metadata) @ org.eclipse.ease.lang.groovy.feature ---
23:41:10 [2022-05-21T03:41:10.094Z] [INFO] 
23:41:10 [2022-05-21T03:41:10.094Z] [INFO] --- tycho-source-feature-plugin:2.2.0:source-feature (source-feature) @ org.eclipse.ease.lang.groovy.feature ---
23:41:10 [2022-05-21T03:41:10.094Z] [WARNING] Mojo tycho-source-feature-plugin:source-feature is replaced by the tycho-source-plugin:feature-source which offers equivalent and even enhanced functionality
23:41:10 [2022-05-21T03:41:10.094Z] [INFO] Building jar: /home/jenkins/agent/workspace/ease.verify.core.target.2018-12/features/org.eclipse.ease.lang.groovy.feature/target/org.eclipse.ease.lang.groovy.feature-0.9.0-SNAPSHOT-sources-feature.jar
23:41:10 [2022-05-21T03:41:10.094Z] [INFO] 
23:41:10 [2022-05-21T03:41:10.094Z] [INFO] --- tycho-p2-plugin:2.2.0:p2-metadata (attached-p2-metadata) @ org.eclipse.ease.lang.groovy.feature ---
23:41:10 [2022-05-21T03:41:10.094Z] [WARNING] artifact org.eclipse.ease:org.eclipse.ease.lang.groovy.feature:xml:p2metadata:0.9.0-SNAPSHOT already attached, replace previous instance
23:41:10 [2022-05-21T03:41:10.094Z] [WARNING] artifact org.eclipse.ease:org.eclipse.ease.lang.groovy.feature:xml:p2artifacts:0.9.0-SNAPSHOT already attached, replace previous instance
23:41:10 [2022-05-21T03:41:10.094Z] [INFO] 
23:41:10 [2022-05-21T03:41:10.094Z] [INFO] --- maven-install-plugin:2.3.1:install (default-install) @ org.eclipse.ease.lang.groovy.feature ---
23:41:10 [2022-05-21T03:41:10.094Z] [INFO] Installing /home/jenkins/agent/workspace/ease.verify.core.target.2018-12/features/org.eclipse.ease.lang.groovy.feature/target/org.eclipse.ease.lang.groovy.feature-0.9.0-SNAPSHOT.jar to /home/jenkins/.m2/repository/org/eclipse/ease/org.eclipse.ease.lang.groovy.feature/0.9.0-SNAPSHOT/org.eclipse.ease.lang.groovy.feature-0.9.0-SNAPSHOT.jar
23:41:10 [2022-05-21T03:41:10.094Z] [INFO] Installing /home/jenkins/agent/workspace/ease.verify.core.target.2018-12/features/org.eclipse.ease.lang.groovy.feature/pom.xml to /home/jenkins/.m2/repository/org/eclipse/ease/org.eclipse.ease.lang.groovy.feature/0.9.0-SNAPSHOT/org.eclipse.ease.lang.groovy.feature-0.9.0-SNAPSHOT.pom
23:41:10 [2022-05-21T03:41:10.094Z] [INFO] Installing /home/jenkins/agent/workspace/ease.verify.core.target.2018-12/features/org.eclipse.ease.lang.groovy.feature/target/p2content.xml to /home/jenkins/.m2/repository/org/eclipse/ease/org.eclipse.ease.lang.groovy.feature/0.9.0-SNAPSHOT/org.eclipse.ease.lang.groovy.feature-0.9.0-SNAPSHOT-p2metadata.xml
23:41:10 [2022-05-21T03:41:10.094Z] [INFO] Installing /home/jenkins/agent/workspace/ease.verify.core.target.2018-12/features/org.eclipse.ease.lang.groovy.feature/target/p2artifacts.xml to /home/jenkins/.m2/repository/org/eclipse/ease/org.eclipse.ease.lang.groovy.feature/0.9.0-SNAPSHOT/org.eclipse.ease.lang.groovy.feature-0.9.0-SNAPSHOT-p2artifacts.xml
23:41:10 [2022-05-21T03:41:10.094Z] [INFO] Installing /home/jenkins/agent/workspace/ease.verify.core.target.2018-12/features/org.eclipse.ease.lang.groovy.feature/target/org.eclipse.ease.lang.groovy.feature-0.9.0-SNAPSHOT-sources-feature.jar to /home/jenkins/.m2/repository/org/eclipse/ease/org.eclipse.ease.lang.groovy.feature/0.9.0-SNAPSHOT/org.eclipse.ease.lang.groovy.feature-0.9.0-SNAPSHOT-sources-feature.jar
23:41:10 [2022-05-21T03:41:10.094Z] [INFO] 
23:41:10 [2022-05-21T03:41:10.095Z] [INFO] --- tycho-p2-plugin:2.2.0:update-local-index (default-update-local-index) @ org.eclipse.ease.lang.groovy.feature ---
23:41:10 [2022-05-21T03:41:10.095Z] [INFO] 
23:41:10 [2022-05-21T03:41:10.095Z] [INFO] --------< org.eclipse.ease:org.eclipse.ease.lang.ruby.feature >---------
23:41:10 [2022-05-21T03:41:10.095Z] [INFO] Building org.eclipse.ease.lang.ruby.feature 0.9.0-SNAPSHOT       [32/49]
23:41:10 [2022-05-21T03:41:10.095Z] [INFO] --------------------------[ eclipse-feature ]---------------------------
23:41:10 [2022-05-21T03:41:10.095Z] [INFO] 
23:41:10 [2022-05-21T03:41:10.095Z] [INFO] --- maven-clean-plugin:2.5:clean (default-clean) @ org.eclipse.ease.lang.ruby.feature ---
23:41:10 [2022-05-21T03:41:10.095Z] [INFO] Deleting /home/jenkins/agent/workspace/ease.verify.core.target.2018-12/features/org.eclipse.ease.lang.ruby.feature/target
23:41:10 [2022-05-21T03:41:10.095Z] [INFO] 
23:41:10 [2022-05-21T03:41:10.095Z] [INFO] --- tycho-packaging-plugin:2.2.0:build-qualifier-aggregator (default-build-qualifier-aggregator) @ org.eclipse.ease.lang.ruby.feature ---
23:41:10 [2022-05-21T03:41:10.095Z] [INFO] The project's OSGi version is 0.9.0.I202111181115
23:41:10 [2022-05-21T03:41:10.095Z] [INFO] 
23:41:10 [2022-05-21T03:41:10.095Z] [INFO] --- tycho-packaging-plugin:2.2.0:validate-id (default-validate-id) @ org.eclipse.ease.lang.ruby.feature ---
23:41:10 [2022-05-21T03:41:10.095Z] [INFO] 
23:41:10 [2022-05-21T03:41:10.095Z] [INFO] --- tycho-packaging-plugin:2.2.0:validate-version (default-validate-version) @ org.eclipse.ease.lang.ruby.feature ---
23:41:10 [2022-05-21T03:41:10.095Z] [INFO] 
23:41:10 [2022-05-21T03:41:10.095Z] [INFO] --- target-platform-configuration:2.2.0:target-platform (default-target-platform) @ org.eclipse.ease.lang.ruby.feature ---
23:41:10 [2022-05-21T03:41:10.095Z] [INFO] 
23:41:10 [2022-05-21T03:41:10.095Z] [INFO] --- tycho-packaging-plugin:2.2.0:package-feature (default-package-feature) @ org.eclipse.ease.lang.ruby.feature ---
23:41:10 [2022-05-21T03:41:10.095Z] [INFO] Building jar: /home/jenkins/agent/workspace/ease.verify.core.target.2018-12/features/org.eclipse.ease.lang.ruby.feature/target/org.eclipse.ease.lang.ruby.feature-0.9.0-SNAPSHOT.jar
23:41:10 [2022-05-21T03:41:10.095Z] [INFO] 
23:41:10 [2022-05-21T03:41:10.095Z] [INFO] --- tycho-p2-plugin:2.2.0:p2-metadata-default (default-p2-metadata-default) @ org.eclipse.ease.lang.ruby.feature ---
23:41:10 [2022-05-21T03:41:10.095Z] [INFO] 
23:41:10 [2022-05-21T03:41:10.095Z] [INFO] --- tycho-p2-plugin:2.2.0:feature-p2-metadata (default-feature-p2-metadata) @ org.eclipse.ease.lang.ruby.feature ---
23:41:10 [2022-05-21T03:41:10.095Z] [INFO] 
23:41:10 [2022-05-21T03:41:10.095Z] [INFO] --- tycho-source-feature-plugin:2.2.0:source-feature (source-feature) @ org.eclipse.ease.lang.ruby.feature ---
23:41:10 [2022-05-21T03:41:10.096Z] [WARNING] Mojo tycho-source-feature-plugin:source-feature is replaced by the tycho-source-plugin:feature-source which offers equivalent and even enhanced functionality
23:41:10 [2022-05-21T03:41:10.096Z] [INFO] Building jar: /home/jenkins/agent/workspace/ease.verify.core.target.2018-12/features/org.eclipse.ease.lang.ruby.feature/target/org.eclipse.ease.lang.ruby.feature-0.9.0-SNAPSHOT-sources-feature.jar
23:41:10 [2022-05-21T03:41:10.096Z] [INFO] 
23:41:10 [2022-05-21T03:41:10.096Z] [INFO] --- tycho-p2-plugin:2.2.0:p2-metadata (attached-p2-metadata) @ org.eclipse.ease.lang.ruby.feature ---
23:41:10 [2022-05-21T03:41:10.096Z] [WARNING] artifact org.eclipse.ease:org.eclipse.ease.lang.ruby.feature:xml:p2metadata:0.9.0-SNAPSHOT already attached, replace previous instance
23:41:10 [2022-05-21T03:41:10.096Z] [WARNING] artifact org.eclipse.ease:org.eclipse.ease.lang.ruby.feature:xml:p2artifacts:0.9.0-SNAPSHOT already attached, replace previous instance
23:41:10 [2022-05-21T03:41:10.096Z] [INFO] 
23:41:10 [2022-05-21T03:41:10.096Z] [INFO] --- maven-install-plugin:2.3.1:install (default-install) @ org.eclipse.ease.lang.ruby.feature ---
23:41:10 [2022-05-21T03:41:10.096Z] [INFO] Installing /home/jenkins/agent/workspace/ease.verify.core.target.2018-12/features/org.eclipse.ease.lang.ruby.feature/target/org.eclipse.ease.lang.ruby.feature-0.9.0-SNAPSHOT.jar to /home/jenkins/.m2/repository/org/eclipse/ease/org.eclipse.ease.lang.ruby.feature/0.9.0-SNAPSHOT/org.eclipse.ease.lang.ruby.feature-0.9.0-SNAPSHOT.jar
23:41:10 [2022-05-21T03:41:10.096Z] [INFO] Installing /home/jenkins/agent/workspace/ease.verify.core.target.2018-12/features/org.eclipse.ease.lang.ruby.feature/pom.xml to /home/jenkins/.m2/repository/org/eclipse/ease/org.eclipse.ease.lang.ruby.feature/0.9.0-SNAPSHOT/org.eclipse.ease.lang.ruby.feature-0.9.0-SNAPSHOT.pom
23:41:10 [2022-05-21T03:41:10.096Z] [INFO] Installing /home/jenkins/agent/workspace/ease.verify.core.target.2018-12/features/org.eclipse.ease.lang.ruby.feature/target/p2content.xml to /home/jenkins/.m2/repository/org/eclipse/ease/org.eclipse.ease.lang.ruby.feature/0.9.0-SNAPSHOT/org.eclipse.ease.lang.ruby.feature-0.9.0-SNAPSHOT-p2metadata.xml
23:41:10 [2022-05-21T03:41:10.096Z] [INFO] Installing /home/jenkins/agent/workspace/ease.verify.core.target.2018-12/features/org.eclipse.ease.lang.ruby.feature/target/p2artifacts.xml to /home/jenkins/.m2/repository/org/eclipse/ease/org.eclipse.ease.lang.ruby.feature/0.9.0-SNAPSHOT/org.eclipse.ease.lang.ruby.feature-0.9.0-SNAPSHOT-p2artifacts.xml
23:41:10 [2022-05-21T03:41:10.096Z] [INFO] Installing /home/jenkins/agent/workspace/ease.verify.core.target.2018-12/features/org.eclipse.ease.lang.ruby.feature/target/org.eclipse.ease.lang.ruby.feature-0.9.0-SNAPSHOT-sources-feature.jar to /home/jenkins/.m2/repository/org/eclipse/ease/org.eclipse.ease.lang.ruby.feature/0.9.0-SNAPSHOT/org.eclipse.ease.lang.ruby.feature-0.9.0-SNAPSHOT-sources-feature.jar
23:41:10 [2022-05-21T03:41:10.096Z] [INFO] 
23:41:10 [2022-05-21T03:41:10.096Z] [INFO] --- tycho-p2-plugin:2.2.0:update-local-index (default-update-local-index) @ org.eclipse.ease.lang.ruby.feature ---
23:41:10 [2022-05-21T03:41:10.096Z] [INFO] 
23:41:10 [2022-05-21T03:41:10.096Z] [INFO] ----< org.eclipse.ease:org.eclipse.ease.lang.scriptarchive.feature >----
23:41:10 [2022-05-21T03:41:10.097Z] [INFO] Building org.eclipse.ease.lang.scriptarchive.feature 0.9.0-SNAPSHOT [33/49]
23:41:10 [2022-05-21T03:41:10.097Z] [INFO] --------------------------[ eclipse-feature ]---------------------------
23:41:10 [2022-05-21T03:41:10.376Z] [INFO] 
23:41:10 [2022-05-21T03:41:10.376Z] [INFO] --- maven-clean-plugin:2.5:clean (default-clean) @ org.eclipse.ease.lang.scriptarchive.feature ---
23:41:10 [2022-05-21T03:41:10.376Z] [INFO] Deleting /home/jenkins/agent/workspace/ease.verify.core.target.2018-12/features/org.eclipse.ease.lang.scriptarchive.feature/target
23:41:10 [2022-05-21T03:41:10.376Z] [INFO] 
23:41:10 [2022-05-21T03:41:10.376Z] [INFO] --- tycho-packaging-plugin:2.2.0:build-qualifier-aggregator (default-build-qualifier-aggregator) @ org.eclipse.ease.lang.scriptarchive.feature ---
23:41:10 [2022-05-21T03:41:10.376Z] [INFO] The project's OSGi version is 0.9.0.I202111181115
23:41:10 [2022-05-21T03:41:10.376Z] [INFO] 
23:41:10 [2022-05-21T03:41:10.376Z] [INFO] --- tycho-packaging-plugin:2.2.0:validate-id (default-validate-id) @ org.eclipse.ease.lang.scriptarchive.feature ---
23:41:10 [2022-05-21T03:41:10.376Z] [INFO] 
23:41:10 [2022-05-21T03:41:10.376Z] [INFO] --- tycho-packaging-plugin:2.2.0:validate-version (default-validate-version) @ org.eclipse.ease.lang.scriptarchive.feature ---
23:41:10 [2022-05-21T03:41:10.376Z] [INFO] 
23:41:10 [2022-05-21T03:41:10.376Z] [INFO] --- target-platform-configuration:2.2.0:target-platform (default-target-platform) @ org.eclipse.ease.lang.scriptarchive.feature ---
23:41:10 [2022-05-21T03:41:10.376Z] [INFO] 
23:41:10 [2022-05-21T03:41:10.376Z] [INFO] --- tycho-packaging-plugin:2.2.0:package-feature (default-package-feature) @ org.eclipse.ease.lang.scriptarchive.feature ---
23:41:10 [2022-05-21T03:41:10.376Z] [INFO] Building jar: /home/jenkins/agent/workspace/ease.verify.core.target.2018-12/features/org.eclipse.ease.lang.scriptarchive.feature/target/org.eclipse.ease.lang.scriptarchive.feature-0.9.0-SNAPSHOT.jar
23:41:10 [2022-05-21T03:41:10.376Z] [INFO] 
23:41:10 [2022-05-21T03:41:10.376Z] [INFO] --- tycho-p2-plugin:2.2.0:p2-metadata-default (default-p2-metadata-default) @ org.eclipse.ease.lang.scriptarchive.feature ---
23:41:10 [2022-05-21T03:41:10.377Z] [INFO] 
23:41:10 [2022-05-21T03:41:10.377Z] [INFO] --- tycho-p2-plugin:2.2.0:feature-p2-metadata (default-feature-p2-metadata) @ org.eclipse.ease.lang.scriptarchive.feature ---
23:41:10 [2022-05-21T03:41:10.377Z] [INFO] 
23:41:10 [2022-05-21T03:41:10.377Z] [INFO] --- tycho-source-feature-plugin:2.2.0:source-feature (source-feature) @ org.eclipse.ease.lang.scriptarchive.feature ---
23:41:10 [2022-05-21T03:41:10.377Z] [WARNING] Mojo tycho-source-feature-plugin:source-feature is replaced by the tycho-source-plugin:feature-source which offers equivalent and even enhanced functionality
23:41:10 [2022-05-21T03:41:10.377Z] [INFO] Building jar: /home/jenkins/agent/workspace/ease.verify.core.target.2018-12/features/org.eclipse.ease.lang.scriptarchive.feature/target/org.eclipse.ease.lang.scriptarchive.feature-0.9.0-SNAPSHOT-sources-feature.jar
23:41:10 [2022-05-21T03:41:10.377Z] [INFO] 
23:41:10 [2022-05-21T03:41:10.377Z] [INFO] --- tycho-p2-plugin:2.2.0:p2-metadata (attached-p2-metadata) @ org.eclipse.ease.lang.scriptarchive.feature ---
23:41:10 [2022-05-21T03:41:10.377Z] [WARNING] artifact org.eclipse.ease:org.eclipse.ease.lang.scriptarchive.feature:xml:p2metadata:0.9.0-SNAPSHOT already attached, replace previous instance
23:41:10 [2022-05-21T03:41:10.377Z] [WARNING] artifact org.eclipse.ease:org.eclipse.ease.lang.scriptarchive.feature:xml:p2artifacts:0.9.0-SNAPSHOT already attached, replace previous instance
23:41:10 [2022-05-21T03:41:10.377Z] [INFO] 
23:41:10 [2022-05-21T03:41:10.377Z] [INFO] --- maven-install-plugin:2.3.1:install (default-install) @ org.eclipse.ease.lang.scriptarchive.feature ---
23:41:10 [2022-05-21T03:41:10.377Z] [INFO] Installing /home/jenkins/agent/workspace/ease.verify.core.target.2018-12/features/org.eclipse.ease.lang.scriptarchive.feature/target/org.eclipse.ease.lang.scriptarchive.feature-0.9.0-SNAPSHOT.jar to /home/jenkins/.m2/repository/org/eclipse/ease/org.eclipse.ease.lang.scriptarchive.feature/0.9.0-SNAPSHOT/org.eclipse.ease.lang.scriptarchive.feature-0.9.0-SNAPSHOT.jar
23:41:10 [2022-05-21T03:41:10.377Z] [INFO] Installing /home/jenkins/agent/workspace/ease.verify.core.target.2018-12/features/org.eclipse.ease.lang.scriptarchive.feature/pom.xml to /home/jenkins/.m2/repository/org/eclipse/ease/org.eclipse.ease.lang.scriptarchive.feature/0.9.0-SNAPSHOT/org.eclipse.ease.lang.scriptarchive.feature-0.9.0-SNAPSHOT.pom
23:41:10 [2022-05-21T03:41:10.377Z] [INFO] Installing /home/jenkins/agent/workspace/ease.verify.core.target.2018-12/features/org.eclipse.ease.lang.scriptarchive.feature/target/p2content.xml to /home/jenkins/.m2/repository/org/eclipse/ease/org.eclipse.ease.lang.scriptarchive.feature/0.9.0-SNAPSHOT/org.eclipse.ease.lang.scriptarchive.feature-0.9.0-SNAPSHOT-p2metadata.xml
23:41:10 [2022-05-21T03:41:10.377Z] [INFO] Installing /home/jenkins/agent/workspace/ease.verify.core.target.2018-12/features/org.eclipse.ease.lang.scriptarchive.feature/target/p2artifacts.xml to /home/jenkins/.m2/repository/org/eclipse/ease/org.eclipse.ease.lang.scriptarchive.feature/0.9.0-SNAPSHOT/org.eclipse.ease.lang.scriptarchive.feature-0.9.0-SNAPSHOT-p2artifacts.xml
23:41:10 [2022-05-21T03:41:10.377Z] [INFO] Installing /home/jenkins/agent/workspace/ease.verify.core.target.2018-12/features/org.eclipse.ease.lang.scriptarchive.feature/target/org.eclipse.ease.lang.scriptarchive.feature-0.9.0-SNAPSHOT-sources-feature.jar to /home/jenkins/.m2/repository/org/eclipse/ease/org.eclipse.ease.lang.scriptarchive.feature/0.9.0-SNAPSHOT/org.eclipse.ease.lang.scriptarchive.feature-0.9.0-SNAPSHOT-sources-feature.jar
23:41:10 [2022-05-21T03:41:10.377Z] [INFO] 
23:41:10 [2022-05-21T03:41:10.377Z] [INFO] --- tycho-p2-plugin:2.2.0:update-local-index (default-update-local-index) @ org.eclipse.ease.lang.scriptarchive.feature ---
23:41:10 [2022-05-21T03:41:10.377Z] [INFO] 
23:41:10 [2022-05-21T03:41:10.378Z] [INFO] ------< org.eclipse.ease:org.eclipse.ease.lang.unittest.feature >-------
23:41:10 [2022-05-21T03:41:10.378Z] [INFO] Building org.eclipse.ease.lang.unittest.feature 0.9.0-SNAPSHOT   [34/49]
23:41:10 [2022-05-21T03:41:10.378Z] [INFO] --------------------------[ eclipse-feature ]---------------------------
23:41:10 [2022-05-21T03:41:10.378Z] [INFO] 
23:41:10 [2022-05-21T03:41:10.378Z] [INFO] --- maven-clean-plugin:2.5:clean (default-clean) @ org.eclipse.ease.lang.unittest.feature ---
23:41:10 [2022-05-21T03:41:10.378Z] [INFO] Deleting /home/jenkins/agent/workspace/ease.verify.core.target.2018-12/features/org.eclipse.ease.lang.unittest.feature/target
23:41:10 [2022-05-21T03:41:10.378Z] [INFO] 
23:41:10 [2022-05-21T03:41:10.378Z] [INFO] --- tycho-packaging-plugin:2.2.0:build-qualifier-aggregator (default-build-qualifier-aggregator) @ org.eclipse.ease.lang.unittest.feature ---
23:41:10 [2022-05-21T03:41:10.378Z] [INFO] The project's OSGi version is 0.9.0.I202204291053
23:41:10 [2022-05-21T03:41:10.378Z] [INFO] 
23:41:10 [2022-05-21T03:41:10.378Z] [INFO] --- tycho-packaging-plugin:2.2.0:validate-id (default-validate-id) @ org.eclipse.ease.lang.unittest.feature ---
23:41:10 [2022-05-21T03:41:10.378Z] [INFO] 
23:41:10 [2022-05-21T03:41:10.378Z] [INFO] --- tycho-packaging-plugin:2.2.0:validate-version (default-validate-version) @ org.eclipse.ease.lang.unittest.feature ---
23:41:10 [2022-05-21T03:41:10.378Z] [INFO] 
23:41:10 [2022-05-21T03:41:10.378Z] [INFO] --- target-platform-configuration:2.2.0:target-platform (default-target-platform) @ org.eclipse.ease.lang.unittest.feature ---
23:41:10 [2022-05-21T03:41:10.378Z] [INFO] 
23:41:10 [2022-05-21T03:41:10.378Z] [INFO] --- tycho-packaging-plugin:2.2.0:package-feature (default-package-feature) @ org.eclipse.ease.lang.unittest.feature ---
23:41:10 [2022-05-21T03:41:10.378Z] [INFO] Building jar: /home/jenkins/agent/workspace/ease.verify.core.target.2018-12/features/org.eclipse.ease.lang.unittest.feature/target/org.eclipse.ease.lang.unittest.feature-0.9.0-SNAPSHOT.jar
23:41:10 [2022-05-21T03:41:10.378Z] [INFO] 
23:41:10 [2022-05-21T03:41:10.378Z] [INFO] --- tycho-p2-plugin:2.2.0:p2-metadata-default (default-p2-metadata-default) @ org.eclipse.ease.lang.unittest.feature ---
23:41:10 [2022-05-21T03:41:10.378Z] [INFO] 
23:41:10 [2022-05-21T03:41:10.378Z] [INFO] --- tycho-p2-plugin:2.2.0:feature-p2-metadata (default-feature-p2-metadata) @ org.eclipse.ease.lang.unittest.feature ---
23:41:10 [2022-05-21T03:41:10.378Z] [INFO] 
23:41:10 [2022-05-21T03:41:10.378Z] [INFO] --- tycho-source-feature-plugin:2.2.0:source-feature (source-feature) @ org.eclipse.ease.lang.unittest.feature ---
23:41:10 [2022-05-21T03:41:10.378Z] [WARNING] Mojo tycho-source-feature-plugin:source-feature is replaced by the tycho-source-plugin:feature-source which offers equivalent and even enhanced functionality
23:41:10 [2022-05-21T03:41:10.378Z] [INFO] Building jar: /home/jenkins/agent/workspace/ease.verify.core.target.2018-12/features/org.eclipse.ease.lang.unittest.feature/target/org.eclipse.ease.lang.unittest.feature-0.9.0-SNAPSHOT-sources-feature.jar
23:41:10 [2022-05-21T03:41:10.378Z] [INFO] 
23:41:10 [2022-05-21T03:41:10.378Z] [INFO] --- tycho-p2-plugin:2.2.0:p2-metadata (attached-p2-metadata) @ org.eclipse.ease.lang.unittest.feature ---
23:41:10 [2022-05-21T03:41:10.378Z] [WARNING] artifact org.eclipse.ease:org.eclipse.ease.lang.unittest.feature:xml:p2metadata:0.9.0-SNAPSHOT already attached, replace previous instance
23:41:10 [2022-05-21T03:41:10.379Z] [WARNING] artifact org.eclipse.ease:org.eclipse.ease.lang.unittest.feature:xml:p2artifacts:0.9.0-SNAPSHOT already attached, replace previous instance
23:41:10 [2022-05-21T03:41:10.379Z] [INFO] 
23:41:10 [2022-05-21T03:41:10.379Z] [INFO] --- maven-install-plugin:2.3.1:install (default-install) @ org.eclipse.ease.lang.unittest.feature ---
23:41:10 [2022-05-21T03:41:10.379Z] [INFO] Installing /home/jenkins/agent/workspace/ease.verify.core.target.2018-12/features/org.eclipse.ease.lang.unittest.feature/target/org.eclipse.ease.lang.unittest.feature-0.9.0-SNAPSHOT.jar to /home/jenkins/.m2/repository/org/eclipse/ease/org.eclipse.ease.lang.unittest.feature/0.9.0-SNAPSHOT/org.eclipse.ease.lang.unittest.feature-0.9.0-SNAPSHOT.jar
23:41:10 [2022-05-21T03:41:10.379Z] [INFO] Installing /home/jenkins/agent/workspace/ease.verify.core.target.2018-12/features/org.eclipse.ease.lang.unittest.feature/pom.xml to /home/jenkins/.m2/repository/org/eclipse/ease/org.eclipse.ease.lang.unittest.feature/0.9.0-SNAPSHOT/org.eclipse.ease.lang.unittest.feature-0.9.0-SNAPSHOT.pom
23:41:10 [2022-05-21T03:41:10.379Z] [INFO] Installing /home/jenkins/agent/workspace/ease.verify.core.target.2018-12/features/org.eclipse.ease.lang.unittest.feature/target/p2content.xml to /home/jenkins/.m2/repository/org/eclipse/ease/org.eclipse.ease.lang.unittest.feature/0.9.0-SNAPSHOT/org.eclipse.ease.lang.unittest.feature-0.9.0-SNAPSHOT-p2metadata.xml
23:41:10 [2022-05-21T03:41:10.379Z] [INFO] Installing /home/jenkins/agent/workspace/ease.verify.core.target.2018-12/features/org.eclipse.ease.lang.unittest.feature/target/p2artifacts.xml to /home/jenkins/.m2/repository/org/eclipse/ease/org.eclipse.ease.lang.unittest.feature/0.9.0-SNAPSHOT/org.eclipse.ease.lang.unittest.feature-0.9.0-SNAPSHOT-p2artifacts.xml
23:41:10 [2022-05-21T03:41:10.379Z] [INFO] Installing /home/jenkins/agent/workspace/ease.verify.core.target.2018-12/features/org.eclipse.ease.lang.unittest.feature/target/org.eclipse.ease.lang.unittest.feature-0.9.0-SNAPSHOT-sources-feature.jar to /home/jenkins/.m2/repository/org/eclipse/ease/org.eclipse.ease.lang.unittest.feature/0.9.0-SNAPSHOT/org.eclipse.ease.lang.unittest.feature-0.9.0-SNAPSHOT-sources-feature.jar
23:41:10 [2022-05-21T03:41:10.379Z] [INFO] 
23:41:10 [2022-05-21T03:41:10.379Z] [INFO] --- tycho-p2-plugin:2.2.0:update-local-index (default-update-local-index) @ org.eclipse.ease.lang.unittest.feature ---
23:41:10 [2022-05-21T03:41:10.379Z] [INFO] 
23:41:10 [2022-05-21T03:41:10.379Z] [INFO] ----------< org.eclipse.ease:org.eclipse.ease.releng.target >-----------
23:41:10 [2022-05-21T03:41:10.379Z] [INFO] Building org.eclipse.ease.releng.target 0.9.0-SNAPSHOT           [35/49]
23:41:10 [2022-05-21T03:41:10.379Z] [INFO] ---------------------[ eclipse-target-definition ]----------------------
23:41:10 [2022-05-21T03:41:10.379Z] [INFO] 
23:41:10 [2022-05-21T03:41:10.379Z] [INFO] --- maven-clean-plugin:2.5:clean (default-clean) @ org.eclipse.ease.releng.target ---
23:41:10 [2022-05-21T03:41:10.379Z] [INFO] 
23:41:10 [2022-05-21T03:41:10.379Z] [INFO] --- tycho-packaging-plugin:2.2.0:package-target-definition (default-package-target-definition) @ org.eclipse.ease.releng.target ---
23:41:10 [2022-05-21T03:41:10.379Z] [INFO] 
23:41:10 [2022-05-21T03:41:10.379Z] [INFO] --- maven-install-plugin:2.3.1:install (default-install) @ org.eclipse.ease.releng.target ---
23:41:10 [2022-05-21T03:41:10.379Z] [INFO] Installing /home/jenkins/agent/workspace/ease.verify.core.target.2018-12/releng/org.eclipse.ease.releng.target/org.eclipse.ease.releng.target.target to /home/jenkins/.m2/repository/org/eclipse/ease/org.eclipse.ease.releng.target/0.9.0-SNAPSHOT/org.eclipse.ease.releng.target-0.9.0-SNAPSHOT.target
23:41:10 [2022-05-21T03:41:10.379Z] [INFO] Installing /home/jenkins/agent/workspace/ease.verify.core.target.2018-12/releng/org.eclipse.ease.releng.target/pom.xml to /home/jenkins/.m2/repository/org/eclipse/ease/org.eclipse.ease.releng.target/0.9.0-SNAPSHOT/org.eclipse.ease.releng.target-0.9.0-SNAPSHOT.pom
23:41:10 [2022-05-21T03:41:10.379Z] [INFO] 
23:41:10 [2022-05-21T03:41:10.379Z] [INFO] ------------< org.eclipse.ease:org.eclipse.ease.releng.p2 >-------------
23:41:10 [2022-05-21T03:41:10.379Z] [INFO] Building org.eclipse.ease.releng.p2 0.9.0-SNAPSHOT               [36/49]
23:41:10 [2022-05-21T03:41:10.380Z] [INFO] -------------------------[ eclipse-repository ]-------------------------
23:41:10 [2022-05-21T03:41:10.380Z] [INFO] ------------------------------------------------------------------------
23:41:10 [2022-05-21T03:41:10.380Z] [INFO] Reactor Summary:
23:41:10 [2022-05-21T03:41:10.380Z] [INFO] 
23:41:10 [2022-05-21T03:41:10.380Z] [INFO] org.eclipse.ease.classloader 0.9.0-SNAPSHOT ........ SUCCESS [ 31.931 s]
23:41:10 [2022-05-21T03:41:10.380Z] [INFO] org.eclipse.ease 0.9.0-SNAPSHOT .................... SUCCESS [ 20.234 s]
23:41:10 [2022-05-21T03:41:10.380Z] [INFO] org.eclipse.ease.ui 0.9.0-SNAPSHOT ................. SUCCESS [ 22.735 s]
23:41:10 [2022-05-21T03:41:10.380Z] [INFO] org.eclipse.ease.ui.completions.java 0.9.0-SNAPSHOT  SUCCESS [  8.772 s]
23:41:10 [2022-05-21T03:41:10.380Z] [INFO] org.eclipse.ease.ui.scripts 0.9.0-SNAPSHOT ......... SUCCESS [ 19.205 s]
23:41:10 [2022-05-21T03:41:10.380Z] [INFO] org.eclipse.ease.releng 0.9.0-SNAPSHOT ............. SUCCESS [  0.261 s]
23:41:10 [2022-05-21T03:41:10.380Z] [INFO] org.eclipse.ease.lang.javascript 0.9.0-SNAPSHOT .... SUCCESS [  6.263 s]
23:41:10 [2022-05-21T03:41:10.380Z] [INFO] org.eclipse.ease.lang.scriptarchive 0.9.0-SNAPSHOT . SUCCESS [  5.474 s]
23:41:10 [2022-05-21T03:41:10.380Z] [INFO] org.eclipse.ease.lang.python 0.9.0-SNAPSHOT ........ SUCCESS [  7.706 s]
23:41:10 [2022-05-21T03:41:10.380Z] [INFO] org.eclipse.ease.lang.python.py4j 0.9.0-SNAPSHOT ... SUCCESS [  7.310 s]
23:41:10 [2022-05-21T03:41:10.380Z] [INFO] org.eclipse.ease.lang.groovy 0.9.0-SNAPSHOT ........ SUCCESS [  5.216 s]
23:41:10 [2022-05-21T03:41:10.380Z] [INFO] org.eclipse.ease.lang.groovy.interpreter 0.9.0-SNAPSHOT SUCCESS [  6.326 s]
23:41:10 [2022-05-21T03:41:10.380Z] [INFO] org.eclipse.ease.lang.unittest 0.9.0-SNAPSHOT ...... SUCCESS [ 11.826 s]
23:41:10 [2022-05-21T03:41:10.380Z] [INFO] org.eclipse.ease.lang.unittest.ui 0.9.0-SNAPSHOT ... SUCCESS [ 13.084 s]
23:41:10 [2022-05-21T03:41:10.380Z] [INFO] org.eclipse.ease.lang.ruby 0.9.0-SNAPSHOT .......... SUCCESS [  6.153 s]
23:41:10 [2022-05-21T03:41:10.380Z] [INFO] org.eclipse.ease.lang.ruby.jruby 0.9.0-SNAPSHOT .... SUCCESS [  5.105 s]
23:41:10 [2022-05-21T03:41:10.380Z] [INFO] org.eclipse.ease.lang.javascript.nashorn 0.9.0-SNAPSHOT SUCCESS [  6.052 s]
23:41:10 [2022-05-21T03:41:10.380Z] [INFO] org.eclipse.ease.lang.javascript.rhino 0.9.0-SNAPSHOT SUCCESS [ 10.878 s]
23:41:10 [2022-05-21T03:41:10.380Z] [INFO] org.eclipse.ease.lang.python.jython 0.9.0-SNAPSHOT . SUCCESS [  7.918 s]
23:41:10 [2022-05-21T03:41:10.380Z] [INFO] org.eclipse.ease.lang.javascript.ui 0.9.0-SNAPSHOT . SUCCESS [  5.815 s]
23:41:10 [2022-05-21T03:41:10.380Z] [INFO] org.eclipse.ease.lang.jvm.compiled 0.9.0-SNAPSHOT .. SUCCESS [  5.926 s]
23:41:10 [2022-05-21T03:41:10.380Z] [INFO] org.eclipse.ease.lang.scriptarchive.ui 0.9.0-SNAPSHOT SUCCESS [  6.996 s]
23:41:10 [2022-05-21T03:41:10.380Z] [INFO] org.eclipse.ease.help 0.9.0-SNAPSHOT ............... SUCCESS [  8.808 s]
23:41:10 [2022-05-21T03:41:10.380Z] [INFO] org.eclipse.ease.feature 0.9.0-SNAPSHOT ............ SUCCESS [  0.198 s]
23:41:10 [2022-05-21T03:41:10.380Z] [INFO] org.eclipse.ease.ui.feature 0.9.0-SNAPSHOT ......... SUCCESS [  0.175 s]
23:41:10 [2022-05-21T03:41:10.380Z] [INFO] org.eclipse.ease.lang.javascript.feature 0.9.0-SNAPSHOT SUCCESS [  0.102 s]
23:41:10 [2022-05-21T03:41:10.380Z] [INFO] org.eclipse.ease.lang.python.feature 0.9.0-SNAPSHOT  SUCCESS [  0.082 s]
23:41:10 [2022-05-21T03:41:10.380Z] [INFO] org.eclipse.ease.python.jython.feature 0.9.0-SNAPSHOT SUCCESS [  0.100 s]
23:41:10 [2022-05-21T03:41:10.380Z] [INFO] org.eclipse.ease.lang.python.py4j.feature 0.9.0-SNAPSHOT SUCCESS [  0.046 s]
23:41:10 [2022-05-21T03:41:10.380Z] [INFO] org.eclipse.ease.lang.jvm.feature 0.9.0-SNAPSHOT ... SUCCESS [  0.078 s]
23:41:10 [2022-05-21T03:41:10.380Z] [INFO] org.eclipse.ease.lang.groovy.feature 0.9.0-SNAPSHOT  SUCCESS [  0.082 s]
23:41:10 [2022-05-21T03:41:10.380Z] [INFO] org.eclipse.ease.lang.ruby.feature 0.9.0-SNAPSHOT .. SUCCESS [  0.042 s]
23:41:10 [2022-05-21T03:41:10.380Z] [INFO] org.eclipse.ease.lang.scriptarchive.feature 0.9.0-SNAPSHOT SUCCESS [  0.101 s]
23:41:10 [2022-05-21T03:41:10.380Z] [INFO] org.eclipse.ease.lang.unittest.feature 0.9.0-SNAPSHOT SUCCESS [  0.071 s]
23:41:10 [2022-05-21T03:41:10.380Z] [INFO] org.eclipse.ease.releng.target 0.9.0-SNAPSHOT ...... SUCCESS [  0.003 s]
23:41:10 [2022-05-21T03:41:10.380Z] [INFO] org.eclipse.ease.releng.p2 0.9.0-SNAPSHOT .......... FAILURE [  0.001 s]
23:41:10 [2022-05-21T03:41:10.380Z] [INFO] org.eclipse.ease.testhelper 0.9.0-SNAPSHOT ......... SKIPPED
23:41:10 [2022-05-21T03:41:10.380Z] [INFO] org.eclipse.ease.test 0.9.0-SNAPSHOT ............... SKIPPED
23:41:10 [2022-05-21T03:41:10.380Z] [INFO] org.eclipse.ease.lang.javascript.rhino.test 0.9.0-SNAPSHOT SKIPPED
23:41:10 [2022-05-21T03:41:10.380Z] [INFO] org.eclipse.ease.lang.javascript.test 0.9.0-SNAPSHOT SKIPPED
23:41:10 [2022-05-21T03:41:10.380Z] [INFO] org.eclipse.ease.lang.python.test 0.9.0-SNAPSHOT ... SKIPPED
23:41:10 [2022-05-21T03:41:10.380Z] [INFO] org.eclipse.ease.lang.python.jython.test 0.9.0-SNAPSHOT SKIPPED
23:41:10 [2022-05-21T03:41:10.380Z] [INFO] org.eclipse.ease.lang.scriptarchive.test 0.9.0-SNAPSHOT SKIPPED
23:41:10 [2022-05-21T03:41:10.380Z] [INFO] org.eclipse.ease.lang.unittest.test 0.9.0-SNAPSHOT . SKIPPED
23:41:10 [2022-05-21T03:41:10.380Z] [INFO] org.eclipse.ease.ui.scripts.test 0.9.0-SNAPSHOT .... SKIPPED
23:41:10 [2022-05-21T03:41:10.380Z] [INFO] org.eclipse.ease.ui.test 0.9.0-SNAPSHOT ............ SKIPPED
23:41:10 [2022-05-21T03:41:10.380Z] [INFO] org.eclipse.ease.ui.completions.java.test 0.9.0-SNAPSHOT SKIPPED
23:41:10 [2022-05-21T03:41:10.380Z] [INFO] org.eclipse.ease.releng.coverage 0.9.0-SNAPSHOT .... SKIPPED
23:41:10 [2022-05-21T03:41:10.381Z] [INFO] EASE (Incubation) 0.4.0-SNAPSHOT ................... SKIPPED
23:41:10 [2022-05-21T03:41:10.381Z] [INFO] ------------------------------------------------------------------------
23:41:10 [2022-05-21T03:41:10.381Z] [INFO] BUILD FAILURE
23:41:10 [2022-05-21T03:41:10.381Z] [INFO] ------------------------------------------------------------------------
23:41:10 [2022-05-21T03:41:10.381Z] [INFO] Total time:  04:51 min
23:41:10 [2022-05-21T03:41:10.381Z] [INFO] Finished at: 2022-05-21T03:41:10Z
23:41:10 [2022-05-21T03:41:10.381Z] [INFO] ------------------------------------------------------------------------
23:41:10 [2022-05-21T03:41:10.381Z] [INFO] [jenkins-event-spy] Generated /home/jenkins/agent/workspace/ease.verify.core.target.2018-12@tmp/withMaven3e833975/maven-spy-20220521-033618-28013694719127934657942.log
23:41:10 [2022-05-21T03:41:10.381Z] [ERROR] Plugin org.jboss.tools.tycho-plugins:repository-utils:2.2.0 or one of its dependencies could not be resolved: Failed to read artifact descriptor for org.jboss.tools.tycho-plugins:repository-utils:jar:2.2.0: org.jboss.tools.tycho-plugins:repository-utils:pom:2.2.0 failed to transfer from https://repository.jboss.org/nexus/content/groups/public/ during a previous attempt. This failure was cached in the local repository and resolution is not reattempted until the update interval of jboss-public-repository-group has elapsed or updates are forced. Original error: Could not transfer artifact org.jboss.tools.tycho-plugins:repository-utils:pom:2.2.0 from/to jboss-public-repository-group (https://repository.jboss.org/nexus/content/groups/public/): transfer failed for https://repository.jboss.org/nexus/content/groups/public/org/jboss/tools/tycho-plugins/repository-utils/2.2.0/repository-utils-2.2.0.pom, status: 503 Service Unavailable -> [Help 1]
23:41:10 [2022-05-21T03:41:10.381Z] [ERROR] 
23:41:10 [2022-05-21T03:41:10.381Z] [ERROR] To see the full stack trace of the errors, re-run Maven with the -e switch.
23:41:10 [2022-05-21T03:41:10.381Z] [ERROR] Re-run Maven using the -X switch to enable full debug logging.
23:41:10 [2022-05-21T03:41:10.381Z] [ERROR] 
23:41:10 [2022-05-21T03:41:10.381Z] [ERROR] For more information about the errors and possible solutions, please read the following articles:
23:41:10 [2022-05-21T03:41:10.381Z] [ERROR] [Help 1] http://cwiki.apache.org/confluence/display/MAVEN/PluginResolutionException
[Pipeline] }
23:41:13 [2022-05-21T03:41:13.728Z] [withMaven] Jenkins FindBugs Plugin not found, don't display com.github.spotbugs:spotbugs-maven-plugin:spotbugs results in pipeline screen.
23:41:13 [2022-05-21T03:41:13.731Z] [withMaven] Publishers: Pipeline Graph Publisher: 47 ms, Invoker Publisher: 2 ms, Junit Publisher: 3 ms, Concordion Publisher: 1 ms, Dependencies Fingerprint Publisher: 1918 ms, Findbugs Publisher: 1 ms, Jacoco Publisher: 1 ms, SpotBugs Publisher: 3 ms
[Pipeline] // withMaven
[Pipeline] }
[Pipeline] // stage
[Pipeline] stage
[Pipeline] { (Test)
Stage "Test" skipped due to earlier failure(s)
[Pipeline] }
[Pipeline] // stage
[Pipeline] stage
[Pipeline] { (Declarative: Post Actions)
[Pipeline] archiveArtifacts
23:41:13 [2022-05-21T03:41:13.820Z] Archiving artifacts
[Pipeline] emailext
23:41:29 [2022-05-21T03:41:29.067Z] Sending email to: christian.pontesegger@web.de
[Pipeline] }
[Pipeline] // stage
[Pipeline] }
[Pipeline] // timeout
[Pipeline] }
[Pipeline] // timestamps
[Pipeline] }
[Pipeline] // node
[Pipeline] End of Pipeline
ERROR: script returned exit code 1
Finished: FAILURE