Console Output

Skipping 100 KB.. Full Log
MethodAccessorImpl.invoke(NativeMethodAccessorImpl.java:64)
00:30:29 [2022-02-12T05:30:29.936Z] 	at java.base/jdk.internal.reflect.DelegatingMethodAccessorImpl.invoke(DelegatingMethodAccessorImpl.java:43)
00:30:29 [2022-02-12T05:30:29.936Z] 	at java.base/java.lang.reflect.Method.invoke(Method.java:564)
00:30:29 [2022-02-12T05:30:29.936Z] 	at org.mozilla.javascript.MemberBox.invoke(MemberBox.java:126)
00:30:29 [2022-02-12T05:30:29.936Z] 	at org.mozilla.javascript.NativeJavaMethod.call(NativeJavaMethod.java:225)
00:30:29 [2022-02-12T05:30:29.936Z] 	at org.mozilla.javascript.Interpreter.interpretLoop(Interpreter.java:1473)
00:30:29 [2022-02-12T05:30:29.936Z] 	at org.mozilla.javascript.Interpreter.interpret(Interpreter.java:815)
00:30:29 [2022-02-12T05:30:29.936Z] 	at org.mozilla.javascript.InterpretedFunction.call(InterpretedFunction.java:109)
00:30:29 [2022-02-12T05:30:29.936Z] 	at org.mozilla.javascript.ContextFactory.doTopCall(ContextFactory.java:394)
00:30:29 [2022-02-12T05:30:29.936Z] 	at org.mozilla.javascript.ScriptRuntime.doTopCall(ScriptRuntime.java:3091)
00:30:29 [2022-02-12T05:30:29.936Z] 	at org.mozilla.javascript.InterpretedFunction.exec(InterpretedFunction.java:120)
00:30:29 [2022-02-12T05:30:29.936Z] 	at org.mozilla.javascript.Context.evaluateReader(Context.java:1110)
00:30:29 [2022-02-12T05:30:29.936Z] 	at org.eclipse.ease.lang.javascript.rhino.RhinoScriptEngine.internalExecute(RhinoScriptEngine.java:226)
00:30:29 [2022-02-12T05:30:29.936Z] 	at org.eclipse.ease.lang.javascript.rhino.RhinoScriptEngine.execute(RhinoScriptEngine.java:205)
00:30:29 [2022-02-12T05:30:29.936Z] 	at org.eclipse.ease.AbstractScriptEngine.inject(AbstractScriptEngine.java:190)
00:30:29 [2022-02-12T05:30:29.936Z] 	at org.eclipse.ease.AbstractScriptEngine.run(AbstractScriptEngine.java:243)
00:30:29 [2022-02-12T05:30:29.936Z] 	at org.eclipse.core.internal.jobs.Worker.run(Worker.java:63)
00:30:29 [2022-02-12T05:30:29.936Z] org.eclipse.ease.ScriptExecutionException: TypeError: Cannot call method "substr" of null
00:30:29 [2022-02-12T05:30:29.936Z] 	at mainFile.js,throwOnNull():4
00:30:29 [2022-02-12T05:30:29.936Z] 	at includeFile.js,subCall():2
00:30:29 [2022-02-12T05:30:29.936Z] 	at mainFile.js:7
00:30:29 [2022-02-12T05:30:29.936Z] Tests run: 12, Failures: 0, Errors: 0, Skipped: 0, Time elapsed: 0.527 s - in org.eclipse.ease.lang.javascript.rhino.RhinoDebuggerEngineTest
00:30:29 [2022-02-12T05:30:29.936Z] execute_java_class_instantiation  Time elapsed: 0.162 s
00:30:29 [2022-02-12T05:30:29.936Z] execute_environment_module_code_with_optional_parameters  Time elapsed: 0.045 s
00:30:29 [2022-02-12T05:30:29.936Z] execute_throws_java_exception  Time elapsed: 0.021 s
00:30:29 [2022-02-12T05:30:29.936Z] execute_throws_java_class  Time elapsed: 0.025 s
00:30:29 [2022-02-12T05:30:29.936Z] execute_javascript_assignment  Time elapsed: 0.049 s
00:30:29 [2022-02-12T05:30:29.936Z] execute_eclipse_class_instantiation  Time elapsed: 0.03 s
00:30:29 [2022-02-12T05:30:29.936Z] execute_throws_javascript_object  Time elapsed: 0.063 s
00:30:29 [2022-02-12T05:30:29.936Z] execute_throws_syntax_error  Time elapsed: 0.021 s
00:30:29 [2022-02-12T05:30:29.936Z] execute_throws_javascript_runtime_error  Time elapsed: 0.019 s
00:30:29 [2022-02-12T05:30:29.936Z] execute_environment_module_code  Time elapsed: 0.013 s
00:30:29 [2022-02-12T05:30:29.936Z] execute_throws_wrapped_java_exception  Time elapsed: 0.053 s
00:30:29 [2022-02-12T05:30:29.936Z] getExceptionStackTrace_returns_script_trace_over_multiple_files  Time elapsed: 0.02 s
00:30:29 [2022-02-12T05:30:29.936Z] Running org.eclipse.ease.lang.javascript.rhino.RhinoDebugTest
00:30:30 [2022-02-12T05:30:30.192Z] Start of script
00:30:30 [2022-02-12T05:30:30.192Z] include file start
00:30:30 [2022-02-12T05:30:30.192Z] Include file processed
00:30:30 [2022-02-12T05:30:30.192Z] line after include file
00:30:30 [2022-02-12T05:30:30.192Z] Result of testMethod = 5
00:30:30 [2022-02-12T05:30:30.192Z] End of script
00:30:30 [2022-02-12T05:30:30.448Z] Start of script
00:30:30 [2022-02-12T05:30:30.448Z] include file start
00:30:30 [2022-02-12T05:30:30.448Z] Include file processed
00:30:30 [2022-02-12T05:30:30.448Z] line after include file
00:30:30 [2022-02-12T05:30:30.448Z] Result of testMethod = 5
00:30:30 [2022-02-12T05:30:30.448Z] End of script
00:30:30 [2022-02-12T05:30:30.448Z] Start of script
00:30:30 [2022-02-12T05:30:30.448Z] include file start
00:30:30 [2022-02-12T05:30:30.448Z] Include file processed
00:30:30 [2022-02-12T05:30:30.448Z] line after include file
00:30:30 [2022-02-12T05:30:30.448Z] Result of testMethod = 5
00:30:30 [2022-02-12T05:30:30.705Z] org.eclipse.ease.ScriptEngineCancellationException: Terminated on user request
00:30:30 [2022-02-12T05:30:30.705Z] 	at org.eclipse.ease.debugging.AbstractEaseDebugger.handleEventsInSuspendedState(AbstractEaseDebugger.java:331)
00:30:30 [2022-02-12T05:30:30.705Z] 	at org.eclipse.ease.debugging.AbstractEaseDebugger.suspend(AbstractEaseDebugger.java:257)
00:30:30 [2022-02-12T05:30:30.705Z] 	at org.eclipse.ease.debugging.AbstractEaseDebugger.processLine(AbstractEaseDebugger.java:492)
00:30:30 [2022-02-12T05:30:30.705Z] 	at org.eclipse.ease.lang.javascript.rhino.debugger.RhinoDebugger.access$4(RhinoDebugger.java:1)
00:30:30 [2022-02-12T05:30:30.705Z] 	at org.eclipse.ease.lang.javascript.rhino.debugger.RhinoDebugger$RhinoDebugFrame.onLineChange(RhinoDebugger.java:124)
00:30:30 [2022-02-12T05:30:30.705Z] 	at org.mozilla.javascript.Interpreter.interpretLoop(Interpreter.java:1824)
00:30:30 [2022-02-12T05:30:30.705Z] 	at org.mozilla.javascript.Interpreter.interpret(Interpreter.java:815)
00:30:30 [2022-02-12T05:30:30.705Z] 	at org.mozilla.javascript.InterpretedFunction.call(InterpretedFunction.java:109)
00:30:30 [2022-02-12T05:30:30.705Z] 	at org.mozilla.javascript.ContextFactory.doTopCall(ContextFactory.java:394)
00:30:30 [2022-02-12T05:30:30.705Z] 	at org.mozilla.javascript.ScriptRuntime.doTopCall(ScriptRuntime.java:3091)
00:30:30 [2022-02-12T05:30:30.705Z] 	at org.mozilla.javascript.InterpretedFunction.exec(InterpretedFunction.java:120)
00:30:30 [2022-02-12T05:30:30.705Z] 	at org.mozilla.javascript.Context.evaluateReader(Context.java:1110)
00:30:30 [2022-02-12T05:30:30.705Z] 	at org.eclipse.ease.lang.javascript.rhino.RhinoScriptEngine.internalExecute(RhinoScriptEngine.java:226)
00:30:30 [2022-02-12T05:30:30.705Z] 	at org.eclipse.ease.lang.javascript.rhino.RhinoScriptEngine.execute(RhinoScriptEngine.java:205)
00:30:30 [2022-02-12T05:30:30.705Z] 	at org.eclipse.ease.AbstractScriptEngine.inject(AbstractScriptEngine.java:190)
00:30:30 [2022-02-12T05:30:30.705Z] 	at org.eclipse.ease.AbstractScriptEngine.run(AbstractScriptEngine.java:243)
00:30:30 [2022-02-12T05:30:30.705Z] 	at org.eclipse.core.internal.jobs.Worker.run(Worker.java:63)
00:30:30 [2022-02-12T05:30:30.962Z] Start of script
00:30:30 [2022-02-12T05:30:30.962Z] include file start
00:30:30 [2022-02-12T05:30:30.962Z] Include file processed
00:30:30 [2022-02-12T05:30:30.962Z] line after include file
00:30:30 [2022-02-12T05:30:30.962Z] Result of testMethod = 5
00:30:30 [2022-02-12T05:30:30.962Z] End of script
00:30:31 [2022-02-12T05:30:31.218Z] Start of script
00:30:31 [2022-02-12T05:30:31.218Z] include file start
00:30:31 [2022-02-12T05:30:31.218Z] Include file processed
00:30:31 [2022-02-12T05:30:31.218Z] line after include file
00:30:31 [2022-02-12T05:30:31.218Z] Result of testMethod = 5
00:30:31 [2022-02-12T05:30:31.218Z] End of script
00:30:31 [2022-02-12T05:30:31.476Z] Start of script
00:30:31 [2022-02-12T05:30:31.476Z] include file start
00:30:31 [2022-02-12T05:30:31.476Z] Include file processed
00:30:31 [2022-02-12T05:30:31.476Z] line after include file
00:30:31 [2022-02-12T05:30:31.476Z] Result of testMethod = 5
00:30:31 [2022-02-12T05:30:31.476Z] End of script
00:30:31 [2022-02-12T05:30:31.734Z] Start of script
00:30:31 [2022-02-12T05:30:31.734Z] include file start
00:30:31 [2022-02-12T05:30:31.734Z] Include file processed
00:30:31 [2022-02-12T05:30:31.734Z] line after include file
00:30:31 [2022-02-12T05:30:31.734Z] Result of testMethod = 5
00:30:31 [2022-02-12T05:30:31.991Z] org.eclipse.ease.ScriptEngineCancellationException: Terminated on user request
00:30:31 [2022-02-12T05:30:31.991Z] 	at org.eclipse.ease.debugging.AbstractEaseDebugger.handleEventsInSuspendedState(AbstractEaseDebugger.java:331)
00:30:31 [2022-02-12T05:30:31.991Z] 	at org.eclipse.ease.debugging.AbstractEaseDebugger.suspend(AbstractEaseDebugger.java:257)
00:30:31 [2022-02-12T05:30:31.991Z] 	at org.eclipse.ease.debugging.AbstractEaseDebugger.processLine(AbstractEaseDebugger.java:492)
00:30:31 [2022-02-12T05:30:31.991Z] 	at org.eclipse.ease.lang.javascript.rhino.debugger.RhinoDebugger.access$4(RhinoDebugger.java:1)
00:30:31 [2022-02-12T05:30:31.991Z] 	at org.eclipse.ease.lang.javascript.rhino.debugger.RhinoDebugger$RhinoDebugFrame.onLineChange(RhinoDebugger.java:124)
00:30:31 [2022-02-12T05:30:31.991Z] 	at org.mozilla.javascript.Interpreter.interpretLoop(Interpreter.java:1824)
00:30:31 [2022-02-12T05:30:31.991Z] 	at org.mozilla.javascript.Interpreter.interpret(Interpreter.java:815)
00:30:31 [2022-02-12T05:30:31.991Z] 	at org.mozilla.javascript.InterpretedFunction.call(InterpretedFunction.java:109)
00:30:31 [2022-02-12T05:30:31.991Z] 	at org.mozilla.javascript.ContextFactory.doTopCall(ContextFactory.java:394)
00:30:31 [2022-02-12T05:30:31.991Z] 	at org.mozilla.javascript.ScriptRuntime.doTopCall(ScriptRuntime.java:3091)
00:30:31 [2022-02-12T05:30:31.991Z] 	at org.mozilla.javascript.InterpretedFunction.exec(InterpretedFunction.java:120)
00:30:31 [2022-02-12T05:30:31.991Z] 	at org.mozilla.javascript.Context.evaluateReader(Context.java:1110)
00:30:31 [2022-02-12T05:30:31.991Z] 	at org.eclipse.ease.lang.javascript.rhino.RhinoScriptEngine.internalExecute(RhinoScriptEngine.java:226)
00:30:31 [2022-02-12T05:30:31.991Z] 	at org.eclipse.ease.lang.javascript.rhino.RhinoScriptEngine.execute(RhinoScriptEngine.java:205)
00:30:31 [2022-02-12T05:30:31.991Z] 	at org.eclipse.ease.AbstractScriptEngine.inject(AbstractScriptEngine.java:190)
00:30:31 [2022-02-12T05:30:31.991Z] 	at org.eclipse.ease.AbstractScriptEngine.run(AbstractScriptEngine.java:243)
00:30:31 [2022-02-12T05:30:31.991Z] 	at org.eclipse.core.internal.jobs.Worker.run(Worker.java:63)
00:30:31 [2022-02-12T05:30:31.991Z] Start of script
00:30:31 [2022-02-12T05:30:31.991Z] include file start
00:30:31 [2022-02-12T05:30:31.991Z] Include file processed
00:30:31 [2022-02-12T05:30:31.991Z] line after include file
00:30:32 [2022-02-12T05:30:32.248Z] Result of testMethod = 5
00:30:32 [2022-02-12T05:30:32.248Z] End of script
00:30:32 [2022-02-12T05:30:32.248Z] Start of script
00:30:32 [2022-02-12T05:30:32.248Z] include file start
00:30:32 [2022-02-12T05:30:32.248Z] Include file processed
00:30:32 [2022-02-12T05:30:32.248Z] line after include file
00:30:32 [2022-02-12T05:30:32.248Z] Result of testMethod = 5
00:30:32 [2022-02-12T05:30:32.504Z] End of script
00:30:32 [2022-02-12T05:30:32.504Z] Start of script
00:30:32 [2022-02-12T05:30:32.504Z] include file start
00:30:32 [2022-02-12T05:30:32.504Z] Include file processed
00:30:32 [2022-02-12T05:30:32.504Z] line after include file
00:30:32 [2022-02-12T05:30:32.760Z] org.eclipse.ease.ScriptEngineCancellationException: Terminated on user request
00:30:32 [2022-02-12T05:30:32.760Z] 	at org.eclipse.ease.debugging.AbstractEaseDebugger.handleEventsInSuspendedState(AbstractEaseDebugger.java:331)
00:30:32 [2022-02-12T05:30:32.760Z] 	at org.eclipse.ease.debugging.AbstractEaseDebugger.suspend(AbstractEaseDebugger.java:257)
00:30:32 [2022-02-12T05:30:32.760Z] 	at org.eclipse.ease.debugging.AbstractEaseDebugger.processLine(AbstractEaseDebugger.java:512)
00:30:32 [2022-02-12T05:30:32.760Z] 	at org.eclipse.ease.lang.javascript.rhino.debugger.RhinoDebugger.access$4(RhinoDebugger.java:1)
00:30:32 [2022-02-12T05:30:32.760Z] 	at org.eclipse.ease.lang.javascript.rhino.debugger.RhinoDebugger$RhinoDebugFrame.onLineChange(RhinoDebugger.java:124)
00:30:32 [2022-02-12T05:30:32.760Z] 	at org.mozilla.javascript.Interpreter.interpretLoop(Interpreter.java:1824)
00:30:32 [2022-02-12T05:30:32.760Z] 	at org.mozilla.javascript.Interpreter.interpret(Interpreter.java:815)
00:30:32 [2022-02-12T05:30:32.760Z] 	at org.mozilla.javascript.InterpretedFunction.call(InterpretedFunction.java:109)
00:30:32 [2022-02-12T05:30:32.760Z] 	at org.mozilla.javascript.ContextFactory.doTopCall(ContextFactory.java:394)
00:30:32 [2022-02-12T05:30:32.760Z] 	at org.mozilla.javascript.ScriptRuntime.doTopCall(ScriptRuntime.java:3091)
00:30:32 [2022-02-12T05:30:32.760Z] 	at org.mozilla.javascript.InterpretedFunction.exec(InterpretedFunction.java:120)
00:30:32 [2022-02-12T05:30:32.760Z] 	at org.mozilla.javascript.Context.evaluateReader(Context.java:1110)
00:30:32 [2022-02-12T05:30:32.760Z] 	at org.eclipse.ease.lang.javascript.rhino.RhinoScriptEngine.internalExecute(RhinoScriptEngine.java:226)
00:30:32 [2022-02-12T05:30:32.760Z] 	at org.eclipse.ease.lang.javascript.rhino.RhinoScriptEngine.execute(RhinoScriptEngine.java:205)
00:30:32 [2022-02-12T05:30:32.760Z] 	at org.eclipse.ease.AbstractScriptEngine.inject(AbstractScriptEngine.java:190)
00:30:32 [2022-02-12T05:30:32.760Z] 	at org.eclipse.ease.AbstractScriptEngine.run(AbstractScriptEngine.java:243)
00:30:32 [2022-02-12T05:30:32.760Z] 	at org.eclipse.core.internal.jobs.Worker.run(Worker.java:63)
00:30:33 [2022-02-12T05:30:33.016Z] Start of script
00:30:33 [2022-02-12T05:30:33.016Z] include file start
00:30:33 [2022-02-12T05:30:33.016Z] Include file processed
00:30:33 [2022-02-12T05:30:33.016Z] line after include file
00:30:33 [2022-02-12T05:30:33.016Z] Result of testMethod = 5
00:30:33 [2022-02-12T05:30:33.016Z] End of script
00:30:33 [2022-02-12T05:30:33.016Z] Start of script
00:30:33 [2022-02-12T05:30:33.016Z] include file start
00:30:33 [2022-02-12T05:30:33.016Z] Include file processed
00:30:33 [2022-02-12T05:30:33.016Z] line after include file
00:30:33 [2022-02-12T05:30:33.273Z] Result of testMethod = 5
00:30:33 [2022-02-12T05:30:33.273Z] End of script
00:30:33 [2022-02-12T05:30:33.531Z] org.eclipse.ease.ScriptEngineCancellationException: Terminated on user request
00:30:33 [2022-02-12T05:30:33.531Z] 	at org.eclipse.ease.debugging.AbstractEaseDebugger.handleEventsInSuspendedState(AbstractEaseDebugger.java:331)
00:30:33 [2022-02-12T05:30:33.531Z] 	at org.eclipse.ease.debugging.AbstractEaseDebugger.suspend(AbstractEaseDebugger.java:257)
00:30:33 [2022-02-12T05:30:33.531Z] 	at org.eclipse.ease.debugging.AbstractEaseDebugger.processLine(AbstractEaseDebugger.java:492)
00:30:33 [2022-02-12T05:30:33.531Z] 	at org.eclipse.ease.lang.javascript.rhino.debugger.RhinoDebugger.access$4(RhinoDebugger.java:1)
00:30:33 [2022-02-12T05:30:33.531Z] 	at org.eclipse.ease.lang.javascript.rhino.debugger.RhinoDebugger$RhinoDebugFrame.onLineChange(RhinoDebugger.java:124)
00:30:33 [2022-02-12T05:30:33.531Z] 	at org.mozilla.javascript.Interpreter.interpretLoop(Interpreter.java:1824)
00:30:33 [2022-02-12T05:30:33.531Z] 	at org.mozilla.javascript.Interpreter.interpret(Interpreter.java:815)
00:30:33 [2022-02-12T05:30:33.531Z] 	at org.mozilla.javascript.InterpretedFunction.call(InterpretedFunction.java:109)
00:30:33 [2022-02-12T05:30:33.531Z] 	at org.mozilla.javascript.ContextFactory.doTopCall(ContextFactory.java:394)
00:30:33 [2022-02-12T05:30:33.531Z] 	at org.mozilla.javascript.ScriptRuntime.doTopCall(ScriptRuntime.java:3091)
00:30:33 [2022-02-12T05:30:33.531Z] 	at org.mozilla.javascript.InterpretedFunction.exec(InterpretedFunction.java:120)
00:30:33 [2022-02-12T05:30:33.531Z] 	at org.mozilla.javascript.Context.evaluateReader(Context.java:1110)
00:30:33 [2022-02-12T05:30:33.531Z] 	at org.eclipse.ease.lang.javascript.rhino.RhinoScriptEngine.internalExecute(RhinoScriptEngine.java:226)
00:30:33 [2022-02-12T05:30:33.531Z] 	at org.eclipse.ease.lang.javascript.rhino.RhinoScriptEngine.execute(RhinoScriptEngine.java:205)
00:30:33 [2022-02-12T05:30:33.531Z] 	at org.eclipse.ease.AbstractScriptEngine.inject(AbstractScriptEngine.java:190)
00:30:33 [2022-02-12T05:30:33.531Z] 	at org.eclipse.ease.AbstractScriptEngine.run(AbstractScriptEngine.java:243)
00:30:33 [2022-02-12T05:30:33.531Z] 	at org.eclipse.core.internal.jobs.Worker.run(Worker.java:63)
00:30:33 [2022-02-12T05:30:33.798Z] Start of script
00:30:33 [2022-02-12T05:30:33.798Z] include file start
00:30:33 [2022-02-12T05:30:33.798Z] Include file processed
00:30:33 [2022-02-12T05:30:33.798Z] line after include file
00:30:33 [2022-02-12T05:30:33.798Z] Result of testMethod = 5
00:30:33 [2022-02-12T05:30:33.798Z] End of script
00:30:33 [2022-02-12T05:30:33.798Z] Start of script
00:30:33 [2022-02-12T05:30:33.798Z] include file start
00:30:33 [2022-02-12T05:30:33.798Z] Include file processed
00:30:33 [2022-02-12T05:30:33.798Z] line after include file
00:30:34 [2022-02-12T05:30:34.068Z] Result of testMethod = 5
00:30:34 [2022-02-12T05:30:34.068Z] End of script
00:30:34 [2022-02-12T05:30:34.068Z] Start of script
00:30:34 [2022-02-12T05:30:34.068Z] include file start
00:30:34 [2022-02-12T05:30:34.068Z] Include file processed
00:30:34 [2022-02-12T05:30:34.068Z] line after include file
00:30:34 [2022-02-12T05:30:34.068Z] Result of testMethod = 5
00:30:34 [2022-02-12T05:30:34.324Z] org.eclipse.ease.ScriptEngineCancellationException: Terminated on user request
00:30:34 [2022-02-12T05:30:34.324Z] 	at org.eclipse.ease.debugging.AbstractEaseDebugger.handleEventsInSuspendedState(AbstractEaseDebugger.java:331)
00:30:34 [2022-02-12T05:30:34.324Z] 	at org.eclipse.ease.debugging.AbstractEaseDebugger.suspend(AbstractEaseDebugger.java:257)
00:30:34 [2022-02-12T05:30:34.324Z] 	at org.eclipse.ease.debugging.AbstractEaseDebugger.processLine(AbstractEaseDebugger.java:492)
00:30:34 [2022-02-12T05:30:34.324Z] 	at org.eclipse.ease.lang.javascript.rhino.debugger.RhinoDebugger.access$4(RhinoDebugger.java:1)
00:30:34 [2022-02-12T05:30:34.325Z] 	at org.eclipse.ease.lang.javascript.rhino.debugger.RhinoDebugger$RhinoDebugFrame.onLineChange(RhinoDebugger.java:124)
00:30:34 [2022-02-12T05:30:34.325Z] 	at org.mozilla.javascript.Interpreter.interpretLoop(Interpreter.java:1824)
00:30:34 [2022-02-12T05:30:34.325Z] 	at org.mozilla.javascript.Interpreter.interpret(Interpreter.java:815)
00:30:34 [2022-02-12T05:30:34.325Z] 	at org.mozilla.javascript.InterpretedFunction.call(InterpretedFunction.java:109)
00:30:34 [2022-02-12T05:30:34.325Z] 	at org.mozilla.javascript.ContextFactory.doTopCall(ContextFactory.java:394)
00:30:34 [2022-02-12T05:30:34.325Z] 	at org.mozilla.javascript.ScriptRuntime.doTopCall(ScriptRuntime.java:3091)
00:30:34 [2022-02-12T05:30:34.325Z] 	at org.mozilla.javascript.InterpretedFunction.exec(InterpretedFunction.java:120)
00:30:34 [2022-02-12T05:30:34.325Z] 	at org.mozilla.javascript.Context.evaluateReader(Context.java:1110)
00:30:34 [2022-02-12T05:30:34.325Z] 	at org.eclipse.ease.lang.javascript.rhino.RhinoScriptEngine.internalExecute(RhinoScriptEngine.java:226)
00:30:34 [2022-02-12T05:30:34.325Z] 	at org.eclipse.ease.lang.javascript.rhino.RhinoScriptEngine.execute(RhinoScriptEngine.java:205)
00:30:34 [2022-02-12T05:30:34.325Z] 	at org.eclipse.ease.AbstractScriptEngine.inject(AbstractScriptEngine.java:190)
00:30:34 [2022-02-12T05:30:34.325Z] 	at org.eclipse.ease.AbstractScriptEngine.run(AbstractScriptEngine.java:243)
00:30:34 [2022-02-12T05:30:34.325Z] 	at org.eclipse.core.internal.jobs.Worker.run(Worker.java:63)
00:30:34 [2022-02-12T05:30:34.581Z] Start of script
00:30:34 [2022-02-12T05:30:34.581Z] include file start
00:30:34 [2022-02-12T05:30:34.581Z] Include file processed
00:30:34 [2022-02-12T05:30:34.581Z] line after include file
00:30:34 [2022-02-12T05:30:34.581Z] Result of testMethod = 5
00:30:34 [2022-02-12T05:30:34.581Z] End of script
00:30:34 [2022-02-12T05:30:34.838Z] org.eclipse.ease.ScriptEngineCancellationException: Terminated on user request
00:30:34 [2022-02-12T05:30:34.838Z] 	at org.eclipse.ease.debugging.AbstractEaseDebugger.handleEventsInSuspendedState(AbstractEaseDebugger.java:331)
00:30:34 [2022-02-12T05:30:34.838Z] 	at org.eclipse.ease.debugging.AbstractEaseDebugger.suspend(AbstractEaseDebugger.java:257)
00:30:34 [2022-02-12T05:30:34.838Z] 	at org.eclipse.ease.debugging.AbstractEaseDebugger.processLine(AbstractEaseDebugger.java:492)
00:30:34 [2022-02-12T05:30:34.838Z] 	at org.eclipse.ease.lang.javascript.rhino.debugger.RhinoDebugger.access$4(RhinoDebugger.java:1)
00:30:34 [2022-02-12T05:30:34.838Z] 	at org.eclipse.ease.lang.javascript.rhino.debugger.RhinoDebugger$RhinoDebugFrame.onLineChange(RhinoDebugger.java:124)
00:30:34 [2022-02-12T05:30:34.838Z] 	at org.mozilla.javascript.Interpreter.interpretLoop(Interpreter.java:1824)
00:30:34 [2022-02-12T05:30:34.838Z] 	at org.mozilla.javascript.Interpreter.interpret(Interpreter.java:815)
00:30:34 [2022-02-12T05:30:34.838Z] 	at org.mozilla.javascript.InterpretedFunction.call(InterpretedFunction.java:109)
00:30:34 [2022-02-12T05:30:34.838Z] 	at org.mozilla.javascript.ContextFactory.doTopCall(ContextFactory.java:394)
00:30:34 [2022-02-12T05:30:34.838Z] 	at org.mozilla.javascript.ScriptRuntime.doTopCall(ScriptRuntime.java:3091)
00:30:34 [2022-02-12T05:30:34.838Z] 	at org.mozilla.javascript.InterpretedFunction.exec(InterpretedFunction.java:120)
00:30:34 [2022-02-12T05:30:34.838Z] 	at org.mozilla.javascript.Context.evaluateReader(Context.java:1110)
00:30:34 [2022-02-12T05:30:34.838Z] 	at org.eclipse.ease.lang.javascript.rhino.RhinoScriptEngine.internalExecute(RhinoScriptEngine.java:226)
00:30:34 [2022-02-12T05:30:34.838Z] 	at org.eclipse.ease.lang.javascript.rhino.RhinoScriptEngine.execute(RhinoScriptEngine.java:205)
00:30:34 [2022-02-12T05:30:34.838Z] 	at org.eclipse.ease.AbstractScriptEngine.inject(AbstractScriptEngine.java:190)
00:30:34 [2022-02-12T05:30:34.838Z] 	at org.eclipse.ease.AbstractScriptEngine.run(AbstractScriptEngine.java:243)
00:30:34 [2022-02-12T05:30:34.838Z] 	at org.eclipse.core.internal.jobs.Worker.run(Worker.java:63)
00:30:35 [2022-02-12T05:30:35.095Z] Start of script
00:30:35 [2022-02-12T05:30:35.095Z] include file start
00:30:35 [2022-02-12T05:30:35.095Z] Include file processed
00:30:35 [2022-02-12T05:30:35.095Z] line after include file
00:30:35 [2022-02-12T05:30:35.095Z] Result of testMethod = 5
00:30:35 [2022-02-12T05:30:35.095Z] End of script
00:30:35 [2022-02-12T05:30:35.095Z] Start of script
00:30:35 [2022-02-12T05:30:35.095Z] include file start
00:30:35 [2022-02-12T05:30:35.095Z] Include file processed
00:30:35 [2022-02-12T05:30:35.095Z] line after include file
00:30:35 [2022-02-12T05:30:35.352Z] Result of testMethod = 5
00:30:35 [2022-02-12T05:30:35.352Z] End of script
00:30:35 [2022-02-12T05:30:35.608Z] org.eclipse.ease.ScriptEngineCancellationException: Terminated on user request
00:30:35 [2022-02-12T05:30:35.608Z] 	at org.eclipse.ease.debugging.AbstractEaseDebugger.handleEventsInSuspendedState(AbstractEaseDebugger.java:331)
00:30:35 [2022-02-12T05:30:35.608Z] 	at org.eclipse.ease.debugging.AbstractEaseDebugger.suspend(AbstractEaseDebugger.java:257)
00:30:35 [2022-02-12T05:30:35.608Z] 	at org.eclipse.ease.debugging.AbstractEaseDebugger.processLine(AbstractEaseDebugger.java:492)
00:30:35 [2022-02-12T05:30:35.608Z] 	at org.eclipse.ease.lang.javascript.rhino.debugger.RhinoDebugger.access$4(RhinoDebugger.java:1)
00:30:35 [2022-02-12T05:30:35.608Z] 	at org.eclipse.ease.lang.javascript.rhino.debugger.RhinoDebugger$RhinoDebugFrame.onLineChange(RhinoDebugger.java:124)
00:30:35 [2022-02-12T05:30:35.608Z] 	at org.mozilla.javascript.Interpreter.interpretLoop(Interpreter.java:1824)
00:30:35 [2022-02-12T05:30:35.608Z] 	at org.mozilla.javascript.Interpreter.interpret(Interpreter.java:815)
00:30:35 [2022-02-12T05:30:35.608Z] 	at org.mozilla.javascript.InterpretedFunction.call(InterpretedFunction.java:109)
00:30:35 [2022-02-12T05:30:35.608Z] 	at org.mozilla.javascript.ContextFactory.doTopCall(ContextFactory.java:394)
00:30:35 [2022-02-12T05:30:35.608Z] 	at org.mozilla.javascript.ScriptRuntime.doTopCall(ScriptRuntime.java:3091)
00:30:35 [2022-02-12T05:30:35.608Z] 	at org.mozilla.javascript.InterpretedFunction.exec(InterpretedFunction.java:120)
00:30:35 [2022-02-12T05:30:35.608Z] 	at org.mozilla.javascript.Context.evaluateReader(Context.java:1110)
00:30:35 [2022-02-12T05:30:35.608Z] 	at org.eclipse.ease.lang.javascript.rhino.RhinoScriptEngine.internalExecute(RhinoScriptEngine.java:226)
00:30:35 [2022-02-12T05:30:35.608Z] 	at org.eclipse.ease.lang.javascript.rhino.RhinoScriptEngine.execute(RhinoScriptEngine.java:205)
00:30:35 [2022-02-12T05:30:35.608Z] 	at org.eclipse.ease.AbstractScriptEngine.inject(AbstractScriptEngine.java:190)
00:30:35 [2022-02-12T05:30:35.608Z] 	at org.eclipse.ease.AbstractScriptEngine.run(AbstractScriptEngine.java:243)
00:30:35 [2022-02-12T05:30:35.608Z] 	at org.eclipse.core.internal.jobs.Worker.run(Worker.java:63)
00:30:35 [2022-02-12T05:30:35.608Z] Start of script
00:30:35 [2022-02-12T05:30:35.608Z] include file start
00:30:35 [2022-02-12T05:30:35.608Z] Include file processed
00:30:35 [2022-02-12T05:30:35.608Z] line after include file
00:30:35 [2022-02-12T05:30:35.865Z] Result of testMethod = 5
00:30:35 [2022-02-12T05:30:35.865Z] End of script
00:30:36 [2022-02-12T05:30:36.121Z] Start of script
00:30:36 [2022-02-12T05:30:36.121Z] include file start
00:30:36 [2022-02-12T05:30:36.121Z] Include file processed
00:30:36 [2022-02-12T05:30:36.121Z] line after include file
00:30:36 [2022-02-12T05:30:36.121Z] Result of testMethod = 5
00:30:36 [2022-02-12T05:30:36.121Z] WARNING: An illegal reflective access operation has occurred
00:30:36 [2022-02-12T05:30:36.121Z] WARNING: Illegal reflective access by org.eclipse.ease.debugging.model.EaseDebugValue (file:/home/jenkins/.m2/repository/org/eclipse/ease/org.eclipse.ease/0.9.0-SNAPSHOT/org.eclipse.ease-0.9.0-SNAPSHOT.jar) to field java.lang.String.hash
00:30:36 [2022-02-12T05:30:36.121Z] WARNING: Please consider reporting this to the maintainers of org.eclipse.ease.debugging.model.EaseDebugValue
00:30:36 [2022-02-12T05:30:36.121Z] WARNING: Use --illegal-access=warn to enable warnings of further illegal reflective access operations
00:30:36 [2022-02-12T05:30:36.121Z] WARNING: All illegal access operations will be denied in a future release
00:30:36 [2022-02-12T05:30:36.121Z] org.eclipse.ease.ScriptEngineCancellationException: Terminated on user request
00:30:36 [2022-02-12T05:30:36.121Z] 	at org.eclipse.ease.debugging.AbstractEaseDebugger.handleEventsInSuspendedState(AbstractEaseDebugger.java:331)
00:30:36 [2022-02-12T05:30:36.121Z] 	at org.eclipse.ease.debugging.AbstractEaseDebugger.suspend(AbstractEaseDebugger.java:257)
00:30:36 [2022-02-12T05:30:36.121Z] 	at org.eclipse.ease.debugging.AbstractEaseDebugger.processLine(AbstractEaseDebugger.java:492)
00:30:36 [2022-02-12T05:30:36.121Z] 	at org.eclipse.ease.lang.javascript.rhino.debugger.RhinoDebugger.access$4(RhinoDebugger.java:1)
00:30:36 [2022-02-12T05:30:36.121Z] 	at org.eclipse.ease.lang.javascript.rhino.debugger.RhinoDebugger$RhinoDebugFrame.onLineChange(RhinoDebugger.java:124)
00:30:36 [2022-02-12T05:30:36.121Z] 	at org.mozilla.javascript.Interpreter.interpretLoop(Interpreter.java:1824)
00:30:36 [2022-02-12T05:30:36.121Z] 	at org.mozilla.javascript.Interpreter.interpret(Interpreter.java:815)
00:30:36 [2022-02-12T05:30:36.121Z] 	at org.mozilla.javascript.InterpretedFunction.call(InterpretedFunction.java:109)
00:30:36 [2022-02-12T05:30:36.121Z] 	at org.mozilla.javascript.ContextFactory.doTopCall(ContextFactory.java:394)
00:30:36 [2022-02-12T05:30:36.121Z] 	at org.mozilla.javascript.ScriptRuntime.doTopCall(ScriptRuntime.java:3091)
00:30:36 [2022-02-12T05:30:36.121Z] 	at org.mozilla.javascript.InterpretedFunction.exec(InterpretedFunction.java:120)
00:30:36 [2022-02-12T05:30:36.121Z] 	at org.mozilla.javascript.Context.evaluateReader(Context.java:1110)
00:30:36 [2022-02-12T05:30:36.121Z] 	at org.eclipse.ease.lang.javascript.rhino.RhinoScriptEngine.internalExecute(RhinoScriptEngine.java:226)
00:30:36 [2022-02-12T05:30:36.121Z] 	at org.eclipse.ease.lang.javascript.rhino.RhinoScriptEngine.execute(RhinoScriptEngine.java:205)
00:30:36 [2022-02-12T05:30:36.121Z] 	at org.eclipse.ease.AbstractScriptEngine.inject(AbstractScriptEngine.java:190)
00:30:36 [2022-02-12T05:30:36.121Z] 	at org.eclipse.ease.AbstractScriptEngine.run(AbstractScriptEngine.java:243)
00:30:36 [2022-02-12T05:30:36.121Z] 	at org.eclipse.core.internal.jobs.Worker.run(Worker.java:63)
00:30:36 [2022-02-12T05:30:36.378Z] Start of script
00:30:36 [2022-02-12T05:30:36.378Z] include file start
00:30:36 [2022-02-12T05:30:36.378Z] Include file processed
00:30:36 [2022-02-12T05:30:36.378Z] line after include file
00:30:36 [2022-02-12T05:30:36.378Z] Result of testMethod = 5
00:30:36 [2022-02-12T05:30:36.378Z] End of script
00:30:36 [2022-02-12T05:30:36.635Z] Start of script
00:30:36 [2022-02-12T05:30:36.635Z] include file start
00:30:36 [2022-02-12T05:30:36.635Z] Include file processed
00:30:36 [2022-02-12T05:30:36.635Z] line after include file
00:30:36 [2022-02-12T05:30:36.635Z] Result of testMethod = 5
00:30:36 [2022-02-12T05:30:36.635Z] End of script
00:30:36 [2022-02-12T05:30:36.891Z] Start of script
00:30:36 [2022-02-12T05:30:36.891Z] include file start
00:30:36 [2022-02-12T05:30:36.891Z] Include file processed
00:30:36 [2022-02-12T05:30:36.891Z] line after include file
00:30:36 [2022-02-12T05:30:36.891Z] Result of testMethod = 5
00:30:36 [2022-02-12T05:30:36.891Z] End of script
00:30:36 [2022-02-12T05:30:36.891Z] Start of script
00:30:37 [2022-02-12T05:30:37.147Z] include file start
00:30:37 [2022-02-12T05:30:37.147Z] Include file processed
00:30:37 [2022-02-12T05:30:37.147Z] line after include file
00:30:37 [2022-02-12T05:30:37.147Z] Result of testMethod = 5
00:30:37 [2022-02-12T05:30:37.147Z] End of script
00:30:37 [2022-02-12T05:30:37.147Z] Start of script
00:30:37 [2022-02-12T05:30:37.147Z] include file start
00:30:37 [2022-02-12T05:30:37.147Z] Include file processed
00:30:37 [2022-02-12T05:30:37.147Z] line after include file
00:30:37 [2022-02-12T05:30:37.404Z] org.eclipse.ease.ScriptEngineCancellationException: Terminated on user request
00:30:37 [2022-02-12T05:30:37.404Z] 	at org.eclipse.ease.debugging.AbstractEaseDebugger.handleEventsInSuspendedState(AbstractEaseDebugger.java:331)
00:30:37 [2022-02-12T05:30:37.404Z] 	at org.eclipse.ease.debugging.AbstractEaseDebugger.suspend(AbstractEaseDebugger.java:257)
00:30:37 [2022-02-12T05:30:37.404Z] 	at org.eclipse.ease.debugging.AbstractEaseDebugger.processLine(AbstractEaseDebugger.java:492)
00:30:37 [2022-02-12T05:30:37.404Z] 	at org.eclipse.ease.lang.javascript.rhino.debugger.RhinoDebugger.access$4(RhinoDebugger.java:1)
00:30:37 [2022-02-12T05:30:37.404Z] 	at org.eclipse.ease.lang.javascript.rhino.debugger.RhinoDebugger$RhinoDebugFrame.onLineChange(RhinoDebugger.java:124)
00:30:37 [2022-02-12T05:30:37.404Z] 	at org.mozilla.javascript.Interpreter.interpretLoop(Interpreter.java:1824)
00:30:37 [2022-02-12T05:30:37.404Z] 	at org.mozilla.javascript.Interpreter.interpret(Interpreter.java:815)
00:30:37 [2022-02-12T05:30:37.404Z] 	at org.mozilla.javascript.InterpretedFunction.call(InterpretedFunction.java:109)
00:30:37 [2022-02-12T05:30:37.404Z] 	at org.mozilla.javascript.ContextFactory.doTopCall(ContextFactory.java:394)
00:30:37 [2022-02-12T05:30:37.404Z] 	at org.mozilla.javascript.ScriptRuntime.doTopCall(ScriptRuntime.java:3091)
00:30:37 [2022-02-12T05:30:37.404Z] 	at org.mozilla.javascript.InterpretedFunction.exec(InterpretedFunction.java:120)
00:30:37 [2022-02-12T05:30:37.404Z] 	at org.mozilla.javascript.Context.evaluateReader(Context.java:1110)
00:30:37 [2022-02-12T05:30:37.404Z] 	at org.eclipse.ease.lang.javascript.rhino.RhinoScriptEngine.internalExecute(RhinoScriptEngine.java:226)
00:30:37 [2022-02-12T05:30:37.404Z] 	at org.eclipse.ease.lang.javascript.rhino.RhinoScriptEngine.execute(RhinoScriptEngine.java:205)
00:30:37 [2022-02-12T05:30:37.404Z] 	at org.eclipse.ease.AbstractScriptEngine.inject(AbstractScriptEngine.java:190)
00:30:37 [2022-02-12T05:30:37.404Z] 	at org.eclipse.ease.AbstractScriptEngine.run(AbstractScriptEngine.java:243)
00:30:37 [2022-02-12T05:30:37.405Z] 	at org.eclipse.core.internal.jobs.Worker.run(Worker.java:63)
00:30:37 [2022-02-12T05:30:37.661Z] Start of script
00:30:37 [2022-02-12T05:30:37.661Z] include file start
00:30:37 [2022-02-12T05:30:37.661Z] Include file processed
00:30:37 [2022-02-12T05:30:37.661Z] line after include file
00:30:37 [2022-02-12T05:30:37.661Z] Result of testMethod = 5
00:30:37 [2022-02-12T05:30:37.661Z] End of script
00:30:37 [2022-02-12T05:30:37.918Z] Start of script
00:30:37 [2022-02-12T05:30:37.918Z] include file start
00:30:37 [2022-02-12T05:30:37.918Z] Include file processed
00:30:37 [2022-02-12T05:30:37.918Z] line after include file
00:30:37 [2022-02-12T05:30:37.918Z] Result of testMethod = 5
00:30:38 [2022-02-12T05:30:38.175Z] org.eclipse.ease.ScriptEngineCancellationException: Terminated on user request
00:30:38 [2022-02-12T05:30:38.175Z] 	at org.eclipse.ease.debugging.AbstractEaseDebugger.handleEventsInSuspendedState(AbstractEaseDebugger.java:331)
00:30:38 [2022-02-12T05:30:38.175Z] 	at org.eclipse.ease.debugging.AbstractEaseDebugger.suspend(AbstractEaseDebugger.java:257)
00:30:38 [2022-02-12T05:30:38.175Z] 	at org.eclipse.ease.debugging.AbstractEaseDebugger.processLine(AbstractEaseDebugger.java:492)
00:30:38 [2022-02-12T05:30:38.175Z] 	at org.eclipse.ease.lang.javascript.rhino.debugger.RhinoDebugger.access$4(RhinoDebugger.java:1)
00:30:38 [2022-02-12T05:30:38.175Z] 	at org.eclipse.ease.lang.javascript.rhino.debugger.RhinoDebugger$RhinoDebugFrame.onLineChange(RhinoDebugger.java:124)
00:30:38 [2022-02-12T05:30:38.175Z] 	at org.mozilla.javascript.Interpreter.interpretLoop(Interpreter.java:1824)
00:30:38 [2022-02-12T05:30:38.175Z] 	at org.mozilla.javascript.Interpreter.interpret(Interpreter.java:815)
00:30:38 [2022-02-12T05:30:38.175Z] 	at org.mozilla.javascript.InterpretedFunction.call(InterpretedFunction.java:109)
00:30:38 [2022-02-12T05:30:38.175Z] 	at org.mozilla.javascript.ContextFactory.doTopCall(ContextFactory.java:394)
00:30:38 [2022-02-12T05:30:38.175Z] 	at org.mozilla.javascript.ScriptRuntime.doTopCall(ScriptRuntime.java:3091)
00:30:38 [2022-02-12T05:30:38.175Z] 	at org.mozilla.javascript.InterpretedFunction.exec(InterpretedFunction.java:120)
00:30:38 [2022-02-12T05:30:38.175Z] 	at org.mozilla.javascript.Context.evaluateReader(Context.java:1110)
00:30:38 [2022-02-12T05:30:38.175Z] 	at org.eclipse.ease.lang.javascript.rhino.RhinoScriptEngine.internalExecute(RhinoScriptEngine.java:226)
00:30:38 [2022-02-12T05:30:38.175Z] 	at org.eclipse.ease.lang.javascript.rhino.RhinoScriptEngine.execute(RhinoScriptEngine.java:205)
00:30:38 [2022-02-12T05:30:38.175Z] 	at org.eclipse.ease.AbstractScriptEngine.inject(AbstractScriptEngine.java:190)
00:30:38 [2022-02-12T05:30:38.175Z] 	at org.eclipse.ease.AbstractScriptEngine.run(AbstractScriptEngine.java:243)
00:30:38 [2022-02-12T05:30:38.175Z] 	at org.eclipse.core.internal.jobs.Worker.run(Worker.java:63)
00:30:38 [2022-02-12T05:30:38.175Z] Start of script
00:30:38 [2022-02-12T05:30:38.176Z] include file start
00:30:38 [2022-02-12T05:30:38.176Z] Include file processed
00:30:38 [2022-02-12T05:30:38.176Z] line after include file
00:30:38 [2022-02-12T05:30:38.176Z] Result of testMethod = 5
00:30:38 [2022-02-12T05:30:38.176Z] End of script
00:30:38 [2022-02-12T05:30:38.433Z] Start of script
00:30:38 [2022-02-12T05:30:38.433Z] include file start
00:30:38 [2022-02-12T05:30:38.433Z] Include file processed
00:30:38 [2022-02-12T05:30:38.433Z] line after include file
00:30:38 [2022-02-12T05:30:38.690Z] Result of testMethod = 5
00:30:38 [2022-02-12T05:30:38.690Z] End of script
00:30:38 [2022-02-12T05:30:38.690Z] Start of script
00:30:38 [2022-02-12T05:30:38.690Z] include file start
00:30:38 [2022-02-12T05:30:38.690Z] Include file processed
00:30:38 [2022-02-12T05:30:38.690Z] line after include file
00:30:38 [2022-02-12T05:30:38.947Z] Result of testMethod = 5
00:30:38 [2022-02-12T05:30:38.947Z] End of script
00:30:38 [2022-02-12T05:30:38.947Z] Start of script
00:30:38 [2022-02-12T05:30:38.947Z] include file start
00:30:38 [2022-02-12T05:30:38.947Z] Include file processed
00:30:38 [2022-02-12T05:30:38.947Z] line after include file
00:30:38 [2022-02-12T05:30:38.947Z] Result of testMethod = 5
00:30:39 [2022-02-12T05:30:39.204Z] End of script
00:30:39 [2022-02-12T05:30:39.204Z] Start of script
00:30:39 [2022-02-12T05:30:39.204Z] include file start
00:30:39 [2022-02-12T05:30:39.204Z] Include file processed
00:30:39 [2022-02-12T05:30:39.204Z] line after include file
00:30:39 [2022-02-12T05:30:39.204Z] Result of testMethod = 5
00:30:39 [2022-02-12T05:30:39.461Z] org.eclipse.ease.ScriptEngineCancellationException: Terminated on user request
00:30:39 [2022-02-12T05:30:39.461Z] 	at org.eclipse.ease.debugging.AbstractEaseDebugger.handleEventsInSuspendedState(AbstractEaseDebugger.java:331)
00:30:39 [2022-02-12T05:30:39.461Z] 	at org.eclipse.ease.debugging.AbstractEaseDebugger.suspend(AbstractEaseDebugger.java:257)
00:30:39 [2022-02-12T05:30:39.461Z] 	at org.eclipse.ease.debugging.AbstractEaseDebugger.processLine(AbstractEaseDebugger.java:492)
00:30:39 [2022-02-12T05:30:39.461Z] 	at org.eclipse.ease.lang.javascript.rhino.debugger.RhinoDebugger.access$4(RhinoDebugger.java:1)
00:30:39 [2022-02-12T05:30:39.461Z] 	at org.eclipse.ease.lang.javascript.rhino.debugger.RhinoDebugger$RhinoDebugFrame.onLineChange(RhinoDebugger.java:124)
00:30:39 [2022-02-12T05:30:39.461Z] 	at org.mozilla.javascript.Interpreter.interpretLoop(Interpreter.java:1824)
00:30:39 [2022-02-12T05:30:39.461Z] 	at org.mozilla.javascript.Interpreter.interpret(Interpreter.java:815)
00:30:39 [2022-02-12T05:30:39.461Z] 	at org.mozilla.javascript.InterpretedFunction.call(InterpretedFunction.java:109)
00:30:39 [2022-02-12T05:30:39.461Z] 	at org.mozilla.javascript.ContextFactory.doTopCall(ContextFactory.java:394)
00:30:39 [2022-02-12T05:30:39.461Z] 	at org.mozilla.javascript.ScriptRuntime.doTopCall(ScriptRuntime.java:3091)
00:30:39 [2022-02-12T05:30:39.461Z] 	at org.mozilla.javascript.InterpretedFunction.exec(InterpretedFunction.java:120)
00:30:39 [2022-02-12T05:30:39.461Z] 	at org.mozilla.javascript.Context.evaluateReader(Context.java:1110)
00:30:39 [2022-02-12T05:30:39.461Z] 	at org.eclipse.ease.lang.javascript.rhino.RhinoScriptEngine.internalExecute(RhinoScriptEngine.java:226)
00:30:39 [2022-02-12T05:30:39.461Z] 	at org.eclipse.ease.lang.javascript.rhino.RhinoScriptEngine.execute(RhinoScriptEngine.java:205)
00:30:39 [2022-02-12T05:30:39.461Z] 	at org.eclipse.ease.AbstractScriptEngine.inject(AbstractScriptEngine.java:190)
00:30:39 [2022-02-12T05:30:39.461Z] 	at org.eclipse.ease.AbstractScriptEngine.run(AbstractScriptEngine.java:243)
00:30:39 [2022-02-12T05:30:39.461Z] 	at org.eclipse.core.internal.jobs.Worker.run(Worker.java:63)
00:30:39 [2022-02-12T05:30:39.461Z] Start of script
00:30:39 [2022-02-12T05:30:39.461Z] include file start
00:30:39 [2022-02-12T05:30:39.461Z] Include file processed
00:30:39 [2022-02-12T05:30:39.461Z] line after include file
00:30:39 [2022-02-12T05:30:39.461Z] Result of testMethod = 5
00:30:39 [2022-02-12T05:30:39.718Z] End of script
00:30:39 [2022-02-12T05:30:39.718Z] Start of script
00:30:39 [2022-02-12T05:30:39.718Z] include file start
00:30:39 [2022-02-12T05:30:39.718Z] Include file processed
00:30:39 [2022-02-12T05:30:39.718Z] line after include file
00:30:39 [2022-02-12T05:30:39.718Z] Result of testMethod = 5
00:30:39 [2022-02-12T05:30:39.975Z] org.eclipse.ease.ScriptEngineCancellationException: Terminated on user request
00:30:39 [2022-02-12T05:30:39.975Z] 	at org.eclipse.ease.debugging.AbstractEaseDebugger.handleEventsInSuspendedState(AbstractEaseDebugger.java:331)
00:30:39 [2022-02-12T05:30:39.975Z] 	at org.eclipse.ease.debugging.AbstractEaseDebugger.suspend(AbstractEaseDebugger.java:257)
00:30:39 [2022-02-12T05:30:39.975Z] 	at org.eclipse.ease.debugging.AbstractEaseDebugger.processLine(AbstractEaseDebugger.java:492)
00:30:39 [2022-02-12T05:30:39.975Z] 	at org.eclipse.ease.lang.javascript.rhino.debugger.RhinoDebugger.access$4(RhinoDebugger.java:1)
00:30:39 [2022-02-12T05:30:39.975Z] 	at org.eclipse.ease.lang.javascript.rhino.debugger.RhinoDebugger$RhinoDebugFrame.onLineChange(RhinoDebugger.java:124)
00:30:39 [2022-02-12T05:30:39.975Z] 	at org.mozilla.javascript.Interpreter.interpretLoop(Interpreter.java:1824)
00:30:39 [2022-02-12T05:30:39.975Z] 	at org.mozilla.javascript.Interpreter.interpret(Interpreter.java:815)
00:30:39 [2022-02-12T05:30:39.975Z] 	at org.mozilla.javascript.InterpretedFunction.call(InterpretedFunction.java:109)
00:30:39 [2022-02-12T05:30:39.975Z] 	at org.mozilla.javascript.ContextFactory.doTopCall(ContextFactory.java:394)
00:30:39 [2022-02-12T05:30:39.975Z] 	at org.mozilla.javascript.ScriptRuntime.doTopCall(ScriptRuntime.java:3091)
00:30:39 [2022-02-12T05:30:39.975Z] 	at org.mozilla.javascript.InterpretedFunction.exec(InterpretedFunction.java:120)
00:30:39 [2022-02-12T05:30:39.975Z] 	at org.mozilla.javascript.Context.evaluateReader(Context.java:1110)
00:30:39 [2022-02-12T05:30:39.975Z] 	at org.eclipse.ease.lang.javascript.rhino.RhinoScriptEngine.internalExecute(RhinoScriptEngine.java:226)
00:30:39 [2022-02-12T05:30:39.975Z] 	at org.eclipse.ease.lang.javascript.rhino.RhinoScriptEngine.execute(RhinoScriptEngine.java:205)
00:30:39 [2022-02-12T05:30:39.975Z] 	at org.eclipse.ease.AbstractScriptEngine.inject(AbstractScriptEngine.java:190)
00:30:39 [2022-02-12T05:30:39.975Z] 	at org.eclipse.ease.AbstractScriptEngine.run(AbstractScriptEngine.java:243)
00:30:39 [2022-02-12T05:30:39.975Z] 	at org.eclipse.core.internal.jobs.Worker.run(Worker.java:63)
00:30:40 [2022-02-12T05:30:40.232Z] org.eclipse.ease.ScriptEngineCancellationException: Terminated on user request
00:30:40 [2022-02-12T05:30:40.232Z] 	at org.eclipse.ease.debugging.AbstractEaseDebugger.handleEventsInSuspendedState(AbstractEaseDebugger.java:331)
00:30:40 [2022-02-12T05:30:40.232Z] 	at org.eclipse.ease.debugging.AbstractEaseDebugger.suspend(AbstractEaseDebugger.java:257)
00:30:40 [2022-02-12T05:30:40.232Z] 	at org.eclipse.ease.debugging.AbstractEaseDebugger.processLine(AbstractEaseDebugger.java:492)
00:30:40 [2022-02-12T05:30:40.232Z] 	at org.eclipse.ease.lang.javascript.rhino.debugger.RhinoDebugger.access$4(RhinoDebugger.java:1)
00:30:40 [2022-02-12T05:30:40.232Z] 	at org.eclipse.ease.lang.javascript.rhino.debugger.RhinoDebugger$RhinoDebugFrame.onLineChange(RhinoDebugger.java:124)
00:30:40 [2022-02-12T05:30:40.232Z] 	at org.mozilla.javascript.Interpreter.interpretLoop(Interpreter.java:1824)
00:30:40 [2022-02-12T05:30:40.232Z] 	at org.mozilla.javascript.Interpreter.interpret(Interpreter.java:815)
00:30:40 [2022-02-12T05:30:40.232Z] 	at org.mozilla.javascript.InterpretedFunction.call(InterpretedFunction.java:109)
00:30:40 [2022-02-12T05:30:40.232Z] 	at org.mozilla.javascript.ContextFactory.doTopCall(ContextFactory.java:394)
00:30:40 [2022-02-12T05:30:40.232Z] 	at org.mozilla.javascript.ScriptRuntime.doTopCall(ScriptRuntime.java:3091)
00:30:40 [2022-02-12T05:30:40.232Z] 	at org.mozilla.javascript.InterpretedFunction.exec(InterpretedFunction.java:120)
00:30:40 [2022-02-12T05:30:40.232Z] 	at org.mozilla.javascript.Context.evaluateReader(Context.java:1110)
00:30:40 [2022-02-12T05:30:40.232Z] 	at org.eclipse.ease.lang.javascript.rhino.RhinoScriptEngine.internalExecute(RhinoScriptEngine.java:226)
00:30:40 [2022-02-12T05:30:40.232Z] 	at org.eclipse.ease.lang.javascript.rhino.RhinoScriptEngine.execute(RhinoScriptEngine.java:205)
00:30:40 [2022-02-12T05:30:40.232Z] 	at org.eclipse.ease.AbstractScriptEngine.inject(AbstractScriptEngine.java:190)
00:30:40 [2022-02-12T05:30:40.232Z] 	at org.eclipse.ease.AbstractScriptEngine.run(AbstractScriptEngine.java:243)
00:30:40 [2022-02-12T05:30:40.233Z] 	at org.eclipse.core.internal.jobs.Worker.run(Worker.java:63)
00:30:40 [2022-02-12T05:30:40.233Z] Start of script
00:30:40 [2022-02-12T05:30:40.233Z] include file start
00:30:40 [2022-02-12T05:30:40.233Z] Include file processed
00:30:40 [2022-02-12T05:30:40.233Z] line after include file
00:30:40 [2022-02-12T05:30:40.233Z] Result of testMethod = 5
00:30:40 [2022-02-12T05:30:40.233Z] End of script
00:30:40 [2022-02-12T05:30:40.489Z] Start of script
00:30:40 [2022-02-12T05:30:40.489Z] include file start
00:30:40 [2022-02-12T05:30:40.489Z] Include file processed
00:30:40 [2022-02-12T05:30:40.489Z] line after include file
00:30:40 [2022-02-12T05:30:40.745Z] Result of testMethod = 5
00:30:40 [2022-02-12T05:30:40.745Z] End of script
00:30:40 [2022-02-12T05:30:40.745Z] Start of script
00:30:40 [2022-02-12T05:30:40.745Z] include file start
00:30:40 [2022-02-12T05:30:40.745Z] Include file processed
00:30:40 [2022-02-12T05:30:40.745Z] line after include file
00:30:40 [2022-02-12T05:30:40.745Z] Result of testMethod = 5
00:30:40 [2022-02-12T05:30:40.745Z] End of script
00:30:41 [2022-02-12T05:30:41.001Z] Tests run: 41, Failures: 0, Errors: 0, Skipped: 0, Time elapsed: 10.957 s - in org.eclipse.ease.lang.javascript.rhino.RhinoDebugTest
00:30:41 [2022-02-12T05:30:41.001Z] disconnectProcessInSuspendedState  Time elapsed: 0.324 s
00:30:41 [2022-02-12T05:30:41.001Z] stepReturnIncludeCommand  Time elapsed: 0.214 s
00:30:41 [2022-02-12T05:30:41.001Z] arrayVariableSorting  Time elapsed: 0.307 s
00:30:41 [2022-02-12T05:30:41.001Z] stepOverOnDebugTarget  Time elapsed: 0.31 s
00:30:41 [2022-02-12T05:30:41.001Z] disconnectThreadInSuspendedState  Time elapsed: 0.207 s
00:30:41 [2022-02-12T05:30:41.001Z] stepReturnOnDebugTarget  Time elapsed: 0.309 s
00:30:41 [2022-02-12T05:30:41.001Z] nullVariable  Time elapsed: 0.307 s
00:30:41 [2022-02-12T05:30:41.001Z] stepOverOnStackFrame  Time elapsed: 0.308 s
00:30:41 [2022-02-12T05:30:41.001Z] resumeOnDebugTarget  Time elapsed: 0.206 s
00:30:41 [2022-02-12T05:30:41.001Z] modifyVariableKeepingType  Time elapsed: 0.409 s
00:30:41 [2022-02-12T05:30:41.001Z] resumeOnLastIncludeLine  Time elapsed: 0.206 s
00:30:41 [2022-02-12T05:30:41.001Z] stepReturnOnStackFrame  Time elapsed: 0.308 s
00:30:41 [2022-02-12T05:30:41.001Z] terminateStackFrameInSuspendedState  Time elapsed: 0.213 s
00:30:41 [2022-02-12T05:30:41.002Z] breakpointLocation  Time elapsed: 0.213 s
00:30:41 [2022-02-12T05:30:41.002Z] stepReturnOnThread  Time elapsed: 0.307 s
00:30:41 [2022-02-12T05:30:41.002Z] javaClassVariable  Time elapsed: 0.309 s
00:30:41 [2022-02-12T05:30:41.002Z] stepIntoOnThread  Time elapsed: 0.307 s
00:30:41 [2022-02-12T05:30:41.002Z] terminateThreadInSuspendedState  Time elapsed: 0.206 s
00:30:41 [2022-02-12T05:30:41.002Z] resumeOnThread  Time elapsed: 0.206 s
00:30:41 [2022-02-12T05:30:41.002Z] stepIntoOnStackFrame  Time elapsed: 0.307 s
00:30:41 [2022-02-12T05:30:41.002Z] terminateProcessInSuspendedState  Time elapsed: 0.211 s
00:30:41 [2022-02-12T05:30:41.002Z] stepOverOnProcess  Time elapsed: 0.308 s
00:30:41 [2022-02-12T05:30:41.002Z] nativeArrayVariable  Time elapsed: 0.308 s
00:30:41 [2022-02-12T05:30:41.002Z] disconnectDebugTargetInSuspendedState  Time elapsed: 0.206 s
00:30:41 [2022-02-12T05:30:41.002Z] stepIntoOnProcess  Time elapsed: 0.31 s
00:30:41 [2022-02-12T05:30:41.002Z] terminatedState  Time elapsed: 0.104 s
00:30:41 [2022-02-12T05:30:41.002Z] stepOverIncludeCommand  Time elapsed: 0.306 s
00:30:41 [2022-02-12T05:30:41.002Z] innerScopeVariableBeforeOuterScopeVariable  Time elapsed: 0.306 s
00:30:41 [2022-02-12T05:30:41.002Z] stepIntoIncludeCommand  Time elapsed: 0.306 s
00:30:41 [2022-02-12T05:30:41.002Z] primitiveStringVariable  Time elapsed: 0.306 s
00:30:41 [2022-02-12T05:30:41.002Z] resumeOnProcess  Time elapsed: 0.205 s
00:30:41 [2022-02-12T05:30:41.002Z] stepIntoOnDebugTarget  Time elapsed: 0.307 s
00:30:41 [2022-02-12T05:30:41.002Z] stepOverOnThread  Time elapsed: 0.306 s
00:30:41 [2022-02-12T05:30:41.002Z] suspendedState  Time elapsed: 0.205 s
00:30:41 [2022-02-12T05:30:41.002Z] primitiveDoubleVariable  Time elapsed: 0.305 s
00:30:41 [2022-02-12T05:30:41.002Z] resumeOnStackFrame  Time elapsed: 0.205 s
00:30:41 [2022-02-12T05:30:41.002Z] nativeObjectVariable  Time elapsed: 0.306 s
00:30:41 [2022-02-12T05:30:41.002Z] terminateDebugTargetInSuspendedState  Time elapsed: 0.205 s
00:30:41 [2022-02-12T05:30:41.002Z] disconnectStackFrameInSuspendedState  Time elapsed: 0.206 s
00:30:41 [2022-02-12T05:30:41.002Z] stepReturnOnProcess  Time elapsed: 0.307 s
00:30:41 [2022-02-12T05:30:41.002Z] evaluateWatchExpression  Time elapsed: 0.226 s
00:30:41 [2022-02-12T05:30:41.002Z] Running org.eclipse.ease.lang.javascript.rhino.RhinoScriptEngineTest
00:30:41 [2022-02-12T05:30:41.002Z] org.eclipse.ease.ScriptExecutionException: JavaError: java.lang.Exception
00:30:41 [2022-02-12T05:30:41.002Z] 	at <unknown source>
00:30:41 [2022-02-12T05:30:41.002Z] 
00:30:41 [2022-02-12T05:30:41.002Z] Java Stacktrace:
00:30:41 [2022-02-12T05:30:41.002Z] java.lang.Exception
00:30:41 [2022-02-12T05:30:41.002Z] 	at java.base/jdk.internal.reflect.NativeConstructorAccessorImpl.newInstance0(Native Method)
00:30:41 [2022-02-12T05:30:41.002Z] 	at java.base/jdk.internal.reflect.NativeConstructorAccessorImpl.newInstance(NativeConstructorAccessorImpl.java:64)
00:30:41 [2022-02-12T05:30:41.002Z] 	at java.base/jdk.internal.reflect.DelegatingConstructorAccessorImpl.newInstance(DelegatingConstructorAccessorImpl.java:45)
00:30:41 [2022-02-12T05:30:41.002Z] 	at java.base/java.lang.reflect.Constructor.newInstanceWithCaller(Constructor.java:500)
00:30:41 [2022-02-12T05:30:41.002Z] 	at java.base/java.lang.reflect.Constructor.newInstance(Constructor.java:481)
00:30:41 [2022-02-12T05:30:41.002Z] 	at org.mozilla.javascript.MemberBox.newInstance(MemberBox.java:159)
00:30:41 [2022-02-12T05:30:41.002Z] 	at org.mozilla.javascript.NativeJavaClass.constructInternal(NativeJavaClass.java:266)
00:30:41 [2022-02-12T05:30:41.002Z] 	at org.mozilla.javascript.NativeJavaClass.constructSpecific(NativeJavaClass.java:205)
00:30:41 [2022-02-12T05:30:41.002Z] 	at org.mozilla.javascript.NativeJavaClass.construct(NativeJavaClass.java:166)
00:30:41 [2022-02-12T05:30:41.002Z] 	at org.mozilla.javascript.ScriptRuntime.newObject(ScriptRuntime.java:2349)
00:30:41 [2022-02-12T05:30:41.002Z] 	at org.mozilla.javascript.gen.c_33._c_script_0(Unknown Source)
00:30:41 [2022-02-12T05:30:41.002Z] 	at org.mozilla.javascript.gen.c_33.call(Unknown Source)
00:30:41 [2022-02-12T05:30:41.002Z] 	at org.mozilla.javascript.ContextFactory.doTopCall(ContextFactory.java:394)
00:30:41 [2022-02-12T05:30:41.002Z] 	at org.mozilla.javascript.ScriptRuntime.doTopCall(ScriptRuntime.java:3091)
00:30:41 [2022-02-12T05:30:41.002Z] 	at org.mozilla.javascript.gen.c_33.call(Unknown Source)
00:30:41 [2022-02-12T05:30:41.002Z] 	at org.mozilla.javascript.gen.c_33.exec(Unknown Source)
00:30:41 [2022-02-12T05:30:41.002Z] 	at org.mozilla.javascript.Context.evaluateReader(Context.java:1110)
00:30:41 [2022-02-12T05:30:41.002Z] 	at org.eclipse.ease.lang.javascript.rhino.RhinoScriptEngine.internalExecute(RhinoScriptEngine.java:226)
00:30:41 [2022-02-12T05:30:41.002Z] 	at org.eclipse.ease.lang.javascript.rhino.RhinoScriptEngine.execute(RhinoScriptEngine.java:205)
00:30:41 [2022-02-12T05:30:41.002Z] 	at org.eclipse.ease.AbstractScriptEngine.inject(AbstractScriptEngine.java:190)
00:30:41 [2022-02-12T05:30:41.002Z] 	at org.eclipse.ease.AbstractScriptEngine.run(AbstractScriptEngine.java:243)
00:30:41 [2022-02-12T05:30:41.002Z] 	at org.eclipse.core.internal.jobs.Worker.run(Worker.java:63)
00:30:41 [2022-02-12T05:30:41.002Z] org.eclipse.ease.ScriptExecutionException: ScriptException: test
00:30:41 [2022-02-12T05:30:41.002Z] 	at <unknown source>
00:30:41 [2022-02-12T05:30:41.002Z] org.eclipse.ease.ScriptExecutionException: ScriptException: JavaScript
00:30:41 [2022-02-12T05:30:41.002Z] 	at <unknown source>
00:30:41 [2022-02-12T05:30:41.002Z] org.eclipse.ease.ScriptExecutionException: SyntaxError: unterminated string literal (#1)
00:30:41 [2022-02-12T05:30:41.002Z] 'asdf
00:30:41 [2022-02-12T05:30:41.002Z]     ^
00:30:41 [2022-02-12T05:30:41.002Z] 	at <unknown source>
00:30:41 [2022-02-12T05:30:41.258Z] org.eclipse.ease.ScriptExecutionException: TypeError: Cannot call method "foobar" of undefined
00:30:41 [2022-02-12T05:30:41.258Z] 	at <unknown source>
00:30:41 [2022-02-12T05:30:41.258Z] org.eclipse.ease.ScriptExecutionException: JavaError: NotThere cannot be found by org.mozilla.javascript_1.7.5.v201504281450
00:30:41 [2022-02-12T05:30:41.258Z] 	at <unknown source>
00:30:41 [2022-02-12T05:30:41.258Z] 
00:30:41 [2022-02-12T05:30:41.258Z] Java Stacktrace:
00:30:41 [2022-02-12T05:30:41.258Z] java.lang.ClassNotFoundException: NotThere cannot be found by org.mozilla.javascript_1.7.5.v201504281450
00:30:41 [2022-02-12T05:30:41.258Z] 	at org.eclipse.osgi.internal.loader.BundleLoader.findClassInternal(BundleLoader.java:511)
00:30:41 [2022-02-12T05:30:41.258Z] 	at org.eclipse.osgi.internal.loader.BundleLoader.findClass(BundleLoader.java:422)
00:30:41 [2022-02-12T05:30:41.258Z] 	at org.eclipse.osgi.internal.loader.BundleLoader.findClass(BundleLoader.java:414)
00:30:41 [2022-02-12T05:30:41.258Z] 	at org.eclipse.osgi.internal.loader.ModuleClassLoader.loadClass(ModuleClassLoader.java:153)
00:30:41 [2022-02-12T05:30:41.258Z] 	at java.base/java.lang.ClassLoader.loadClass(ClassLoader.java:522)
00:30:41 [2022-02-12T05:30:41.258Z] 	at java.base/java.lang.Class.forName0(Native Method)
00:30:41 [2022-02-12T05:30:41.258Z] 	at java.base/java.lang.Class.forName(Class.java:377)
00:30:41 [2022-02-12T05:30:41.258Z] 	at java.base/jdk.internal.reflect.NativeMethodAccessorImpl.invoke0(Native Method)
00:30:41 [2022-02-12T05:30:41.258Z] 	at java.base/jdk.internal.reflect.NativeMethodAccessorImpl.invoke(NativeMethodAccessorImpl.java:64)
00:30:41 [2022-02-12T05:30:41.258Z] 	at java.base/jdk.internal.reflect.DelegatingMethodAccessorImpl.invoke(DelegatingMethodAccessorImpl.java:43)
00:30:41 [2022-02-12T05:30:41.258Z] 	at java.base/java.lang.reflect.Method.invoke(Method.java:564)
00:30:41 [2022-02-12T05:30:41.258Z] 	at org.mozilla.javascript.MemberBox.invoke(MemberBox.java:126)
00:30:41 [2022-02-12T05:30:41.258Z] 	at org.mozilla.javascript.NativeJavaMethod.call(NativeJavaMethod.java:225)
00:30:41 [2022-02-12T05:30:41.258Z] 	at org.mozilla.javascript.optimizer.OptRuntime.call1(OptRuntime.java:32)
00:30:41 [2022-02-12T05:30:41.258Z] 	at org.mozilla.javascript.gen.c_56._c_script_0(Unknown Source)
00:30:41 [2022-02-12T05:30:41.258Z] 	at org.mozilla.javascript.gen.c_56.call(Unknown Source)
00:30:41 [2022-02-12T05:30:41.258Z] 	at org.mozilla.javascript.ContextFactory.doTopCall(ContextFactory.java:394)
00:30:41 [2022-02-12T05:30:41.258Z] 	at org.mozilla.javascript.ScriptRuntime.doTopCall(ScriptRuntime.java:3091)
00:30:41 [2022-02-12T05:30:41.258Z] 	at org.mozilla.javascript.gen.c_56.call(Unknown Source)
00:30:41 [2022-02-12T05:30:41.258Z] 	at org.mozilla.javascript.gen.c_56.exec(Unknown Source)
00:30:41 [2022-02-12T05:30:41.258Z] 	at org.mozilla.javascript.Context.evaluateReader(Context.java:1110)
00:30:41 [2022-02-12T05:30:41.258Z] 	at org.eclipse.ease.lang.javascript.rhino.RhinoScriptEngine.internalExecute(RhinoScriptEngine.java:226)
00:30:41 [2022-02-12T05:30:41.258Z] 	at org.eclipse.ease.lang.javascript.rhino.RhinoScriptEngine.execute(RhinoScriptEngine.java:205)
00:30:41 [2022-02-12T05:30:41.258Z] 	at org.eclipse.ease.AbstractScriptEngine.inject(AbstractScriptEngine.java:190)
00:30:41 [2022-02-12T05:30:41.258Z] 	at org.eclipse.ease.AbstractScriptEngine.run(AbstractScriptEngine.java:243)
00:30:41 [2022-02-12T05:30:41.258Z] 	at org.eclipse.core.internal.jobs.Worker.run(Worker.java:63)
00:30:41 [2022-02-12T05:30:41.258Z] Tests run: 11, Failures: 0, Errors: 0, Skipped: 0, Time elapsed: 0.216 s - in org.eclipse.ease.lang.javascript.rhino.RhinoScriptEngineTest
00:30:41 [2022-02-12T05:30:41.258Z] execute_java_class_instantiation  Time elapsed: 0.014 s
00:30:41 [2022-02-12T05:30:41.258Z] execute_environment_module_code_with_optional_parameters  Time elapsed: 0.019 s
00:30:41 [2022-02-12T05:30:41.259Z] execute_throws_java_exception  Time elapsed: 0.017 s
00:30:41 [2022-02-12T05:30:41.259Z] execute_throws_java_class  Time elapsed: 0.047 s
00:30:41 [2022-02-12T05:30:41.259Z] execute_javascript_assignment  Time elapsed: 0.013 s
00:30:41 [2022-02-12T05:30:41.259Z] execute_eclipse_class_instantiation  Time elapsed: 0.017 s
00:30:41 [2022-02-12T05:30:41.259Z] execute_throws_javascript_object  Time elapsed: 0.011 s
00:30:41 [2022-02-12T05:30:41.259Z] execute_throws_syntax_error  Time elapsed: 0.013 s
00:30:41 [2022-02-12T05:30:41.259Z] execute_throws_javascript_runtime_error  Time elapsed: 0.013 s
00:30:41 [2022-02-12T05:30:41.259Z] execute_environment_module_code  Time elapsed: 0.034 s
00:30:41 [2022-02-12T05:30:41.259Z] execute_throws_wrapped_java_exception  Time elapsed: 0.014 s
00:30:41 [2022-02-12T05:30:41.259Z] 
00:30:41 [2022-02-12T05:30:41.259Z] Results:
00:30:41 [2022-02-12T05:30:41.259Z] 
00:30:41 [2022-02-12T05:30:41.259Z] Tests run: 69, Failures: 0, Errors: 0, Skipped: 0
00:30:41 [2022-02-12T05:30:41.259Z] 
00:30:41 [2022-02-12T05:30:41.539Z] [INFO] All tests passed!
00:30:41 [2022-02-12T05:30:41.539Z] [INFO] 
00:30:41 [2022-02-12T05:30:41.539Z] [INFO] -------< org.eclipse.ease:org.eclipse.ease.lang.javascript.test >-------
00:30:41 [2022-02-12T05:30:41.539Z] [INFO] Building org.eclipse.ease.lang.javascript.test 0.9.0-SNAPSHOT      [5/9]
00:30:41 [2022-02-12T05:30:41.539Z] [INFO] ------------------------[ eclipse-test-plugin ]-------------------------
00:30:41 [2022-02-12T05:30:41.539Z] [INFO] 
00:30:41 [2022-02-12T05:30:41.539Z] [INFO] --- tycho-packaging-plugin:2.2.0:build-qualifier (default-build-qualifier) @ org.eclipse.ease.lang.javascript.test ---
00:30:41 [2022-02-12T05:30:41.539Z] [INFO] The project's OSGi version is 0.9.0.I202107211616
00:30:41 [2022-02-12T05:30:41.539Z] [INFO] 
00:30:41 [2022-02-12T05:30:41.539Z] [INFO] --- tycho-packaging-plugin:2.2.0:validate-id (default-validate-id) @ org.eclipse.ease.lang.javascript.test ---
00:30:41 [2022-02-12T05:30:41.539Z] [INFO] 
00:30:41 [2022-02-12T05:30:41.539Z] [INFO] --- tycho-packaging-plugin:2.2.0:validate-version (default-validate-version) @ org.eclipse.ease.lang.javascript.test ---
00:30:41 [2022-02-12T05:30:41.539Z] [INFO] 
00:30:41 [2022-02-12T05:30:41.539Z] [INFO] --- maven-resources-plugin:2.4.3:resources (default-resources) @ org.eclipse.ease.lang.javascript.test ---
00:30:41 [2022-02-12T05:30:41.539Z] [INFO] Using 'UTF-8' encoding to copy filtered resources.
00:30:41 [2022-02-12T05:30:41.539Z] [INFO] skip non existing resourceDirectory /home/jenkins/agent/workspace/ease.verify.core.target.2018-12/tests/org.eclipse.ease.lang.javascript.test/src/main/resources
00:30:41 [2022-02-12T05:30:41.539Z] [INFO] 
00:30:41 [2022-02-12T05:30:41.539Z] [INFO] --- tycho-compiler-plugin:2.2.0:compile (default-compile) @ org.eclipse.ease.lang.javascript.test ---
00:30:41 [2022-02-12T05:30:41.539Z] [INFO] Nothing to compile - all classes are up to date
00:30:41 [2022-02-12T05:30:41.539Z] [INFO] 
00:30:41 [2022-02-12T05:30:41.539Z] [INFO] --- maven-resources-plugin:2.4.3:testResources (default-testResources) @ org.eclipse.ease.lang.javascript.test ---
00:30:41 [2022-02-12T05:30:41.539Z] [INFO] Using 'UTF-8' encoding to copy filtered resources.
00:30:41 [2022-02-12T05:30:41.539Z] [INFO] skip non existing resourceDirectory /home/jenkins/agent/workspace/ease.verify.core.target.2018-12/tests/org.eclipse.ease.lang.javascript.test/src/test/resources
00:30:41 [2022-02-12T05:30:41.539Z] [INFO] 
00:30:41 [2022-02-12T05:30:41.539Z] [INFO] --- target-platform-configuration:2.2.0:target-platform (default-target-platform) @ org.eclipse.ease.lang.javascript.test ---
00:30:41 [2022-02-12T05:30:41.539Z] [INFO] 
00:30:41 [2022-02-12T05:30:41.539Z] [INFO] --- tycho-packaging-plugin:2.2.0:package-plugin (default-package-plugin) @ org.eclipse.ease.lang.javascript.test ---
00:30:41 [2022-02-12T05:30:41.539Z] [INFO] Building jar: /home/jenkins/agent/workspace/ease.verify.core.target.2018-12/tests/org.eclipse.ease.lang.javascript.test/target/org.eclipse.ease.lang.javascript.test-0.9.0-SNAPSHOT.jar
00:30:41 [2022-02-12T05:30:41.539Z] [INFO] 
00:30:41 [2022-02-12T05:30:41.539Z] [INFO] --- tycho-p2-plugin:2.2.0:p2-metadata-default (default-p2-metadata-default) @ org.eclipse.ease.lang.javascript.test ---
00:30:41 [2022-02-12T05:30:41.539Z] [INFO] 
00:30:41 [2022-02-12T05:30:41.539Z] [INFO] --- jacoco-maven-plugin:0.8.6:prepare-agent (jacoco-initialize) @ org.eclipse.ease.lang.javascript.test ---
00:30:41 [2022-02-12T05:30:41.539Z] [INFO] tycho.testArgLine set to -javaagent:/home/jenkins/.m2/repository/org/jacoco/org.jacoco.agent/0.8.6/org.jacoco.agent-0.8.6-runtime.jar=destfile=/home/jenkins/agent/workspace/ease.verify.core.target.2018-12/tests/org.eclipse.ease.lang.javascript.test/target/jacoco.exec,output=file
00:30:41 [2022-02-12T05:30:41.539Z] [INFO] 
00:30:41 [2022-02-12T05:30:41.539Z] [INFO] --- tycho-surefire-plugin:2.2.0:test (default-test) @ org.eclipse.ease.lang.javascript.test ---
00:30:41 [2022-02-12T05:30:41.539Z] [INFO] Executing Test Runtime with timeout 0, logs (if any) will be placed at: /home/jenkins/agent/workspace/ease.verify.core.target.2018-12/tests/org.eclipse.ease.lang.javascript.test/target/work/data/.metadata/.log
00:30:41 [2022-02-12T05:30:41.540Z] [INFO] Command line:
00:30:41 [2022-02-12T05:30:41.540Z] 	[/opt/tools/java/openjdk/jdk-15/15.0.2+7/bin/java, -Dosgi.noShutdown=false, -Dosgi.os=linux, -Dosgi.ws=gtk, -Dosgi.arch=x86_64, -javaagent:/home/jenkins/.m2/repository/org/jacoco/org.jacoco.agent/0.8.6/org.jacoco.agent-0.8.6-runtime.jar=destfile=/home/jenkins/agent/workspace/ease.verify.core.target.2018-12/tests/org.eclipse.ease.lang.javascript.test/target/jacoco.exec,output=file, -Dosgi.clean=true, -jar, /home/jenkins/.m2/repository/p2/osgi/bundle/org.eclipse.equinox.launcher/1.5.200.v20180922-1751/org.eclipse.equinox.launcher-1.5.200.v20180922-1751.jar, -data, /home/jenkins/agent/workspace/ease.verify.core.target.2018-12/tests/org.eclipse.ease.lang.javascript.test/target/work/data, -install, /home/jenkins/agent/workspace/ease.verify.core.target.2018-12/tests/org.eclipse.ease.lang.javascript.test/target/work, -configuration, /home/jenkins/agent/workspace/ease.verify.core.target.2018-12/tests/org.eclipse.ease.lang.javascript.test/target/work/configuration, -application, org.eclipse.tycho.surefire.osgibooter.headlesstest, -testproperties, /home/jenkins/agent/workspace/ease.verify.core.target.2018-12/tests/org.eclipse.ease.lang.javascript.test/target/surefire.properties]
00:30:41 [2022-02-12T05:30:41.540Z] Picked up JAVA_TOOL_OPTIONS: -Dmaven.ext.class.path="/home/jenkins/agent/workspace/ease.verify.core.target.2018-12@tmp/withMaven055d1bcb/pipeline-maven-spy.jar" -Dorg.jenkinsci.plugins.pipeline.maven.reportsFolder="/home/jenkins/agent/workspace/ease.verify.core.target.2018-12@tmp/withMaven055d1bcb" 
00:30:45 [2022-02-12T05:30:45.743Z] Running org.eclipse.ease.lang.javascript.JavaScriptCodeFactoryTest
00:30:45 [2022-02-12T05:30:45.743Z] Tests run: 11, Failures: 0, Errors: 0, Skipped: 0, Time elapsed: 0.115 s - in org.eclipse.ease.lang.javascript.JavaScriptCodeFactoryTest
00:30:45 [2022-02-12T05:30:45.743Z] getSaveVariableName_creates_random_string_for_invalid_characters  Time elapsed: 0.084 s
00:30:45 [2022-02-12T05:30:45.743Z] getNullString_equals_null  Time elapsed: 0.003 s
00:30:45 [2022-02-12T05:30:45.743Z] getSaveVariableName_prefixes_keywords_with_underscore  Time elapsed: 0.001 s
00:30:45 [2022-02-12T05:30:45.743Z] getSaveVariableName_does_not_alter_save_name  Time elapsed: 0.001 s
00:30:45 [2022-02-12T05:30:45.743Z] classInstantiation_creates_instance_with_parameters  Time elapsed: 0.002 s
00:30:45 [2022-02-12T05:30:45.743Z] createCommentedString_creates_block_comment  Time elapsed: 0.002 s
00:30:45 [2022-02-12T05:30:45.743Z] createCommentedString_creates_single_line_comment  Time elapsed: 0.002 s
00:30:45 [2022-02-12T05:30:45.743Z] classInstantiation_creates_default_instance  Time elapsed: 0 s
00:30:45 [2022-02-12T05:30:45.743Z] createCommentedString_creates_multi_line_comment  Time elapsed: 0.001 s
00:30:45 [2022-02-12T05:30:45.743Z] getSaveVariableName_replaces_invalid_characters  Time elapsed: 0 s
00:30:45 [2022-02-12T05:30:45.743Z] getSaveVariableName_prefixes_numbers_with_underscore  Time elapsed: 0 s
00:30:45 [2022-02-12T05:30:45.743Z] 
00:30:45 [2022-02-12T05:30:45.743Z] Results:
00:30:45 [2022-02-12T05:30:45.743Z] 
00:30:45 [2022-02-12T05:30:45.743Z] Tests run: 11, Failures: 0, Errors: 0, Skipped: 0
00:30:45 [2022-02-12T05:30:45.743Z] 
00:30:45 [2022-02-12T05:30:45.743Z] [INFO] All tests passed!
00:30:45 [2022-02-12T05:30:45.743Z] [INFO] 
00:30:45 [2022-02-12T05:30:45.743Z] [INFO] ---------< org.eclipse.ease:org.eclipse.ease.lang.python.test >---------
00:30:45 [2022-02-12T05:30:45.743Z] [INFO] Building org.eclipse.ease.lang.python.test 0.9.0-SNAPSHOT          [6/9]
00:30:45 [2022-02-12T05:30:45.743Z] [INFO] ------------------------[ eclipse-test-plugin ]-------------------------
00:30:45 [2022-02-12T05:30:45.743Z] [INFO] 
00:30:45 [2022-02-12T05:30:45.744Z] [INFO] --- tycho-packaging-plugin:2.2.0:build-qualifier (default-build-qualifier) @ org.eclipse.ease.lang.python.test ---
00:30:45 [2022-02-12T05:30:45.744Z] [INFO] The project's OSGi version is 0.9.0.I202112011324
00:30:45 [2022-02-12T05:30:45.744Z] [INFO] 
00:30:45 [2022-02-12T05:30:45.744Z] [INFO] --- tycho-packaging-plugin:2.2.0:validate-id (default-validate-id) @ org.eclipse.ease.lang.python.test ---
00:30:45 [2022-02-12T05:30:45.744Z] [INFO] 
00:30:45 [2022-02-12T05:30:45.744Z] [INFO] --- tycho-packaging-plugin:2.2.0:validate-version (default-validate-version) @ org.eclipse.ease.lang.python.test ---
00:30:45 [2022-02-12T05:30:45.744Z] [INFO] 
00:30:45 [2022-02-12T05:30:45.744Z] [INFO] --- maven-resources-plugin:2.4.3:resources (default-resources) @ org.eclipse.ease.lang.python.test ---
00:30:45 [2022-02-12T05:30:45.744Z] [INFO] Using 'UTF-8' encoding to copy filtered resources.
00:30:45 [2022-02-12T05:30:45.744Z] [INFO] skip non existing resourceDirectory /home/jenkins/agent/workspace/ease.verify.core.target.2018-12/tests/org.eclipse.ease.lang.python.test/src/main/resources
00:30:45 [2022-02-12T05:30:45.744Z] [INFO] 
00:30:45 [2022-02-12T05:30:45.744Z] [INFO] --- tycho-compiler-plugin:2.2.0:compile (default-compile) @ org.eclipse.ease.lang.python.test ---
00:30:45 [2022-02-12T05:30:45.744Z] [INFO] Nothing to compile - all classes are up to date
00:30:45 [2022-02-12T05:30:45.744Z] [INFO] 
00:30:45 [2022-02-12T05:30:45.744Z] [INFO] --- maven-resources-plugin:2.4.3:testResources (default-testResources) @ org.eclipse.ease.lang.python.test ---
00:30:45 [2022-02-12T05:30:45.744Z] [INFO] Using 'UTF-8' encoding to copy filtered resources.
00:30:45 [2022-02-12T05:30:45.744Z] [INFO] skip non existing resourceDirectory /home/jenkins/agent/workspace/ease.verify.core.target.2018-12/tests/org.eclipse.ease.lang.python.test/src/test/resources
00:30:45 [2022-02-12T05:30:45.744Z] [INFO] 
00:30:45 [2022-02-12T05:30:45.744Z] [INFO] --- target-platform-configuration:2.2.0:target-platform (default-target-platform) @ org.eclipse.ease.lang.python.test ---
00:30:45 [2022-02-12T05:30:45.744Z] [INFO] 
00:30:45 [2022-02-12T05:30:45.744Z] [INFO] --- tycho-packaging-plugin:2.2.0:package-plugin (default-package-plugin) @ org.eclipse.ease.lang.python.test ---
00:30:45 [2022-02-12T05:30:45.744Z] [INFO] Building jar: /home/jenkins/agent/workspace/ease.verify.core.target.2018-12/tests/org.eclipse.ease.lang.python.test/target/org.eclipse.ease.lang.python.test-0.9.0-SNAPSHOT.jar
00:30:45 [2022-02-12T05:30:45.744Z] [INFO] 
00:30:45 [2022-02-12T05:30:45.744Z] [INFO] --- tycho-p2-plugin:2.2.0:p2-metadata-default (default-p2-metadata-default) @ org.eclipse.ease.lang.python.test ---
00:30:45 [2022-02-12T05:30:45.744Z] [INFO] 
00:30:45 [2022-02-12T05:30:45.745Z] [INFO] --- jacoco-maven-plugin:0.8.6:prepare-agent (jacoco-initialize) @ org.eclipse.ease.lang.python.test ---
00:30:45 [2022-02-12T05:30:45.745Z] [INFO] tycho.testArgLine set to -javaagent:/home/jenkins/.m2/repository/org/jacoco/org.jacoco.agent/0.8.6/org.jacoco.agent-0.8.6-runtime.jar=destfile=/home/jenkins/agent/workspace/ease.verify.core.target.2018-12/tests/org.eclipse.ease.lang.python.test/target/jacoco.exec,output=file
00:30:45 [2022-02-12T05:30:45.745Z] [INFO] 
00:30:45 [2022-02-12T05:30:45.745Z] [INFO] --- tycho-surefire-plugin:2.2.0:test (default-test) @ org.eclipse.ease.lang.python.test ---
00:30:46 [2022-02-12T05:30:46.307Z] [INFO] Executing Test Runtime with timeout 0, logs (if any) will be placed at: /home/jenkins/agent/workspace/ease.verify.core.target.2018-12/tests/org.eclipse.ease.lang.python.test/target/work/data/.metadata/.log
00:30:46 [2022-02-12T05:30:46.307Z] [INFO] Command line:
00:30:46 [2022-02-12T05:30:46.307Z] 	[/opt/tools/java/openjdk/jdk-15/15.0.2+7/bin/java, -Dosgi.noShutdown=false, -Dosgi.os=linux, -Dosgi.ws=gtk, -Dosgi.arch=x86_64, -javaagent:/home/jenkins/.m2/repository/org/jacoco/org.jacoco.agent/0.8.6/org.jacoco.agent-0.8.6-runtime.jar=destfile=/home/jenkins/agent/workspace/ease.verify.core.target.2018-12/tests/org.eclipse.ease.lang.python.test/target/jacoco.exec,output=file, -Dosgi.clean=true, -jar, /home/jenkins/.m2/repository/p2/osgi/bundle/org.eclipse.equinox.launcher/1.5.200.v20180922-1751/org.eclipse.equinox.launcher-1.5.200.v20180922-1751.jar, -data, /home/jenkins/agent/workspace/ease.verify.core.target.2018-12/tests/org.eclipse.ease.lang.python.test/target/work/data, -install, /home/jenkins/agent/workspace/ease.verify.core.target.2018-12/tests/org.eclipse.ease.lang.python.test/target/work, -configuration, /home/jenkins/agent/workspace/ease.verify.core.target.2018-12/tests/org.eclipse.ease.lang.python.test/target/work/configuration, -application, org.eclipse.tycho.surefire.osgibooter.headlesstest, -testproperties, /home/jenkins/agent/workspace/ease.verify.core.target.2018-12/tests/org.eclipse.ease.lang.python.test/target/surefire.properties]
00:30:46 [2022-02-12T05:30:46.307Z] Picked up JAVA_TOOL_OPTIONS: -Dmaven.ext.class.path="/home/jenkins/agent/workspace/ease.verify.core.target.2018-12@tmp/withMaven055d1bcb/pipeline-maven-spy.jar" -Dorg.jenkinsci.plugins.pipeline.maven.reportsFolder="/home/jenkins/agent/workspace/ease.verify.core.target.2018-12@tmp/withMaven055d1bcb" 
00:30:49 [2022-02-12T05:30:49.615Z] Running org.eclipse.ease.lang.python.PyDevPathImporterTest
00:30:50 [2022-02-12T05:30:50.982Z] Tests run: 6, Failures: 0, Errors: 0, Skipped: 0, Time elapsed: 1.465 s - in org.eclipse.ease.lang.python.PyDevPathImporterTest
00:30:50 [2022-02-12T05:30:50.982Z] createEngine_registers_engine_execution_listener  Time elapsed: 0.884 s
00:30:50 [2022-02-12T05:30:50.982Z] notify_does_not_throwwhen_PyDev_plugins_are_not_available  Time elapsed: 0.343 s
00:30:50 [2022-02-12T05:30:50.982Z] notify_registers_project_paths_for_engine_executed_file  Time elapsed: 0.202 s
00:30:50 [2022-02-12T05:30:50.982Z] notify_does_not_throw_for_non_PyDev_project  Time elapsed: 0.002 s
00:30:50 [2022-02-12T05:30:50.982Z] notify_escapes_path_on_windows  Time elapsed: 0.002 s
00:30:50 [2022-02-12T05:30:50.982Z] notify_registers_project_paths  Time elapsed: 0.001 s
00:30:50 [2022-02-12T05:30:50.982Z] Running org.eclipse.ease.lang.python.PythonCodeFactoryTest
00:30:51 [2022-02-12T05:30:51.238Z] Tests run: 3, Failures: 0, Errors: 0, Skipped: 0, Time elapsed: 0.09 s - in org.eclipse.ease.lang.python.PythonCodeFactoryTest
00:30:51 [2022-02-12T05:30:51.238Z] createFunctionWrapper_creates_return_andParameters_for_Py4J  Time elapsed: 0.085 s
00:30:51 [2022-02-12T05:30:51.238Z] testCommentCreator  Time elapsed: 0.001 s
00:30:51 [2022-02-12T05:30:51.238Z] createFunctionWrapper_creates_void_return_types_for_Py4J  Time elapsed: 0.002 s
00:30:51 [2022-02-12T05:30:51.238Z] Running org.eclipse.ease.lang.python.ResourceProjectPathImporterTest
00:30:51 [2022-02-12T05:30:51.238Z] Tests run: 4, Failures: 0, Errors: 0, Skipped: 0, Time elapsed: 0.005 s - in org.eclipse.ease.lang.python.ResourceProjectPathImporterTest
00:30:51 [2022-02-12T05:30:51.238Z] createEngine_registers_engine_execution_listener  Time elapsed: 0.001 s
00:30:51 [2022-02-12T05:30:51.238Z] notify_registers_project_paths_for_engine_executed_file  Time elapsed: 0.002 s
00:30:51 [2022-02-12T05:30:51.238Z] notify_escapes_path_on_windows  Time elapsed: 0.001 s
00:30:51 [2022-02-12T05:30:51.238Z] notify_registers_project_paths  Time elapsed: 0.001 s
00:30:51 [2022-02-12T05:30:51.238Z] 
00:30:51 [2022-02-12T05:30:51.238Z] Results:
00:30:51 [2022-02-12T05:30:51.238Z] 
00:30:51 [2022-02-12T05:30:51.238Z] Tests run: 13, Failures: 0, Errors: 0, Skipped: 0
00:30:51 [2022-02-12T05:30:51.238Z] 
00:30:51 [2022-02-12T05:30:51.493Z] [INFO] All tests passed!
00:30:51 [2022-02-12T05:30:51.493Z] [INFO] 
00:30:51 [2022-02-12T05:30:51.493Z] [INFO] -----< org.eclipse.ease:org.eclipse.ease.lang.python.jython.test >------
00:30:51 [2022-02-12T05:30:51.493Z] [INFO] Building org.eclipse.ease.lang.python.jython.test 0.9.0-SNAPSHOT   [7/9]
00:30:51 [2022-02-12T05:30:51.493Z] [INFO] ------------------------[ eclipse-test-plugin ]-------------------------
00:30:51 [2022-02-12T05:30:51.493Z] [INFO] 
00:30:51 [2022-02-12T05:30:51.493Z] [INFO] --- tycho-packaging-plugin:2.2.0:build-qualifier (default-build-qualifier) @ org.eclipse.ease.lang.python.jython.test ---
00:30:51 [2022-02-12T05:30:51.493Z] [INFO] The project's OSGi version is 0.9.0.I202106220815
00:30:51 [2022-02-12T05:30:51.493Z] [INFO] 
00:30:51 [2022-02-12T05:30:51.493Z] [INFO] --- tycho-packaging-plugin:2.2.0:validate-id (default-validate-id) @ org.eclipse.ease.lang.python.jython.test ---
00:30:51 [2022-02-12T05:30:51.494Z] [INFO] 
00:30:51 [2022-02-12T05:30:51.494Z] [INFO] --- tycho-packaging-plugin:2.2.0:validate-version (default-validate-version) @ org.eclipse.ease.lang.python.jython.test ---
00:30:51 [2022-02-12T05:30:51.494Z] [INFO] 
00:30:51 [2022-02-12T05:30:51.494Z] [INFO] --- maven-resources-plugin:2.4.3:resources (default-resources) @ org.eclipse.ease.lang.python.jython.test ---
00:30:51 [2022-02-12T05:30:51.494Z] [INFO] Using 'UTF-8' encoding to copy filtered resources.
00:30:51 [2022-02-12T05:30:51.494Z] [INFO] skip non existing resourceDirectory /home/jenkins/agent/workspace/ease.verify.core.target.2018-12/tests/org.eclipse.ease.lang.python.jython.test/src/main/resources
00:30:51 [2022-02-12T05:30:51.494Z] [INFO] 
00:30:51 [2022-02-12T05:30:51.494Z] [INFO] --- tycho-compiler-plugin:2.2.0:compile (default-compile) @ org.eclipse.ease.lang.python.jython.test ---
00:30:51 [2022-02-12T05:30:51.494Z] [INFO] Nothing to compile - all classes are up to date
00:30:51 [2022-02-12T05:30:51.494Z] [INFO] 
00:30:51 [2022-02-12T05:30:51.494Z] [INFO] --- maven-resources-plugin:2.4.3:testResources (default-testResources) @ org.eclipse.ease.lang.python.jython.test ---
00:30:51 [2022-02-12T05:30:51.494Z] [INFO] Using 'UTF-8' encoding to copy filtered resources.
00:30:51 [2022-02-12T05:30:51.494Z] [INFO] skip non existing resourceDirectory /home/jenkins/agent/workspace/ease.verify.core.target.2018-12/tests/org.eclipse.ease.lang.python.jython.test/src/test/resources
00:30:51 [2022-02-12T05:30:51.494Z] [INFO] 
00:30:51 [2022-02-12T05:30:51.494Z] [INFO] --- target-platform-configuration:2.2.0:target-platform (default-target-platform) @ org.eclipse.ease.lang.python.jython.test ---
00:30:51 [2022-02-12T05:30:51.494Z] [INFO] 
00:30:51 [2022-02-12T05:30:51.494Z] [INFO] --- tycho-packaging-plugin:2.2.0:package-plugin (default-package-plugin) @ org.eclipse.ease.lang.python.jython.test ---
00:30:51 [2022-02-12T05:30:51.494Z] [INFO] Building jar: /home/jenkins/agent/workspace/ease.verify.core.target.2018-12/tests/org.eclipse.ease.lang.python.jython.test/target/org.eclipse.ease.lang.python.jython.test-0.9.0-SNAPSHOT.jar
00:30:51 [2022-02-12T05:30:51.494Z] [INFO] 
00:30:51 [2022-02-12T05:30:51.494Z] [INFO] --- tycho-p2-plugin:2.2.0:p2-metadata-default (default-p2-metadata-default) @ org.eclipse.ease.lang.python.jython.test ---
00:30:51 [2022-02-12T05:30:51.494Z] [INFO] 
00:30:51 [2022-02-12T05:30:51.494Z] [INFO] --- jacoco-maven-plugin:0.8.6:prepare-agent (jacoco-initialize) @ org.eclipse.ease.lang.python.jython.test ---
00:30:51 [2022-02-12T05:30:51.494Z] [INFO] tycho.testArgLine set to -javaagent:/home/jenkins/.m2/repository/org/jacoco/org.jacoco.agent/0.8.6/org.jacoco.agent-0.8.6-runtime.jar=destfile=/home/jenkins/agent/workspace/ease.verify.core.target.2018-12/tests/org.eclipse.ease.lang.python.jython.test/target/jacoco.exec,output=file
00:30:51 [2022-02-12T05:30:51.494Z] [INFO] 
00:30:51 [2022-02-12T05:30:51.494Z] [INFO] --- tycho-surefire-plugin:2.2.0:test (default-test) @ org.eclipse.ease.lang.python.jython.test ---
00:30:52 [2022-02-12T05:30:52.056Z] [INFO] Executing Test Runtime with timeout 0, logs (if any) will be placed at: /home/jenkins/agent/workspace/ease.verify.core.target.2018-12/tests/org.eclipse.ease.lang.python.jython.test/target/work/data/.metadata/.log
00:30:52 [2022-02-12T05:30:52.056Z] [INFO] Command line:
00:30:52 [2022-02-12T05:30:52.056Z] 	[/opt/tools/java/openjdk/jdk-15/15.0.2+7/bin/java, -Dosgi.noShutdown=false, -Dosgi.os=linux, -Dosgi.ws=gtk, -Dosgi.arch=x86_64, -javaagent:/home/jenkins/.m2/repository/org/jacoco/org.jacoco.agent/0.8.6/org.jacoco.agent-0.8.6-runtime.jar=destfile=/home/jenkins/agent/workspace/ease.verify.core.target.2018-12/tests/org.eclipse.ease.lang.python.jython.test/target/jacoco.exec,output=file, -Dosgi.clean=true, -jar, /home/jenkins/.m2/repository/p2/osgi/bundle/org.eclipse.equinox.launcher/1.5.200.v20180922-1751/org.eclipse.equinox.launcher-1.5.200.v20180922-1751.jar, -data, /home/jenkins/agent/workspace/ease.verify.core.target.2018-12/tests/org.eclipse.ease.lang.python.jython.test/target/work/data, -install, /home/jenkins/agent/workspace/ease.verify.core.target.2018-12/tests/org.eclipse.ease.lang.python.jython.test/target/work, -configuration, /home/jenkins/agent/workspace/ease.verify.core.target.2018-12/tests/org.eclipse.ease.lang.python.jython.test/target/work/configuration, -application, org.eclipse.tycho.surefire.osgibooter.headlesstest, -testproperties, /home/jenkins/agent/workspace/ease.verify.core.target.2018-12/tests/org.eclipse.ease.lang.python.jython.test/target/surefire.properties]
00:30:52 [2022-02-12T05:30:52.056Z] Picked up JAVA_TOOL_OPTIONS: -Dmaven.ext.class.path="/home/jenkins/agent/workspace/ease.verify.core.target.2018-12@tmp/withMaven055d1bcb/pipeline-maven-spy.jar" -Dorg.jenkinsci.plugins.pipeline.maven.reportsFolder="/home/jenkins/agent/workspace/ease.verify.core.target.2018-12@tmp/withMaven055d1bcb" 
00:30:55 [2022-02-12T05:30:55.351Z] WARNING: An illegal reflective access operation has occurred
00:30:55 [2022-02-12T05:30:55.351Z] WARNING: Illegal reflective access by org.python.core.PySystemState (file:/home/jenkins/agent/workspace/ease.verify.core.target.2018-12/tests/org.eclipse.ease.lang.python.jython.test/target/work/plugins/org.jython_2.7.0.I202104151016/jython.jar) to method java.io.Console.encoding()
00:30:55 [2022-02-12T05:30:55.351Z] WARNING: Please consider reporting this to the maintainers of org.python.core.PySystemState
00:30:55 [2022-02-12T05:30:55.351Z] WARNING: Use --illegal-access=warn to enable warnings of further illegal reflective access operations
00:30:55 [2022-02-12T05:30:55.351Z] WARNING: All illegal access operations will be denied in a future release
00:30:56 [2022-02-12T05:30:56.280Z] Running org.eclipse.ease.lang.python.jython.debugger.JythonDebugTest
00:30:59 [2022-02-12T05:30:59.596Z] Start of script
00:30:59 [2022-02-12T05:30:59.596Z] include file start
00:30:59 [2022-02-12T05:30:59.596Z] include file processed
00:30:59 [2022-02-12T05:30:59.596Z] Result of testMethod = 5
00:30:59 [2022-02-12T05:30:59.596Z] End of script
00:30:59 [2022-02-12T05:30:59.596Z] Start of script
00:30:59 [2022-02-12T05:30:59.596Z] include file start
00:30:59 [2022-02-12T05:30:59.596Z] include file processed
00:30:59 [2022-02-12T05:30:59.596Z] Result of testMethod = 5
00:30:59 [2022-02-12T05:30:59.596Z] End of script
00:30:59 [2022-02-12T05:30:59.853Z] Start of script
00:30:59 [2022-02-12T05:30:59.853Z] include file start
00:30:59 [2022-02-12T05:30:59.853Z] include file processed
00:30:59 [2022-02-12T05:30:59.853Z] Result of testMethod = 5
00:31:00 [2022-02-12T05:31:00.135Z] Traceback (most recent call last):
00:31:00 [2022-02-12T05:31:00.135Z]   File "(none)", line 184, in run
00:31:00 [2022-02-12T05:31:00.135Z]   File "__ref_L/Debug Test/Main.py_dwrjypkgkq", line 23, in <module>
00:31:00 [2022-02-12T05:31:00.135Z]   File "(none)", line 161, in trace_dispatch
00:31:00 [2022-02-12T05:31:00.135Z] 	at org.eclipse.ease.debugging.AbstractEaseDebugger.handleEventsInSuspendedState(AbstractEaseDebugger.java:331)
00:31:00 [2022-02-12T05:31:00.135Z] 	at org.eclipse.ease.debugging.AbstractEaseDebugger.suspend(AbstractEaseDebugger.java:257)
00:31:00 [2022-02-12T05:31:00.135Z] 	at org.eclipse.ease.debugging.AbstractEaseDebugger.processLine(AbstractEaseDebugger.java:492)
00:31:00 [2022-02-12T05:31:00.135Z] 	at org.eclipse.ease.lang.python.debugger.PythonDebugger.traceDispatch(PythonDebugger.java:179)
00:31:00 [2022-02-12T05:31:00.135Z] 	at org.eclipse.ease.lang.python.jython.debugger.JythonDebugger.traceDispatch(JythonDebugger.java:46)
00:31:00 [2022-02-12T05:31:00.135Z] 	at jdk.internal.reflect.GeneratedMethodAccessor25.invoke(Unknown Source)
00:31:00 [2022-02-12T05:31:00.135Z] 	at java.base/jdk.internal.reflect.DelegatingMethodAccessorImpl.invoke(DelegatingMethodAccessorImpl.java:43)
00:31:00 [2022-02-12T05:31:00.135Z] 	at java.base/java.lang.reflect.Method.invoke(Method.java:564)
00:31:00 [2022-02-12T05:31:00.135Z] 
00:31:00 [2022-02-12T05:31:00.135Z] org.eclipse.ease.ScriptEngineCancellationException: org.eclipse.ease.ScriptEngineCancellationException: Terminated on user request
00:31:00 [2022-02-12T05:31:00.135Z] Start of script
00:31:00 [2022-02-12T05:31:00.391Z] include file start
00:31:00 [2022-02-12T05:31:00.391Z] include file processed
00:31:00 [2022-02-12T05:31:00.391Z] Result of testMethod = 5
00:31:00 [2022-02-12T05:31:00.391Z] End of script
00:31:00 [2022-02-12T05:31:00.649Z] Start of script
00:31:00 [2022-02-12T05:31:00.649Z] include file start
00:31:00 [2022-02-12T05:31:00.649Z] include file processed
00:31:00 [2022-02-12T05:31:00.649Z] Result of testMethod = 5
00:31:00 [2022-02-12T05:31:00.649Z] End of script
00:31:00 [2022-02-12T05:31:00.937Z] Start of script
00:31:00 [2022-02-12T05:31:00.937Z] include file start
00:31:00 [2022-02-12T05:31:00.937Z] include file processed
00:31:01 [2022-02-12T05:31:01.194Z] Result of testMethod = 5
00:31:01 [2022-02-12T05:31:01.194Z] End of script
00:31:01 [2022-02-12T05:31:01.451Z] Start of script
00:31:01 [2022-02-12T05:31:01.451Z] include file start
00:31:01 [2022-02-12T05:31:01.451Z] include file processed
00:31:01 [2022-02-12T05:31:01.451Z] Result of testMethod = 5
00:31:01 [2022-02-12T05:31:01.451Z] Traceback (most recent call last):
00:31:01 [2022-02-12T05:31:01.451Z]   File "(none)", line 184, in run
00:31:01 [2022-02-12T05:31:01.451Z]   File "__ref_L/Debug Test/Main.py_gwsyjpjlpx", line 23, in <module>
00:31:01 [2022-02-12T05:31:01.451Z]   File "(none)", line 161, in trace_dispatch
00:31:01 [2022-02-12T05:31:01.451Z] 	at org.eclipse.ease.debugging.AbstractEaseDebugger.handleEventsInSuspendedState(AbstractEaseDebugger.java:331)
00:31:01 [2022-02-12T05:31:01.451Z] 	at org.eclipse.ease.debugging.AbstractEaseDebugger.suspend(AbstractEaseDebugger.java:257)
00:31:01 [2022-02-12T05:31:01.451Z] 	at org.eclipse.ease.debugging.AbstractEaseDebugger.processLine(AbstractEaseDebugger.java:492)
00:31:01 [2022-02-12T05:31:01.451Z] 	at org.eclipse.ease.lang.python.debugger.PythonDebugger.traceDispatch(PythonDebugger.java:179)
00:31:01 [2022-02-12T05:31:01.451Z] 	at org.eclipse.ease.lang.python.jython.debugger.JythonDebugger.traceDispatch(JythonDebugger.java:46)
00:31:01 [2022-02-12T05:31:01.451Z] 	at jdk.internal.reflect.GeneratedMethodAccessor25.invoke(Unknown Source)
00:31:01 [2022-02-12T05:31:01.451Z] 	at java.base/jdk.internal.reflect.DelegatingMethodAccessorImpl.invoke(DelegatingMethodAccessorImpl.java:43)
00:31:01 [2022-02-12T05:31:01.451Z] 	at java.base/java.lang.reflect.Method.invoke(Method.java:564)
00:31:01 [2022-02-12T05:31:01.451Z] 
00:31:01 [2022-02-12T05:31:01.451Z] org.eclipse.ease.ScriptEngineCancellationException: org.eclipse.ease.ScriptEngineCancellationException: Terminated on user request
00:31:01 [2022-02-12T05:31:01.708Z] Start of script
00:31:01 [2022-02-12T05:31:01.708Z] include file start
00:31:01 [2022-02-12T05:31:01.708Z] include file processed
00:31:01 [2022-02-12T05:31:01.708Z] Result of testMethod = 5
00:31:01 [2022-02-12T05:31:01.708Z] End of script
00:31:01 [2022-02-12T05:31:01.965Z] Start of script
00:31:01 [2022-02-12T05:31:01.965Z] include file start
00:31:01 [2022-02-12T05:31:01.965Z] include file processed
00:31:01 [2022-02-12T05:31:01.965Z] Result of testMethod = 5
00:31:01 [2022-02-12T05:31:01.965Z] End of script
00:31:02 [2022-02-12T05:31:02.221Z] Start of script
00:31:02 [2022-02-12T05:31:02.221Z] include file start
00:31:02 [2022-02-12T05:31:02.221Z] include file processed
00:31:02 [2022-02-12T05:31:02.784Z] Traceback (most recent call last):
00:31:02 [2022-02-12T05:31:02.784Z]   File "(none)", line 184, in run
00:31:02 [2022-02-12T05:31:02.784Z]   File "__ref_L/Debug Test/Main.py_zuuwbtnzdh", line 22, in <module>
00:31:02 [2022-02-12T05:31:02.784Z]   File "(none)", line 161, in trace_dispatch
00:31:02 [2022-02-12T05:31:02.784Z] 	at org.eclipse.ease.debugging.AbstractEaseDebugger.handleEventsInSuspendedState(AbstractEaseDebugger.java:331)
00:31:02 [2022-02-12T05:31:02.784Z] 	at org.eclipse.ease.debugging.AbstractEaseDebugger.suspend(AbstractEaseDebugger.java:257)
00:31:02 [2022-02-12T05:31:02.784Z] 	at org.eclipse.ease.debugging.AbstractEaseDebugger.processLine(AbstractEaseDebugger.java:512)
00:31:02 [2022-02-12T05:31:02.784Z] 	at org.eclipse.ease.lang.python.debugger.PythonDebugger.traceDispatch(PythonDebugger.java:179)
00:31:02 [2022-02-12T05:31:02.784Z] 	at org.eclipse.ease.lang.python.jython.debugger.JythonDebugger.traceDispatch(JythonDebugger.java:46)
00:31:02 [2022-02-12T05:31:02.784Z] 	at jdk.internal.reflect.GeneratedMethodAccessor25.invoke(Unknown Source)
00:31:02 [2022-02-12T05:31:02.784Z] 	at java.base/jdk.internal.reflect.DelegatingMethodAccessorImpl.invoke(DelegatingMethodAccessorImpl.java:43)
00:31:02 [2022-02-12T05:31:02.784Z] 	at java.base/java.lang.reflect.Method.invoke(Method.java:564)
00:31:02 [2022-02-12T05:31:02.784Z] 
00:31:02 [2022-02-12T05:31:02.784Z] org.eclipse.ease.ScriptEngineCancellationException: org.eclipse.ease.ScriptEngineCancellationException: Terminated on user request
00:31:02 [2022-02-12T05:31:02.784Z] Start of script
00:31:02 [2022-02-12T05:31:02.784Z] include file start
00:31:02 [2022-02-12T05:31:02.784Z] include file processed
00:31:02 [2022-02-12T05:31:02.784Z] Result of testMethod = 5
00:31:02 [2022-02-12T05:31:02.784Z] End of script
00:31:03 [2022-02-12T05:31:03.041Z] Start of script
00:31:03 [2022-02-12T05:31:03.041Z] include file start
00:31:03 [2022-02-12T05:31:03.041Z] include file processed
00:31:03 [2022-02-12T05:31:03.041Z] Result of testMethod = 5
00:31:03 [2022-02-12T05:31:03.041Z] End of script
00:31:03 [2022-02-12T05:31:03.605Z] Traceback (most recent call last):
00:31:03 [2022-02-12T05:31:03.605Z]   File "(none)", line 184, in run
00:31:03 [2022-02-12T05:31:03.605Z]   File "__ref_L/Debug Test/Main.py_yzxxdbfako", line 1, in <module>
00:31:03 [2022-02-12T05:31:03.605Z]   File "(none)", line 161, in trace_dispatch
00:31:03 [2022-02-12T05:31:03.605Z] 	at org.eclipse.ease.debugging.AbstractEaseDebugger.handleEventsInSuspendedState(AbstractEaseDebugger.java:331)
00:31:03 [2022-02-12T05:31:03.605Z] 	at org.eclipse.ease.debugging.AbstractEaseDebugger.suspend(AbstractEaseDebugger.java:257)
00:31:03 [2022-02-12T05:31:03.605Z] 	at org.eclipse.ease.debugging.AbstractEaseDebugger.processLine(AbstractEaseDebugger.java:492)
00:31:03 [2022-02-12T05:31:03.605Z] 	at org.eclipse.ease.lang.python.debugger.PythonDebugger.traceDispatch(PythonDebugger.java:179)
00:31:03 [2022-02-12T05:31:03.605Z] 	at org.eclipse.ease.lang.python.jython.debugger.JythonDebugger.traceDispatch(JythonDebugger.java:46)
00:31:03 [2022-02-12T05:31:03.605Z] 	at jdk.internal.reflect.GeneratedMethodAccessor25.invoke(Unknown Source)
00:31:03 [2022-02-12T05:31:03.605Z] 	at java.base/jdk.internal.reflect.DelegatingMethodAccessorImpl.invoke(DelegatingMethodAccessorImpl.java:43)
00:31:03 [2022-02-12T05:31:03.605Z] 	at java.base/java.lang.reflect.Method.invoke(Method.java:564)
00:31:03 [2022-02-12T05:31:03.605Z] 
00:31:03 [2022-02-12T05:31:03.605Z] org.eclipse.ease.ScriptEngineCancellationException: org.eclipse.ease.ScriptEngineCancellationException: Terminated on user request
00:31:03 [2022-02-12T05:31:03.605Z] Start of script
00:31:03 [2022-02-12T05:31:03.605Z] include file start
00:31:03 [2022-02-12T05:31:03.605Z] include file processed
00:31:03 [2022-02-12T05:31:03.605Z] Result of testMethod = 5
00:31:03 [2022-02-12T05:31:03.605Z] End of script
00:31:03 [2022-02-12T05:31:03.861Z] Start of script
00:31:03 [2022-02-12T05:31:03.861Z] include file start
00:31:03 [2022-02-12T05:31:03.861Z] include file processed
00:31:03 [2022-02-12T05:31:03.861Z] Result of testMethod = 5
00:31:03 [2022-02-12T05:31:03.861Z] End of script
00:31:04 [2022-02-12T05:31:04.116Z] Start of script
00:31:04 [2022-02-12T05:31:04.116Z] include file start
00:31:04 [2022-02-12T05:31:04.116Z] include file processed
00:31:04 [2022-02-12T05:31:04.116Z] Result of testMethod = 5
00:31:04 [2022-02-12T05:31:04.372Z] Traceback (most recent call last):
00:31:04 [2022-02-12T05:31:04.372Z]   File "(none)", line 184, in run
00:31:04 [2022-02-12T05:31:04.372Z]   File "__ref_L/Debug Test/Main.py_eygcfikbuj", line 23, in <module>
00:31:04 [2022-02-12T05:31:04.372Z]   File "(none)", line 161, in trace_dispatch
00:31:04 [2022-02-12T05:31:04.372Z] 	at org.eclipse.ease.debugging.AbstractEaseDebugger.handleEventsInSuspendedState(AbstractEaseDebugger.java:331)
00:31:04 [2022-02-12T05:31:04.372Z] 	at org.eclipse.ease.debugging.AbstractEaseDebugger.suspend(AbstractEaseDebugger.java:257)
00:31:04 [2022-02-12T05:31:04.372Z] 	at org.eclipse.ease.debugging.AbstractEaseDebugger.processLine(AbstractEaseDebugger.java:492)
00:31:04 [2022-02-12T05:31:04.372Z] 	at org.eclipse.ease.lang.python.debugger.PythonDebugger.traceDispatch(PythonDebugger.java:179)
00:31:04 [2022-02-12T05:31:04.372Z] 	at org.eclipse.ease.lang.python.jython.debugger.JythonDebugger.traceDispatch(JythonDebugger.java:46)
00:31:04 [2022-02-12T05:31:04.372Z] 	at jdk.internal.reflect.GeneratedMethodAccessor25.invoke(Unknown Source)
00:31:04 [2022-02-12T05:31:04.372Z] 	at java.base/jdk.internal.reflect.DelegatingMethodAccessorImpl.invoke(DelegatingMethodAccessorImpl.java:43)
00:31:04 [2022-02-12T05:31:04.372Z] 	at java.base/java.lang.reflect.Method.invoke(Method.java:564)
00:31:04 [2022-02-12T05:31:04.372Z] 
00:31:04 [2022-02-12T05:31:04.372Z] org.eclipse.ease.ScriptEngineCancellationException: org.eclipse.ease.ScriptEngineCancellationException: Terminated on user request
00:31:04 [2022-02-12T05:31:04.629Z] Start of script
00:31:04 [2022-02-12T05:31:04.629Z] include file start
00:31:04 [2022-02-12T05:31:04.629Z] include file processed
00:31:04 [2022-02-12T05:31:04.629Z] Result of testMethod = 5
00:31:04 [2022-02-12T05:31:04.629Z] End of script
00:31:04 [2022-02-12T05:31:04.885Z] Traceback (most recent call last):
00:31:04 [2022-02-12T05:31:04.885Z]   File "(none)", line 184, in run
00:31:04 [2022-02-12T05:31:04.885Z]   File "__ref_L/Debug Test/Main.py_utevrnctuz", line 1, in <module>
00:31:04 [2022-02-12T05:31:04.885Z]   File "(none)", line 161, in trace_dispatch
00:31:04 [2022-02-12T05:31:04.885Z] 	at org.eclipse.ease.debugging.AbstractEaseDebugger.handleEventsInSuspendedState(AbstractEaseDebugger.java:331)
00:31:04 [2022-02-12T05:31:04.885Z] 	at org.eclipse.ease.debugging.AbstractEaseDebugger.suspend(AbstractEaseDebugger.java:257)
00:31:04 [2022-02-12T05:31:04.885Z] 	at org.eclipse.ease.debugging.AbstractEaseDebugger.processLine(AbstractEaseDebugger.java:492)
00:31:04 [2022-02-12T05:31:04.885Z] 	at org.eclipse.ease.lang.python.debugger.PythonDebugger.traceDispatch(PythonDebugger.java:179)
00:31:04 [2022-02-12T05:31:04.885Z] 	at org.eclipse.ease.lang.python.jython.debugger.JythonDebugger.traceDispatch(JythonDebugger.java:46)
00:31:04 [2022-02-12T05:31:04.885Z] 	at jdk.internal.reflect.GeneratedMethodAccessor25.invoke(Unknown Source)
00:31:04 [2022-02-12T05:31:04.885Z] 	at java.base/jdk.internal.reflect.DelegatingMethodAccessorImpl.invoke(DelegatingMethodAccessorImpl.java:43)
00:31:04 [2022-02-12T05:31:04.885Z] 	at java.base/java.lang.reflect.Method.invoke(Method.java:564)
00:31:04 [2022-02-12T05:31:04.885Z] 
00:31:04 [2022-02-12T05:31:04.885Z] org.eclipse.ease.ScriptEngineCancellationException: org.eclipse.ease.ScriptEngineCancellationException: Terminated on user request
00:31:05 [2022-02-12T05:31:05.141Z] Start of script
00:31:05 [2022-02-12T05:31:05.141Z] include file start
00:31:05 [2022-02-12T05:31:05.141Z] include file processed
00:31:05 [2022-02-12T05:31:05.141Z] Result of testMethod = 5
00:31:05 [2022-02-12T05:31:05.141Z] End of script
00:31:05 [2022-02-12T05:31:05.398Z] Start of script
00:31:05 [2022-02-12T05:31:05.398Z] include file start
00:31:05 [2022-02-12T05:31:05.398Z] include file processed
00:31:05 [2022-02-12T05:31:05.398Z] Result of testMethod = 5
00:31:05 [2022-02-12T05:31:05.398Z] End of script
00:31:05 [2022-02-12T05:31:05.654Z] Traceback (most recent call last):
00:31:05 [2022-02-12T05:31:05.654Z]   File "(none)", line 184, in run
00:31:05 [2022-02-12T05:31:05.654Z]   File "__ref_L/Debug Test/Main.py_zdqusvrboq", line 1, in <module>
00:31:05 [2022-02-12T05:31:05.654Z]   File "(none)", line 161, in trace_dispatch
00:31:05 [2022-02-12T05:31:05.654Z] 	at org.eclipse.ease.debugging.AbstractEaseDebugger.handleEventsInSuspendedState(AbstractEaseDebugger.java:331)
00:31:05 [2022-02-12T05:31:05.654Z] 	at org.eclipse.ease.debugging.AbstractEaseDebugger.suspend(AbstractEaseDebugger.java:257)
00:31:05 [2022-02-12T05:31:05.654Z] 	at org.eclipse.ease.debugging.AbstractEaseDebugger.processLine(AbstractEaseDebugger.java:492)
00:31:05 [2022-02-12T05:31:05.654Z] 	at org.eclipse.ease.lang.python.debugger.PythonDebugger.traceDispatch(PythonDebugger.java:179)
00:31:05 [2022-02-12T05:31:05.654Z] 	at org.eclipse.ease.lang.python.jython.debugger.JythonDebugger.traceDispatch(JythonDebugger.java:46)
00:31:05 [2022-02-12T05:31:05.654Z] 	at jdk.internal.reflect.GeneratedMethodAccessor25.invoke(Unknown Source)
00:31:05 [2022-02-12T05:31:05.654Z] 	at java.base/jdk.internal.reflect.DelegatingMethodAccessorImpl.invoke(DelegatingMethodAccessorImpl.java:43)
00:31:05 [2022-02-12T05:31:05.654Z] 	at java.base/java.lang.reflect.Method.invoke(Method.java:564)
00:31:05 [2022-02-12T05:31:05.654Z] 
00:31:05 [2022-02-12T05:31:05.654Z] org.eclipse.ease.ScriptEngineCancellationException: org.eclipse.ease.ScriptEngineCancellationException: Terminated on user request
00:31:05 [2022-02-12T05:31:05.911Z] Start of script
00:31:05 [2022-02-12T05:31:05.911Z] include file start
00:31:05 [2022-02-12T05:31:05.911Z] include file processed
00:31:05 [2022-02-12T05:31:05.911Z] Result of testMethod = 5
00:31:05 [2022-02-12T05:31:05.911Z] End of script
00:31:06 [2022-02-12T05:31:06.167Z] Start of script
00:31:06 [2022-02-12T05:31:06.167Z] include file start
00:31:06 [2022-02-12T05:31:06.167Z] include file processed
00:31:06 [2022-02-12T05:31:06.167Z] Result of testMethod = 5
00:31:06 [2022-02-12T05:31:06.424Z] Traceback (most recent call last):
00:31:06 [2022-02-12T05:31:06.424Z]   File "(none)", line 184, in run
00:31:06 [2022-02-12T05:31:06.424Z]   File "__ref_L/Debug Test/Main.py_cbotovkoyp", line 23, in <module>
00:31:06 [2022-02-12T05:31:06.424Z]   File "(none)", line 161, in trace_dispatch
00:31:06 [2022-02-12T05:31:06.424Z] 	at org.eclipse.ease.debugging.AbstractEaseDebugger.handleEventsInSuspendedState(AbstractEaseDebugger.java:331)
00:31:06 [2022-02-12T05:31:06.424Z] 	at org.eclipse.ease.debugging.AbstractEaseDebugger.suspend(AbstractEaseDebugger.java:257)
00:31:06 [2022-02-12T05:31:06.424Z] 	at org.eclipse.ease.debugging.AbstractEaseDebugger.processLine(AbstractEaseDebugger.java:492)
00:31:06 [2022-02-12T05:31:06.424Z] 	at org.eclipse.ease.lang.python.debugger.PythonDebugger.traceDispatch(PythonDebugger.java:179)
00:31:06 [2022-02-12T05:31:06.424Z] 	at org.eclipse.ease.lang.python.jython.debugger.JythonDebugger.traceDispatch(JythonDebugger.java:46)
00:31:06 [2022-02-12T05:31:06.424Z] 	at jdk.internal.reflect.GeneratedMethodAccessor25.invoke(Unknown Source)
00:31:06 [2022-02-12T05:31:06.424Z] 	at java.base/jdk.internal.reflect.DelegatingMethodAccessorImpl.invoke(DelegatingMethodAccessorImpl.java:43)
00:31:06 [2022-02-12T05:31:06.424Z] 	at java.base/java.lang.reflect.Method.invoke(Method.java:564)
00:31:06 [2022-02-12T05:31:06.424Z] 
00:31:06 [2022-02-12T05:31:06.424Z] org.eclipse.ease.ScriptEngineCancellationException: org.eclipse.ease.ScriptEngineCancellationException: Terminated on user request
00:31:06 [2022-02-12T05:31:06.424Z] Start of script
00:31:06 [2022-02-12T05:31:06.681Z] include file start
00:31:06 [2022-02-12T05:31:06.681Z] include file processed
00:31:06 [2022-02-12T05:31:06.681Z] Result of testMethod = 5
00:31:06 [2022-02-12T05:31:06.681Z] End of script
00:31:06 [2022-02-12T05:31:06.681Z] Start of script
00:31:06 [2022-02-12T05:31:06.681Z] include file start
00:31:06 [2022-02-12T05:31:06.681Z] include file processed
00:31:06 [2022-02-12T05:31:06.938Z] Result of testMethod = 5
00:31:06 [2022-02-12T05:31:06.938Z] End of script
00:31:07 [2022-02-12T05:31:07.196Z] Start of script
00:31:07 [2022-02-12T05:31:07.196Z] include file start
00:31:07 [2022-02-12T05:31:07.196Z] include file processed
00:31:07 [2022-02-12T05:31:07.196Z] Result of testMethod = 5
00:31:07 [2022-02-12T05:31:07.196Z] End of script
00:31:07 [2022-02-12T05:31:07.196Z] Start of script
00:31:07 [2022-02-12T05:31:07.196Z] include file start
00:31:07 [2022-02-12T05:31:07.196Z] include file processed
00:31:07 [2022-02-12T05:31:07.452Z] Result of testMethod = 5
00:31:07 [2022-02-12T05:31:07.452Z] End of script
00:31:07 [2022-02-12T05:31:07.452Z] Start of script
00:31:07 [2022-02-12T05:31:07.452Z] include file start
00:31:07 [2022-02-12T05:31:07.452Z] include file processed
00:31:07 [2022-02-12T05:31:07.708Z] Traceback (most recent call last):
00:31:07 [2022-02-12T05:31:07.708Z]   File "(none)", line 184, in run
00:31:07 [2022-02-12T05:31:07.708Z]   File "__ref_L/Debug Test/Main.py_xyqoxoytlp", line 21, in <module>
00:31:07 [2022-02-12T05:31:07.708Z]   File "__ref_L/Debug Test/Main.py_xyqoxoytlp", line 18, in testMethod
00:31:07 [2022-02-12T05:31:07.708Z]   File "(none)", line 161, in trace_dispatch
00:31:07 [2022-02-12T05:31:07.708Z] 	at org.eclipse.ease.debugging.AbstractEaseDebugger.handleEventsInSuspendedState(AbstractEaseDebugger.java:331)
00:31:07 [2022-02-12T05:31:07.708Z] 	at org.eclipse.ease.debugging.AbstractEaseDebugger.suspend(AbstractEaseDebugger.java:257)
00:31:07 [2022-02-12T05:31:07.708Z] 	at org.eclipse.ease.debugging.AbstractEaseDebugger.processLine(AbstractEaseDebugger.java:492)
00:31:07 [2022-02-12T05:31:07.708Z] 	at org.eclipse.ease.lang.python.debugger.PythonDebugger.traceDispatch(PythonDebugger.java:179)
00:31:07 [2022-02-12T05:31:07.708Z] 	at org.eclipse.ease.lang.python.jython.debugger.JythonDebugger.traceDispatch(JythonDebugger.java:46)
00:31:07 [2022-02-12T05:31:07.708Z] 	at jdk.internal.reflect.GeneratedMethodAccessor25.invoke(Unknown Source)
00:31:07 [2022-02-12T05:31:07.708Z] 	at java.base/jdk.internal.reflect.DelegatingMethodAccessorImpl.invoke(DelegatingMethodAccessorImpl.java:43)
00:31:07 [2022-02-12T05:31:07.708Z] 	at java.base/java.lang.reflect.Method.invoke(Method.java:564)
00:31:07 [2022-02-12T05:31:07.708Z] 
00:31:07 [2022-02-12T05:31:07.708Z] org.eclipse.ease.ScriptEngineCancellationException: org.eclipse.ease.ScriptEngineCancellationException: Terminated on user request
00:31:07 [2022-02-12T05:31:07.965Z] Start of script
00:31:07 [2022-02-12T05:31:07.965Z] include file start
00:31:07 [2022-02-12T05:31:07.965Z] include file processed
00:31:07 [2022-02-12T05:31:07.965Z] Result of testMethod = 5
00:31:07 [2022-02-12T05:31:07.965Z] End of script
00:31:08 [2022-02-12T05:31:08.222Z] Start of script
00:31:08 [2022-02-12T05:31:08.222Z] include file start
00:31:08 [2022-02-12T05:31:08.222Z] include file processed
00:31:08 [2022-02-12T05:31:08.222Z] Result of testMethod = 5
00:31:08 [2022-02-12T05:31:08.479Z] Traceback (most recent call last):
00:31:08 [2022-02-12T05:31:08.479Z]   File "(none)", line 184, in run
00:31:08 [2022-02-12T05:31:08.479Z]   File "__ref_L/Debug Test/Main.py_qqthlufyxf", line 23, in <module>
00:31:08 [2022-02-12T05:31:08.479Z]   File "(none)", line 161, in trace_dispatch
00:31:08 [2022-02-12T05:31:08.479Z] 	at org.eclipse.ease.debugging.AbstractEaseDebugger.handleEventsInSuspendedState(AbstractEaseDebugger.java:331)
00:31:08 [2022-02-12T05:31:08.479Z] 	at org.eclipse.ease.debugging.AbstractEaseDebugger.suspend(AbstractEaseDebugger.java:257)
00:31:08 [2022-02-12T05:31:08.479Z] 	at org.eclipse.ease.debugging.AbstractEaseDebugger.processLine(AbstractEaseDebugger.java:492)
00:31:08 [2022-02-12T05:31:08.479Z] 	at org.eclipse.ease.lang.python.debugger.PythonDebugger.traceDispatch(PythonDebugger.java:179)
00:31:08 [2022-02-12T05:31:08.479Z] 	at org.eclipse.ease.lang.python.jython.debugger.JythonDebugger.traceDispatch(JythonDebugger.java:46)
00:31:08 [2022-02-12T05:31:08.479Z] 	at jdk.internal.reflect.GeneratedMethodAccessor25.invoke(Unknown Source)
00:31:08 [2022-02-12T05:31:08.479Z] 	at java.base/jdk.internal.reflect.DelegatingMethodAccessorImpl.invoke(DelegatingMethodAccessorImpl.java:43)
00:31:08 [2022-02-12T05:31:08.479Z] 	at java.base/java.lang.reflect.Method.invoke(Method.java:564)
00:31:08 [2022-02-12T05:31:08.479Z] 
00:31:08 [2022-02-12T05:31:08.479Z] org.eclipse.ease.ScriptEngineCancellationException: org.eclipse.ease.ScriptEngineCancellationException: Terminated on user request
00:31:08 [2022-02-12T05:31:08.479Z] Start of script
00:31:08 [2022-02-12T05:31:08.479Z] include file start
00:31:08 [2022-02-12T05:31:08.479Z] include file processed
00:31:08 [2022-02-12T05:31:08.479Z] Result of testMethod = 5
00:31:08 [2022-02-12T05:31:08.479Z] End of script
00:31:08 [2022-02-12T05:31:08.736Z] Start of script
00:31:08 [2022-02-12T05:31:08.736Z] include file start
00:31:08 [2022-02-12T05:31:08.736Z] include file processed
00:31:08 [2022-02-12T05:31:08.993Z] Result of testMethod = 5
00:31:08 [2022-02-12T05:31:08.993Z] End of script
00:31:08 [2022-02-12T05:31:08.993Z] Start of script
00:31:08 [2022-02-12T05:31:08.993Z] include file start
00:31:08 [2022-02-12T05:31:08.993Z] include file processed
00:31:09 [2022-02-12T05:31:09.264Z] Result of testMethod = 5
00:31:09 [2022-02-12T05:31:09.264Z] End of script
00:31:09 [2022-02-12T05:31:09.535Z] Start of script
00:31:09 [2022-02-12T05:31:09.535Z] include file start
00:31:09 [2022-02-12T05:31:09.535Z] include file processed
00:31:09 [2022-02-12T05:31:09.535Z] Result of testMethod = 5
00:31:09 [2022-02-12T05:31:09.535Z] End of script
00:31:09 [2022-02-12T05:31:09.535Z] Start of script
00:31:09 [2022-02-12T05:31:09.535Z] include file start
00:31:09 [2022-02-12T05:31:09.535Z] include file processed
00:31:09 [2022-02-12T05:31:09.535Z] Result of testMethod = 5
00:31:09 [2022-02-12T05:31:09.805Z] Traceback (most recent call last):
00:31:09 [2022-02-12T05:31:09.805Z]   File "(none)", line 184, in run
00:31:09 [2022-02-12T05:31:09.805Z]   File "__ref_L/Debug Test/Main.py_sahsoktdmj", line 23, in <module>
00:31:09 [2022-02-12T05:31:09.805Z]   File "(none)", line 161, in trace_dispatch
00:31:09 [2022-02-12T05:31:09.805Z] 	at org.eclipse.ease.debugging.AbstractEaseDebugger.handleEventsInSuspendedState(AbstractEaseDebugger.java:331)
00:31:09 [2022-02-12T05:31:09.805Z] 	at org.eclipse.ease.debugging.AbstractEaseDebugger.suspend(AbstractEaseDebugger.java:257)
00:31:09 [2022-02-12T05:31:09.805Z] 	at org.eclipse.ease.debugging.AbstractEaseDebugger.processLine(AbstractEaseDebugger.java:492)
00:31:09 [2022-02-12T05:31:09.805Z] 	at org.eclipse.ease.lang.python.debugger.PythonDebugger.traceDispatch(PythonDebugger.java:179)
00:31:09 [2022-02-12T05:31:09.805Z] 	at org.eclipse.ease.lang.python.jython.debugger.JythonDebugger.traceDispatch(JythonDebugger.java:46)
00:31:09 [2022-02-12T05:31:09.805Z] 	at jdk.internal.reflect.GeneratedMethodAccessor25.invoke(Unknown Source)
00:31:09 [2022-02-12T05:31:09.805Z] 	at java.base/jdk.internal.reflect.DelegatingMethodAccessorImpl.invoke(DelegatingMethodAccessorImpl.java:43)
00:31:09 [2022-02-12T05:31:09.805Z] 	at java.base/java.lang.reflect.Method.invoke(Method.java:564)
00:31:09 [2022-02-12T05:31:09.805Z] 
00:31:09 [2022-02-12T05:31:09.805Z] org.eclipse.ease.ScriptEngineCancellationException: org.eclipse.ease.ScriptEngineCancellationException: Terminated on user request
00:31:09 [2022-02-12T05:31:09.805Z] Start of script
00:31:09 [2022-02-12T05:31:09.805Z] include file start
00:31:09 [2022-02-12T05:31:09.805Z] include file processed
00:31:09 [2022-02-12T05:31:09.805Z] Result of testMethod = 5
00:31:09 [2022-02-12T05:31:09.805Z] End of script
00:31:10 [2022-02-12T05:31:10.062Z] Start of script
00:31:10 [2022-02-12T05:31:10.062Z] include file start
00:31:10 [2022-02-12T05:31:10.062Z] include file processed
00:31:10 [2022-02-12T05:31:10.062Z] Result of testMethod = 5
00:31:10 [2022-02-12T05:31:10.319Z] Traceback (most recent call last):
00:31:10 [2022-02-12T05:31:10.319Z]   File "(none)", line 184, in run
00:31:10 [2022-02-12T05:31:10.319Z]   File "__ref_L/Debug Test/Main.py_ntjvibalnk", line 23, in <module>
00:31:10 [2022-02-12T05:31:10.319Z]   File "(none)", line 161, in trace_dispatch
00:31:10 [2022-02-12T05:31:10.319Z] 	at org.eclipse.ease.debugging.AbstractEaseDebugger.handleEventsInSuspendedState(AbstractEaseDebugger.java:331)
00:31:10 [2022-02-12T05:31:10.319Z] 	at org.eclipse.ease.debugging.AbstractEaseDebugger.suspend(AbstractEaseDebugger.java:257)
00:31:10 [2022-02-12T05:31:10.319Z] 	at org.eclipse.ease.debugging.AbstractEaseDebugger.processLine(AbstractEaseDebugger.java:492)
00:31:10 [2022-02-12T05:31:10.319Z] 	at org.eclipse.ease.lang.python.debugger.PythonDebugger.traceDispatch(PythonDebugger.java:179)
00:31:10 [2022-02-12T05:31:10.319Z] 	at org.eclipse.ease.lang.python.jython.debugger.JythonDebugger.traceDispatch(JythonDebugger.java:46)
00:31:10 [2022-02-12T05:31:10.319Z] 	at jdk.internal.reflect.GeneratedMethodAccessor25.invoke(Unknown Source)
00:31:10 [2022-02-12T05:31:10.319Z] 	at java.base/jdk.internal.reflect.DelegatingMethodAccessorImpl.invoke(DelegatingMethodAccessorImpl.java:43)
00:31:10 [2022-02-12T05:31:10.319Z] 	at java.base/java.lang.reflect.Method.invoke(Method.java:564)
00:31:10 [2022-02-12T05:31:10.319Z] 
00:31:10 [2022-02-12T05:31:10.319Z] org.eclipse.ease.ScriptEngineCancellationException: org.eclipse.ease.ScriptEngineCancellationException: Terminated on user request
00:31:10 [2022-02-12T05:31:10.319Z] Traceback (most recent call last):
00:31:10 [2022-02-12T05:31:10.319Z]   File "(none)", line 184, in run
00:31:10 [2022-02-12T05:31:10.319Z]   File "__ref_L/Debug Test/Main.py_ajxmhxzysf", line 1, in <module>
00:31:10 [2022-02-12T05:31:10.319Z]   File "(none)", line 161, in trace_dispatch
00:31:10 [2022-02-12T05:31:10.319Z] 	at org.eclipse.ease.debugging.AbstractEaseDebugger.handleEventsInSuspendedState(AbstractEaseDebugger.java:331)
00:31:10 [2022-02-12T05:31:10.319Z] 	at org.eclipse.ease.debugging.AbstractEaseDebugger.suspend(AbstractEaseDebugger.java:257)
00:31:10 [2022-02-12T05:31:10.319Z] 	at org.eclipse.ease.debugging.AbstractEaseDebugger.processLine(AbstractEaseDebugger.java:492)
00:31:10 [2022-02-12T05:31:10.319Z] 	at org.eclipse.ease.lang.python.debugger.PythonDebugger.traceDispatch(PythonDebugger.java:179)
00:31:10 [2022-02-12T05:31:10.319Z] 	at org.eclipse.ease.lang.python.jython.debugger.JythonDebugger.traceDispatch(JythonDebugger.java:46)
00:31:10 [2022-02-12T05:31:10.319Z] 	at jdk.internal.reflect.GeneratedMethodAccessor25.invoke(Unknown Source)
00:31:10 [2022-02-12T05:31:10.319Z] 	at java.base/jdk.internal.reflect.DelegatingMethodAccessorImpl.invoke(DelegatingMethodAccessorImpl.java:43)
00:31:10 [2022-02-12T05:31:10.319Z] 	at java.base/java.lang.reflect.Method.invoke(Method.java:564)
00:31:10 [2022-02-12T05:31:10.319Z] 
00:31:10 [2022-02-12T05:31:10.319Z] org.eclipse.ease.ScriptEngineCancellationException: org.eclipse.ease.ScriptEngineCancellationException: Terminated on user request
00:31:10 [2022-02-12T05:31:10.576Z] Start of script
00:31:10 [2022-02-12T05:31:10.576Z] include file start
00:31:10 [2022-02-12T05:31:10.576Z] include file processed
00:31:10 [2022-02-12T05:31:10.576Z] Result of testMethod = 5
00:31:10 [2022-02-12T05:31:10.576Z] End of script
00:31:10 [2022-02-12T05:31:10.833Z] Start of script
00:31:10 [2022-02-12T05:31:10.833Z] include file start
00:31:10 [2022-02-12T05:31:10.833Z] include file processed
00:31:10 [2022-02-12T05:31:10.833Z] Result of testMethod = 5
00:31:10 [2022-02-12T05:31:10.833Z] End of script
00:31:11 [2022-02-12T05:31:11.089Z] Start of script
00:31:11 [2022-02-12T05:31:11.089Z] include file start
00:31:11 [2022-02-12T05:31:11.089Z] include file processed
00:31:11 [2022-02-12T05:31:11.089Z] Result of testMethod = 5
00:31:11 [2022-02-12T05:31:11.346Z] End of script
00:31:11 [2022-02-12T05:31:11.346Z] Tests run: 41, Failures: 0, Errors: 0, Skipped: 0, Time elapsed: 14.951 s - in org.eclipse.ease.lang.python.jython.debugger.JythonDebugTest
00:31:11 [2022-02-12T05:31:11.346Z] disconnectProcessInSuspendedState  Time elapsed: 3.061 s
00:31:11 [2022-02-12T05:31:11.346Z] stepReturnIncludeCommand  Time elapsed: 0.316 s
00:31:11 [2022-02-12T05:31:11.346Z] arrayVariableSorting  Time elapsed: 0.412 s
00:31:11 [2022-02-12T05:31:11.346Z] stepOverOnDebugTarget  Time elapsed: 0.433 s
00:31:11 [2022-02-12T05:31:11.346Z] disconnectThreadInSuspendedState  Time elapsed: 0.208 s
00:31:11 [2022-02-12T05:31:11.346Z] stepReturnOnDebugTarget  Time elapsed: 0.51 s
00:31:11 [2022-02-12T05:31:11.346Z] nullVariable  Time elapsed: 0.308 s
00:31:11 [2022-02-12T05:31:11.346Z] stepOverOnStackFrame  Time elapsed: 0.309 s
00:31:11 [2022-02-12T05:31:11.346Z] resumeOnDebugTarget  Time elapsed: 0.211 s
00:31:11 [2022-02-12T05:31:11.346Z] modifyVariableKeepingType  Time elapsed: 0.609 s
00:31:11 [2022-02-12T05:31:11.346Z] resumeOnLastIncludeLine  Time elapsed: 0.208 s
00:31:11 [2022-02-12T05:31:11.346Z] stepReturnOnStackFrame  Time elapsed: 0.309 s
00:31:11 [2022-02-12T05:31:11.346Z] terminateStackFrameInSuspendedState  Time elapsed: 0.308 s
00:31:11 [2022-02-12T05:31:11.346Z] breakpointLocation  Time elapsed: 0.208 s
00:31:11 [2022-02-12T05:31:11.346Z] stepReturnOnThread  Time elapsed: 0.308 s
00:31:11 [2022-02-12T05:31:11.346Z] javaClassVariable  Time elapsed: 0.414 s
00:31:11 [2022-02-12T05:31:11.346Z] stepIntoOnThread  Time elapsed: 0.307 s
00:31:11 [2022-02-12T05:31:11.346Z] terminateThreadInSuspendedState  Time elapsed: 0.207 s
00:31:11 [2022-02-12T05:31:11.346Z] resumeOnThread  Time elapsed: 0.208 s
00:31:11 [2022-02-12T05:31:11.346Z] stepIntoOnStackFrame  Time elapsed: 0.407 s
00:31:11 [2022-02-12T05:31:11.346Z] terminateProcessInSuspendedState  Time elapsed: 0.206 s
00:31:11 [2022-02-12T05:31:11.346Z] stepOverOnProcess  Time elapsed: 0.307 s
00:31:11 [2022-02-12T05:31:11.346Z] nativeArrayVariable  Time elapsed: 0.307 s
00:31:11 [2022-02-12T05:31:11.346Z] disconnectDebugTargetInSuspendedState  Time elapsed: 0.206 s
00:31:11 [2022-02-12T05:31:11.346Z] stepIntoOnProcess  Time elapsed: 0.31 s
00:31:11 [2022-02-12T05:31:11.346Z] terminatedState  Time elapsed: 0.208 s
00:31:11 [2022-02-12T05:31:11.346Z] stepOverIncludeCommand  Time elapsed: 0.306 s
00:31:11 [2022-02-12T05:31:11.346Z] innerScopeVariableBeforeOuterScopeVariable  Time elapsed: 0.305 s
00:31:11 [2022-02-12T05:31:11.346Z] stepIntoIncludeCommand  Time elapsed: 0.407 s
00:31:11 [2022-02-12T05:31:11.346Z] primitiveStringVariable  Time elapsed: 0.307 s
00:31:11 [2022-02-12T05:31:11.346Z] resumeOnProcess  Time elapsed: 0.206 s
00:31:11 [2022-02-12T05:31:11.346Z] stepIntoOnDebugTarget  Time elapsed: 0.307 s
00:31:11 [2022-02-12T05:31:11.346Z] stepOverOnThread  Time elapsed: 0.308 s
00:31:11 [2022-02-12T05:31:11.346Z] suspendedState  Time elapsed: 0.205 s
00:31:11 [2022-02-12T05:31:11.346Z] primitiveDoubleVariable  Time elapsed: 0.306 s
00:31:11 [2022-02-12T05:31:11.346Z] resumeOnStackFrame  Time elapsed: 0.205 s
00:31:11 [2022-02-12T05:31:11.346Z] nativeObjectVariable  Time elapsed: 0.306 s
00:31:11 [2022-02-12T05:31:11.346Z] terminateDebugTargetInSuspendedState  Time elapsed: 0.207 s
00:31:11 [2022-02-12T05:31:11.346Z] disconnectStackFrameInSuspendedState  Time elapsed: 0.206 s
00:31:11 [2022-02-12T05:31:11.346Z] stepReturnOnProcess  Time elapsed: 0.307 s
00:31:11 [2022-02-12T05:31:11.346Z] evaluateWatchExpression  Time elapsed: 0.222 s
00:31:11 [2022-02-12T05:31:11.346Z] 
00:31:11 [2022-02-12T05:31:11.346Z] Results:
00:31:11 [2022-02-12T05:31:11.346Z] 
00:31:11 [2022-02-12T05:31:11.346Z] Tests run: 41, Failures: 0, Errors: 0, Skipped: 0
00:31:11 [2022-02-12T05:31:11.346Z] 
00:31:11 [2022-02-12T05:31:11.602Z] [INFO] All tests passed!
00:31:11 [2022-02-12T05:31:11.602Z] [INFO] 
00:31:11 [2022-02-12T05:31:11.602Z] [INFO] -----< org.eclipse.ease:org.eclipse.ease.lang.scriptarchive.test >------
00:31:11 [2022-02-12T05:31:11.602Z] [INFO] Building org.eclipse.ease.lang.scriptarchive.test 0.9.0-SNAPSHOT   [8/9]
00:31:11 [2022-02-12T05:31:11.602Z] [INFO] ------------------------[ eclipse-test-plugin ]-------------------------
00:31:11 [2022-02-12T05:31:11.602Z] [INFO] 
00:31:11 [2022-02-12T05:31:11.602Z] [INFO] --- tycho-packaging-plugin:2.2.0:build-qualifier (default-build-qualifier) @ org.eclipse.ease.lang.scriptarchive.test ---
00:31:11 [2022-02-12T05:31:11.602Z] [INFO] The project's OSGi version is 0.9.0.I202106220815
00:31:11 [2022-02-12T05:31:11.602Z] [INFO] 
00:31:11 [2022-02-12T05:31:11.602Z] [INFO] --- tycho-packaging-plugin:2.2.0:validate-id (default-validate-id) @ org.eclipse.ease.lang.scriptarchive.test ---
00:31:11 [2022-02-12T05:31:11.602Z] [INFO] 
00:31:11 [2022-02-12T05:31:11.602Z] [INFO] --- tycho-packaging-plugin:2.2.0:validate-version (default-validate-version) @ org.eclipse.ease.lang.scriptarchive.test ---
00:31:11 [2022-02-12T05:31:11.602Z] [INFO] 
00:31:11 [2022-02-12T05:31:11.602Z] [INFO] --- maven-resources-plugin:2.4.3:resources (default-resources) @ org.eclipse.ease.lang.scriptarchive.test ---
00:31:11 [2022-02-12T05:31:11.602Z] [INFO] Using 'UTF-8' encoding to copy filtered resources.
00:31:11 [2022-02-12T05:31:11.602Z] [INFO] skip non existing resourceDirectory /home/jenkins/agent/workspace/ease.verify.core.target.2018-12/tests/org.eclipse.ease.lang.scriptarchive.test/src/main/resources
00:31:11 [2022-02-12T05:31:11.603Z] [INFO] 
00:31:11 [2022-02-12T05:31:11.603Z] [INFO] --- tycho-compiler-plugin:2.2.0:compile (default-compile) @ org.eclipse.ease.lang.scriptarchive.test ---
00:31:11 [2022-02-12T05:31:11.603Z] [INFO] Nothing to compile - all classes are up to date
00:31:11 [2022-02-12T05:31:11.603Z] [INFO] 
00:31:11 [2022-02-12T05:31:11.603Z] [INFO] --- maven-resources-plugin:2.4.3:testResources (default-testResources) @ org.eclipse.ease.lang.scriptarchive.test ---
00:31:11 [2022-02-12T05:31:11.603Z] [INFO] Using 'UTF-8' encoding to copy filtered resources.
00:31:11 [2022-02-12T05:31:11.603Z] [INFO] skip non existing resourceDirectory /home/jenkins/agent/workspace/ease.verify.core.target.2018-12/tests/org.eclipse.ease.lang.scriptarchive.test/src/test/resources
00:31:11 [2022-02-12T05:31:11.603Z] [INFO] 
00:31:11 [2022-02-12T05:31:11.603Z] [INFO] --- target-platform-configuration:2.2.0:target-platform (default-target-platform) @ org.eclipse.ease.lang.scriptarchive.test ---
00:31:11 [2022-02-12T05:31:11.603Z] [INFO] 
00:31:11 [2022-02-12T05:31:11.603Z] [INFO] --- tycho-packaging-plugin:2.2.0:package-plugin (default-package-plugin) @ org.eclipse.ease.lang.scriptarchive.test ---
00:31:11 [2022-02-12T05:31:11.603Z] [INFO] Building jar: /home/jenkins/agent/workspace/ease.verify.core.target.2018-12/tests/org.eclipse.ease.lang.scriptarchive.test/target/org.eclipse.ease.lang.scriptarchive.test-0.9.0-SNAPSHOT.jar
00:31:11 [2022-02-12T05:31:11.603Z] [INFO] 
00:31:11 [2022-02-12T05:31:11.603Z] [INFO] --- tycho-p2-plugin:2.2.0:p2-metadata-default (default-p2-metadata-default) @ org.eclipse.ease.lang.scriptarchive.test ---
00:31:11 [2022-02-12T05:31:11.603Z] [INFO] 
00:31:11 [2022-02-12T05:31:11.603Z] [INFO] --- jacoco-maven-plugin:0.8.6:prepare-agent (jacoco-initialize) @ org.eclipse.ease.lang.scriptarchive.test ---
00:31:11 [2022-02-12T05:31:11.603Z] [INFO] tycho.testArgLine set to -javaagent:/home/jenkins/.m2/repository/org/jacoco/org.jacoco.agent/0.8.6/org.jacoco.agent-0.8.6-runtime.jar=destfile=/home/jenkins/agent/workspace/ease.verify.core.target.2018-12/tests/org.eclipse.ease.lang.scriptarchive.test/target/jacoco.exec,output=file
00:31:11 [2022-02-12T05:31:11.603Z] [INFO] 
00:31:11 [2022-02-12T05:31:11.603Z] [INFO] --- tycho-surefire-plugin:2.2.0:test (default-test) @ org.eclipse.ease.lang.scriptarchive.test ---
00:31:11 [2022-02-12T05:31:11.603Z] [INFO] Executing Test Runtime with timeout 0, logs (if any) will be placed at: /home/jenkins/agent/workspace/ease.verify.core.target.2018-12/tests/org.eclipse.ease.lang.scriptarchive.test/target/work/data/.metadata/.log
00:31:11 [2022-02-12T05:31:11.603Z] [INFO] Command line:
00:31:11 [2022-02-12T05:31:11.603Z] 	[/opt/tools/java/openjdk/jdk-15/15.0.2+7/bin/java, -Dosgi.noShutdown=false, -Dosgi.os=linux, -Dosgi.ws=gtk, -Dosgi.arch=x86_64, -javaagent:/home/jenkins/.m2/repository/org/jacoco/org.jacoco.agent/0.8.6/org.jacoco.agent-0.8.6-runtime.jar=destfile=/home/jenkins/agent/workspace/ease.verify.core.target.2018-12/tests/org.eclipse.ease.lang.scriptarchive.test/target/jacoco.exec,output=file, -Dosgi.clean=true, -jar, /home/jenkins/.m2/repository/p2/osgi/bundle/org.eclipse.equinox.launcher/1.5.200.v20180922-1751/org.eclipse.equinox.launcher-1.5.200.v20180922-1751.jar, -data, /home/jenkins/agent/workspace/ease.verify.core.target.2018-12/tests/org.eclipse.ease.lang.scriptarchive.test/target/work/data, -install, /home/jenkins/agent/workspace/ease.verify.core.target.2018-12/tests/org.eclipse.ease.lang.scriptarchive.test/target/work, -configuration, /home/jenkins/agent/workspace/ease.verify.core.target.2018-12/tests/org.eclipse.ease.lang.scriptarchive.test/target/work/configuration, -application, org.eclipse.tycho.surefire.osgibooter.headlesstest, -testproperties, /home/jenkins/agent/workspace/ease.verify.core.target.2018-12/tests/org.eclipse.ease.lang.scriptarchive.test/target/surefire.properties]
00:31:11 [2022-02-12T05:31:11.603Z] Picked up JAVA_TOOL_OPTIONS: -Dmaven.ext.class.path="/home/jenkins/agent/workspace/ease.verify.core.target.2018-12@tmp/withMaven055d1bcb/pipeline-maven-spy.jar" -Dorg.jenkinsci.plugins.pipeline.maven.reportsFolder="/home/jenkins/agent/workspace/ease.verify.core.target.2018-12@tmp/withMaven055d1bcb" 
00:31:15 [2022-02-12T05:31:15.838Z] Running org.eclipse.ease.lang.scriptarchive.ArchiveEngineTest
00:31:15 [2022-02-12T05:31:15.838Z] We are running from a zip file!
00:31:15 [2022-02-12T05:31:15.838Z] org.eclipse.ease.ScriptExecutionException: SyntaxError: missing ; before statement (workspace://__EASE_ScriptArchive_1/scripts/Master.js#3)
00:31:15 [2022-02-12T05:31:15.838Z] this is an error
00:31:15 [2022-02-12T05:31:15.838Z]        ^
00:31:15 [2022-02-12T05:31:15.838Z] 	at Master.js,workspace://__EASE_ScriptArchive_1/scripts/Master.js
00:31:15 [2022-02-12T05:31:15.838Z] org.eclipse.ease.ScriptExecutionException: SyntaxError: missing ; before statement (workspace://__EASE_ScriptArchive_1/scripts/Master.js#3)
00:31:15 [2022-02-12T05:31:15.838Z] this is an error
00:31:15 [2022-02-12T05:31:15.838Z]        ^
00:31:15 [2022-02-12T05:31:15.838Z] 	at Master.js,workspace://__EASE_ScriptArchive_1/scripts/Master.js
00:31:16 [2022-02-12T05:31:16.095Z] Tests run: 7, Failures: 0, Errors: 0, Skipped: 0, Time elapsed: 1.023 s - in org.eclipse.ease.lang.scriptarchive.ArchiveEngineTest
00:31:16 [2022-02-12T05:31:16.095Z] executeWithManifest  Time elapsed: 0.755 s
00:31:16 [2022-02-12T05:31:16.095Z] zipFileRegistration  Time elapsed: 0.04 s
00:31:16 [2022-02-12T05:31:16.095Z] engineIdRegistration  Time elapsed: 0 s
00:31:16 [2022-02-12T05:31:16.095Z] jarFileRegistration  Time elapsed: 0 s
00:31:16 [2022-02-12T05:31:16.095Z] sarFileRegistration  Time elapsed: 0.001 s
00:31:16 [2022-02-12T05:31:16.095Z] executeWithErrors  Time elapsed: 0.085 s
00:31:16 [2022-02-12T05:31:16.095Z] executeWithIncludes  Time elapsed: 0.055 s
00:31:16 [2022-02-12T05:31:16.095Z] 
00:31:16 [2022-02-12T05:31:16.095Z] Results:
00:31:16 [2022-02-12T05:31:16.095Z] 
00:31:16 [2022-02-12T05:31:16.095Z] Tests run: 7, Failures: 0, Errors: 0, Skipped: 0
00:31:16 [2022-02-12T05:31:16.095Z] 
00:31:16 [2022-02-12T05:31:16.658Z] [INFO] All tests passed!
00:31:16 [2022-02-12T05:31:16.658Z] [INFO] 
00:31:16 [2022-02-12T05:31:16.658Z] [INFO] -------------< org.eclipse.ease:org.eclipse.ease.ui.test >--------------
00:31:16 [2022-02-12T05:31:16.658Z] [INFO] Building org.eclipse.ease.ui.test 0.9.0-SNAPSHOT                   [9/9]
00:31:16 [2022-02-12T05:31:16.658Z] [INFO] ------------------------[ eclipse-test-plugin ]-------------------------
00:31:16 [2022-02-12T05:31:16.658Z] [INFO] 
00:31:16 [2022-02-12T05:31:16.658Z] [INFO] --- tycho-packaging-plugin:2.2.0:build-qualifier (default-build-qualifier) @ org.eclipse.ease.ui.test ---
00:31:16 [2022-02-12T05:31:16.658Z] [INFO] The project's OSGi version is 0.9.0.I202201141255
00:31:16 [2022-02-12T05:31:16.658Z] [INFO] 
00:31:16 [2022-02-12T05:31:16.658Z] [INFO] --- tycho-packaging-plugin:2.2.0:validate-id (default-validate-id) @ org.eclipse.ease.ui.test ---
00:31:16 [2022-02-12T05:31:16.658Z] [INFO] 
00:31:16 [2022-02-12T05:31:16.659Z] [INFO] --- tycho-packaging-plugin:2.2.0:validate-version (default-validate-version) @ org.eclipse.ease.ui.test ---
00:31:16 [2022-02-12T05:31:16.659Z] [INFO] 
00:31:16 [2022-02-12T05:31:16.659Z] [INFO] --- maven-resources-plugin:2.4.3:resources (default-resources) @ org.eclipse.ease.ui.test ---
00:31:16 [2022-02-12T05:31:16.659Z] [INFO] Using 'UTF-8' encoding to copy filtered resources.
00:31:16 [2022-02-12T05:31:16.659Z] [INFO] skip non existing resourceDirectory /home/jenkins/agent/workspace/ease.verify.core.target.2018-12/tests/org.eclipse.ease.ui.test/src/main/resources
00:31:16 [2022-02-12T05:31:16.659Z] [INFO] 
00:31:16 [2022-02-12T05:31:16.659Z] [INFO] --- tycho-compiler-plugin:2.2.0:compile (default-compile) @ org.eclipse.ease.ui.test ---
00:31:16 [2022-02-12T05:31:16.659Z] [INFO] Nothing to compile - all classes are up to date
00:31:16 [2022-02-12T05:31:16.659Z] [INFO] 
00:31:16 [2022-02-12T05:31:16.659Z] [INFO] --- maven-resources-plugin:2.4.3:testResources (default-testResources) @ org.eclipse.ease.ui.test ---
00:31:16 [2022-02-12T05:31:16.659Z] [INFO] Using 'UTF-8' encoding to copy filtered resources.
00:31:16 [2022-02-12T05:31:16.659Z] [INFO] skip non existing resourceDirectory /home/jenkins/agent/workspace/ease.verify.core.target.2018-12/tests/org.eclipse.ease.ui.test/src/test/resources
00:31:16 [2022-02-12T05:31:16.659Z] [INFO] 
00:31:16 [2022-02-12T05:31:16.659Z] [INFO] --- target-platform-configuration:2.2.0:target-platform (default-target-platform) @ org.eclipse.ease.ui.test ---
00:31:16 [2022-02-12T05:31:16.659Z] [INFO] 
00:31:16 [2022-02-12T05:31:16.659Z] [INFO] --- tycho-packaging-plugin:2.2.0:package-plugin (default-package-plugin) @ org.eclipse.ease.ui.test ---
00:31:16 [2022-02-12T05:31:16.659Z] [INFO] Building jar: /home/jenkins/agent/workspace/ease.verify.core.target.2018-12/tests/org.eclipse.ease.ui.test/target/org.eclipse.ease.ui.test-0.9.0-SNAPSHOT.jar
00:31:16 [2022-02-12T05:31:16.659Z] [INFO] 
00:31:16 [2022-02-12T05:31:16.659Z] [INFO] --- tycho-p2-plugin:2.2.0:p2-metadata-default (default-p2-metadata-default) @ org.eclipse.ease.ui.test ---
00:31:16 [2022-02-12T05:31:16.659Z] [INFO] 
00:31:16 [2022-02-12T05:31:16.659Z] [INFO] --- jacoco-maven-plugin:0.8.6:prepare-agent (jacoco-initialize) @ org.eclipse.ease.ui.test ---
00:31:16 [2022-02-12T05:31:16.659Z] [INFO] tycho.testArgLine set to -javaagent:/home/jenkins/.m2/repository/org/jacoco/org.jacoco.agent/0.8.6/org.jacoco.agent-0.8.6-runtime.jar=destfile=/home/jenkins/agent/workspace/ease.verify.core.target.2018-12/tests/org.eclipse.ease.ui.test/target/jacoco.exec,output=file
00:31:16 [2022-02-12T05:31:16.659Z] [INFO] 
00:31:16 [2022-02-12T05:31:16.659Z] [INFO] --- tycho-surefire-plugin:2.2.0:test (default-test) @ org.eclipse.ease.ui.test ---
00:31:16 [2022-02-12T05:31:16.659Z] [INFO] Executing Test Runtime with timeout 0, logs (if any) will be placed at: /home/jenkins/agent/workspace/ease.verify.core.target.2018-12/tests/org.eclipse.ease.ui.test/target/work/data/.metadata/.log
00:31:16 [2022-02-12T05:31:16.659Z] [INFO] Command line:
00:31:16 [2022-02-12T05:31:16.659Z] 	[/opt/tools/java/openjdk/jdk-15/15.0.2+7/bin/java, -Dosgi.noShutdown=false, -Dosgi.os=linux, -Dosgi.ws=gtk, -Dosgi.arch=x86_64, -javaagent:/home/jenkins/.m2/repository/org/jacoco/org.jacoco.agent/0.8.6/org.jacoco.agent-0.8.6-runtime.jar=destfile=/home/jenkins/agent/workspace/ease.verify.core.target.2018-12/tests/org.eclipse.ease.ui.test/target/jacoco.exec,output=file, -Dosgi.clean=true, -jar, /home/jenkins/.m2/repository/p2/osgi/bundle/org.eclipse.equinox.launcher/1.5.200.v20180922-1751/org.eclipse.equinox.launcher-1.5.200.v20180922-1751.jar, -data, /home/jenkins/agent/workspace/ease.verify.core.target.2018-12/tests/org.eclipse.ease.ui.test/target/work/data, -install, /home/jenkins/agent/workspace/ease.verify.core.target.2018-12/tests/org.eclipse.ease.ui.test/target/work, -configuration, /home/jenkins/agent/workspace/ease.verify.core.target.2018-12/tests/org.eclipse.ease.ui.test/target/work/configuration, -application, org.eclipse.tycho.surefire.osgibooter.headlesstest, -testproperties, /home/jenkins/agent/workspace/ease.verify.core.target.2018-12/tests/org.eclipse.ease.ui.test/target/surefire.properties]
00:31:16 [2022-02-12T05:31:16.659Z] Picked up JAVA_TOOL_OPTIONS: -Dmaven.ext.class.path="/home/jenkins/agent/workspace/ease.verify.core.target.2018-12@tmp/withMaven055d1bcb/pipeline-maven-spy.jar" -Dorg.jenkinsci.plugins.pipeline.maven.reportsFolder="/home/jenkins/agent/workspace/ease.verify.core.target.2018-12@tmp/withMaven055d1bcb" 
00:31:20 [2022-02-12T05:31:20.940Z] Running org.eclipse.ease.ui.completion.CodeCompletionAggregatorTest
00:31:21 [2022-02-12T05:31:21.197Z] Tests run: 4, Failures: 0, Errors: 0, Skipped: 0, Time elapsed: 0.793 s - in org.eclipse.ease.ui.completion.CodeCompletionAggregatorTest
00:31:21 [2022-02-12T05:31:21.197Z] context_for_empty_input  Time elapsed: 0.752 s
00:31:21 [2022-02-12T05:31:21.197Z] context_for_root_package_with_suffix  Time elapsed: 0.003 s
00:31:21 [2022-02-12T05:31:21.197Z] getProposals_contains_proposal_from_local_provider  Time elapsed: 0.003 s
00:31:21 [2022-02-12T05:31:21.197Z] context_for_root_package  Time elapsed: 0.002 s
00:31:21 [2022-02-12T05:31:21.197Z] Running org.eclipse.ease.ui.completion.provider.AbstractCompletionProviderTest
00:31:21 [2022-02-12T05:31:21.197Z] Tests run: 16, Failures: 0, Errors: 0, Skipped: 0, Time elapsed: 0.12 s - in org.eclipse.ease.ui.completion.provider.AbstractCompletionProviderTest
00:31:21 [2022-02-12T05:31:21.197Z] isStringParameter_equals_true{String}[1]  Time elapsed: 0.041 s
00:31:21 [2022-02-12T05:31:21.197Z] isStringParameter_equals_true{String}[2]  Time elapsed: 0.001 s
00:31:21 [2022-02-12T05:31:21.197Z] isStringParameter_equals_true{String}[3]  Time elapsed: 0.001 s
00:31:21 [2022-02-12T05:31:21.197Z] isStringParameter_equals_true{String}[4]  Time elapsed: 0.002 s
00:31:21 [2022-02-12T05:31:21.197Z] isMethodParameter_equals_true  Time elapsed: 0.002 s
00:31:21 [2022-02-12T05:31:21.197Z] isMethodParameter_equals_true_for_2nd_parameter  Time elapsed: 0 s
00:31:21 [2022-02-12T05:31:21.198Z] isValid_equals_false_for_invalid_context  Time elapsed: 0.02 s
00:31:21 [2022-02-12T05:31:21.198Z] isStringParameter_equals_false{String}[1]  Time elapsed: 0 s
00:31:21 [2022-02-12T05:31:21.198Z] isStringParameter_equals_false{String}[2]  Time elapsed: 0 s
00:31:21 [2022-02-12T05:31:21.198Z] isStringParameter_equals_false{String}[3]  Time elapsed: 0 s
00:31:21 [2022-02-12T05:31:21.198Z] isStringParameter_equals_false{String}[4]  Time elapsed: 0 s
00:31:21 [2022-02-12T05:31:21.198Z] isStringParameter_equals_false{String}[5]  Time elapsed: 0 s
00:31:21 [2022-02-12T05:31:21.198Z] isMethodParameter_equals_false_when_no_method_is_detected  Time elapsed: 0 s
00:31:21 [2022-02-12T05:31:21.198Z] isValid_equals_true_for_valid_context  Time elapsed: 0 s
00:31:21 [2022-02-12T05:31:21.198Z] isMethodParameter_equals_false_for_wrong_method_name  Time elapsed: 0.001 s
00:31:21 [2022-02-12T05:31:21.198Z] isMethodParameter_equals_false_for_wrong_parameter_index  Time elapsed: 0.001 s
00:31:21 [2022-02-12T05:31:21.198Z] Running org.eclipse.ease.ui.completion.provider.VariablesCompletionProviderTest
00:31:21 [2022-02-12T05:31:21.761Z] Tests run: 18, Failures: 0, Errors: 0, Skipped: 0, Time elapsed: 0.368 s - in org.eclipse.ease.ui.completion.provider.VariablesCompletionProviderTest
00:31:21 [2022-02-12T05:31:21.761Z] prepareProposals_instance_contains_integer_variable  Time elapsed: 0.322 s
00:31:21 [2022-02-12T05:31:21.761Z] prepareProposals_instance_contains_string_variable  Time elapsed: 0.001 s
00:31:21 [2022-02-12T05:31:21.761Z] prepareProposals_instance_contains_string_variable_for_filter_input_case_insensitive  Time elapsed: 0.001 s
00:31:21 [2022-02-12T05:31:21.761Z] prepareProposals_instance_contains_string_variable_for_filter_input  Time elapsed: 0.001 s
00:31:21 [2022-02-12T05:31:21.761Z] prepareProposals_does_not_contain_internal_variable  Time elapsed: 0.022 s
00:31:21 [2022-02-12T05:31:21.761Z] isActive_equals_false{String}[1]  Time elapsed: 0.001 s
00:31:21 [2022-02-12T05:31:21.761Z] isActive_equals_false{String}[2]  Time elapsed: 0.002 s
00:31:21 [2022-02-12T05:31:21.761Z] isActive_equals_false{String}[3]  Time elapsed: 0.001 s
00:31:21 [2022-02-12T05:31:21.761Z] isActive_equals_false{String}[4]  Time elapsed: 0.001 s
00:31:21 [2022-02-12T05:31:21.761Z] isActive_equals_false{String}[5]  Time elapsed: 0.001 s
00:31:21 [2022-02-12T05:31:21.761Z] isActive_equals_true{String}[1]  Time elapsed: 0 s
00:31:21 [2022-02-12T05:31:21.761Z] isActive_equals_true{String}[2]  Time elapsed: 0 s
00:31:21 [2022-02-12T05:31:21.761Z] isActive_equals_true{String}[3]  Time elapsed: 0.001 s
00:31:21 [2022-02-12T05:31:21.761Z] isActive_equals_true{String}[4]  Time elapsed: 0.001 s
00:31:21 [2022-02-12T05:31:21.761Z] isActive_equals_true{String}[5]  Time elapsed: 0.001 s
00:31:21 [2022-02-12T05:31:21.761Z] isActive_equals_true{String}[6]  Time elapsed: 0.002 s
00:31:21 [2022-02-12T05:31:21.761Z] isActive_equals_true{String}[7]  Time elapsed: 0.001 s
00:31:21 [2022-02-12T05:31:21.761Z] isActive_equals_true{String}[8]  Time elapsed: 0.001 s
00:31:21 [2022-02-12T05:31:21.761Z] Running org.eclipse.ease.ui.completion.provider.LoadModuleCompletionProviderTest
00:31:21 [2022-02-12T05:31:21.761Z] Tests run: 12, Failures: 0, Errors: 0, Skipped: 0, Time elapsed: 0.021 s - in org.eclipse.ease.ui.completion.provider.LoadModuleCompletionProviderTest
00:31:21 [2022-02-12T05:31:21.761Z] getProposals_contains_root_entry_with_absolute_filter  Time elapsed: 0.006 s
00:31:21 [2022-02-12T05:31:21.761Z] getProposals_contains_root_entry_with_relative_filter  Time elapsed: 0.001 s
00:31:21 [2022-02-12T05:31:21.761Z] getProposals_contains_category_with_relative_filter  Time elapsed: 0.002 s
00:31:21 [2022-02-12T05:31:21.761Z] getProposals_does_not_contain_root_entry_on_filter_mismatch  Time elapsed: 0.001 s
00:31:21 [2022-02-12T05:31:21.761Z] isActive_equals_false{String}[1]  Time elapsed: 0.002 s
00:31:21 [2022-02-12T05:31:21.761Z] isActive_equals_false{String}[2]  Time elapsed: 0.001 s
00:31:21 [2022-02-12T05:31:21.761Z] isActive_equals_false{String}[3]  Time elapsed: 0.001 s
00:31:21 [2022-02-12T05:31:21.761Z] getProposals_contains_root_entry  Time elapsed: 0.001 s
00:31:21 [2022-02-12T05:31:21.761Z] isActive_equals_true{String}[1]  Time elapsed: 0.001 s
00:31:21 [2022-02-12T05:31:21.761Z] isActive_equals_true{String}[2]  Time elapsed: 0.001 s
00:31:21 [2022-02-12T05:31:21.761Z] getProposals_contains_child_entry_with_absolute_filter  Time elapsed: 0 s
00:31:21 [2022-02-12T05:31:21.761Z] getProposals_does_not_contain_entry_on_completed_input  Time elapsed: 0 s
00:31:21 [2022-02-12T05:31:21.761Z] Running org.eclipse.ease.ui.completion.provider.AbstractPathCompletionProviderTest
00:31:21 [2022-02-12T05:31:21.761Z] Tests run: 11, Failures: 0, Errors: 0, Skipped: 0, Time elapsed: 0.009 s - in org.eclipse.ease.ui.completion.provider.AbstractPathCompletionProviderTest
00:31:21 [2022-02-12T05:31:21.761Z] filter_keeps_only_lower_level_on_matching_filter  Time elapsed: 0.004 s
00:31:21 [2022-02-12T05:31:21.761Z] filter_removes_nothing_if_context_is_empty  Time elapsed: 0 s
00:31:21 [2022-02-12T05:31:21.761Z] getPathsFromElements_is_empty_for_root_elements_only  Time elapsed: 0 s
00:31:21 [2022-02-12T05:31:21.761Z] filter_keeps_only_1st_level_on_empty_filter  Time elapsed: 0 s
00:31:21 [2022-02-12T05:31:21.761Z] filter_keeps_only_1st_level_on_matching_filter  Time elapsed: 0 s
00:31:21 [2022-02-12T05:31:21.761Z] getPathsFromElements_is_empty_for_empty_element  Time elapsed: 0.001 s
00:31:21 [2022-02-12T05:31:21.761Z] filter_removes_mismatches_on_same_level  Time elapsed: 0 s
00:31:21 [2022-02-12T05:31:21.761Z] filter_matches_next_level  Time elapsed: 0 s
00:31:21 [2022-02-12T05:31:21.761Z] filter_matches_relative_paths  Time elapsed: 0 s
00:31:21 [2022-02-12T05:31:21.761Z] getPathsFromElements_contains_parent_paths  Time elapsed: 0 s
00:31:21 [2022-02-12T05:31:21.761Z] getPathsFromElements_contains_all_hierarchies  Time elapsed: 0.001 s
00:31:21 [2022-02-12T05:31:21.761Z] Running org.eclipse.ease.ui.completion.provider.LoadedModuleCompletionProviderTest
00:31:21 [2022-02-12T05:31:21.761Z] Tests run: 15, Failures: 0, Errors: 0, Skipped: 0, Time elapsed: 0.049 s - in org.eclipse.ease.ui.completion.provider.LoadedModuleCompletionProviderTest
00:31:21 [2022-02-12T05:31:21.761Z] method_proposal_contains_opening_bracket_when_method_has_mandatory_parameters  Time elapsed: 0.003 s
00:31:21 [2022-02-12T05:31:21.761Z] method_proposal_contains_full_method_call_when_method_has_only_optional_parameters  Time elapsed: 0.002 s
00:31:21 [2022-02-12T05:31:21.761Z] getProposals_contains_constant_methods  Time elapsed: 0.031 s
00:31:21 [2022-02-12T05:31:21.761Z] getProposals_contains_module_methods  Time elapsed: 0.002 s
00:31:21 [2022-02-12T05:31:21.761Z] isActive_equals_false{String}[1]  Time elapsed: 0 s
00:31:21 [2022-02-12T05:31:21.761Z] isActive_equals_false{String}[2]  Time elapsed: 0 s
00:31:21 [2022-02-12T05:31:21.761Z] isActive_equals_false{String}[3]  Time elapsed: 0.001 s
00:31:21 [2022-02-12T05:31:21.761Z] isActive_equals_false{String}[4]  Time elapsed: 0 s
00:31:21 [2022-02-12T05:31:21.761Z] isActive_equals_true{String}[1]  Time elapsed: 0.001 s
00:31:21 [2022-02-12T05:31:21.761Z] isActive_equals_true{String}[2]  Time elapsed: 0 s
00:31:21 [2022-02-12T05:31:21.761Z] isActive_equals_true{String}[3]  Time elapsed: 0 s
00:31:21 [2022-02-12T05:31:21.761Z] isActive_equals_true{String}[4]  Time elapsed: 0.001 s
00:31:21 [2022-02-12T05:31:21.761Z] isActive_equals_true{String}[5]  Time elapsed: 0 s
00:31:21 [2022-02-12T05:31:21.761Z] isActive_equals_true{String}[6]  Time elapsed: 0 s
00:31:21 [2022-02-12T05:31:21.761Z] method_proposal_contains_full_method_call_when_method_has_no_parameters  Time elapsed: 0.002 s
00:31:21 [2022-02-12T05:31:21.761Z] Running org.eclipse.ease.ui.completion.provider.LocationResolverTest
00:31:21 [2022-02-12T05:31:21.761Z] Tests run: 1, Failures: 0, Errors: 0, Skipped: 0, Time elapsed: 0.003 s - in org.eclipse.ease.ui.completion.provider.LocationResolverTest
00:31:21 [2022-02-12T05:31:21.761Z] getParentString_has_no_trailing_slashes  Time elapsed: 0.003 s
00:31:21 [2022-02-12T05:31:21.761Z] Running org.eclipse.ease.ui.completion.provider.AbstractFileLocationCompletionProviderTest
00:31:22 [2022-02-12T05:31:22.039Z] Tests run: 22, Failures: 0, Errors: 0, Skipped: 0, Time elapsed: 0.151 s - in org.eclipse.ease.ui.completion.provider.AbstractFileLocationCompletionProviderTest
00:31:22 [2022-02-12T05:31:22.039Z] getProposals_does_not_contain_back_proposal_for_project  Time elapsed: 0.119 s
00:31:22 [2022-02-12T05:31:22.039Z] getProposals_does_not_contain_project_root_with_file_resource  Time elapsed: 0.001 s
00:31:22 [2022-02-12T05:31:22.039Z] getProposals_contains_project_root_files_for_project_root  Time elapsed: 0.001 s
00:31:22 [2022-02-12T05:31:22.039Z] getProposals_contains_files_for_workspace_folder  Time elapsed: 0 s
00:31:22 [2022-02-12T05:31:22.039Z] getProposals_contains_back_for_workspace_folder  Time elapsed: 0 s
00:31:22 [2022-02-12T05:31:22.039Z] getProposals_contains_root_file_systems  Time elapsed: 0.001 s
00:31:22 [2022-02-12T05:31:22.039Z] getProposals_contains_files_for_project  Time elapsed: 0.001 s
00:31:22 [2022-02-12T05:31:22.039Z] back_proposal_contains_correct_replacement_string_for_absolute_workspace_folder_link  Time elapsed: 0 s
00:31:22 [2022-02-12T05:31:22.039Z] getProposals_does_not_contain_project_root_without_resource  Time elapsed: 0.001 s
00:31:22 [2022-02-12T05:31:22.039Z] getProposals_contains_project_root_with_workspace_resource  Time elapsed: 0 s
00:31:22 [2022-02-12T05:31:22.039Z] getProposals_contains_back_for_project_folder  Time elapsed: 0 s
00:31:22 [2022-02-12T05:31:22.039Z] getProposals_contains_project_root_folders_for_workspace_project_with_back_path  Time elapsed: 0.001 s
00:31:22 [2022-02-12T05:31:22.039Z] getProposals_contains_projects_for_workspace_root  Time elapsed: 0 s
00:31:22 [2022-02-12T05:31:22.039Z] getProposals_contains_project_root_folders_for_workspace_project  Time elapsed: 0.001 s
00:31:22 [2022-02-12T05:31:22.039Z] getProposals_contains_filesystem_root  Time elapsed: 0 s
00:31:22 [2022-02-12T05:31:22.039Z] getProposals_contains_files_for_project_folder  Time elapsed: 0.001 s
00:31:22 [2022-02-12T05:31:22.039Z] getProposals_contains_workspace_root  Time elapsed: 0 s
00:31:22 [2022-02-12T05:31:22.039Z] getProposals_does_not_contain_back_proposal  Time elapsed: 0.001 s
00:31:22 [2022-02-12T05:31:22.039Z] getProposals_contains_files_for_filesystem  Time elapsed: 0 s
00:31:22 [2022-02-12T05:31:22.039Z] getProposals_contains_project_root_files_for_workspace_project  Time elapsed: 0 s
00:31:22 [2022-02-12T05:31:22.039Z] getProposals_contains_back_for_filesystem  Time elapsed: 0.001 s
00:31:22 [2022-02-12T05:31:22.039Z] back_proposal_contains_correct_replacement_string_for_relative_workspace_folder_link  Time elapsed: 0 s
00:31:22 [2022-02-12T05:31:22.039Z] Running org.eclipse.ease.ui.completion.tokenizer.TokenListTest
00:31:22 [2022-02-12T05:31:22.039Z] Tests run: 1, Failures: 0, Errors: 0, Skipped: 0, Time elapsed: 0.001 s - in org.eclipse.ease.ui.completion.tokenizer.TokenListTest
00:31:22 [2022-02-12T05:31:22.039Z] new_TokenList_is_empty  Time elapsed: 0.001 s
00:31:22 [2022-02-12T05:31:22.039Z] Running org.eclipse.ease.ui.completion.tokenizer.BracketMatcherTest
00:31:22 [2022-02-12T05:31:22.039Z] Tests run: 9, Failures: 0, Errors: 0, Skipped: 0, Time elapsed: 0.026 s - in org.eclipse.ease.ui.completion.tokenizer.BracketMatcherTest
00:31:22 [2022-02-12T05:31:22.039Z] getOpenBrackets_returns_open_brackets_only  Time elapsed: 0 s
00:31:22 [2022-02-12T05:31:22.039Z] getBrackets_detects_1  Time elapsed: 0 s
00:31:22 [2022-02-12T05:31:22.039Z] getBrackets_detects_2  Time elapsed: 0 s
00:31:22 [2022-02-12T05:31:22.039Z] getBrackets_detects_3  Time elapsed: 0 s
00:31:22 [2022-02-12T05:31:22.039Z] hasOpenBrackets_equals_true  Time elapsed: 0 s
00:31:22 [2022-02-12T05:31:22.039Z] getBrackets_is_empty  Time elapsed: 0 s
00:31:22 [2022-02-12T05:31:22.039Z] hasOpenBrackets_equals_false  Time elapsed: 0 s
00:31:22 [2022-02-12T05:31:22.039Z] getBrackets_detects_open_brackets  Time elapsed: 0.001 s
00:31:22 [2022-02-12T05:31:22.039Z] getBrackets_detects_nested  Time elapsed: 0 s
00:31:22 [2022-02-12T05:31:22.039Z] Running org.eclipse.ease.ui.completion.tokenizer.InputTokenizerTest
00:31:22 [2022-02-12T05:31:22.039Z] Tests run: 68, Failures: 0, Errors: 0, Skipped: 0, Time elapsed: 0.039 s - in org.eclipse.ease.ui.completion.tokenizer.InputTokenizerTest
00:31:22 [2022-02-12T05:31:22.039Z] getTokens_detects_method_chaining  Time elapsed: 0.001 s
00:31:22 [2022-02-12T05:31:22.039Z] isDelimiter_equals_true{String}[1]  Time elapsed: 0 s
00:31:22 [2022-02-12T05:31:22.039Z] isDelimiter_equals_true{String}[2]  Time elapsed: 0 s
00:31:22 [2022-02-12T05:31:22.039Z] isDelimiter_equals_true{String}[3]  Time elapsed: 0.001 s
00:31:22 [2022-02-12T05:31:22.039Z] isDelimiter_equals_true{String}[4]  Time elapsed: 0.001 s
00:31:22 [2022-02-12T05:31:22.039Z] isDelimiter_equals_true{String}[5]  Time elapsed: 0 s
00:31:22 [2022-02-12T05:31:22.039Z] isDelimiter_equals_true{String}[6]  Time elapsed: 0 s
00:31:22 [2022-02-12T05:31:22.039Z] isDelimiter_equals_true{String}[7]  Time elapsed: 0 s
00:31:22 [2022-02-12T05:31:22.039Z] getTokens_detects_package_fragments  Time elapsed: 0.001 s
00:31:22 [2022-02-12T05:31:22.039Z] getTokens_detects_javascript_method_call  Time elapsed: 0 s
00:31:22 [2022-02-12T05:31:22.039Z] getTokens_detects_incomplete_package  Time elapsed: 0.001 s
00:31:22 [2022-02-12T05:31:22.039Z] getTokens_detects_module_methods_call_chain  Time elapsed: 0.001 s
00:31:22 [2022-02-12T05:31:22.039Z] getTokens_splits_string_literal  Time elapsed: 0 s
00:31:22 [2022-02-12T05:31:22.039Z] getTokens_detects_static_method_call  Time elapsed: 0 s
00:31:22 [2022-02-12T05:31:22.039Z] getTokens_detects_method_call_chain  Time elapsed: 0 s
00:31:22 [2022-02-12T05:31:22.039Z] getTokens_simplifies_multiply_operations  Time elapsed: 0 s
00:31:22 [2022-02-12T05:31:22.040Z] getTokens_detects_method_call_parameter_prefix  Time elapsed: 0 s
00:31:22 [2022-02-12T05:31:22.040Z] getTokens_detects_method_call_parameters_with_prefix  Time elapsed: 0.001 s
00:31:22 [2022-02-12T05:31:22.040Z] getTokens_detects_package  Time elapsed: 0 s
00:31:22 [2022-02-12T05:31:22.040Z] getTokens_detects_partial_package  Time elapsed: 0.001 s
00:31:22 [2022-02-12T05:31:22.040Z] getTokens_simplifies_plus_operations  Time elapsed: 0 s
00:31:22 [2022-02-12T05:31:22.040Z] getTokens_detects_class  Time elapsed: 0 s
00:31:22 [2022-02-12T05:31:22.040Z] getTokens_detects_opened_module_method  Time elapsed: 0.001 s
00:31:22 [2022-02-12T05:31:22.040Z] getTokens_simplifies_brackets_recursively  Time elapsed: 0 s
00:31:22 [2022-02-12T05:31:22.040Z] getTokens_detects_method_call_parameter  Time elapsed: 0 s
00:31:22 [2022-02-12T05:31:22.040Z] getTokens_simplifies_brackets  Time elapsed: 0 s
00:31:22 [2022-02-12T05:31:22.040Z] getTokens_removes_new_operator  Time elapsed: 0.001 s
00:31:22 [2022-02-12T05:31:22.040Z] isDelimiter_equals_false{String}[1]  Time elapsed: 0.001 s
00:31:22 [2022-02-12T05:31:22.040Z] isDelimiter_equals_false{String}[2]  Time elapsed: 0 s
00:31:22 [2022-02-12T05:31:22.040Z] isDelimiter_equals_false{String}[3]  Time elapsed: 0 s
00:31:22 [2022-02-12T05:31:22.040Z] getTokens_detects_method_call_parameters  Time elapsed: 0 s
00:31:22 [2022-02-12T05:31:22.040Z] getTokens_detects_class_instantiation  Time elapsed: 0.001 s
00:31:22 [2022-02-12T05:31:22.040Z] getTokens_detects_method_call  Time elapsed: 0 s
00:31:22 [2022-02-12T05:31:22.040Z] getTokens_simplifies_divide_operations  Time elapsed: 0 s
00:31:22 [2022-02-12T05:31:22.040Z] getTokens_removes_left_hand_side_of_assignment  Time elapsed: 0 s
00:31:22 [2022-02-12T05:31:22.040Z] getTokens_detects_javascript_class_instantiation  Time elapsed: 0 s
00:31:22 [2022-02-12T05:31:22.040Z] getTokens_simplifies_for_loop  Time elapsed: 0 s
00:31:22 [2022-02-12T05:31:22.040Z] getTokens_detects_resolved_javascript_variable_2  Time elapsed: 0 s
00:31:22 [2022-02-12T05:31:22.040Z] getTokens_simplifies_minus_operations  Time elapsed: 0.001 s
00:31:22 [2022-02-12T05:31:22.040Z] getTokens_detects_class_instantiation_2  Time elapsed: 0 s
00:31:22 [2022-02-12T05:31:22.040Z] getTokens_detects_class_instantiation_3  Time elapsed: 0 s
00:31:22 [2022-02-12T05:31:22.040Z] getTokens_simplifies_assignments  Time elapsed: 0 s
00:31:22 [2022-02-12T05:31:22.040Z] getTokens_detects_inner_class  Time elapsed: 0 s
00:31:22 [2022-02-12T05:31:22.040Z] getTokens_detects_static_method_call_with_dot_prefix  Time elapsed: 0.001 s
00:31:22 [2022-02-12T05:31:22.040Z] getTokens_detects_class_2  Time elapsed: 0 s
00:31:22 [2022-02-12T05:31:22.040Z] isTextFilter_equals_false{String}[1]  Time elapsed: 0 s
00:31:22 [2022-02-12T05:31:22.040Z] isTextFilter_equals_false{String}[2]  Time elapsed: 0 s
00:31:22 [2022-02-12T05:31:22.040Z] isTextFilter_equals_false{String}[3]  Time elapsed: 0 s
00:31:22 [2022-02-12T05:31:22.040Z] isTextFilter_equals_false{String}[4]  Time elapsed: 0 s
00:31:22 [2022-02-12T05:31:22.040Z] isTextFilter_equals_false{String}[5]  Time elapsed: 0 s
00:31:22 [2022-02-12T05:31:22.040Z] getTokens_does_not_split_within_string_literal  Time elapsed: 0 s
00:31:22 [2022-02-12T05:31:22.040Z] getTokens_1  Time elapsed: 0 s
00:31:22 [2022-02-12T05:31:22.040Z] isTextFilter_equals_true{String}[1]  Time elapsed: 0 s
00:31:22 [2022-02-12T05:31:22.040Z] isTextFilter_equals_true{String}[2]  Time elapsed: 0.001 s
00:31:22 [2022-02-12T05:31:22.040Z] getTokens_detects_opened_module_method_with_filter  Time elapsed: 0 s
00:31:22 [2022-02-12T05:31:22.040Z] getTokens_detects_method_call_request_with_filter  Time elapsed: 0 s
00:31:22 [2022-02-12T05:31:22.040Z] getTokens_for_empty_input  Time elapsed: 0 s
00:31:22 [2022-02-12T05:31:22.040Z] getTokens_detects_package_with_class_prefix  Time elapsed: 0.001 s
00:31:22 [2022-02-12T05:31:22.040Z] getTokens_detects_module_methods  Time elapsed: 0 s
00:31:22 [2022-02-12T05:31:22.040Z] getTokens_detects_completed_method  Time elapsed: 0.001 s
00:31:22 [2022-02-12T05:31:22.040Z] getTokens_detects_resolved_javascript_variable_with_method  Time elapsed: 0.001 s
00:31:22 [2022-02-12T05:31:22.040Z] getTokens_detects_resolved_javascript_variable  Time elapsed: 0 s
00:31:22 [2022-02-12T05:31:22.040Z] getTokens_simplifies_string_literal_1  Time elapsed: 0.001 s
00:31:22 [2022-02-12T05:31:22.040Z] getTokens_simplifies_string_literal_2  Time elapsed: 0 s
00:31:22 [2022-02-12T05:31:22.040Z] getTokens_is_empty_after_string_literal  Time elapsed: 0.001 s
00:31:22 [2022-02-12T05:31:22.040Z] getTokens_detects_static_method_call_chain  Time elapsed: 0 s
00:31:22 [2022-02-12T05:31:22.040Z] getTokens_detects_opened_module_method_with_parameter  Time elapsed: 0.001 s
00:31:22 [2022-02-12T05:31:22.040Z] getTokens_detects_javascript_object_call  Time elapsed: 0 s
00:31:22 [2022-02-12T05:31:22.040Z] Running org.eclipse.ease.ui.completion.BasicContextTest
00:31:22 [2022-02-12T05:31:22.040Z] Tests run: 12, Failures: 0, Errors: 0, Skipped: 0, Time elapsed: 0.007 s - in org.eclipse.ease.ui.completion.BasicContextTest
00:31:22 [2022-02-12T05:31:22.040Z] isValid_equals_true  Time elapsed: 0.001 s
00:31:22 [2022-02-12T05:31:22.040Z] getScriptEngine_returns_engine  Time elapsed: 0.001 s
00:31:22 [2022-02-12T05:31:22.040Z] getFilter_removes_string_literal_start  Time elapsed: 0 s
00:31:22 [2022-02-12T05:31:22.040Z] getLoadedModules_detects_modules_from_ScriptEngine  Time elapsed: 0.001 s
00:31:22 [2022-02-12T05:31:22.040Z] getFilter_contains_parameter_prefix  Time elapsed: 0.001 s
00:31:22 [2022-02-12T05:31:22.040Z] getLoadedModules_contains_environment_on_resource  Time elapsed: 0 s
00:31:22 [2022-02-12T05:31:22.040Z] getLoadedModules_does_not_contain_environment_twice_on_resource  Time elapsed: 0 s
00:31:22 [2022-02-12T05:31:22.040Z] getFilter_is_empty  Time elapsed: 0 s
00:31:22 [2022-02-12T05:31:22.040Z] getFilter_keeps_spaces_in_string_literal  Time elapsed: 0 s
00:31:22 [2022-02-12T05:31:22.040Z] getLoadedModules_detects_loadModule_commands  Time elapsed: 0.001 s
00:31:22 [2022-02-12T05:31:22.040Z] getFilter_is_empty_for_empty_input  Time elapsed: 0 s
00:31:22 [2022-02-12T05:31:22.040Z] isInvalid_equals_true  Time elapsed: 0 s
00:31:22 [2022-02-12T05:31:22.040Z] Running org.eclipse.ease.ui.completion.ScriptCompletionProposalTest
00:31:22 [2022-02-12T05:31:22.040Z] Tests run: 8, Failures: 0, Errors: 0, Skipped: 0, Time elapsed: 0.003 s - in org.eclipse.ease.ui.completion.ScriptCompletionProposalTest
00:31:22 [2022-02-12T05:31:22.040Z] getCursorPosition_equals_end_of_inserted_text  Time elapsed: 0 s
00:31:22 [2022-02-12T05:31:22.040Z] getCursorPosition_equals_end_of_appended_text  Time elapsed: 0 s
00:31:22 [2022-02-12T05:31:22.040Z] compareTo_lists_higher_priority_first  Time elapsed: 0 s
00:31:22 [2022-02-12T05:31:22.040Z] getContent_inserts_replacement_text  Time elapsed: 0 s
00:31:22 [2022-02-12T05:31:22.040Z] getCursorPosition_equals_end_of_set_text  Time elapsed: 0 s
00:31:22 [2022-02-12T05:31:22.040Z] getContent_sets_replacement_text  Time elapsed: 0 s
00:31:22 [2022-02-12T05:31:22.040Z] compareTo_lists_same_prio_in_alphabetic_order  Time elapsed: 0 s
00:31:22 [2022-02-12T05:31:22.040Z] getContent_appends_replacement_text  Time elapsed: 0.001 s
00:31:22 [2022-02-12T05:31:22.040Z] Running org.eclipse.ease.ui.help.hovers.ModuleHelpTest
00:31:22 [2022-02-12T05:31:22.040Z] Tests run: 4, Failures: 0, Errors: 0, Skipped: 4, Time elapsed: 0.035 s - in org.eclipse.ease.ui.help.hovers.ModuleHelpTest
00:31:22 [2022-02-12T05:31:22.040Z] getModuleHelpLocation skipped
00:31:22 [2022-02-12T05:31:22.040Z] getModuleHelp skipped
00:31:22 [2022-02-12T05:31:22.040Z] getMethodHelp skipped
00:31:22 [2022-02-12T05:31:22.040Z] getConstantHelp skipped
00:31:22 [2022-02-12T05:31:22.040Z] Running org.eclipse.ease.ui.views.shell.dropins.modules.ModulesStackLabelProviderTest
00:31:22 [2022-02-12T05:31:22.040Z] Tests run: 3, Failures: 0, Errors: 0, Skipped: 0, Time elapsed: 0.054 s - in org.eclipse.ease.ui.views.shell.dropins.modules.ModulesStackLabelProviderTest
00:31:22 [2022-02-12T05:31:22.040Z] getText_null_returns_empty_string  Time elapsed: 0.004 s
00:31:22 [2022-02-12T05:31:22.040Z] getText_returns_definition_name  Time elapsed: 0.05 s
00:31:22 [2022-02-12T05:31:22.041Z] getText_returns_full_class_name_name  Time elapsed: 0 s
00:31:22 [2022-02-12T05:31:22.041Z] Running org.eclipse.ease.ui.views.shell.dropins.modules.ModulesStackContentProviderTest
00:31:22 [2022-02-12T05:31:22.297Z] Tests run: 2, Failures: 0, Errors: 0, Skipped: 0, Time elapsed: 0.058 s - in org.eclipse.ease.ui.views.shell.dropins.modules.ModulesStackContentProviderTest
00:31:22 [2022-02-12T05:31:22.297Z] getElements_returns_modules  Time elapsed: 0.057 s
00:31:22 [2022-02-12T05:31:22.297Z] getElements_returns_empty_list_without_environment  Time elapsed: 0.001 s
00:31:22 [2022-02-12T05:31:22.297Z] Running org.eclipse.ease.ui.views.shell.dropins.variables.HiddenVariablesFilterTest
00:31:22 [2022-02-12T05:31:22.297Z] Tests run: 3, Failures: 0, Errors: 0, Skipped: 0, Time elapsed: 0.095 s - in org.eclipse.ease.ui.views.shell.dropins.variables.HiddenVariablesFilterTest
00:31:22 [2022-02-12T05:31:22.297Z] select_accepts_unknown_classes  Time elapsed: 0.002 s
00:31:22 [2022-02-12T05:31:22.297Z] select_accepts_script_variables  Time elapsed: 0.091 s
00:31:22 [2022-02-12T05:31:22.297Z] select_declines_hidden_script_variables  Time elapsed: 0.001 s
00:31:22 [2022-02-12T05:31:22.297Z] Running org.eclipse.ease.ui.views.shell.dropins.variables.ContentLabelProviderTest
00:31:22 [2022-02-12T05:31:22.297Z] Tests run: 1, Failures: 0, Errors: 0, Skipped: 0, Time elapsed: 0.039 s - in org.eclipse.ease.ui.views.shell.dropins.variables.ContentLabelProviderTest
00:31:22 [2022-02-12T05:31:22.297Z] getText_returns_variable_content  Time elapsed: 0.039 s
00:31:22 [2022-02-12T05:31:22.297Z] Running org.eclipse.ease.ui.views.shell.dropins.variables.VariablesComparatorTest
00:31:22 [2022-02-12T05:31:22.297Z] Tests run: 1, Failures: 0, Errors: 0, Skipped: 0, Time elapsed: 0.07 s - in org.eclipse.ease.ui.views.shell.dropins.variables.VariablesComparatorTest
00:31:22 [2022-02-12T05:31:22.297Z] lastExecutionResult_comes_before_debugVariable  Time elapsed: 0.069 s
00:31:22 [2022-02-12T05:31:22.297Z] Running org.eclipse.ease.ui.views.shell.dropins.variables.VariablesLabelProviderTest
00:31:22 [2022-02-12T05:31:22.297Z] Tests run: 1, Failures: 0, Errors: 0, Skipped: 0, Time elapsed: 0.003 s - in org.eclipse.ease.ui.views.shell.dropins.variables.VariablesLabelProviderTest
00:31:22 [2022-02-12T05:31:22.297Z] getText_returns_variable_name  Time elapsed: 0.003 s
00:31:22 [2022-02-12T05:31:22.297Z] Running org.eclipse.ease.ui.views.shell.dropins.variables.VariablesContentProviderTest
00:31:22 [2022-02-12T05:31:22.553Z] Tests run: 5, Failures: 0, Errors: 0, Skipped: 0, Time elapsed: 0.038 s - in org.eclipse.ease.ui.views.shell.dropins.variables.VariablesContentProviderTest
00:31:22 [2022-02-12T05:31:22.553Z] hasChildren_true_when_child_nodes_are_available  Time elapsed: 0.001 s
00:31:22 [2022-02-12T05:31:22.553Z] getChildren_is_empty_when_no_child_nodes_are_available  Time elapsed: 0 s
00:31:22 [2022-02-12T05:31:22.553Z] getElements_contains_variables_from_engine  Time elapsed: 0.035 s
00:31:22 [2022-02-12T05:31:22.553Z] hasChildren_false_when_no_child_nodes_are_available  Time elapsed: 0.001 s
00:31:22 [2022-02-12T05:31:22.553Z] getChildren_not_empty_when_child_nodes_are_available  Time elapsed: 0.001 s
00:31:22 [2022-02-12T05:31:22.553Z] Running org.eclipse.ease.ui.dnd.ResourceDropHandlerTest
00:31:22 [2022-02-12T05:31:22.553Z] Tests run: 4, Failures: 0, Errors: 0, Skipped: 0, Time elapsed: 0.246 s - in org.eclipse.ease.ui.dnd.ResourceDropHandlerTest
00:31:22 [2022-02-12T05:31:22.553Z] performDrop_includes_URI_instance  Time elapsed: 0.051 s
00:31:22 [2022-02-12T05:31:22.553Z] performDrop_includes_File_instance  Time elapsed: 0.118 s
00:31:22 [2022-02-12T05:31:22.553Z] accepts_returns_false_for_String_input  Time elapsed: 0.002 s
00:31:22 [2022-02-12T05:31:22.553Z] performDrop_includes_IFile_instance  Time elapsed: 0.073 s
00:31:22 [2022-02-12T05:31:22.553Z] Running org.eclipse.ease.ui.dnd.ModulesDropHandlerTest
00:31:22 [2022-02-12T05:31:22.809Z] Tests run: 5, Failures: 0, Errors: 0, Skipped: 0, Time elapsed: 0.022 s - in org.eclipse.ease.ui.dnd.ModulesDropHandlerTest
00:31:22 [2022-02-12T05:31:22.809Z] accepts_true_for_ModuleEntry  Time elapsed: 0.015 s
00:31:22 [2022-02-12T05:31:22.809Z] performDrop_of_Method_executes_with_default_parameters_on_DROP_COPY  Time elapsed: 0.004 s
00:31:22 [2022-02-12T05:31:22.809Z] performDrop_of_ModuleEntry_loads_module  Time elapsed: 0.002 s
00:31:22 [2022-02-12T05:31:22.809Z] accepts_true_for_ModuleDefinition  Time elapsed: 0 s
00:31:22 [2022-02-12T05:31:22.809Z] performDrop_of_ModuleDefinition_loads_module  Time elapsed: 0.001 s
00:31:22 [2022-02-12T05:31:22.809Z] 
00:31:22 [2022-02-12T05:31:22.809Z] Results:
00:31:22 [2022-02-12T05:31:22.809Z] 
00:31:22 [2022-02-12T05:31:22.809Z] Tests run: 226, Failures: 0, Errors: 0, Skipped: 4
00:31:22 [2022-02-12T05:31:22.809Z] 
00:31:23 [2022-02-12T05:31:23.066Z] [INFO] All tests passed!
00:31:23 [2022-02-12T05:31:23.066Z] [INFO] ------------------------------------------------------------------------
00:31:23 [2022-02-12T05:31:23.067Z] [INFO] Reactor Summary for org.eclipse.ease.releng 0.9.0-SNAPSHOT:
00:31:23 [2022-02-12T05:31:23.067Z] [INFO] 
00:31:23 [2022-02-12T05:31:23.067Z] [INFO] org.eclipse.ease.releng ............................ SUCCESS [  0.002 s]
00:31:23 [2022-02-12T05:31:23.067Z] [INFO] org.eclipse.ease.releng.target ..................... SUCCESS [  0.173 s]
00:31:23 [2022-02-12T05:31:23.067Z] [INFO] org.eclipse.ease.test .............................. SUCCESS [ 19.579 s]
00:31:23 [2022-02-12T05:31:23.067Z] [INFO] org.eclipse.ease.lang.javascript.rhino.test ........ SUCCESS [ 17.057 s]
00:31:23 [2022-02-12T05:31:23.067Z] [INFO] org.eclipse.ease.lang.javascript.test .............. SUCCESS [  3.973 s]
00:31:23 [2022-02-12T05:31:23.067Z] [INFO] org.eclipse.ease.lang.python.test .................. SUCCESS [  6.020 s]
00:31:23 [2022-02-12T05:31:23.067Z] [INFO] org.eclipse.ease.lang.python.jython.test ........... SUCCESS [ 20.134 s]
00:31:23 [2022-02-12T05:31:23.067Z] [INFO] org.eclipse.ease.lang.scriptarchive.test ........... SUCCESS [  4.890 s]
00:31:23 [2022-02-12T05:31:23.067Z] [INFO] org.eclipse.ease.ui.test ........................... SUCCESS [  6.470 s]
00:31:23 [2022-02-12T05:31:23.067Z] [INFO] ------------------------------------------------------------------------
00:31:23 [2022-02-12T05:31:23.067Z] [INFO] BUILD SUCCESS
00:31:23 [2022-02-12T05:31:23.067Z] [INFO] ------------------------------------------------------------------------
00:31:23 [2022-02-12T05:31:23.067Z] [INFO] Total time:  01:55 min
00:31:23 [2022-02-12T05:31:23.067Z] [INFO] Finished at: 2022-02-12T05:31:22Z
00:31:23 [2022-02-12T05:31:23.067Z] [INFO] ------------------------------------------------------------------------
00:31:23 [2022-02-12T05:31:23.067Z] [WARNING] [jenkins-event-spy] Unexpected Maven project file name 'target-tests-pom.xml', problems may occur
00:31:23 [2022-02-12T05:31:23.067Z] [INFO] [jenkins-event-spy] Generated /home/jenkins/agent/workspace/ease.verify.core.target.2018-12@tmp/withMaven055d1bcb/maven-spy-20220212-052927-5235727349417655532100.log