Console Output

Skipping 825 KB.. Full Log
nvoke(Unknown Source)
23:42:19 [2022-01-29T04:42:19.606Z] 	at java.base/jdk.internal.reflect.DelegatingMethodAccessorImpl.invoke(DelegatingMethodAccessorImpl.java:43)
23:42:19 [2022-01-29T04:42:19.606Z] 	at java.base/java.lang.reflect.Method.invoke(Method.java:564)
23:42:19 [2022-01-29T04:42:19.606Z] 
23:42:19 [2022-01-29T04:42:19.606Z] org.eclipse.ease.ScriptEngineCancellationException: org.eclipse.ease.ScriptEngineCancellationException: Terminated on user request
23:42:19 [2022-01-29T04:42:19.862Z] Start of script
23:42:19 [2022-01-29T04:42:19.862Z] include file start
23:42:19 [2022-01-29T04:42:19.862Z] include file processed
23:42:20 [2022-01-29T04:42:20.118Z] Result of testMethod = 5
23:42:20 [2022-01-29T04:42:20.118Z] End of script
23:42:20 [2022-01-29T04:42:20.118Z] Traceback (most recent call last):
23:42:20 [2022-01-29T04:42:20.118Z]   File "(none)", line 184, in run
23:42:20 [2022-01-29T04:42:20.118Z]   File "__ref_L/Debug Test/Main.py_qstngygccx", line 1, in <module>
23:42:20 [2022-01-29T04:42:20.118Z]   File "(none)", line 161, in trace_dispatch
23:42:20 [2022-01-29T04:42:20.118Z] 	at org.eclipse.ease.debugging.AbstractEaseDebugger.handleEventsInSuspendedState(AbstractEaseDebugger.java:331)
23:42:20 [2022-01-29T04:42:20.118Z] 	at org.eclipse.ease.debugging.AbstractEaseDebugger.suspend(AbstractEaseDebugger.java:257)
23:42:20 [2022-01-29T04:42:20.118Z] 	at org.eclipse.ease.debugging.AbstractEaseDebugger.processLine(AbstractEaseDebugger.java:492)
23:42:20 [2022-01-29T04:42:20.118Z] 	at org.eclipse.ease.lang.python.debugger.PythonDebugger.traceDispatch(PythonDebugger.java:179)
23:42:20 [2022-01-29T04:42:20.118Z] 	at org.eclipse.ease.lang.python.jython.debugger.JythonDebugger.traceDispatch(JythonDebugger.java:46)
23:42:20 [2022-01-29T04:42:20.118Z] 	at jdk.internal.reflect.GeneratedMethodAccessor25.invoke(Unknown Source)
23:42:20 [2022-01-29T04:42:20.118Z] 	at java.base/jdk.internal.reflect.DelegatingMethodAccessorImpl.invoke(DelegatingMethodAccessorImpl.java:43)
23:42:20 [2022-01-29T04:42:20.118Z] 	at java.base/java.lang.reflect.Method.invoke(Method.java:564)
23:42:20 [2022-01-29T04:42:20.118Z] 
23:42:20 [2022-01-29T04:42:20.118Z] org.eclipse.ease.ScriptEngineCancellationException: org.eclipse.ease.ScriptEngineCancellationException: Terminated on user request
23:42:20 [2022-01-29T04:42:20.376Z] Start of script
23:42:20 [2022-01-29T04:42:20.376Z] include file start
23:42:20 [2022-01-29T04:42:20.376Z] include file processed
23:42:20 [2022-01-29T04:42:20.376Z] Result of testMethod = 5
23:42:20 [2022-01-29T04:42:20.376Z] End of script
23:42:20 [2022-01-29T04:42:20.634Z] Start of script
23:42:20 [2022-01-29T04:42:20.634Z] include file start
23:42:20 [2022-01-29T04:42:20.634Z] include file processed
23:42:20 [2022-01-29T04:42:20.634Z] Result of testMethod = 5
23:42:20 [2022-01-29T04:42:20.634Z] End of script
23:42:20 [2022-01-29T04:42:20.890Z] Traceback (most recent call last):
23:42:20 [2022-01-29T04:42:20.890Z]   File "(none)", line 184, in run
23:42:20 [2022-01-29T04:42:20.890Z]   File "__ref_L/Debug Test/Main.py_upzpvkauxs", line 1, in <module>
23:42:20 [2022-01-29T04:42:20.890Z]   File "(none)", line 161, in trace_dispatch
23:42:20 [2022-01-29T04:42:20.890Z] 	at org.eclipse.ease.debugging.AbstractEaseDebugger.handleEventsInSuspendedState(AbstractEaseDebugger.java:331)
23:42:20 [2022-01-29T04:42:20.890Z] 	at org.eclipse.ease.debugging.AbstractEaseDebugger.suspend(AbstractEaseDebugger.java:257)
23:42:20 [2022-01-29T04:42:20.890Z] 	at org.eclipse.ease.debugging.AbstractEaseDebugger.processLine(AbstractEaseDebugger.java:492)
23:42:20 [2022-01-29T04:42:20.891Z] 	at org.eclipse.ease.lang.python.debugger.PythonDebugger.traceDispatch(PythonDebugger.java:179)
23:42:20 [2022-01-29T04:42:20.891Z] 	at org.eclipse.ease.lang.python.jython.debugger.JythonDebugger.traceDispatch(JythonDebugger.java:46)
23:42:20 [2022-01-29T04:42:20.891Z] 	at jdk.internal.reflect.GeneratedMethodAccessor25.invoke(Unknown Source)
23:42:20 [2022-01-29T04:42:20.891Z] 	at java.base/jdk.internal.reflect.DelegatingMethodAccessorImpl.invoke(DelegatingMethodAccessorImpl.java:43)
23:42:20 [2022-01-29T04:42:20.891Z] 	at java.base/java.lang.reflect.Method.invoke(Method.java:564)
23:42:20 [2022-01-29T04:42:20.891Z] 
23:42:20 [2022-01-29T04:42:20.891Z] org.eclipse.ease.ScriptEngineCancellationException: org.eclipse.ease.ScriptEngineCancellationException: Terminated on user request
23:42:21 [2022-01-29T04:42:21.147Z] Start of script
23:42:21 [2022-01-29T04:42:21.147Z] include file start
23:42:21 [2022-01-29T04:42:21.147Z] include file processed
23:42:21 [2022-01-29T04:42:21.147Z] Result of testMethod = 5
23:42:21 [2022-01-29T04:42:21.147Z] End of script
23:42:21 [2022-01-29T04:42:21.404Z] Start of script
23:42:21 [2022-01-29T04:42:21.404Z] include file start
23:42:21 [2022-01-29T04:42:21.404Z] include file processed
23:42:21 [2022-01-29T04:42:21.404Z] Result of testMethod = 5
23:42:21 [2022-01-29T04:42:21.681Z] Traceback (most recent call last):
23:42:21 [2022-01-29T04:42:21.681Z]   File "(none)", line 184, in run
23:42:21 [2022-01-29T04:42:21.681Z]   File "__ref_L/Debug Test/Main.py_fpwzkydibk", line 23, in <module>
23:42:21 [2022-01-29T04:42:21.681Z]   File "(none)", line 161, in trace_dispatch
23:42:21 [2022-01-29T04:42:21.681Z] 	at org.eclipse.ease.debugging.AbstractEaseDebugger.handleEventsInSuspendedState(AbstractEaseDebugger.java:331)
23:42:21 [2022-01-29T04:42:21.681Z] 	at org.eclipse.ease.debugging.AbstractEaseDebugger.suspend(AbstractEaseDebugger.java:257)
23:42:21 [2022-01-29T04:42:21.681Z] 	at org.eclipse.ease.debugging.AbstractEaseDebugger.processLine(AbstractEaseDebugger.java:492)
23:42:21 [2022-01-29T04:42:21.681Z] 	at org.eclipse.ease.lang.python.debugger.PythonDebugger.traceDispatch(PythonDebugger.java:179)
23:42:21 [2022-01-29T04:42:21.681Z] 	at org.eclipse.ease.lang.python.jython.debugger.JythonDebugger.traceDispatch(JythonDebugger.java:46)
23:42:21 [2022-01-29T04:42:21.681Z] 	at jdk.internal.reflect.GeneratedMethodAccessor25.invoke(Unknown Source)
23:42:21 [2022-01-29T04:42:21.681Z] 	at java.base/jdk.internal.reflect.DelegatingMethodAccessorImpl.invoke(DelegatingMethodAccessorImpl.java:43)
23:42:21 [2022-01-29T04:42:21.681Z] 	at java.base/java.lang.reflect.Method.invoke(Method.java:564)
23:42:21 [2022-01-29T04:42:21.681Z] 
23:42:21 [2022-01-29T04:42:21.681Z] org.eclipse.ease.ScriptEngineCancellationException: org.eclipse.ease.ScriptEngineCancellationException: Terminated on user request
23:42:21 [2022-01-29T04:42:21.681Z] Start of script
23:42:21 [2022-01-29T04:42:21.681Z] include file start
23:42:21 [2022-01-29T04:42:21.681Z] include file processed
23:42:21 [2022-01-29T04:42:21.681Z] Result of testMethod = 5
23:42:21 [2022-01-29T04:42:21.681Z] End of script
23:42:21 [2022-01-29T04:42:21.960Z] Start of script
23:42:21 [2022-01-29T04:42:21.960Z] include file start
23:42:21 [2022-01-29T04:42:21.960Z] include file processed
23:42:21 [2022-01-29T04:42:21.960Z] Result of testMethod = 5
23:42:21 [2022-01-29T04:42:21.960Z] End of script
23:42:22 [2022-01-29T04:42:22.216Z] Start of script
23:42:22 [2022-01-29T04:42:22.216Z] include file start
23:42:22 [2022-01-29T04:42:22.216Z] include file processed
23:42:22 [2022-01-29T04:42:22.216Z] Result of testMethod = 5
23:42:22 [2022-01-29T04:42:22.216Z] End of script
23:42:22 [2022-01-29T04:42:22.472Z] Start of script
23:42:22 [2022-01-29T04:42:22.472Z] include file start
23:42:22 [2022-01-29T04:42:22.472Z] include file processed
23:42:22 [2022-01-29T04:42:22.472Z] Result of testMethod = 5
23:42:22 [2022-01-29T04:42:22.472Z] End of script
23:42:22 [2022-01-29T04:42:22.729Z] Start of script
23:42:22 [2022-01-29T04:42:22.729Z] include file start
23:42:22 [2022-01-29T04:42:22.729Z] include file processed
23:42:22 [2022-01-29T04:42:22.729Z] Traceback (most recent call last):
23:42:22 [2022-01-29T04:42:22.729Z]   File "(none)", line 184, in run
23:42:22 [2022-01-29T04:42:22.729Z]   File "__ref_L/Debug Test/Main.py_qpqfwwtefe", line 21, in <module>
23:42:22 [2022-01-29T04:42:22.729Z]   File "__ref_L/Debug Test/Main.py_qpqfwwtefe", line 18, in testMethod
23:42:22 [2022-01-29T04:42:22.729Z]   File "(none)", line 161, in trace_dispatch
23:42:22 [2022-01-29T04:42:22.729Z] 	at org.eclipse.ease.debugging.AbstractEaseDebugger.handleEventsInSuspendedState(AbstractEaseDebugger.java:331)
23:42:22 [2022-01-29T04:42:22.729Z] 	at org.eclipse.ease.debugging.AbstractEaseDebugger.suspend(AbstractEaseDebugger.java:257)
23:42:22 [2022-01-29T04:42:22.729Z] 	at org.eclipse.ease.debugging.AbstractEaseDebugger.processLine(AbstractEaseDebugger.java:492)
23:42:22 [2022-01-29T04:42:22.729Z] 	at org.eclipse.ease.lang.python.debugger.PythonDebugger.traceDispatch(PythonDebugger.java:179)
23:42:22 [2022-01-29T04:42:22.729Z] 	at org.eclipse.ease.lang.python.jython.debugger.JythonDebugger.traceDispatch(JythonDebugger.java:46)
23:42:22 [2022-01-29T04:42:22.729Z] 	at jdk.internal.reflect.GeneratedMethodAccessor25.invoke(Unknown Source)
23:42:22 [2022-01-29T04:42:22.729Z] 	at java.base/jdk.internal.reflect.DelegatingMethodAccessorImpl.invoke(DelegatingMethodAccessorImpl.java:43)
23:42:22 [2022-01-29T04:42:22.729Z] 	at java.base/java.lang.reflect.Method.invoke(Method.java:564)
23:42:22 [2022-01-29T04:42:22.729Z] 
23:42:22 [2022-01-29T04:42:22.729Z] org.eclipse.ease.ScriptEngineCancellationException: org.eclipse.ease.ScriptEngineCancellationException: Terminated on user request
23:42:22 [2022-01-29T04:42:22.986Z] Start of script
23:42:23 [2022-01-29T04:42:23.242Z] include file start
23:42:23 [2022-01-29T04:42:23.242Z] include file processed
23:42:23 [2022-01-29T04:42:23.242Z] Result of testMethod = 5
23:42:23 [2022-01-29T04:42:23.242Z] End of script
23:42:23 [2022-01-29T04:42:23.242Z] Start of script
23:42:23 [2022-01-29T04:42:23.242Z] include file start
23:42:23 [2022-01-29T04:42:23.242Z] include file processed
23:42:23 [2022-01-29T04:42:23.242Z] Result of testMethod = 5
23:42:23 [2022-01-29T04:42:23.499Z] Traceback (most recent call last):
23:42:23 [2022-01-29T04:42:23.499Z]   File "(none)", line 184, in run
23:42:23 [2022-01-29T04:42:23.499Z]   File "__ref_L/Debug Test/Main.py_ftsqspcekc", line 23, in <module>
23:42:23 [2022-01-29T04:42:23.499Z]   File "(none)", line 161, in trace_dispatch
23:42:23 [2022-01-29T04:42:23.499Z] 	at org.eclipse.ease.debugging.AbstractEaseDebugger.handleEventsInSuspendedState(AbstractEaseDebugger.java:331)
23:42:23 [2022-01-29T04:42:23.499Z] 	at org.eclipse.ease.debugging.AbstractEaseDebugger.suspend(AbstractEaseDebugger.java:257)
23:42:23 [2022-01-29T04:42:23.499Z] 	at org.eclipse.ease.debugging.AbstractEaseDebugger.processLine(AbstractEaseDebugger.java:492)
23:42:23 [2022-01-29T04:42:23.500Z] 	at org.eclipse.ease.lang.python.debugger.PythonDebugger.traceDispatch(PythonDebugger.java:179)
23:42:23 [2022-01-29T04:42:23.500Z] 	at org.eclipse.ease.lang.python.jython.debugger.JythonDebugger.traceDispatch(JythonDebugger.java:46)
23:42:23 [2022-01-29T04:42:23.500Z] 	at jdk.internal.reflect.GeneratedMethodAccessor25.invoke(Unknown Source)
23:42:23 [2022-01-29T04:42:23.500Z] 	at java.base/jdk.internal.reflect.DelegatingMethodAccessorImpl.invoke(DelegatingMethodAccessorImpl.java:43)
23:42:23 [2022-01-29T04:42:23.500Z] 	at java.base/java.lang.reflect.Method.invoke(Method.java:564)
23:42:23 [2022-01-29T04:42:23.500Z] 
23:42:23 [2022-01-29T04:42:23.500Z] org.eclipse.ease.ScriptEngineCancellationException: org.eclipse.ease.ScriptEngineCancellationException: Terminated on user request
23:42:23 [2022-01-29T04:42:23.500Z] Start of script
23:42:23 [2022-01-29T04:42:23.500Z] include file start
23:42:23 [2022-01-29T04:42:23.500Z] include file processed
23:42:23 [2022-01-29T04:42:23.500Z] Result of testMethod = 5
23:42:23 [2022-01-29T04:42:23.756Z] End of script
23:42:23 [2022-01-29T04:42:23.757Z] Start of script
23:42:23 [2022-01-29T04:42:23.757Z] include file start
23:42:23 [2022-01-29T04:42:23.757Z] include file processed
23:42:24 [2022-01-29T04:42:24.013Z] Result of testMethod = 5
23:42:24 [2022-01-29T04:42:24.013Z] End of script
23:42:24 [2022-01-29T04:42:24.013Z] Start of script
23:42:24 [2022-01-29T04:42:24.270Z] include file start
23:42:24 [2022-01-29T04:42:24.270Z] include file processed
23:42:24 [2022-01-29T04:42:24.270Z] Result of testMethod = 5
23:42:24 [2022-01-29T04:42:24.270Z] End of script
23:42:24 [2022-01-29T04:42:24.270Z] Start of script
23:42:24 [2022-01-29T04:42:24.270Z] include file start
23:42:24 [2022-01-29T04:42:24.270Z] include file processed
23:42:24 [2022-01-29T04:42:24.270Z] Result of testMethod = 5
23:42:24 [2022-01-29T04:42:24.527Z] End of script
23:42:24 [2022-01-29T04:42:24.527Z] Start of script
23:42:24 [2022-01-29T04:42:24.527Z] include file start
23:42:24 [2022-01-29T04:42:24.527Z] include file processed
23:42:24 [2022-01-29T04:42:24.527Z] Result of testMethod = 5
23:42:24 [2022-01-29T04:42:24.783Z] Traceback (most recent call last):
23:42:24 [2022-01-29T04:42:24.783Z]   File "(none)", line 184, in run
23:42:24 [2022-01-29T04:42:24.783Z]   File "__ref_L/Debug Test/Main.py_scamhvjqiy", line 23, in <module>
23:42:24 [2022-01-29T04:42:24.783Z]   File "(none)", line 161, in trace_dispatch
23:42:24 [2022-01-29T04:42:24.783Z] 	at org.eclipse.ease.debugging.AbstractEaseDebugger.handleEventsInSuspendedState(AbstractEaseDebugger.java:331)
23:42:24 [2022-01-29T04:42:24.783Z] 	at org.eclipse.ease.debugging.AbstractEaseDebugger.suspend(AbstractEaseDebugger.java:257)
23:42:24 [2022-01-29T04:42:24.783Z] 	at org.eclipse.ease.debugging.AbstractEaseDebugger.processLine(AbstractEaseDebugger.java:492)
23:42:24 [2022-01-29T04:42:24.783Z] 	at org.eclipse.ease.lang.python.debugger.PythonDebugger.traceDispatch(PythonDebugger.java:179)
23:42:24 [2022-01-29T04:42:24.783Z] 	at org.eclipse.ease.lang.python.jython.debugger.JythonDebugger.traceDispatch(JythonDebugger.java:46)
23:42:24 [2022-01-29T04:42:24.783Z] 	at jdk.internal.reflect.GeneratedMethodAccessor25.invoke(Unknown Source)
23:42:24 [2022-01-29T04:42:24.783Z] 	at java.base/jdk.internal.reflect.DelegatingMethodAccessorImpl.invoke(DelegatingMethodAccessorImpl.java:43)
23:42:24 [2022-01-29T04:42:24.783Z] 	at java.base/java.lang.reflect.Method.invoke(Method.java:564)
23:42:24 [2022-01-29T04:42:24.783Z] 
23:42:24 [2022-01-29T04:42:24.783Z] org.eclipse.ease.ScriptEngineCancellationException: org.eclipse.ease.ScriptEngineCancellationException: Terminated on user request
23:42:24 [2022-01-29T04:42:24.783Z] Start of script
23:42:24 [2022-01-29T04:42:24.783Z] include file start
23:42:24 [2022-01-29T04:42:24.783Z] include file processed
23:42:24 [2022-01-29T04:42:24.783Z] Result of testMethod = 5
23:42:25 [2022-01-29T04:42:25.041Z] End of script
23:42:25 [2022-01-29T04:42:25.041Z] Start of script
23:42:25 [2022-01-29T04:42:25.041Z] include file start
23:42:25 [2022-01-29T04:42:25.041Z] include file processed
23:42:25 [2022-01-29T04:42:25.041Z] Result of testMethod = 5
23:42:25 [2022-01-29T04:42:25.299Z] Traceback (most recent call last):
23:42:25 [2022-01-29T04:42:25.299Z]   File "(none)", line 184, in run
23:42:25 [2022-01-29T04:42:25.299Z]   File "__ref_L/Debug Test/Main.py_hkzqpfmgny", line 23, in <module>
23:42:25 [2022-01-29T04:42:25.299Z]   File "(none)", line 161, in trace_dispatch
23:42:25 [2022-01-29T04:42:25.299Z] 	at org.eclipse.ease.debugging.AbstractEaseDebugger.handleEventsInSuspendedState(AbstractEaseDebugger.java:331)
23:42:25 [2022-01-29T04:42:25.299Z] 	at org.eclipse.ease.debugging.AbstractEaseDebugger.suspend(AbstractEaseDebugger.java:257)
23:42:25 [2022-01-29T04:42:25.299Z] 	at org.eclipse.ease.debugging.AbstractEaseDebugger.processLine(AbstractEaseDebugger.java:492)
23:42:25 [2022-01-29T04:42:25.299Z] 	at org.eclipse.ease.lang.python.debugger.PythonDebugger.traceDispatch(PythonDebugger.java:179)
23:42:25 [2022-01-29T04:42:25.299Z] 	at org.eclipse.ease.lang.python.jython.debugger.JythonDebugger.traceDispatch(JythonDebugger.java:46)
23:42:25 [2022-01-29T04:42:25.299Z] 	at jdk.internal.reflect.GeneratedMethodAccessor25.invoke(Unknown Source)
23:42:25 [2022-01-29T04:42:25.299Z] 	at java.base/jdk.internal.reflect.DelegatingMethodAccessorImpl.invoke(DelegatingMethodAccessorImpl.java:43)
23:42:25 [2022-01-29T04:42:25.299Z] 	at java.base/java.lang.reflect.Method.invoke(Method.java:564)
23:42:25 [2022-01-29T04:42:25.299Z] 
23:42:25 [2022-01-29T04:42:25.299Z] org.eclipse.ease.ScriptEngineCancellationException: org.eclipse.ease.ScriptEngineCancellationException: Terminated on user request
23:42:25 [2022-01-29T04:42:25.557Z] Traceback (most recent call last):
23:42:25 [2022-01-29T04:42:25.557Z]   File "(none)", line 184, in run
23:42:25 [2022-01-29T04:42:25.557Z]   File "__ref_L/Debug Test/Main.py_lptmoixoor", line 1, in <module>
23:42:25 [2022-01-29T04:42:25.557Z]   File "(none)", line 161, in trace_dispatch
23:42:25 [2022-01-29T04:42:25.557Z] 	at org.eclipse.ease.debugging.AbstractEaseDebugger.handleEventsInSuspendedState(AbstractEaseDebugger.java:331)
23:42:25 [2022-01-29T04:42:25.557Z] 	at org.eclipse.ease.debugging.AbstractEaseDebugger.suspend(AbstractEaseDebugger.java:257)
23:42:25 [2022-01-29T04:42:25.557Z] 	at org.eclipse.ease.debugging.AbstractEaseDebugger.processLine(AbstractEaseDebugger.java:492)
23:42:25 [2022-01-29T04:42:25.557Z] 	at org.eclipse.ease.lang.python.debugger.PythonDebugger.traceDispatch(PythonDebugger.java:179)
23:42:25 [2022-01-29T04:42:25.557Z] 	at org.eclipse.ease.lang.python.jython.debugger.JythonDebugger.traceDispatch(JythonDebugger.java:46)
23:42:25 [2022-01-29T04:42:25.557Z] 	at jdk.internal.reflect.GeneratedMethodAccessor25.invoke(Unknown Source)
23:42:25 [2022-01-29T04:42:25.557Z] 	at java.base/jdk.internal.reflect.DelegatingMethodAccessorImpl.invoke(DelegatingMethodAccessorImpl.java:43)
23:42:25 [2022-01-29T04:42:25.557Z] 	at java.base/java.lang.reflect.Method.invoke(Method.java:564)
23:42:25 [2022-01-29T04:42:25.557Z] 
23:42:25 [2022-01-29T04:42:25.557Z] org.eclipse.ease.ScriptEngineCancellationException: org.eclipse.ease.ScriptEngineCancellationException: Terminated on user request
23:42:25 [2022-01-29T04:42:25.557Z] Start of script
23:42:25 [2022-01-29T04:42:25.814Z] include file start
23:42:25 [2022-01-29T04:42:25.814Z] include file processed
23:42:25 [2022-01-29T04:42:25.814Z] Result of testMethod = 5
23:42:25 [2022-01-29T04:42:25.814Z] End of script
23:42:25 [2022-01-29T04:42:25.814Z] Start of script
23:42:25 [2022-01-29T04:42:25.814Z] include file start
23:42:25 [2022-01-29T04:42:25.814Z] include file processed
23:42:26 [2022-01-29T04:42:26.071Z] Result of testMethod = 5
23:42:26 [2022-01-29T04:42:26.071Z] End of script
23:42:26 [2022-01-29T04:42:26.071Z] Start of script
23:42:26 [2022-01-29T04:42:26.071Z] include file start
23:42:26 [2022-01-29T04:42:26.071Z] include file processed
23:42:26 [2022-01-29T04:42:26.071Z] Result of testMethod = 5
23:42:26 [2022-01-29T04:42:26.328Z] End of script
23:42:26 [2022-01-29T04:42:26.328Z] Tests run: 41, Failures: 0, Errors: 0, Skipped: 0, Time elapsed: 14.184 s - in org.eclipse.ease.lang.python.jython.debugger.JythonDebugTest
23:42:26 [2022-01-29T04:42:26.328Z] disconnectProcessInSuspendedState  Time elapsed: 3.256 s
23:42:26 [2022-01-29T04:42:26.328Z] stepReturnIncludeCommand  Time elapsed: 0.215 s
23:42:26 [2022-01-29T04:42:26.328Z] arrayVariableSorting  Time elapsed: 0.308 s
23:42:26 [2022-01-29T04:42:26.328Z] stepOverOnDebugTarget  Time elapsed: 0.407 s
23:42:26 [2022-01-29T04:42:26.328Z] disconnectThreadInSuspendedState  Time elapsed: 0.206 s
23:42:26 [2022-01-29T04:42:26.328Z] stepReturnOnDebugTarget  Time elapsed: 0.307 s
23:42:26 [2022-01-29T04:42:26.328Z] nullVariable  Time elapsed: 0.306 s
23:42:26 [2022-01-29T04:42:26.328Z] stepOverOnStackFrame  Time elapsed: 0.307 s
23:42:26 [2022-01-29T04:42:26.328Z] resumeOnDebugTarget  Time elapsed: 0.206 s
23:42:26 [2022-01-29T04:42:26.328Z] modifyVariableKeepingType  Time elapsed: 0.507 s
23:42:26 [2022-01-29T04:42:26.328Z] resumeOnLastIncludeLine  Time elapsed: 0.205 s
23:42:26 [2022-01-29T04:42:26.328Z] stepReturnOnStackFrame  Time elapsed: 0.306 s
23:42:26 [2022-01-29T04:42:26.328Z] terminateStackFrameInSuspendedState  Time elapsed: 0.206 s
23:42:26 [2022-01-29T04:42:26.328Z] breakpointLocation  Time elapsed: 0.206 s
23:42:26 [2022-01-29T04:42:26.328Z] stepReturnOnThread  Time elapsed: 0.424 s
23:42:26 [2022-01-29T04:42:26.328Z] javaClassVariable  Time elapsed: 0.308 s
23:42:26 [2022-01-29T04:42:26.328Z] stepIntoOnThread  Time elapsed: 0.306 s
23:42:26 [2022-01-29T04:42:26.328Z] terminateThreadInSuspendedState  Time elapsed: 0.205 s
23:42:26 [2022-01-29T04:42:26.328Z] resumeOnThread  Time elapsed: 0.205 s
23:42:26 [2022-01-29T04:42:26.328Z] stepIntoOnStackFrame  Time elapsed: 0.305 s
23:42:26 [2022-01-29T04:42:26.328Z] terminateProcessInSuspendedState  Time elapsed: 0.204 s
23:42:26 [2022-01-29T04:42:26.328Z] stepOverOnProcess  Time elapsed: 0.305 s
23:42:26 [2022-01-29T04:42:26.328Z] nativeArrayVariable  Time elapsed: 0.306 s
23:42:26 [2022-01-29T04:42:26.328Z] disconnectDebugTargetInSuspendedState  Time elapsed: 0.205 s
23:42:26 [2022-01-29T04:42:26.328Z] stepIntoOnProcess  Time elapsed: 0.307 s
23:42:26 [2022-01-29T04:42:26.328Z] terminatedState  Time elapsed: 0.104 s
23:42:26 [2022-01-29T04:42:26.328Z] stepOverIncludeCommand  Time elapsed: 0.308 s
23:42:26 [2022-01-29T04:42:26.328Z] innerScopeVariableBeforeOuterScopeVariable  Time elapsed: 0.305 s
23:42:26 [2022-01-29T04:42:26.328Z] stepIntoIncludeCommand  Time elapsed: 0.329 s
23:42:26 [2022-01-29T04:42:26.328Z] primitiveStringVariable  Time elapsed: 0.304 s
23:42:26 [2022-01-29T04:42:26.328Z] resumeOnProcess  Time elapsed: 0.204 s
23:42:26 [2022-01-29T04:42:26.328Z] stepIntoOnDebugTarget  Time elapsed: 0.306 s
23:42:26 [2022-01-29T04:42:26.328Z] stepOverOnThread  Time elapsed: 0.305 s
23:42:26 [2022-01-29T04:42:26.328Z] suspendedState  Time elapsed: 0.203 s
23:42:26 [2022-01-29T04:42:26.328Z] primitiveDoubleVariable  Time elapsed: 0.305 s
23:42:26 [2022-01-29T04:42:26.328Z] resumeOnStackFrame  Time elapsed: 0.205 s
23:42:26 [2022-01-29T04:42:26.328Z] nativeObjectVariable  Time elapsed: 0.306 s
23:42:26 [2022-01-29T04:42:26.328Z] terminateDebugTargetInSuspendedState  Time elapsed: 0.205 s
23:42:26 [2022-01-29T04:42:26.328Z] disconnectStackFrameInSuspendedState  Time elapsed: 0.206 s
23:42:26 [2022-01-29T04:42:26.328Z] stepReturnOnProcess  Time elapsed: 0.305 s
23:42:26 [2022-01-29T04:42:26.328Z] evaluateWatchExpression  Time elapsed: 0.224 s
23:42:26 [2022-01-29T04:42:26.328Z] 
23:42:26 [2022-01-29T04:42:26.328Z] Results:
23:42:26 [2022-01-29T04:42:26.328Z] 
23:42:26 [2022-01-29T04:42:26.328Z] Tests run: 41, Failures: 0, Errors: 0, Skipped: 0
23:42:26 [2022-01-29T04:42:26.328Z] 
23:42:26 [2022-01-29T04:42:26.585Z] [INFO] All tests passed!
23:42:26 [2022-01-29T04:42:26.591Z] [INFO] 
23:42:26 [2022-01-29T04:42:26.591Z] [INFO] --- maven-pmd-plugin:3.14.0:pmd (pmd-integration) @ org.eclipse.ease.lang.python.jython.test ---
23:42:26 [2022-01-29T04:42:26.592Z] [WARNING] Unable to exclude rules [JUnit5TestShouldBePackagePrivate] from ruleset reference category/java/bestpractices.xml; perhaps the rule name is misspelled or the rule doesn't exist anymore?
23:42:26 [2022-01-29T04:42:26.592Z] [WARNING] Unable to exclude rules [JUnit5TestShouldBePackagePrivate] from ruleset reference category/java/bestpractices.xml; perhaps the rule name is misspelled or the rule doesn't exist anymore?
23:42:26 [2022-01-29T04:42:26.848Z] [INFO] 
23:42:26 [2022-01-29T04:42:26.848Z] [INFO] --- maven-pmd-plugin:3.14.0:cpd (pmd-integration) @ org.eclipse.ease.lang.python.jython.test ---
23:42:26 [2022-01-29T04:42:26.848Z] [INFO] 
23:42:26 [2022-01-29T04:42:26.848Z] [INFO] --- spotbugs-maven-plugin:4.1.4:spotbugs (spotbugs-integration) @ org.eclipse.ease.lang.python.jython.test ---
23:42:26 [2022-01-29T04:42:26.848Z] [INFO] Fork Value is false
23:42:26 [2022-01-29T04:42:26.848Z]      [java] JVM args ignored when same JVM is used.
23:42:29 [2022-01-29T04:42:29.392Z] [INFO] Done SpotBugs Analysis....
23:42:29 [2022-01-29T04:42:29.392Z] [INFO] 
23:42:29 [2022-01-29T04:42:29.392Z] [INFO] --- maven-checkstyle-plugin:3.1.1:check (checkstyle-integration) @ org.eclipse.ease.lang.python.jython.test ---
23:42:29 [2022-01-29T04:42:29.392Z] [INFO] You have 0 Checkstyle violations.
23:42:29 [2022-01-29T04:42:29.392Z] [INFO] 
23:42:29 [2022-01-29T04:42:29.392Z] [INFO] --- maven-install-plugin:2.3.1:install (default-install) @ org.eclipse.ease.lang.python.jython.test ---
23:42:29 [2022-01-29T04:42:29.392Z] [INFO] Installing /home/jenkins/agent/workspace/ease.verify.core.target.2018-12/tests/org.eclipse.ease.lang.python.jython.test/target/org.eclipse.ease.lang.python.jython.test-0.9.0-SNAPSHOT.jar to /home/jenkins/.m2/repository/org/eclipse/ease/org.eclipse.ease.lang.python.jython.test/0.9.0-SNAPSHOT/org.eclipse.ease.lang.python.jython.test-0.9.0-SNAPSHOT.jar
23:42:29 [2022-01-29T04:42:29.392Z] [INFO] Installing /home/jenkins/agent/workspace/ease.verify.core.target.2018-12/tests/org.eclipse.ease.lang.python.jython.test/pom.xml to /home/jenkins/.m2/repository/org/eclipse/ease/org.eclipse.ease.lang.python.jython.test/0.9.0-SNAPSHOT/org.eclipse.ease.lang.python.jython.test-0.9.0-SNAPSHOT.pom
23:42:29 [2022-01-29T04:42:29.392Z] [INFO] Installing /home/jenkins/agent/workspace/ease.verify.core.target.2018-12/tests/org.eclipse.ease.lang.python.jython.test/target/p2content.xml to /home/jenkins/.m2/repository/org/eclipse/ease/org.eclipse.ease.lang.python.jython.test/0.9.0-SNAPSHOT/org.eclipse.ease.lang.python.jython.test-0.9.0-SNAPSHOT-p2metadata.xml
23:42:29 [2022-01-29T04:42:29.392Z] [INFO] Installing /home/jenkins/agent/workspace/ease.verify.core.target.2018-12/tests/org.eclipse.ease.lang.python.jython.test/target/p2artifacts.xml to /home/jenkins/.m2/repository/org/eclipse/ease/org.eclipse.ease.lang.python.jython.test/0.9.0-SNAPSHOT/org.eclipse.ease.lang.python.jython.test-0.9.0-SNAPSHOT-p2artifacts.xml
23:42:29 [2022-01-29T04:42:29.392Z] [INFO] 
23:42:29 [2022-01-29T04:42:29.392Z] [INFO] --- tycho-p2-plugin:2.2.0:update-local-index (default-update-local-index) @ org.eclipse.ease.lang.python.jython.test ---
23:42:29 [2022-01-29T04:42:29.392Z] [INFO] 
23:42:29 [2022-01-29T04:42:29.392Z] [INFO] -----< org.eclipse.ease:org.eclipse.ease.lang.scriptarchive.test >------
23:42:29 [2022-01-29T04:42:29.392Z] [INFO] Building org.eclipse.ease.lang.scriptarchive.test 0.9.0-SNAPSHOT [43/49]
23:42:29 [2022-01-29T04:42:29.392Z] [INFO] ------------------------[ eclipse-test-plugin ]-------------------------
23:42:29 [2022-01-29T04:42:29.392Z] [INFO] 
23:42:29 [2022-01-29T04:42:29.392Z] [INFO] --- maven-clean-plugin:2.5:clean (default-clean) @ org.eclipse.ease.lang.scriptarchive.test ---
23:42:29 [2022-01-29T04:42:29.392Z] [INFO] 
23:42:29 [2022-01-29T04:42:29.392Z] [INFO] --- tycho-packaging-plugin:2.2.0:build-qualifier (default-build-qualifier) @ org.eclipse.ease.lang.scriptarchive.test ---
23:42:29 [2022-01-29T04:42:29.392Z] [INFO] The project's OSGi version is 0.9.0.I202106220815
23:42:29 [2022-01-29T04:42:29.392Z] [INFO] 
23:42:29 [2022-01-29T04:42:29.393Z] [INFO] --- tycho-packaging-plugin:2.2.0:validate-id (default-validate-id) @ org.eclipse.ease.lang.scriptarchive.test ---
23:42:29 [2022-01-29T04:42:29.393Z] [INFO] 
23:42:29 [2022-01-29T04:42:29.393Z] [INFO] --- tycho-packaging-plugin:2.2.0:validate-version (default-validate-version) @ org.eclipse.ease.lang.scriptarchive.test ---
23:42:29 [2022-01-29T04:42:29.393Z] [INFO] 
23:42:29 [2022-01-29T04:42:29.393Z] [INFO] --- maven-resources-plugin:2.4.3:resources (default-resources) @ org.eclipse.ease.lang.scriptarchive.test ---
23:42:29 [2022-01-29T04:42:29.393Z] [INFO] Using 'UTF-8' encoding to copy filtered resources.
23:42:29 [2022-01-29T04:42:29.393Z] [INFO] skip non existing resourceDirectory /home/jenkins/agent/workspace/ease.verify.core.target.2018-12/tests/org.eclipse.ease.lang.scriptarchive.test/src/main/resources
23:42:29 [2022-01-29T04:42:29.393Z] [INFO] 
23:42:29 [2022-01-29T04:42:29.393Z] [INFO] --- tycho-compiler-plugin:2.2.0:compile (default-compile) @ org.eclipse.ease.lang.scriptarchive.test ---
23:42:29 [2022-01-29T04:42:29.393Z] [INFO] Compiling 1 source file to /home/jenkins/agent/workspace/ease.verify.core.target.2018-12/tests/org.eclipse.ease.lang.scriptarchive.test/target/classes
23:42:29 [2022-01-29T04:42:29.393Z] [INFO] 
23:42:29 [2022-01-29T04:42:29.393Z] [INFO] --- maven-resources-plugin:2.4.3:testResources (default-testResources) @ org.eclipse.ease.lang.scriptarchive.test ---
23:42:29 [2022-01-29T04:42:29.393Z] [INFO] Using 'UTF-8' encoding to copy filtered resources.
23:42:29 [2022-01-29T04:42:29.393Z] [INFO] skip non existing resourceDirectory /home/jenkins/agent/workspace/ease.verify.core.target.2018-12/tests/org.eclipse.ease.lang.scriptarchive.test/src/test/resources
23:42:29 [2022-01-29T04:42:29.393Z] [INFO] 
23:42:29 [2022-01-29T04:42:29.393Z] [INFO] --- target-platform-configuration:2.2.0:target-platform (default-target-platform) @ org.eclipse.ease.lang.scriptarchive.test ---
23:42:29 [2022-01-29T04:42:29.393Z] [INFO] 
23:42:29 [2022-01-29T04:42:29.393Z] [INFO] --- tycho-packaging-plugin:2.2.0:package-plugin (default-package-plugin) @ org.eclipse.ease.lang.scriptarchive.test ---
23:42:29 [2022-01-29T04:42:29.393Z] [INFO] Building jar: /home/jenkins/agent/workspace/ease.verify.core.target.2018-12/tests/org.eclipse.ease.lang.scriptarchive.test/target/org.eclipse.ease.lang.scriptarchive.test-0.9.0-SNAPSHOT.jar
23:42:29 [2022-01-29T04:42:29.393Z] [INFO] 
23:42:29 [2022-01-29T04:42:29.393Z] [INFO] --- tycho-p2-plugin:2.2.0:p2-metadata-default (default-p2-metadata-default) @ org.eclipse.ease.lang.scriptarchive.test ---
23:42:29 [2022-01-29T04:42:29.393Z] [INFO] 
23:42:29 [2022-01-29T04:42:29.393Z] [INFO] --- jacoco-maven-plugin:0.8.6:prepare-agent (jacoco-initialize) @ org.eclipse.ease.lang.scriptarchive.test ---
23:42:29 [2022-01-29T04:42:29.394Z] [INFO] tycho.testArgLine set to -javaagent:/home/jenkins/.m2/repository/org/jacoco/org.jacoco.agent/0.8.6/org.jacoco.agent-0.8.6-runtime.jar=destfile=/home/jenkins/agent/workspace/ease.verify.core.target.2018-12/tests/org.eclipse.ease.lang.scriptarchive.test/target/jacoco.exec,output=file
23:42:29 [2022-01-29T04:42:29.394Z] [INFO] 
23:42:29 [2022-01-29T04:42:29.394Z] [INFO] --- tycho-surefire-plugin:2.2.0:test (default-test) @ org.eclipse.ease.lang.scriptarchive.test ---
23:42:29 [2022-01-29T04:42:29.394Z] [INFO] Executing Test Runtime with timeout 0, logs (if any) will be placed at: /home/jenkins/agent/workspace/ease.verify.core.target.2018-12/tests/org.eclipse.ease.lang.scriptarchive.test/target/work/data/.metadata/.log
23:42:29 [2022-01-29T04:42:29.394Z] [INFO] Command line:
23:42:29 [2022-01-29T04:42:29.394Z] 	[/opt/tools/java/openjdk/jdk-15/15.0.2+7/bin/java, -Dosgi.noShutdown=false, -Dosgi.os=linux, -Dosgi.ws=gtk, -Dosgi.arch=x86_64, -javaagent:/home/jenkins/.m2/repository/org/jacoco/org.jacoco.agent/0.8.6/org.jacoco.agent-0.8.6-runtime.jar=destfile=/home/jenkins/agent/workspace/ease.verify.core.target.2018-12/tests/org.eclipse.ease.lang.scriptarchive.test/target/jacoco.exec,output=file, -Dosgi.clean=true, -jar, /home/jenkins/.m2/repository/p2/osgi/bundle/org.eclipse.equinox.launcher/1.6.300.v20210813-1054/org.eclipse.equinox.launcher-1.6.300.v20210813-1054.jar, -data, /home/jenkins/agent/workspace/ease.verify.core.target.2018-12/tests/org.eclipse.ease.lang.scriptarchive.test/target/work/data, -install, /home/jenkins/agent/workspace/ease.verify.core.target.2018-12/tests/org.eclipse.ease.lang.scriptarchive.test/target/work, -configuration, /home/jenkins/agent/workspace/ease.verify.core.target.2018-12/tests/org.eclipse.ease.lang.scriptarchive.test/target/work/configuration, -application, org.eclipse.tycho.surefire.osgibooter.headlesstest, -testproperties, /home/jenkins/agent/workspace/ease.verify.core.target.2018-12/tests/org.eclipse.ease.lang.scriptarchive.test/target/surefire.properties]
23:42:29 [2022-01-29T04:42:29.692Z] Picked up JAVA_TOOL_OPTIONS: -Dmaven.ext.class.path="/home/jenkins/agent/workspace/ease.verify.core.target.2018-12@tmp/withMaven5e71502e/pipeline-maven-spy.jar" -Dorg.jenkinsci.plugins.pipeline.maven.reportsFolder="/home/jenkins/agent/workspace/ease.verify.core.target.2018-12@tmp/withMaven5e71502e" 
23:42:33 [2022-01-29T04:42:33.043Z] Running org.eclipse.ease.lang.scriptarchive.ArchiveEngineTest
23:42:33 [2022-01-29T04:42:33.300Z] We are running from a zip file!
23:42:33 [2022-01-29T04:42:33.300Z] org.eclipse.ease.ScriptExecutionException: SyntaxError: missing ; before statement (workspace://__EASE_ScriptArchive_1/scripts/Master.js#3)
23:42:33 [2022-01-29T04:42:33.300Z] this is an error
23:42:33 [2022-01-29T04:42:33.300Z]        ^
23:42:33 [2022-01-29T04:42:33.300Z] 	at Master.js,workspace://__EASE_ScriptArchive_1/scripts/Master.js
23:42:33 [2022-01-29T04:42:33.300Z] org.eclipse.ease.ScriptExecutionException: SyntaxError: missing ; before statement (workspace://__EASE_ScriptArchive_1/scripts/Master.js#3)
23:42:33 [2022-01-29T04:42:33.301Z] this is an error
23:42:33 [2022-01-29T04:42:33.301Z]        ^
23:42:33 [2022-01-29T04:42:33.301Z] 	at Master.js,workspace://__EASE_ScriptArchive_1/scripts/Master.js
23:42:33 [2022-01-29T04:42:33.557Z] Tests run: 7, Failures: 0, Errors: 0, Skipped: 0, Time elapsed: 0.86 s - in org.eclipse.ease.lang.scriptarchive.ArchiveEngineTest
23:42:33 [2022-01-29T04:42:33.558Z] executeWithManifest  Time elapsed: 0.668 s
23:42:33 [2022-01-29T04:42:33.558Z] zipFileRegistration  Time elapsed: 0.031 s
23:42:33 [2022-01-29T04:42:33.558Z] engineIdRegistration  Time elapsed: 0.001 s
23:42:33 [2022-01-29T04:42:33.558Z] jarFileRegistration  Time elapsed: 0 s
23:42:33 [2022-01-29T04:42:33.558Z] sarFileRegistration  Time elapsed: 0 s
23:42:33 [2022-01-29T04:42:33.558Z] executeWithErrors  Time elapsed: 0.067 s
23:42:33 [2022-01-29T04:42:33.558Z] executeWithIncludes  Time elapsed: 0.061 s
23:42:33 [2022-01-29T04:42:33.558Z] 
23:42:33 [2022-01-29T04:42:33.558Z] Results:
23:42:33 [2022-01-29T04:42:33.558Z] 
23:42:33 [2022-01-29T04:42:33.558Z] Tests run: 7, Failures: 0, Errors: 0, Skipped: 0
23:42:33 [2022-01-29T04:42:33.558Z] 
23:42:33 [2022-01-29T04:42:33.814Z] [INFO] All tests passed!
23:42:33 [2022-01-29T04:42:33.814Z] [INFO] 
23:42:33 [2022-01-29T04:42:33.814Z] [INFO] --- maven-pmd-plugin:3.14.0:pmd (pmd-integration) @ org.eclipse.ease.lang.scriptarchive.test ---
23:42:33 [2022-01-29T04:42:33.814Z] [WARNING] Unable to exclude rules [JUnit5TestShouldBePackagePrivate] from ruleset reference category/java/bestpractices.xml; perhaps the rule name is misspelled or the rule doesn't exist anymore?
23:42:33 [2022-01-29T04:42:33.814Z] [WARNING] Unable to exclude rules [JUnit5TestShouldBePackagePrivate] from ruleset reference category/java/bestpractices.xml; perhaps the rule name is misspelled or the rule doesn't exist anymore?
23:42:34 [2022-01-29T04:42:34.088Z] [INFO] 
23:42:34 [2022-01-29T04:42:34.088Z] [INFO] --- maven-pmd-plugin:3.14.0:cpd (pmd-integration) @ org.eclipse.ease.lang.scriptarchive.test ---
23:42:34 [2022-01-29T04:42:34.088Z] [INFO] 
23:42:34 [2022-01-29T04:42:34.088Z] [INFO] --- spotbugs-maven-plugin:4.1.4:spotbugs (spotbugs-integration) @ org.eclipse.ease.lang.scriptarchive.test ---
23:42:34 [2022-01-29T04:42:34.089Z] [INFO] Fork Value is false
23:42:34 [2022-01-29T04:42:34.089Z]      [java] JVM args ignored when same JVM is used.
23:42:36 [2022-01-29T04:42:36.642Z] [INFO] Done SpotBugs Analysis....
23:42:36 [2022-01-29T04:42:36.642Z] [INFO] 
23:42:36 [2022-01-29T04:42:36.642Z] [INFO] --- maven-checkstyle-plugin:3.1.1:check (checkstyle-integration) @ org.eclipse.ease.lang.scriptarchive.test ---
23:42:36 [2022-01-29T04:42:36.642Z] [INFO] You have 0 Checkstyle violations.
23:42:36 [2022-01-29T04:42:36.642Z] [INFO] 
23:42:36 [2022-01-29T04:42:36.642Z] [INFO] --- maven-install-plugin:2.3.1:install (default-install) @ org.eclipse.ease.lang.scriptarchive.test ---
23:42:36 [2022-01-29T04:42:36.643Z] [INFO] Installing /home/jenkins/agent/workspace/ease.verify.core.target.2018-12/tests/org.eclipse.ease.lang.scriptarchive.test/target/org.eclipse.ease.lang.scriptarchive.test-0.9.0-SNAPSHOT.jar to /home/jenkins/.m2/repository/org/eclipse/ease/org.eclipse.ease.lang.scriptarchive.test/0.9.0-SNAPSHOT/org.eclipse.ease.lang.scriptarchive.test-0.9.0-SNAPSHOT.jar
23:42:36 [2022-01-29T04:42:36.643Z] [INFO] Installing /home/jenkins/agent/workspace/ease.verify.core.target.2018-12/tests/org.eclipse.ease.lang.scriptarchive.test/pom.xml to /home/jenkins/.m2/repository/org/eclipse/ease/org.eclipse.ease.lang.scriptarchive.test/0.9.0-SNAPSHOT/org.eclipse.ease.lang.scriptarchive.test-0.9.0-SNAPSHOT.pom
23:42:36 [2022-01-29T04:42:36.643Z] [INFO] Installing /home/jenkins/agent/workspace/ease.verify.core.target.2018-12/tests/org.eclipse.ease.lang.scriptarchive.test/target/p2content.xml to /home/jenkins/.m2/repository/org/eclipse/ease/org.eclipse.ease.lang.scriptarchive.test/0.9.0-SNAPSHOT/org.eclipse.ease.lang.scriptarchive.test-0.9.0-SNAPSHOT-p2metadata.xml
23:42:36 [2022-01-29T04:42:36.643Z] [INFO] Installing /home/jenkins/agent/workspace/ease.verify.core.target.2018-12/tests/org.eclipse.ease.lang.scriptarchive.test/target/p2artifacts.xml to /home/jenkins/.m2/repository/org/eclipse/ease/org.eclipse.ease.lang.scriptarchive.test/0.9.0-SNAPSHOT/org.eclipse.ease.lang.scriptarchive.test-0.9.0-SNAPSHOT-p2artifacts.xml
23:42:36 [2022-01-29T04:42:36.643Z] [INFO] 
23:42:36 [2022-01-29T04:42:36.643Z] [INFO] --- tycho-p2-plugin:2.2.0:update-local-index (default-update-local-index) @ org.eclipse.ease.lang.scriptarchive.test ---
23:42:36 [2022-01-29T04:42:36.643Z] [INFO] 
23:42:36 [2022-01-29T04:42:36.643Z] [INFO] --------< org.eclipse.ease:org.eclipse.ease.lang.unittest.test >--------
23:42:36 [2022-01-29T04:42:36.643Z] [INFO] Building org.eclipse.ease.lang.unittest.test 0.9.0-SNAPSHOT      [44/49]
23:42:36 [2022-01-29T04:42:36.643Z] [INFO] ------------------------[ eclipse-test-plugin ]-------------------------
23:42:36 [2022-01-29T04:42:36.643Z] [INFO] 
23:42:36 [2022-01-29T04:42:36.643Z] [INFO] --- maven-clean-plugin:2.5:clean (default-clean) @ org.eclipse.ease.lang.unittest.test ---
23:42:36 [2022-01-29T04:42:36.643Z] [INFO] 
23:42:36 [2022-01-29T04:42:36.643Z] [INFO] --- tycho-packaging-plugin:2.2.0:build-qualifier (default-build-qualifier) @ org.eclipse.ease.lang.unittest.test ---
23:42:36 [2022-01-29T04:42:36.643Z] [INFO] The project's OSGi version is 0.9.0.I202111240844
23:42:36 [2022-01-29T04:42:36.643Z] [INFO] 
23:42:36 [2022-01-29T04:42:36.643Z] [INFO] --- tycho-packaging-plugin:2.2.0:validate-id (default-validate-id) @ org.eclipse.ease.lang.unittest.test ---
23:42:36 [2022-01-29T04:42:36.643Z] [INFO] 
23:42:36 [2022-01-29T04:42:36.643Z] [INFO] --- tycho-packaging-plugin:2.2.0:validate-version (default-validate-version) @ org.eclipse.ease.lang.unittest.test ---
23:42:36 [2022-01-29T04:42:36.643Z] [INFO] 
23:42:36 [2022-01-29T04:42:36.643Z] [INFO] --- maven-resources-plugin:2.4.3:resources (default-resources) @ org.eclipse.ease.lang.unittest.test ---
23:42:36 [2022-01-29T04:42:36.643Z] [INFO] Using 'UTF-8' encoding to copy filtered resources.
23:42:36 [2022-01-29T04:42:36.643Z] [INFO] skip non existing resourceDirectory /home/jenkins/agent/workspace/ease.verify.core.target.2018-12/tests/org.eclipse.ease.lang.unittest.test/src/main/resources
23:42:36 [2022-01-29T04:42:36.643Z] [INFO] 
23:42:36 [2022-01-29T04:42:36.643Z] [INFO] --- tycho-compiler-plugin:2.2.0:compile (default-compile) @ org.eclipse.ease.lang.unittest.test ---
23:42:36 [2022-01-29T04:42:36.644Z] [INFO] Compiling 8 source files to /home/jenkins/agent/workspace/ease.verify.core.target.2018-12/tests/org.eclipse.ease.lang.unittest.test/target/classes
23:42:36 [2022-01-29T04:42:36.644Z] [INFO] 
23:42:36 [2022-01-29T04:42:36.644Z] [INFO] --- maven-resources-plugin:2.4.3:testResources (default-testResources) @ org.eclipse.ease.lang.unittest.test ---
23:42:36 [2022-01-29T04:42:36.644Z] [INFO] Using 'UTF-8' encoding to copy filtered resources.
23:42:36 [2022-01-29T04:42:36.644Z] [INFO] skip non existing resourceDirectory /home/jenkins/agent/workspace/ease.verify.core.target.2018-12/tests/org.eclipse.ease.lang.unittest.test/src/test/resources
23:42:36 [2022-01-29T04:42:36.644Z] [INFO] 
23:42:36 [2022-01-29T04:42:36.644Z] [INFO] --- target-platform-configuration:2.2.0:target-platform (default-target-platform) @ org.eclipse.ease.lang.unittest.test ---
23:42:36 [2022-01-29T04:42:36.644Z] [INFO] 
23:42:36 [2022-01-29T04:42:36.644Z] [INFO] --- tycho-packaging-plugin:2.2.0:package-plugin (default-package-plugin) @ org.eclipse.ease.lang.unittest.test ---
23:42:36 [2022-01-29T04:42:36.644Z] [INFO] Building jar: /home/jenkins/agent/workspace/ease.verify.core.target.2018-12/tests/org.eclipse.ease.lang.unittest.test/target/org.eclipse.ease.lang.unittest.test-0.9.0-SNAPSHOT.jar
23:42:36 [2022-01-29T04:42:36.644Z] [INFO] 
23:42:36 [2022-01-29T04:42:36.644Z] [INFO] --- tycho-p2-plugin:2.2.0:p2-metadata-default (default-p2-metadata-default) @ org.eclipse.ease.lang.unittest.test ---
23:42:36 [2022-01-29T04:42:36.644Z] [INFO] 
23:42:36 [2022-01-29T04:42:36.644Z] [INFO] --- jacoco-maven-plugin:0.8.6:prepare-agent (jacoco-initialize) @ org.eclipse.ease.lang.unittest.test ---
23:42:36 [2022-01-29T04:42:36.644Z] [INFO] tycho.testArgLine set to -javaagent:/home/jenkins/.m2/repository/org/jacoco/org.jacoco.agent/0.8.6/org.jacoco.agent-0.8.6-runtime.jar=destfile=/home/jenkins/agent/workspace/ease.verify.core.target.2018-12/tests/org.eclipse.ease.lang.unittest.test/target/jacoco.exec,output=file
23:42:36 [2022-01-29T04:42:36.644Z] [INFO] 
23:42:36 [2022-01-29T04:42:36.644Z] [INFO] --- tycho-surefire-plugin:2.2.0:test (default-test) @ org.eclipse.ease.lang.unittest.test ---
23:42:36 [2022-01-29T04:42:36.944Z] [INFO] Executing Test Runtime with timeout 0, logs (if any) will be placed at: /home/jenkins/agent/workspace/ease.verify.core.target.2018-12/tests/org.eclipse.ease.lang.unittest.test/target/work/data/.metadata/.log
23:42:36 [2022-01-29T04:42:36.944Z] [INFO] Command line:
23:42:36 [2022-01-29T04:42:36.944Z] 	[/opt/tools/java/openjdk/jdk-15/15.0.2+7/bin/java, -Dosgi.noShutdown=false, -Dosgi.os=linux, -Dosgi.ws=gtk, -Dosgi.arch=x86_64, -javaagent:/home/jenkins/.m2/repository/org/jacoco/org.jacoco.agent/0.8.6/org.jacoco.agent-0.8.6-runtime.jar=destfile=/home/jenkins/agent/workspace/ease.verify.core.target.2018-12/tests/org.eclipse.ease.lang.unittest.test/target/jacoco.exec,output=file, -Dosgi.clean=true, -jar, /home/jenkins/.m2/repository/p2/osgi/bundle/org.eclipse.equinox.launcher/1.6.300.v20210813-1054/org.eclipse.equinox.launcher-1.6.300.v20210813-1054.jar, -data, /home/jenkins/agent/workspace/ease.verify.core.target.2018-12/tests/org.eclipse.ease.lang.unittest.test/target/work/data, -install, /home/jenkins/agent/workspace/ease.verify.core.target.2018-12/tests/org.eclipse.ease.lang.unittest.test/target/work, -configuration, /home/jenkins/agent/workspace/ease.verify.core.target.2018-12/tests/org.eclipse.ease.lang.unittest.test/target/work/configuration, -application, org.eclipse.tycho.surefire.osgibooter.headlesstest, -testproperties, /home/jenkins/agent/workspace/ease.verify.core.target.2018-12/tests/org.eclipse.ease.lang.unittest.test/target/surefire.properties]
23:42:36 [2022-01-29T04:42:36.944Z] Picked up JAVA_TOOL_OPTIONS: -Dmaven.ext.class.path="/home/jenkins/agent/workspace/ease.verify.core.target.2018-12@tmp/withMaven5e71502e/pipeline-maven-spy.jar" -Dorg.jenkinsci.plugins.pipeline.maven.reportsFolder="/home/jenkins/agent/workspace/ease.verify.core.target.2018-12@tmp/withMaven5e71502e" 
23:42:40 [2022-01-29T04:42:40.242Z] Running org.eclipse.ease.lang.unittest.runtime.impl.TestTest
23:42:41 [2022-01-29T04:42:41.173Z] Tests run: 30, Failures: 0, Errors: 0, Skipped: 0, Time elapsed: 1.121 s - in org.eclipse.ease.lang.unittest.runtime.impl.TestTest
23:42:41 [2022-01-29T04:42:41.173Z] reset_clears_results  Time elapsed: 0.04 s
23:42:41 [2022-01-29T04:42:41.173Z] hasError_is_false_when_no_error_exists  Time elapsed: 0.001 s
23:42:41 [2022-01-29T04:42:41.173Z] getDuration_is_0_for_not_executed_test  Time elapsed: 0.001 s
23:42:41 [2022-01-29T04:42:41.173Z] getStatus_is_DISABLED_when_1_result_is_disabled  Time elapsed: 0.002 s
23:42:41 [2022-01-29T04:42:41.173Z] reset_clears_status  Time elapsed: 0.102 s
23:42:41 [2022-01-29T04:42:41.173Z] getResults_FAILURE_returns_only_matching_results  Time elapsed: 0 s
23:42:41 [2022-01-29T04:42:41.173Z] isDisabled_is_false_for_finished_test  Time elapsed: 0.001 s
23:42:41 [2022-01-29T04:42:41.173Z] getStatus_is_DISABLED_when_entity_status_is_disabled  Time elapsed: 0 s
23:42:41 [2022-01-29T04:42:41.173Z] getStatus_is_status_of_worst_result  Time elapsed: 0.001 s
23:42:41 [2022-01-29T04:42:41.173Z] getEstimatedDuration_is_minus_1_by_default  Time elapsed: 0 s
23:42:41 [2022-01-29T04:42:41.173Z] getDuration_returns_current_execution_time_for_running_test  Time elapsed: 0.201 s
23:42:41 [2022-01-29T04:42:41.173Z] setDisabled_marks_test_as_disabled  Time elapsed: 0 s
23:42:41 [2022-01-29T04:42:41.173Z] getStatus_is_entity_status_if_it_is_the_worst_status  Time elapsed: 0.001 s
23:42:41 [2022-01-29T04:42:41.173Z] reset_clears_timestamps  Time elapsed: 0 s
23:42:41 [2022-01-29T04:42:41.173Z] getResource_returns_parent_resource  Time elapsed: 0.005 s
23:42:41 [2022-01-29T04:42:41.173Z] isDisabled_is_true_when_1_result_is_DISABLED  Time elapsed: 0 s
23:42:41 [2022-01-29T04:42:41.173Z] getFullPath_returns_test_name  Time elapsed: 0 s
23:42:41 [2022-01-29T04:42:41.173Z] getDuration_returns_execution_time_for_completed_test  Time elapsed: 0.101 s
23:42:41 [2022-01-29T04:42:41.173Z] addError_adds_error_result  Time elapsed: 0.376 s
23:42:41 [2022-01-29T04:42:41.173Z] getFullPath_returns_parent_path_and_test_name  Time elapsed: 0.001 s
23:42:41 [2022-01-29T04:42:41.173Z] reset_clears_metadata  Time elapsed: 0.001 s
23:42:41 [2022-01-29T04:42:41.173Z] getRoot_returns_root_element  Time elapsed: 0 s
23:42:41 [2022-01-29T04:42:41.173Z] hasError_is_true_when_error_exists  Time elapsed: 0 s
23:42:41 [2022-01-29T04:42:41.173Z] setEntityStatus_FINISHED_sets_end_timestamp  Time elapsed: 0 s
23:42:41 [2022-01-29T04:42:41.173Z] getWorstResult_returns_worst_execution_result  Time elapsed: 0 s
23:42:41 [2022-01-29T04:42:41.173Z] getTestSuite_returns_master_suite  Time elapsed: 0.002 s
23:42:41 [2022-01-29T04:42:41.173Z] isDisabled_is_true_when_status_is_DISABLED  Time elapsed: 0 s
23:42:41 [2022-01-29T04:42:41.173Z] setEntityStatus_RUNNING_sets_start_timestamp  Time elapsed: 0.001 s
23:42:41 [2022-01-29T04:42:41.173Z] setEndTimestamp_verifies_duration_limit  Time elapsed: 0.022 s
23:42:41 [2022-01-29T04:42:41.173Z] setStackTrace_stores_a_clone_of_the_trace  Time elapsed: 0.245 s
23:42:41 [2022-01-29T04:42:41.173Z] Running org.eclipse.ease.lang.unittest.runtime.impl.TestContainerTest
23:42:41 [2022-01-29T04:42:41.737Z] Tests run: 38, Failures: 0, Errors: 0, Skipped: 1, Time elapsed: 0.333 s - in org.eclipse.ease.lang.unittest.runtime.impl.TestContainerTest
23:42:41 [2022-01-29T04:42:41.737Z] reset_clears_results  Time elapsed: 0 s
23:42:41 [2022-01-29T04:42:41.737Z] hasError_is_false_when_no_error_exists  Time elapsed: 0 s
23:42:41 [2022-01-29T04:42:41.737Z] getDuration_is_0_for_not_executed_test  Time elapsed: 0 s
23:42:41 [2022-01-29T04:42:41.737Z] getStatus_is_DISABLED_when_1_result_is_disabled  Time elapsed: 0 s
23:42:41 [2022-01-29T04:42:41.737Z] reset_clears_status  Time elapsed: 0 s
23:42:41 [2022-01-29T04:42:41.737Z] getResults_FAILURE_returns_only_matching_results  Time elapsed: 0 s
23:42:41 [2022-01-29T04:42:41.737Z] isDisabled_is_false_for_finished_test  Time elapsed: 0.001 s
23:42:41 [2022-01-29T04:42:41.737Z] getStatus_is_DISABLED_when_entity_status_is_disabled  Time elapsed: 0 s
23:42:41 [2022-01-29T04:42:41.737Z] getStatus_is_status_of_worst_result  Time elapsed: 0 s
23:42:41 [2022-01-29T04:42:41.737Z] getEstimatedDuration_is_minus_1_by_default  Time elapsed: 0.001 s
23:42:41 [2022-01-29T04:42:41.737Z] getDuration_returns_current_execution_time_for_running_test  Time elapsed: 0.2 s
23:42:41 [2022-01-29T04:42:41.737Z] setDisabled_marks_test_as_disabled  Time elapsed: 0 s
23:42:41 [2022-01-29T04:42:41.737Z] getStatus_is_entity_status_if_it_is_the_worst_status  Time elapsed: 0.001 s
23:42:41 [2022-01-29T04:42:41.737Z] reset_clears_timestamps  Time elapsed: 0 s
23:42:41 [2022-01-29T04:42:41.737Z] isDisabled_is_true_when_1_result_is_DISABLED  Time elapsed: 0.001 s
23:42:41 [2022-01-29T04:42:41.737Z] getFullPath_returns_test_name  Time elapsed: 0 s
23:42:41 [2022-01-29T04:42:41.737Z] getDuration_returns_execution_time_for_completed_test  Time elapsed: 0.1 s
23:42:41 [2022-01-29T04:42:41.737Z] addError_adds_error_result  Time elapsed: 0.001 s
23:42:41 [2022-01-29T04:42:41.737Z] getFullPath_returns_parent_path_and_test_name  Time elapsed: 0 s
23:42:41 [2022-01-29T04:42:41.737Z] reset_clears_metadata  Time elapsed: 0.001 s
23:42:41 [2022-01-29T04:42:41.737Z] getRoot_returns_root_element  Time elapsed: 0 s
23:42:41 [2022-01-29T04:42:41.737Z] hasError_is_true_when_error_exists  Time elapsed: 0 s
23:42:41 [2022-01-29T04:42:41.737Z] setEntityStatus_FINISHED_sets_end_timestamp  Time elapsed: 0.001 s
23:42:41 [2022-01-29T04:42:41.737Z] getWorstResult_returns_worst_execution_result  Time elapsed: 0 s
23:42:41 [2022-01-29T04:42:41.737Z] getTestSuite_returns_master_suite  Time elapsed: 0 s
23:42:41 [2022-01-29T04:42:41.737Z] isDisabled_is_true_when_status_is_DISABLED  Time elapsed: 0 s
23:42:41 [2022-01-29T04:42:41.737Z] setEntityStatus_RUNNING_sets_start_timestamp  Time elapsed: 0 s
23:42:41 [2022-01-29T04:42:41.737Z] hasError_queries_children_for_error_status  Time elapsed: 0.002 s
23:42:41 [2022-01-29T04:42:41.737Z] setTerminated_terminates_children_too  Time elapsed: 0 s
23:42:41 [2022-01-29T04:42:41.737Z] getTest_is_null_when_child_test_does_not_exist  Time elapsed: 0.001 s
23:42:41 [2022-01-29T04:42:41.737Z] getTest_returns_child_with_matching_name  Time elapsed: 0 s
23:42:41 [2022-01-29T04:42:41.737Z] getEstimatedDuration_sums_child_estimations  Time elapsed: 0 s
23:42:41 [2022-01-29T04:42:41.737Z] reset_deletes_children_of_type_ITest  Time elapsed: 0 s
23:42:41 [2022-01-29T04:42:41.737Z] getResource_returns_parent_resource skipped
23:42:41 [2022-01-29T04:42:41.737Z] getStatus_returns_worst_child_status  Time elapsed: 0.001 s
23:42:41 [2022-01-29T04:42:41.737Z] getChildContainers_returns_only_containers  Time elapsed: 0 s
23:42:41 [2022-01-29T04:42:41.737Z] getStatus_returns_entity_status  Time elapsed: 0.001 s
23:42:41 [2022-01-29T04:42:41.737Z] run_executes_each_child  Time elapsed: 0.014 s
23:42:41 [2022-01-29T04:42:41.737Z] Running org.eclipse.ease.lang.unittest.runtime.impl.TestFileTest
23:42:41 [2022-01-29T04:42:41.994Z] Tests run: 43, Failures: 0, Errors: 0, Skipped: 2, Time elapsed: 0.435 s - in org.eclipse.ease.lang.unittest.runtime.impl.TestFileTest
23:42:41 [2022-01-29T04:42:41.995Z] reset_clears_results  Time elapsed: 0 s
23:42:41 [2022-01-29T04:42:41.995Z] hasError_is_false_when_no_error_exists  Time elapsed: 0.001 s
23:42:41 [2022-01-29T04:42:41.995Z] getDuration_is_0_for_not_executed_test  Time elapsed: 0 s
23:42:41 [2022-01-29T04:42:41.995Z] getStatus_is_DISABLED_when_1_result_is_disabled  Time elapsed: 0 s
23:42:41 [2022-01-29T04:42:41.995Z] reset_clears_status  Time elapsed: 0.001 s
23:42:41 [2022-01-29T04:42:41.995Z] getResults_FAILURE_returns_only_matching_results  Time elapsed: 0 s
23:42:41 [2022-01-29T04:42:41.995Z] isDisabled_is_false_for_finished_test  Time elapsed: 0 s
23:42:41 [2022-01-29T04:42:41.995Z] getStatus_is_DISABLED_when_entity_status_is_disabled  Time elapsed: 0.001 s
23:42:41 [2022-01-29T04:42:41.995Z] getStatus_is_status_of_worst_result  Time elapsed: 0 s
23:42:41 [2022-01-29T04:42:41.995Z] getEstimatedDuration_is_minus_1_by_default  Time elapsed: 0 s
23:42:41 [2022-01-29T04:42:41.995Z] getDuration_returns_current_execution_time_for_running_test  Time elapsed: 0.201 s
23:42:41 [2022-01-29T04:42:41.995Z] setDisabled_marks_test_as_disabled  Time elapsed: 0 s
23:42:41 [2022-01-29T04:42:41.995Z] getStatus_is_entity_status_if_it_is_the_worst_status  Time elapsed: 0.001 s
23:42:41 [2022-01-29T04:42:41.995Z] reset_clears_timestamps  Time elapsed: 0 s
23:42:41 [2022-01-29T04:42:41.995Z] isDisabled_is_true_when_1_result_is_DISABLED  Time elapsed: 0.001 s
23:42:41 [2022-01-29T04:42:41.995Z] getFullPath_returns_test_name  Time elapsed: 0 s
23:42:41 [2022-01-29T04:42:41.995Z] getDuration_returns_execution_time_for_completed_test  Time elapsed: 0.101 s
23:42:41 [2022-01-29T04:42:41.995Z] addError_adds_error_result  Time elapsed: 0 s
23:42:41 [2022-01-29T04:42:41.995Z] getFullPath_returns_parent_path_and_test_name  Time elapsed: 0.001 s
23:42:41 [2022-01-29T04:42:41.995Z] reset_clears_metadata  Time elapsed: 0 s
23:42:41 [2022-01-29T04:42:41.995Z] getRoot_returns_root_element  Time elapsed: 0 s
23:42:41 [2022-01-29T04:42:41.995Z] hasError_is_true_when_error_exists  Time elapsed: 0 s
23:42:41 [2022-01-29T04:42:41.995Z] setEntityStatus_FINISHED_sets_end_timestamp  Time elapsed: 0 s
23:42:41 [2022-01-29T04:42:41.995Z] getWorstResult_returns_worst_execution_result  Time elapsed: 0.001 s
23:42:41 [2022-01-29T04:42:41.995Z] getTestSuite_returns_master_suite  Time elapsed: 0 s
23:42:41 [2022-01-29T04:42:41.995Z] isDisabled_is_true_when_status_is_DISABLED  Time elapsed: 0 s
23:42:41 [2022-01-29T04:42:41.995Z] setEntityStatus_RUNNING_sets_start_timestamp  Time elapsed: 0.001 s
23:42:41 [2022-01-29T04:42:41.995Z] hasError_queries_children_for_error_status  Time elapsed: 0 s
23:42:41 [2022-01-29T04:42:41.995Z] setTerminated_terminates_children_too  Time elapsed: 0.001 s
23:42:41 [2022-01-29T04:42:41.995Z] getTest_is_null_when_child_test_does_not_exist  Time elapsed: 0 s
23:42:41 [2022-01-29T04:42:41.995Z] getTest_returns_child_with_matching_name  Time elapsed: 0 s
23:42:41 [2022-01-29T04:42:41.995Z] getEstimatedDuration_sums_child_estimations  Time elapsed: 0.001 s
23:42:41 [2022-01-29T04:42:41.995Z] reset_deletes_children_of_type_ITest  Time elapsed: 0 s
23:42:41 [2022-01-29T04:42:41.995Z] getResource_returns_parent_resource skipped
23:42:41 [2022-01-29T04:42:41.995Z] getStatus_returns_worst_child_status  Time elapsed: 0 s
23:42:41 [2022-01-29T04:42:41.995Z] getChildContainers_returns_only_containers  Time elapsed: 0 s
23:42:41 [2022-01-29T04:42:41.995Z] getStatus_returns_entity_status  Time elapsed: 0.001 s
23:42:41 [2022-01-29T04:42:41.995Z] getEstimatedDuration_is_0_for_disabled_status  Time elapsed: 0 s
23:42:41 [2022-01-29T04:42:41.995Z] run_adds_error_when_no_engine_is_found  Time elapsed: 0.001 s
23:42:41 [2022-01-29T04:42:41.995Z] reset_removes_error_markers_from_files  Time elapsed: 0.066 s
23:42:41 [2022-01-29T04:42:41.995Z] reset_disables_TestFile_when_set_in_suite_description  Time elapsed: 0.049 s
23:42:41 [2022-01-29T04:42:41.995Z] run_does_not_execute_disabled_tests  Time elapsed: 0 s
23:42:41 [2022-01-29T04:42:41.995Z] run_executes_each_child skipped
23:42:41 [2022-01-29T04:42:41.995Z] Running org.eclipse.ease.lang.unittest.runtime.impl.TestEntityTest
23:42:42 [2022-01-29T04:42:42.252Z] Tests run: 28, Failures: 0, Errors: 0, Skipped: 0, Time elapsed: 0.313 s - in org.eclipse.ease.lang.unittest.runtime.impl.TestEntityTest
23:42:42 [2022-01-29T04:42:42.252Z] reset_clears_results  Time elapsed: 0.001 s
23:42:42 [2022-01-29T04:42:42.252Z] hasError_is_false_when_no_error_exists  Time elapsed: 0 s
23:42:42 [2022-01-29T04:42:42.252Z] getDuration_is_0_for_not_executed_test  Time elapsed: 0 s
23:42:42 [2022-01-29T04:42:42.252Z] getStatus_is_DISABLED_when_1_result_is_disabled  Time elapsed: 0.001 s
23:42:42 [2022-01-29T04:42:42.252Z] reset_clears_status  Time elapsed: 0 s
23:42:42 [2022-01-29T04:42:42.252Z] getResults_FAILURE_returns_only_matching_results  Time elapsed: 0 s
23:42:42 [2022-01-29T04:42:42.252Z] isDisabled_is_false_for_finished_test  Time elapsed: 0.001 s
23:42:42 [2022-01-29T04:42:42.252Z] getStatus_is_DISABLED_when_entity_status_is_disabled  Time elapsed: 0 s
23:42:42 [2022-01-29T04:42:42.252Z] getStatus_is_status_of_worst_result  Time elapsed: 0 s
23:42:42 [2022-01-29T04:42:42.252Z] getEstimatedDuration_is_minus_1_by_default  Time elapsed: 0 s
23:42:42 [2022-01-29T04:42:42.252Z] getDuration_returns_current_execution_time_for_running_test  Time elapsed: 0.201 s
23:42:42 [2022-01-29T04:42:42.252Z] setDisabled_marks_test_as_disabled  Time elapsed: 0 s
23:42:42 [2022-01-29T04:42:42.252Z] getStatus_is_entity_status_if_it_is_the_worst_status  Time elapsed: 0 s
23:42:42 [2022-01-29T04:42:42.252Z] reset_clears_timestamps  Time elapsed: 0 s
23:42:42 [2022-01-29T04:42:42.252Z] getResource_returns_parent_resource  Time elapsed: 0 s
23:42:42 [2022-01-29T04:42:42.252Z] isDisabled_is_true_when_1_result_is_DISABLED  Time elapsed: 0 s
23:42:42 [2022-01-29T04:42:42.252Z] getFullPath_returns_test_name  Time elapsed: 0 s
23:42:42 [2022-01-29T04:42:42.252Z] getDuration_returns_execution_time_for_completed_test  Time elapsed: 0.101 s
23:42:42 [2022-01-29T04:42:42.252Z] addError_adds_error_result  Time elapsed: 0.001 s
23:42:42 [2022-01-29T04:42:42.252Z] getFullPath_returns_parent_path_and_test_name  Time elapsed: 0 s
23:42:42 [2022-01-29T04:42:42.252Z] reset_clears_metadata  Time elapsed: 0.001 s
23:42:42 [2022-01-29T04:42:42.252Z] getRoot_returns_root_element  Time elapsed: 0 s
23:42:42 [2022-01-29T04:42:42.252Z] hasError_is_true_when_error_exists  Time elapsed: 0 s
23:42:42 [2022-01-29T04:42:42.252Z] setEntityStatus_FINISHED_sets_end_timestamp  Time elapsed: 0.001 s
23:42:42 [2022-01-29T04:42:42.252Z] getWorstResult_returns_worst_execution_result  Time elapsed: 0 s
23:42:42 [2022-01-29T04:42:42.252Z] getTestSuite_returns_master_suite  Time elapsed: 0 s
23:42:42 [2022-01-29T04:42:42.252Z] isDisabled_is_true_when_status_is_DISABLED  Time elapsed: 0.001 s
23:42:42 [2022-01-29T04:42:42.252Z] setEntityStatus_RUNNING_sets_start_timestamp  Time elapsed: 0 s
23:42:42 [2022-01-29T04:42:42.252Z] Running org.eclipse.ease.lang.unittest.ModernJavaScriptTest
23:42:44 [2022-01-29T04:42:44.156Z] Tests run: 8, Failures: 0, Errors: 0, Skipped: 0, Time elapsed: 1.615 s - in org.eclipse.ease.lang.unittest.ModernJavaScriptTest
23:42:44 [2022-01-29T04:42:44.156Z] folderStatus  Time elapsed: 0.617 s
23:42:44 [2022-01-29T04:42:44.156Z] verifyOutput  Time elapsed: 0.18 s
23:42:44 [2022-01-29T04:42:44.156Z] suiteStatus  Time elapsed: 0.132 s
23:42:44 [2022-01-29T04:42:44.156Z] ignoreTestStatus  Time elapsed: 0.13 s
23:42:44 [2022-01-29T04:42:44.156Z] ignoreTestClassStatus  Time elapsed: 0.133 s
23:42:44 [2022-01-29T04:42:44.156Z] failureTestClassStatus  Time elapsed: 0.121 s
23:42:44 [2022-01-29T04:42:44.156Z] errorTestClassStatus  Time elapsed: 0.121 s
23:42:44 [2022-01-29T04:42:44.156Z] passTestClassStatus  Time elapsed: 0.108 s
23:42:44 [2022-01-29T04:42:44.156Z] Running org.eclipse.ease.lang.unittest.adapters.HeadlessResultAdapterTest
23:42:44 [2022-01-29T04:42:44.156Z] Tests run: 7, Failures: 0, Errors: 0, Skipped: 0, Time elapsed: 0.055 s - in org.eclipse.ease.lang.unittest.adapters.HeadlessResultAdapterTest
23:42:44 [2022-01-29T04:42:44.156Z] getAdapter_declines_to_adapt_generic_object  Time elapsed: 0.001 s
23:42:44 [2022-01-29T04:42:44.156Z] getAdapter_adapts_testsuite_with_failures_to_100  Time elapsed: 0.05 s
23:42:44 [2022-01-29T04:42:44.156Z] adapter_can_be_called_via_adapter_framework  Time elapsed: 0.001 s
23:42:44 [2022-01-29T04:42:44.156Z] getAdapter_adapts_testsuite_with_errors_to_200  Time elapsed: 0 s
23:42:44 [2022-01-29T04:42:44.156Z] getAdapterList_returns_only_ITestSuite  Time elapsed: 0.002 s
23:42:44 [2022-01-29T04:42:44.156Z] getAdapter_adapts_testsuite_with_no_errors_to_0  Time elapsed: 0 s
23:42:44 [2022-01-29T04:42:44.156Z] getAdapter_declines_to_adapt_to_Boolean  Time elapsed: 0.001 s
23:42:44 [2022-01-29T04:42:44.156Z] Running org.eclipse.ease.lang.unittest.ClassicJavaScriptTest
23:42:44 [2022-01-29T04:42:44.719Z] Tests run: 7, Failures: 0, Errors: 0, Skipped: 0, Time elapsed: 0.601 s - in org.eclipse.ease.lang.unittest.ClassicJavaScriptTest
23:42:44 [2022-01-29T04:42:44.719Z] folderStatus  Time elapsed: 0.098 s
23:42:44 [2022-01-29T04:42:44.719Z] errorTestStatus  Time elapsed: 0.09 s
23:42:44 [2022-01-29T04:42:44.719Z] failureTestStatus  Time elapsed: 0.076 s
23:42:44 [2022-01-29T04:42:44.719Z] verifyOutput  Time elapsed: 0.091 s
23:42:44 [2022-01-29T04:42:44.719Z] suiteStatus  Time elapsed: 0.083 s
23:42:44 [2022-01-29T04:42:44.719Z] ignoreTestStatus  Time elapsed: 0.082 s
23:42:44 [2022-01-29T04:42:44.719Z] passTestStatus  Time elapsed: 0.078 s
23:42:44 [2022-01-29T04:42:44.719Z] 
23:42:44 [2022-01-29T04:42:44.719Z] Results:
23:42:44 [2022-01-29T04:42:44.719Z] 
23:42:44 [2022-01-29T04:42:44.719Z] Tests run: 161, Failures: 0, Errors: 0, Skipped: 3
23:42:44 [2022-01-29T04:42:44.719Z] 
23:42:44 [2022-01-29T04:42:44.992Z] [INFO] All tests passed!
23:42:44 [2022-01-29T04:42:44.992Z] [INFO] 
23:42:44 [2022-01-29T04:42:44.992Z] [INFO] --- maven-pmd-plugin:3.14.0:pmd (pmd-integration) @ org.eclipse.ease.lang.unittest.test ---
23:42:44 [2022-01-29T04:42:44.992Z] [WARNING] Unable to exclude rules [JUnit5TestShouldBePackagePrivate] from ruleset reference category/java/bestpractices.xml; perhaps the rule name is misspelled or the rule doesn't exist anymore?
23:42:44 [2022-01-29T04:42:44.992Z] [WARNING] Unable to exclude rules [JUnit5TestShouldBePackagePrivate] from ruleset reference category/java/bestpractices.xml; perhaps the rule name is misspelled or the rule doesn't exist anymore?
23:42:45 [2022-01-29T04:42:45.616Z] [INFO] 
23:42:45 [2022-01-29T04:42:45.616Z] [INFO] --- maven-pmd-plugin:3.14.0:cpd (pmd-integration) @ org.eclipse.ease.lang.unittest.test ---
23:42:45 [2022-01-29T04:42:45.616Z] [INFO] 
23:42:45 [2022-01-29T04:42:45.616Z] [INFO] --- spotbugs-maven-plugin:4.1.4:spotbugs (spotbugs-integration) @ org.eclipse.ease.lang.unittest.test ---
23:42:45 [2022-01-29T04:42:45.616Z] [INFO] Fork Value is false
23:42:45 [2022-01-29T04:42:45.616Z]      [java] JVM args ignored when same JVM is used.
23:42:48 [2022-01-29T04:42:48.935Z] [INFO] Done SpotBugs Analysis....
23:42:48 [2022-01-29T04:42:48.935Z] [INFO] 
23:42:48 [2022-01-29T04:42:48.935Z] [INFO] --- maven-checkstyle-plugin:3.1.1:check (checkstyle-integration) @ org.eclipse.ease.lang.unittest.test ---
23:42:48 [2022-01-29T04:42:48.935Z] [INFO] You have 0 Checkstyle violations.
23:42:48 [2022-01-29T04:42:48.935Z] [INFO] 
23:42:48 [2022-01-29T04:42:48.935Z] [INFO] --- maven-install-plugin:2.3.1:install (default-install) @ org.eclipse.ease.lang.unittest.test ---
23:42:48 [2022-01-29T04:42:48.935Z] [INFO] Installing /home/jenkins/agent/workspace/ease.verify.core.target.2018-12/tests/org.eclipse.ease.lang.unittest.test/target/org.eclipse.ease.lang.unittest.test-0.9.0-SNAPSHOT.jar to /home/jenkins/.m2/repository/org/eclipse/ease/org.eclipse.ease.lang.unittest.test/0.9.0-SNAPSHOT/org.eclipse.ease.lang.unittest.test-0.9.0-SNAPSHOT.jar
23:42:48 [2022-01-29T04:42:48.935Z] [INFO] Installing /home/jenkins/agent/workspace/ease.verify.core.target.2018-12/tests/org.eclipse.ease.lang.unittest.test/pom.xml to /home/jenkins/.m2/repository/org/eclipse/ease/org.eclipse.ease.lang.unittest.test/0.9.0-SNAPSHOT/org.eclipse.ease.lang.unittest.test-0.9.0-SNAPSHOT.pom
23:42:48 [2022-01-29T04:42:48.935Z] [INFO] Installing /home/jenkins/agent/workspace/ease.verify.core.target.2018-12/tests/org.eclipse.ease.lang.unittest.test/target/p2content.xml to /home/jenkins/.m2/repository/org/eclipse/ease/org.eclipse.ease.lang.unittest.test/0.9.0-SNAPSHOT/org.eclipse.ease.lang.unittest.test-0.9.0-SNAPSHOT-p2metadata.xml
23:42:48 [2022-01-29T04:42:48.935Z] [INFO] Installing /home/jenkins/agent/workspace/ease.verify.core.target.2018-12/tests/org.eclipse.ease.lang.unittest.test/target/p2artifacts.xml to /home/jenkins/.m2/repository/org/eclipse/ease/org.eclipse.ease.lang.unittest.test/0.9.0-SNAPSHOT/org.eclipse.ease.lang.unittest.test-0.9.0-SNAPSHOT-p2artifacts.xml
23:42:48 [2022-01-29T04:42:48.935Z] [INFO] 
23:42:48 [2022-01-29T04:42:48.935Z] [INFO] --- tycho-p2-plugin:2.2.0:update-local-index (default-update-local-index) @ org.eclipse.ease.lang.unittest.test ---
23:42:48 [2022-01-29T04:42:48.935Z] [INFO] 
23:42:48 [2022-01-29T04:42:48.936Z] [INFO] ---------< org.eclipse.ease:org.eclipse.ease.ui.scripts.test >----------
23:42:48 [2022-01-29T04:42:48.936Z] [INFO] Building org.eclipse.ease.ui.scripts.test 0.9.0-SNAPSHOT         [45/49]
23:42:48 [2022-01-29T04:42:48.936Z] [INFO] ------------------------[ eclipse-test-plugin ]-------------------------
23:42:48 [2022-01-29T04:42:48.936Z] [INFO] 
23:42:48 [2022-01-29T04:42:48.936Z] [INFO] --- maven-clean-plugin:2.5:clean (default-clean) @ org.eclipse.ease.ui.scripts.test ---
23:42:48 [2022-01-29T04:42:48.936Z] [INFO] 
23:42:48 [2022-01-29T04:42:48.936Z] [INFO] --- tycho-packaging-plugin:2.2.0:build-qualifier (default-build-qualifier) @ org.eclipse.ease.ui.scripts.test ---
23:42:48 [2022-01-29T04:42:48.936Z] [INFO] The project's OSGi version is 0.9.0.I202106220815
23:42:48 [2022-01-29T04:42:48.936Z] [INFO] 
23:42:48 [2022-01-29T04:42:48.936Z] [INFO] --- tycho-packaging-plugin:2.2.0:validate-id (default-validate-id) @ org.eclipse.ease.ui.scripts.test ---
23:42:48 [2022-01-29T04:42:48.936Z] [INFO] 
23:42:48 [2022-01-29T04:42:48.936Z] [INFO] --- tycho-packaging-plugin:2.2.0:validate-version (default-validate-version) @ org.eclipse.ease.ui.scripts.test ---
23:42:48 [2022-01-29T04:42:48.936Z] [INFO] 
23:42:48 [2022-01-29T04:42:48.936Z] [INFO] --- maven-resources-plugin:2.4.3:resources (default-resources) @ org.eclipse.ease.ui.scripts.test ---
23:42:48 [2022-01-29T04:42:48.936Z] [INFO] Using 'UTF-8' encoding to copy filtered resources.
23:42:48 [2022-01-29T04:42:48.936Z] [INFO] skip non existing resourceDirectory /home/jenkins/agent/workspace/ease.verify.core.target.2018-12/tests/org.eclipse.ease.ui.scripts.test/src/main/resources
23:42:48 [2022-01-29T04:42:48.936Z] [INFO] 
23:42:48 [2022-01-29T04:42:48.936Z] [INFO] --- tycho-compiler-plugin:2.2.0:compile (default-compile) @ org.eclipse.ease.ui.scripts.test ---
23:42:48 [2022-01-29T04:42:48.936Z] [INFO] Compiling 1 source file to /home/jenkins/agent/workspace/ease.verify.core.target.2018-12/tests/org.eclipse.ease.ui.scripts.test/target/classes
23:42:48 [2022-01-29T04:42:48.936Z] [INFO] 
23:42:48 [2022-01-29T04:42:48.936Z] [INFO] --- maven-resources-plugin:2.4.3:testResources (default-testResources) @ org.eclipse.ease.ui.scripts.test ---
23:42:48 [2022-01-29T04:42:48.936Z] [INFO] Using 'UTF-8' encoding to copy filtered resources.
23:42:48 [2022-01-29T04:42:48.936Z] [INFO] skip non existing resourceDirectory /home/jenkins/agent/workspace/ease.verify.core.target.2018-12/tests/org.eclipse.ease.ui.scripts.test/src/test/resources
23:42:48 [2022-01-29T04:42:48.936Z] [INFO] 
23:42:48 [2022-01-29T04:42:48.936Z] [INFO] --- target-platform-configuration:2.2.0:target-platform (default-target-platform) @ org.eclipse.ease.ui.scripts.test ---
23:42:48 [2022-01-29T04:42:48.936Z] [INFO] 
23:42:48 [2022-01-29T04:42:48.936Z] [INFO] --- tycho-packaging-plugin:2.2.0:package-plugin (default-package-plugin) @ org.eclipse.ease.ui.scripts.test ---
23:42:48 [2022-01-29T04:42:48.936Z] [INFO] Building jar: /home/jenkins/agent/workspace/ease.verify.core.target.2018-12/tests/org.eclipse.ease.ui.scripts.test/target/org.eclipse.ease.ui.scripts.test-0.9.0-SNAPSHOT.jar
23:42:48 [2022-01-29T04:42:48.936Z] [INFO] 
23:42:48 [2022-01-29T04:42:48.936Z] [INFO] --- tycho-p2-plugin:2.2.0:p2-metadata-default (default-p2-metadata-default) @ org.eclipse.ease.ui.scripts.test ---
23:42:48 [2022-01-29T04:42:48.936Z] [INFO] 
23:42:48 [2022-01-29T04:42:48.937Z] [INFO] --- jacoco-maven-plugin:0.8.6:prepare-agent (jacoco-initialize) @ org.eclipse.ease.ui.scripts.test ---
23:42:48 [2022-01-29T04:42:48.937Z] [INFO] tycho.testArgLine set to -javaagent:/home/jenkins/.m2/repository/org/jacoco/org.jacoco.agent/0.8.6/org.jacoco.agent-0.8.6-runtime.jar=destfile=/home/jenkins/agent/workspace/ease.verify.core.target.2018-12/tests/org.eclipse.ease.ui.scripts.test/target/jacoco.exec,output=file
23:42:48 [2022-01-29T04:42:48.937Z] [INFO] 
23:42:48 [2022-01-29T04:42:48.937Z] [INFO] --- tycho-surefire-plugin:2.2.0:test (default-test) @ org.eclipse.ease.ui.scripts.test ---
23:42:48 [2022-01-29T04:42:48.937Z] [INFO] Executing Test Runtime with timeout 0, logs (if any) will be placed at: /home/jenkins/agent/workspace/ease.verify.core.target.2018-12/tests/org.eclipse.ease.ui.scripts.test/target/work/data/.metadata/.log
23:42:48 [2022-01-29T04:42:48.937Z] [INFO] Command line:
23:42:48 [2022-01-29T04:42:48.937Z] 	[/opt/tools/java/openjdk/jdk-15/15.0.2+7/bin/java, -Dosgi.noShutdown=false, -Dosgi.os=linux, -Dosgi.ws=gtk, -Dosgi.arch=x86_64, -javaagent:/home/jenkins/.m2/repository/org/jacoco/org.jacoco.agent/0.8.6/org.jacoco.agent-0.8.6-runtime.jar=destfile=/home/jenkins/agent/workspace/ease.verify.core.target.2018-12/tests/org.eclipse.ease.ui.scripts.test/target/jacoco.exec,output=file, -Dosgi.clean=true, -jar, /home/jenkins/.m2/repository/p2/osgi/bundle/org.eclipse.equinox.launcher/1.6.300.v20210813-1054/org.eclipse.equinox.launcher-1.6.300.v20210813-1054.jar, -data, /home/jenkins/agent/workspace/ease.verify.core.target.2018-12/tests/org.eclipse.ease.ui.scripts.test/target/work/data, -install, /home/jenkins/agent/workspace/ease.verify.core.target.2018-12/tests/org.eclipse.ease.ui.scripts.test/target/work, -configuration, /home/jenkins/agent/workspace/ease.verify.core.target.2018-12/tests/org.eclipse.ease.ui.scripts.test/target/work/configuration, -application, org.eclipse.tycho.surefire.osgibooter.headlesstest, -testproperties, /home/jenkins/agent/workspace/ease.verify.core.target.2018-12/tests/org.eclipse.ease.ui.scripts.test/target/surefire.properties]
23:42:48 [2022-01-29T04:42:48.937Z] Picked up JAVA_TOOL_OPTIONS: -Dmaven.ext.class.path="/home/jenkins/agent/workspace/ease.verify.core.target.2018-12@tmp/withMaven5e71502e/pipeline-maven-spy.jar" -Dorg.jenkinsci.plugins.pipeline.maven.reportsFolder="/home/jenkins/agent/workspace/ease.verify.core.target.2018-12@tmp/withMaven5e71502e" 
23:42:52 [2022-01-29T04:42:52.238Z] Running org.eclipse.ease.ui.scripts.expressions.definitions.ExpressionFactoryTest
23:42:52 [2022-01-29T04:42:52.238Z] Tests run: 14, Failures: 0, Errors: 0, Skipped: 0, Time elapsed: 0.07 s - in org.eclipse.ease.ui.scripts.expressions.definitions.ExpressionFactoryTest
23:42:52 [2022-01-29T04:42:52.238Z] loadClassWithExpression  Time elapsed: 0.021 s
23:42:52 [2022-01-29T04:42:52.238Z] createWithExpression  Time elapsed: 0 s
23:42:52 [2022-01-29T04:42:52.238Z] createReferenceExpression  Time elapsed: 0.001 s
23:42:52 [2022-01-29T04:42:52.238Z] loadClassReferenceExpression  Time elapsed: 0.001 s
23:42:52 [2022-01-29T04:42:52.238Z] loadClassTestExpression  Time elapsed: 0.002 s
23:42:52 [2022-01-29T04:42:52.238Z] createEqualsExpression  Time elapsed: 0.001 s
23:42:52 [2022-01-29T04:42:52.238Z] loadClassCountExpression  Time elapsed: 0.001 s
23:42:52 [2022-01-29T04:42:52.238Z] loadClassOrExpression  Time elapsed: 0.001 s
23:42:52 [2022-01-29T04:42:52.238Z] createTestExpression  Time elapsed: 0.004 s
23:42:52 [2022-01-29T04:42:52.238Z] createOrExpression  Time elapsed: 0.002 s
23:42:52 [2022-01-29T04:42:52.238Z] loadClassAndExpression  Time elapsed: 0.001 s
23:42:52 [2022-01-29T04:42:52.239Z] createAndExpression  Time elapsed: 0 s
23:42:52 [2022-01-29T04:42:52.239Z] loadClassEqualsExpression  Time elapsed: 0.001 s
23:42:52 [2022-01-29T04:42:52.239Z] createCountExpression  Time elapsed: 0.001 s
23:42:52 [2022-01-29T04:42:52.239Z] 
23:42:52 [2022-01-29T04:42:52.239Z] Results:
23:42:52 [2022-01-29T04:42:52.239Z] 
23:42:52 [2022-01-29T04:42:52.239Z] Tests run: 14, Failures: 0, Errors: 0, Skipped: 0
23:42:52 [2022-01-29T04:42:52.239Z] 
23:42:52 [2022-01-29T04:42:52.495Z] [INFO] All tests passed!
23:42:52 [2022-01-29T04:42:52.495Z] [INFO] 
23:42:52 [2022-01-29T04:42:52.495Z] [INFO] --- maven-pmd-plugin:3.14.0:pmd (pmd-integration) @ org.eclipse.ease.ui.scripts.test ---
23:42:52 [2022-01-29T04:42:52.495Z] [WARNING] Unable to exclude rules [JUnit5TestShouldBePackagePrivate] from ruleset reference category/java/bestpractices.xml; perhaps the rule name is misspelled or the rule doesn't exist anymore?
23:42:52 [2022-01-29T04:42:52.495Z] [WARNING] Unable to exclude rules [JUnit5TestShouldBePackagePrivate] from ruleset reference category/java/bestpractices.xml; perhaps the rule name is misspelled or the rule doesn't exist anymore?
23:42:52 [2022-01-29T04:42:52.752Z] [INFO] 
23:42:52 [2022-01-29T04:42:52.752Z] [INFO] --- maven-pmd-plugin:3.14.0:cpd (pmd-integration) @ org.eclipse.ease.ui.scripts.test ---
23:42:52 [2022-01-29T04:42:52.752Z] [INFO] 
23:42:52 [2022-01-29T04:42:52.752Z] [INFO] --- spotbugs-maven-plugin:4.1.4:spotbugs (spotbugs-integration) @ org.eclipse.ease.ui.scripts.test ---
23:42:52 [2022-01-29T04:42:52.752Z] [INFO] Fork Value is false
23:42:52 [2022-01-29T04:42:52.752Z]      [java] JVM args ignored when same JVM is used.
23:42:54 [2022-01-29T04:42:54.653Z] [INFO] Done SpotBugs Analysis....
23:42:54 [2022-01-29T04:42:54.653Z] [INFO] 
23:42:54 [2022-01-29T04:42:54.653Z] [INFO] --- maven-checkstyle-plugin:3.1.1:check (checkstyle-integration) @ org.eclipse.ease.ui.scripts.test ---
23:42:54 [2022-01-29T04:42:54.653Z] [INFO] You have 0 Checkstyle violations.
23:42:54 [2022-01-29T04:42:54.653Z] [INFO] 
23:42:54 [2022-01-29T04:42:54.653Z] [INFO] --- maven-install-plugin:2.3.1:install (default-install) @ org.eclipse.ease.ui.scripts.test ---
23:42:54 [2022-01-29T04:42:54.653Z] [INFO] Installing /home/jenkins/agent/workspace/ease.verify.core.target.2018-12/tests/org.eclipse.ease.ui.scripts.test/target/org.eclipse.ease.ui.scripts.test-0.9.0-SNAPSHOT.jar to /home/jenkins/.m2/repository/org/eclipse/ease/org.eclipse.ease.ui.scripts.test/0.9.0-SNAPSHOT/org.eclipse.ease.ui.scripts.test-0.9.0-SNAPSHOT.jar
23:42:54 [2022-01-29T04:42:54.654Z] [INFO] Installing /home/jenkins/agent/workspace/ease.verify.core.target.2018-12/tests/org.eclipse.ease.ui.scripts.test/pom.xml to /home/jenkins/.m2/repository/org/eclipse/ease/org.eclipse.ease.ui.scripts.test/0.9.0-SNAPSHOT/org.eclipse.ease.ui.scripts.test-0.9.0-SNAPSHOT.pom
23:42:54 [2022-01-29T04:42:54.654Z] [INFO] Installing /home/jenkins/agent/workspace/ease.verify.core.target.2018-12/tests/org.eclipse.ease.ui.scripts.test/target/p2content.xml to /home/jenkins/.m2/repository/org/eclipse/ease/org.eclipse.ease.ui.scripts.test/0.9.0-SNAPSHOT/org.eclipse.ease.ui.scripts.test-0.9.0-SNAPSHOT-p2metadata.xml
23:42:54 [2022-01-29T04:42:54.654Z] [INFO] Installing /home/jenkins/agent/workspace/ease.verify.core.target.2018-12/tests/org.eclipse.ease.ui.scripts.test/target/p2artifacts.xml to /home/jenkins/.m2/repository/org/eclipse/ease/org.eclipse.ease.ui.scripts.test/0.9.0-SNAPSHOT/org.eclipse.ease.ui.scripts.test-0.9.0-SNAPSHOT-p2artifacts.xml
23:42:54 [2022-01-29T04:42:54.654Z] [INFO] 
23:42:54 [2022-01-29T04:42:54.654Z] [INFO] --- tycho-p2-plugin:2.2.0:update-local-index (default-update-local-index) @ org.eclipse.ease.ui.scripts.test ---
23:42:54 [2022-01-29T04:42:54.654Z] [INFO] 
23:42:54 [2022-01-29T04:42:54.654Z] [INFO] -------------< org.eclipse.ease:org.eclipse.ease.ui.test >--------------
23:42:54 [2022-01-29T04:42:54.654Z] [INFO] Building org.eclipse.ease.ui.test 0.9.0-SNAPSHOT                 [46/49]
23:42:54 [2022-01-29T04:42:54.654Z] [INFO] ------------------------[ eclipse-test-plugin ]-------------------------
23:42:54 [2022-01-29T04:42:54.654Z] [INFO] 
23:42:54 [2022-01-29T04:42:54.654Z] [INFO] --- maven-clean-plugin:2.5:clean (default-clean) @ org.eclipse.ease.ui.test ---
23:42:54 [2022-01-29T04:42:54.654Z] [INFO] 
23:42:54 [2022-01-29T04:42:54.654Z] [INFO] --- tycho-packaging-plugin:2.2.0:build-qualifier (default-build-qualifier) @ org.eclipse.ease.ui.test ---
23:42:54 [2022-01-29T04:42:54.654Z] [INFO] The project's OSGi version is 0.9.0.I202201141255
23:42:54 [2022-01-29T04:42:54.654Z] [INFO] 
23:42:54 [2022-01-29T04:42:54.654Z] [INFO] --- tycho-packaging-plugin:2.2.0:validate-id (default-validate-id) @ org.eclipse.ease.ui.test ---
23:42:54 [2022-01-29T04:42:54.654Z] [INFO] 
23:42:54 [2022-01-29T04:42:54.654Z] [INFO] --- tycho-packaging-plugin:2.2.0:validate-version (default-validate-version) @ org.eclipse.ease.ui.test ---
23:42:54 [2022-01-29T04:42:54.654Z] [INFO] 
23:42:54 [2022-01-29T04:42:54.654Z] [INFO] --- maven-resources-plugin:2.4.3:resources (default-resources) @ org.eclipse.ease.ui.test ---
23:42:54 [2022-01-29T04:42:54.654Z] [INFO] Using 'UTF-8' encoding to copy filtered resources.
23:42:54 [2022-01-29T04:42:54.654Z] [INFO] skip non existing resourceDirectory /home/jenkins/agent/workspace/ease.verify.core.target.2018-12/tests/org.eclipse.ease.ui.test/src/main/resources
23:42:54 [2022-01-29T04:42:54.654Z] [INFO] 
23:42:54 [2022-01-29T04:42:54.654Z] [INFO] --- tycho-compiler-plugin:2.2.0:compile (default-compile) @ org.eclipse.ease.ui.test ---
23:42:54 [2022-01-29T04:42:54.654Z] [INFO] Compiling 26 source files to /home/jenkins/agent/workspace/ease.verify.core.target.2018-12/tests/org.eclipse.ease.ui.test/target/classes
23:42:55 [2022-01-29T04:42:55.289Z] [INFO] 
23:42:55 [2022-01-29T04:42:55.290Z] [INFO] --- maven-resources-plugin:2.4.3:testResources (default-testResources) @ org.eclipse.ease.ui.test ---
23:42:55 [2022-01-29T04:42:55.290Z] [INFO] Using 'UTF-8' encoding to copy filtered resources.
23:42:55 [2022-01-29T04:42:55.290Z] [INFO] skip non existing resourceDirectory /home/jenkins/agent/workspace/ease.verify.core.target.2018-12/tests/org.eclipse.ease.ui.test/src/test/resources
23:42:55 [2022-01-29T04:42:55.290Z] [INFO] 
23:42:55 [2022-01-29T04:42:55.290Z] [INFO] --- target-platform-configuration:2.2.0:target-platform (default-target-platform) @ org.eclipse.ease.ui.test ---
23:42:55 [2022-01-29T04:42:55.290Z] [INFO] 
23:42:55 [2022-01-29T04:42:55.290Z] [INFO] --- tycho-packaging-plugin:2.2.0:package-plugin (default-package-plugin) @ org.eclipse.ease.ui.test ---
23:42:55 [2022-01-29T04:42:55.290Z] [INFO] Building jar: /home/jenkins/agent/workspace/ease.verify.core.target.2018-12/tests/org.eclipse.ease.ui.test/target/org.eclipse.ease.ui.test-0.9.0-SNAPSHOT.jar
23:42:55 [2022-01-29T04:42:55.290Z] [INFO] 
23:42:55 [2022-01-29T04:42:55.290Z] [INFO] --- tycho-p2-plugin:2.2.0:p2-metadata-default (default-p2-metadata-default) @ org.eclipse.ease.ui.test ---
23:42:55 [2022-01-29T04:42:55.290Z] [INFO] 
23:42:55 [2022-01-29T04:42:55.290Z] [INFO] --- jacoco-maven-plugin:0.8.6:prepare-agent (jacoco-initialize) @ org.eclipse.ease.ui.test ---
23:42:55 [2022-01-29T04:42:55.290Z] [INFO] tycho.testArgLine set to -javaagent:/home/jenkins/.m2/repository/org/jacoco/org.jacoco.agent/0.8.6/org.jacoco.agent-0.8.6-runtime.jar=destfile=/home/jenkins/agent/workspace/ease.verify.core.target.2018-12/tests/org.eclipse.ease.ui.test/target/jacoco.exec,output=file
23:42:55 [2022-01-29T04:42:55.290Z] [INFO] 
23:42:55 [2022-01-29T04:42:55.290Z] [INFO] --- tycho-surefire-plugin:2.2.0:test (default-test) @ org.eclipse.ease.ui.test ---
23:42:55 [2022-01-29T04:42:55.547Z] [INFO] Executing Test Runtime with timeout 0, logs (if any) will be placed at: /home/jenkins/agent/workspace/ease.verify.core.target.2018-12/tests/org.eclipse.ease.ui.test/target/work/data/.metadata/.log
23:42:55 [2022-01-29T04:42:55.547Z] [INFO] Command line:
23:42:55 [2022-01-29T04:42:55.547Z] 	[/opt/tools/java/openjdk/jdk-15/15.0.2+7/bin/java, -Dosgi.noShutdown=false, -Dosgi.os=linux, -Dosgi.ws=gtk, -Dosgi.arch=x86_64, -javaagent:/home/jenkins/.m2/repository/org/jacoco/org.jacoco.agent/0.8.6/org.jacoco.agent-0.8.6-runtime.jar=destfile=/home/jenkins/agent/workspace/ease.verify.core.target.2018-12/tests/org.eclipse.ease.ui.test/target/jacoco.exec,output=file, -Dosgi.clean=true, -jar, /home/jenkins/.m2/repository/p2/osgi/bundle/org.eclipse.equinox.launcher/1.6.300.v20210813-1054/org.eclipse.equinox.launcher-1.6.300.v20210813-1054.jar, -data, /home/jenkins/agent/workspace/ease.verify.core.target.2018-12/tests/org.eclipse.ease.ui.test/target/work/data, -install, /home/jenkins/agent/workspace/ease.verify.core.target.2018-12/tests/org.eclipse.ease.ui.test/target/work, -configuration, /home/jenkins/agent/workspace/ease.verify.core.target.2018-12/tests/org.eclipse.ease.ui.test/target/work/configuration, -application, org.eclipse.tycho.surefire.osgibooter.headlesstest, -testproperties, /home/jenkins/agent/workspace/ease.verify.core.target.2018-12/tests/org.eclipse.ease.ui.test/target/surefire.properties]
23:42:55 [2022-01-29T04:42:55.547Z] Picked up JAVA_TOOL_OPTIONS: -Dmaven.ext.class.path="/home/jenkins/agent/workspace/ease.verify.core.target.2018-12@tmp/withMaven5e71502e/pipeline-maven-spy.jar" -Dorg.jenkinsci.plugins.pipeline.maven.reportsFolder="/home/jenkins/agent/workspace/ease.verify.core.target.2018-12@tmp/withMaven5e71502e" 
23:42:58 [2022-01-29T04:42:58.840Z] Running org.eclipse.ease.ui.completion.CodeCompletionAggregatorTest
23:42:58 [2022-01-29T04:42:58.840Z] Tests run: 4, Failures: 0, Errors: 0, Skipped: 0, Time elapsed: 0.507 s - in org.eclipse.ease.ui.completion.CodeCompletionAggregatorTest
23:42:58 [2022-01-29T04:42:58.840Z] context_for_empty_input  Time elapsed: 0.487 s
23:42:58 [2022-01-29T04:42:58.840Z] context_for_root_package_with_suffix  Time elapsed: 0.003 s
23:42:58 [2022-01-29T04:42:58.840Z] getProposals_contains_proposal_from_local_provider  Time elapsed: 0.003 s
23:42:58 [2022-01-29T04:42:58.840Z] context_for_root_package  Time elapsed: 0.001 s
23:42:58 [2022-01-29T04:42:58.840Z] Running org.eclipse.ease.ui.completion.provider.AbstractCompletionProviderTest
23:42:58 [2022-01-29T04:42:58.840Z] Tests run: 16, Failures: 0, Errors: 0, Skipped: 0, Time elapsed: 0.086 s - in org.eclipse.ease.ui.completion.provider.AbstractCompletionProviderTest
23:42:58 [2022-01-29T04:42:58.840Z] isStringParameter_equals_true{String}[1]  Time elapsed: 0.014 s
23:42:58 [2022-01-29T04:42:58.840Z] isStringParameter_equals_true{String}[2]  Time elapsed: 0.014 s
23:42:58 [2022-01-29T04:42:58.840Z] isStringParameter_equals_true{String}[3]  Time elapsed: 0 s
23:42:58 [2022-01-29T04:42:58.840Z] isStringParameter_equals_true{String}[4]  Time elapsed: 0.001 s
23:42:58 [2022-01-29T04:42:58.840Z] isMethodParameter_equals_true  Time elapsed: 0.001 s
23:42:58 [2022-01-29T04:42:58.840Z] isMethodParameter_equals_true_for_2nd_parameter  Time elapsed: 0.001 s
23:42:58 [2022-01-29T04:42:58.840Z] isValid_equals_false_for_invalid_context  Time elapsed: 0.018 s
23:42:58 [2022-01-29T04:42:58.840Z] isStringParameter_equals_false{String}[1]  Time elapsed: 0.001 s
23:42:58 [2022-01-29T04:42:58.840Z] isStringParameter_equals_false{String}[2]  Time elapsed: 0.001 s
23:42:58 [2022-01-29T04:42:58.840Z] isStringParameter_equals_false{String}[3]  Time elapsed: 0.001 s
23:42:58 [2022-01-29T04:42:58.840Z] isStringParameter_equals_false{String}[4]  Time elapsed: 0 s
23:42:58 [2022-01-29T04:42:58.840Z] isStringParameter_equals_false{String}[5]  Time elapsed: 0 s
23:42:58 [2022-01-29T04:42:58.840Z] isMethodParameter_equals_false_when_no_method_is_detected  Time elapsed: 0.001 s
23:42:58 [2022-01-29T04:42:58.840Z] isValid_equals_true_for_valid_context  Time elapsed: 0 s
23:42:58 [2022-01-29T04:42:58.840Z] isMethodParameter_equals_false_for_wrong_method_name  Time elapsed: 0 s
23:42:58 [2022-01-29T04:42:58.840Z] isMethodParameter_equals_false_for_wrong_parameter_index  Time elapsed: 0 s
23:42:58 [2022-01-29T04:42:58.840Z] Running org.eclipse.ease.ui.completion.provider.VariablesCompletionProviderTest
23:42:59 [2022-01-29T04:42:59.404Z] Tests run: 18, Failures: 0, Errors: 0, Skipped: 0, Time elapsed: 0.282 s - in org.eclipse.ease.ui.completion.provider.VariablesCompletionProviderTest
23:42:59 [2022-01-29T04:42:59.404Z] prepareProposals_instance_contains_integer_variable  Time elapsed: 0.231 s
23:42:59 [2022-01-29T04:42:59.404Z] prepareProposals_instance_contains_string_variable  Time elapsed: 0 s
23:42:59 [2022-01-29T04:42:59.404Z] prepareProposals_instance_contains_string_variable_for_filter_input_case_insensitive  Time elapsed: 0.001 s
23:42:59 [2022-01-29T04:42:59.404Z] prepareProposals_instance_contains_string_variable_for_filter_input  Time elapsed: 0.001 s
23:42:59 [2022-01-29T04:42:59.404Z] prepareProposals_does_not_contain_internal_variable  Time elapsed: 0.001 s
23:42:59 [2022-01-29T04:42:59.404Z] isActive_equals_false{String}[1]  Time elapsed: 0.001 s
23:42:59 [2022-01-29T04:42:59.404Z] isActive_equals_false{String}[2]  Time elapsed: 0.027 s
23:42:59 [2022-01-29T04:42:59.404Z] isActive_equals_false{String}[3]  Time elapsed: 0.001 s
23:42:59 [2022-01-29T04:42:59.404Z] isActive_equals_false{String}[4]  Time elapsed: 0.001 s
23:42:59 [2022-01-29T04:42:59.404Z] isActive_equals_false{String}[5]  Time elapsed: 0.001 s
23:42:59 [2022-01-29T04:42:59.404Z] isActive_equals_true{String}[1]  Time elapsed: 0.001 s
23:42:59 [2022-01-29T04:42:59.404Z] isActive_equals_true{String}[2]  Time elapsed: 0.001 s
23:42:59 [2022-01-29T04:42:59.404Z] isActive_equals_true{String}[3]  Time elapsed: 0 s
23:42:59 [2022-01-29T04:42:59.404Z] isActive_equals_true{String}[4]  Time elapsed: 0.001 s
23:42:59 [2022-01-29T04:42:59.404Z] isActive_equals_true{String}[5]  Time elapsed: 0.001 s
23:42:59 [2022-01-29T04:42:59.404Z] isActive_equals_true{String}[6]  Time elapsed: 0.001 s
23:42:59 [2022-01-29T04:42:59.404Z] isActive_equals_true{String}[7]  Time elapsed: 0.001 s
23:42:59 [2022-01-29T04:42:59.404Z] isActive_equals_true{String}[8]  Time elapsed: 0.001 s
23:42:59 [2022-01-29T04:42:59.404Z] Running org.eclipse.ease.ui.completion.provider.LoadModuleCompletionProviderTest
23:42:59 [2022-01-29T04:42:59.404Z] Tests run: 12, Failures: 0, Errors: 0, Skipped: 0, Time elapsed: 0.019 s - in org.eclipse.ease.ui.completion.provider.LoadModuleCompletionProviderTest
23:42:59 [2022-01-29T04:42:59.404Z] getProposals_contains_root_entry_with_absolute_filter  Time elapsed: 0.004 s
23:42:59 [2022-01-29T04:42:59.404Z] getProposals_contains_root_entry_with_relative_filter  Time elapsed: 0.001 s
23:42:59 [2022-01-29T04:42:59.404Z] getProposals_contains_category_with_relative_filter  Time elapsed: 0.001 s
23:42:59 [2022-01-29T04:42:59.404Z] getProposals_does_not_contain_root_entry_on_filter_mismatch  Time elapsed: 0.001 s
23:42:59 [2022-01-29T04:42:59.404Z] isActive_equals_false{String}[1]  Time elapsed: 0.001 s
23:42:59 [2022-01-29T04:42:59.404Z] isActive_equals_false{String}[2]  Time elapsed: 0.001 s
23:42:59 [2022-01-29T04:42:59.404Z] isActive_equals_false{String}[3]  Time elapsed: 0.001 s
23:42:59 [2022-01-29T04:42:59.404Z] getProposals_contains_root_entry  Time elapsed: 0.001 s
23:42:59 [2022-01-29T04:42:59.404Z] isActive_equals_true{String}[1]  Time elapsed: 0.001 s
23:42:59 [2022-01-29T04:42:59.404Z] isActive_equals_true{String}[2]  Time elapsed: 0.001 s
23:42:59 [2022-01-29T04:42:59.404Z] getProposals_contains_child_entry_with_absolute_filter  Time elapsed: 0.001 s
23:42:59 [2022-01-29T04:42:59.404Z] getProposals_does_not_contain_entry_on_completed_input  Time elapsed: 0.001 s
23:42:59 [2022-01-29T04:42:59.404Z] Running org.eclipse.ease.ui.completion.provider.AbstractPathCompletionProviderTest
23:42:59 [2022-01-29T04:42:59.404Z] Tests run: 11, Failures: 0, Errors: 0, Skipped: 0, Time elapsed: 0.007 s - in org.eclipse.ease.ui.completion.provider.AbstractPathCompletionProviderTest
23:42:59 [2022-01-29T04:42:59.404Z] filter_keeps_only_lower_level_on_matching_filter  Time elapsed: 0.003 s
23:42:59 [2022-01-29T04:42:59.405Z] filter_removes_nothing_if_context_is_empty  Time elapsed: 0 s
23:42:59 [2022-01-29T04:42:59.405Z] getPathsFromElements_is_empty_for_root_elements_only  Time elapsed: 0.001 s
23:42:59 [2022-01-29T04:42:59.405Z] filter_keeps_only_1st_level_on_empty_filter  Time elapsed: 0 s
23:42:59 [2022-01-29T04:42:59.405Z] filter_keeps_only_1st_level_on_matching_filter  Time elapsed: 0 s
23:42:59 [2022-01-29T04:42:59.405Z] getPathsFromElements_is_empty_for_empty_element  Time elapsed: 0 s
23:42:59 [2022-01-29T04:42:59.405Z] filter_removes_mismatches_on_same_level  Time elapsed: 0 s
23:42:59 [2022-01-29T04:42:59.405Z] filter_matches_next_level  Time elapsed: 0.001 s
23:42:59 [2022-01-29T04:42:59.405Z] filter_matches_relative_paths  Time elapsed: 0 s
23:42:59 [2022-01-29T04:42:59.405Z] getPathsFromElements_contains_parent_paths  Time elapsed: 0 s
23:42:59 [2022-01-29T04:42:59.405Z] getPathsFromElements_contains_all_hierarchies  Time elapsed: 0 s
23:42:59 [2022-01-29T04:42:59.405Z] Running org.eclipse.ease.ui.completion.provider.LoadedModuleCompletionProviderTest
23:42:59 [2022-01-29T04:42:59.405Z] Tests run: 15, Failures: 0, Errors: 0, Skipped: 0, Time elapsed: 0.049 s - in org.eclipse.ease.ui.completion.provider.LoadedModuleCompletionProviderTest
23:42:59 [2022-01-29T04:42:59.405Z] method_proposal_contains_opening_bracket_when_method_has_mandatory_parameters  Time elapsed: 0.003 s
23:42:59 [2022-01-29T04:42:59.405Z] method_proposal_contains_full_method_call_when_method_has_only_optional_parameters  Time elapsed: 0.002 s
23:42:59 [2022-01-29T04:42:59.405Z] getProposals_contains_constant_methods  Time elapsed: 0.001 s
23:42:59 [2022-01-29T04:42:59.405Z] getProposals_contains_module_methods  Time elapsed: 0.002 s
23:42:59 [2022-01-29T04:42:59.405Z] isActive_equals_false{String}[1]  Time elapsed: 0 s
23:42:59 [2022-01-29T04:42:59.405Z] isActive_equals_false{String}[2]  Time elapsed: 0.001 s
23:42:59 [2022-01-29T04:42:59.405Z] isActive_equals_false{String}[3]  Time elapsed: 0 s
23:42:59 [2022-01-29T04:42:59.405Z] isActive_equals_false{String}[4]  Time elapsed: 0 s
23:42:59 [2022-01-29T04:42:59.405Z] isActive_equals_true{String}[1]  Time elapsed: 0 s
23:42:59 [2022-01-29T04:42:59.405Z] isActive_equals_true{String}[2]  Time elapsed: 0.001 s
23:42:59 [2022-01-29T04:42:59.405Z] isActive_equals_true{String}[3]  Time elapsed: 0 s
23:42:59 [2022-01-29T04:42:59.405Z] isActive_equals_true{String}[4]  Time elapsed: 0 s
23:42:59 [2022-01-29T04:42:59.405Z] isActive_equals_true{String}[5]  Time elapsed: 0.001 s
23:42:59 [2022-01-29T04:42:59.405Z] isActive_equals_true{String}[6]  Time elapsed: 0 s
23:42:59 [2022-01-29T04:42:59.405Z] method_proposal_contains_full_method_call_when_method_has_no_parameters  Time elapsed: 0.03 s
23:42:59 [2022-01-29T04:42:59.405Z] Running org.eclipse.ease.ui.completion.provider.LocationResolverTest
23:42:59 [2022-01-29T04:42:59.405Z] Tests run: 1, Failures: 0, Errors: 0, Skipped: 0, Time elapsed: 0.003 s - in org.eclipse.ease.ui.completion.provider.LocationResolverTest
23:42:59 [2022-01-29T04:42:59.405Z] getParentString_has_no_trailing_slashes  Time elapsed: 0.002 s
23:42:59 [2022-01-29T04:42:59.405Z] Running org.eclipse.ease.ui.completion.provider.AbstractFileLocationCompletionProviderTest
23:42:59 [2022-01-29T04:42:59.405Z] Tests run: 22, Failures: 0, Errors: 0, Skipped: 0, Time elapsed: 0.108 s - in org.eclipse.ease.ui.completion.provider.AbstractFileLocationCompletionProviderTest
23:42:59 [2022-01-29T04:42:59.405Z] getProposals_does_not_contain_back_proposal_for_project  Time elapsed: 0.069 s
23:42:59 [2022-01-29T04:42:59.405Z] getProposals_does_not_contain_project_root_with_file_resource  Time elapsed: 0 s
23:42:59 [2022-01-29T04:42:59.405Z] getProposals_contains_project_root_files_for_project_root  Time elapsed: 0.001 s
23:42:59 [2022-01-29T04:42:59.405Z] getProposals_contains_files_for_workspace_folder  Time elapsed: 0 s
23:42:59 [2022-01-29T04:42:59.405Z] getProposals_contains_back_for_workspace_folder  Time elapsed: 0 s
23:42:59 [2022-01-29T04:42:59.405Z] getProposals_contains_root_file_systems  Time elapsed: 0.001 s
23:42:59 [2022-01-29T04:42:59.405Z] getProposals_contains_files_for_project  Time elapsed: 0 s
23:42:59 [2022-01-29T04:42:59.405Z] back_proposal_contains_correct_replacement_string_for_absolute_workspace_folder_link  Time elapsed: 0.001 s
23:42:59 [2022-01-29T04:42:59.405Z] getProposals_does_not_contain_project_root_without_resource  Time elapsed: 0 s
23:42:59 [2022-01-29T04:42:59.405Z] getProposals_contains_project_root_with_workspace_resource  Time elapsed: 0.001 s
23:42:59 [2022-01-29T04:42:59.405Z] getProposals_contains_back_for_project_folder  Time elapsed: 0 s
23:42:59 [2022-01-29T04:42:59.405Z] getProposals_contains_project_root_folders_for_workspace_project_with_back_path  Time elapsed: 0.001 s
23:42:59 [2022-01-29T04:42:59.405Z] getProposals_contains_projects_for_workspace_root  Time elapsed: 0 s
23:42:59 [2022-01-29T04:42:59.406Z] getProposals_contains_project_root_folders_for_workspace_project  Time elapsed: 0.001 s
23:42:59 [2022-01-29T04:42:59.406Z] getProposals_contains_filesystem_root  Time elapsed: 0 s
23:42:59 [2022-01-29T04:42:59.406Z] getProposals_contains_files_for_project_folder  Time elapsed: 0.001 s
23:42:59 [2022-01-29T04:42:59.406Z] getProposals_contains_workspace_root  Time elapsed: 0 s
23:42:59 [2022-01-29T04:42:59.406Z] getProposals_does_not_contain_back_proposal  Time elapsed: 0.001 s
23:42:59 [2022-01-29T04:42:59.406Z] getProposals_contains_files_for_filesystem  Time elapsed: 0 s
23:42:59 [2022-01-29T04:42:59.406Z] getProposals_contains_project_root_files_for_workspace_project  Time elapsed: 0 s
23:42:59 [2022-01-29T04:42:59.406Z] getProposals_contains_back_for_filesystem  Time elapsed: 0 s
23:42:59 [2022-01-29T04:42:59.406Z] back_proposal_contains_correct_replacement_string_for_relative_workspace_folder_link  Time elapsed: 0 s
23:42:59 [2022-01-29T04:42:59.406Z] Running org.eclipse.ease.ui.completion.tokenizer.TokenListTest
23:42:59 [2022-01-29T04:42:59.406Z] Tests run: 1, Failures: 0, Errors: 0, Skipped: 0, Time elapsed: 0.001 s - in org.eclipse.ease.ui.completion.tokenizer.TokenListTest
23:42:59 [2022-01-29T04:42:59.406Z] new_TokenList_is_empty  Time elapsed: 0 s
23:42:59 [2022-01-29T04:42:59.406Z] Running org.eclipse.ease.ui.completion.tokenizer.BracketMatcherTest
23:42:59 [2022-01-29T04:42:59.406Z] Tests run: 9, Failures: 0, Errors: 0, Skipped: 0, Time elapsed: 0.003 s - in org.eclipse.ease.ui.completion.tokenizer.BracketMatcherTest
23:42:59 [2022-01-29T04:42:59.406Z] getOpenBrackets_returns_open_brackets_only  Time elapsed: 0.001 s
23:42:59 [2022-01-29T04:42:59.406Z] getBrackets_detects_1  Time elapsed: 0 s
23:42:59 [2022-01-29T04:42:59.406Z] getBrackets_detects_2  Time elapsed: 0 s
23:42:59 [2022-01-29T04:42:59.406Z] getBrackets_detects_3  Time elapsed: 0 s
23:42:59 [2022-01-29T04:42:59.406Z] hasOpenBrackets_equals_true  Time elapsed: 0.001 s
23:42:59 [2022-01-29T04:42:59.406Z] getBrackets_is_empty  Time elapsed: 0 s
23:42:59 [2022-01-29T04:42:59.406Z] hasOpenBrackets_equals_false  Time elapsed: 0 s
23:42:59 [2022-01-29T04:42:59.406Z] getBrackets_detects_open_brackets  Time elapsed: 0 s
23:42:59 [2022-01-29T04:42:59.406Z] getBrackets_detects_nested  Time elapsed: 0 s
23:42:59 [2022-01-29T04:42:59.406Z] Running org.eclipse.ease.ui.completion.tokenizer.InputTokenizerTest
23:42:59 [2022-01-29T04:42:59.406Z] Tests run: 68, Failures: 0, Errors: 0, Skipped: 0, Time elapsed: 0.031 s - in org.eclipse.ease.ui.completion.tokenizer.InputTokenizerTest
23:42:59 [2022-01-29T04:42:59.406Z] getTokens_detects_method_chaining  Time elapsed: 0.001 s
23:42:59 [2022-01-29T04:42:59.406Z] isDelimiter_equals_true{String}[1]  Time elapsed: 0 s
23:42:59 [2022-01-29T04:42:59.406Z] isDelimiter_equals_true{String}[2]  Time elapsed: 0 s
23:42:59 [2022-01-29T04:42:59.406Z] isDelimiter_equals_true{String}[3]  Time elapsed: 0 s
23:42:59 [2022-01-29T04:42:59.406Z] isDelimiter_equals_true{String}[4]  Time elapsed: 0 s
23:42:59 [2022-01-29T04:42:59.406Z] isDelimiter_equals_true{String}[5]  Time elapsed: 0.001 s
23:42:59 [2022-01-29T04:42:59.406Z] isDelimiter_equals_true{String}[6]  Time elapsed: 0 s
23:42:59 [2022-01-29T04:42:59.406Z] isDelimiter_equals_true{String}[7]  Time elapsed: 0 s
23:42:59 [2022-01-29T04:42:59.406Z] getTokens_detects_package_fragments  Time elapsed: 0 s
23:42:59 [2022-01-29T04:42:59.406Z] getTokens_detects_javascript_method_call  Time elapsed: 0 s
23:42:59 [2022-01-29T04:42:59.406Z] getTokens_detects_incomplete_package  Time elapsed: 0 s
23:42:59 [2022-01-29T04:42:59.406Z] getTokens_detects_module_methods_call_chain  Time elapsed: 0 s
23:42:59 [2022-01-29T04:42:59.406Z] getTokens_splits_string_literal  Time elapsed: 0.001 s
23:42:59 [2022-01-29T04:42:59.406Z] getTokens_detects_static_method_call  Time elapsed: 0 s
23:42:59 [2022-01-29T04:42:59.406Z] getTokens_detects_method_call_chain  Time elapsed: 0 s
23:42:59 [2022-01-29T04:42:59.406Z] getTokens_simplifies_multiply_operations  Time elapsed: 0 s
23:42:59 [2022-01-29T04:42:59.406Z] getTokens_detects_method_call_parameter_prefix  Time elapsed: 0 s
23:42:59 [2022-01-29T04:42:59.406Z] getTokens_detects_method_call_parameters_with_prefix  Time elapsed: 0.001 s
23:42:59 [2022-01-29T04:42:59.406Z] getTokens_detects_package  Time elapsed: 0 s
23:42:59 [2022-01-29T04:42:59.406Z] getTokens_detects_partial_package  Time elapsed: 0 s
23:42:59 [2022-01-29T04:42:59.406Z] getTokens_simplifies_plus_operations  Time elapsed: 0.001 s
23:42:59 [2022-01-29T04:42:59.406Z] getTokens_detects_class  Time elapsed: 0 s
23:42:59 [2022-01-29T04:42:59.406Z] getTokens_detects_opened_module_method  Time elapsed: 0 s
23:42:59 [2022-01-29T04:42:59.406Z] getTokens_simplifies_brackets_recursively  Time elapsed: 0 s
23:42:59 [2022-01-29T04:42:59.406Z] getTokens_detects_method_call_parameter  Time elapsed: 0 s
23:42:59 [2022-01-29T04:42:59.406Z] getTokens_simplifies_brackets  Time elapsed: 0 s
23:42:59 [2022-01-29T04:42:59.407Z] getTokens_removes_new_operator  Time elapsed: 0.001 s
23:42:59 [2022-01-29T04:42:59.407Z] isDelimiter_equals_false{String}[1]  Time elapsed: 0.001 s
23:42:59 [2022-01-29T04:42:59.407Z] isDelimiter_equals_false{String}[2]  Time elapsed: 0 s
23:42:59 [2022-01-29T04:42:59.407Z] isDelimiter_equals_false{String}[3]  Time elapsed: 0.001 s
23:42:59 [2022-01-29T04:42:59.407Z] getTokens_detects_method_call_parameters  Time elapsed: 0 s
23:42:59 [2022-01-29T04:42:59.407Z] getTokens_detects_class_instantiation  Time elapsed: 0 s
23:42:59 [2022-01-29T04:42:59.407Z] getTokens_detects_method_call  Time elapsed: 0 s
23:42:59 [2022-01-29T04:42:59.407Z] getTokens_simplifies_divide_operations  Time elapsed: 0 s
23:42:59 [2022-01-29T04:42:59.407Z] getTokens_removes_left_hand_side_of_assignment  Time elapsed: 0 s
23:42:59 [2022-01-29T04:42:59.407Z] getTokens_detects_javascript_class_instantiation  Time elapsed: 0.001 s
23:42:59 [2022-01-29T04:42:59.407Z] getTokens_simplifies_for_loop  Time elapsed: 0 s
23:42:59 [2022-01-29T04:42:59.407Z] getTokens_detects_resolved_javascript_variable_2  Time elapsed: 0 s
23:42:59 [2022-01-29T04:42:59.407Z] getTokens_simplifies_minus_operations  Time elapsed: 0 s
23:42:59 [2022-01-29T04:42:59.407Z] getTokens_detects_class_instantiation_2  Time elapsed: 0 s
23:42:59 [2022-01-29T04:42:59.407Z] getTokens_detects_class_instantiation_3  Time elapsed: 0.001 s
23:42:59 [2022-01-29T04:42:59.407Z] getTokens_simplifies_assignments  Time elapsed: 0 s
23:42:59 [2022-01-29T04:42:59.407Z] getTokens_detects_inner_class  Time elapsed: 0 s
23:42:59 [2022-01-29T04:42:59.407Z] getTokens_detects_static_method_call_with_dot_prefix  Time elapsed: 0.001 s
23:42:59 [2022-01-29T04:42:59.407Z] getTokens_detects_class_2  Time elapsed: 0 s
23:42:59 [2022-01-29T04:42:59.407Z] isTextFilter_equals_false{String}[1]  Time elapsed: 0 s
23:42:59 [2022-01-29T04:42:59.407Z] isTextFilter_equals_false{String}[2]  Time elapsed: 0 s
23:42:59 [2022-01-29T04:42:59.407Z] isTextFilter_equals_false{String}[3]  Time elapsed: 0 s
23:42:59 [2022-01-29T04:42:59.407Z] isTextFilter_equals_false{String}[4]  Time elapsed: 0 s
23:42:59 [2022-01-29T04:42:59.407Z] isTextFilter_equals_false{String}[5]  Time elapsed: 0 s
23:42:59 [2022-01-29T04:42:59.407Z] getTokens_does_not_split_within_string_literal  Time elapsed: 0 s
23:42:59 [2022-01-29T04:42:59.407Z] getTokens_1  Time elapsed: 0 s
23:42:59 [2022-01-29T04:42:59.407Z] isTextFilter_equals_true{String}[1]  Time elapsed: 0 s
23:42:59 [2022-01-29T04:42:59.407Z] isTextFilter_equals_true{String}[2]  Time elapsed: 0 s
23:42:59 [2022-01-29T04:42:59.407Z] getTokens_detects_opened_module_method_with_filter  Time elapsed: 0 s
23:42:59 [2022-01-29T04:42:59.407Z] getTokens_detects_method_call_request_with_filter  Time elapsed: 0 s
23:42:59 [2022-01-29T04:42:59.407Z] getTokens_for_empty_input  Time elapsed: 0 s
23:42:59 [2022-01-29T04:42:59.407Z] getTokens_detects_package_with_class_prefix  Time elapsed: 0 s
23:42:59 [2022-01-29T04:42:59.407Z] getTokens_detects_module_methods  Time elapsed: 0 s
23:42:59 [2022-01-29T04:42:59.407Z] getTokens_detects_completed_method  Time elapsed: 0 s
23:42:59 [2022-01-29T04:42:59.407Z] getTokens_detects_resolved_javascript_variable_with_method  Time elapsed: 0.001 s
23:42:59 [2022-01-29T04:42:59.407Z] getTokens_detects_resolved_javascript_variable  Time elapsed: 0 s
23:42:59 [2022-01-29T04:42:59.407Z] getTokens_simplifies_string_literal_1  Time elapsed: 0 s
23:42:59 [2022-01-29T04:42:59.407Z] getTokens_simplifies_string_literal_2  Time elapsed: 0 s
23:42:59 [2022-01-29T04:42:59.407Z] getTokens_is_empty_after_string_literal  Time elapsed: 0 s
23:42:59 [2022-01-29T04:42:59.407Z] getTokens_detects_static_method_call_chain  Time elapsed: 0 s
23:42:59 [2022-01-29T04:42:59.407Z] getTokens_detects_opened_module_method_with_parameter  Time elapsed: 0 s
23:42:59 [2022-01-29T04:42:59.407Z] getTokens_detects_javascript_object_call  Time elapsed: 0.001 s
23:42:59 [2022-01-29T04:42:59.407Z] Running org.eclipse.ease.ui.completion.BasicContextTest
23:42:59 [2022-01-29T04:42:59.407Z] Tests run: 12, Failures: 0, Errors: 0, Skipped: 0, Time elapsed: 0.038 s - in org.eclipse.ease.ui.completion.BasicContextTest
23:42:59 [2022-01-29T04:42:59.407Z] isValid_equals_true  Time elapsed: 0.001 s
23:42:59 [2022-01-29T04:42:59.407Z] getScriptEngine_returns_engine  Time elapsed: 0.001 s
23:42:59 [2022-01-29T04:42:59.407Z] getFilter_removes_string_literal_start  Time elapsed: 0 s
23:42:59 [2022-01-29T04:42:59.407Z] getLoadedModules_detects_modules_from_ScriptEngine  Time elapsed: 0.001 s
23:42:59 [2022-01-29T04:42:59.407Z] getFilter_contains_parameter_prefix  Time elapsed: 0 s
23:42:59 [2022-01-29T04:42:59.407Z] getLoadedModules_contains_environment_on_resource  Time elapsed: 0 s
23:42:59 [2022-01-29T04:42:59.407Z] getLoadedModules_does_not_contain_environment_twice_on_resource  Time elapsed: 0.005 s
23:42:59 [2022-01-29T04:42:59.408Z] getFilter_is_empty  Time elapsed: 0 s
23:42:59 [2022-01-29T04:42:59.408Z] getFilter_keeps_spaces_in_string_literal  Time elapsed: 0 s
23:42:59 [2022-01-29T04:42:59.408Z] getLoadedModules_detects_loadModule_commands  Time elapsed: 0 s
23:42:59 [2022-01-29T04:42:59.408Z] getFilter_is_empty_for_empty_input  Time elapsed: 0 s
23:42:59 [2022-01-29T04:42:59.408Z] isInvalid_equals_true  Time elapsed: 0 s
23:42:59 [2022-01-29T04:42:59.408Z] Running org.eclipse.ease.ui.completion.ScriptCompletionProposalTest
23:42:59 [2022-01-29T04:42:59.408Z] Tests run: 8, Failures: 0, Errors: 0, Skipped: 0, Time elapsed: 0.003 s - in org.eclipse.ease.ui.completion.ScriptCompletionProposalTest
23:42:59 [2022-01-29T04:42:59.408Z] getCursorPosition_equals_end_of_inserted_text  Time elapsed: 0 s
23:42:59 [2022-01-29T04:42:59.408Z] getCursorPosition_equals_end_of_appended_text  Time elapsed: 0 s
23:42:59 [2022-01-29T04:42:59.408Z] compareTo_lists_higher_priority_first  Time elapsed: 0 s
23:42:59 [2022-01-29T04:42:59.408Z] getContent_inserts_replacement_text  Time elapsed: 0 s
23:42:59 [2022-01-29T04:42:59.408Z] getCursorPosition_equals_end_of_set_text  Time elapsed: 0 s
23:42:59 [2022-01-29T04:42:59.408Z] getContent_sets_replacement_text  Time elapsed: 0 s
23:42:59 [2022-01-29T04:42:59.408Z] compareTo_lists_same_prio_in_alphabetic_order  Time elapsed: 0.001 s
23:42:59 [2022-01-29T04:42:59.408Z] getContent_appends_replacement_text  Time elapsed: 0 s
23:42:59 [2022-01-29T04:42:59.408Z] Running org.eclipse.ease.ui.help.hovers.ModuleHelpTest
23:42:59 [2022-01-29T04:42:59.408Z] Tests run: 4, Failures: 0, Errors: 0, Skipped: 4, Time elapsed: 0.002 s - in org.eclipse.ease.ui.help.hovers.ModuleHelpTest
23:42:59 [2022-01-29T04:42:59.408Z] getModuleHelpLocation skipped
23:42:59 [2022-01-29T04:42:59.408Z] getModuleHelp skipped
23:42:59 [2022-01-29T04:42:59.408Z] getMethodHelp skipped
23:42:59 [2022-01-29T04:42:59.408Z] getConstantHelp skipped
23:42:59 [2022-01-29T04:42:59.408Z] Running org.eclipse.ease.ui.views.shell.dropins.modules.ModulesStackLabelProviderTest
23:42:59 [2022-01-29T04:42:59.664Z] Tests run: 3, Failures: 0, Errors: 0, Skipped: 0, Time elapsed: 0.099 s - in org.eclipse.ease.ui.views.shell.dropins.modules.ModulesStackLabelProviderTest
23:42:59 [2022-01-29T04:42:59.665Z] getText_null_returns_empty_string  Time elapsed: 0.008 s
23:42:59 [2022-01-29T04:42:59.665Z] getText_returns_definition_name  Time elapsed: 0.091 s
23:42:59 [2022-01-29T04:42:59.665Z] getText_returns_full_class_name_name  Time elapsed: 0 s
23:42:59 [2022-01-29T04:42:59.665Z] Running org.eclipse.ease.ui.views.shell.dropins.modules.ModulesStackContentProviderTest
23:42:59 [2022-01-29T04:42:59.665Z] Tests run: 2, Failures: 0, Errors: 0, Skipped: 0, Time elapsed: 0.024 s - in org.eclipse.ease.ui.views.shell.dropins.modules.ModulesStackContentProviderTest
23:42:59 [2022-01-29T04:42:59.665Z] getElements_returns_modules  Time elapsed: 0.023 s
23:42:59 [2022-01-29T04:42:59.665Z] getElements_returns_empty_list_without_environment  Time elapsed: 0.001 s
23:42:59 [2022-01-29T04:42:59.665Z] Running org.eclipse.ease.ui.views.shell.dropins.variables.HiddenVariablesFilterTest
23:42:59 [2022-01-29T04:42:59.665Z] Tests run: 3, Failures: 0, Errors: 0, Skipped: 0, Time elapsed: 0.076 s - in org.eclipse.ease.ui.views.shell.dropins.variables.HiddenVariablesFilterTest
23:42:59 [2022-01-29T04:42:59.665Z] select_accepts_unknown_classes  Time elapsed: 0.002 s
23:42:59 [2022-01-29T04:42:59.665Z] select_accepts_script_variables  Time elapsed: 0.074 s
23:42:59 [2022-01-29T04:42:59.665Z] select_declines_hidden_script_variables  Time elapsed: 0 s
23:42:59 [2022-01-29T04:42:59.665Z] Running org.eclipse.ease.ui.views.shell.dropins.variables.ContentLabelProviderTest
23:42:59 [2022-01-29T04:42:59.665Z] Tests run: 1, Failures: 0, Errors: 0, Skipped: 0, Time elapsed: 0.033 s - in org.eclipse.ease.ui.views.shell.dropins.variables.ContentLabelProviderTest
23:42:59 [2022-01-29T04:42:59.665Z] getText_returns_variable_content  Time elapsed: 0.032 s
23:42:59 [2022-01-29T04:42:59.665Z] Running org.eclipse.ease.ui.views.shell.dropins.variables.VariablesComparatorTest
23:42:59 [2022-01-29T04:42:59.922Z] Tests run: 1, Failures: 0, Errors: 0, Skipped: 0, Time elapsed: 0.061 s - in org.eclipse.ease.ui.views.shell.dropins.variables.VariablesComparatorTest
23:42:59 [2022-01-29T04:42:59.922Z] lastExecutionResult_comes_before_debugVariable  Time elapsed: 0.061 s
23:42:59 [2022-01-29T04:42:59.922Z] Running org.eclipse.ease.ui.views.shell.dropins.variables.VariablesLabelProviderTest
23:42:59 [2022-01-29T04:42:59.922Z] Tests run: 1, Failures: 0, Errors: 0, Skipped: 0, Time elapsed: 0.002 s - in org.eclipse.ease.ui.views.shell.dropins.variables.VariablesLabelProviderTest
23:42:59 [2022-01-29T04:42:59.922Z] getText_returns_variable_name  Time elapsed: 0.001 s
23:42:59 [2022-01-29T04:42:59.922Z] Running org.eclipse.ease.ui.views.shell.dropins.variables.VariablesContentProviderTest
23:42:59 [2022-01-29T04:42:59.922Z] Tests run: 5, Failures: 0, Errors: 0, Skipped: 0, Time elapsed: 0.025 s - in org.eclipse.ease.ui.views.shell.dropins.variables.VariablesContentProviderTest
23:42:59 [2022-01-29T04:42:59.922Z] hasChildren_true_when_child_nodes_are_available  Time elapsed: 0.001 s
23:42:59 [2022-01-29T04:42:59.922Z] getChildren_is_empty_when_no_child_nodes_are_available  Time elapsed: 0 s
23:42:59 [2022-01-29T04:42:59.922Z] getElements_contains_variables_from_engine  Time elapsed: 0.022 s
23:42:59 [2022-01-29T04:42:59.922Z] hasChildren_false_when_no_child_nodes_are_available  Time elapsed: 0.001 s
23:42:59 [2022-01-29T04:42:59.922Z] getChildren_not_empty_when_child_nodes_are_available  Time elapsed: 0 s
23:42:59 [2022-01-29T04:42:59.922Z] Running org.eclipse.ease.ui.dnd.ResourceDropHandlerTest
23:42:59 [2022-01-29T04:42:59.922Z] Tests run: 4, Failures: 0, Errors: 0, Skipped: 0, Time elapsed: 0.168 s - in org.eclipse.ease.ui.dnd.ResourceDropHandlerTest
23:42:59 [2022-01-29T04:42:59.922Z] performDrop_includes_URI_instance  Time elapsed: 0.013 s
23:42:59 [2022-01-29T04:42:59.922Z] performDrop_includes_File_instance  Time elapsed: 0.076 s
23:42:59 [2022-01-29T04:42:59.922Z] accepts_returns_false_for_String_input  Time elapsed: 0.003 s
23:42:59 [2022-01-29T04:42:59.922Z] performDrop_includes_IFile_instance  Time elapsed: 0.075 s
23:42:59 [2022-01-29T04:42:59.922Z] Running org.eclipse.ease.ui.dnd.ModulesDropHandlerTest
23:42:59 [2022-01-29T04:42:59.922Z] Tests run: 5, Failures: 0, Errors: 0, Skipped: 0, Time elapsed: 0.017 s - in org.eclipse.ease.ui.dnd.ModulesDropHandlerTest
23:42:59 [2022-01-29T04:42:59.922Z] accepts_true_for_ModuleEntry  Time elapsed: 0.011 s
23:42:59 [2022-01-29T04:42:59.922Z] performDrop_of_Method_executes_with_default_parameters_on_DROP_COPY  Time elapsed: 0.003 s
23:42:59 [2022-01-29T04:42:59.922Z] performDrop_of_ModuleEntry_loads_module  Time elapsed: 0.001 s
23:42:59 [2022-01-29T04:42:59.922Z] accepts_true_for_ModuleDefinition  Time elapsed: 0 s
23:42:59 [2022-01-29T04:42:59.922Z] performDrop_of_ModuleDefinition_loads_module  Time elapsed: 0.001 s
23:42:59 [2022-01-29T04:42:59.922Z] 
23:42:59 [2022-01-29T04:42:59.922Z] Results:
23:42:59 [2022-01-29T04:42:59.922Z] 
23:42:59 [2022-01-29T04:42:59.922Z] Tests run: 226, Failures: 0, Errors: 0, Skipped: 4
23:42:59 [2022-01-29T04:42:59.922Z] 
23:43:00 [2022-01-29T04:43:00.179Z] [INFO] All tests passed!
23:43:00 [2022-01-29T04:43:00.179Z] [INFO] 
23:43:00 [2022-01-29T04:43:00.179Z] [INFO] --- maven-pmd-plugin:3.14.0:pmd (pmd-integration) @ org.eclipse.ease.ui.test ---
23:43:00 [2022-01-29T04:43:00.179Z] [WARNING] Unable to exclude rules [JUnit5TestShouldBePackagePrivate] from ruleset reference category/java/bestpractices.xml; perhaps the rule name is misspelled or the rule doesn't exist anymore?
23:43:00 [2022-01-29T04:43:00.179Z] [WARNING] Unable to exclude rules [JUnit5TestShouldBePackagePrivate] from ruleset reference category/java/bestpractices.xml; perhaps the rule name is misspelled or the rule doesn't exist anymore?
23:43:01 [2022-01-29T04:43:01.551Z] [INFO] 
23:43:01 [2022-01-29T04:43:01.551Z] [INFO] --- maven-pmd-plugin:3.14.0:cpd (pmd-integration) @ org.eclipse.ease.ui.test ---
23:43:01 [2022-01-29T04:43:01.551Z] [INFO] 
23:43:01 [2022-01-29T04:43:01.551Z] [INFO] --- spotbugs-maven-plugin:4.1.4:spotbugs (spotbugs-integration) @ org.eclipse.ease.ui.test ---
23:43:01 [2022-01-29T04:43:01.551Z] [INFO] Fork Value is false
23:43:01 [2022-01-29T04:43:01.551Z]      [java] JVM args ignored when same JVM is used.
23:43:04 [2022-01-29T04:43:04.888Z] [INFO] Done SpotBugs Analysis....
23:43:04 [2022-01-29T04:43:04.888Z] [INFO] 
23:43:04 [2022-01-29T04:43:04.888Z] [INFO] --- maven-checkstyle-plugin:3.1.1:check (checkstyle-integration) @ org.eclipse.ease.ui.test ---
23:43:04 [2022-01-29T04:43:04.888Z] [INFO] You have 0 Checkstyle violations.
23:43:04 [2022-01-29T04:43:04.888Z] [INFO] 
23:43:04 [2022-01-29T04:43:04.888Z] [INFO] --- maven-install-plugin:2.3.1:install (default-install) @ org.eclipse.ease.ui.test ---
23:43:04 [2022-01-29T04:43:04.889Z] [INFO] Installing /home/jenkins/agent/workspace/ease.verify.core.target.2018-12/tests/org.eclipse.ease.ui.test/target/org.eclipse.ease.ui.test-0.9.0-SNAPSHOT.jar to /home/jenkins/.m2/repository/org/eclipse/ease/org.eclipse.ease.ui.test/0.9.0-SNAPSHOT/org.eclipse.ease.ui.test-0.9.0-SNAPSHOT.jar
23:43:04 [2022-01-29T04:43:04.889Z] [INFO] Installing /home/jenkins/agent/workspace/ease.verify.core.target.2018-12/tests/org.eclipse.ease.ui.test/pom.xml to /home/jenkins/.m2/repository/org/eclipse/ease/org.eclipse.ease.ui.test/0.9.0-SNAPSHOT/org.eclipse.ease.ui.test-0.9.0-SNAPSHOT.pom
23:43:04 [2022-01-29T04:43:04.889Z] [INFO] Installing /home/jenkins/agent/workspace/ease.verify.core.target.2018-12/tests/org.eclipse.ease.ui.test/target/p2content.xml to /home/jenkins/.m2/repository/org/eclipse/ease/org.eclipse.ease.ui.test/0.9.0-SNAPSHOT/org.eclipse.ease.ui.test-0.9.0-SNAPSHOT-p2metadata.xml
23:43:04 [2022-01-29T04:43:04.889Z] [INFO] Installing /home/jenkins/agent/workspace/ease.verify.core.target.2018-12/tests/org.eclipse.ease.ui.test/target/p2artifacts.xml to /home/jenkins/.m2/repository/org/eclipse/ease/org.eclipse.ease.ui.test/0.9.0-SNAPSHOT/org.eclipse.ease.ui.test-0.9.0-SNAPSHOT-p2artifacts.xml
23:43:04 [2022-01-29T04:43:04.889Z] [INFO] 
23:43:04 [2022-01-29T04:43:04.889Z] [INFO] --- tycho-p2-plugin:2.2.0:update-local-index (default-update-local-index) @ org.eclipse.ease.ui.test ---
23:43:04 [2022-01-29T04:43:04.889Z] [INFO] 
23:43:04 [2022-01-29T04:43:04.889Z] [INFO] -----< org.eclipse.ease:org.eclipse.ease.ui.completions.java.test >-----
23:43:04 [2022-01-29T04:43:04.889Z] [INFO] Building org.eclipse.ease.ui.completions.java.test 0.9.0-SNAPSHOT [47/49]
23:43:04 [2022-01-29T04:43:04.889Z] [INFO] ------------------------[ eclipse-test-plugin ]-------------------------
23:43:04 [2022-01-29T04:43:04.889Z] [INFO] 
23:43:04 [2022-01-29T04:43:04.889Z] [INFO] --- maven-clean-plugin:2.5:clean (default-clean) @ org.eclipse.ease.ui.completions.java.test ---
23:43:04 [2022-01-29T04:43:04.889Z] [INFO] 
23:43:04 [2022-01-29T04:43:04.889Z] [INFO] --- tycho-packaging-plugin:2.2.0:build-qualifier (default-build-qualifier) @ org.eclipse.ease.ui.completions.java.test ---
23:43:04 [2022-01-29T04:43:04.889Z] [INFO] The project's OSGi version is 0.9.0.I202110141644
23:43:04 [2022-01-29T04:43:04.889Z] [INFO] 
23:43:04 [2022-01-29T04:43:04.889Z] [INFO] --- tycho-packaging-plugin:2.2.0:validate-id (default-validate-id) @ org.eclipse.ease.ui.completions.java.test ---
23:43:04 [2022-01-29T04:43:04.889Z] [INFO] 
23:43:04 [2022-01-29T04:43:04.889Z] [INFO] --- tycho-packaging-plugin:2.2.0:validate-version (default-validate-version) @ org.eclipse.ease.ui.completions.java.test ---
23:43:04 [2022-01-29T04:43:04.889Z] [INFO] 
23:43:04 [2022-01-29T04:43:04.889Z] [INFO] --- maven-resources-plugin:2.4.3:resources (default-resources) @ org.eclipse.ease.ui.completions.java.test ---
23:43:04 [2022-01-29T04:43:04.889Z] [INFO] Using 'UTF-8' encoding to copy filtered resources.
23:43:04 [2022-01-29T04:43:04.889Z] [INFO] skip non existing resourceDirectory /home/jenkins/agent/workspace/ease.verify.core.target.2018-12/tests/org.eclipse.ease.ui.completions.java.test/src/main/resources
23:43:04 [2022-01-29T04:43:04.889Z] [INFO] 
23:43:04 [2022-01-29T04:43:04.889Z] [INFO] --- tycho-compiler-plugin:2.2.0:compile (default-compile) @ org.eclipse.ease.ui.completions.java.test ---
23:43:04 [2022-01-29T04:43:04.889Z] [INFO] Compiling 4 source files to /home/jenkins/agent/workspace/ease.verify.core.target.2018-12/tests/org.eclipse.ease.ui.completions.java.test/target/classes
23:43:04 [2022-01-29T04:43:04.889Z] [INFO] 
23:43:04 [2022-01-29T04:43:04.890Z] [INFO] --- maven-resources-plugin:2.4.3:testResources (default-testResources) @ org.eclipse.ease.ui.completions.java.test ---
23:43:04 [2022-01-29T04:43:04.890Z] [INFO] Using 'UTF-8' encoding to copy filtered resources.
23:43:04 [2022-01-29T04:43:04.890Z] [INFO] skip non existing resourceDirectory /home/jenkins/agent/workspace/ease.verify.core.target.2018-12/tests/org.eclipse.ease.ui.completions.java.test/src/test/resources
23:43:04 [2022-01-29T04:43:04.890Z] [INFO] 
23:43:04 [2022-01-29T04:43:04.890Z] [INFO] --- target-platform-configuration:2.2.0:target-platform (default-target-platform) @ org.eclipse.ease.ui.completions.java.test ---
23:43:04 [2022-01-29T04:43:04.890Z] [INFO] 
23:43:04 [2022-01-29T04:43:04.890Z] [INFO] --- tycho-packaging-plugin:2.2.0:package-plugin (default-package-plugin) @ org.eclipse.ease.ui.completions.java.test ---
23:43:04 [2022-01-29T04:43:04.890Z] [INFO] Building jar: /home/jenkins/agent/workspace/ease.verify.core.target.2018-12/tests/org.eclipse.ease.ui.completions.java.test/target/org.eclipse.ease.ui.completions.java.test-0.9.0-SNAPSHOT.jar
23:43:04 [2022-01-29T04:43:04.890Z] [INFO] 
23:43:04 [2022-01-29T04:43:04.890Z] [INFO] --- tycho-p2-plugin:2.2.0:p2-metadata-default (default-p2-metadata-default) @ org.eclipse.ease.ui.completions.java.test ---
23:43:04 [2022-01-29T04:43:04.890Z] [INFO] 
23:43:04 [2022-01-29T04:43:04.890Z] [INFO] --- jacoco-maven-plugin:0.8.6:prepare-agent (jacoco-initialize) @ org.eclipse.ease.ui.completions.java.test ---
23:43:04 [2022-01-29T04:43:04.890Z] [INFO] tycho.testArgLine set to -javaagent:/home/jenkins/.m2/repository/org/jacoco/org.jacoco.agent/0.8.6/org.jacoco.agent-0.8.6-runtime.jar=destfile=/home/jenkins/agent/workspace/ease.verify.core.target.2018-12/tests/org.eclipse.ease.ui.completions.java.test/target/jacoco.exec,output=file
23:43:04 [2022-01-29T04:43:04.890Z] [INFO] 
23:43:04 [2022-01-29T04:43:04.890Z] [INFO] --- tycho-surefire-plugin:2.2.0:test (default-test) @ org.eclipse.ease.ui.completions.java.test ---
23:43:04 [2022-01-29T04:43:04.890Z] [INFO] Executing Test Runtime with timeout 0, logs (if any) will be placed at: /home/jenkins/agent/workspace/ease.verify.core.target.2018-12/tests/org.eclipse.ease.ui.completions.java.test/target/work/data/.metadata/.log
23:43:04 [2022-01-29T04:43:04.890Z] [INFO] Command line:
23:43:04 [2022-01-29T04:43:04.890Z] 	[/opt/tools/java/openjdk/jdk-15/15.0.2+7/bin/java, -Dosgi.noShutdown=false, -Dosgi.os=linux, -Dosgi.ws=gtk, -Dosgi.arch=x86_64, -javaagent:/home/jenkins/.m2/repository/org/jacoco/org.jacoco.agent/0.8.6/org.jacoco.agent-0.8.6-runtime.jar=destfile=/home/jenkins/agent/workspace/ease.verify.core.target.2018-12/tests/org.eclipse.ease.ui.completions.java.test/target/jacoco.exec,output=file, -Dosgi.clean=true, -jar, /home/jenkins/.m2/repository/p2/osgi/bundle/org.eclipse.equinox.launcher/1.6.300.v20210813-1054/org.eclipse.equinox.launcher-1.6.300.v20210813-1054.jar, -data, /home/jenkins/agent/workspace/ease.verify.core.target.2018-12/tests/org.eclipse.ease.ui.completions.java.test/target/work/data, -install, /home/jenkins/agent/workspace/ease.verify.core.target.2018-12/tests/org.eclipse.ease.ui.completions.java.test/target/work, -configuration, /home/jenkins/agent/workspace/ease.verify.core.target.2018-12/tests/org.eclipse.ease.ui.completions.java.test/target/work/configuration, -application, org.eclipse.tycho.surefire.osgibooter.headlesstest, -testproperties, /home/jenkins/agent/workspace/ease.verify.core.target.2018-12/tests/org.eclipse.ease.ui.completions.java.test/target/surefire.properties]
23:43:04 [2022-01-29T04:43:04.890Z] Picked up JAVA_TOOL_OPTIONS: -Dmaven.ext.class.path="/home/jenkins/agent/workspace/ease.verify.core.target.2018-12@tmp/withMaven5e71502e/pipeline-maven-spy.jar" -Dorg.jenkinsci.plugins.pipeline.maven.reportsFolder="/home/jenkins/agent/workspace/ease.verify.core.target.2018-12@tmp/withMaven5e71502e" 
23:43:08 [2022-01-29T04:43:08.208Z] Running org.eclipse.ease.ui.completions.java.provider.JavaClassCompletionProviderTest
23:43:09 [2022-01-29T04:43:09.139Z] Tests run: 16, Failures: 0, Errors: 0, Skipped: 0, Time elapsed: 1.064 s - in org.eclipse.ease.ui.completions.java.provider.JavaClassCompletionProviderTest
23:43:09 [2022-01-29T04:43:09.139Z] prepareProposals_instance_contains_class_for_package_context_with_filter  Time elapsed: 0.679 s
23:43:09 [2022-01-29T04:43:09.139Z] prepareProposals_instance_contains_inner_class_for_class_context  Time elapsed: 0.006 s
23:43:09 [2022-01-29T04:43:09.139Z] prepareProposals_instance_contains_class_for_package_context  Time elapsed: 0.003 s
23:43:09 [2022-01-29T04:43:09.139Z] prepareProposals_instance_contains_class_for_partial_context  Time elapsed: 0.002 s
23:43:09 [2022-01-29T04:43:09.139Z] prepareProposals_instance_contains_inner_class_for_class_context_with_filter  Time elapsed: 0.001 s
23:43:09 [2022-01-29T04:43:09.139Z] prepareProposals_instance_contains_class_for_global_context  Time elapsed: 0.006 s
23:43:09 [2022-01-29T04:43:09.139Z] prepareProposals_does_not_contain_inner_class_for_a_given_inner_class_context  Time elapsed: 0.001 s
23:43:09 [2022-01-29T04:43:09.139Z] isActive_equals_false{String}[1]  Time elapsed: 0.011 s
23:43:09 [2022-01-29T04:43:09.139Z] isActive_equals_false{String}[2]  Time elapsed: 0.001 s
23:43:09 [2022-01-29T04:43:09.139Z] isActive_equals_true{String}[1]  Time elapsed: 0 s
23:43:09 [2022-01-29T04:43:09.139Z] isActive_equals_true{String}[2]  Time elapsed: 0 s
23:43:09 [2022-01-29T04:43:09.139Z] isActive_equals_true{String}[3]  Time elapsed: 0 s
23:43:09 [2022-01-29T04:43:09.139Z] isActive_equals_true{String}[4]  Time elapsed: 0 s
23:43:09 [2022-01-29T04:43:09.139Z] isActive_equals_true{String}[5]  Time elapsed: 0 s
23:43:09 [2022-01-29T04:43:09.139Z] isActive_equals_true{String}[6]  Time elapsed: 0 s
23:43:09 [2022-01-29T04:43:09.139Z] prepareProposals_is_empty_for_exact_class_context  Time elapsed: 0 s
23:43:09 [2022-01-29T04:43:09.139Z] Running org.eclipse.ease.ui.completions.java.provider.JavaMethodCompletionProviderTest
23:43:09 [2022-01-29T04:43:09.396Z] Tests run: 23, Failures: 0, Errors: 0, Skipped: 0, Time elapsed: 0.044 s - in org.eclipse.ease.ui.completions.java.provider.JavaMethodCompletionProviderTest
23:43:09 [2022-01-29T04:43:09.396Z] prepareProposals_class_does_not_contain_isntance_methods  Time elapsed: 0.016 s
23:43:09 [2022-01-29T04:43:09.396Z] prepareProposals_instance_contains_method_with_filter  Time elapsed: 0.001 s
23:43:09 [2022-01-29T04:43:09.396Z] prepareProposals_method_contains_instance_methods  Time elapsed: 0.001 s
23:43:09 [2022-01-29T04:43:09.396Z] prepareProposals_instance_contains_instance_methods  Time elapsed: 0.001 s
23:43:09 [2022-01-29T04:43:09.396Z] prepareProposals_class_contains_static_methods  Time elapsed: 0.001 s
23:43:09 [2022-01-29T04:43:09.396Z] proposal_replacement_string_contains_leading_dot  Time elapsed: 0.003 s
23:43:09 [2022-01-29T04:43:09.396Z] prepareProposals_instance_does_not_contain_static_methods  Time elapsed: 0.004 s
23:43:09 [2022-01-29T04:43:09.396Z] prepareProposals_class_contains_static_fields  Time elapsed: 0.001 s
23:43:09 [2022-01-29T04:43:09.396Z] prepareProposals_instance_does_not_contain_static_fields  Time elapsed: 0.001 s
23:43:09 [2022-01-29T04:43:09.396Z] prepareProposals_does_not_contain_methods_of_base_class_for_method_context  Time elapsed: 0.001 s
23:43:09 [2022-01-29T04:43:09.396Z] isActive_equals_false{String}[1]  Time elapsed: 0.001 s
23:43:09 [2022-01-29T04:43:09.396Z] isActive_equals_false{String}[2]  Time elapsed: 0.001 s
23:43:09 [2022-01-29T04:43:09.396Z] isActive_equals_false{String}[3]  Time elapsed: 0.001 s
23:43:09 [2022-01-29T04:43:09.396Z] isActive_equals_true{String}[1]  Time elapsed: 0 s
23:43:09 [2022-01-29T04:43:09.396Z] isActive_equals_true{String}[2]  Time elapsed: 0 s
23:43:09 [2022-01-29T04:43:09.396Z] isActive_equals_true{String}[3]  Time elapsed: 0 s
23:43:09 [2022-01-29T04:43:09.396Z] isActive_equals_true{String}[4]  Time elapsed: 0.001 s
23:43:09 [2022-01-29T04:43:09.396Z] isActive_equals_true{String}[5]  Time elapsed: 0 s
23:43:09 [2022-01-29T04:43:09.396Z] isActive_equals_true{String}[6]  Time elapsed: 0 s
23:43:09 [2022-01-29T04:43:09.396Z] isActive_equals_true{String}[7]  Time elapsed: 0.001 s
23:43:09 [2022-01-29T04:43:09.396Z] isActive_equals_true{String}[8]  Time elapsed: 0.001 s
23:43:09 [2022-01-29T04:43:09.396Z] isActive_equals_true{String}[9]  Time elapsed: 0.001 s
23:43:09 [2022-01-29T04:43:09.396Z] isActive_equals_true{String}[10]  Time elapsed: 0 s
23:43:09 [2022-01-29T04:43:09.396Z] Running org.eclipse.ease.ui.completions.java.provider.JavaPackagesCompletionProviderTest
23:43:09 [2022-01-29T04:43:09.396Z] Tests run: 28, Failures: 0, Errors: 0, Skipped: 0, Time elapsed: 0.062 s - in org.eclipse.ease.ui.completions.java.provider.JavaPackagesCompletionProviderTest
23:43:09 [2022-01-29T04:43:09.396Z] proposal_java_preserves_suffix  Time elapsed: 0.001 s
23:43:09 [2022-01-29T04:43:09.396Z] proposal_java_appends_to_prefix  Time elapsed: 0.001 s
23:43:09 [2022-01-29T04:43:09.396Z] prepareProposals_instance_contains_root_package_after_new_keyword  Time elapsed: 0.001 s
23:43:09 [2022-01-29T04:43:09.396Z] proposal_java_replaces_filter  Time elapsed: 0 s
23:43:09 [2022-01-29T04:43:09.396Z] prepareProposals_instance_contains_sub_package  Time elapsed: 0.001 s
23:43:09 [2022-01-29T04:43:09.397Z] prepareProposals_instance_contains_3rd_level  Time elapsed: 0 s
23:43:09 [2022-01-29T04:43:09.397Z] isActive_equals_false{String}[1]  Time elapsed: 0.013 s
23:43:09 [2022-01-29T04:43:09.397Z] isActive_equals_false{String}[2]  Time elapsed: 0.001 s
23:43:09 [2022-01-29T04:43:09.397Z] isActive_equals_false{String}[3]  Time elapsed: 0.001 s
23:43:09 [2022-01-29T04:43:09.397Z] isActive_equals_false{String}[4]  Time elapsed: 0.001 s
23:43:09 [2022-01-29T04:43:09.397Z] prepareProposals_contains_root_package{String}[1]  Time elapsed: 0.001 s
23:43:09 [2022-01-29T04:43:09.397Z] prepareProposals_contains_root_package{String}[2]  Time elapsed: 0.001 s
23:43:09 [2022-01-29T04:43:09.397Z] prepareProposals_contains_root_package{String}[3]  Time elapsed: 0.001 s
23:43:09 [2022-01-29T04:43:09.397Z] isActive_equals_true{String}[1]  Time elapsed: 0 s
23:43:09 [2022-01-29T04:43:09.397Z] isActive_equals_true{String}[2]  Time elapsed: 0 s
23:43:09 [2022-01-29T04:43:09.397Z] isActive_equals_true{String}[3]  Time elapsed: 0 s
23:43:09 [2022-01-29T04:43:09.397Z] isActive_equals_true{String}[4]  Time elapsed: 0 s
23:43:09 [2022-01-29T04:43:09.397Z] isActive_equals_true{String}[5]  Time elapsed: 0 s
23:43:09 [2022-01-29T04:43:09.397Z] isActive_equals_true{String}[6]  Time elapsed: 0 s
23:43:09 [2022-01-29T04:43:09.397Z] isActive_equals_true{String}[7]  Time elapsed: 0.001 s
23:43:09 [2022-01-29T04:43:09.397Z] isActive_equals_true{String}[8]  Time elapsed: 0.001 s
23:43:09 [2022-01-29T04:43:09.397Z] isActive_equals_true{String}[9]  Time elapsed: 0.001 s
23:43:09 [2022-01-29T04:43:09.397Z] isActive_equals_true{String}[10]  Time elapsed: 0.001 s
23:43:09 [2022-01-29T04:43:09.397Z] isActive_equals_true{String}[11]  Time elapsed: 0.001 s
23:43:09 [2022-01-29T04:43:09.397Z] isActive_equals_true{String}[12]  Time elapsed: 0 s
23:43:09 [2022-01-29T04:43:09.397Z] isActive_equals_true{String}[13]  Time elapsed: 0 s
23:43:09 [2022-01-29T04:43:09.397Z] isActive_equals_true{String}[14]  Time elapsed: 0 s
23:43:09 [2022-01-29T04:43:09.397Z] prepareProposals_is_empty_for_exact_class_context  Time elapsed: 0 s
23:43:09 [2022-01-29T04:43:09.397Z] Running org.eclipse.ease.ui.completions.java.provider.JavaResourcesTest
23:43:09 [2022-01-29T04:43:09.397Z] Tests run: 5, Failures: 0, Errors: 0, Skipped: 0, Time elapsed: 0.002 s - in org.eclipse.ease.ui.completions.java.provider.JavaResourcesTest
23:43:09 [2022-01-29T04:43:09.397Z] getClasses_with_filter_is_populated  Time elapsed: 0 s
23:43:09 [2022-01-29T04:43:09.397Z] getClasses_is_populated  Time elapsed: 0.001 s
23:43:09 [2022-01-29T04:43:09.397Z] singleton_exists  Time elapsed: 0 s
23:43:09 [2022-01-29T04:43:09.397Z] getPackages_is_populated  Time elapsed: 0 s
23:43:09 [2022-01-29T04:43:09.397Z] getClasses_with_filter_contains_File_class  Time elapsed: 0.001 s
23:43:09 [2022-01-29T04:43:09.397Z] 
23:43:09 [2022-01-29T04:43:09.397Z] Results:
23:43:09 [2022-01-29T04:43:09.397Z] 
23:43:09 [2022-01-29T04:43:09.397Z] Tests run: 72, Failures: 0, Errors: 0, Skipped: 0
23:43:09 [2022-01-29T04:43:09.397Z] 
23:43:09 [2022-01-29T04:43:09.962Z] [INFO] All tests passed!
23:43:09 [2022-01-29T04:43:09.962Z] [INFO] 
23:43:09 [2022-01-29T04:43:09.962Z] [INFO] --- maven-pmd-plugin:3.14.0:pmd (pmd-integration) @ org.eclipse.ease.ui.completions.java.test ---
23:43:09 [2022-01-29T04:43:09.962Z] [WARNING] Unable to exclude rules [JUnit5TestShouldBePackagePrivate] from ruleset reference category/java/bestpractices.xml; perhaps the rule name is misspelled or the rule doesn't exist anymore?
23:43:10 [2022-01-29T04:43:10.218Z] [WARNING] Unable to exclude rules [JUnit5TestShouldBePackagePrivate] from ruleset reference category/java/bestpractices.xml; perhaps the rule name is misspelled or the rule doesn't exist anymore?
23:43:10 [2022-01-29T04:43:10.476Z] [INFO] 
23:43:10 [2022-01-29T04:43:10.476Z] [INFO] --- maven-pmd-plugin:3.14.0:cpd (pmd-integration) @ org.eclipse.ease.ui.completions.java.test ---
23:43:10 [2022-01-29T04:43:10.476Z] [INFO] 
23:43:10 [2022-01-29T04:43:10.476Z] [INFO] --- spotbugs-maven-plugin:4.1.4:spotbugs (spotbugs-integration) @ org.eclipse.ease.ui.completions.java.test ---
23:43:10 [2022-01-29T04:43:10.476Z] [INFO] Fork Value is false
23:43:10 [2022-01-29T04:43:10.476Z]      [java] JVM args ignored when same JVM is used.
23:43:13 [2022-01-29T04:43:13.117Z] [INFO] Done SpotBugs Analysis....
23:43:13 [2022-01-29T04:43:13.117Z] [INFO] 
23:43:13 [2022-01-29T04:43:13.117Z] [INFO] --- maven-checkstyle-plugin:3.1.1:check (checkstyle-integration) @ org.eclipse.ease.ui.completions.java.test ---
23:43:13 [2022-01-29T04:43:13.117Z] [INFO] You have 0 Checkstyle violations.
23:43:13 [2022-01-29T04:43:13.117Z] [INFO] 
23:43:13 [2022-01-29T04:43:13.117Z] [INFO] --- maven-install-plugin:2.3.1:install (default-install) @ org.eclipse.ease.ui.completions.java.test ---
23:43:13 [2022-01-29T04:43:13.117Z] [INFO] Installing /home/jenkins/agent/workspace/ease.verify.core.target.2018-12/tests/org.eclipse.ease.ui.completions.java.test/target/org.eclipse.ease.ui.completions.java.test-0.9.0-SNAPSHOT.jar to /home/jenkins/.m2/repository/org/eclipse/ease/org.eclipse.ease.ui.completions.java.test/0.9.0-SNAPSHOT/org.eclipse.ease.ui.completions.java.test-0.9.0-SNAPSHOT.jar
23:43:13 [2022-01-29T04:43:13.117Z] [INFO] Installing /home/jenkins/agent/workspace/ease.verify.core.target.2018-12/tests/org.eclipse.ease.ui.completions.java.test/pom.xml to /home/jenkins/.m2/repository/org/eclipse/ease/org.eclipse.ease.ui.completions.java.test/0.9.0-SNAPSHOT/org.eclipse.ease.ui.completions.java.test-0.9.0-SNAPSHOT.pom
23:43:13 [2022-01-29T04:43:13.117Z] [INFO] Installing /home/jenkins/agent/workspace/ease.verify.core.target.2018-12/tests/org.eclipse.ease.ui.completions.java.test/target/p2content.xml to /home/jenkins/.m2/repository/org/eclipse/ease/org.eclipse.ease.ui.completions.java.test/0.9.0-SNAPSHOT/org.eclipse.ease.ui.completions.java.test-0.9.0-SNAPSHOT-p2metadata.xml
23:43:13 [2022-01-29T04:43:13.117Z] [INFO] Installing /home/jenkins/agent/workspace/ease.verify.core.target.2018-12/tests/org.eclipse.ease.ui.completions.java.test/target/p2artifacts.xml to /home/jenkins/.m2/repository/org/eclipse/ease/org.eclipse.ease.ui.completions.java.test/0.9.0-SNAPSHOT/org.eclipse.ease.ui.completions.java.test-0.9.0-SNAPSHOT-p2artifacts.xml
23:43:13 [2022-01-29T04:43:13.117Z] [INFO] 
23:43:13 [2022-01-29T04:43:13.117Z] [INFO] --- tycho-p2-plugin:2.2.0:update-local-index (default-update-local-index) @ org.eclipse.ease.ui.completions.java.test ---
23:43:13 [2022-01-29T04:43:13.117Z] [INFO] 
23:43:13 [2022-01-29T04:43:13.117Z] [INFO] ---------< org.eclipse.ease:org.eclipse.ease.releng.coverage >----------
23:43:13 [2022-01-29T04:43:13.117Z] [INFO] Building org.eclipse.ease.releng.coverage 0.9.0-SNAPSHOT         [48/49]
23:43:13 [2022-01-29T04:43:13.117Z] [INFO] --------------------------------[ pom ]---------------------------------
23:43:13 [2022-01-29T04:43:13.117Z] [INFO] 
23:43:13 [2022-01-29T04:43:13.117Z] [INFO] --- maven-clean-plugin:2.5:clean (default-clean) @ org.eclipse.ease.releng.coverage ---
23:43:13 [2022-01-29T04:43:13.117Z] [INFO] 
23:43:13 [2022-01-29T04:43:13.117Z] [INFO] --- jacoco-maven-plugin:0.8.6:report-aggregate (default) @ org.eclipse.ease.releng.coverage ---
23:43:13 [2022-01-29T04:43:13.396Z] [INFO] Loading execution data file /home/jenkins/agent/workspace/ease.verify.core.target.2018-12/tests/org.eclipse.ease.test/target/jacoco.exec
23:43:13 [2022-01-29T04:43:13.396Z] [INFO] Loading execution data file /home/jenkins/agent/workspace/ease.verify.core.target.2018-12/tests/org.eclipse.ease.lang.javascript.rhino.test/target/jacoco.exec
23:43:13 [2022-01-29T04:43:13.396Z] [INFO] Loading execution data file /home/jenkins/agent/workspace/ease.verify.core.target.2018-12/tests/org.eclipse.ease.lang.javascript.test/target/jacoco.exec
23:43:13 [2022-01-29T04:43:13.396Z] [INFO] Loading execution data file /home/jenkins/agent/workspace/ease.verify.core.target.2018-12/tests/org.eclipse.ease.lang.python.test/target/jacoco.exec
23:43:13 [2022-01-29T04:43:13.396Z] [INFO] Loading execution data file /home/jenkins/agent/workspace/ease.verify.core.target.2018-12/tests/org.eclipse.ease.lang.python.jython.test/target/jacoco.exec
23:43:13 [2022-01-29T04:43:13.396Z] [INFO] Loading execution data file /home/jenkins/agent/workspace/ease.verify.core.target.2018-12/tests/org.eclipse.ease.lang.scriptarchive.test/target/jacoco.exec
23:43:13 [2022-01-29T04:43:13.396Z] [INFO] Loading execution data file /home/jenkins/agent/workspace/ease.verify.core.target.2018-12/tests/org.eclipse.ease.lang.unittest.test/target/jacoco.exec
23:43:13 [2022-01-29T04:43:13.396Z] [INFO] Loading execution data file /home/jenkins/agent/workspace/ease.verify.core.target.2018-12/tests/org.eclipse.ease.ui.scripts.test/target/jacoco.exec
23:43:13 [2022-01-29T04:43:13.396Z] [INFO] Loading execution data file /home/jenkins/agent/workspace/ease.verify.core.target.2018-12/tests/org.eclipse.ease.ui.test/target/jacoco.exec
23:43:13 [2022-01-29T04:43:13.396Z] [INFO] Loading execution data file /home/jenkins/agent/workspace/ease.verify.core.target.2018-12/tests/org.eclipse.ease.ui.completions.java.test/target/jacoco.exec
23:43:13 [2022-01-29T04:43:13.669Z] [INFO] Analyzed bundle 'org.eclipse.ease' with 105 classes
23:43:13 [2022-01-29T04:43:13.669Z] [INFO] Analyzed bundle 'org.eclipse.ease.classloader' with 1 classes
23:43:13 [2022-01-29T04:43:13.925Z] [INFO] Analyzed bundle 'org.eclipse.ease.ui' with 212 classes
23:43:13 [2022-01-29T04:43:13.925Z] [INFO] Analyzed bundle 'org.eclipse.ease.ui.completions.java' with 14 classes
23:43:14 [2022-01-29T04:43:14.190Z] [INFO] Analyzed bundle 'org.eclipse.ease.ui.scripts' with 157 classes
23:43:14 [2022-01-29T04:43:14.190Z] [INFO] Analyzed bundle 'org.eclipse.ease.help' with 0 classes
23:43:14 [2022-01-29T04:43:14.190Z] [INFO] Analyzed bundle 'org.eclipse.ease.lang.javascript' with 5 classes
23:43:14 [2022-01-29T04:43:14.190Z] [INFO] Analyzed bundle 'org.eclipse.ease.lang.javascript.ui' with 4 classes
23:43:14 [2022-01-29T04:43:14.190Z] [INFO] Analyzed bundle 'org.eclipse.ease.lang.javascript.rhino' with 21 classes
23:43:14 [2022-01-29T04:43:14.190Z] [INFO] Analyzed bundle 'org.eclipse.ease.lang.javascript.nashorn' with 2 classes
23:43:14 [2022-01-29T04:43:14.190Z] [INFO] Analyzed bundle 'org.eclipse.ease.lang.python' with 23 classes
23:43:14 [2022-01-29T04:43:14.190Z] [INFO] Analyzed bundle 'org.eclipse.ease.lang.python.jython' with 13 classes
23:43:14 [2022-01-29T04:43:14.447Z] [INFO] Analyzed bundle 'org.eclipse.ease.lang.python.py4j' with 11 classes
23:43:14 [2022-01-29T04:43:14.447Z] [INFO] Analyzed bundle 'org.eclipse.ease.lang.jvm.compiled' with 2 classes
23:43:14 [2022-01-29T04:43:14.447Z] [INFO] Analyzed bundle 'org.eclipse.ease.lang.groovy' with 3 classes
23:43:14 [2022-01-29T04:43:14.447Z] [INFO] Analyzed bundle 'org.eclipse.ease.lang.groovy.interpreter' with 3 classes
23:43:14 [2022-01-29T04:43:14.447Z] [INFO] Analyzed bundle 'org.eclipse.ease.lang.ruby' with 3 classes
23:43:14 [2022-01-29T04:43:14.447Z] [INFO] Analyzed bundle 'org.eclipse.ease.lang.ruby.jruby' with 2 classes
23:43:14 [2022-01-29T04:43:14.447Z] [INFO] Analyzed bundle 'org.eclipse.ease.lang.scriptarchive' with 3 classes
23:43:14 [2022-01-29T04:43:14.447Z] [INFO] Analyzed bundle 'org.eclipse.ease.lang.scriptarchive.ui' with 8 classes
23:43:14 [2022-01-29T04:43:14.447Z] [INFO] Analyzed bundle 'org.eclipse.ease.lang.unittest' with 51 classes
23:43:14 [2022-01-29T04:43:14.448Z] [INFO] Analyzed bundle 'org.eclipse.ease.lang.unittest.ui' with 79 classes
23:43:14 [2022-01-29T04:43:14.704Z] [INFO] 
23:43:14 [2022-01-29T04:43:14.704Z] [INFO] --- maven-install-plugin:2.4:install (default-install) @ org.eclipse.ease.releng.coverage ---
23:43:14 [2022-01-29T04:43:14.704Z] [INFO] Installing /home/jenkins/agent/workspace/ease.verify.core.target.2018-12/releng/org.eclipse.ease.releng.coverage/pom.xml to /home/jenkins/.m2/repository/org/eclipse/ease/org.eclipse.ease.releng.coverage/0.9.0-SNAPSHOT/org.eclipse.ease.releng.coverage-0.9.0-SNAPSHOT.pom
23:43:14 [2022-01-29T04:43:14.704Z] [INFO] 
23:43:14 [2022-01-29T04:43:14.704Z] [INFO] ---------------------< org.eclipse.ease:ease.core >---------------------
23:43:14 [2022-01-29T04:43:14.704Z] [INFO] Building EASE (Incubation) 0.4.0-SNAPSHOT                        [49/49]
23:43:14 [2022-01-29T04:43:14.704Z] [INFO] --------------------------------[ pom ]---------------------------------
23:43:14 [2022-01-29T04:43:14.704Z] [INFO] 
23:43:14 [2022-01-29T04:43:14.704Z] [INFO] --- maven-clean-plugin:2.5:clean (default-clean) @ ease.core ---
23:43:14 [2022-01-29T04:43:14.961Z] [INFO] 
23:43:14 [2022-01-29T04:43:14.961Z] [INFO] --- maven-install-plugin:2.4:install (default-install) @ ease.core ---
23:43:14 [2022-01-29T04:43:14.961Z] [INFO] Installing /home/jenkins/agent/workspace/ease.verify.core.target.2018-12/pom.xml to /home/jenkins/.m2/repository/org/eclipse/ease/ease.core/0.4.0-SNAPSHOT/ease.core-0.4.0-SNAPSHOT.pom
23:43:14 [2022-01-29T04:43:14.961Z] [INFO] ------------------------------------------------------------------------
23:43:14 [2022-01-29T04:43:14.961Z] [INFO] Reactor Summary:
23:43:14 [2022-01-29T04:43:14.961Z] [INFO] 
23:43:14 [2022-01-29T04:43:14.961Z] [INFO] org.eclipse.ease.classloader 0.9.0-SNAPSHOT ........ SUCCESS [ 16.578 s]
23:43:14 [2022-01-29T04:43:14.961Z] [INFO] org.eclipse.ease 0.9.0-SNAPSHOT .................... SUCCESS [ 15.574 s]
23:43:14 [2022-01-29T04:43:14.961Z] [INFO] org.eclipse.ease.ui 0.9.0-SNAPSHOT ................. SUCCESS [ 19.004 s]
23:43:14 [2022-01-29T04:43:14.961Z] [INFO] org.eclipse.ease.ui.completions.java 0.9.0-SNAPSHOT  SUCCESS [  6.498 s]
23:43:14 [2022-01-29T04:43:14.962Z] [INFO] org.eclipse.ease.ui.scripts 0.9.0-SNAPSHOT ......... SUCCESS [ 14.092 s]
23:43:14 [2022-01-29T04:43:14.962Z] [INFO] org.eclipse.ease.releng 0.9.0-SNAPSHOT ............. SUCCESS [  0.114 s]
23:43:14 [2022-01-29T04:43:14.962Z] [INFO] org.eclipse.ease.lang.javascript 0.9.0-SNAPSHOT .... SUCCESS [  4.929 s]
23:43:14 [2022-01-29T04:43:14.962Z] [INFO] org.eclipse.ease.lang.scriptarchive 0.9.0-SNAPSHOT . SUCCESS [  4.777 s]
23:43:14 [2022-01-29T04:43:14.962Z] [INFO] org.eclipse.ease.lang.python 0.9.0-SNAPSHOT ........ SUCCESS [  6.124 s]
23:43:14 [2022-01-29T04:43:14.962Z] [INFO] org.eclipse.ease.lang.python.py4j 0.9.0-SNAPSHOT ... SUCCESS [  5.850 s]
23:43:14 [2022-01-29T04:43:14.962Z] [INFO] org.eclipse.ease.lang.groovy 0.9.0-SNAPSHOT ........ SUCCESS [  4.432 s]
23:43:14 [2022-01-29T04:43:14.962Z] [INFO] org.eclipse.ease.lang.groovy.interpreter 0.9.0-SNAPSHOT SUCCESS [  4.527 s]
23:43:14 [2022-01-29T04:43:14.962Z] [INFO] org.eclipse.ease.lang.unittest 0.9.0-SNAPSHOT ...... SUCCESS [  9.532 s]
23:43:14 [2022-01-29T04:43:14.962Z] [INFO] org.eclipse.ease.lang.unittest.ui 0.9.0-SNAPSHOT ... SUCCESS [ 10.509 s]
23:43:14 [2022-01-29T04:43:14.962Z] [INFO] org.eclipse.ease.lang.ruby 0.9.0-SNAPSHOT .......... SUCCESS [  4.311 s]
23:43:14 [2022-01-29T04:43:14.962Z] [INFO] org.eclipse.ease.lang.ruby.jruby 0.9.0-SNAPSHOT .... SUCCESS [  4.423 s]
23:43:14 [2022-01-29T04:43:14.962Z] [INFO] org.eclipse.ease.lang.javascript.nashorn 0.9.0-SNAPSHOT SUCCESS [  4.667 s]
23:43:14 [2022-01-29T04:43:14.962Z] [INFO] org.eclipse.ease.lang.javascript.rhino 0.9.0-SNAPSHOT SUCCESS [  6.661 s]
23:43:14 [2022-01-29T04:43:14.962Z] [INFO] org.eclipse.ease.lang.python.jython 0.9.0-SNAPSHOT . SUCCESS [  6.777 s]
23:43:14 [2022-01-29T04:43:14.962Z] [INFO] org.eclipse.ease.lang.javascript.ui 0.9.0-SNAPSHOT . SUCCESS [  4.460 s]
23:43:14 [2022-01-29T04:43:14.962Z] [INFO] org.eclipse.ease.lang.jvm.compiled 0.9.0-SNAPSHOT .. SUCCESS [  4.597 s]
23:43:14 [2022-01-29T04:43:14.962Z] [INFO] org.eclipse.ease.lang.scriptarchive.ui 0.9.0-SNAPSHOT SUCCESS [  5.531 s]
23:43:14 [2022-01-29T04:43:14.962Z] [INFO] org.eclipse.ease.help 0.9.0-SNAPSHOT ............... SUCCESS [  7.358 s]
23:43:14 [2022-01-29T04:43:14.962Z] [INFO] org.eclipse.ease.feature 0.9.0-SNAPSHOT ............ SUCCESS [  0.119 s]
23:43:14 [2022-01-29T04:43:14.962Z] [INFO] org.eclipse.ease.ui.feature 0.9.0-SNAPSHOT ......... SUCCESS [  0.106 s]
23:43:14 [2022-01-29T04:43:14.962Z] [INFO] org.eclipse.ease.lang.javascript.feature 0.9.0-SNAPSHOT SUCCESS [  0.112 s]
23:43:14 [2022-01-29T04:43:14.962Z] [INFO] org.eclipse.ease.lang.python.feature 0.9.0-SNAPSHOT  SUCCESS [  0.074 s]
23:43:14 [2022-01-29T04:43:14.962Z] [INFO] org.eclipse.ease.python.jython.feature 0.9.0-SNAPSHOT SUCCESS [  0.083 s]
23:43:14 [2022-01-29T04:43:14.962Z] [INFO] org.eclipse.ease.lang.python.py4j.feature 0.9.0-SNAPSHOT SUCCESS [  0.043 s]
23:43:14 [2022-01-29T04:43:14.962Z] [INFO] org.eclipse.ease.lang.jvm.feature 0.9.0-SNAPSHOT ... SUCCESS [  0.078 s]
23:43:14 [2022-01-29T04:43:14.962Z] [INFO] org.eclipse.ease.lang.groovy.feature 0.9.0-SNAPSHOT  SUCCESS [  0.101 s]
23:43:14 [2022-01-29T04:43:14.962Z] [INFO] org.eclipse.ease.lang.ruby.feature 0.9.0-SNAPSHOT .. SUCCESS [  0.075 s]
23:43:14 [2022-01-29T04:43:14.962Z] [INFO] org.eclipse.ease.lang.scriptarchive.feature 0.9.0-SNAPSHOT SUCCESS [  0.040 s]
23:43:14 [2022-01-29T04:43:14.962Z] [INFO] org.eclipse.ease.lang.unittest.feature 0.9.0-SNAPSHOT SUCCESS [  0.079 s]
23:43:14 [2022-01-29T04:43:14.962Z] [INFO] org.eclipse.ease.releng.target 0.9.0-SNAPSHOT ...... SUCCESS [  0.003 s]
23:43:14 [2022-01-29T04:43:14.962Z] [INFO] org.eclipse.ease.releng.p2 0.9.0-SNAPSHOT .......... SUCCESS [  4.426 s]
23:43:14 [2022-01-29T04:43:14.962Z] [INFO] org.eclipse.ease.testhelper 0.9.0-SNAPSHOT ......... SUCCESS [  7.088 s]
23:43:14 [2022-01-29T04:43:14.962Z] [INFO] org.eclipse.ease.test 0.9.0-SNAPSHOT ............... SUCCESS [ 26.580 s]
23:43:14 [2022-01-29T04:43:14.962Z] [INFO] org.eclipse.ease.lang.javascript.rhino.test 0.9.0-SNAPSHOT SUCCESS [ 19.809 s]
23:43:14 [2022-01-29T04:43:14.962Z] [INFO] org.eclipse.ease.lang.javascript.test 0.9.0-SNAPSHOT SUCCESS [  6.299 s]
23:43:14 [2022-01-29T04:43:14.962Z] [INFO] org.eclipse.ease.lang.python.test 0.9.0-SNAPSHOT ... SUCCESS [  7.740 s]
23:43:14 [2022-01-29T04:43:14.962Z] [INFO] org.eclipse.ease.lang.python.jython.test 0.9.0-SNAPSHOT SUCCESS [ 21.255 s]
23:43:14 [2022-01-29T04:43:14.962Z] [INFO] org.eclipse.ease.lang.scriptarchive.test 0.9.0-SNAPSHOT SUCCESS [  7.161 s]
23:43:14 [2022-01-29T04:43:14.962Z] [INFO] org.eclipse.ease.lang.unittest.test 0.9.0-SNAPSHOT . SUCCESS [ 12.338 s]
23:43:14 [2022-01-29T04:43:14.962Z] [INFO] org.eclipse.ease.ui.scripts.test 0.9.0-SNAPSHOT .... SUCCESS [  5.709 s]
23:43:14 [2022-01-29T04:43:14.962Z] [INFO] org.eclipse.ease.ui.test 0.9.0-SNAPSHOT ............ SUCCESS [ 10.103 s]
23:43:14 [2022-01-29T04:43:14.963Z] [INFO] org.eclipse.ease.ui.completions.java.test 0.9.0-SNAPSHOT SUCCESS [  8.684 s]
23:43:14 [2022-01-29T04:43:14.963Z] [INFO] org.eclipse.ease.releng.coverage 0.9.0-SNAPSHOT .... SUCCESS [  1.444 s]
23:43:14 [2022-01-29T04:43:14.963Z] [INFO] EASE (Incubation) 0.4.0-SNAPSHOT ................... SUCCESS [  0.246 s]
23:43:14 [2022-01-29T04:43:14.963Z] [INFO] ------------------------------------------------------------------------
23:43:14 [2022-01-29T04:43:14.963Z] [INFO] BUILD SUCCESS
23:43:14 [2022-01-29T04:43:14.963Z] [INFO] ------------------------------------------------------------------------
23:43:14 [2022-01-29T04:43:14.963Z] [INFO] Total time:  06:20 min
23:43:14 [2022-01-29T04:43:14.963Z] [INFO] Finished at: 2022-01-29T04:43:14Z
23:43:14 [2022-01-29T04:43:14.963Z] [INFO] ------------------------------------------------------------------------
23:43:14 [2022-01-29T04:43:14.963Z] [INFO] [jenkins-event-spy] Generated /home/jenkins/agent/workspace/ease.verify.core.target.2018-12@tmp/withMaven5e71502e/maven-spy-20220129-043653-9471220084684660711852.log