Console Output

Skipping 1,043 KB.. Full Log
23:44:18 [2021-10-23T03:44:18.846Z] resolveRelativeInFileSystemOnLinux  Time elapsed: 0 s
23:44:18 [2021-10-23T03:44:18.846Z] isFolder  Time elapsed: 0.001 s
23:44:18 [2021-10-23T03:44:18.846Z] fileSystemToAbsoluteLocationOnWindows  Time elapsed: 0 s
23:44:18 [2021-10-23T03:44:18.846Z] isAbsoluteWorkspacePath  Time elapsed: 0.001 s
23:44:18 [2021-10-23T03:44:18.846Z] isAbsoluteFileSystemPathOnLinux  Time elapsed: 0 s
23:44:18 [2021-10-23T03:44:18.846Z] resolveInvalid  Time elapsed: 0 s
23:44:18 [2021-10-23T03:44:18.846Z] resolveAbsoluteInFileSystemOnWindows  Time elapsed: 0 s
23:44:18 [2021-10-23T03:44:18.846Z] resolveScriptLocationWithSpacesInDomain  Time elapsed: 0 s
23:44:18 [2021-10-23T03:44:18.846Z] resolveRelativefromWorkspaceToFilesystem  Time elapsed: 0 s
23:44:18 [2021-10-23T03:44:18.846Z] resolveRelativeWithoutBaseFile  Time elapsed: 0.001 s
23:44:18 [2021-10-23T03:44:18.846Z] resolveInWorkspace  Time elapsed: 0 s
23:44:18 [2021-10-23T03:44:18.846Z] resolveScriptLocationWithSpecialCharactersInPath  Time elapsed: 0.001 s
23:44:18 [2021-10-23T03:44:18.846Z] filesystemFileToString  Time elapsed: 0 s
23:44:18 [2021-10-23T03:44:18.846Z] createURI  Time elapsed: 0 s
23:44:18 [2021-10-23T03:44:18.846Z] uriToAbsoluteLocation  Time elapsed: 0 s
23:44:18 [2021-10-23T03:44:18.846Z] createFolder  Time elapsed: 0.002 s
23:44:18 [2021-10-23T03:44:18.846Z] workspaceToAbsoluteLocation  Time elapsed: 0.001 s
23:44:18 [2021-10-23T03:44:18.846Z] resolveAbsoluteInFileSystemOnLinux  Time elapsed: 0 s
23:44:18 [2021-10-23T03:44:18.846Z] invalidToString  Time elapsed: 0.001 s
23:44:18 [2021-10-23T03:44:18.846Z] resolveRelativeURIs  Time elapsed: 0 s
23:44:18 [2021-10-23T03:44:18.846Z] resolveRelativeInFileSystem  Time elapsed: 0.001 s
23:44:18 [2021-10-23T03:44:18.846Z] resolveScriptLocationWithSpecialCharactersInDomain  Time elapsed: 0.003 s
23:44:18 [2021-10-23T03:44:18.846Z] isAbsoluteURL  Time elapsed: 0 s
23:44:18 [2021-10-23T03:44:18.846Z] Running org.eclipse.ease.tools.StringToolsTest
23:44:18 [2021-10-23T03:44:18.846Z] Tests run: 8, Failures: 0, Errors: 0, Skipped: 0, Time elapsed: 0.005 s - in org.eclipse.ease.tools.StringToolsTest
23:44:18 [2021-10-23T03:44:18.846Z] parseArgumentsNull  Time elapsed: 0.001 s
23:44:18 [2021-10-23T03:44:18.846Z] parseArgumentsQuotedSingle  Time elapsed: 0 s
23:44:18 [2021-10-23T03:44:18.846Z] parseArgumentsEmpty  Time elapsed: 0 s
23:44:18 [2021-10-23T03:44:18.846Z] parseArgumentsMixedMultiple  Time elapsed: 0 s
23:44:18 [2021-10-23T03:44:18.846Z] parseArgumentsMixedMultipleLines  Time elapsed: 0.001 s
23:44:18 [2021-10-23T03:44:18.846Z] parseArgumentsNonQuotedMultiple  Time elapsed: 0 s
23:44:18 [2021-10-23T03:44:18.846Z] parseArgumentsNonQuotedSingle  Time elapsed: 0 s
23:44:18 [2021-10-23T03:44:18.846Z] parseArgumentsQuotedMultiple  Time elapsed: 0.001 s
23:44:18 [2021-10-23T03:44:18.846Z] Running org.eclipse.ease.ScriptTest
23:44:18 [2021-10-23T03:44:18.846Z] Tests run: 13, Failures: 0, Errors: 0, Skipped: 0, Time elapsed: 0.013 s - in org.eclipse.ease.ScriptTest
23:44:18 [2021-10-23T03:44:18.847Z] codeFromScriptable  Time elapsed: 0.005 s
23:44:18 [2021-10-23T03:44:18.847Z] codeFromFilesystemFile  Time elapsed: 0.002 s
23:44:18 [2021-10-23T03:44:18.847Z] getCodeStream  Time elapsed: 0 s
23:44:18 [2021-10-23T03:44:18.847Z] getFile  Time elapsed: 0 s
23:44:18 [2021-10-23T03:44:18.847Z] codeFromStringBuilder  Time elapsed: 0.001 s
23:44:18 [2021-10-23T03:44:18.847Z] getResult  Time elapsed: 0 s
23:44:18 [2021-10-23T03:44:18.847Z] getException  Time elapsed: 0.001 s
23:44:18 [2021-10-23T03:44:18.847Z] codeFromWorkspaceFile  Time elapsed: 0 s
23:44:18 [2021-10-23T03:44:18.847Z] codeFromInputStream  Time elapsed: 0 s
23:44:18 [2021-10-23T03:44:18.847Z] getTitle  Time elapsed: 0 s
23:44:18 [2021-10-23T03:44:18.847Z] getCommand  Time elapsed: 0 s
23:44:18 [2021-10-23T03:44:18.847Z] codeFromReader  Time elapsed: 0 s
23:44:18 [2021-10-23T03:44:18.847Z] codeFromString  Time elapsed: 0 s
23:44:18 [2021-10-23T03:44:18.847Z] Running org.eclipse.ease.adapters.ScriptableAdapterTest
23:44:18 [2021-10-23T03:44:18.847Z] Tests run: 5, Failures: 0, Errors: 0, Skipped: 0, Time elapsed: 0.008 s - in org.eclipse.ease.adapters.ScriptableAdapterTest
23:44:18 [2021-10-23T03:44:18.847Z] adaptURI  Time elapsed: 0.006 s
23:44:18 [2021-10-23T03:44:18.847Z] adaptURL  Time elapsed: 0.001 s
23:44:18 [2021-10-23T03:44:18.847Z] adaptWorkspaceFile  Time elapsed: 0 s
23:44:18 [2021-10-23T03:44:18.847Z] getAdapterList  Time elapsed: 0.001 s
23:44:18 [2021-10-23T03:44:18.847Z] adaptFilesystemFile  Time elapsed: 0 s
23:44:18 [2021-10-23T03:44:18.847Z] Running org.eclipse.ease.modules.ModuleDocumentationTest
23:44:18 [2021-10-23T03:44:18.847Z] Tests run: 1, Failures: 0, Errors: 0, Skipped: 0, Time elapsed: 0.001 s - in org.eclipse.ease.modules.ModuleDocumentationTest
23:44:18 [2021-10-23T03:44:18.847Z] module_documentation_exists  Time elapsed: 0 s
23:44:18 [2021-10-23T03:44:18.847Z] Running org.eclipse.ease.modules.ModuleDefinitionTest
23:44:18 [2021-10-23T03:44:18.847Z] Tests run: 2, Failures: 0, Errors: 0, Skipped: 0, Time elapsed: 0.009 s - in org.eclipse.ease.modules.ModuleDefinitionTest
23:44:18 [2021-10-23T03:44:18.847Z] forInstance_returns_definition  Time elapsed: 0.008 s
23:44:18 [2021-10-23T03:44:18.847Z] forInstance_returns_null  Time elapsed: 0.001 s
23:44:18 [2021-10-23T03:44:18.847Z] Running org.eclipse.ease.modules.EnvironmentModuleTest
23:44:18 [2021-10-23T03:44:18.847Z] Tests run: 1, Failures: 0, Errors: 0, Skipped: 0, Time elapsed: 0.001 s - in org.eclipse.ease.modules.EnvironmentModuleTest
23:44:18 [2021-10-23T03:44:18.847Z] getModuleDefinition_returns_environment_definition  Time elapsed: 0.001 s
23:44:18 [2021-10-23T03:44:18.847Z] Running org.eclipse.ease.modules.ScriptParameterTest
23:44:18 [2021-10-23T03:44:18.847Z] Tests run: 6, Failures: 0, Errors: 0, Skipped: 0, Time elapsed: 0.003 s - in org.eclipse.ease.modules.ScriptParameterTest
23:44:18 [2021-10-23T03:44:18.847Z] getDefaultValue_null_when_annotation_has_no_default_value  Time elapsed: 0.001 s
23:44:18 [2021-10-23T03:44:18.847Z] isOptional_false_when_annotation_is_missing  Time elapsed: 0 s
23:44:18 [2021-10-23T03:44:18.847Z] isOptional_false_when_annotation_has_no_default_value  Time elapsed: 0 s
23:44:18 [2021-10-23T03:44:18.847Z] getDefaultValue_has_value_when_annotation_with_default_value_exists  Time elapsed: 0.001 s
23:44:18 [2021-10-23T03:44:18.847Z] getDefaultValue_null_when_annotation_is_missing  Time elapsed: 0 s
23:44:18 [2021-10-23T03:44:18.847Z] isOptional_true_when_annotation_with_default_value_exists  Time elapsed: 0 s
23:44:18 [2021-10-23T03:44:18.847Z] Running org.eclipse.ease.AbstractReplScriptEngineTest
23:44:23 [2021-10-23T03:44:23.027Z] 1testorg.eclipse.ease.ScriptEngineCancellationException: Terminated on user request
23:44:23 [2021-10-23T03:44:23.027Z] 	at org.eclipse.ease.AbstractScriptEngine.checkForCancellation(AbstractScriptEngine.java:393)
23:44:23 [2021-10-23T03:44:23.027Z] 	at org.eclipse.ease.AbstractScriptEngineTest$3.execute(AbstractScriptEngineTest.java:294)
23:44:23 [2021-10-23T03:44:23.027Z] 	at org.eclipse.ease.AbstractScriptEngine.inject(AbstractScriptEngine.java:191)
23:44:23 [2021-10-23T03:44:23.027Z] 	at org.eclipse.ease.AbstractScriptEngine.run(AbstractScriptEngine.java:244)
23:44:23 [2021-10-23T03:44:23.027Z] 	at org.eclipse.core.internal.jobs.Worker.run(Worker.java:63)
23:44:23 [2021-10-23T03:44:23.027Z] java.lang.RuntimeException: ERROR
23:44:23 [2021-10-23T03:44:23.027Z] 	at org.eclipse.ease.AbstractReplScriptEngineTest$MockedScriptEngine.execute(AbstractReplScriptEngineTest.java:61)
23:44:23 [2021-10-23T03:44:23.027Z] 	at org.eclipse.ease.AbstractScriptEngine.inject(AbstractScriptEngine.java:191)
23:44:23 [2021-10-23T03:44:23.027Z] 	at org.eclipse.ease.AbstractScriptEngine.run(AbstractScriptEngine.java:244)
23:44:23 [2021-10-23T03:44:23.027Z] 	at org.eclipse.core.internal.jobs.Worker.run(Worker.java:63)
23:44:23 [2021-10-23T03:44:23.027Z] Hello worldHello worldTests run: 20, Failures: 0, Errors: 0, Skipped: 0, Time elapsed: 4.065 s - in org.eclipse.ease.AbstractReplScriptEngineTest
23:44:23 [2021-10-23T03:44:23.027Z] extractEmptyArguments  Time elapsed: 0.021 s
23:44:23 [2021-10-23T03:44:23.027Z] setNotNullOutputStream  Time elapsed: 0 s
23:44:23 [2021-10-23T03:44:23.027Z] terminateViaMonitorCancellation  Time elapsed: 1.215 s
23:44:23 [2021-10-23T03:44:23.027Z] inject  Time elapsed: 0.001 s
23:44:23 [2021-10-23T03:44:23.027Z] extractArguments  Time elapsed: 0 s
23:44:23 [2021-10-23T03:44:23.027Z] executeSync  Time elapsed: 1.001 s
23:44:23 [2021-10-23T03:44:23.027Z] setNotNullErrorStream  Time elapsed: 0 s
23:44:23 [2021-10-23T03:44:23.027Z] setNullErrorStream  Time elapsed: 0 s
23:44:23 [2021-10-23T03:44:23.027Z] isJob  Time elapsed: 0 s
23:44:23 [2021-10-23T03:44:23.027Z] streamsAvailable  Time elapsed: 0 s
23:44:23 [2021-10-23T03:44:23.027Z] executeValidCodeAndTerminate  Time elapsed: 0.001 s
23:44:23 [2021-10-23T03:44:23.027Z] setNullOutputStream  Time elapsed: 0 s
23:44:23 [2021-10-23T03:44:23.027Z] terminateMultipleTimes  Time elapsed: 0.601 s
23:44:23 [2021-10-23T03:44:23.027Z] engineTerminatesWhenIdle  Time elapsed: 1 s
23:44:23 [2021-10-23T03:44:23.027Z] terminateViaTerminateMethod  Time elapsed: 0.202 s
23:44:23 [2021-10-23T03:44:23.027Z] terminateViaMethodCallback  Time elapsed: 0.002 s
23:44:23 [2021-10-23T03:44:23.027Z] executeErrorCodeAndTerminate  Time elapsed: 0.001 s
23:44:23 [2021-10-23T03:44:23.027Z] terminateOnIdleAfterSchedule  Time elapsed: 0.011 s
23:44:23 [2021-10-23T03:44:23.027Z] terminateEngine  Time elapsed: 0.001 s
23:44:23 [2021-10-23T03:44:23.027Z] keepRunningOnIdle  Time elapsed: 0.001 s
23:44:23 [2021-10-23T03:44:23.027Z] Running org.eclipse.ease.AbstractScriptEngineTest
23:44:25 [2021-10-23T03:44:25.794Z] 1testorg.eclipse.ease.ScriptEngineCancellationException: Terminated on user request
23:44:25 [2021-10-23T03:44:25.794Z] 	at org.eclipse.ease.AbstractScriptEngine.checkForCancellation(AbstractScriptEngine.java:393)
23:44:25 [2021-10-23T03:44:25.794Z] 	at org.eclipse.ease.AbstractScriptEngineTest$3.execute(AbstractScriptEngineTest.java:294)
23:44:25 [2021-10-23T03:44:25.794Z] 	at org.eclipse.ease.AbstractScriptEngine.inject(AbstractScriptEngine.java:191)
23:44:25 [2021-10-23T03:44:25.794Z] 	at org.eclipse.ease.AbstractScriptEngine.run(AbstractScriptEngine.java:244)
23:44:25 [2021-10-23T03:44:25.794Z] 	at org.eclipse.core.internal.jobs.Worker.run(Worker.java:63)
23:44:25 [2021-10-23T03:44:25.794Z] java.lang.RuntimeException: ERROR
23:44:25 [2021-10-23T03:44:25.794Z] 	at org.eclipse.ease.AbstractScriptEngineTest$MockedScriptEngine.execute(AbstractScriptEngineTest.java:76)
23:44:25 [2021-10-23T03:44:25.794Z] 	at org.eclipse.ease.AbstractScriptEngine.inject(AbstractScriptEngine.java:191)
23:44:25 [2021-10-23T03:44:25.794Z] 	at org.eclipse.ease.AbstractScriptEngine.run(AbstractScriptEngine.java:244)
23:44:25 [2021-10-23T03:44:25.794Z] 	at org.eclipse.core.internal.jobs.Worker.run(Worker.java:63)
23:44:25 [2021-10-23T03:44:25.794Z] Tests run: 17, Failures: 0, Errors: 0, Skipped: 0, Time elapsed: 2.914 s - in org.eclipse.ease.AbstractScriptEngineTest
23:44:25 [2021-10-23T03:44:25.794Z] extractEmptyArguments  Time elapsed: 0 s
23:44:25 [2021-10-23T03:44:25.794Z] setNotNullOutputStream  Time elapsed: 0.001 s
23:44:25 [2021-10-23T03:44:25.794Z] terminateViaMonitorCancellation  Time elapsed: 1.201 s
23:44:25 [2021-10-23T03:44:25.794Z] inject  Time elapsed: 0 s
23:44:25 [2021-10-23T03:44:25.794Z] extractArguments  Time elapsed: 0 s
23:44:25 [2021-10-23T03:44:25.794Z] executeSync  Time elapsed: 0.001 s
23:44:25 [2021-10-23T03:44:25.794Z] setNotNullErrorStream  Time elapsed: 0 s
23:44:25 [2021-10-23T03:44:25.794Z] setNullErrorStream  Time elapsed: 0.001 s
23:44:25 [2021-10-23T03:44:25.795Z] isJob  Time elapsed: 0 s
23:44:25 [2021-10-23T03:44:25.795Z] streamsAvailable  Time elapsed: 0 s
23:44:25 [2021-10-23T03:44:25.795Z] executeValidCodeAndTerminate  Time elapsed: 0 s
23:44:25 [2021-10-23T03:44:25.795Z] setNullOutputStream  Time elapsed: 0.001 s
23:44:25 [2021-10-23T03:44:25.795Z] terminateMultipleTimes  Time elapsed: 0.601 s
23:44:25 [2021-10-23T03:44:25.795Z] engineTerminatesWhenIdle  Time elapsed: 1.001 s
23:44:25 [2021-10-23T03:44:25.795Z] terminateViaTerminateMethod  Time elapsed: 0.102 s
23:44:25 [2021-10-23T03:44:25.795Z] terminateViaMethodCallback  Time elapsed: 0.001 s
23:44:25 [2021-10-23T03:44:25.795Z] executeErrorCodeAndTerminate  Time elapsed: 0.001 s
23:44:25 [2021-10-23T03:44:25.795Z] Running org.eclipse.ease.AbstractCodeFactoryTest
23:44:26 [2021-10-23T03:44:26.050Z] Tests run: 1, Failures: 0, Errors: 0, Skipped: 0, Time elapsed: 0.096 s - in org.eclipse.ease.AbstractCodeFactoryTest
23:44:26 [2021-10-23T03:44:26.050Z] createNewKeywordHeader  Time elapsed: 0.096 s
23:44:26 [2021-10-23T03:44:26.050Z] Running org.eclipse.ease.applications.RunHeadlessScriptTest
23:44:26 [2021-10-23T03:44:26.343Z] org.eclipse.ease.ScriptExecutionException: SyntaxError: missing ; before statement (file:///home/jenkins/agent/workspace/ease.verify.core.target.2018-12/tests/org.eclipse.ease.test/resources/throwsException.js#1)
23:44:26 [2021-10-23T03:44:26.343Z] this does not work;
23:44:26 [2021-10-23T03:44:26.343Z]          ^
23:44:26 [2021-10-23T03:44:26.343Z] 	at throwsException.js,file:///home/jenkins/agent/workspace/ease.verify.core.target.2018-12/tests/org.eclipse.ease.test/resources/throwsException.js
23:44:26 [2021-10-23T03:44:26.343Z] ERROR: invalid command line argument
23:44:26 [2021-10-23T03:44:26.343Z] 	invalid argument: -unknown
23:44:26 [2021-10-23T03:44:26.343Z] 
23:44:26 [2021-10-23T03:44:26.343Z] SYNTAX: [-workspace <workspace location> [-refreshWorkspace]] [-engine <engineID>]-script <script name> <script parameters>
23:44:26 [2021-10-23T03:44:26.343Z] 
23:44:26 [2021-10-23T03:44:26.343Z] 		<script name> is a path like 'file://C/myfolder/myscript.js'
23:44:26 [2021-10-23T03:44:26.343Z] 		<engineID> provides a dedicated script engine ID. Use org.eclipse.ease.listEngines application.
23:44:26 [2021-10-23T03:44:26.343Z] 		<workspace location> is a file system path like 'C:\somefolder\myworkspace'
23:44:26 [2021-10-23T03:44:26.343Z] 			if you provide a workspace you can use workspace:// identifiers in your scripts
23:44:26 [2021-10-23T03:44:26.343Z] 			if you provide a workspace you may ask to refresh it first prior to script execution
23:44:26 [2021-10-23T03:44:26.343Z] 		<script parameters> will be passed to the script as String[] in the variable 'argv'
23:44:26 [2021-10-23T03:44:26.343Z] ERROR: invalid command line argument
23:44:26 [2021-10-23T03:44:26.343Z] 	script name is missing
23:44:26 [2021-10-23T03:44:26.343Z] 
23:44:26 [2021-10-23T03:44:26.343Z] SYNTAX: [-workspace <workspace location> [-refreshWorkspace]] [-engine <engineID>]-script <script name> <script parameters>
23:44:26 [2021-10-23T03:44:26.343Z] 
23:44:26 [2021-10-23T03:44:26.343Z] 		<script name> is a path like 'file://C/myfolder/myscript.js'
23:44:26 [2021-10-23T03:44:26.343Z] 		<engineID> provides a dedicated script engine ID. Use org.eclipse.ease.listEngines application.
23:44:26 [2021-10-23T03:44:26.343Z] 		<workspace location> is a file system path like 'C:\somefolder\myworkspace'
23:44:26 [2021-10-23T03:44:26.343Z] 			if you provide a workspace you can use workspace:// identifiers in your scripts
23:44:26 [2021-10-23T03:44:26.343Z] 			if you provide a workspace you may ask to refresh it first prior to script execution
23:44:26 [2021-10-23T03:44:26.343Z] 		<script parameters> will be passed to the script as String[] in the variable 'argv'
23:44:26 [2021-10-23T03:44:26.343Z] SYNTAX: [-workspace <workspace location> [-refreshWorkspace]] [-engine <engineID>]-script <script name> <script parameters>
23:44:26 [2021-10-23T03:44:26.343Z] 
23:44:26 [2021-10-23T03:44:26.343Z] 		<script name> is a path like 'file://C/myfolder/myscript.js'
23:44:26 [2021-10-23T03:44:26.343Z] 		<engineID> provides a dedicated script engine ID. Use org.eclipse.ease.listEngines application.
23:44:26 [2021-10-23T03:44:26.343Z] 		<workspace location> is a file system path like 'C:\somefolder\myworkspace'
23:44:26 [2021-10-23T03:44:26.343Z] 			if you provide a workspace you can use workspace:// identifiers in your scripts
23:44:26 [2021-10-23T03:44:26.343Z] 			if you provide a workspace you may ask to refresh it first prior to script execution
23:44:26 [2021-10-23T03:44:26.343Z] 		<script parameters> will be passed to the script as String[] in the variable 'argv'
23:44:26 [2021-10-23T03:44:26.343Z] Hello World
23:44:26 [2021-10-23T03:44:26.343Z] ERROR: invalid command line argument
23:44:26 [2021-10-23T03:44:26.343Z] 	workspace name is missing
23:44:26 [2021-10-23T03:44:26.343Z] 
23:44:26 [2021-10-23T03:44:26.343Z] SYNTAX: [-workspace <workspace location> [-refreshWorkspace]] [-engine <engineID>]-script <script name> <script parameters>
23:44:26 [2021-10-23T03:44:26.343Z] 
23:44:26 [2021-10-23T03:44:26.343Z] 		<script name> is a path like 'file://C/myfolder/myscript.js'
23:44:26 [2021-10-23T03:44:26.343Z] 		<engineID> provides a dedicated script engine ID. Use org.eclipse.ease.listEngines application.
23:44:26 [2021-10-23T03:44:26.343Z] 		<workspace location> is a file system path like 'C:\somefolder\myworkspace'
23:44:26 [2021-10-23T03:44:26.343Z] 			if you provide a workspace you can use workspace:// identifiers in your scripts
23:44:26 [2021-10-23T03:44:26.343Z] 			if you provide a workspace you may ask to refresh it first prior to script execution
23:44:26 [2021-10-23T03:44:26.343Z] 		<script parameters> will be passed to the script as String[] in the variable 'argv'
23:44:26 [2021-10-23T03:44:26.343Z] ERROR: invalid command line argument
23:44:26 [2021-10-23T03:44:26.343Z] 	engine ID is missing
23:44:26 [2021-10-23T03:44:26.343Z] 
23:44:26 [2021-10-23T03:44:26.343Z] SYNTAX: [-workspace <workspace location> [-refreshWorkspace]] [-engine <engineID>]-script <script name> <script parameters>
23:44:26 [2021-10-23T03:44:26.343Z] 
23:44:26 [2021-10-23T03:44:26.343Z] 		<script name> is a path like 'file://C/myfolder/myscript.js'
23:44:26 [2021-10-23T03:44:26.343Z] 		<engineID> provides a dedicated script engine ID. Use org.eclipse.ease.listEngines application.
23:44:26 [2021-10-23T03:44:26.343Z] 		<workspace location> is a file system path like 'C:\somefolder\myworkspace'
23:44:26 [2021-10-23T03:44:26.343Z] 			if you provide a workspace you can use workspace:// identifiers in your scripts
23:44:26 [2021-10-23T03:44:26.343Z] 			if you provide a workspace you may ask to refresh it first prior to script execution
23:44:26 [2021-10-23T03:44:26.343Z] 		<script parameters> will be passed to the script as String[] in the variable 'argv'
23:44:26 [2021-10-23T03:44:26.344Z] Tests run: 12, Failures: 0, Errors: 0, Skipped: 0, Time elapsed: 0.488 s - in org.eclipse.ease.applications.RunHeadlessScriptTest
23:44:26 [2021-10-23T03:44:26.344Z] start_error_when_script_throws  Time elapsed: 0.313 s
23:44:26 [2021-10-23T03:44:26.344Z] start_error_when_engine_ID_is_invalid  Time elapsed: 0.001 s
23:44:26 [2021-10-23T03:44:26.344Z] start_error_when_argument_is_unknown  Time elapsed: 0.001 s
23:44:26 [2021-10-23T03:44:26.344Z] start_error_when_script_location_is_missing  Time elapsed: 0.001 s
23:44:26 [2021-10-23T03:44:26.344Z] start_error_when_help_is_set  Time elapsed: 0 s
23:44:26 [2021-10-23T03:44:26.344Z] start_error_when_script_location_is_invalid  Time elapsed: 0.001 s
23:44:26 [2021-10-23T03:44:26.344Z] start_script  Time elapsed: 0.001 s
23:44:26 [2021-10-23T03:44:26.344Z] start_executes_script_with_return_value  Time elapsed: 0.073 s
23:44:26 [2021-10-23T03:44:26.344Z] start_executes_hello_world  Time elapsed: 0.023 s
23:44:26 [2021-10-23T03:44:26.344Z] start_error_when_workspace_location_is_missing  Time elapsed: 0.001 s
23:44:26 [2021-10-23T03:44:26.344Z] start_executes_script_arguments  Time elapsed: 0.03 s
23:44:26 [2021-10-23T03:44:26.344Z] start_error_when_engine_ID_is_missing  Time elapsed: 0.001 s
23:44:26 [2021-10-23T03:44:26.600Z] Running org.eclipse.ease.ScriptResultTest
23:44:30 [2021-10-23T03:44:30.769Z] Tests run: 17, Failures: 0, Errors: 0, Skipped: 0, Time elapsed: 3.767 s - in org.eclipse.ease.ScriptResultTest
23:44:30 [2021-10-23T03:44:30.769Z] setResult_after_setException_throws  Time elapsed: 0.001 s
23:44:30 [2021-10-23T03:44:30.769Z] setResult_after_setResult_throws  Time elapsed: 0 s
23:44:30 [2021-10-23T03:44:30.769Z] isDone_true_when_exception_was_thrown  Time elapsed: 0 s
23:44:30 [2021-10-23T03:44:30.769Z] get_returns_ready_execution_result  Time elapsed: 0 s
23:44:30 [2021-10-23T03:44:30.769Z] get_waits_for_execution_result  Time elapsed: 0.552 s
23:44:30 [2021-10-23T03:44:30.769Z] get_with_timeout_waits_for_execution_result  Time elapsed: 0.55 s
23:44:30 [2021-10-23T03:44:30.769Z] get_throws_execution_exception  Time elapsed: 0 s
23:44:30 [2021-10-23T03:44:30.769Z] get_with_milliseconds_timeout_waits_for_execution_result  Time elapsed: 0.551 s
23:44:30 [2021-10-23T03:44:30.769Z] setException_after_setException_throws  Time elapsed: 0.001 s
23:44:30 [2021-10-23T03:44:30.769Z] isDone_false_on_new_ScriptResult  Time elapsed: 0.001 s
23:44:30 [2021-10-23T03:44:30.769Z] get_milliseconds_times_out  Time elapsed: 0.501 s
23:44:30 [2021-10-23T03:44:30.769Z] get_times_out  Time elapsed: 0.501 s
23:44:30 [2021-10-23T03:44:30.769Z] get_waits_for_execution_exception  Time elapsed: 0.552 s
23:44:30 [2021-10-23T03:44:30.769Z] setException_after_setResult_throws  Time elapsed: 0.001 s
23:44:30 [2021-10-23T03:44:30.769Z] isDone_true_when_result_is_null  Time elapsed: 0 s
23:44:30 [2021-10-23T03:44:30.769Z] isDone_true_when_result_is_ready  Time elapsed: 0 s
23:44:30 [2021-10-23T03:44:30.769Z] get_with_timeout_waits_for_execution_exception  Time elapsed: 0.551 s
23:44:30 [2021-10-23T03:44:30.770Z] 
23:44:30 [2021-10-23T03:44:30.770Z] Results:
23:44:30 [2021-10-23T03:44:30.770Z] 
23:44:30 [2021-10-23T03:44:30.770Z] Tests run: 167, Failures: 0, Errors: 0, Skipped: 0
23:44:30 [2021-10-23T03:44:30.770Z] 
23:44:30 [2021-10-23T03:44:30.770Z] [INFO] All tests passed!
23:44:30 [2021-10-23T03:44:30.770Z] [INFO] 
23:44:30 [2021-10-23T03:44:30.770Z] [INFO] ----< org.eclipse.ease:org.eclipse.ease.lang.javascript.rhino.test >----
23:44:30 [2021-10-23T03:44:30.770Z] [INFO] Building org.eclipse.ease.lang.javascript.rhino.test 0.9.0-SNAPSHOT [4/9]
23:44:30 [2021-10-23T03:44:30.770Z] [INFO] ------------------------[ eclipse-test-plugin ]-------------------------
23:44:30 [2021-10-23T03:44:30.770Z] [INFO] 
23:44:30 [2021-10-23T03:44:30.770Z] [INFO] --- tycho-packaging-plugin:2.2.0:build-qualifier (default-build-qualifier) @ org.eclipse.ease.lang.javascript.rhino.test ---
23:44:30 [2021-10-23T03:44:30.770Z] [INFO] The project's OSGi version is 0.9.0.I202106220815
23:44:30 [2021-10-23T03:44:30.770Z] [INFO] 
23:44:30 [2021-10-23T03:44:30.770Z] [INFO] --- tycho-packaging-plugin:2.2.0:validate-id (default-validate-id) @ org.eclipse.ease.lang.javascript.rhino.test ---
23:44:30 [2021-10-23T03:44:30.770Z] [INFO] 
23:44:30 [2021-10-23T03:44:30.770Z] [INFO] --- tycho-packaging-plugin:2.2.0:validate-version (default-validate-version) @ org.eclipse.ease.lang.javascript.rhino.test ---
23:44:30 [2021-10-23T03:44:30.770Z] [INFO] 
23:44:30 [2021-10-23T03:44:30.770Z] [INFO] --- maven-resources-plugin:2.4.3:resources (default-resources) @ org.eclipse.ease.lang.javascript.rhino.test ---
23:44:30 [2021-10-23T03:44:30.770Z] [INFO] Using 'UTF-8' encoding to copy filtered resources.
23:44:30 [2021-10-23T03:44:30.770Z] [INFO] skip non existing resourceDirectory /home/jenkins/agent/workspace/ease.verify.core.target.2018-12/tests/org.eclipse.ease.lang.javascript.rhino.test/src/main/resources
23:44:30 [2021-10-23T03:44:30.770Z] [INFO] 
23:44:30 [2021-10-23T03:44:30.770Z] [INFO] --- tycho-compiler-plugin:2.2.0:compile (default-compile) @ org.eclipse.ease.lang.javascript.rhino.test ---
23:44:30 [2021-10-23T03:44:30.770Z] [INFO] Nothing to compile - all classes are up to date
23:44:30 [2021-10-23T03:44:30.770Z] [INFO] 
23:44:30 [2021-10-23T03:44:30.770Z] [INFO] --- maven-resources-plugin:2.4.3:testResources (default-testResources) @ org.eclipse.ease.lang.javascript.rhino.test ---
23:44:30 [2021-10-23T03:44:30.770Z] [INFO] Using 'UTF-8' encoding to copy filtered resources.
23:44:30 [2021-10-23T03:44:30.770Z] [INFO] skip non existing resourceDirectory /home/jenkins/agent/workspace/ease.verify.core.target.2018-12/tests/org.eclipse.ease.lang.javascript.rhino.test/src/test/resources
23:44:30 [2021-10-23T03:44:30.770Z] [INFO] 
23:44:30 [2021-10-23T03:44:30.770Z] [INFO] --- target-platform-configuration:2.2.0:target-platform (default-target-platform) @ org.eclipse.ease.lang.javascript.rhino.test ---
23:44:30 [2021-10-23T03:44:30.770Z] [INFO] 
23:44:30 [2021-10-23T03:44:30.770Z] [INFO] --- tycho-packaging-plugin:2.2.0:package-plugin (default-package-plugin) @ org.eclipse.ease.lang.javascript.rhino.test ---
23:44:30 [2021-10-23T03:44:30.770Z] [INFO] Building jar: /home/jenkins/agent/workspace/ease.verify.core.target.2018-12/tests/org.eclipse.ease.lang.javascript.rhino.test/target/org.eclipse.ease.lang.javascript.rhino.test-0.9.0-SNAPSHOT.jar
23:44:30 [2021-10-23T03:44:30.770Z] [INFO] 
23:44:30 [2021-10-23T03:44:30.770Z] [INFO] --- tycho-p2-plugin:2.2.0:p2-metadata-default (default-p2-metadata-default) @ org.eclipse.ease.lang.javascript.rhino.test ---
23:44:30 [2021-10-23T03:44:30.770Z] [INFO] 
23:44:30 [2021-10-23T03:44:30.770Z] [INFO] --- jacoco-maven-plugin:0.8.6:prepare-agent (jacoco-initialize) @ org.eclipse.ease.lang.javascript.rhino.test ---
23:44:30 [2021-10-23T03:44:30.770Z] [INFO] tycho.testArgLine set to -javaagent:/home/jenkins/.m2/repository/org/jacoco/org.jacoco.agent/0.8.6/org.jacoco.agent-0.8.6-runtime.jar=destfile=/home/jenkins/agent/workspace/ease.verify.core.target.2018-12/tests/org.eclipse.ease.lang.javascript.rhino.test/target/jacoco.exec,output=file
23:44:30 [2021-10-23T03:44:30.770Z] [INFO] 
23:44:30 [2021-10-23T03:44:30.770Z] [INFO] --- tycho-surefire-plugin:2.2.0:test (default-test) @ org.eclipse.ease.lang.javascript.rhino.test ---
23:44:30 [2021-10-23T03:44:30.770Z] [INFO] Executing Test Runtime with timeout 0, logs (if any) will be placed at: /home/jenkins/agent/workspace/ease.verify.core.target.2018-12/tests/org.eclipse.ease.lang.javascript.rhino.test/target/work/data/.metadata/.log
23:44:30 [2021-10-23T03:44:30.770Z] [INFO] Command line:
23:44:30 [2021-10-23T03:44:30.770Z] 	[/opt/tools/java/openjdk/jdk-15/15.0.2+7/bin/java, -Dosgi.noShutdown=false, -Dosgi.os=linux, -Dosgi.ws=gtk, -Dosgi.arch=x86_64, -javaagent:/home/jenkins/.m2/repository/org/jacoco/org.jacoco.agent/0.8.6/org.jacoco.agent-0.8.6-runtime.jar=destfile=/home/jenkins/agent/workspace/ease.verify.core.target.2018-12/tests/org.eclipse.ease.lang.javascript.rhino.test/target/jacoco.exec,output=file, -Dosgi.clean=true, -jar, /home/jenkins/.m2/repository/p2/osgi/bundle/org.eclipse.equinox.launcher/1.5.200.v20180922-1751/org.eclipse.equinox.launcher-1.5.200.v20180922-1751.jar, -data, /home/jenkins/agent/workspace/ease.verify.core.target.2018-12/tests/org.eclipse.ease.lang.javascript.rhino.test/target/work/data, -install, /home/jenkins/agent/workspace/ease.verify.core.target.2018-12/tests/org.eclipse.ease.lang.javascript.rhino.test/target/work, -configuration, /home/jenkins/agent/workspace/ease.verify.core.target.2018-12/tests/org.eclipse.ease.lang.javascript.rhino.test/target/work/configuration, -application, org.eclipse.tycho.surefire.osgibooter.headlesstest, -testproperties, /home/jenkins/agent/workspace/ease.verify.core.target.2018-12/tests/org.eclipse.ease.lang.javascript.rhino.test/target/surefire.properties]
23:44:30 [2021-10-23T03:44:30.770Z] Picked up JAVA_TOOL_OPTIONS: -Dmaven.ext.class.path="/home/jenkins/agent/workspace/ease.verify.core.target.2018-12@tmp/withMaven93c549ad/pipeline-maven-spy.jar" -Dorg.jenkinsci.plugins.pipeline.maven.reportsFolder="/home/jenkins/agent/workspace/ease.verify.core.target.2018-12@tmp/withMaven93c549ad" 
23:44:34 [2021-10-23T03:44:34.056Z] Running org.eclipse.ease.lang.javascript.rhino.RhinoEnvironmentTest
23:44:34 [2021-10-23T03:44:34.312Z] Tests run: 5, Failures: 0, Errors: 0, Skipped: 0, Time elapsed: 0.88 s - in org.eclipse.ease.lang.javascript.rhino.RhinoEnvironmentTest
23:44:34 [2021-10-23T03:44:34.312Z] reloadEnvironment  Time elapsed: 0.328 s
23:44:34 [2021-10-23T03:44:34.312Z] bootstrappedEnvironment  Time elapsed: 0.051 s
23:44:34 [2021-10-23T03:44:34.312Z] postMethodCallback  Time elapsed: 0.412 s
23:44:34 [2021-10-23T03:44:34.312Z] preMethodCallback  Time elapsed: 0.022 s
23:44:34 [2021-10-23T03:44:34.312Z] reloadFunctionDefinitions  Time elapsed: 0.054 s
23:44:34 [2021-10-23T03:44:34.312Z] Running org.eclipse.ease.lang.javascript.rhino.RhinoDebuggerEngineTest
23:44:34 [2021-10-23T03:44:34.568Z] org.eclipse.ease.ScriptExecutionException: JavaError: java.lang.Exception
23:44:34 [2021-10-23T03:44:34.568Z] 
23:44:34 [2021-10-23T03:44:34.568Z] Java Stacktrace:
23:44:34 [2021-10-23T03:44:34.568Z] java.lang.Exception
23:44:34 [2021-10-23T03:44:34.568Z] 	at java.base/jdk.internal.reflect.NativeConstructorAccessorImpl.newInstance0(Native Method)
23:44:34 [2021-10-23T03:44:34.568Z] 	at java.base/jdk.internal.reflect.NativeConstructorAccessorImpl.newInstance(NativeConstructorAccessorImpl.java:64)
23:44:34 [2021-10-23T03:44:34.568Z] 	at java.base/jdk.internal.reflect.DelegatingConstructorAccessorImpl.newInstance(DelegatingConstructorAccessorImpl.java:45)
23:44:34 [2021-10-23T03:44:34.568Z] 	at java.base/java.lang.reflect.Constructor.newInstanceWithCaller(Constructor.java:500)
23:44:34 [2021-10-23T03:44:34.568Z] 	at java.base/java.lang.reflect.Constructor.newInstance(Constructor.java:481)
23:44:34 [2021-10-23T03:44:34.568Z] 	at org.mozilla.javascript.MemberBox.newInstance(MemberBox.java:159)
23:44:34 [2021-10-23T03:44:34.568Z] 	at org.mozilla.javascript.NativeJavaClass.constructInternal(NativeJavaClass.java:266)
23:44:34 [2021-10-23T03:44:34.568Z] 	at org.mozilla.javascript.NativeJavaClass.constructSpecific(NativeJavaClass.java:205)
23:44:34 [2021-10-23T03:44:34.568Z] 	at org.mozilla.javascript.NativeJavaClass.construct(NativeJavaClass.java:166)
23:44:34 [2021-10-23T03:44:34.568Z] 	at org.mozilla.javascript.Interpreter.interpretLoop(Interpreter.java:1519)
23:44:34 [2021-10-23T03:44:34.568Z] 	at org.mozilla.javascript.Interpreter.interpret(Interpreter.java:815)
23:44:34 [2021-10-23T03:44:34.568Z] 	at org.mozilla.javascript.InterpretedFunction.call(InterpretedFunction.java:109)
23:44:34 [2021-10-23T03:44:34.568Z] 	at org.mozilla.javascript.ContextFactory.doTopCall(ContextFactory.java:394)
23:44:34 [2021-10-23T03:44:34.568Z] 	at org.mozilla.javascript.ScriptRuntime.doTopCall(ScriptRuntime.java:3091)
23:44:34 [2021-10-23T03:44:34.568Z] 	at org.mozilla.javascript.InterpretedFunction.exec(InterpretedFunction.java:120)
23:44:34 [2021-10-23T03:44:34.568Z] 	at org.mozilla.javascript.Context.evaluateReader(Context.java:1110)
23:44:34 [2021-10-23T03:44:34.568Z] 	at org.eclipse.ease.lang.javascript.rhino.RhinoScriptEngine.internalExecute(RhinoScriptEngine.java:226)
23:44:34 [2021-10-23T03:44:34.568Z] 	at org.eclipse.ease.lang.javascript.rhino.RhinoScriptEngine.execute(RhinoScriptEngine.java:205)
23:44:34 [2021-10-23T03:44:34.568Z] 	at org.eclipse.ease.AbstractScriptEngine.inject(AbstractScriptEngine.java:191)
23:44:34 [2021-10-23T03:44:34.568Z] 	at org.eclipse.ease.AbstractScriptEngine.run(AbstractScriptEngine.java:244)
23:44:34 [2021-10-23T03:44:34.568Z] 	at org.eclipse.core.internal.jobs.Worker.run(Worker.java:63)
23:44:34 [2021-10-23T03:44:34.568Z] org.eclipse.ease.ScriptExecutionException: ScriptException: test
23:44:34 [2021-10-23T03:44:34.568Z] org.eclipse.ease.ScriptExecutionException: ScriptException: JavaScript
23:44:34 [2021-10-23T03:44:34.844Z] org.eclipse.ease.ScriptExecutionException: SyntaxError: unterminated string literal (#1)
23:44:34 [2021-10-23T03:44:34.844Z] 'asdf
23:44:34 [2021-10-23T03:44:34.844Z]     ^
23:44:34 [2021-10-23T03:44:34.844Z] 	at <unknown source>:1
23:44:34 [2021-10-23T03:44:34.844Z] org.eclipse.ease.ScriptExecutionException: TypeError: Cannot call method "foobar" of undefined
23:44:34 [2021-10-23T03:44:34.844Z] org.eclipse.ease.ScriptExecutionException: JavaError: NotThere cannot be found by org.mozilla.javascript_1.7.5.v201504281450
23:44:34 [2021-10-23T03:44:34.844Z] 
23:44:34 [2021-10-23T03:44:34.844Z] Java Stacktrace:
23:44:34 [2021-10-23T03:44:34.844Z] java.lang.ClassNotFoundException: NotThere cannot be found by org.mozilla.javascript_1.7.5.v201504281450
23:44:34 [2021-10-23T03:44:34.844Z] 	at org.eclipse.osgi.internal.loader.BundleLoader.findClassInternal(BundleLoader.java:511)
23:44:34 [2021-10-23T03:44:34.844Z] 	at org.eclipse.osgi.internal.loader.BundleLoader.findClass(BundleLoader.java:422)
23:44:34 [2021-10-23T03:44:34.844Z] 	at org.eclipse.osgi.internal.loader.BundleLoader.findClass(BundleLoader.java:414)
23:44:34 [2021-10-23T03:44:34.844Z] 	at org.eclipse.osgi.internal.loader.ModuleClassLoader.loadClass(ModuleClassLoader.java:153)
23:44:34 [2021-10-23T03:44:34.844Z] 	at java.base/java.lang.ClassLoader.loadClass(ClassLoader.java:522)
23:44:34 [2021-10-23T03:44:34.844Z] 	at java.base/java.lang.Class.forName0(Native Method)
23:44:34 [2021-10-23T03:44:34.844Z] 	at java.base/java.lang.Class.forName(Class.java:377)
23:44:34 [2021-10-23T03:44:34.844Z] 	at java.base/jdk.internal.reflect.NativeMethodAccessorImpl.invoke0(Native Method)
23:44:34 [2021-10-23T03:44:34.844Z] 	at java.base/jdk.internal.reflect.NativeMethodAccessorImpl.invoke(NativeMethodAccessorImpl.java:64)
23:44:34 [2021-10-23T03:44:34.844Z] 	at java.base/jdk.internal.reflect.DelegatingMethodAccessorImpl.invoke(DelegatingMethodAccessorImpl.java:43)
23:44:34 [2021-10-23T03:44:34.844Z] 	at java.base/java.lang.reflect.Method.invoke(Method.java:564)
23:44:34 [2021-10-23T03:44:34.844Z] 	at org.mozilla.javascript.MemberBox.invoke(MemberBox.java:126)
23:44:34 [2021-10-23T03:44:34.844Z] 	at org.mozilla.javascript.NativeJavaMethod.call(NativeJavaMethod.java:225)
23:44:34 [2021-10-23T03:44:34.844Z] 	at org.mozilla.javascript.Interpreter.interpretLoop(Interpreter.java:1473)
23:44:34 [2021-10-23T03:44:34.844Z] 	at org.mozilla.javascript.Interpreter.interpret(Interpreter.java:815)
23:44:34 [2021-10-23T03:44:34.844Z] 	at org.mozilla.javascript.InterpretedFunction.call(InterpretedFunction.java:109)
23:44:34 [2021-10-23T03:44:34.844Z] 	at org.mozilla.javascript.ContextFactory.doTopCall(ContextFactory.java:394)
23:44:34 [2021-10-23T03:44:34.844Z] 	at org.mozilla.javascript.ScriptRuntime.doTopCall(ScriptRuntime.java:3091)
23:44:34 [2021-10-23T03:44:34.844Z] 	at org.mozilla.javascript.InterpretedFunction.exec(InterpretedFunction.java:120)
23:44:34 [2021-10-23T03:44:34.844Z] 	at org.mozilla.javascript.Context.evaluateReader(Context.java:1110)
23:44:34 [2021-10-23T03:44:34.844Z] 	at org.eclipse.ease.lang.javascript.rhino.RhinoScriptEngine.internalExecute(RhinoScriptEngine.java:226)
23:44:34 [2021-10-23T03:44:34.844Z] 	at org.eclipse.ease.lang.javascript.rhino.RhinoScriptEngine.execute(RhinoScriptEngine.java:205)
23:44:34 [2021-10-23T03:44:34.844Z] 	at org.eclipse.ease.AbstractScriptEngine.inject(AbstractScriptEngine.java:191)
23:44:34 [2021-10-23T03:44:34.844Z] 	at org.eclipse.ease.AbstractScriptEngine.run(AbstractScriptEngine.java:244)
23:44:34 [2021-10-23T03:44:34.844Z] 	at org.eclipse.core.internal.jobs.Worker.run(Worker.java:63)
23:44:34 [2021-10-23T03:44:34.844Z] org.eclipse.ease.ScriptExecutionException: TypeError: Cannot call method "substr" of null
23:44:34 [2021-10-23T03:44:34.844Z] 	at mainFile.js,throwOnNull():4
23:44:34 [2021-10-23T03:44:34.844Z] 	at includeFile.js,subCall():2
23:44:34 [2021-10-23T03:44:34.844Z] 	at mainFile.js:7
23:44:34 [2021-10-23T03:44:34.844Z] Tests run: 12, Failures: 0, Errors: 0, Skipped: 0, Time elapsed: 0.427 s - in org.eclipse.ease.lang.javascript.rhino.RhinoDebuggerEngineTest
23:44:34 [2021-10-23T03:44:34.844Z] execute_java_class_instantiation  Time elapsed: 0.119 s
23:44:34 [2021-10-23T03:44:34.844Z] execute_environment_module_code_with_optional_parameters  Time elapsed: 0.023 s
23:44:34 [2021-10-23T03:44:34.844Z] execute_throws_java_exception  Time elapsed: 0.044 s
23:44:34 [2021-10-23T03:44:34.844Z] execute_throws_java_class  Time elapsed: 0.017 s
23:44:34 [2021-10-23T03:44:34.844Z] execute_javascript_assignment  Time elapsed: 0.015 s
23:44:34 [2021-10-23T03:44:34.844Z] execute_eclipse_class_instantiation  Time elapsed: 0.057 s
23:44:34 [2021-10-23T03:44:34.844Z] execute_throws_javascript_object  Time elapsed: 0.023 s
23:44:34 [2021-10-23T03:44:34.844Z] execute_throws_syntax_error  Time elapsed: 0.018 s
23:44:34 [2021-10-23T03:44:34.844Z] execute_throws_javascript_runtime_error  Time elapsed: 0.055 s
23:44:34 [2021-10-23T03:44:34.844Z] execute_environment_module_code  Time elapsed: 0.015 s
23:44:34 [2021-10-23T03:44:34.844Z] execute_throws_wrapped_java_exception  Time elapsed: 0.018 s
23:44:34 [2021-10-23T03:44:34.844Z] getExceptionStackTrace_returns_script_trace_over_multiple_files  Time elapsed: 0.019 s
23:44:34 [2021-10-23T03:44:34.844Z] Running org.eclipse.ease.lang.javascript.rhino.RhinoDebugTest
23:44:35 [2021-10-23T03:44:35.100Z] Start of script
23:44:35 [2021-10-23T03:44:35.100Z] include file start
23:44:35 [2021-10-23T03:44:35.100Z] Include file processed
23:44:35 [2021-10-23T03:44:35.100Z] line after include file
23:44:35 [2021-10-23T03:44:35.100Z] Result of testMethod = 5
23:44:35 [2021-10-23T03:44:35.100Z] End of script
23:44:35 [2021-10-23T03:44:35.100Z] Start of script
23:44:35 [2021-10-23T03:44:35.356Z] include file start
23:44:35 [2021-10-23T03:44:35.356Z] Include file processed
23:44:35 [2021-10-23T03:44:35.356Z] line after include file
23:44:35 [2021-10-23T03:44:35.356Z] Result of testMethod = 5
23:44:35 [2021-10-23T03:44:35.356Z] End of script
23:44:35 [2021-10-23T03:44:35.356Z] Start of script
23:44:35 [2021-10-23T03:44:35.356Z] include file start
23:44:35 [2021-10-23T03:44:35.356Z] Include file processed
23:44:35 [2021-10-23T03:44:35.356Z] line after include file
23:44:35 [2021-10-23T03:44:35.356Z] Result of testMethod = 5
23:44:35 [2021-10-23T03:44:35.612Z] org.eclipse.ease.ScriptEngineCancellationException: Terminated on user request
23:44:35 [2021-10-23T03:44:35.612Z] 	at org.eclipse.ease.debugging.AbstractEaseDebugger.handleEventsInSuspendedState(AbstractEaseDebugger.java:331)
23:44:35 [2021-10-23T03:44:35.612Z] 	at org.eclipse.ease.debugging.AbstractEaseDebugger.suspend(AbstractEaseDebugger.java:257)
23:44:35 [2021-10-23T03:44:35.612Z] 	at org.eclipse.ease.debugging.AbstractEaseDebugger.processLine(AbstractEaseDebugger.java:492)
23:44:35 [2021-10-23T03:44:35.613Z] 	at org.eclipse.ease.lang.javascript.rhino.debugger.RhinoDebugger.access$4(RhinoDebugger.java:1)
23:44:35 [2021-10-23T03:44:35.613Z] 	at org.eclipse.ease.lang.javascript.rhino.debugger.RhinoDebugger$RhinoDebugFrame.onLineChange(RhinoDebugger.java:124)
23:44:35 [2021-10-23T03:44:35.613Z] 	at org.mozilla.javascript.Interpreter.interpretLoop(Interpreter.java:1824)
23:44:35 [2021-10-23T03:44:35.613Z] 	at org.mozilla.javascript.Interpreter.interpret(Interpreter.java:815)
23:44:35 [2021-10-23T03:44:35.613Z] 	at org.mozilla.javascript.InterpretedFunction.call(InterpretedFunction.java:109)
23:44:35 [2021-10-23T03:44:35.613Z] 	at org.mozilla.javascript.ContextFactory.doTopCall(ContextFactory.java:394)
23:44:35 [2021-10-23T03:44:35.613Z] 	at org.mozilla.javascript.ScriptRuntime.doTopCall(ScriptRuntime.java:3091)
23:44:35 [2021-10-23T03:44:35.613Z] 	at org.mozilla.javascript.InterpretedFunction.exec(InterpretedFunction.java:120)
23:44:35 [2021-10-23T03:44:35.613Z] 	at org.mozilla.javascript.Context.evaluateReader(Context.java:1110)
23:44:35 [2021-10-23T03:44:35.613Z] 	at org.eclipse.ease.lang.javascript.rhino.RhinoScriptEngine.internalExecute(RhinoScriptEngine.java:226)
23:44:35 [2021-10-23T03:44:35.613Z] 	at org.eclipse.ease.lang.javascript.rhino.RhinoScriptEngine.execute(RhinoScriptEngine.java:205)
23:44:35 [2021-10-23T03:44:35.613Z] 	at org.eclipse.ease.AbstractScriptEngine.inject(AbstractScriptEngine.java:191)
23:44:35 [2021-10-23T03:44:35.613Z] 	at org.eclipse.ease.AbstractScriptEngine.run(AbstractScriptEngine.java:244)
23:44:35 [2021-10-23T03:44:35.613Z] 	at org.eclipse.core.internal.jobs.Worker.run(Worker.java:63)
23:44:35 [2021-10-23T03:44:35.613Z] Start of script
23:44:35 [2021-10-23T03:44:35.613Z] include file start
23:44:35 [2021-10-23T03:44:35.613Z] Include file processed
23:44:35 [2021-10-23T03:44:35.613Z] line after include file
23:44:35 [2021-10-23T03:44:35.869Z] Result of testMethod = 5
23:44:35 [2021-10-23T03:44:35.869Z] End of script
23:44:36 [2021-10-23T03:44:36.126Z] Start of script
23:44:36 [2021-10-23T03:44:36.126Z] include file start
23:44:36 [2021-10-23T03:44:36.126Z] Include file processed
23:44:36 [2021-10-23T03:44:36.126Z] line after include file
23:44:36 [2021-10-23T03:44:36.126Z] Result of testMethod = 5
23:44:36 [2021-10-23T03:44:36.126Z] End of script
23:44:36 [2021-10-23T03:44:36.383Z] Start of script
23:44:36 [2021-10-23T03:44:36.383Z] include file start
23:44:36 [2021-10-23T03:44:36.383Z] Include file processed
23:44:36 [2021-10-23T03:44:36.383Z] line after include file
23:44:36 [2021-10-23T03:44:36.383Z] Result of testMethod = 5
23:44:36 [2021-10-23T03:44:36.383Z] End of script
23:44:36 [2021-10-23T03:44:36.639Z] Start of script
23:44:36 [2021-10-23T03:44:36.639Z] include file start
23:44:36 [2021-10-23T03:44:36.639Z] Include file processed
23:44:36 [2021-10-23T03:44:36.639Z] line after include file
23:44:36 [2021-10-23T03:44:36.639Z] Result of testMethod = 5
23:44:36 [2021-10-23T03:44:36.894Z] org.eclipse.ease.ScriptEngineCancellationException: Terminated on user request
23:44:36 [2021-10-23T03:44:36.894Z] 	at org.eclipse.ease.debugging.AbstractEaseDebugger.handleEventsInSuspendedState(AbstractEaseDebugger.java:331)
23:44:36 [2021-10-23T03:44:36.894Z] 	at org.eclipse.ease.debugging.AbstractEaseDebugger.suspend(AbstractEaseDebugger.java:257)
23:44:36 [2021-10-23T03:44:36.894Z] 	at org.eclipse.ease.debugging.AbstractEaseDebugger.processLine(AbstractEaseDebugger.java:492)
23:44:36 [2021-10-23T03:44:36.894Z] 	at org.eclipse.ease.lang.javascript.rhino.debugger.RhinoDebugger.access$4(RhinoDebugger.java:1)
23:44:36 [2021-10-23T03:44:36.894Z] 	at org.eclipse.ease.lang.javascript.rhino.debugger.RhinoDebugger$RhinoDebugFrame.onLineChange(RhinoDebugger.java:124)
23:44:36 [2021-10-23T03:44:36.894Z] 	at org.mozilla.javascript.Interpreter.interpretLoop(Interpreter.java:1824)
23:44:36 [2021-10-23T03:44:36.894Z] 	at org.mozilla.javascript.Interpreter.interpret(Interpreter.java:815)
23:44:36 [2021-10-23T03:44:36.894Z] 	at org.mozilla.javascript.InterpretedFunction.call(InterpretedFunction.java:109)
23:44:36 [2021-10-23T03:44:36.894Z] 	at org.mozilla.javascript.ContextFactory.doTopCall(ContextFactory.java:394)
23:44:36 [2021-10-23T03:44:36.894Z] 	at org.mozilla.javascript.ScriptRuntime.doTopCall(ScriptRuntime.java:3091)
23:44:36 [2021-10-23T03:44:36.894Z] 	at org.mozilla.javascript.InterpretedFunction.exec(InterpretedFunction.java:120)
23:44:36 [2021-10-23T03:44:36.894Z] 	at org.mozilla.javascript.Context.evaluateReader(Context.java:1110)
23:44:36 [2021-10-23T03:44:36.894Z] 	at org.eclipse.ease.lang.javascript.rhino.RhinoScriptEngine.internalExecute(RhinoScriptEngine.java:226)
23:44:36 [2021-10-23T03:44:36.894Z] 	at org.eclipse.ease.lang.javascript.rhino.RhinoScriptEngine.execute(RhinoScriptEngine.java:205)
23:44:36 [2021-10-23T03:44:36.894Z] 	at org.eclipse.ease.AbstractScriptEngine.inject(AbstractScriptEngine.java:191)
23:44:36 [2021-10-23T03:44:36.894Z] 	at org.eclipse.ease.AbstractScriptEngine.run(AbstractScriptEngine.java:244)
23:44:36 [2021-10-23T03:44:36.894Z] 	at org.eclipse.core.internal.jobs.Worker.run(Worker.java:63)
23:44:36 [2021-10-23T03:44:36.894Z] Start of script
23:44:36 [2021-10-23T03:44:36.894Z] include file start
23:44:36 [2021-10-23T03:44:36.894Z] Include file processed
23:44:36 [2021-10-23T03:44:36.894Z] line after include file
23:44:37 [2021-10-23T03:44:37.151Z] Result of testMethod = 5
23:44:37 [2021-10-23T03:44:37.151Z] End of script
23:44:37 [2021-10-23T03:44:37.151Z] Start of script
23:44:37 [2021-10-23T03:44:37.151Z] include file start
23:44:37 [2021-10-23T03:44:37.151Z] Include file processed
23:44:37 [2021-10-23T03:44:37.151Z] line after include file
23:44:37 [2021-10-23T03:44:37.151Z] Result of testMethod = 5
23:44:37 [2021-10-23T03:44:37.406Z] End of script
23:44:37 [2021-10-23T03:44:37.406Z] Start of script
23:44:37 [2021-10-23T03:44:37.406Z] include file start
23:44:37 [2021-10-23T03:44:37.406Z] Include file processed
23:44:37 [2021-10-23T03:44:37.406Z] line after include file
23:44:37 [2021-10-23T03:44:37.662Z] org.eclipse.ease.ScriptEngineCancellationException: Terminated on user request
23:44:37 [2021-10-23T03:44:37.662Z] 	at org.eclipse.ease.debugging.AbstractEaseDebugger.handleEventsInSuspendedState(AbstractEaseDebugger.java:331)
23:44:37 [2021-10-23T03:44:37.662Z] 	at org.eclipse.ease.debugging.AbstractEaseDebugger.suspend(AbstractEaseDebugger.java:257)
23:44:37 [2021-10-23T03:44:37.662Z] 	at org.eclipse.ease.debugging.AbstractEaseDebugger.processLine(AbstractEaseDebugger.java:512)
23:44:37 [2021-10-23T03:44:37.662Z] 	at org.eclipse.ease.lang.javascript.rhino.debugger.RhinoDebugger.access$4(RhinoDebugger.java:1)
23:44:37 [2021-10-23T03:44:37.662Z] 	at org.eclipse.ease.lang.javascript.rhino.debugger.RhinoDebugger$RhinoDebugFrame.onLineChange(RhinoDebugger.java:124)
23:44:37 [2021-10-23T03:44:37.662Z] 	at org.mozilla.javascript.Interpreter.interpretLoop(Interpreter.java:1824)
23:44:37 [2021-10-23T03:44:37.662Z] 	at org.mozilla.javascript.Interpreter.interpret(Interpreter.java:815)
23:44:37 [2021-10-23T03:44:37.662Z] 	at org.mozilla.javascript.InterpretedFunction.call(InterpretedFunction.java:109)
23:44:37 [2021-10-23T03:44:37.662Z] 	at org.mozilla.javascript.ContextFactory.doTopCall(ContextFactory.java:394)
23:44:37 [2021-10-23T03:44:37.662Z] 	at org.mozilla.javascript.ScriptRuntime.doTopCall(ScriptRuntime.java:3091)
23:44:37 [2021-10-23T03:44:37.662Z] 	at org.mozilla.javascript.InterpretedFunction.exec(InterpretedFunction.java:120)
23:44:37 [2021-10-23T03:44:37.662Z] 	at org.mozilla.javascript.Context.evaluateReader(Context.java:1110)
23:44:37 [2021-10-23T03:44:37.662Z] 	at org.eclipse.ease.lang.javascript.rhino.RhinoScriptEngine.internalExecute(RhinoScriptEngine.java:226)
23:44:37 [2021-10-23T03:44:37.662Z] 	at org.eclipse.ease.lang.javascript.rhino.RhinoScriptEngine.execute(RhinoScriptEngine.java:205)
23:44:37 [2021-10-23T03:44:37.662Z] 	at org.eclipse.ease.AbstractScriptEngine.inject(AbstractScriptEngine.java:191)
23:44:37 [2021-10-23T03:44:37.662Z] 	at org.eclipse.ease.AbstractScriptEngine.run(AbstractScriptEngine.java:244)
23:44:37 [2021-10-23T03:44:37.662Z] 	at org.eclipse.core.internal.jobs.Worker.run(Worker.java:63)
23:44:37 [2021-10-23T03:44:37.918Z] Start of script
23:44:37 [2021-10-23T03:44:37.918Z] include file start
23:44:37 [2021-10-23T03:44:37.918Z] Include file processed
23:44:37 [2021-10-23T03:44:37.918Z] line after include file
23:44:37 [2021-10-23T03:44:37.918Z] Result of testMethod = 5
23:44:37 [2021-10-23T03:44:37.918Z] End of script
23:44:37 [2021-10-23T03:44:37.918Z] Start of script
23:44:37 [2021-10-23T03:44:37.918Z] include file start
23:44:37 [2021-10-23T03:44:37.918Z] Include file processed
23:44:37 [2021-10-23T03:44:37.918Z] line after include file
23:44:38 [2021-10-23T03:44:38.174Z] Result of testMethod = 5
23:44:38 [2021-10-23T03:44:38.174Z] End of script
23:44:38 [2021-10-23T03:44:38.430Z] org.eclipse.ease.ScriptEngineCancellationException: Terminated on user request
23:44:38 [2021-10-23T03:44:38.430Z] 	at org.eclipse.ease.debugging.AbstractEaseDebugger.handleEventsInSuspendedState(AbstractEaseDebugger.java:331)
23:44:38 [2021-10-23T03:44:38.430Z] 	at org.eclipse.ease.debugging.AbstractEaseDebugger.suspend(AbstractEaseDebugger.java:257)
23:44:38 [2021-10-23T03:44:38.430Z] 	at org.eclipse.ease.debugging.AbstractEaseDebugger.processLine(AbstractEaseDebugger.java:492)
23:44:38 [2021-10-23T03:44:38.430Z] 	at org.eclipse.ease.lang.javascript.rhino.debugger.RhinoDebugger.access$4(RhinoDebugger.java:1)
23:44:38 [2021-10-23T03:44:38.430Z] 	at org.eclipse.ease.lang.javascript.rhino.debugger.RhinoDebugger$RhinoDebugFrame.onLineChange(RhinoDebugger.java:124)
23:44:38 [2021-10-23T03:44:38.430Z] 	at org.mozilla.javascript.Interpreter.interpretLoop(Interpreter.java:1824)
23:44:38 [2021-10-23T03:44:38.430Z] 	at org.mozilla.javascript.Interpreter.interpret(Interpreter.java:815)
23:44:38 [2021-10-23T03:44:38.430Z] 	at org.mozilla.javascript.InterpretedFunction.call(InterpretedFunction.java:109)
23:44:38 [2021-10-23T03:44:38.430Z] 	at org.mozilla.javascript.ContextFactory.doTopCall(ContextFactory.java:394)
23:44:38 [2021-10-23T03:44:38.430Z] 	at org.mozilla.javascript.ScriptRuntime.doTopCall(ScriptRuntime.java:3091)
23:44:38 [2021-10-23T03:44:38.430Z] 	at org.mozilla.javascript.InterpretedFunction.exec(InterpretedFunction.java:120)
23:44:38 [2021-10-23T03:44:38.430Z] 	at org.mozilla.javascript.Context.evaluateReader(Context.java:1110)
23:44:38 [2021-10-23T03:44:38.430Z] 	at org.eclipse.ease.lang.javascript.rhino.RhinoScriptEngine.internalExecute(RhinoScriptEngine.java:226)
23:44:38 [2021-10-23T03:44:38.430Z] 	at org.eclipse.ease.lang.javascript.rhino.RhinoScriptEngine.execute(RhinoScriptEngine.java:205)
23:44:38 [2021-10-23T03:44:38.430Z] 	at org.eclipse.ease.AbstractScriptEngine.inject(AbstractScriptEngine.java:191)
23:44:38 [2021-10-23T03:44:38.430Z] 	at org.eclipse.ease.AbstractScriptEngine.run(AbstractScriptEngine.java:244)
23:44:38 [2021-10-23T03:44:38.430Z] 	at org.eclipse.core.internal.jobs.Worker.run(Worker.java:63)
23:44:38 [2021-10-23T03:44:38.430Z] Start of script
23:44:38 [2021-10-23T03:44:38.686Z] include file start
23:44:38 [2021-10-23T03:44:38.686Z] Include file processed
23:44:38 [2021-10-23T03:44:38.686Z] line after include file
23:44:38 [2021-10-23T03:44:38.686Z] Result of testMethod = 5
23:44:38 [2021-10-23T03:44:38.686Z] End of script
23:44:38 [2021-10-23T03:44:38.686Z] Start of script
23:44:38 [2021-10-23T03:44:38.686Z] include file start
23:44:38 [2021-10-23T03:44:38.686Z] Include file processed
23:44:38 [2021-10-23T03:44:38.686Z] line after include file
23:44:38 [2021-10-23T03:44:38.942Z] Result of testMethod = 5
23:44:38 [2021-10-23T03:44:38.942Z] End of script
23:44:38 [2021-10-23T03:44:38.942Z] Start of script
23:44:38 [2021-10-23T03:44:38.942Z] include file start
23:44:38 [2021-10-23T03:44:38.942Z] Include file processed
23:44:38 [2021-10-23T03:44:38.942Z] line after include file
23:44:38 [2021-10-23T03:44:38.942Z] Result of testMethod = 5
23:44:39 [2021-10-23T03:44:39.198Z] org.eclipse.ease.ScriptEngineCancellationException: Terminated on user request
23:44:39 [2021-10-23T03:44:39.198Z] 	at org.eclipse.ease.debugging.AbstractEaseDebugger.handleEventsInSuspendedState(AbstractEaseDebugger.java:331)
23:44:39 [2021-10-23T03:44:39.198Z] 	at org.eclipse.ease.debugging.AbstractEaseDebugger.suspend(AbstractEaseDebugger.java:257)
23:44:39 [2021-10-23T03:44:39.198Z] 	at org.eclipse.ease.debugging.AbstractEaseDebugger.processLine(AbstractEaseDebugger.java:492)
23:44:39 [2021-10-23T03:44:39.198Z] 	at org.eclipse.ease.lang.javascript.rhino.debugger.RhinoDebugger.access$4(RhinoDebugger.java:1)
23:44:39 [2021-10-23T03:44:39.198Z] 	at org.eclipse.ease.lang.javascript.rhino.debugger.RhinoDebugger$RhinoDebugFrame.onLineChange(RhinoDebugger.java:124)
23:44:39 [2021-10-23T03:44:39.198Z] 	at org.mozilla.javascript.Interpreter.interpretLoop(Interpreter.java:1824)
23:44:39 [2021-10-23T03:44:39.198Z] 	at org.mozilla.javascript.Interpreter.interpret(Interpreter.java:815)
23:44:39 [2021-10-23T03:44:39.198Z] 	at org.mozilla.javascript.InterpretedFunction.call(InterpretedFunction.java:109)
23:44:39 [2021-10-23T03:44:39.198Z] 	at org.mozilla.javascript.ContextFactory.doTopCall(ContextFactory.java:394)
23:44:39 [2021-10-23T03:44:39.198Z] 	at org.mozilla.javascript.ScriptRuntime.doTopCall(ScriptRuntime.java:3091)
23:44:39 [2021-10-23T03:44:39.198Z] 	at org.mozilla.javascript.InterpretedFunction.exec(InterpretedFunction.java:120)
23:44:39 [2021-10-23T03:44:39.198Z] 	at org.mozilla.javascript.Context.evaluateReader(Context.java:1110)
23:44:39 [2021-10-23T03:44:39.198Z] 	at org.eclipse.ease.lang.javascript.rhino.RhinoScriptEngine.internalExecute(RhinoScriptEngine.java:226)
23:44:39 [2021-10-23T03:44:39.198Z] 	at org.eclipse.ease.lang.javascript.rhino.RhinoScriptEngine.execute(RhinoScriptEngine.java:205)
23:44:39 [2021-10-23T03:44:39.198Z] 	at org.eclipse.ease.AbstractScriptEngine.inject(AbstractScriptEngine.java:191)
23:44:39 [2021-10-23T03:44:39.198Z] 	at org.eclipse.ease.AbstractScriptEngine.run(AbstractScriptEngine.java:244)
23:44:39 [2021-10-23T03:44:39.198Z] 	at org.eclipse.core.internal.jobs.Worker.run(Worker.java:63)
23:44:39 [2021-10-23T03:44:39.454Z] Start of script
23:44:39 [2021-10-23T03:44:39.454Z] include file start
23:44:39 [2021-10-23T03:44:39.454Z] Include file processed
23:44:39 [2021-10-23T03:44:39.454Z] line after include file
23:44:39 [2021-10-23T03:44:39.454Z] Result of testMethod = 5
23:44:39 [2021-10-23T03:44:39.454Z] End of script
23:44:39 [2021-10-23T03:44:39.710Z] org.eclipse.ease.ScriptEngineCancellationException: Terminated on user request
23:44:39 [2021-10-23T03:44:39.710Z] 	at org.eclipse.ease.debugging.AbstractEaseDebugger.handleEventsInSuspendedState(AbstractEaseDebugger.java:331)
23:44:39 [2021-10-23T03:44:39.710Z] 	at org.eclipse.ease.debugging.AbstractEaseDebugger.suspend(AbstractEaseDebugger.java:257)
23:44:39 [2021-10-23T03:44:39.710Z] 	at org.eclipse.ease.debugging.AbstractEaseDebugger.processLine(AbstractEaseDebugger.java:492)
23:44:39 [2021-10-23T03:44:39.710Z] 	at org.eclipse.ease.lang.javascript.rhino.debugger.RhinoDebugger.access$4(RhinoDebugger.java:1)
23:44:39 [2021-10-23T03:44:39.710Z] 	at org.eclipse.ease.lang.javascript.rhino.debugger.RhinoDebugger$RhinoDebugFrame.onLineChange(RhinoDebugger.java:124)
23:44:39 [2021-10-23T03:44:39.710Z] 	at org.mozilla.javascript.Interpreter.interpretLoop(Interpreter.java:1824)
23:44:39 [2021-10-23T03:44:39.710Z] 	at org.mozilla.javascript.Interpreter.interpret(Interpreter.java:815)
23:44:39 [2021-10-23T03:44:39.710Z] 	at org.mozilla.javascript.InterpretedFunction.call(InterpretedFunction.java:109)
23:44:39 [2021-10-23T03:44:39.710Z] 	at org.mozilla.javascript.ContextFactory.doTopCall(ContextFactory.java:394)
23:44:39 [2021-10-23T03:44:39.710Z] 	at org.mozilla.javascript.ScriptRuntime.doTopCall(ScriptRuntime.java:3091)
23:44:39 [2021-10-23T03:44:39.710Z] 	at org.mozilla.javascript.InterpretedFunction.exec(InterpretedFunction.java:120)
23:44:39 [2021-10-23T03:44:39.710Z] 	at org.mozilla.javascript.Context.evaluateReader(Context.java:1110)
23:44:39 [2021-10-23T03:44:39.710Z] 	at org.eclipse.ease.lang.javascript.rhino.RhinoScriptEngine.internalExecute(RhinoScriptEngine.java:226)
23:44:39 [2021-10-23T03:44:39.710Z] 	at org.eclipse.ease.lang.javascript.rhino.RhinoScriptEngine.execute(RhinoScriptEngine.java:205)
23:44:39 [2021-10-23T03:44:39.710Z] 	at org.eclipse.ease.AbstractScriptEngine.inject(AbstractScriptEngine.java:191)
23:44:39 [2021-10-23T03:44:39.710Z] 	at org.eclipse.ease.AbstractScriptEngine.run(AbstractScriptEngine.java:244)
23:44:39 [2021-10-23T03:44:39.710Z] 	at org.eclipse.core.internal.jobs.Worker.run(Worker.java:63)
23:44:39 [2021-10-23T03:44:39.965Z] Start of script
23:44:39 [2021-10-23T03:44:39.965Z] include file start
23:44:39 [2021-10-23T03:44:39.965Z] Include file processed
23:44:39 [2021-10-23T03:44:39.965Z] line after include file
23:44:39 [2021-10-23T03:44:39.965Z] Result of testMethod = 5
23:44:39 [2021-10-23T03:44:39.965Z] End of script
23:44:39 [2021-10-23T03:44:39.965Z] Start of script
23:44:39 [2021-10-23T03:44:39.965Z] include file start
23:44:39 [2021-10-23T03:44:39.965Z] Include file processed
23:44:39 [2021-10-23T03:44:39.965Z] line after include file
23:44:40 [2021-10-23T03:44:40.221Z] Result of testMethod = 5
23:44:40 [2021-10-23T03:44:40.221Z] End of script
23:44:40 [2021-10-23T03:44:40.476Z] org.eclipse.ease.ScriptEngineCancellationException: Terminated on user request
23:44:40 [2021-10-23T03:44:40.476Z] 	at org.eclipse.ease.debugging.AbstractEaseDebugger.handleEventsInSuspendedState(AbstractEaseDebugger.java:331)
23:44:40 [2021-10-23T03:44:40.476Z] 	at org.eclipse.ease.debugging.AbstractEaseDebugger.suspend(AbstractEaseDebugger.java:257)
23:44:40 [2021-10-23T03:44:40.476Z] 	at org.eclipse.ease.debugging.AbstractEaseDebugger.processLine(AbstractEaseDebugger.java:492)
23:44:40 [2021-10-23T03:44:40.476Z] 	at org.eclipse.ease.lang.javascript.rhino.debugger.RhinoDebugger.access$4(RhinoDebugger.java:1)
23:44:40 [2021-10-23T03:44:40.477Z] 	at org.eclipse.ease.lang.javascript.rhino.debugger.RhinoDebugger$RhinoDebugFrame.onLineChange(RhinoDebugger.java:124)
23:44:40 [2021-10-23T03:44:40.477Z] 	at org.mozilla.javascript.Interpreter.interpretLoop(Interpreter.java:1824)
23:44:40 [2021-10-23T03:44:40.477Z] 	at org.mozilla.javascript.Interpreter.interpret(Interpreter.java:815)
23:44:40 [2021-10-23T03:44:40.477Z] 	at org.mozilla.javascript.InterpretedFunction.call(InterpretedFunction.java:109)
23:44:40 [2021-10-23T03:44:40.477Z] 	at org.mozilla.javascript.ContextFactory.doTopCall(ContextFactory.java:394)
23:44:40 [2021-10-23T03:44:40.477Z] 	at org.mozilla.javascript.ScriptRuntime.doTopCall(ScriptRuntime.java:3091)
23:44:40 [2021-10-23T03:44:40.477Z] 	at org.mozilla.javascript.InterpretedFunction.exec(InterpretedFunction.java:120)
23:44:40 [2021-10-23T03:44:40.477Z] 	at org.mozilla.javascript.Context.evaluateReader(Context.java:1110)
23:44:40 [2021-10-23T03:44:40.477Z] 	at org.eclipse.ease.lang.javascript.rhino.RhinoScriptEngine.internalExecute(RhinoScriptEngine.java:226)
23:44:40 [2021-10-23T03:44:40.477Z] 	at org.eclipse.ease.lang.javascript.rhino.RhinoScriptEngine.execute(RhinoScriptEngine.java:205)
23:44:40 [2021-10-23T03:44:40.477Z] 	at org.eclipse.ease.AbstractScriptEngine.inject(AbstractScriptEngine.java:191)
23:44:40 [2021-10-23T03:44:40.477Z] 	at org.eclipse.ease.AbstractScriptEngine.run(AbstractScriptEngine.java:244)
23:44:40 [2021-10-23T03:44:40.477Z] 	at org.eclipse.core.internal.jobs.Worker.run(Worker.java:63)
23:44:40 [2021-10-23T03:44:40.477Z] Start of script
23:44:40 [2021-10-23T03:44:40.477Z] include file start
23:44:40 [2021-10-23T03:44:40.477Z] Include file processed
23:44:40 [2021-10-23T03:44:40.477Z] line after include file
23:44:40 [2021-10-23T03:44:40.733Z] Result of testMethod = 5
23:44:40 [2021-10-23T03:44:40.733Z] End of script
23:44:40 [2021-10-23T03:44:40.989Z] Start of script
23:44:40 [2021-10-23T03:44:40.989Z] include file start
23:44:40 [2021-10-23T03:44:40.990Z] Include file processed
23:44:40 [2021-10-23T03:44:40.990Z] line after include file
23:44:40 [2021-10-23T03:44:40.990Z] Result of testMethod = 5
23:44:40 [2021-10-23T03:44:40.990Z] WARNING: An illegal reflective access operation has occurred
23:44:40 [2021-10-23T03:44:40.990Z] WARNING: Illegal reflective access by org.eclipse.ease.debugging.model.EaseDebugValue (file:/home/jenkins/.m2/repository/org/eclipse/ease/org.eclipse.ease/0.9.0-SNAPSHOT/org.eclipse.ease-0.9.0-SNAPSHOT.jar) to field java.lang.String.hash
23:44:40 [2021-10-23T03:44:40.990Z] WARNING: Please consider reporting this to the maintainers of org.eclipse.ease.debugging.model.EaseDebugValue
23:44:40 [2021-10-23T03:44:40.990Z] WARNING: Use --illegal-access=warn to enable warnings of further illegal reflective access operations
23:44:40 [2021-10-23T03:44:40.990Z] WARNING: All illegal access operations will be denied in a future release
23:44:40 [2021-10-23T03:44:40.990Z] org.eclipse.ease.ScriptEngineCancellationException: Terminated on user request
23:44:40 [2021-10-23T03:44:40.990Z] 	at org.eclipse.ease.debugging.AbstractEaseDebugger.handleEventsInSuspendedState(AbstractEaseDebugger.java:331)
23:44:40 [2021-10-23T03:44:40.990Z] 	at org.eclipse.ease.debugging.AbstractEaseDebugger.suspend(AbstractEaseDebugger.java:257)
23:44:40 [2021-10-23T03:44:40.990Z] 	at org.eclipse.ease.debugging.AbstractEaseDebugger.processLine(AbstractEaseDebugger.java:492)
23:44:40 [2021-10-23T03:44:40.990Z] 	at org.eclipse.ease.lang.javascript.rhino.debugger.RhinoDebugger.access$4(RhinoDebugger.java:1)
23:44:40 [2021-10-23T03:44:40.990Z] 	at org.eclipse.ease.lang.javascript.rhino.debugger.RhinoDebugger$RhinoDebugFrame.onLineChange(RhinoDebugger.java:124)
23:44:40 [2021-10-23T03:44:40.990Z] 	at org.mozilla.javascript.Interpreter.interpretLoop(Interpreter.java:1824)
23:44:40 [2021-10-23T03:44:40.990Z] 	at org.mozilla.javascript.Interpreter.interpret(Interpreter.java:815)
23:44:40 [2021-10-23T03:44:40.990Z] 	at org.mozilla.javascript.InterpretedFunction.call(InterpretedFunction.java:109)
23:44:40 [2021-10-23T03:44:40.990Z] 	at org.mozilla.javascript.ContextFactory.doTopCall(ContextFactory.java:394)
23:44:40 [2021-10-23T03:44:40.990Z] 	at org.mozilla.javascript.ScriptRuntime.doTopCall(ScriptRuntime.java:3091)
23:44:40 [2021-10-23T03:44:40.990Z] 	at org.mozilla.javascript.InterpretedFunction.exec(InterpretedFunction.java:120)
23:44:40 [2021-10-23T03:44:40.990Z] 	at org.mozilla.javascript.Context.evaluateReader(Context.java:1110)
23:44:40 [2021-10-23T03:44:40.990Z] 	at org.eclipse.ease.lang.javascript.rhino.RhinoScriptEngine.internalExecute(RhinoScriptEngine.java:226)
23:44:40 [2021-10-23T03:44:40.990Z] 	at org.eclipse.ease.lang.javascript.rhino.RhinoScriptEngine.execute(RhinoScriptEngine.java:205)
23:44:40 [2021-10-23T03:44:40.990Z] 	at org.eclipse.ease.AbstractScriptEngine.inject(AbstractScriptEngine.java:191)
23:44:40 [2021-10-23T03:44:40.990Z] 	at org.eclipse.ease.AbstractScriptEngine.run(AbstractScriptEngine.java:244)
23:44:40 [2021-10-23T03:44:40.990Z] 	at org.eclipse.core.internal.jobs.Worker.run(Worker.java:63)
23:44:41 [2021-10-23T03:44:41.247Z] Start of script
23:44:41 [2021-10-23T03:44:41.247Z] include file start
23:44:41 [2021-10-23T03:44:41.247Z] Include file processed
23:44:41 [2021-10-23T03:44:41.247Z] line after include file
23:44:41 [2021-10-23T03:44:41.247Z] Result of testMethod = 5
23:44:41 [2021-10-23T03:44:41.247Z] End of script
23:44:41 [2021-10-23T03:44:41.506Z] Start of script
23:44:41 [2021-10-23T03:44:41.506Z] include file start
23:44:41 [2021-10-23T03:44:41.506Z] Include file processed
23:44:41 [2021-10-23T03:44:41.506Z] line after include file
23:44:41 [2021-10-23T03:44:41.506Z] Result of testMethod = 5
23:44:41 [2021-10-23T03:44:41.506Z] End of script
23:44:41 [2021-10-23T03:44:41.764Z] Start of script
23:44:41 [2021-10-23T03:44:41.764Z] include file start
23:44:41 [2021-10-23T03:44:41.764Z] Include file processed
23:44:41 [2021-10-23T03:44:41.764Z] line after include file
23:44:41 [2021-10-23T03:44:41.764Z] Result of testMethod = 5
23:44:41 [2021-10-23T03:44:41.764Z] End of script
23:44:41 [2021-10-23T03:44:41.764Z] Start of script
23:44:42 [2021-10-23T03:44:42.019Z] include file start
23:44:42 [2021-10-23T03:44:42.019Z] Include file processed
23:44:42 [2021-10-23T03:44:42.019Z] line after include file
23:44:42 [2021-10-23T03:44:42.019Z] Result of testMethod = 5
23:44:42 [2021-10-23T03:44:42.019Z] End of script
23:44:42 [2021-10-23T03:44:42.019Z] Start of script
23:44:42 [2021-10-23T03:44:42.019Z] include file start
23:44:42 [2021-10-23T03:44:42.019Z] Include file processed
23:44:42 [2021-10-23T03:44:42.019Z] line after include file
23:44:42 [2021-10-23T03:44:42.275Z] org.eclipse.ease.ScriptEngineCancellationException: Terminated on user request
23:44:42 [2021-10-23T03:44:42.275Z] 	at org.eclipse.ease.debugging.AbstractEaseDebugger.handleEventsInSuspendedState(AbstractEaseDebugger.java:331)
23:44:42 [2021-10-23T03:44:42.275Z] 	at org.eclipse.ease.debugging.AbstractEaseDebugger.suspend(AbstractEaseDebugger.java:257)
23:44:42 [2021-10-23T03:44:42.275Z] 	at org.eclipse.ease.debugging.AbstractEaseDebugger.processLine(AbstractEaseDebugger.java:492)
23:44:42 [2021-10-23T03:44:42.275Z] 	at org.eclipse.ease.lang.javascript.rhino.debugger.RhinoDebugger.access$4(RhinoDebugger.java:1)
23:44:42 [2021-10-23T03:44:42.275Z] 	at org.eclipse.ease.lang.javascript.rhino.debugger.RhinoDebugger$RhinoDebugFrame.onLineChange(RhinoDebugger.java:124)
23:44:42 [2021-10-23T03:44:42.275Z] 	at org.mozilla.javascript.Interpreter.interpretLoop(Interpreter.java:1824)
23:44:42 [2021-10-23T03:44:42.275Z] 	at org.mozilla.javascript.Interpreter.interpret(Interpreter.java:815)
23:44:42 [2021-10-23T03:44:42.275Z] 	at org.mozilla.javascript.InterpretedFunction.call(InterpretedFunction.java:109)
23:44:42 [2021-10-23T03:44:42.275Z] 	at org.mozilla.javascript.ContextFactory.doTopCall(ContextFactory.java:394)
23:44:42 [2021-10-23T03:44:42.275Z] 	at org.mozilla.javascript.ScriptRuntime.doTopCall(ScriptRuntime.java:3091)
23:44:42 [2021-10-23T03:44:42.275Z] 	at org.mozilla.javascript.InterpretedFunction.exec(InterpretedFunction.java:120)
23:44:42 [2021-10-23T03:44:42.275Z] 	at org.mozilla.javascript.Context.evaluateReader(Context.java:1110)
23:44:42 [2021-10-23T03:44:42.275Z] 	at org.eclipse.ease.lang.javascript.rhino.RhinoScriptEngine.internalExecute(RhinoScriptEngine.java:226)
23:44:42 [2021-10-23T03:44:42.275Z] 	at org.eclipse.ease.lang.javascript.rhino.RhinoScriptEngine.execute(RhinoScriptEngine.java:205)
23:44:42 [2021-10-23T03:44:42.275Z] 	at org.eclipse.ease.AbstractScriptEngine.inject(AbstractScriptEngine.java:191)
23:44:42 [2021-10-23T03:44:42.275Z] 	at org.eclipse.ease.AbstractScriptEngine.run(AbstractScriptEngine.java:244)
23:44:42 [2021-10-23T03:44:42.275Z] 	at org.eclipse.core.internal.jobs.Worker.run(Worker.java:63)
23:44:42 [2021-10-23T03:44:42.531Z] Start of script
23:44:42 [2021-10-23T03:44:42.531Z] include file start
23:44:42 [2021-10-23T03:44:42.531Z] Include file processed
23:44:42 [2021-10-23T03:44:42.531Z] line after include file
23:44:42 [2021-10-23T03:44:42.531Z] Result of testMethod = 5
23:44:42 [2021-10-23T03:44:42.531Z] End of script
23:44:42 [2021-10-23T03:44:42.787Z] Start of script
23:44:42 [2021-10-23T03:44:42.787Z] include file start
23:44:42 [2021-10-23T03:44:42.787Z] Include file processed
23:44:42 [2021-10-23T03:44:42.787Z] line after include file
23:44:42 [2021-10-23T03:44:42.787Z] Result of testMethod = 5
23:44:43 [2021-10-23T03:44:43.043Z] org.eclipse.ease.ScriptEngineCancellationException: Terminated on user request
23:44:43 [2021-10-23T03:44:43.043Z] 	at org.eclipse.ease.debugging.AbstractEaseDebugger.handleEventsInSuspendedState(AbstractEaseDebugger.java:331)
23:44:43 [2021-10-23T03:44:43.043Z] 	at org.eclipse.ease.debugging.AbstractEaseDebugger.suspend(AbstractEaseDebugger.java:257)
23:44:43 [2021-10-23T03:44:43.043Z] 	at org.eclipse.ease.debugging.AbstractEaseDebugger.processLine(AbstractEaseDebugger.java:492)
23:44:43 [2021-10-23T03:44:43.043Z] 	at org.eclipse.ease.lang.javascript.rhino.debugger.RhinoDebugger.access$4(RhinoDebugger.java:1)
23:44:43 [2021-10-23T03:44:43.043Z] 	at org.eclipse.ease.lang.javascript.rhino.debugger.RhinoDebugger$RhinoDebugFrame.onLineChange(RhinoDebugger.java:124)
23:44:43 [2021-10-23T03:44:43.043Z] 	at org.mozilla.javascript.Interpreter.interpretLoop(Interpreter.java:1824)
23:44:43 [2021-10-23T03:44:43.043Z] 	at org.mozilla.javascript.Interpreter.interpret(Interpreter.java:815)
23:44:43 [2021-10-23T03:44:43.043Z] 	at org.mozilla.javascript.InterpretedFunction.call(InterpretedFunction.java:109)
23:44:43 [2021-10-23T03:44:43.043Z] 	at org.mozilla.javascript.ContextFactory.doTopCall(ContextFactory.java:394)
23:44:43 [2021-10-23T03:44:43.043Z] 	at org.mozilla.javascript.ScriptRuntime.doTopCall(ScriptRuntime.java:3091)
23:44:43 [2021-10-23T03:44:43.043Z] 	at org.mozilla.javascript.InterpretedFunction.exec(InterpretedFunction.java:120)
23:44:43 [2021-10-23T03:44:43.043Z] 	at org.mozilla.javascript.Context.evaluateReader(Context.java:1110)
23:44:43 [2021-10-23T03:44:43.043Z] 	at org.eclipse.ease.lang.javascript.rhino.RhinoScriptEngine.internalExecute(RhinoScriptEngine.java:226)
23:44:43 [2021-10-23T03:44:43.043Z] 	at org.eclipse.ease.lang.javascript.rhino.RhinoScriptEngine.execute(RhinoScriptEngine.java:205)
23:44:43 [2021-10-23T03:44:43.043Z] 	at org.eclipse.ease.AbstractScriptEngine.inject(AbstractScriptEngine.java:191)
23:44:43 [2021-10-23T03:44:43.043Z] 	at org.eclipse.ease.AbstractScriptEngine.run(AbstractScriptEngine.java:244)
23:44:43 [2021-10-23T03:44:43.043Z] 	at org.eclipse.core.internal.jobs.Worker.run(Worker.java:63)
23:44:43 [2021-10-23T03:44:43.043Z] Start of script
23:44:43 [2021-10-23T03:44:43.043Z] include file start
23:44:43 [2021-10-23T03:44:43.043Z] Include file processed
23:44:43 [2021-10-23T03:44:43.043Z] line after include file
23:44:43 [2021-10-23T03:44:43.043Z] Result of testMethod = 5
23:44:43 [2021-10-23T03:44:43.043Z] End of script
23:44:43 [2021-10-23T03:44:43.299Z] Start of script
23:44:43 [2021-10-23T03:44:43.299Z] include file start
23:44:43 [2021-10-23T03:44:43.299Z] Include file processed
23:44:43 [2021-10-23T03:44:43.299Z] line after include file
23:44:43 [2021-10-23T03:44:43.555Z] Result of testMethod = 5
23:44:43 [2021-10-23T03:44:43.555Z] End of script
23:44:43 [2021-10-23T03:44:43.555Z] Start of script
23:44:43 [2021-10-23T03:44:43.555Z] include file start
23:44:43 [2021-10-23T03:44:43.555Z] Include file processed
23:44:43 [2021-10-23T03:44:43.555Z] line after include file
23:44:43 [2021-10-23T03:44:43.811Z] Result of testMethod = 5
23:44:43 [2021-10-23T03:44:43.811Z] End of script
23:44:43 [2021-10-23T03:44:43.811Z] Start of script
23:44:43 [2021-10-23T03:44:43.811Z] include file start
23:44:43 [2021-10-23T03:44:43.811Z] Include file processed
23:44:43 [2021-10-23T03:44:43.811Z] line after include file
23:44:43 [2021-10-23T03:44:43.811Z] Result of testMethod = 5
23:44:44 [2021-10-23T03:44:44.068Z] End of script
23:44:44 [2021-10-23T03:44:44.068Z] Start of script
23:44:44 [2021-10-23T03:44:44.068Z] include file start
23:44:44 [2021-10-23T03:44:44.068Z] Include file processed
23:44:44 [2021-10-23T03:44:44.068Z] line after include file
23:44:44 [2021-10-23T03:44:44.068Z] Result of testMethod = 5
23:44:44 [2021-10-23T03:44:44.324Z] org.eclipse.ease.ScriptEngineCancellationException: Terminated on user request
23:44:44 [2021-10-23T03:44:44.324Z] 	at org.eclipse.ease.debugging.AbstractEaseDebugger.handleEventsInSuspendedState(AbstractEaseDebugger.java:331)
23:44:44 [2021-10-23T03:44:44.324Z] 	at org.eclipse.ease.debugging.AbstractEaseDebugger.suspend(AbstractEaseDebugger.java:257)
23:44:44 [2021-10-23T03:44:44.324Z] 	at org.eclipse.ease.debugging.AbstractEaseDebugger.processLine(AbstractEaseDebugger.java:492)
23:44:44 [2021-10-23T03:44:44.324Z] 	at org.eclipse.ease.lang.javascript.rhino.debugger.RhinoDebugger.access$4(RhinoDebugger.java:1)
23:44:44 [2021-10-23T03:44:44.324Z] 	at org.eclipse.ease.lang.javascript.rhino.debugger.RhinoDebugger$RhinoDebugFrame.onLineChange(RhinoDebugger.java:124)
23:44:44 [2021-10-23T03:44:44.324Z] 	at org.mozilla.javascript.Interpreter.interpretLoop(Interpreter.java:1824)
23:44:44 [2021-10-23T03:44:44.324Z] 	at org.mozilla.javascript.Interpreter.interpret(Interpreter.java:815)
23:44:44 [2021-10-23T03:44:44.324Z] 	at org.mozilla.javascript.InterpretedFunction.call(InterpretedFunction.java:109)
23:44:44 [2021-10-23T03:44:44.324Z] 	at org.mozilla.javascript.ContextFactory.doTopCall(ContextFactory.java:394)
23:44:44 [2021-10-23T03:44:44.324Z] 	at org.mozilla.javascript.ScriptRuntime.doTopCall(ScriptRuntime.java:3091)
23:44:44 [2021-10-23T03:44:44.324Z] 	at org.mozilla.javascript.InterpretedFunction.exec(InterpretedFunction.java:120)
23:44:44 [2021-10-23T03:44:44.324Z] 	at org.mozilla.javascript.Context.evaluateReader(Context.java:1110)
23:44:44 [2021-10-23T03:44:44.324Z] 	at org.eclipse.ease.lang.javascript.rhino.RhinoScriptEngine.internalExecute(RhinoScriptEngine.java:226)
23:44:44 [2021-10-23T03:44:44.324Z] 	at org.eclipse.ease.lang.javascript.rhino.RhinoScriptEngine.execute(RhinoScriptEngine.java:205)
23:44:44 [2021-10-23T03:44:44.324Z] 	at org.eclipse.ease.AbstractScriptEngine.inject(AbstractScriptEngine.java:191)
23:44:44 [2021-10-23T03:44:44.324Z] 	at org.eclipse.ease.AbstractScriptEngine.run(AbstractScriptEngine.java:244)
23:44:44 [2021-10-23T03:44:44.324Z] 	at org.eclipse.core.internal.jobs.Worker.run(Worker.java:63)
23:44:44 [2021-10-23T03:44:44.324Z] Start of script
23:44:44 [2021-10-23T03:44:44.324Z] include file start
23:44:44 [2021-10-23T03:44:44.324Z] Include file processed
23:44:44 [2021-10-23T03:44:44.324Z] line after include file
23:44:44 [2021-10-23T03:44:44.324Z] Result of testMethod = 5
23:44:44 [2021-10-23T03:44:44.580Z] End of script
23:44:44 [2021-10-23T03:44:44.580Z] Start of script
23:44:44 [2021-10-23T03:44:44.580Z] include file start
23:44:44 [2021-10-23T03:44:44.580Z] Include file processed
23:44:44 [2021-10-23T03:44:44.580Z] line after include file
23:44:44 [2021-10-23T03:44:44.580Z] Result of testMethod = 5
23:44:44 [2021-10-23T03:44:44.836Z] org.eclipse.ease.ScriptEngineCancellationException: Terminated on user request
23:44:44 [2021-10-23T03:44:44.836Z] 	at org.eclipse.ease.debugging.AbstractEaseDebugger.handleEventsInSuspendedState(AbstractEaseDebugger.java:331)
23:44:44 [2021-10-23T03:44:44.836Z] 	at org.eclipse.ease.debugging.AbstractEaseDebugger.suspend(AbstractEaseDebugger.java:257)
23:44:44 [2021-10-23T03:44:44.836Z] 	at org.eclipse.ease.debugging.AbstractEaseDebugger.processLine(AbstractEaseDebugger.java:492)
23:44:44 [2021-10-23T03:44:44.836Z] 	at org.eclipse.ease.lang.javascript.rhino.debugger.RhinoDebugger.access$4(RhinoDebugger.java:1)
23:44:44 [2021-10-23T03:44:44.836Z] 	at org.eclipse.ease.lang.javascript.rhino.debugger.RhinoDebugger$RhinoDebugFrame.onLineChange(RhinoDebugger.java:124)
23:44:44 [2021-10-23T03:44:44.836Z] 	at org.mozilla.javascript.Interpreter.interpretLoop(Interpreter.java:1824)
23:44:44 [2021-10-23T03:44:44.836Z] 	at org.mozilla.javascript.Interpreter.interpret(Interpreter.java:815)
23:44:44 [2021-10-23T03:44:44.836Z] 	at org.mozilla.javascript.InterpretedFunction.call(InterpretedFunction.java:109)
23:44:44 [2021-10-23T03:44:44.836Z] 	at org.mozilla.javascript.ContextFactory.doTopCall(ContextFactory.java:394)
23:44:44 [2021-10-23T03:44:44.836Z] 	at org.mozilla.javascript.ScriptRuntime.doTopCall(ScriptRuntime.java:3091)
23:44:44 [2021-10-23T03:44:44.836Z] 	at org.mozilla.javascript.InterpretedFunction.exec(InterpretedFunction.java:120)
23:44:44 [2021-10-23T03:44:44.836Z] 	at org.mozilla.javascript.Context.evaluateReader(Context.java:1110)
23:44:44 [2021-10-23T03:44:44.836Z] 	at org.eclipse.ease.lang.javascript.rhino.RhinoScriptEngine.internalExecute(RhinoScriptEngine.java:226)
23:44:44 [2021-10-23T03:44:44.836Z] 	at org.eclipse.ease.lang.javascript.rhino.RhinoScriptEngine.execute(RhinoScriptEngine.java:205)
23:44:44 [2021-10-23T03:44:44.836Z] 	at org.eclipse.ease.AbstractScriptEngine.inject(AbstractScriptEngine.java:191)
23:44:44 [2021-10-23T03:44:44.836Z] 	at org.eclipse.ease.AbstractScriptEngine.run(AbstractScriptEngine.java:244)
23:44:44 [2021-10-23T03:44:44.836Z] 	at org.eclipse.core.internal.jobs.Worker.run(Worker.java:63)
23:44:45 [2021-10-23T03:44:45.092Z] org.eclipse.ease.ScriptEngineCancellationException: Terminated on user request
23:44:45 [2021-10-23T03:44:45.092Z] 	at org.eclipse.ease.debugging.AbstractEaseDebugger.handleEventsInSuspendedState(AbstractEaseDebugger.java:331)
23:44:45 [2021-10-23T03:44:45.092Z] 	at org.eclipse.ease.debugging.AbstractEaseDebugger.suspend(AbstractEaseDebugger.java:257)
23:44:45 [2021-10-23T03:44:45.092Z] 	at org.eclipse.ease.debugging.AbstractEaseDebugger.processLine(AbstractEaseDebugger.java:492)
23:44:45 [2021-10-23T03:44:45.092Z] 	at org.eclipse.ease.lang.javascript.rhino.debugger.RhinoDebugger.access$4(RhinoDebugger.java:1)
23:44:45 [2021-10-23T03:44:45.092Z] 	at org.eclipse.ease.lang.javascript.rhino.debugger.RhinoDebugger$RhinoDebugFrame.onLineChange(RhinoDebugger.java:124)
23:44:45 [2021-10-23T03:44:45.092Z] 	at org.mozilla.javascript.Interpreter.interpretLoop(Interpreter.java:1824)
23:44:45 [2021-10-23T03:44:45.092Z] 	at org.mozilla.javascript.Interpreter.interpret(Interpreter.java:815)
23:44:45 [2021-10-23T03:44:45.092Z] 	at org.mozilla.javascript.InterpretedFunction.call(InterpretedFunction.java:109)
23:44:45 [2021-10-23T03:44:45.092Z] 	at org.mozilla.javascript.ContextFactory.doTopCall(ContextFactory.java:394)
23:44:45 [2021-10-23T03:44:45.092Z] 	at org.mozilla.javascript.ScriptRuntime.doTopCall(ScriptRuntime.java:3091)
23:44:45 [2021-10-23T03:44:45.092Z] 	at org.mozilla.javascript.InterpretedFunction.exec(InterpretedFunction.java:120)
23:44:45 [2021-10-23T03:44:45.092Z] 	at org.mozilla.javascript.Context.evaluateReader(Context.java:1110)
23:44:45 [2021-10-23T03:44:45.092Z] 	at org.eclipse.ease.lang.javascript.rhino.RhinoScriptEngine.internalExecute(RhinoScriptEngine.java:226)
23:44:45 [2021-10-23T03:44:45.092Z] 	at org.eclipse.ease.lang.javascript.rhino.RhinoScriptEngine.execute(RhinoScriptEngine.java:205)
23:44:45 [2021-10-23T03:44:45.092Z] 	at org.eclipse.ease.AbstractScriptEngine.inject(AbstractScriptEngine.java:191)
23:44:45 [2021-10-23T03:44:45.092Z] 	at org.eclipse.ease.AbstractScriptEngine.run(AbstractScriptEngine.java:244)
23:44:45 [2021-10-23T03:44:45.092Z] 	at org.eclipse.core.internal.jobs.Worker.run(Worker.java:63)
23:44:45 [2021-10-23T03:44:45.092Z] Start of script
23:44:45 [2021-10-23T03:44:45.092Z] include file start
23:44:45 [2021-10-23T03:44:45.092Z] Include file processed
23:44:45 [2021-10-23T03:44:45.092Z] line after include file
23:44:45 [2021-10-23T03:44:45.092Z] Result of testMethod = 5
23:44:45 [2021-10-23T03:44:45.092Z] End of script
23:44:45 [2021-10-23T03:44:45.348Z] Start of script
23:44:45 [2021-10-23T03:44:45.348Z] include file start
23:44:45 [2021-10-23T03:44:45.348Z] Include file processed
23:44:45 [2021-10-23T03:44:45.348Z] line after include file
23:44:45 [2021-10-23T03:44:45.603Z] Result of testMethod = 5
23:44:45 [2021-10-23T03:44:45.603Z] End of script
23:44:45 [2021-10-23T03:44:45.603Z] Start of script
23:44:45 [2021-10-23T03:44:45.603Z] include file start
23:44:45 [2021-10-23T03:44:45.603Z] Include file processed
23:44:45 [2021-10-23T03:44:45.603Z] line after include file
23:44:45 [2021-10-23T03:44:45.603Z] Result of testMethod = 5
23:44:45 [2021-10-23T03:44:45.603Z] End of script
23:44:45 [2021-10-23T03:44:45.858Z] Tests run: 42, Failures: 0, Errors: 0, Skipped: 0, Time elapsed: 10.99 s - in org.eclipse.ease.lang.javascript.rhino.RhinoDebugTest
23:44:45 [2021-10-23T03:44:45.858Z] disconnectProcessInSuspendedState  Time elapsed: 0.308 s
23:44:45 [2021-10-23T03:44:45.858Z] stepReturnIncludeCommand  Time elapsed: 0.214 s
23:44:45 [2021-10-23T03:44:45.858Z] arrayVariableSorting  Time elapsed: 0.306 s
23:44:45 [2021-10-23T03:44:45.858Z] stepOverOnDebugTarget  Time elapsed: 0.309 s
23:44:45 [2021-10-23T03:44:45.858Z] hasDebugTarget  Time elapsed: 0.104 s
23:44:45 [2021-10-23T03:44:45.858Z] disconnectThreadInSuspendedState  Time elapsed: 0.206 s
23:44:45 [2021-10-23T03:44:45.858Z] stepReturnOnDebugTarget  Time elapsed: 0.307 s
23:44:45 [2021-10-23T03:44:45.858Z] nullVariable  Time elapsed: 0.306 s
23:44:45 [2021-10-23T03:44:45.858Z] stepOverOnStackFrame  Time elapsed: 0.306 s
23:44:45 [2021-10-23T03:44:45.858Z] resumeOnDebugTarget  Time elapsed: 0.205 s
23:44:45 [2021-10-23T03:44:45.858Z] modifyVariableKeepingType  Time elapsed: 0.406 s
23:44:45 [2021-10-23T03:44:45.858Z] resumeOnLastIncludeLine  Time elapsed: 0.206 s
23:44:45 [2021-10-23T03:44:45.858Z] stepReturnOnStackFrame  Time elapsed: 0.306 s
23:44:45 [2021-10-23T03:44:45.858Z] terminateStackFrameInSuspendedState  Time elapsed: 0.205 s
23:44:45 [2021-10-23T03:44:45.858Z] breakpointLocation  Time elapsed: 0.206 s
23:44:45 [2021-10-23T03:44:45.858Z] stepReturnOnThread  Time elapsed: 0.307 s
23:44:45 [2021-10-23T03:44:45.858Z] javaClassVariable  Time elapsed: 0.307 s
23:44:45 [2021-10-23T03:44:45.858Z] stepIntoOnThread  Time elapsed: 0.306 s
23:44:45 [2021-10-23T03:44:45.858Z] terminateThreadInSuspendedState  Time elapsed: 0.206 s
23:44:45 [2021-10-23T03:44:45.858Z] resumeOnThread  Time elapsed: 0.205 s
23:44:45 [2021-10-23T03:44:45.858Z] stepIntoOnStackFrame  Time elapsed: 0.306 s
23:44:45 [2021-10-23T03:44:45.858Z] terminateProcessInSuspendedState  Time elapsed: 0.205 s
23:44:45 [2021-10-23T03:44:45.858Z] stepOverOnProcess  Time elapsed: 0.311 s
23:44:45 [2021-10-23T03:44:45.858Z] nativeArrayVariable  Time elapsed: 0.307 s
23:44:45 [2021-10-23T03:44:45.858Z] disconnectDebugTargetInSuspendedState  Time elapsed: 0.205 s
23:44:45 [2021-10-23T03:44:45.858Z] stepIntoOnProcess  Time elapsed: 0.306 s
23:44:45 [2021-10-23T03:44:45.858Z] terminatedState  Time elapsed: 0.103 s
23:44:45 [2021-10-23T03:44:45.858Z] stepOverIncludeCommand  Time elapsed: 0.305 s
23:44:45 [2021-10-23T03:44:45.858Z] innerScopeVariableBeforeOuterScopeVariable  Time elapsed: 0.304 s
23:44:45 [2021-10-23T03:44:45.858Z] stepIntoIncludeCommand  Time elapsed: 0.305 s
23:44:45 [2021-10-23T03:44:45.858Z] primitiveStringVariable  Time elapsed: 0.306 s
23:44:45 [2021-10-23T03:44:45.858Z] resumeOnProcess  Time elapsed: 0.206 s
23:44:45 [2021-10-23T03:44:45.858Z] stepIntoOnDebugTarget  Time elapsed: 0.306 s
23:44:45 [2021-10-23T03:44:45.858Z] stepOverOnThread  Time elapsed: 0.307 s
23:44:45 [2021-10-23T03:44:45.858Z] suspendedState  Time elapsed: 0.205 s
23:44:45 [2021-10-23T03:44:45.858Z] primitiveDoubleVariable  Time elapsed: 0.304 s
23:44:45 [2021-10-23T03:44:45.858Z] resumeOnStackFrame  Time elapsed: 0.204 s
23:44:45 [2021-10-23T03:44:45.858Z] nativeObjectVariable  Time elapsed: 0.306 s
23:44:45 [2021-10-23T03:44:45.858Z] terminateDebugTargetInSuspendedState  Time elapsed: 0.205 s
23:44:45 [2021-10-23T03:44:45.858Z] disconnectStackFrameInSuspendedState  Time elapsed: 0.204 s
23:44:45 [2021-10-23T03:44:45.858Z] stepReturnOnProcess  Time elapsed: 0.306 s
23:44:45 [2021-10-23T03:44:45.858Z] evaluateWatchExpression  Time elapsed: 0.223 s
23:44:45 [2021-10-23T03:44:45.858Z] Running org.eclipse.ease.lang.javascript.rhino.RhinoScriptEngineTest
23:44:45 [2021-10-23T03:44:45.858Z] org.eclipse.ease.ScriptExecutionException: JavaError: java.lang.Exception
23:44:45 [2021-10-23T03:44:45.858Z] 	at <unknown source>
23:44:45 [2021-10-23T03:44:45.858Z] 
23:44:45 [2021-10-23T03:44:45.858Z] Java Stacktrace:
23:44:45 [2021-10-23T03:44:45.858Z] java.lang.Exception
23:44:45 [2021-10-23T03:44:45.858Z] 	at java.base/jdk.internal.reflect.NativeConstructorAccessorImpl.newInstance0(Native Method)
23:44:45 [2021-10-23T03:44:45.858Z] 	at java.base/jdk.internal.reflect.NativeConstructorAccessorImpl.newInstance(NativeConstructorAccessorImpl.java:64)
23:44:45 [2021-10-23T03:44:45.858Z] 	at java.base/jdk.internal.reflect.DelegatingConstructorAccessorImpl.newInstance(DelegatingConstructorAccessorImpl.java:45)
23:44:45 [2021-10-23T03:44:45.858Z] 	at java.base/java.lang.reflect.Constructor.newInstanceWithCaller(Constructor.java:500)
23:44:45 [2021-10-23T03:44:45.858Z] 	at java.base/java.lang.reflect.Constructor.newInstance(Constructor.java:481)
23:44:45 [2021-10-23T03:44:45.858Z] 	at org.mozilla.javascript.MemberBox.newInstance(MemberBox.java:159)
23:44:45 [2021-10-23T03:44:45.858Z] 	at org.mozilla.javascript.NativeJavaClass.constructInternal(NativeJavaClass.java:266)
23:44:45 [2021-10-23T03:44:45.858Z] 	at org.mozilla.javascript.NativeJavaClass.constructSpecific(NativeJavaClass.java:205)
23:44:45 [2021-10-23T03:44:45.858Z] 	at org.mozilla.javascript.NativeJavaClass.construct(NativeJavaClass.java:166)
23:44:45 [2021-10-23T03:44:45.858Z] 	at org.mozilla.javascript.ScriptRuntime.newObject(ScriptRuntime.java:2349)
23:44:45 [2021-10-23T03:44:45.858Z] 	at org.mozilla.javascript.gen.c_33._c_script_0(Unknown Source)
23:44:45 [2021-10-23T03:44:45.858Z] 	at org.mozilla.javascript.gen.c_33.call(Unknown Source)
23:44:45 [2021-10-23T03:44:45.858Z] 	at org.mozilla.javascript.ContextFactory.doTopCall(ContextFactory.java:394)
23:44:45 [2021-10-23T03:44:45.858Z] 	at org.mozilla.javascript.ScriptRuntime.doTopCall(ScriptRuntime.java:3091)
23:44:45 [2021-10-23T03:44:45.858Z] 	at org.mozilla.javascript.gen.c_33.call(Unknown Source)
23:44:45 [2021-10-23T03:44:45.858Z] 	at org.mozilla.javascript.gen.c_33.exec(Unknown Source)
23:44:45 [2021-10-23T03:44:45.858Z] 	at org.mozilla.javascript.Context.evaluateReader(Context.java:1110)
23:44:45 [2021-10-23T03:44:45.858Z] 	at org.eclipse.ease.lang.javascript.rhino.RhinoScriptEngine.internalExecute(RhinoScriptEngine.java:226)
23:44:45 [2021-10-23T03:44:45.858Z] 	at org.eclipse.ease.lang.javascript.rhino.RhinoScriptEngine.execute(RhinoScriptEngine.java:205)
23:44:45 [2021-10-23T03:44:45.858Z] 	at org.eclipse.ease.AbstractScriptEngine.inject(AbstractScriptEngine.java:191)
23:44:45 [2021-10-23T03:44:45.858Z] 	at org.eclipse.ease.AbstractScriptEngine.run(AbstractScriptEngine.java:244)
23:44:45 [2021-10-23T03:44:45.858Z] 	at org.eclipse.core.internal.jobs.Worker.run(Worker.java:63)
23:44:45 [2021-10-23T03:44:45.858Z] org.eclipse.ease.ScriptExecutionException: ScriptException: test
23:44:45 [2021-10-23T03:44:45.858Z] 	at <unknown source>
23:44:45 [2021-10-23T03:44:45.858Z] org.eclipse.ease.ScriptExecutionException: ScriptException: JavaScript
23:44:45 [2021-10-23T03:44:45.858Z] 	at <unknown source>
23:44:45 [2021-10-23T03:44:45.858Z] org.eclipse.ease.ScriptExecutionException: SyntaxError: unterminated string literal (#1)
23:44:45 [2021-10-23T03:44:45.858Z] 'asdf
23:44:45 [2021-10-23T03:44:45.858Z]     ^
23:44:45 [2021-10-23T03:44:45.858Z] 	at <unknown source>
23:44:45 [2021-10-23T03:44:45.858Z] org.eclipse.ease.ScriptExecutionException: TypeError: Cannot call method "foobar" of undefined
23:44:45 [2021-10-23T03:44:45.858Z] 	at <unknown source>
23:44:45 [2021-10-23T03:44:45.858Z] org.eclipse.ease.ScriptExecutionException: JavaError: NotThere cannot be found by org.mozilla.javascript_1.7.5.v201504281450
23:44:45 [2021-10-23T03:44:45.858Z] 	at <unknown source>
23:44:45 [2021-10-23T03:44:45.858Z] 
23:44:45 [2021-10-23T03:44:45.858Z] Java Stacktrace:
23:44:45 [2021-10-23T03:44:45.858Z] java.lang.ClassNotFoundException: NotThere cannot be found by org.mozilla.javascript_1.7.5.v201504281450
23:44:45 [2021-10-23T03:44:45.858Z] 	at org.eclipse.osgi.internal.loader.BundleLoader.findClassInternal(BundleLoader.java:511)
23:44:45 [2021-10-23T03:44:45.858Z] 	at org.eclipse.osgi.internal.loader.BundleLoader.findClass(BundleLoader.java:422)
23:44:45 [2021-10-23T03:44:45.858Z] 	at org.eclipse.osgi.internal.loader.BundleLoader.findClass(BundleLoader.java:414)
23:44:45 [2021-10-23T03:44:45.858Z] 	at org.eclipse.osgi.internal.loader.ModuleClassLoader.loadClass(ModuleClassLoader.java:153)
23:44:45 [2021-10-23T03:44:45.858Z] 	at java.base/java.lang.ClassLoader.loadClass(ClassLoader.java:522)
23:44:45 [2021-10-23T03:44:45.858Z] 	at java.base/java.lang.Class.forName0(Native Method)
23:44:45 [2021-10-23T03:44:45.858Z] 	at java.base/java.lang.Class.forName(Class.java:377)
23:44:45 [2021-10-23T03:44:45.858Z] 	at java.base/jdk.internal.reflect.NativeMethodAccessorImpl.invoke0(Native Method)
23:44:45 [2021-10-23T03:44:45.858Z] 	at java.base/jdk.internal.reflect.NativeMethodAccessorImpl.invoke(NativeMethodAccessorImpl.java:64)
23:44:45 [2021-10-23T03:44:45.858Z] 	at java.base/jdk.internal.reflect.DelegatingMethodAccessorImpl.invoke(DelegatingMethodAccessorImpl.java:43)
23:44:45 [2021-10-23T03:44:45.858Z] 	at java.base/java.lang.reflect.Method.invoke(Method.java:564)
23:44:45 [2021-10-23T03:44:45.858Z] 	at org.mozilla.javascript.MemberBox.invoke(MemberBox.java:126)
23:44:45 [2021-10-23T03:44:45.858Z] 	at org.mozilla.javascript.NativeJavaMethod.call(NativeJavaMethod.java:225)
23:44:45 [2021-10-23T03:44:45.858Z] 	at org.mozilla.javascript.optimizer.OptRuntime.call1(OptRuntime.java:32)
23:44:45 [2021-10-23T03:44:45.858Z] 	at org.mozilla.javascript.gen.c_56._c_script_0(Unknown Source)
23:44:45 [2021-10-23T03:44:45.858Z] 	at org.mozilla.javascript.gen.c_56.call(Unknown Source)
23:44:45 [2021-10-23T03:44:45.858Z] 	at org.mozilla.javascript.ContextFactory.doTopCall(ContextFactory.java:394)
23:44:45 [2021-10-23T03:44:45.858Z] 	at org.mozilla.javascript.ScriptRuntime.doTopCall(ScriptRuntime.java:3091)
23:44:45 [2021-10-23T03:44:45.858Z] 	at org.mozilla.javascript.gen.c_56.call(Unknown Source)
23:44:45 [2021-10-23T03:44:45.858Z] 	at org.mozilla.javascript.gen.c_56.exec(Unknown Source)
23:44:45 [2021-10-23T03:44:45.858Z] 	at org.mozilla.javascript.Context.evaluateReader(Context.java:1110)
23:44:45 [2021-10-23T03:44:45.858Z] 	at org.eclipse.ease.lang.javascript.rhino.RhinoScriptEngine.internalExecute(RhinoScriptEngine.java:226)
23:44:45 [2021-10-23T03:44:45.858Z] 	at org.eclipse.ease.lang.javascript.rhino.RhinoScriptEngine.execute(RhinoScriptEngine.java:205)
23:44:45 [2021-10-23T03:44:45.858Z] 	at org.eclipse.ease.AbstractScriptEngine.inject(AbstractScriptEngine.java:191)
23:44:45 [2021-10-23T03:44:45.858Z] 	at org.eclipse.ease.AbstractScriptEngine.run(AbstractScriptEngine.java:244)
23:44:45 [2021-10-23T03:44:45.859Z] 	at org.eclipse.core.internal.jobs.Worker.run(Worker.java:63)
23:44:45 [2021-10-23T03:44:45.859Z] Tests run: 11, Failures: 0, Errors: 0, Skipped: 0, Time elapsed: 0.114 s - in org.eclipse.ease.lang.javascript.rhino.RhinoScriptEngineTest
23:44:45 [2021-10-23T03:44:45.859Z] execute_java_class_instantiation  Time elapsed: 0.011 s
23:44:45 [2021-10-23T03:44:45.859Z] execute_environment_module_code_with_optional_parameters  Time elapsed: 0.01 s
23:44:45 [2021-10-23T03:44:45.859Z] execute_throws_java_exception  Time elapsed: 0.013 s
23:44:45 [2021-10-23T03:44:45.859Z] execute_throws_java_class  Time elapsed: 0.01 s
23:44:45 [2021-10-23T03:44:45.859Z] execute_javascript_assignment  Time elapsed: 0.009 s
23:44:45 [2021-10-23T03:44:45.859Z] execute_eclipse_class_instantiation  Time elapsed: 0.013 s
23:44:45 [2021-10-23T03:44:45.859Z] execute_throws_javascript_object  Time elapsed: 0.009 s
23:44:45 [2021-10-23T03:44:45.859Z] execute_throws_syntax_error  Time elapsed: 0.008 s
23:44:45 [2021-10-23T03:44:45.859Z] execute_throws_javascript_runtime_error  Time elapsed: 0.01 s
23:44:45 [2021-10-23T03:44:45.859Z] execute_environment_module_code  Time elapsed: 0.009 s
23:44:45 [2021-10-23T03:44:45.859Z] execute_throws_wrapped_java_exception  Time elapsed: 0.009 s
23:44:45 [2021-10-23T03:44:45.859Z] 
23:44:45 [2021-10-23T03:44:45.859Z] Results:
23:44:45 [2021-10-23T03:44:45.859Z] 
23:44:45 [2021-10-23T03:44:45.859Z] Tests run: 70, Failures: 0, Errors: 0, Skipped: 0
23:44:45 [2021-10-23T03:44:45.859Z] 
23:44:46 [2021-10-23T03:44:46.113Z] [INFO] All tests passed!
23:44:46 [2021-10-23T03:44:46.113Z] [INFO] 
23:44:46 [2021-10-23T03:44:46.113Z] [INFO] -------< org.eclipse.ease:org.eclipse.ease.lang.javascript.test >-------
23:44:46 [2021-10-23T03:44:46.113Z] [INFO] Building org.eclipse.ease.lang.javascript.test 0.9.0-SNAPSHOT      [5/9]
23:44:46 [2021-10-23T03:44:46.113Z] [INFO] ------------------------[ eclipse-test-plugin ]-------------------------
23:44:46 [2021-10-23T03:44:46.113Z] [INFO] 
23:44:46 [2021-10-23T03:44:46.113Z] [INFO] --- tycho-packaging-plugin:2.2.0:build-qualifier (default-build-qualifier) @ org.eclipse.ease.lang.javascript.test ---
23:44:46 [2021-10-23T03:44:46.113Z] [INFO] The project's OSGi version is 0.9.0.I202107211616
23:44:46 [2021-10-23T03:44:46.113Z] [INFO] 
23:44:46 [2021-10-23T03:44:46.113Z] [INFO] --- tycho-packaging-plugin:2.2.0:validate-id (default-validate-id) @ org.eclipse.ease.lang.javascript.test ---
23:44:46 [2021-10-23T03:44:46.113Z] [INFO] 
23:44:46 [2021-10-23T03:44:46.113Z] [INFO] --- tycho-packaging-plugin:2.2.0:validate-version (default-validate-version) @ org.eclipse.ease.lang.javascript.test ---
23:44:46 [2021-10-23T03:44:46.114Z] [INFO] 
23:44:46 [2021-10-23T03:44:46.114Z] [INFO] --- maven-resources-plugin:2.4.3:resources (default-resources) @ org.eclipse.ease.lang.javascript.test ---
23:44:46 [2021-10-23T03:44:46.114Z] [INFO] Using 'UTF-8' encoding to copy filtered resources.
23:44:46 [2021-10-23T03:44:46.114Z] [INFO] skip non existing resourceDirectory /home/jenkins/agent/workspace/ease.verify.core.target.2018-12/tests/org.eclipse.ease.lang.javascript.test/src/main/resources
23:44:46 [2021-10-23T03:44:46.114Z] [INFO] 
23:44:46 [2021-10-23T03:44:46.114Z] [INFO] --- tycho-compiler-plugin:2.2.0:compile (default-compile) @ org.eclipse.ease.lang.javascript.test ---
23:44:46 [2021-10-23T03:44:46.114Z] [INFO] Nothing to compile - all classes are up to date
23:44:46 [2021-10-23T03:44:46.114Z] [INFO] 
23:44:46 [2021-10-23T03:44:46.114Z] [INFO] --- maven-resources-plugin:2.4.3:testResources (default-testResources) @ org.eclipse.ease.lang.javascript.test ---
23:44:46 [2021-10-23T03:44:46.114Z] [INFO] Using 'UTF-8' encoding to copy filtered resources.
23:44:46 [2021-10-23T03:44:46.114Z] [INFO] skip non existing resourceDirectory /home/jenkins/agent/workspace/ease.verify.core.target.2018-12/tests/org.eclipse.ease.lang.javascript.test/src/test/resources
23:44:46 [2021-10-23T03:44:46.114Z] [INFO] 
23:44:46 [2021-10-23T03:44:46.114Z] [INFO] --- target-platform-configuration:2.2.0:target-platform (default-target-platform) @ org.eclipse.ease.lang.javascript.test ---
23:44:46 [2021-10-23T03:44:46.114Z] [INFO] 
23:44:46 [2021-10-23T03:44:46.114Z] [INFO] --- tycho-packaging-plugin:2.2.0:package-plugin (default-package-plugin) @ org.eclipse.ease.lang.javascript.test ---
23:44:46 [2021-10-23T03:44:46.114Z] [INFO] Building jar: /home/jenkins/agent/workspace/ease.verify.core.target.2018-12/tests/org.eclipse.ease.lang.javascript.test/target/org.eclipse.ease.lang.javascript.test-0.9.0-SNAPSHOT.jar
23:44:46 [2021-10-23T03:44:46.114Z] [INFO] 
23:44:46 [2021-10-23T03:44:46.114Z] [INFO] --- tycho-p2-plugin:2.2.0:p2-metadata-default (default-p2-metadata-default) @ org.eclipse.ease.lang.javascript.test ---
23:44:46 [2021-10-23T03:44:46.114Z] [INFO] 
23:44:46 [2021-10-23T03:44:46.114Z] [INFO] --- jacoco-maven-plugin:0.8.6:prepare-agent (jacoco-initialize) @ org.eclipse.ease.lang.javascript.test ---
23:44:46 [2021-10-23T03:44:46.114Z] [INFO] tycho.testArgLine set to -javaagent:/home/jenkins/.m2/repository/org/jacoco/org.jacoco.agent/0.8.6/org.jacoco.agent-0.8.6-runtime.jar=destfile=/home/jenkins/agent/workspace/ease.verify.core.target.2018-12/tests/org.eclipse.ease.lang.javascript.test/target/jacoco.exec,output=file
23:44:46 [2021-10-23T03:44:46.114Z] [INFO] 
23:44:46 [2021-10-23T03:44:46.114Z] [INFO] --- tycho-surefire-plugin:2.2.0:test (default-test) @ org.eclipse.ease.lang.javascript.test ---
23:44:46 [2021-10-23T03:44:46.371Z] [INFO] Executing Test Runtime with timeout 0, logs (if any) will be placed at: /home/jenkins/agent/workspace/ease.verify.core.target.2018-12/tests/org.eclipse.ease.lang.javascript.test/target/work/data/.metadata/.log
23:44:46 [2021-10-23T03:44:46.371Z] [INFO] Command line:
23:44:46 [2021-10-23T03:44:46.371Z] 	[/opt/tools/java/openjdk/jdk-15/15.0.2+7/bin/java, -Dosgi.noShutdown=false, -Dosgi.os=linux, -Dosgi.ws=gtk, -Dosgi.arch=x86_64, -javaagent:/home/jenkins/.m2/repository/org/jacoco/org.jacoco.agent/0.8.6/org.jacoco.agent-0.8.6-runtime.jar=destfile=/home/jenkins/agent/workspace/ease.verify.core.target.2018-12/tests/org.eclipse.ease.lang.javascript.test/target/jacoco.exec,output=file, -Dosgi.clean=true, -jar, /home/jenkins/.m2/repository/p2/osgi/bundle/org.eclipse.equinox.launcher/1.5.200.v20180922-1751/org.eclipse.equinox.launcher-1.5.200.v20180922-1751.jar, -data, /home/jenkins/agent/workspace/ease.verify.core.target.2018-12/tests/org.eclipse.ease.lang.javascript.test/target/work/data, -install, /home/jenkins/agent/workspace/ease.verify.core.target.2018-12/tests/org.eclipse.ease.lang.javascript.test/target/work, -configuration, /home/jenkins/agent/workspace/ease.verify.core.target.2018-12/tests/org.eclipse.ease.lang.javascript.test/target/work/configuration, -application, org.eclipse.tycho.surefire.osgibooter.headlesstest, -testproperties, /home/jenkins/agent/workspace/ease.verify.core.target.2018-12/tests/org.eclipse.ease.lang.javascript.test/target/surefire.properties]
23:44:46 [2021-10-23T03:44:46.371Z] Picked up JAVA_TOOL_OPTIONS: -Dmaven.ext.class.path="/home/jenkins/agent/workspace/ease.verify.core.target.2018-12@tmp/withMaven93c549ad/pipeline-maven-spy.jar" -Dorg.jenkinsci.plugins.pipeline.maven.reportsFolder="/home/jenkins/agent/workspace/ease.verify.core.target.2018-12@tmp/withMaven93c549ad" 
23:44:48 [2021-10-23T03:44:48.944Z] Running org.eclipse.ease.lang.javascript.JavaScriptCodeFactoryTest
23:44:49 [2021-10-23T03:44:49.200Z] Tests run: 11, Failures: 0, Errors: 0, Skipped: 0, Time elapsed: 0.103 s - in org.eclipse.ease.lang.javascript.JavaScriptCodeFactoryTest
23:44:49 [2021-10-23T03:44:49.200Z] getSaveVariableName_creates_random_string_for_invalid_characters  Time elapsed: 0.073 s
23:44:49 [2021-10-23T03:44:49.200Z] getNullString_equals_null  Time elapsed: 0.006 s
23:44:49 [2021-10-23T03:44:49.200Z] getSaveVariableName_prefixes_keywords_with_underscore  Time elapsed: 0 s
23:44:49 [2021-10-23T03:44:49.200Z] getSaveVariableName_does_not_alter_save_name  Time elapsed: 0.001 s
23:44:49 [2021-10-23T03:44:49.200Z] classInstantiation_creates_instance_with_parameters  Time elapsed: 0.001 s
23:44:49 [2021-10-23T03:44:49.200Z] createCommentedString_creates_block_comment  Time elapsed: 0.002 s
23:44:49 [2021-10-23T03:44:49.200Z] createCommentedString_creates_single_line_comment  Time elapsed: 0.001 s
23:44:49 [2021-10-23T03:44:49.200Z] classInstantiation_creates_default_instance  Time elapsed: 0.001 s
23:44:49 [2021-10-23T03:44:49.200Z] createCommentedString_creates_multi_line_comment  Time elapsed: 0 s
23:44:49 [2021-10-23T03:44:49.200Z] getSaveVariableName_replaces_invalid_characters  Time elapsed: 0 s
23:44:49 [2021-10-23T03:44:49.200Z] getSaveVariableName_prefixes_numbers_with_underscore  Time elapsed: 0.001 s
23:44:49 [2021-10-23T03:44:49.200Z] 
23:44:49 [2021-10-23T03:44:49.200Z] Results:
23:44:49 [2021-10-23T03:44:49.200Z] 
23:44:49 [2021-10-23T03:44:49.200Z] Tests run: 11, Failures: 0, Errors: 0, Skipped: 0
23:44:49 [2021-10-23T03:44:49.200Z] 
23:44:49 [2021-10-23T03:44:49.455Z] [INFO] All tests passed!
23:44:49 [2021-10-23T03:44:49.455Z] [INFO] 
23:44:49 [2021-10-23T03:44:49.455Z] [INFO] ---------< org.eclipse.ease:org.eclipse.ease.lang.python.test >---------
23:44:49 [2021-10-23T03:44:49.455Z] [INFO] Building org.eclipse.ease.lang.python.test 0.9.0-SNAPSHOT          [6/9]
23:44:49 [2021-10-23T03:44:49.455Z] [INFO] ------------------------[ eclipse-test-plugin ]-------------------------
23:44:49 [2021-10-23T03:44:49.455Z] [INFO] 
23:44:49 [2021-10-23T03:44:49.456Z] [INFO] --- tycho-packaging-plugin:2.2.0:build-qualifier (default-build-qualifier) @ org.eclipse.ease.lang.python.test ---
23:44:49 [2021-10-23T03:44:49.456Z] [INFO] The project's OSGi version is 0.9.0.I202110010807
23:44:49 [2021-10-23T03:44:49.456Z] [INFO] 
23:44:49 [2021-10-23T03:44:49.456Z] [INFO] --- tycho-packaging-plugin:2.2.0:validate-id (default-validate-id) @ org.eclipse.ease.lang.python.test ---
23:44:49 [2021-10-23T03:44:49.456Z] [INFO] 
23:44:49 [2021-10-23T03:44:49.456Z] [INFO] --- tycho-packaging-plugin:2.2.0:validate-version (default-validate-version) @ org.eclipse.ease.lang.python.test ---
23:44:49 [2021-10-23T03:44:49.456Z] [INFO] 
23:44:49 [2021-10-23T03:44:49.456Z] [INFO] --- maven-resources-plugin:2.4.3:resources (default-resources) @ org.eclipse.ease.lang.python.test ---
23:44:49 [2021-10-23T03:44:49.456Z] [INFO] Using 'UTF-8' encoding to copy filtered resources.
23:44:49 [2021-10-23T03:44:49.456Z] [INFO] skip non existing resourceDirectory /home/jenkins/agent/workspace/ease.verify.core.target.2018-12/tests/org.eclipse.ease.lang.python.test/src/main/resources
23:44:49 [2021-10-23T03:44:49.456Z] [INFO] 
23:44:49 [2021-10-23T03:44:49.456Z] [INFO] --- tycho-compiler-plugin:2.2.0:compile (default-compile) @ org.eclipse.ease.lang.python.test ---
23:44:49 [2021-10-23T03:44:49.456Z] [INFO] Nothing to compile - all classes are up to date
23:44:49 [2021-10-23T03:44:49.456Z] [INFO] 
23:44:49 [2021-10-23T03:44:49.456Z] [INFO] --- maven-resources-plugin:2.4.3:testResources (default-testResources) @ org.eclipse.ease.lang.python.test ---
23:44:49 [2021-10-23T03:44:49.456Z] [INFO] Using 'UTF-8' encoding to copy filtered resources.
23:44:49 [2021-10-23T03:44:49.456Z] [INFO] skip non existing resourceDirectory /home/jenkins/agent/workspace/ease.verify.core.target.2018-12/tests/org.eclipse.ease.lang.python.test/src/test/resources
23:44:49 [2021-10-23T03:44:49.456Z] [INFO] 
23:44:49 [2021-10-23T03:44:49.456Z] [INFO] --- target-platform-configuration:2.2.0:target-platform (default-target-platform) @ org.eclipse.ease.lang.python.test ---
23:44:49 [2021-10-23T03:44:49.456Z] [INFO] 
23:44:49 [2021-10-23T03:44:49.456Z] [INFO] --- tycho-packaging-plugin:2.2.0:package-plugin (default-package-plugin) @ org.eclipse.ease.lang.python.test ---
23:44:49 [2021-10-23T03:44:49.456Z] [INFO] Building jar: /home/jenkins/agent/workspace/ease.verify.core.target.2018-12/tests/org.eclipse.ease.lang.python.test/target/org.eclipse.ease.lang.python.test-0.9.0-SNAPSHOT.jar
23:44:49 [2021-10-23T03:44:49.456Z] [INFO] 
23:44:49 [2021-10-23T03:44:49.456Z] [INFO] --- tycho-p2-plugin:2.2.0:p2-metadata-default (default-p2-metadata-default) @ org.eclipse.ease.lang.python.test ---
23:44:49 [2021-10-23T03:44:49.456Z] [INFO] 
23:44:49 [2021-10-23T03:44:49.456Z] [INFO] --- jacoco-maven-plugin:0.8.6:prepare-agent (jacoco-initialize) @ org.eclipse.ease.lang.python.test ---
23:44:49 [2021-10-23T03:44:49.456Z] [INFO] tycho.testArgLine set to -javaagent:/home/jenkins/.m2/repository/org/jacoco/org.jacoco.agent/0.8.6/org.jacoco.agent-0.8.6-runtime.jar=destfile=/home/jenkins/agent/workspace/ease.verify.core.target.2018-12/tests/org.eclipse.ease.lang.python.test/target/jacoco.exec,output=file
23:44:49 [2021-10-23T03:44:49.456Z] [INFO] 
23:44:49 [2021-10-23T03:44:49.456Z] [INFO] --- tycho-surefire-plugin:2.2.0:test (default-test) @ org.eclipse.ease.lang.python.test ---
23:44:50 [2021-10-23T03:44:50.017Z] [INFO] Executing Test Runtime with timeout 0, logs (if any) will be placed at: /home/jenkins/agent/workspace/ease.verify.core.target.2018-12/tests/org.eclipse.ease.lang.python.test/target/work/data/.metadata/.log
23:44:50 [2021-10-23T03:44:50.017Z] [INFO] Command line:
23:44:50 [2021-10-23T03:44:50.017Z] 	[/opt/tools/java/openjdk/jdk-15/15.0.2+7/bin/java, -Dosgi.noShutdown=false, -Dosgi.os=linux, -Dosgi.ws=gtk, -Dosgi.arch=x86_64, -javaagent:/home/jenkins/.m2/repository/org/jacoco/org.jacoco.agent/0.8.6/org.jacoco.agent-0.8.6-runtime.jar=destfile=/home/jenkins/agent/workspace/ease.verify.core.target.2018-12/tests/org.eclipse.ease.lang.python.test/target/jacoco.exec,output=file, -Dosgi.clean=true, -jar, /home/jenkins/.m2/repository/p2/osgi/bundle/org.eclipse.equinox.launcher/1.5.200.v20180922-1751/org.eclipse.equinox.launcher-1.5.200.v20180922-1751.jar, -data, /home/jenkins/agent/workspace/ease.verify.core.target.2018-12/tests/org.eclipse.ease.lang.python.test/target/work/data, -install, /home/jenkins/agent/workspace/ease.verify.core.target.2018-12/tests/org.eclipse.ease.lang.python.test/target/work, -configuration, /home/jenkins/agent/workspace/ease.verify.core.target.2018-12/tests/org.eclipse.ease.lang.python.test/target/work/configuration, -application, org.eclipse.tycho.surefire.osgibooter.headlesstest, -testproperties, /home/jenkins/agent/workspace/ease.verify.core.target.2018-12/tests/org.eclipse.ease.lang.python.test/target/surefire.properties]
23:44:50 [2021-10-23T03:44:50.017Z] Picked up JAVA_TOOL_OPTIONS: -Dmaven.ext.class.path="/home/jenkins/agent/workspace/ease.verify.core.target.2018-12@tmp/withMaven93c549ad/pipeline-maven-spy.jar" -Dorg.jenkinsci.plugins.pipeline.maven.reportsFolder="/home/jenkins/agent/workspace/ease.verify.core.target.2018-12@tmp/withMaven93c549ad" 
23:44:52 [2021-10-23T03:44:52.535Z] Running org.eclipse.ease.lang.python.PyDevPathImporterTest
23:44:53 [2021-10-23T03:44:53.467Z] Tests run: 5, Failures: 0, Errors: 0, Skipped: 0, Time elapsed: 1.083 s - in org.eclipse.ease.lang.python.PyDevPathImporterTest
23:44:53 [2021-10-23T03:44:53.467Z] createEngine_registers_engine_execution_listener  Time elapsed: 0.619 s
23:44:53 [2021-10-23T03:44:53.467Z] notify_does_not_throwwhen_PyDev_plugins_are_not_available  Time elapsed: 0.278 s
23:44:53 [2021-10-23T03:44:53.467Z] notify_does_not_throw_for_non_PyDev_project  Time elapsed: 0.001 s
23:44:53 [2021-10-23T03:44:53.467Z] notify_escapes_path_on_windows  Time elapsed: 0.167 s
23:44:53 [2021-10-23T03:44:53.467Z] notify_registers_project_paths  Time elapsed: 0.001 s
23:44:53 [2021-10-23T03:44:53.467Z] Running org.eclipse.ease.lang.python.PythonCodeFactoryTest
23:44:53 [2021-10-23T03:44:53.467Z] Tests run: 3, Failures: 0, Errors: 0, Skipped: 0, Time elapsed: 0.07 s - in org.eclipse.ease.lang.python.PythonCodeFactoryTest
23:44:53 [2021-10-23T03:44:53.467Z] createFunctionWrapper_creates_return_andParameters_for_Py4J  Time elapsed: 0.066 s
23:44:53 [2021-10-23T03:44:53.467Z] testCommentCreator  Time elapsed: 0.001 s
23:44:53 [2021-10-23T03:44:53.467Z] createFunctionWrapper_creates_void_return_types_for_Py4J  Time elapsed: 0.001 s
23:44:53 [2021-10-23T03:44:53.467Z] 
23:44:53 [2021-10-23T03:44:53.467Z] Results:
23:44:53 [2021-10-23T03:44:53.467Z] 
23:44:53 [2021-10-23T03:44:53.467Z] Tests run: 8, Failures: 0, Errors: 0, Skipped: 0
23:44:53 [2021-10-23T03:44:53.467Z] 
23:44:53 [2021-10-23T03:44:53.742Z] [INFO] All tests passed!
23:44:53 [2021-10-23T03:44:53.742Z] [INFO] 
23:44:53 [2021-10-23T03:44:53.742Z] [INFO] -----< org.eclipse.ease:org.eclipse.ease.lang.python.jython.test >------
23:44:53 [2021-10-23T03:44:53.742Z] [INFO] Building org.eclipse.ease.lang.python.jython.test 0.9.0-SNAPSHOT   [7/9]
23:44:53 [2021-10-23T03:44:53.742Z] [INFO] ------------------------[ eclipse-test-plugin ]-------------------------
23:44:53 [2021-10-23T03:44:53.742Z] [INFO] 
23:44:53 [2021-10-23T03:44:53.742Z] [INFO] --- tycho-packaging-plugin:2.2.0:build-qualifier (default-build-qualifier) @ org.eclipse.ease.lang.python.jython.test ---
23:44:53 [2021-10-23T03:44:53.742Z] [INFO] The project's OSGi version is 0.9.0.I202106220815
23:44:53 [2021-10-23T03:44:53.742Z] [INFO] 
23:44:53 [2021-10-23T03:44:53.742Z] [INFO] --- tycho-packaging-plugin:2.2.0:validate-id (default-validate-id) @ org.eclipse.ease.lang.python.jython.test ---
23:44:53 [2021-10-23T03:44:53.742Z] [INFO] 
23:44:53 [2021-10-23T03:44:53.742Z] [INFO] --- tycho-packaging-plugin:2.2.0:validate-version (default-validate-version) @ org.eclipse.ease.lang.python.jython.test ---
23:44:53 [2021-10-23T03:44:53.742Z] [INFO] 
23:44:53 [2021-10-23T03:44:53.742Z] [INFO] --- maven-resources-plugin:2.4.3:resources (default-resources) @ org.eclipse.ease.lang.python.jython.test ---
23:44:53 [2021-10-23T03:44:53.742Z] [INFO] Using 'UTF-8' encoding to copy filtered resources.
23:44:53 [2021-10-23T03:44:53.742Z] [INFO] skip non existing resourceDirectory /home/jenkins/agent/workspace/ease.verify.core.target.2018-12/tests/org.eclipse.ease.lang.python.jython.test/src/main/resources
23:44:53 [2021-10-23T03:44:53.742Z] [INFO] 
23:44:53 [2021-10-23T03:44:53.742Z] [INFO] --- tycho-compiler-plugin:2.2.0:compile (default-compile) @ org.eclipse.ease.lang.python.jython.test ---
23:44:53 [2021-10-23T03:44:53.742Z] [INFO] Nothing to compile - all classes are up to date
23:44:53 [2021-10-23T03:44:53.742Z] [INFO] 
23:44:53 [2021-10-23T03:44:53.742Z] [INFO] --- maven-resources-plugin:2.4.3:testResources (default-testResources) @ org.eclipse.ease.lang.python.jython.test ---
23:44:53 [2021-10-23T03:44:53.742Z] [INFO] Using 'UTF-8' encoding to copy filtered resources.
23:44:53 [2021-10-23T03:44:53.742Z] [INFO] skip non existing resourceDirectory /home/jenkins/agent/workspace/ease.verify.core.target.2018-12/tests/org.eclipse.ease.lang.python.jython.test/src/test/resources
23:44:53 [2021-10-23T03:44:53.742Z] [INFO] 
23:44:53 [2021-10-23T03:44:53.742Z] [INFO] --- target-platform-configuration:2.2.0:target-platform (default-target-platform) @ org.eclipse.ease.lang.python.jython.test ---
23:44:53 [2021-10-23T03:44:53.742Z] [INFO] 
23:44:53 [2021-10-23T03:44:53.742Z] [INFO] --- tycho-packaging-plugin:2.2.0:package-plugin (default-package-plugin) @ org.eclipse.ease.lang.python.jython.test ---
23:44:53 [2021-10-23T03:44:53.742Z] [INFO] Building jar: /home/jenkins/agent/workspace/ease.verify.core.target.2018-12/tests/org.eclipse.ease.lang.python.jython.test/target/org.eclipse.ease.lang.python.jython.test-0.9.0-SNAPSHOT.jar
23:44:53 [2021-10-23T03:44:53.742Z] [INFO] 
23:44:53 [2021-10-23T03:44:53.743Z] [INFO] --- tycho-p2-plugin:2.2.0:p2-metadata-default (default-p2-metadata-default) @ org.eclipse.ease.lang.python.jython.test ---
23:44:53 [2021-10-23T03:44:53.743Z] [INFO] 
23:44:53 [2021-10-23T03:44:53.743Z] [INFO] --- jacoco-maven-plugin:0.8.6:prepare-agent (jacoco-initialize) @ org.eclipse.ease.lang.python.jython.test ---
23:44:53 [2021-10-23T03:44:53.743Z] [INFO] tycho.testArgLine set to -javaagent:/home/jenkins/.m2/repository/org/jacoco/org.jacoco.agent/0.8.6/org.jacoco.agent-0.8.6-runtime.jar=destfile=/home/jenkins/agent/workspace/ease.verify.core.target.2018-12/tests/org.eclipse.ease.lang.python.jython.test/target/jacoco.exec,output=file
23:44:53 [2021-10-23T03:44:53.743Z] [INFO] 
23:44:53 [2021-10-23T03:44:53.743Z] [INFO] --- tycho-surefire-plugin:2.2.0:test (default-test) @ org.eclipse.ease.lang.python.jython.test ---
23:44:54 [2021-10-23T03:44:54.303Z] [INFO] Executing Test Runtime with timeout 0, logs (if any) will be placed at: /home/jenkins/agent/workspace/ease.verify.core.target.2018-12/tests/org.eclipse.ease.lang.python.jython.test/target/work/data/.metadata/.log
23:44:54 [2021-10-23T03:44:54.303Z] [INFO] Command line:
23:44:54 [2021-10-23T03:44:54.303Z] 	[/opt/tools/java/openjdk/jdk-15/15.0.2+7/bin/java, -Dosgi.noShutdown=false, -Dosgi.os=linux, -Dosgi.ws=gtk, -Dosgi.arch=x86_64, -javaagent:/home/jenkins/.m2/repository/org/jacoco/org.jacoco.agent/0.8.6/org.jacoco.agent-0.8.6-runtime.jar=destfile=/home/jenkins/agent/workspace/ease.verify.core.target.2018-12/tests/org.eclipse.ease.lang.python.jython.test/target/jacoco.exec,output=file, -Dosgi.clean=true, -jar, /home/jenkins/.m2/repository/p2/osgi/bundle/org.eclipse.equinox.launcher/1.5.200.v20180922-1751/org.eclipse.equinox.launcher-1.5.200.v20180922-1751.jar, -data, /home/jenkins/agent/workspace/ease.verify.core.target.2018-12/tests/org.eclipse.ease.lang.python.jython.test/target/work/data, -install, /home/jenkins/agent/workspace/ease.verify.core.target.2018-12/tests/org.eclipse.ease.lang.python.jython.test/target/work, -configuration, /home/jenkins/agent/workspace/ease.verify.core.target.2018-12/tests/org.eclipse.ease.lang.python.jython.test/target/work/configuration, -application, org.eclipse.tycho.surefire.osgibooter.headlesstest, -testproperties, /home/jenkins/agent/workspace/ease.verify.core.target.2018-12/tests/org.eclipse.ease.lang.python.jython.test/target/surefire.properties]
23:44:54 [2021-10-23T03:44:54.303Z] Picked up JAVA_TOOL_OPTIONS: -Dmaven.ext.class.path="/home/jenkins/agent/workspace/ease.verify.core.target.2018-12@tmp/withMaven93c549ad/pipeline-maven-spy.jar" -Dorg.jenkinsci.plugins.pipeline.maven.reportsFolder="/home/jenkins/agent/workspace/ease.verify.core.target.2018-12@tmp/withMaven93c549ad" 
23:44:56 [2021-10-23T03:44:56.830Z] WARNING: An illegal reflective access operation has occurred
23:44:56 [2021-10-23T03:44:56.830Z] WARNING: Illegal reflective access by org.python.core.PySystemState (file:/home/jenkins/agent/workspace/ease.verify.core.target.2018-12/tests/org.eclipse.ease.lang.python.jython.test/target/work/plugins/org.jython_2.7.0.I202104151016/jython.jar) to method java.io.Console.encoding()
23:44:56 [2021-10-23T03:44:56.830Z] WARNING: Please consider reporting this to the maintainers of org.python.core.PySystemState
23:44:56 [2021-10-23T03:44:56.830Z] WARNING: Use --illegal-access=warn to enable warnings of further illegal reflective access operations
23:44:56 [2021-10-23T03:44:56.830Z] WARNING: All illegal access operations will be denied in a future release
23:44:57 [2021-10-23T03:44:57.401Z] Running org.eclipse.ease.lang.python.jython.debugger.JythonDebugTest
23:44:59 [2021-10-23T03:44:59.304Z] Start of script
23:44:59 [2021-10-23T03:44:59.559Z] include file start
23:44:59 [2021-10-23T03:44:59.559Z] include file processed
23:44:59 [2021-10-23T03:44:59.559Z] Result of testMethod = 5
23:44:59 [2021-10-23T03:44:59.559Z] End of script
23:44:59 [2021-10-23T03:44:59.559Z] Start of script
23:44:59 [2021-10-23T03:44:59.559Z] include file start
23:44:59 [2021-10-23T03:44:59.559Z] include file processed
23:44:59 [2021-10-23T03:44:59.559Z] Result of testMethod = 5
23:44:59 [2021-10-23T03:44:59.559Z] End of script
23:44:59 [2021-10-23T03:44:59.814Z] Start of script
23:44:59 [2021-10-23T03:44:59.814Z] include file start
23:44:59 [2021-10-23T03:44:59.814Z] include file processed
23:44:59 [2021-10-23T03:44:59.814Z] Result of testMethod = 5
23:44:59 [2021-10-23T03:44:59.814Z] End of script
23:45:00 [2021-10-23T03:45:00.070Z] Start of script
23:45:00 [2021-10-23T03:45:00.070Z] include file start
23:45:00 [2021-10-23T03:45:00.070Z] include file processed
23:45:00 [2021-10-23T03:45:00.325Z] Result of testMethod = 5
23:45:00 [2021-10-23T03:45:00.325Z] End of script
23:45:00 [2021-10-23T03:45:00.581Z] Start of script
23:45:00 [2021-10-23T03:45:00.581Z] include file start
23:45:00 [2021-10-23T03:45:00.581Z] include file processed
23:45:00 [2021-10-23T03:45:00.581Z] Result of testMethod = 5
23:45:00 [2021-10-23T03:45:00.581Z] End of script
23:45:00 [2021-10-23T03:45:00.836Z] Start of script
23:45:00 [2021-10-23T03:45:00.836Z] include file start
23:45:00 [2021-10-23T03:45:00.836Z] include file processed
23:45:01 [2021-10-23T03:45:01.092Z] Result of testMethod = 5
23:45:01 [2021-10-23T03:45:01.092Z] End of script
23:45:01 [2021-10-23T03:45:01.092Z] Start of script
23:45:01 [2021-10-23T03:45:01.092Z] include file start
23:45:01 [2021-10-23T03:45:01.092Z] include file processed
23:45:01 [2021-10-23T03:45:01.092Z] Result of testMethod = 5
23:45:01 [2021-10-23T03:45:01.349Z] Traceback (most recent call last):
23:45:01 [2021-10-23T03:45:01.349Z]   File "(none)", line 184, in run
23:45:01 [2021-10-23T03:45:01.349Z]   File "__ref_L/Debug Test/Main.py_kuezhzxkfj", line 23, in <module>
23:45:01 [2021-10-23T03:45:01.349Z]   File "(none)", line 161, in trace_dispatch
23:45:01 [2021-10-23T03:45:01.349Z] 	at org.eclipse.ease.debugging.AbstractEaseDebugger.handleEventsInSuspendedState(AbstractEaseDebugger.java:331)
23:45:01 [2021-10-23T03:45:01.349Z] 	at org.eclipse.ease.debugging.AbstractEaseDebugger.suspend(AbstractEaseDebugger.java:257)
23:45:01 [2021-10-23T03:45:01.349Z] 	at org.eclipse.ease.debugging.AbstractEaseDebugger.processLine(AbstractEaseDebugger.java:492)
23:45:01 [2021-10-23T03:45:01.349Z] 	at org.eclipse.ease.lang.python.debugger.PythonDebugger.traceDispatch(PythonDebugger.java:179)
23:45:01 [2021-10-23T03:45:01.349Z] 	at org.eclipse.ease.lang.python.jython.debugger.JythonDebugger.traceDispatch(JythonDebugger.java:46)
23:45:01 [2021-10-23T03:45:01.349Z] 	at jdk.internal.reflect.GeneratedMethodAccessor25.invoke(Unknown Source)
23:45:01 [2021-10-23T03:45:01.349Z] 	at java.base/jdk.internal.reflect.DelegatingMethodAccessorImpl.invoke(DelegatingMethodAccessorImpl.java:43)
23:45:01 [2021-10-23T03:45:01.349Z] 	at java.base/java.lang.reflect.Method.invoke(Method.java:564)
23:45:01 [2021-10-23T03:45:01.349Z] 
23:45:01 [2021-10-23T03:45:01.349Z] org.eclipse.ease.ScriptEngineCancellationException: org.eclipse.ease.ScriptEngineCancellationException: Terminated on user request
23:45:01 [2021-10-23T03:45:01.349Z] Start of script
23:45:01 [2021-10-23T03:45:01.349Z] include file start
23:45:01 [2021-10-23T03:45:01.349Z] include file processed
23:45:01 [2021-10-23T03:45:01.604Z] Result of testMethod = 5
23:45:01 [2021-10-23T03:45:01.604Z] End of script
23:45:01 [2021-10-23T03:45:01.860Z] Start of script
23:45:01 [2021-10-23T03:45:01.860Z] include file start
23:45:01 [2021-10-23T03:45:01.860Z] include file processed
23:45:01 [2021-10-23T03:45:01.860Z] Result of testMethod = 5
23:45:01 [2021-10-23T03:45:01.860Z] End of script
23:45:01 [2021-10-23T03:45:01.860Z] Start of script
23:45:01 [2021-10-23T03:45:01.860Z] include file start
23:45:01 [2021-10-23T03:45:01.860Z] include file processed
23:45:02 [2021-10-23T03:45:02.422Z] Traceback (most recent call last):
23:45:02 [2021-10-23T03:45:02.422Z]   File "(none)", line 184, in run
23:45:02 [2021-10-23T03:45:02.422Z]   File "__ref_L/Debug Test/Main.py_ounqceznfd", line 22, in <module>
23:45:02 [2021-10-23T03:45:02.422Z]   File "(none)", line 161, in trace_dispatch
23:45:02 [2021-10-23T03:45:02.422Z] 	at org.eclipse.ease.debugging.AbstractEaseDebugger.handleEventsInSuspendedState(AbstractEaseDebugger.java:331)
23:45:02 [2021-10-23T03:45:02.422Z] 	at org.eclipse.ease.debugging.AbstractEaseDebugger.suspend(AbstractEaseDebugger.java:257)
23:45:02 [2021-10-23T03:45:02.422Z] 	at org.eclipse.ease.debugging.AbstractEaseDebugger.processLine(AbstractEaseDebugger.java:512)
23:45:02 [2021-10-23T03:45:02.422Z] 	at org.eclipse.ease.lang.python.debugger.PythonDebugger.traceDispatch(PythonDebugger.java:179)
23:45:02 [2021-10-23T03:45:02.422Z] 	at org.eclipse.ease.lang.python.jython.debugger.JythonDebugger.traceDispatch(JythonDebugger.java:46)
23:45:02 [2021-10-23T03:45:02.422Z] 	at jdk.internal.reflect.GeneratedMethodAccessor25.invoke(Unknown Source)
23:45:02 [2021-10-23T03:45:02.423Z] 	at java.base/jdk.internal.reflect.DelegatingMethodAccessorImpl.invoke(DelegatingMethodAccessorImpl.java:43)
23:45:02 [2021-10-23T03:45:02.423Z] 	at java.base/java.lang.reflect.Method.invoke(Method.java:564)
23:45:02 [2021-10-23T03:45:02.423Z] 
23:45:02 [2021-10-23T03:45:02.423Z] org.eclipse.ease.ScriptEngineCancellationException: org.eclipse.ease.ScriptEngineCancellationException: Terminated on user request
23:45:02 [2021-10-23T03:45:02.423Z] Start of script
23:45:02 [2021-10-23T03:45:02.423Z] include file start
23:45:02 [2021-10-23T03:45:02.423Z] include file processed
23:45:02 [2021-10-23T03:45:02.423Z] Result of testMethod = 5
23:45:02 [2021-10-23T03:45:02.423Z] End of script
23:45:02 [2021-10-23T03:45:02.678Z] Start of script
23:45:02 [2021-10-23T03:45:02.678Z] include file start
23:45:02 [2021-10-23T03:45:02.679Z] include file processed
23:45:02 [2021-10-23T03:45:02.934Z] Result of testMethod = 5
23:45:02 [2021-10-23T03:45:02.934Z] End of script
23:45:02 [2021-10-23T03:45:02.934Z] Traceback (most recent call last):
23:45:02 [2021-10-23T03:45:02.934Z]   File "(none)", line 184, in run
23:45:02 [2021-10-23T03:45:02.934Z]   File "__ref_L/Debug Test/Main.py_kwziixguev", line 1, in <module>
23:45:02 [2021-10-23T03:45:02.934Z]   File "(none)", line 161, in trace_dispatch
23:45:02 [2021-10-23T03:45:02.934Z] 	at org.eclipse.ease.debugging.AbstractEaseDebugger.handleEventsInSuspendedState(AbstractEaseDebugger.java:331)
23:45:02 [2021-10-23T03:45:02.934Z] 	at org.eclipse.ease.debugging.AbstractEaseDebugger.suspend(AbstractEaseDebugger.java:257)
23:45:02 [2021-10-23T03:45:02.934Z] 	at org.eclipse.ease.debugging.AbstractEaseDebugger.processLine(AbstractEaseDebugger.java:492)
23:45:02 [2021-10-23T03:45:02.934Z] 	at org.eclipse.ease.lang.python.debugger.PythonDebugger.traceDispatch(PythonDebugger.java:179)
23:45:02 [2021-10-23T03:45:02.934Z] 	at org.eclipse.ease.lang.python.jython.debugger.JythonDebugger.traceDispatch(JythonDebugger.java:46)
23:45:02 [2021-10-23T03:45:02.934Z] 	at jdk.internal.reflect.GeneratedMethodAccessor25.invoke(Unknown Source)
23:45:02 [2021-10-23T03:45:02.934Z] 	at java.base/jdk.internal.reflect.DelegatingMethodAccessorImpl.invoke(DelegatingMethodAccessorImpl.java:43)
23:45:02 [2021-10-23T03:45:02.934Z] 	at java.base/java.lang.reflect.Method.invoke(Method.java:564)
23:45:02 [2021-10-23T03:45:02.934Z] 
23:45:02 [2021-10-23T03:45:02.934Z] org.eclipse.ease.ScriptEngineCancellationException: org.eclipse.ease.ScriptEngineCancellationException: Terminated on user request
23:45:03 [2021-10-23T03:45:03.190Z] Start of script
23:45:03 [2021-10-23T03:45:03.190Z] include file start
23:45:03 [2021-10-23T03:45:03.190Z] include file processed
23:45:03 [2021-10-23T03:45:03.190Z] Result of testMethod = 5
23:45:03 [2021-10-23T03:45:03.190Z] End of script
23:45:03 [2021-10-23T03:45:03.448Z] Start of script
23:45:03 [2021-10-23T03:45:03.448Z] include file start
23:45:03 [2021-10-23T03:45:03.448Z] include file processed
23:45:03 [2021-10-23T03:45:03.448Z] Result of testMethod = 5
23:45:03 [2021-10-23T03:45:03.448Z] End of script
23:45:03 [2021-10-23T03:45:03.706Z] Start of script
23:45:03 [2021-10-23T03:45:03.706Z] include file start
23:45:03 [2021-10-23T03:45:03.706Z] include file processed
23:45:03 [2021-10-23T03:45:03.706Z] Result of testMethod = 5
23:45:03 [2021-10-23T03:45:03.963Z] Traceback (most recent call last):
23:45:03 [2021-10-23T03:45:03.963Z]   File "(none)", line 184, in run
23:45:03 [2021-10-23T03:45:03.963Z]   File "__ref_L/Debug Test/Main.py_lnlnpdkyml", line 23, in <module>
23:45:03 [2021-10-23T03:45:03.963Z]   File "(none)", line 161, in trace_dispatch
23:45:03 [2021-10-23T03:45:03.963Z] 	at org.eclipse.ease.debugging.AbstractEaseDebugger.handleEventsInSuspendedState(AbstractEaseDebugger.java:331)
23:45:03 [2021-10-23T03:45:03.963Z] 	at org.eclipse.ease.debugging.AbstractEaseDebugger.suspend(AbstractEaseDebugger.java:257)
23:45:03 [2021-10-23T03:45:03.963Z] 	at org.eclipse.ease.debugging.AbstractEaseDebugger.processLine(AbstractEaseDebugger.java:492)
23:45:03 [2021-10-23T03:45:03.963Z] 	at org.eclipse.ease.lang.python.debugger.PythonDebugger.traceDispatch(PythonDebugger.java:179)
23:45:03 [2021-10-23T03:45:03.963Z] 	at org.eclipse.ease.lang.python.jython.debugger.JythonDebugger.traceDispatch(JythonDebugger.java:46)
23:45:03 [2021-10-23T03:45:03.963Z] 	at jdk.internal.reflect.GeneratedMethodAccessor25.invoke(Unknown Source)
23:45:03 [2021-10-23T03:45:03.963Z] 	at java.base/jdk.internal.reflect.DelegatingMethodAccessorImpl.invoke(DelegatingMethodAccessorImpl.java:43)
23:45:03 [2021-10-23T03:45:03.963Z] 	at java.base/java.lang.reflect.Method.invoke(Method.java:564)
23:45:03 [2021-10-23T03:45:03.963Z] 
23:45:03 [2021-10-23T03:45:03.963Z] org.eclipse.ease.ScriptEngineCancellationException: org.eclipse.ease.ScriptEngineCancellationException: Terminated on user request
23:45:03 [2021-10-23T03:45:03.963Z] Start of script
23:45:03 [2021-10-23T03:45:03.963Z] include file start
23:45:03 [2021-10-23T03:45:03.963Z] include file processed
23:45:04 [2021-10-23T03:45:04.219Z] Result of testMethod = 5
23:45:04 [2021-10-23T03:45:04.219Z] End of script
23:45:04 [2021-10-23T03:45:04.474Z] Traceback (most recent call last):
23:45:04 [2021-10-23T03:45:04.474Z]   File "(none)", line 184, in run
23:45:04 [2021-10-23T03:45:04.474Z]   File "__ref_L/Debug Test/Main.py_aolzzxwvbr", line 1, in <module>
23:45:04 [2021-10-23T03:45:04.474Z]   File "(none)", line 161, in trace_dispatch
23:45:04 [2021-10-23T03:45:04.474Z] 	at org.eclipse.ease.debugging.AbstractEaseDebugger.handleEventsInSuspendedState(AbstractEaseDebugger.java:331)
23:45:04 [2021-10-23T03:45:04.474Z] 	at org.eclipse.ease.debugging.AbstractEaseDebugger.suspend(AbstractEaseDebugger.java:257)
23:45:04 [2021-10-23T03:45:04.474Z] 	at org.eclipse.ease.debugging.AbstractEaseDebugger.processLine(AbstractEaseDebugger.java:492)
23:45:04 [2021-10-23T03:45:04.474Z] 	at org.eclipse.ease.lang.python.debugger.PythonDebugger.traceDispatch(PythonDebugger.java:179)
23:45:04 [2021-10-23T03:45:04.474Z] 	at org.eclipse.ease.lang.python.jython.debugger.JythonDebugger.traceDispatch(JythonDebugger.java:46)
23:45:04 [2021-10-23T03:45:04.474Z] 	at jdk.internal.reflect.GeneratedMethodAccessor25.invoke(Unknown Source)
23:45:04 [2021-10-23T03:45:04.474Z] 	at java.base/jdk.internal.reflect.DelegatingMethodAccessorImpl.invoke(DelegatingMethodAccessorImpl.java:43)
23:45:04 [2021-10-23T03:45:04.474Z] 	at java.base/java.lang.reflect.Method.invoke(Method.java:564)
23:45:04 [2021-10-23T03:45:04.474Z] 
23:45:04 [2021-10-23T03:45:04.474Z] org.eclipse.ease.ScriptEngineCancellationException: org.eclipse.ease.ScriptEngineCancellationException: Terminated on user request
23:45:04 [2021-10-23T03:45:04.474Z] Start of script
23:45:04 [2021-10-23T03:45:04.474Z] include file start
23:45:04 [2021-10-23T03:45:04.474Z] include file processed
23:45:04 [2021-10-23T03:45:04.474Z] Result of testMethod = 5
23:45:04 [2021-10-23T03:45:04.474Z] End of script
23:45:04 [2021-10-23T03:45:04.730Z] Start of script
23:45:04 [2021-10-23T03:45:04.730Z] include file start
23:45:04 [2021-10-23T03:45:04.730Z] include file processed
23:45:04 [2021-10-23T03:45:04.985Z] Result of testMethod = 5
23:45:04 [2021-10-23T03:45:04.985Z] End of script
23:45:05 [2021-10-23T03:45:05.241Z] Traceback (most recent call last):
23:45:05 [2021-10-23T03:45:05.241Z]   File "(none)", line 184, in run
23:45:05 [2021-10-23T03:45:05.241Z]   File "__ref_L/Debug Test/Main.py_flrphrrxcj", line 1, in <module>
23:45:05 [2021-10-23T03:45:05.241Z]   File "(none)", line 161, in trace_dispatch
23:45:05 [2021-10-23T03:45:05.241Z] 	at org.eclipse.ease.debugging.AbstractEaseDebugger.handleEventsInSuspendedState(AbstractEaseDebugger.java:331)
23:45:05 [2021-10-23T03:45:05.241Z] 	at org.eclipse.ease.debugging.AbstractEaseDebugger.suspend(AbstractEaseDebugger.java:257)
23:45:05 [2021-10-23T03:45:05.241Z] 	at org.eclipse.ease.debugging.AbstractEaseDebugger.processLine(AbstractEaseDebugger.java:492)
23:45:05 [2021-10-23T03:45:05.241Z] 	at org.eclipse.ease.lang.python.debugger.PythonDebugger.traceDispatch(PythonDebugger.java:179)
23:45:05 [2021-10-23T03:45:05.241Z] 	at org.eclipse.ease.lang.python.jython.debugger.JythonDebugger.traceDispatch(JythonDebugger.java:46)
23:45:05 [2021-10-23T03:45:05.241Z] 	at jdk.internal.reflect.GeneratedMethodAccessor25.invoke(Unknown Source)
23:45:05 [2021-10-23T03:45:05.241Z] 	at java.base/jdk.internal.reflect.DelegatingMethodAccessorImpl.invoke(DelegatingMethodAccessorImpl.java:43)
23:45:05 [2021-10-23T03:45:05.241Z] 	at java.base/java.lang.reflect.Method.invoke(Method.java:564)
23:45:05 [2021-10-23T03:45:05.241Z] 
23:45:05 [2021-10-23T03:45:05.241Z] org.eclipse.ease.ScriptEngineCancellationException: org.eclipse.ease.ScriptEngineCancellationException: Terminated on user request
23:45:05 [2021-10-23T03:45:05.241Z] Start of script
23:45:05 [2021-10-23T03:45:05.241Z] include file start
23:45:05 [2021-10-23T03:45:05.241Z] include file processed
23:45:05 [2021-10-23T03:45:05.497Z] Result of testMethod = 5
23:45:05 [2021-10-23T03:45:05.497Z] End of script
23:45:05 [2021-10-23T03:45:05.497Z] Start of script
23:45:05 [2021-10-23T03:45:05.497Z] include file start
23:45:05 [2021-10-23T03:45:05.497Z] include file processed
23:45:05 [2021-10-23T03:45:05.497Z] Result of testMethod = 5
23:45:05 [2021-10-23T03:45:05.752Z] Traceback (most recent call last):
23:45:05 [2021-10-23T03:45:05.752Z]   File "(none)", line 184, in run
23:45:05 [2021-10-23T03:45:05.752Z]   File "__ref_L/Debug Test/Main.py_igrcetgcpj", line 23, in <module>
23:45:05 [2021-10-23T03:45:05.752Z]   File "(none)", line 161, in trace_dispatch
23:45:05 [2021-10-23T03:45:05.752Z] 	at org.eclipse.ease.debugging.AbstractEaseDebugger.handleEventsInSuspendedState(AbstractEaseDebugger.java:331)
23:45:05 [2021-10-23T03:45:05.752Z] 	at org.eclipse.ease.debugging.AbstractEaseDebugger.suspend(AbstractEaseDebugger.java:257)
23:45:05 [2021-10-23T03:45:05.752Z] 	at org.eclipse.ease.debugging.AbstractEaseDebugger.processLine(AbstractEaseDebugger.java:492)
23:45:05 [2021-10-23T03:45:05.752Z] 	at org.eclipse.ease.lang.python.debugger.PythonDebugger.traceDispatch(PythonDebugger.java:179)
23:45:05 [2021-10-23T03:45:05.752Z] 	at org.eclipse.ease.lang.python.jython.debugger.JythonDebugger.traceDispatch(JythonDebugger.java:46)
23:45:05 [2021-10-23T03:45:05.752Z] 	at jdk.internal.reflect.GeneratedMethodAccessor25.invoke(Unknown Source)
23:45:05 [2021-10-23T03:45:05.752Z] 	at java.base/jdk.internal.reflect.DelegatingMethodAccessorImpl.invoke(DelegatingMethodAccessorImpl.java:43)
23:45:05 [2021-10-23T03:45:05.752Z] 	at java.base/java.lang.reflect.Method.invoke(Method.java:564)
23:45:05 [2021-10-23T03:45:05.752Z] 
23:45:05 [2021-10-23T03:45:05.752Z] org.eclipse.ease.ScriptEngineCancellationException: org.eclipse.ease.ScriptEngineCancellationException: Terminated on user request
23:45:06 [2021-10-23T03:45:06.008Z] Start of script
23:45:06 [2021-10-23T03:45:06.008Z] include file start
23:45:06 [2021-10-23T03:45:06.008Z] include file processed
23:45:06 [2021-10-23T03:45:06.008Z] Result of testMethod = 5
23:45:06 [2021-10-23T03:45:06.008Z] End of script
23:45:06 [2021-10-23T03:45:06.008Z] Start of script
23:45:06 [2021-10-23T03:45:06.008Z] include file start
23:45:06 [2021-10-23T03:45:06.008Z] include file processed
23:45:06 [2021-10-23T03:45:06.264Z] Result of testMethod = 5
23:45:06 [2021-10-23T03:45:06.264Z] End of script
23:45:06 [2021-10-23T03:45:06.264Z] Start of script
23:45:06 [2021-10-23T03:45:06.264Z] include file start
23:45:06 [2021-10-23T03:45:06.264Z] include file processed
23:45:06 [2021-10-23T03:45:06.264Z] Result of testMethod = 5
23:45:06 [2021-10-23T03:45:06.264Z] End of script
23:45:06 [2021-10-23T03:45:06.519Z] Start of script
23:45:06 [2021-10-23T03:45:06.519Z] include file start
23:45:06 [2021-10-23T03:45:06.519Z] include file processed
23:45:06 [2021-10-23T03:45:06.776Z] Result of testMethod = 5
23:45:06 [2021-10-23T03:45:06.776Z] End of script
23:45:06 [2021-10-23T03:45:06.776Z] Start of script
23:45:06 [2021-10-23T03:45:06.776Z] include file start
23:45:06 [2021-10-23T03:45:06.776Z] include file processed
23:45:07 [2021-10-23T03:45:07.032Z] Traceback (most recent call last):
23:45:07 [2021-10-23T03:45:07.032Z]   File "(none)", line 184, in run
23:45:07 [2021-10-23T03:45:07.032Z]   File "__ref_L/Debug Test/Main.py_ifdxzmadme", line 21, in <module>
23:45:07 [2021-10-23T03:45:07.032Z]   File "__ref_L/Debug Test/Main.py_ifdxzmadme", line 18, in testMethod
23:45:07 [2021-10-23T03:45:07.032Z]   File "(none)", line 161, in trace_dispatch
23:45:07 [2021-10-23T03:45:07.032Z] 	at org.eclipse.ease.debugging.AbstractEaseDebugger.handleEventsInSuspendedState(AbstractEaseDebugger.java:331)
23:45:07 [2021-10-23T03:45:07.032Z] 	at org.eclipse.ease.debugging.AbstractEaseDebugger.suspend(AbstractEaseDebugger.java:257)
23:45:07 [2021-10-23T03:45:07.032Z] 	at org.eclipse.ease.debugging.AbstractEaseDebugger.processLine(AbstractEaseDebugger.java:492)
23:45:07 [2021-10-23T03:45:07.032Z] 	at org.eclipse.ease.lang.python.debugger.PythonDebugger.traceDispatch(PythonDebugger.java:179)
23:45:07 [2021-10-23T03:45:07.032Z] 	at org.eclipse.ease.lang.python.jython.debugger.JythonDebugger.traceDispatch(JythonDebugger.java:46)
23:45:07 [2021-10-23T03:45:07.032Z] 	at jdk.internal.reflect.GeneratedMethodAccessor25.invoke(Unknown Source)
23:45:07 [2021-10-23T03:45:07.032Z] 	at java.base/jdk.internal.reflect.DelegatingMethodAccessorImpl.invoke(DelegatingMethodAccessorImpl.java:43)
23:45:07 [2021-10-23T03:45:07.032Z] 	at java.base/java.lang.reflect.Method.invoke(Method.java:564)
23:45:07 [2021-10-23T03:45:07.032Z] 
23:45:07 [2021-10-23T03:45:07.032Z] org.eclipse.ease.ScriptEngineCancellationException: org.eclipse.ease.ScriptEngineCancellationException: Terminated on user request
23:45:07 [2021-10-23T03:45:07.032Z] Start of script
23:45:07 [2021-10-23T03:45:07.287Z] include file start
23:45:07 [2021-10-23T03:45:07.287Z] include file processed
23:45:07 [2021-10-23T03:45:07.287Z] Result of testMethod = 5
23:45:07 [2021-10-23T03:45:07.287Z] End of script
23:45:07 [2021-10-23T03:45:07.544Z] Start of script
23:45:07 [2021-10-23T03:45:07.544Z] include file start
23:45:07 [2021-10-23T03:45:07.544Z] include file processed
23:45:07 [2021-10-23T03:45:07.544Z] Result of testMethod = 5
23:45:07 [2021-10-23T03:45:07.544Z] Traceback (most recent call last):
23:45:07 [2021-10-23T03:45:07.545Z]   File "(none)", line 184, in run
23:45:07 [2021-10-23T03:45:07.545Z]   File "__ref_L/Debug Test/Main.py_bdjcvgiudg", line 23, in <module>
23:45:07 [2021-10-23T03:45:07.545Z]   File "(none)", line 161, in trace_dispatch
23:45:07 [2021-10-23T03:45:07.545Z] 	at org.eclipse.ease.debugging.AbstractEaseDebugger.handleEventsInSuspendedState(AbstractEaseDebugger.java:331)
23:45:07 [2021-10-23T03:45:07.545Z] 	at org.eclipse.ease.debugging.AbstractEaseDebugger.suspend(AbstractEaseDebugger.java:257)
23:45:07 [2021-10-23T03:45:07.545Z] 	at org.eclipse.ease.debugging.AbstractEaseDebugger.processLine(AbstractEaseDebugger.java:492)
23:45:07 [2021-10-23T03:45:07.545Z] 	at org.eclipse.ease.lang.python.debugger.PythonDebugger.traceDispatch(PythonDebugger.java:179)
23:45:07 [2021-10-23T03:45:07.545Z] 	at org.eclipse.ease.lang.python.jython.debugger.JythonDebugger.traceDispatch(JythonDebugger.java:46)
23:45:07 [2021-10-23T03:45:07.545Z] 	at jdk.internal.reflect.GeneratedMethodAccessor25.invoke(Unknown Source)
23:45:07 [2021-10-23T03:45:07.545Z] 	at java.base/jdk.internal.reflect.DelegatingMethodAccessorImpl.invoke(DelegatingMethodAccessorImpl.java:43)
23:45:07 [2021-10-23T03:45:07.545Z] 	at java.base/java.lang.reflect.Method.invoke(Method.java:564)
23:45:07 [2021-10-23T03:45:07.545Z] 
23:45:07 [2021-10-23T03:45:07.545Z] org.eclipse.ease.ScriptEngineCancellationException: org.eclipse.ease.ScriptEngineCancellationException: Terminated on user request
23:45:07 [2021-10-23T03:45:07.799Z] Start of script
23:45:07 [2021-10-23T03:45:07.799Z] include file start
23:45:07 [2021-10-23T03:45:07.799Z] include file processed
23:45:07 [2021-10-23T03:45:07.799Z] Result of testMethod = 5
23:45:07 [2021-10-23T03:45:07.799Z] End of script
23:45:07 [2021-10-23T03:45:07.800Z] Start of script
23:45:07 [2021-10-23T03:45:07.800Z] include file start
23:45:07 [2021-10-23T03:45:07.800Z] include file processed
23:45:08 [2021-10-23T03:45:08.054Z] Result of testMethod = 5
23:45:08 [2021-10-23T03:45:08.054Z] End of script
23:45:08 [2021-10-23T03:45:08.311Z] Start of script
23:45:08 [2021-10-23T03:45:08.311Z] include file start
23:45:08 [2021-10-23T03:45:08.311Z] include file processed
23:45:08 [2021-10-23T03:45:08.311Z] Result of testMethod = 5
23:45:08 [2021-10-23T03:45:08.311Z] End of script
23:45:08 [2021-10-23T03:45:08.567Z] Start of script
23:45:08 [2021-10-23T03:45:08.567Z] include file start
23:45:08 [2021-10-23T03:45:08.567Z] include file processed
23:45:08 [2021-10-23T03:45:08.567Z] Result of testMethod = 5
23:45:08 [2021-10-23T03:45:08.567Z] End of script
23:45:08 [2021-10-23T03:45:08.822Z] Start of script
23:45:08 [2021-10-23T03:45:08.822Z] include file start
23:45:08 [2021-10-23T03:45:08.822Z] include file processed
23:45:08 [2021-10-23T03:45:08.822Z] Result of testMethod = 5
23:45:08 [2021-10-23T03:45:08.822Z] Traceback (most recent call last):
23:45:08 [2021-10-23T03:45:08.823Z]   File "(none)", line 184, in run
23:45:08 [2021-10-23T03:45:08.823Z]   File "__ref_L/Debug Test/Main.py_mwyqrubdpx", line 23, in <module>
23:45:08 [2021-10-23T03:45:08.823Z]   File "(none)", line 161, in trace_dispatch
23:45:08 [2021-10-23T03:45:08.823Z] 	at org.eclipse.ease.debugging.AbstractEaseDebugger.handleEventsInSuspendedState(AbstractEaseDebugger.java:331)
23:45:08 [2021-10-23T03:45:08.823Z] 	at org.eclipse.ease.debugging.AbstractEaseDebugger.suspend(AbstractEaseDebugger.java:257)
23:45:08 [2021-10-23T03:45:08.823Z] 	at org.eclipse.ease.debugging.AbstractEaseDebugger.processLine(AbstractEaseDebugger.java:492)
23:45:08 [2021-10-23T03:45:08.823Z] 	at org.eclipse.ease.lang.python.debugger.PythonDebugger.traceDispatch(PythonDebugger.java:179)
23:45:08 [2021-10-23T03:45:08.823Z] 	at org.eclipse.ease.lang.python.jython.debugger.JythonDebugger.traceDispatch(JythonDebugger.java:46)
23:45:08 [2021-10-23T03:45:08.823Z] 	at jdk.internal.reflect.GeneratedMethodAccessor25.invoke(Unknown Source)
23:45:08 [2021-10-23T03:45:08.823Z] 	at java.base/jdk.internal.reflect.DelegatingMethodAccessorImpl.invoke(DelegatingMethodAccessorImpl.java:43)
23:45:08 [2021-10-23T03:45:08.823Z] 	at java.base/java.lang.reflect.Method.invoke(Method.java:564)
23:45:08 [2021-10-23T03:45:08.823Z] 
23:45:08 [2021-10-23T03:45:08.823Z] org.eclipse.ease.ScriptEngineCancellationException: org.eclipse.ease.ScriptEngineCancellationException: Terminated on user request
23:45:09 [2021-10-23T03:45:09.079Z] Start of script
23:45:09 [2021-10-23T03:45:09.079Z] include file start
23:45:09 [2021-10-23T03:45:09.079Z] include file processed
23:45:09 [2021-10-23T03:45:09.079Z] Result of testMethod = 5
23:45:09 [2021-10-23T03:45:09.079Z] End of script
23:45:09 [2021-10-23T03:45:09.335Z] Start of script
23:45:09 [2021-10-23T03:45:09.335Z] include file start
23:45:09 [2021-10-23T03:45:09.335Z] include file processed
23:45:09 [2021-10-23T03:45:09.335Z] Result of testMethod = 5
23:45:09 [2021-10-23T03:45:09.335Z] Traceback (most recent call last):
23:45:09 [2021-10-23T03:45:09.335Z]   File "(none)", line 184, in run
23:45:09 [2021-10-23T03:45:09.335Z]   File "__ref_L/Debug Test/Main.py_wyerqrypuk", line 23, in <module>
23:45:09 [2021-10-23T03:45:09.335Z]   File "(none)", line 161, in trace_dispatch
23:45:09 [2021-10-23T03:45:09.335Z] 	at org.eclipse.ease.debugging.AbstractEaseDebugger.handleEventsInSuspendedState(AbstractEaseDebugger.java:331)
23:45:09 [2021-10-23T03:45:09.335Z] 	at org.eclipse.ease.debugging.AbstractEaseDebugger.suspend(AbstractEaseDebugger.java:257)
23:45:09 [2021-10-23T03:45:09.335Z] 	at org.eclipse.ease.debugging.AbstractEaseDebugger.processLine(AbstractEaseDebugger.java:492)
23:45:09 [2021-10-23T03:45:09.335Z] 	at org.eclipse.ease.lang.python.debugger.PythonDebugger.traceDispatch(PythonDebugger.java:179)
23:45:09 [2021-10-23T03:45:09.336Z] 	at org.eclipse.ease.lang.python.jython.debugger.JythonDebugger.traceDispatch(JythonDebugger.java:46)
23:45:09 [2021-10-23T03:45:09.336Z] 	at jdk.internal.reflect.GeneratedMethodAccessor25.invoke(Unknown Source)
23:45:09 [2021-10-23T03:45:09.336Z] 	at java.base/jdk.internal.reflect.DelegatingMethodAccessorImpl.invoke(DelegatingMethodAccessorImpl.java:43)
23:45:09 [2021-10-23T03:45:09.336Z] 	at java.base/java.lang.reflect.Method.invoke(Method.java:564)
23:45:09 [2021-10-23T03:45:09.336Z] 
23:45:09 [2021-10-23T03:45:09.336Z] org.eclipse.ease.ScriptEngineCancellationException: org.eclipse.ease.ScriptEngineCancellationException: Terminated on user request
23:45:09 [2021-10-23T03:45:09.591Z] Traceback (most recent call last):
23:45:09 [2021-10-23T03:45:09.591Z]   File "(none)", line 184, in run
23:45:09 [2021-10-23T03:45:09.591Z]   File "__ref_L/Debug Test/Main.py_lsqxdybsud", line 1, in <module>
23:45:09 [2021-10-23T03:45:09.591Z]   File "(none)", line 161, in trace_dispatch
23:45:09 [2021-10-23T03:45:09.591Z] 	at org.eclipse.ease.debugging.AbstractEaseDebugger.handleEventsInSuspendedState(AbstractEaseDebugger.java:331)
23:45:09 [2021-10-23T03:45:09.591Z] 	at org.eclipse.ease.debugging.AbstractEaseDebugger.suspend(AbstractEaseDebugger.java:257)
23:45:09 [2021-10-23T03:45:09.591Z] 	at org.eclipse.ease.debugging.AbstractEaseDebugger.processLine(AbstractEaseDebugger.java:492)
23:45:09 [2021-10-23T03:45:09.591Z] 	at org.eclipse.ease.lang.python.debugger.PythonDebugger.traceDispatch(PythonDebugger.java:179)
23:45:09 [2021-10-23T03:45:09.591Z] 	at org.eclipse.ease.lang.python.jython.debugger.JythonDebugger.traceDispatch(JythonDebugger.java:46)
23:45:09 [2021-10-23T03:45:09.591Z] 	at jdk.internal.reflect.GeneratedMethodAccessor25.invoke(Unknown Source)
23:45:09 [2021-10-23T03:45:09.591Z] 	at java.base/jdk.internal.reflect.DelegatingMethodAccessorImpl.invoke(DelegatingMethodAccessorImpl.java:43)
23:45:09 [2021-10-23T03:45:09.591Z] 	at java.base/java.lang.reflect.Method.invoke(Method.java:564)
23:45:09 [2021-10-23T03:45:09.591Z] 
23:45:09 [2021-10-23T03:45:09.591Z] org.eclipse.ease.ScriptEngineCancellationException: org.eclipse.ease.ScriptEngineCancellationException: Terminated on user request
23:45:09 [2021-10-23T03:45:09.847Z] Start of script
23:45:09 [2021-10-23T03:45:09.847Z] include file start
23:45:09 [2021-10-23T03:45:09.847Z] include file processed
23:45:09 [2021-10-23T03:45:09.847Z] Result of testMethod = 5
23:45:09 [2021-10-23T03:45:09.847Z] End of script
23:45:09 [2021-10-23T03:45:09.847Z] Start of script
23:45:09 [2021-10-23T03:45:09.847Z] include file start
23:45:09 [2021-10-23T03:45:09.847Z] include file processed
23:45:10 [2021-10-23T03:45:10.104Z] Result of testMethod = 5
23:45:10 [2021-10-23T03:45:10.104Z] End of script
23:45:10 [2021-10-23T03:45:10.359Z] Start of script
23:45:10 [2021-10-23T03:45:10.359Z] include file start
23:45:10 [2021-10-23T03:45:10.359Z] include file processed
23:45:10 [2021-10-23T03:45:10.359Z] Result of testMethod = 5
23:45:10 [2021-10-23T03:45:10.359Z] End of script
23:45:10 [2021-10-23T03:45:10.359Z] Tests run: 42, Failures: 1, Errors: 0, Skipped: 0, Time elapsed: 13.017 s <<< FAILURE! - in org.eclipse.ease.lang.python.jython.debugger.JythonDebugTest
23:45:10 [2021-10-23T03:45:10.359Z] disconnectProcessInSuspendedState  Time elapsed: 2.061 s
23:45:10 [2021-10-23T03:45:10.359Z] stepReturnIncludeCommand  Time elapsed: 0.214 s
23:45:10 [2021-10-23T03:45:10.359Z] arrayVariableSorting  Time elapsed: 0.213 s  <<< FAILURE!
23:45:10 [2021-10-23T03:45:10.359Z] org.opentest4j.AssertionFailedError: expected: <1> but was: <0>
23:45:10 [2021-10-23T03:45:10.359Z] 
23:45:10 [2021-10-23T03:45:10.359Z] stepOverOnDebugTarget  Time elapsed: 0.408 s
23:45:10 [2021-10-23T03:45:10.359Z] hasDebugTarget  Time elapsed: 0.105 s
23:45:10 [2021-10-23T03:45:10.359Z] disconnectThreadInSuspendedState  Time elapsed: 0.306 s
23:45:10 [2021-10-23T03:45:10.359Z] stepReturnOnDebugTarget  Time elapsed: 0.308 s
23:45:10 [2021-10-23T03:45:10.359Z] nullVariable  Time elapsed: 0.309 s
23:45:10 [2021-10-23T03:45:10.359Z] stepOverOnStackFrame  Time elapsed: 0.309 s
23:45:10 [2021-10-23T03:45:10.359Z] resumeOnDebugTarget  Time elapsed: 0.207 s
23:45:10 [2021-10-23T03:45:10.359Z] modifyVariableKeepingType  Time elapsed: 0.507 s
23:45:10 [2021-10-23T03:45:10.359Z] resumeOnLastIncludeLine  Time elapsed: 0.206 s
23:45:10 [2021-10-23T03:45:10.359Z] stepReturnOnStackFrame  Time elapsed: 0.307 s
23:45:10 [2021-10-23T03:45:10.359Z] terminateStackFrameInSuspendedState  Time elapsed: 0.209 s
23:45:10 [2021-10-23T03:45:10.359Z] breakpointLocation  Time elapsed: 0.208 s
23:45:10 [2021-10-23T03:45:10.359Z] stepReturnOnThread  Time elapsed: 0.309 s
23:45:10 [2021-10-23T03:45:10.359Z] javaClassVariable  Time elapsed: 0.307 s
23:45:10 [2021-10-23T03:45:10.359Z] stepIntoOnThread  Time elapsed: 0.307 s
23:45:10 [2021-10-23T03:45:10.359Z] terminateThreadInSuspendedState  Time elapsed: 0.206 s
23:45:10 [2021-10-23T03:45:10.359Z] resumeOnThread  Time elapsed: 0.206 s
23:45:10 [2021-10-23T03:45:10.359Z] stepIntoOnStackFrame  Time elapsed: 0.307 s
23:45:10 [2021-10-23T03:45:10.359Z] terminateProcessInSuspendedState  Time elapsed: 0.205 s
23:45:10 [2021-10-23T03:45:10.359Z] stepOverOnProcess  Time elapsed: 0.306 s
23:45:10 [2021-10-23T03:45:10.359Z] nativeArrayVariable  Time elapsed: 0.305 s
23:45:10 [2021-10-23T03:45:10.359Z] disconnectDebugTargetInSuspendedState  Time elapsed: 0.205 s
23:45:10 [2021-10-23T03:45:10.359Z] stepIntoOnProcess  Time elapsed: 0.305 s
23:45:10 [2021-10-23T03:45:10.359Z] terminatedState  Time elapsed: 0.103 s
23:45:10 [2021-10-23T03:45:10.359Z] stepOverIncludeCommand  Time elapsed: 0.304 s
23:45:10 [2021-10-23T03:45:10.359Z] innerScopeVariableBeforeOuterScopeVariable  Time elapsed: 0.305 s
23:45:10 [2021-10-23T03:45:10.359Z] stepIntoIncludeCommand  Time elapsed: 0.305 s
23:45:10 [2021-10-23T03:45:10.359Z] primitiveStringVariable  Time elapsed: 0.304 s
23:45:10 [2021-10-23T03:45:10.359Z] resumeOnProcess  Time elapsed: 0.204 s
23:45:10 [2021-10-23T03:45:10.359Z] stepIntoOnDebugTarget  Time elapsed: 0.309 s
23:45:10 [2021-10-23T03:45:10.359Z] stepOverOnThread  Time elapsed: 0.305 s
23:45:10 [2021-10-23T03:45:10.359Z] suspendedState  Time elapsed: 0.204 s
23:45:10 [2021-10-23T03:45:10.359Z] primitiveDoubleVariable  Time elapsed: 0.305 s
23:45:10 [2021-10-23T03:45:10.359Z] resumeOnStackFrame  Time elapsed: 0.204 s
23:45:10 [2021-10-23T03:45:10.359Z] nativeObjectVariable  Time elapsed: 0.305 s
23:45:10 [2021-10-23T03:45:10.359Z] terminateDebugTargetInSuspendedState  Time elapsed: 0.204 s
23:45:10 [2021-10-23T03:45:10.359Z] disconnectStackFrameInSuspendedState  Time elapsed: 0.206 s
23:45:10 [2021-10-23T03:45:10.359Z] stepReturnOnProcess  Time elapsed: 0.306 s
23:45:10 [2021-10-23T03:45:10.359Z] evaluateWatchExpression  Time elapsed: 0.224 s
23:45:10 [2021-10-23T03:45:10.359Z] 
23:45:10 [2021-10-23T03:45:10.359Z] Results:
23:45:10 [2021-10-23T03:45:10.359Z] 
23:45:10 [2021-10-23T03:45:10.359Z] Failures: 
23:45:10 [2021-10-23T03:45:10.359Z]   JythonDebugTest>AbstractDebugTest.arrayVariableSorting:892 expected: <1> but was: <0>
23:45:10 [2021-10-23T03:45:10.359Z] 
23:45:10 [2021-10-23T03:45:10.359Z] Tests run: 42, Failures: 1, Errors: 0, Skipped: 0
23:45:10 [2021-10-23T03:45:10.359Z] 
23:45:10 [2021-10-23T03:45:10.922Z] [INFO] ------------------------------------------------------------------------
23:45:10 [2021-10-23T03:45:10.922Z] [INFO] Reactor Summary for org.eclipse.ease.releng 0.9.0-SNAPSHOT:
23:45:10 [2021-10-23T03:45:10.922Z] [INFO] 
23:45:10 [2021-10-23T03:45:10.922Z] [INFO] org.eclipse.ease.releng ............................ SUCCESS [  0.001 s]
23:45:10 [2021-10-23T03:45:10.922Z] [INFO] org.eclipse.ease.releng.target ..................... SUCCESS [  0.123 s]
23:45:10 [2021-10-23T03:45:10.922Z] [INFO] org.eclipse.ease.test .............................. SUCCESS [ 16.247 s]
23:45:10 [2021-10-23T03:45:10.922Z] [INFO] org.eclipse.ease.lang.javascript.rhino.test ........ SUCCESS [ 15.731 s]
23:45:10 [2021-10-23T03:45:10.922Z] [INFO] org.eclipse.ease.lang.javascript.test .............. SUCCESS [  3.201 s]
23:45:10 [2021-10-23T03:45:10.922Z] [INFO] org.eclipse.ease.lang.python.test .................. SUCCESS [  4.411 s]
23:45:10 [2021-10-23T03:45:10.922Z] [INFO] org.eclipse.ease.lang.python.jython.test ........... FAILURE [ 16.936 s]
23:45:10 [2021-10-23T03:45:10.922Z] [INFO] org.eclipse.ease.lang.scriptarchive.test ........... SKIPPED
23:45:10 [2021-10-23T03:45:10.922Z] [INFO] org.eclipse.ease.ui.test ........................... SKIPPED
23:45:10 [2021-10-23T03:45:10.922Z] [INFO] ------------------------------------------------------------------------
23:45:10 [2021-10-23T03:45:10.922Z] [INFO] BUILD FAILURE
23:45:10 [2021-10-23T03:45:10.922Z] [INFO] ------------------------------------------------------------------------
23:45:10 [2021-10-23T03:45:10.922Z] [INFO] Total time:  01:32 min
23:45:10 [2021-10-23T03:45:10.922Z] [INFO] Finished at: 2021-10-23T03:45:10Z
23:45:10 [2021-10-23T03:45:10.922Z] [INFO] ------------------------------------------------------------------------
23:45:10 [2021-10-23T03:45:10.922Z] [WARNING] [jenkins-event-spy] Unexpected Maven project file name 'target-tests-pom.xml', problems may occur
23:45:10 [2021-10-23T03:45:10.922Z] [INFO] [jenkins-event-spy] Generated /home/jenkins/agent/workspace/ease.verify.core.target.2018-12@tmp/withMaven93c549ad/maven-spy-20211023-034338-9217634844371624682070.log
23:45:10 [2021-10-23T03:45:10.922Z] [ERROR] Failed to execute goal org.eclipse.tycho:tycho-surefire-plugin:2.2.0:test (default-test) on project org.eclipse.ease.lang.python.jython.test: There are test failures.
23:45:10 [2021-10-23T03:45:10.922Z] [ERROR] 
23:45:10 [2021-10-23T03:45:10.922Z] [ERROR] Please refer to /home/jenkins/agent/workspace/ease.verify.core.target.2018-12/tests/org.eclipse.ease.lang.python.jython.test/target/surefire-reports for the individual test results.
23:45:10 [2021-10-23T03:45:10.922Z] [ERROR] -> [Help 1]
23:45:10 [2021-10-23T03:45:10.922Z] [ERROR] 
23:45:10 [2021-10-23T03:45:10.922Z] [ERROR] To see the full stack trace of the errors, re-run Maven with the -e switch.
23:45:10 [2021-10-23T03:45:10.922Z] [ERROR] Re-run Maven using the -X switch to enable full debug logging.
23:45:10 [2021-10-23T03:45:10.922Z] [ERROR] 
23:45:10 [2021-10-23T03:45:10.922Z] [ERROR] For more information about the errors and possible solutions, please read the following articles:
23:45:10 [2021-10-23T03:45:10.922Z] [ERROR] [Help 1] http://cwiki.apache.org/confluence/display/MAVEN/MojoFailureException
23:45:10 [2021-10-23T03:45:10.922Z] [ERROR] 
23:45:10 [2021-10-23T03:45:10.922Z] [ERROR] After correcting the problems, you can resume the build with the command
23:45:10 [2021-10-23T03:45:10.922Z] [ERROR]   mvn <args> -rf :org.eclipse.ease.lang.python.jython.test
[Pipeline] }
23:45:10 [2021-10-23T03:45:10.943Z] [withMaven] junitPublisher - Archive test results for Maven artifact org.eclipse.ease:org.eclipse.ease.test:eclipse-test-plugin:0.9.0-SNAPSHOT generated by tycho-surefire-plugin:test (default-test): tests/org.eclipse.ease.test/target/surefire-reports/*.xml
23:45:10 [2021-10-23T03:45:10.944Z] [withMaven] junitPublisher - Archive test results for Maven artifact org.eclipse.ease:org.eclipse.ease.lang.javascript.rhino.test:eclipse-test-plugin:0.9.0-SNAPSHOT generated by tycho-surefire-plugin:test (default-test): tests/org.eclipse.ease.lang.javascript.rhino.test/target/surefire-reports/*.xml
23:45:10 [2021-10-23T03:45:10.944Z] [withMaven] junitPublisher - Archive test results for Maven artifact org.eclipse.ease:org.eclipse.ease.lang.javascript.test:eclipse-test-plugin:0.9.0-SNAPSHOT generated by tycho-surefire-plugin:test (default-test): tests/org.eclipse.ease.lang.javascript.test/target/surefire-reports/*.xml
23:45:10 [2021-10-23T03:45:10.944Z] [withMaven] junitPublisher - Archive test results for Maven artifact org.eclipse.ease:org.eclipse.ease.lang.python.test:eclipse-test-plugin:0.9.0-SNAPSHOT generated by tycho-surefire-plugin:test (default-test): tests/org.eclipse.ease.lang.python.test/target/surefire-reports/*.xml
23:45:10 [2021-10-23T03:45:10.944Z] [withMaven] junitPublisher - Archive test results for Maven artifact org.eclipse.ease:org.eclipse.ease.lang.python.jython.test:eclipse-test-plugin:0.9.0-SNAPSHOT generated by tycho-surefire-plugin:test (default-test): tests/org.eclipse.ease.lang.python.jython.test/target/surefire-reports/*.xml
23:45:10 [2021-10-23T03:45:10.944Z] [withMaven] junitPublisher - Jenkins JUnit Attachments Plugin not found, can't publish test attachments.Recording test results
23:45:11 [2021-10-23T03:45:11.048Z] [withMaven] Jenkins JaCoCo Plugin not found, don't display org.jacoco:jacoco-maven-plugin:prepare-agent[-integration] results in pipeline screen.
23:45:11 [2021-10-23T03:45:11.051Z] [withMaven] Publishers: Pipeline Graph Publisher: 1 ms, Junit Publisher: 97 ms
[Pipeline] // withMaven
[Pipeline] }
[Pipeline] // stage
[Pipeline] stage
[Pipeline] { (Declarative: Post Actions)
[Pipeline] archiveArtifacts
23:45:11 [2021-10-23T03:45:11.083Z] Archiving artifacts
[Pipeline] emailext
23:45:28 [2021-10-23T03:45:28.723Z] Sending email to: christian.pontesegger@web.de
[Pipeline] }
[Pipeline] // stage
[Pipeline] }
[Pipeline] // timeout
[Pipeline] }
[Pipeline] // timestamps
[Pipeline] }
[Pipeline] // node
[Pipeline] End of Pipeline
ERROR: script returned exit code 1
Finished: FAILURE