FailedConsole Output

Skipping 500 KB.. Full Log
ts/keywordhandler/ScriptContributionItem.html...
23:41:22 [2021-06-19T03:41:22.953Z] Generating ./org/eclipse/ease/ui/scripts/keywordhandler/ShutdownHandler.html...
23:41:22 [2021-06-19T03:41:22.953Z] Generating ./org/eclipse/ease/ui/scripts/keywordhandler/StartupHandler.html...
23:41:22 [2021-06-19T03:41:22.953Z] Generating ./org/eclipse/ease/ui/scripts/keywordhandler/ToolbarHandler.html...
23:41:22 [2021-06-19T03:41:22.953Z] Generating ./org/eclipse/ease/ui/scripts/keywordhandler/ToolbarHandler.Location.html...
23:41:22 [2021-06-19T03:41:22.953Z] Generating ./org/eclipse/ease/ui/scripts/preferences/IPreferenceConstants.html...
23:41:22 [2021-06-19T03:41:22.953Z] Generating ./org/eclipse/ease/ui/scripts/preferences/LocationsPage.html...
23:41:22 [2021-06-19T03:41:22.953Z] Generating ./org/eclipse/ease/ui/scripts/preferences/PreferenceInitializer.html...
23:41:22 [2021-06-19T03:41:22.953Z] Generating ./org/eclipse/ease/ui/scripts/preferences/PreferencesHelper.html...
23:41:22 [2021-06-19T03:41:22.953Z] Generating ./org/eclipse/ease/ui/scripts/preferences/SignaturePreferencePage.html...
23:41:22 [2021-06-19T03:41:22.953Z] Generating ./org/eclipse/ease/ui/scripts/preferences/URIValidator.html...
23:41:23 [2021-06-19T03:41:23.210Z] Generating ./org/eclipse/ease/ui/scripts/repository/IRawLocation.html...
23:41:23 [2021-06-19T03:41:23.210Z] Generating ./org/eclipse/ease/ui/scripts/repository/IRepositoryFactory.html...
23:41:23 [2021-06-19T03:41:23.210Z] Generating ./org/eclipse/ease/ui/scripts/repository/IRepositoryPackage.html...
23:41:23 [2021-06-19T03:41:23.210Z] Generating ./org/eclipse/ease/ui/scripts/repository/IRepositoryPackage.Literals.html...
23:41:23 [2021-06-19T03:41:23.210Z] Generating ./org/eclipse/ease/ui/scripts/repository/IRepositoryService.html...
23:41:23 [2021-06-19T03:41:23.210Z] Generating ./org/eclipse/ease/ui/scripts/repository/IScript.html...
23:41:23 [2021-06-19T03:41:23.210Z] Generating ./org/eclipse/ease/ui/scripts/repository/IScriptLocation.html...
23:41:23 [2021-06-19T03:41:23.210Z] Generating ./org/eclipse/ease/ui/scripts/repository/IStorage.html...
23:41:23 [2021-06-19T03:41:23.210Z] Generating ./org/eclipse/ease/ui/scripts/ui/Decorator.html...
23:41:23 [2021-06-19T03:41:23.210Z] Generating ./org/eclipse/ease/ui/scripts/ui/ScriptComposite.html...
23:41:23 [2021-06-19T03:41:23.210Z] Generating ./org/eclipse/ease/ui/scripts/ui/ScriptContentProvider.html...
23:41:23 [2021-06-19T03:41:23.210Z] Generating ./org/eclipse/ease/ui/scripts/ui/ScriptContextMenuEntries.html...
23:41:23 [2021-06-19T03:41:23.210Z] Generating ./org/eclipse/ease/ui/scripts/ui/ScriptDragSource.html...
23:41:23 [2021-06-19T03:41:23.210Z] Generating ./org/eclipse/ease/ui/scripts/ui/ScriptDropHandler.html...
23:41:23 [2021-06-19T03:41:23.210Z] Generating ./org/eclipse/ease/ui/scripts/ui/ScriptEngineFilter.html...
23:41:23 [2021-06-19T03:41:23.210Z] Generating ./org/eclipse/ease/ui/scripts/ui/ScriptPopup.html...
23:41:23 [2021-06-19T03:41:23.210Z] Generating ./org/eclipse/ease/ui/scripts/ui/ScriptPopupMenu.html...
23:41:23 [2021-06-19T03:41:23.210Z] Generating ./org/eclipse/ease/ui/scripts/ui/ScriptSelectionDialog.html...
23:41:23 [2021-06-19T03:41:23.210Z] Generating ./org/eclipse/ease/ui/tools/AbstractLaunchDelegate.html...
23:41:23 [2021-06-19T03:41:23.210Z] Generating ./org/eclipse/ease/ui/tools/AbstractPopupItem.html...
23:41:23 [2021-06-19T03:41:23.210Z] Generating ./org/eclipse/ease/ui/tools/AbstractPopupMenu.html...
23:41:23 [2021-06-19T03:41:23.210Z] Generating ./org/eclipse/ease/ui/tools/AbstractVirtualTreeProvider.html...
23:41:23 [2021-06-19T03:41:23.211Z] Generating ./org/eclipse/ease/ui/tools/AbstractWorkbenchRunnable.html...
23:41:23 [2021-06-19T03:41:23.211Z] Generating ./org/eclipse/ease/ui/tools/DecoratedLabelProvider.html...
23:41:23 [2021-06-19T03:41:23.211Z] Generating ./org/eclipse/ease/ui/tools/LocationImageDescriptor.html...
23:41:23 [2021-06-19T03:41:23.211Z] Generating ./org/eclipse/ease/ui/tools/TextWithImage.html...
23:41:23 [2021-06-19T03:41:23.211Z] Generating ./org/eclipse/ease/ui/tools/Timer.html...
23:41:23 [2021-06-19T03:41:23.211Z] Generating ./org/eclipse/ease/ui/tools/ToggleHandler.html...
23:41:23 [2021-06-19T03:41:23.211Z] Generating ./org/eclipse/ease/ui/view/EngineContributionFactory.html...
23:41:23 [2021-06-19T03:41:23.211Z] Generating ./org/eclipse/ease/ui/view/ModuleExplorerView.html...
23:41:23 [2021-06-19T03:41:23.211Z] Generating ./org/eclipse/ease/ui/view/ScriptHistoryText.html...
23:41:23 [2021-06-19T03:41:23.211Z] Generating ./org/eclipse/ease/ui/view/ScriptShell.html...
23:41:23 [2021-06-19T03:41:23.211Z] Generating ./org/eclipse/ease/ui/view/TextSelectionProvider.html...
23:41:23 [2021-06-19T03:41:23.211Z] Generating ./org/eclipse/ease/ui/view/VariablesDragListener.html...
23:41:23 [2021-06-19T03:41:23.211Z] Generating ./org/eclipse/ease/ui/views/shell/dropins/AbstractDropin.html...
23:41:23 [2021-06-19T03:41:23.211Z] Generating ./org/eclipse/ease/ui/views/shell/dropins/IShellDropin.html...
23:41:23 [2021-06-19T03:41:23.211Z] Generating ./org/eclipse/ease/urlhandler/WorkspaceURLConnection.html...
23:41:23 [2021-06-19T03:41:23.211Z] Generating ./org/eclipse/ease/urlhandler/WorkspaceURLStreamHandlerService.html...
23:41:23 [2021-06-19T03:41:23.211Z] Generating ./org/eclipse/ease/package-summary.html...
23:41:23 [2021-06-19T03:41:23.211Z] Generating ./org/eclipse/ease/package-tree.html...
23:41:23 [2021-06-19T03:41:23.211Z] Generating ./org/eclipse/ease/classloader/package-summary.html...
23:41:23 [2021-06-19T03:41:23.211Z] Generating ./org/eclipse/ease/classloader/package-tree.html...
23:41:23 [2021-06-19T03:41:23.211Z] Generating ./org/eclipse/ease/debugging/package-summary.html...
23:41:23 [2021-06-19T03:41:23.211Z] Generating ./org/eclipse/ease/debugging/package-tree.html...
23:41:23 [2021-06-19T03:41:23.211Z] Generating ./org/eclipse/ease/debugging/dispatcher/package-summary.html...
23:41:23 [2021-06-19T03:41:23.211Z] Generating ./org/eclipse/ease/debugging/dispatcher/package-tree.html...
23:41:23 [2021-06-19T03:41:23.211Z] Generating ./org/eclipse/ease/debugging/events/package-summary.html...
23:41:23 [2021-06-19T03:41:23.211Z] Generating ./org/eclipse/ease/debugging/events/package-tree.html...
23:41:23 [2021-06-19T03:41:23.211Z] Generating ./org/eclipse/ease/debugging/events/debugger/package-summary.html...
23:41:23 [2021-06-19T03:41:23.211Z] Generating ./org/eclipse/ease/debugging/events/debugger/package-tree.html...
23:41:23 [2021-06-19T03:41:23.211Z] Generating ./org/eclipse/ease/debugging/events/model/package-summary.html...
23:41:23 [2021-06-19T03:41:23.211Z] Generating ./org/eclipse/ease/debugging/events/model/package-tree.html...
23:41:23 [2021-06-19T03:41:23.211Z] Generating ./org/eclipse/ease/debugging/model/package-summary.html...
23:41:23 [2021-06-19T03:41:23.211Z] Generating ./org/eclipse/ease/debugging/model/package-tree.html...
23:41:23 [2021-06-19T03:41:23.211Z] Generating ./org/eclipse/ease/lang/groovy/package-summary.html...
23:41:23 [2021-06-19T03:41:23.211Z] Generating ./org/eclipse/ease/lang/groovy/package-tree.html...
23:41:23 [2021-06-19T03:41:23.211Z] Generating ./org/eclipse/ease/lang/javascript/package-summary.html...
23:41:23 [2021-06-19T03:41:23.211Z] Generating ./org/eclipse/ease/lang/javascript/package-tree.html...
23:41:23 [2021-06-19T03:41:23.211Z] Generating ./org/eclipse/ease/lang/javascript/nashorn/package-summary.html...
23:41:23 [2021-06-19T03:41:23.211Z] Generating ./org/eclipse/ease/lang/javascript/nashorn/package-tree.html...
23:41:23 [2021-06-19T03:41:23.211Z] Generating ./org/eclipse/ease/lang/javascript/rhino/package-summary.html...
23:41:23 [2021-06-19T03:41:23.211Z] Generating ./org/eclipse/ease/lang/javascript/rhino/package-tree.html...
23:41:23 [2021-06-19T03:41:23.211Z] Generating ./org/eclipse/ease/lang/jvm/compiled/package-summary.html...
23:41:23 [2021-06-19T03:41:23.211Z] Generating ./org/eclipse/ease/lang/jvm/compiled/package-tree.html...
23:41:23 [2021-06-19T03:41:23.211Z] Generating ./org/eclipse/ease/lang/python/package-summary.html...
23:41:23 [2021-06-19T03:41:23.211Z] Generating ./org/eclipse/ease/lang/python/package-tree.html...
23:41:23 [2021-06-19T03:41:23.211Z] Generating ./org/eclipse/ease/lang/python/debug/package-summary.html...
23:41:23 [2021-06-19T03:41:23.211Z] Generating ./org/eclipse/ease/lang/python/debug/package-tree.html...
23:41:23 [2021-06-19T03:41:23.211Z] Generating ./org/eclipse/ease/lang/python/debugger/package-summary.html...
23:41:23 [2021-06-19T03:41:23.211Z] Generating ./org/eclipse/ease/lang/python/debugger/package-tree.html...
23:41:23 [2021-06-19T03:41:23.211Z] Generating ./org/eclipse/ease/lang/python/debugger/actions/package-summary.html...
23:41:23 [2021-06-19T03:41:23.211Z] Generating ./org/eclipse/ease/lang/python/debugger/actions/package-tree.html...
23:41:23 [2021-06-19T03:41:23.211Z] Generating ./org/eclipse/ease/lang/python/debugger/model/package-summary.html...
23:41:23 [2021-06-19T03:41:23.211Z] Generating ./org/eclipse/ease/lang/python/debugger/model/package-tree.html...
23:41:23 [2021-06-19T03:41:23.211Z] Generating ./org/eclipse/ease/lang/python/jython/package-summary.html...
23:41:23 [2021-06-19T03:41:23.211Z] Generating ./org/eclipse/ease/lang/python/jython/package-tree.html...
23:41:23 [2021-06-19T03:41:23.468Z] Generating ./org/eclipse/ease/lang/python/preferences/package-summary.html...
23:41:23 [2021-06-19T03:41:23.468Z] Generating ./org/eclipse/ease/lang/python/preferences/package-tree.html...
23:41:23 [2021-06-19T03:41:23.468Z] Generating ./org/eclipse/ease/lang/python/py4j/internal/package-summary.html...
23:41:23 [2021-06-19T03:41:23.468Z] Generating ./org/eclipse/ease/lang/python/py4j/internal/package-tree.html...
23:41:23 [2021-06-19T03:41:23.468Z] Generating ./org/eclipse/ease/lang/python/py4j/internal/ui/package-summary.html...
23:41:23 [2021-06-19T03:41:23.468Z] Generating ./org/eclipse/ease/lang/python/py4j/internal/ui/package-tree.html...
23:41:23 [2021-06-19T03:41:23.468Z] Generating ./org/eclipse/ease/lang/python/ui/completion/package-summary.html...
23:41:23 [2021-06-19T03:41:23.468Z] Generating ./org/eclipse/ease/lang/python/ui/completion/package-tree.html...
23:41:23 [2021-06-19T03:41:23.468Z] Generating ./org/eclipse/ease/lang/ruby/package-summary.html...
23:41:23 [2021-06-19T03:41:23.468Z] Generating ./org/eclipse/ease/lang/ruby/package-tree.html...
23:41:23 [2021-06-19T03:41:23.468Z] Generating ./org/eclipse/ease/lang/scriptarchive/package-summary.html...
23:41:23 [2021-06-19T03:41:23.468Z] Generating ./org/eclipse/ease/lang/scriptarchive/package-tree.html...
23:41:23 [2021-06-19T03:41:23.468Z] Generating ./org/eclipse/ease/lang/unittest/package-summary.html...
23:41:23 [2021-06-19T03:41:23.468Z] Generating ./org/eclipse/ease/lang/unittest/package-tree.html...
23:41:23 [2021-06-19T03:41:23.468Z] Generating ./org/eclipse/ease/lang/unittest/definition/package-summary.html...
23:41:23 [2021-06-19T03:41:23.468Z] Generating ./org/eclipse/ease/lang/unittest/definition/package-tree.html...
23:41:23 [2021-06-19T03:41:23.468Z] Generating ./org/eclipse/ease/lang/unittest/definition/impl/package-summary.html...
23:41:23 [2021-06-19T03:41:23.468Z] Generating ./org/eclipse/ease/lang/unittest/definition/impl/package-tree.html...
23:41:23 [2021-06-19T03:41:23.468Z] Generating ./org/eclipse/ease/lang/unittest/definition/provider/package-summary.html...
23:41:23 [2021-06-19T03:41:23.468Z] Generating ./org/eclipse/ease/lang/unittest/definition/provider/package-tree.html...
23:41:23 [2021-06-19T03:41:23.468Z] Generating ./org/eclipse/ease/lang/unittest/definition/util/package-summary.html...
23:41:23 [2021-06-19T03:41:23.468Z] Generating ./org/eclipse/ease/lang/unittest/definition/util/package-tree.html...
23:41:23 [2021-06-19T03:41:23.468Z] Generating ./org/eclipse/ease/lang/unittest/reporters/package-summary.html...
23:41:23 [2021-06-19T03:41:23.468Z] Generating ./org/eclipse/ease/lang/unittest/reporters/package-tree.html...
23:41:23 [2021-06-19T03:41:23.468Z] Generating ./org/eclipse/ease/lang/unittest/runtime/package-summary.html...
23:41:23 [2021-06-19T03:41:23.468Z] Generating ./org/eclipse/ease/lang/unittest/runtime/package-tree.html...
23:41:23 [2021-06-19T03:41:23.468Z] Generating ./org/eclipse/ease/lang/unittest/runtime/impl/package-summary.html...
23:41:23 [2021-06-19T03:41:23.468Z] Generating ./org/eclipse/ease/lang/unittest/runtime/impl/package-tree.html...
23:41:23 [2021-06-19T03:41:23.468Z] Generating ./org/eclipse/ease/lang/unittest/runtime/util/package-summary.html...
23:41:23 [2021-06-19T03:41:23.468Z] Generating ./org/eclipse/ease/lang/unittest/runtime/util/package-tree.html...
23:41:23 [2021-06-19T03:41:23.468Z] Generating ./org/eclipse/ease/lang/unittest/ui/editor/package-summary.html...
23:41:23 [2021-06-19T03:41:23.468Z] Generating ./org/eclipse/ease/lang/unittest/ui/editor/package-tree.html...
23:41:23 [2021-06-19T03:41:23.468Z] Generating ./org/eclipse/ease/lang/unittest/ui/views/package-summary.html...
23:41:23 [2021-06-19T03:41:23.468Z] Generating ./org/eclipse/ease/lang/unittest/ui/views/package-tree.html...
23:41:23 [2021-06-19T03:41:23.468Z] Generating ./org/eclipse/ease/modules/package-summary.html...
23:41:23 [2021-06-19T03:41:23.468Z] Generating ./org/eclipse/ease/modules/package-tree.html...
23:41:23 [2021-06-19T03:41:23.468Z] Generating ./org/eclipse/ease/service/package-summary.html...
23:41:23 [2021-06-19T03:41:23.468Z] Generating ./org/eclipse/ease/service/package-tree.html...
23:41:23 [2021-06-19T03:41:23.468Z] Generating ./org/eclipse/ease/sign/package-summary.html...
23:41:23 [2021-06-19T03:41:23.468Z] Generating ./org/eclipse/ease/sign/package-tree.html...
23:41:23 [2021-06-19T03:41:23.468Z] Generating ./org/eclipse/ease/tools/package-summary.html...
23:41:23 [2021-06-19T03:41:23.468Z] Generating ./org/eclipse/ease/tools/package-tree.html...
23:41:23 [2021-06-19T03:41:23.469Z] Generating ./org/eclipse/ease/ui/package-summary.html...
23:41:23 [2021-06-19T03:41:23.469Z] Generating ./org/eclipse/ease/ui/package-tree.html...
23:41:23 [2021-06-19T03:41:23.469Z] Generating ./org/eclipse/ease/ui/completion/package-summary.html...
23:41:23 [2021-06-19T03:41:23.469Z] Generating ./org/eclipse/ease/ui/completion/package-tree.html...
23:41:23 [2021-06-19T03:41:23.469Z] Generating ./org/eclipse/ease/ui/completion/provider/package-summary.html...
23:41:23 [2021-06-19T03:41:23.469Z] Generating ./org/eclipse/ease/ui/completion/provider/package-tree.html...
23:41:23 [2021-06-19T03:41:23.469Z] Generating ./org/eclipse/ease/ui/console/package-summary.html...
23:41:23 [2021-06-19T03:41:23.469Z] Generating ./org/eclipse/ease/ui/console/package-tree.html...
23:41:23 [2021-06-19T03:41:23.469Z] Generating ./org/eclipse/ease/ui/console/actions/package-summary.html...
23:41:23 [2021-06-19T03:41:23.469Z] Generating ./org/eclipse/ease/ui/console/actions/package-tree.html...
23:41:23 [2021-06-19T03:41:23.469Z] Generating ./org/eclipse/ease/ui/debugging/model/package-summary.html...
23:41:23 [2021-06-19T03:41:23.469Z] Generating ./org/eclipse/ease/ui/debugging/model/package-tree.html...
23:41:23 [2021-06-19T03:41:23.469Z] Generating ./org/eclipse/ease/ui/dnd/package-summary.html...
23:41:23 [2021-06-19T03:41:23.469Z] Generating ./org/eclipse/ease/ui/dnd/package-tree.html...
23:41:23 [2021-06-19T03:41:23.469Z] Generating ./org/eclipse/ease/ui/handler/package-summary.html...
23:41:23 [2021-06-19T03:41:23.469Z] Generating ./org/eclipse/ease/ui/handler/package-tree.html...
23:41:23 [2021-06-19T03:41:23.469Z] Generating ./org/eclipse/ease/ui/help/hovers/package-summary.html...
23:41:23 [2021-06-19T03:41:23.469Z] Generating ./org/eclipse/ease/ui/help/hovers/package-tree.html...
23:41:23 [2021-06-19T03:41:23.469Z] Generating ./org/eclipse/ease/ui/launching/package-summary.html...
23:41:23 [2021-06-19T03:41:23.469Z] Generating ./org/eclipse/ease/ui/launching/package-tree.html...
23:41:23 [2021-06-19T03:41:23.469Z] Generating ./org/eclipse/ease/ui/modules/ui/package-summary.html...
23:41:23 [2021-06-19T03:41:23.469Z] Generating ./org/eclipse/ease/ui/modules/ui/package-tree.html...
23:41:23 [2021-06-19T03:41:23.469Z] Generating ./org/eclipse/ease/ui/perspectives/package-summary.html...
23:41:23 [2021-06-19T03:41:23.469Z] Generating ./org/eclipse/ease/ui/perspectives/package-tree.html...
23:41:23 [2021-06-19T03:41:23.469Z] Generating ./org/eclipse/ease/ui/preferences/package-summary.html...
23:41:23 [2021-06-19T03:41:23.469Z] Generating ./org/eclipse/ease/ui/preferences/package-tree.html...
23:41:23 [2021-06-19T03:41:23.469Z] Generating ./org/eclipse/ease/ui/propertytester/package-summary.html...
23:41:23 [2021-06-19T03:41:23.469Z] Generating ./org/eclipse/ease/ui/propertytester/package-tree.html...
23:41:23 [2021-06-19T03:41:23.469Z] Generating ./org/eclipse/ease/ui/scripts/package-summary.html...
23:41:23 [2021-06-19T03:41:23.469Z] Generating ./org/eclipse/ease/ui/scripts/package-tree.html...
23:41:23 [2021-06-19T03:41:23.469Z] Generating ./org/eclipse/ease/ui/scripts/expressions/package-summary.html...
23:41:23 [2021-06-19T03:41:23.469Z] Generating ./org/eclipse/ease/ui/scripts/expressions/package-tree.html...
23:41:23 [2021-06-19T03:41:23.469Z] Generating ./org/eclipse/ease/ui/scripts/expressions/definitions/package-summary.html...
23:41:23 [2021-06-19T03:41:23.469Z] Generating ./org/eclipse/ease/ui/scripts/expressions/definitions/package-tree.html...
23:41:23 [2021-06-19T03:41:23.469Z] Generating ./org/eclipse/ease/ui/scripts/expressions/handler/package-summary.html...
23:41:23 [2021-06-19T03:41:23.469Z] Generating ./org/eclipse/ease/ui/scripts/expressions/handler/package-tree.html...
23:41:23 [2021-06-19T03:41:23.469Z] Generating ./org/eclipse/ease/ui/scripts/expressions/ui/package-summary.html...
23:41:23 [2021-06-19T03:41:23.469Z] Generating ./org/eclipse/ease/ui/scripts/expressions/ui/package-tree.html...
23:41:23 [2021-06-19T03:41:23.469Z] Generating ./org/eclipse/ease/ui/scripts/keywordhandler/package-summary.html...
23:41:23 [2021-06-19T03:41:23.469Z] Generating ./org/eclipse/ease/ui/scripts/keywordhandler/package-tree.html...
23:41:23 [2021-06-19T03:41:23.469Z] Generating ./org/eclipse/ease/ui/scripts/preferences/package-summary.html...
23:41:23 [2021-06-19T03:41:23.469Z] Generating ./org/eclipse/ease/ui/scripts/preferences/package-tree.html...
23:41:23 [2021-06-19T03:41:23.469Z] Generating ./org/eclipse/ease/ui/scripts/repository/package-summary.html...
23:41:23 [2021-06-19T03:41:23.469Z] Generating ./org/eclipse/ease/ui/scripts/repository/package-tree.html...
23:41:23 [2021-06-19T03:41:23.469Z] Generating ./org/eclipse/ease/ui/scripts/ui/package-summary.html...
23:41:23 [2021-06-19T03:41:23.469Z] Generating ./org/eclipse/ease/ui/scripts/ui/package-tree.html...
23:41:23 [2021-06-19T03:41:23.469Z] Generating ./org/eclipse/ease/ui/tools/package-summary.html...
23:41:23 [2021-06-19T03:41:23.469Z] Generating ./org/eclipse/ease/ui/tools/package-tree.html...
23:41:23 [2021-06-19T03:41:23.469Z] Generating ./org/eclipse/ease/ui/view/package-summary.html...
23:41:23 [2021-06-19T03:41:23.469Z] Generating ./org/eclipse/ease/ui/view/package-tree.html...
23:41:23 [2021-06-19T03:41:23.469Z] Generating ./org/eclipse/ease/ui/views/shell/dropins/package-summary.html...
23:41:23 [2021-06-19T03:41:23.469Z] Generating ./org/eclipse/ease/ui/views/shell/dropins/package-tree.html...
23:41:23 [2021-06-19T03:41:23.469Z] Generating ./org/eclipse/ease/urlhandler/package-summary.html...
23:41:23 [2021-06-19T03:41:23.469Z] Generating ./org/eclipse/ease/urlhandler/package-tree.html...
23:41:23 [2021-06-19T03:41:23.469Z] Generating ./constant-values.html...
23:41:23 [2021-06-19T03:41:23.469Z] Generating ./serialized-form.html...
23:41:23 [2021-06-19T03:41:23.469Z] Generating ./overview-tree.html...
23:41:23 [2021-06-19T03:41:23.469Z] Generating ./deprecated-list.html...
23:41:23 [2021-06-19T03:41:23.469Z] Generating ./index.html...
23:41:23 [2021-06-19T03:41:23.469Z] Building index for all the packages and classes...
23:41:23 [2021-06-19T03:41:23.725Z] Generating ./index-all.html...
23:41:23 [2021-06-19T03:41:23.982Z] Building index for all classes...
23:41:23 [2021-06-19T03:41:23.982Z] Generating ./allclasses-index.html...
23:41:23 [2021-06-19T03:41:23.982Z] Generating ./allpackages-index.html...
23:41:23 [2021-06-19T03:41:23.982Z] Generating ./overview-summary.html...
23:41:23 [2021-06-19T03:41:23.982Z] Generating ./help-doc.html...
23:41:23 [2021-06-19T03:41:23.982Z] 100 errors
23:41:23 [2021-06-19T03:41:23.982Z] 100 warnings
23:41:23 [2021-06-19T03:41:23.982Z] [INFO] execution failed with rc = 1
23:41:23 [2021-06-19T03:41:23.982Z] [INFO] Make relative - base: /home/jenkins/agent/workspace/ease.verify.core.target.2018-12/plugins/org.eclipse.ease.help, file: /home/jenkins/agent/workspace/ease.verify.core.target.2018-12/plugins/org.eclipse.ease.help/help/api-docs/javadoc/overview-summary.html -> help/api-docs/javadoc/overview-summary.html
23:41:23 [2021-06-19T03:41:23.982Z] [INFO] Make relative - base: /home/jenkins/agent/workspace/ease.verify.core.target.2018-12/plugins/org.eclipse.ease.help, file: /home/jenkins/agent/workspace/ease.verify.core.target.2018-12/plugins/org.eclipse.ease.help/help/api-docs/javadoc/constant-values.html -> help/api-docs/javadoc/constant-values.html
23:41:23 [2021-06-19T03:41:23.982Z] [INFO] Make relative - base: /home/jenkins/agent/workspace/ease.verify.core.target.2018-12/plugins/org.eclipse.ease.help, file: /home/jenkins/agent/workspace/ease.verify.core.target.2018-12/plugins/org.eclipse.ease.help/help/api-docs/javadoc/deprecated-list.html -> help/api-docs/javadoc/deprecated-list.html
23:41:23 [2021-06-19T03:41:23.982Z] [INFO] Make relative - base: /home/jenkins/agent/workspace/ease.verify.core.target.2018-12/plugins/org.eclipse.ease.help, file: /home/jenkins/agent/workspace/ease.verify.core.target.2018-12/plugins/org.eclipse.ease.help/help/api-docs/javadoc/org/eclipse/ease/package-summary.html -> help/api-docs/javadoc/org/eclipse/ease/package-summary.html
23:41:23 [2021-06-19T03:41:23.982Z] [INFO] Make relative - base: /home/jenkins/agent/workspace/ease.verify.core.target.2018-12/plugins/org.eclipse.ease.help, file: /home/jenkins/agent/workspace/ease.verify.core.target.2018-12/plugins/org.eclipse.ease.help/help/api-docs/javadoc/org/eclipse/ease/classloader/package-summary.html -> help/api-docs/javadoc/org/eclipse/ease/classloader/package-summary.html
23:41:23 [2021-06-19T03:41:23.983Z] [INFO] Make relative - base: /home/jenkins/agent/workspace/ease.verify.core.target.2018-12/plugins/org.eclipse.ease.help, file: /home/jenkins/agent/workspace/ease.verify.core.target.2018-12/plugins/org.eclipse.ease.help/help/api-docs/javadoc/org/eclipse/ease/debugging/package-summary.html -> help/api-docs/javadoc/org/eclipse/ease/debugging/package-summary.html
23:41:23 [2021-06-19T03:41:23.983Z] [INFO] Make relative - base: /home/jenkins/agent/workspace/ease.verify.core.target.2018-12/plugins/org.eclipse.ease.help, file: /home/jenkins/agent/workspace/ease.verify.core.target.2018-12/plugins/org.eclipse.ease.help/help/api-docs/javadoc/org/eclipse/ease/debugging/dispatcher/package-summary.html -> help/api-docs/javadoc/org/eclipse/ease/debugging/dispatcher/package-summary.html
23:41:23 [2021-06-19T03:41:23.983Z] [INFO] Make relative - base: /home/jenkins/agent/workspace/ease.verify.core.target.2018-12/plugins/org.eclipse.ease.help, file: /home/jenkins/agent/workspace/ease.verify.core.target.2018-12/plugins/org.eclipse.ease.help/help/api-docs/javadoc/org/eclipse/ease/debugging/events/package-summary.html -> help/api-docs/javadoc/org/eclipse/ease/debugging/events/package-summary.html
23:41:23 [2021-06-19T03:41:23.983Z] [INFO] Make relative - base: /home/jenkins/agent/workspace/ease.verify.core.target.2018-12/plugins/org.eclipse.ease.help, file: /home/jenkins/agent/workspace/ease.verify.core.target.2018-12/plugins/org.eclipse.ease.help/help/api-docs/javadoc/org/eclipse/ease/debugging/events/debugger/package-summary.html -> help/api-docs/javadoc/org/eclipse/ease/debugging/events/debugger/package-summary.html
23:41:23 [2021-06-19T03:41:23.983Z] [INFO] Make relative - base: /home/jenkins/agent/workspace/ease.verify.core.target.2018-12/plugins/org.eclipse.ease.help, file: /home/jenkins/agent/workspace/ease.verify.core.target.2018-12/plugins/org.eclipse.ease.help/help/api-docs/javadoc/org/eclipse/ease/debugging/events/model/package-summary.html -> help/api-docs/javadoc/org/eclipse/ease/debugging/events/model/package-summary.html
23:41:23 [2021-06-19T03:41:23.983Z] [INFO] Make relative - base: /home/jenkins/agent/workspace/ease.verify.core.target.2018-12/plugins/org.eclipse.ease.help, file: /home/jenkins/agent/workspace/ease.verify.core.target.2018-12/plugins/org.eclipse.ease.help/help/api-docs/javadoc/org/eclipse/ease/debugging/model/package-summary.html -> help/api-docs/javadoc/org/eclipse/ease/debugging/model/package-summary.html
23:41:23 [2021-06-19T03:41:23.983Z] [INFO] Make relative - base: /home/jenkins/agent/workspace/ease.verify.core.target.2018-12/plugins/org.eclipse.ease.help, file: /home/jenkins/agent/workspace/ease.verify.core.target.2018-12/plugins/org.eclipse.ease.help/help/api-docs/javadoc/org/eclipse/ease/lang/groovy/package-summary.html -> help/api-docs/javadoc/org/eclipse/ease/lang/groovy/package-summary.html
23:41:23 [2021-06-19T03:41:23.983Z] [INFO] Make relative - base: /home/jenkins/agent/workspace/ease.verify.core.target.2018-12/plugins/org.eclipse.ease.help, file: /home/jenkins/agent/workspace/ease.verify.core.target.2018-12/plugins/org.eclipse.ease.help/help/api-docs/javadoc/org/eclipse/ease/lang/javascript/package-summary.html -> help/api-docs/javadoc/org/eclipse/ease/lang/javascript/package-summary.html
23:41:23 [2021-06-19T03:41:23.983Z] [INFO] Make relative - base: /home/jenkins/agent/workspace/ease.verify.core.target.2018-12/plugins/org.eclipse.ease.help, file: /home/jenkins/agent/workspace/ease.verify.core.target.2018-12/plugins/org.eclipse.ease.help/help/api-docs/javadoc/org/eclipse/ease/lang/javascript/nashorn/package-summary.html -> help/api-docs/javadoc/org/eclipse/ease/lang/javascript/nashorn/package-summary.html
23:41:23 [2021-06-19T03:41:23.983Z] [INFO] Make relative - base: /home/jenkins/agent/workspace/ease.verify.core.target.2018-12/plugins/org.eclipse.ease.help, file: /home/jenkins/agent/workspace/ease.verify.core.target.2018-12/plugins/org.eclipse.ease.help/help/api-docs/javadoc/org/eclipse/ease/lang/javascript/rhino/package-summary.html -> help/api-docs/javadoc/org/eclipse/ease/lang/javascript/rhino/package-summary.html
23:41:23 [2021-06-19T03:41:23.983Z] [INFO] Make relative - base: /home/jenkins/agent/workspace/ease.verify.core.target.2018-12/plugins/org.eclipse.ease.help, file: /home/jenkins/agent/workspace/ease.verify.core.target.2018-12/plugins/org.eclipse.ease.help/help/api-docs/javadoc/org/eclipse/ease/lang/jvm/compiled/package-summary.html -> help/api-docs/javadoc/org/eclipse/ease/lang/jvm/compiled/package-summary.html
23:41:23 [2021-06-19T03:41:23.983Z] [INFO] Make relative - base: /home/jenkins/agent/workspace/ease.verify.core.target.2018-12/plugins/org.eclipse.ease.help, file: /home/jenkins/agent/workspace/ease.verify.core.target.2018-12/plugins/org.eclipse.ease.help/help/api-docs/javadoc/org/eclipse/ease/lang/python/package-summary.html -> help/api-docs/javadoc/org/eclipse/ease/lang/python/package-summary.html
23:41:23 [2021-06-19T03:41:23.983Z] [INFO] Make relative - base: /home/jenkins/agent/workspace/ease.verify.core.target.2018-12/plugins/org.eclipse.ease.help, file: /home/jenkins/agent/workspace/ease.verify.core.target.2018-12/plugins/org.eclipse.ease.help/help/api-docs/javadoc/org/eclipse/ease/lang/python/debug/package-summary.html -> help/api-docs/javadoc/org/eclipse/ease/lang/python/debug/package-summary.html
23:41:23 [2021-06-19T03:41:23.983Z] [INFO] Make relative - base: /home/jenkins/agent/workspace/ease.verify.core.target.2018-12/plugins/org.eclipse.ease.help, file: /home/jenkins/agent/workspace/ease.verify.core.target.2018-12/plugins/org.eclipse.ease.help/help/api-docs/javadoc/org/eclipse/ease/lang/python/debugger/package-summary.html -> help/api-docs/javadoc/org/eclipse/ease/lang/python/debugger/package-summary.html
23:41:23 [2021-06-19T03:41:23.983Z] [INFO] Make relative - base: /home/jenkins/agent/workspace/ease.verify.core.target.2018-12/plugins/org.eclipse.ease.help, file: /home/jenkins/agent/workspace/ease.verify.core.target.2018-12/plugins/org.eclipse.ease.help/help/api-docs/javadoc/org/eclipse/ease/lang/python/debugger/actions/package-summary.html -> help/api-docs/javadoc/org/eclipse/ease/lang/python/debugger/actions/package-summary.html
23:41:23 [2021-06-19T03:41:23.983Z] [INFO] Make relative - base: /home/jenkins/agent/workspace/ease.verify.core.target.2018-12/plugins/org.eclipse.ease.help, file: /home/jenkins/agent/workspace/ease.verify.core.target.2018-12/plugins/org.eclipse.ease.help/help/api-docs/javadoc/org/eclipse/ease/lang/python/debugger/model/package-summary.html -> help/api-docs/javadoc/org/eclipse/ease/lang/python/debugger/model/package-summary.html
23:41:23 [2021-06-19T03:41:23.983Z] [INFO] Make relative - base: /home/jenkins/agent/workspace/ease.verify.core.target.2018-12/plugins/org.eclipse.ease.help, file: /home/jenkins/agent/workspace/ease.verify.core.target.2018-12/plugins/org.eclipse.ease.help/help/api-docs/javadoc/org/eclipse/ease/lang/python/jython/package-summary.html -> help/api-docs/javadoc/org/eclipse/ease/lang/python/jython/package-summary.html
23:41:23 [2021-06-19T03:41:23.984Z] [INFO] Make relative - base: /home/jenkins/agent/workspace/ease.verify.core.target.2018-12/plugins/org.eclipse.ease.help, file: /home/jenkins/agent/workspace/ease.verify.core.target.2018-12/plugins/org.eclipse.ease.help/help/api-docs/javadoc/org/eclipse/ease/lang/python/preferences/package-summary.html -> help/api-docs/javadoc/org/eclipse/ease/lang/python/preferences/package-summary.html
23:41:23 [2021-06-19T03:41:23.984Z] [INFO] Make relative - base: /home/jenkins/agent/workspace/ease.verify.core.target.2018-12/plugins/org.eclipse.ease.help, file: /home/jenkins/agent/workspace/ease.verify.core.target.2018-12/plugins/org.eclipse.ease.help/help/api-docs/javadoc/org/eclipse/ease/lang/python/py4j/internal/package-summary.html -> help/api-docs/javadoc/org/eclipse/ease/lang/python/py4j/internal/package-summary.html
23:41:23 [2021-06-19T03:41:23.984Z] [INFO] Make relative - base: /home/jenkins/agent/workspace/ease.verify.core.target.2018-12/plugins/org.eclipse.ease.help, file: /home/jenkins/agent/workspace/ease.verify.core.target.2018-12/plugins/org.eclipse.ease.help/help/api-docs/javadoc/org/eclipse/ease/lang/python/py4j/internal/ui/package-summary.html -> help/api-docs/javadoc/org/eclipse/ease/lang/python/py4j/internal/ui/package-summary.html
23:41:23 [2021-06-19T03:41:23.984Z] [INFO] Make relative - base: /home/jenkins/agent/workspace/ease.verify.core.target.2018-12/plugins/org.eclipse.ease.help, file: /home/jenkins/agent/workspace/ease.verify.core.target.2018-12/plugins/org.eclipse.ease.help/help/api-docs/javadoc/org/eclipse/ease/lang/python/ui/completion/package-summary.html -> help/api-docs/javadoc/org/eclipse/ease/lang/python/ui/completion/package-summary.html
23:41:23 [2021-06-19T03:41:23.984Z] [INFO] Make relative - base: /home/jenkins/agent/workspace/ease.verify.core.target.2018-12/plugins/org.eclipse.ease.help, file: /home/jenkins/agent/workspace/ease.verify.core.target.2018-12/plugins/org.eclipse.ease.help/help/api-docs/javadoc/org/eclipse/ease/lang/ruby/package-summary.html -> help/api-docs/javadoc/org/eclipse/ease/lang/ruby/package-summary.html
23:41:23 [2021-06-19T03:41:23.984Z] [INFO] Make relative - base: /home/jenkins/agent/workspace/ease.verify.core.target.2018-12/plugins/org.eclipse.ease.help, file: /home/jenkins/agent/workspace/ease.verify.core.target.2018-12/plugins/org.eclipse.ease.help/help/api-docs/javadoc/org/eclipse/ease/lang/scriptarchive/package-summary.html -> help/api-docs/javadoc/org/eclipse/ease/lang/scriptarchive/package-summary.html
23:41:23 [2021-06-19T03:41:23.984Z] [INFO] Make relative - base: /home/jenkins/agent/workspace/ease.verify.core.target.2018-12/plugins/org.eclipse.ease.help, file: /home/jenkins/agent/workspace/ease.verify.core.target.2018-12/plugins/org.eclipse.ease.help/help/api-docs/javadoc/org/eclipse/ease/lang/unittest/package-summary.html -> help/api-docs/javadoc/org/eclipse/ease/lang/unittest/package-summary.html
23:41:23 [2021-06-19T03:41:23.984Z] [INFO] Make relative - base: /home/jenkins/agent/workspace/ease.verify.core.target.2018-12/plugins/org.eclipse.ease.help, file: /home/jenkins/agent/workspace/ease.verify.core.target.2018-12/plugins/org.eclipse.ease.help/help/api-docs/javadoc/org/eclipse/ease/lang/unittest/definition/package-summary.html -> help/api-docs/javadoc/org/eclipse/ease/lang/unittest/definition/package-summary.html
23:41:23 [2021-06-19T03:41:23.984Z] [INFO] Make relative - base: /home/jenkins/agent/workspace/ease.verify.core.target.2018-12/plugins/org.eclipse.ease.help, file: /home/jenkins/agent/workspace/ease.verify.core.target.2018-12/plugins/org.eclipse.ease.help/help/api-docs/javadoc/org/eclipse/ease/lang/unittest/definition/impl/package-summary.html -> help/api-docs/javadoc/org/eclipse/ease/lang/unittest/definition/impl/package-summary.html
23:41:23 [2021-06-19T03:41:23.984Z] [INFO] Make relative - base: /home/jenkins/agent/workspace/ease.verify.core.target.2018-12/plugins/org.eclipse.ease.help, file: /home/jenkins/agent/workspace/ease.verify.core.target.2018-12/plugins/org.eclipse.ease.help/help/api-docs/javadoc/org/eclipse/ease/lang/unittest/definition/provider/package-summary.html -> help/api-docs/javadoc/org/eclipse/ease/lang/unittest/definition/provider/package-summary.html
23:41:23 [2021-06-19T03:41:23.984Z] [INFO] Make relative - base: /home/jenkins/agent/workspace/ease.verify.core.target.2018-12/plugins/org.eclipse.ease.help, file: /home/jenkins/agent/workspace/ease.verify.core.target.2018-12/plugins/org.eclipse.ease.help/help/api-docs/javadoc/org/eclipse/ease/lang/unittest/definition/util/package-summary.html -> help/api-docs/javadoc/org/eclipse/ease/lang/unittest/definition/util/package-summary.html
23:41:23 [2021-06-19T03:41:23.984Z] [INFO] Make relative - base: /home/jenkins/agent/workspace/ease.verify.core.target.2018-12/plugins/org.eclipse.ease.help, file: /home/jenkins/agent/workspace/ease.verify.core.target.2018-12/plugins/org.eclipse.ease.help/help/api-docs/javadoc/org/eclipse/ease/lang/unittest/reporters/package-summary.html -> help/api-docs/javadoc/org/eclipse/ease/lang/unittest/reporters/package-summary.html
23:41:23 [2021-06-19T03:41:23.984Z] [INFO] Make relative - base: /home/jenkins/agent/workspace/ease.verify.core.target.2018-12/plugins/org.eclipse.ease.help, file: /home/jenkins/agent/workspace/ease.verify.core.target.2018-12/plugins/org.eclipse.ease.help/help/api-docs/javadoc/org/eclipse/ease/lang/unittest/runtime/package-summary.html -> help/api-docs/javadoc/org/eclipse/ease/lang/unittest/runtime/package-summary.html
23:41:23 [2021-06-19T03:41:23.984Z] [INFO] Make relative - base: /home/jenkins/agent/workspace/ease.verify.core.target.2018-12/plugins/org.eclipse.ease.help, file: /home/jenkins/agent/workspace/ease.verify.core.target.2018-12/plugins/org.eclipse.ease.help/help/api-docs/javadoc/org/eclipse/ease/lang/unittest/runtime/impl/package-summary.html -> help/api-docs/javadoc/org/eclipse/ease/lang/unittest/runtime/impl/package-summary.html
23:41:23 [2021-06-19T03:41:23.984Z] [INFO] Make relative - base: /home/jenkins/agent/workspace/ease.verify.core.target.2018-12/plugins/org.eclipse.ease.help, file: /home/jenkins/agent/workspace/ease.verify.core.target.2018-12/plugins/org.eclipse.ease.help/help/api-docs/javadoc/org/eclipse/ease/lang/unittest/runtime/util/package-summary.html -> help/api-docs/javadoc/org/eclipse/ease/lang/unittest/runtime/util/package-summary.html
23:41:23 [2021-06-19T03:41:23.984Z] [INFO] Make relative - base: /home/jenkins/agent/workspace/ease.verify.core.target.2018-12/plugins/org.eclipse.ease.help, file: /home/jenkins/agent/workspace/ease.verify.core.target.2018-12/plugins/org.eclipse.ease.help/help/api-docs/javadoc/org/eclipse/ease/lang/unittest/ui/editor/package-summary.html -> help/api-docs/javadoc/org/eclipse/ease/lang/unittest/ui/editor/package-summary.html
23:41:23 [2021-06-19T03:41:23.984Z] [INFO] Make relative - base: /home/jenkins/agent/workspace/ease.verify.core.target.2018-12/plugins/org.eclipse.ease.help, file: /home/jenkins/agent/workspace/ease.verify.core.target.2018-12/plugins/org.eclipse.ease.help/help/api-docs/javadoc/org/eclipse/ease/lang/unittest/ui/views/package-summary.html -> help/api-docs/javadoc/org/eclipse/ease/lang/unittest/ui/views/package-summary.html
23:41:23 [2021-06-19T03:41:23.984Z] [INFO] Make relative - base: /home/jenkins/agent/workspace/ease.verify.core.target.2018-12/plugins/org.eclipse.ease.help, file: /home/jenkins/agent/workspace/ease.verify.core.target.2018-12/plugins/org.eclipse.ease.help/help/api-docs/javadoc/org/eclipse/ease/modules/package-summary.html -> help/api-docs/javadoc/org/eclipse/ease/modules/package-summary.html
23:41:23 [2021-06-19T03:41:23.984Z] [INFO] Make relative - base: /home/jenkins/agent/workspace/ease.verify.core.target.2018-12/plugins/org.eclipse.ease.help, file: /home/jenkins/agent/workspace/ease.verify.core.target.2018-12/plugins/org.eclipse.ease.help/help/api-docs/javadoc/org/eclipse/ease/service/package-summary.html -> help/api-docs/javadoc/org/eclipse/ease/service/package-summary.html
23:41:23 [2021-06-19T03:41:23.984Z] [INFO] Make relative - base: /home/jenkins/agent/workspace/ease.verify.core.target.2018-12/plugins/org.eclipse.ease.help, file: /home/jenkins/agent/workspace/ease.verify.core.target.2018-12/plugins/org.eclipse.ease.help/help/api-docs/javadoc/org/eclipse/ease/sign/package-summary.html -> help/api-docs/javadoc/org/eclipse/ease/sign/package-summary.html
23:41:23 [2021-06-19T03:41:23.984Z] [INFO] Make relative - base: /home/jenkins/agent/workspace/ease.verify.core.target.2018-12/plugins/org.eclipse.ease.help, file: /home/jenkins/agent/workspace/ease.verify.core.target.2018-12/plugins/org.eclipse.ease.help/help/api-docs/javadoc/org/eclipse/ease/tools/package-summary.html -> help/api-docs/javadoc/org/eclipse/ease/tools/package-summary.html
23:41:23 [2021-06-19T03:41:23.984Z] [INFO] Make relative - base: /home/jenkins/agent/workspace/ease.verify.core.target.2018-12/plugins/org.eclipse.ease.help, file: /home/jenkins/agent/workspace/ease.verify.core.target.2018-12/plugins/org.eclipse.ease.help/help/api-docs/javadoc/org/eclipse/ease/ui/package-summary.html -> help/api-docs/javadoc/org/eclipse/ease/ui/package-summary.html
23:41:23 [2021-06-19T03:41:23.985Z] [INFO] Make relative - base: /home/jenkins/agent/workspace/ease.verify.core.target.2018-12/plugins/org.eclipse.ease.help, file: /home/jenkins/agent/workspace/ease.verify.core.target.2018-12/plugins/org.eclipse.ease.help/help/api-docs/javadoc/org/eclipse/ease/ui/completion/package-summary.html -> help/api-docs/javadoc/org/eclipse/ease/ui/completion/package-summary.html
23:41:23 [2021-06-19T03:41:23.985Z] [INFO] Make relative - base: /home/jenkins/agent/workspace/ease.verify.core.target.2018-12/plugins/org.eclipse.ease.help, file: /home/jenkins/agent/workspace/ease.verify.core.target.2018-12/plugins/org.eclipse.ease.help/help/api-docs/javadoc/org/eclipse/ease/ui/completion/provider/package-summary.html -> help/api-docs/javadoc/org/eclipse/ease/ui/completion/provider/package-summary.html
23:41:23 [2021-06-19T03:41:23.985Z] [INFO] Make relative - base: /home/jenkins/agent/workspace/ease.verify.core.target.2018-12/plugins/org.eclipse.ease.help, file: /home/jenkins/agent/workspace/ease.verify.core.target.2018-12/plugins/org.eclipse.ease.help/help/api-docs/javadoc/org/eclipse/ease/ui/console/package-summary.html -> help/api-docs/javadoc/org/eclipse/ease/ui/console/package-summary.html
23:41:23 [2021-06-19T03:41:23.985Z] [INFO] Make relative - base: /home/jenkins/agent/workspace/ease.verify.core.target.2018-12/plugins/org.eclipse.ease.help, file: /home/jenkins/agent/workspace/ease.verify.core.target.2018-12/plugins/org.eclipse.ease.help/help/api-docs/javadoc/org/eclipse/ease/ui/console/actions/package-summary.html -> help/api-docs/javadoc/org/eclipse/ease/ui/console/actions/package-summary.html
23:41:23 [2021-06-19T03:41:23.985Z] [INFO] Make relative - base: /home/jenkins/agent/workspace/ease.verify.core.target.2018-12/plugins/org.eclipse.ease.help, file: /home/jenkins/agent/workspace/ease.verify.core.target.2018-12/plugins/org.eclipse.ease.help/help/api-docs/javadoc/org/eclipse/ease/ui/debugging/model/package-summary.html -> help/api-docs/javadoc/org/eclipse/ease/ui/debugging/model/package-summary.html
23:41:23 [2021-06-19T03:41:23.985Z] [INFO] Make relative - base: /home/jenkins/agent/workspace/ease.verify.core.target.2018-12/plugins/org.eclipse.ease.help, file: /home/jenkins/agent/workspace/ease.verify.core.target.2018-12/plugins/org.eclipse.ease.help/help/api-docs/javadoc/org/eclipse/ease/ui/dnd/package-summary.html -> help/api-docs/javadoc/org/eclipse/ease/ui/dnd/package-summary.html
23:41:23 [2021-06-19T03:41:23.985Z] [INFO] Make relative - base: /home/jenkins/agent/workspace/ease.verify.core.target.2018-12/plugins/org.eclipse.ease.help, file: /home/jenkins/agent/workspace/ease.verify.core.target.2018-12/plugins/org.eclipse.ease.help/help/api-docs/javadoc/org/eclipse/ease/ui/handler/package-summary.html -> help/api-docs/javadoc/org/eclipse/ease/ui/handler/package-summary.html
23:41:23 [2021-06-19T03:41:23.985Z] [INFO] Make relative - base: /home/jenkins/agent/workspace/ease.verify.core.target.2018-12/plugins/org.eclipse.ease.help, file: /home/jenkins/agent/workspace/ease.verify.core.target.2018-12/plugins/org.eclipse.ease.help/help/api-docs/javadoc/org/eclipse/ease/ui/help/hovers/package-summary.html -> help/api-docs/javadoc/org/eclipse/ease/ui/help/hovers/package-summary.html
23:41:23 [2021-06-19T03:41:23.985Z] [INFO] Make relative - base: /home/jenkins/agent/workspace/ease.verify.core.target.2018-12/plugins/org.eclipse.ease.help, file: /home/jenkins/agent/workspace/ease.verify.core.target.2018-12/plugins/org.eclipse.ease.help/help/api-docs/javadoc/org/eclipse/ease/ui/launching/package-summary.html -> help/api-docs/javadoc/org/eclipse/ease/ui/launching/package-summary.html
23:41:23 [2021-06-19T03:41:23.985Z] [INFO] Make relative - base: /home/jenkins/agent/workspace/ease.verify.core.target.2018-12/plugins/org.eclipse.ease.help, file: /home/jenkins/agent/workspace/ease.verify.core.target.2018-12/plugins/org.eclipse.ease.help/help/api-docs/javadoc/org/eclipse/ease/ui/modules/ui/package-summary.html -> help/api-docs/javadoc/org/eclipse/ease/ui/modules/ui/package-summary.html
23:41:23 [2021-06-19T03:41:23.985Z] [INFO] Make relative - base: /home/jenkins/agent/workspace/ease.verify.core.target.2018-12/plugins/org.eclipse.ease.help, file: /home/jenkins/agent/workspace/ease.verify.core.target.2018-12/plugins/org.eclipse.ease.help/help/api-docs/javadoc/org/eclipse/ease/ui/perspectives/package-summary.html -> help/api-docs/javadoc/org/eclipse/ease/ui/perspectives/package-summary.html
23:41:23 [2021-06-19T03:41:23.985Z] [INFO] Make relative - base: /home/jenkins/agent/workspace/ease.verify.core.target.2018-12/plugins/org.eclipse.ease.help, file: /home/jenkins/agent/workspace/ease.verify.core.target.2018-12/plugins/org.eclipse.ease.help/help/api-docs/javadoc/org/eclipse/ease/ui/preferences/package-summary.html -> help/api-docs/javadoc/org/eclipse/ease/ui/preferences/package-summary.html
23:41:23 [2021-06-19T03:41:23.985Z] [INFO] Make relative - base: /home/jenkins/agent/workspace/ease.verify.core.target.2018-12/plugins/org.eclipse.ease.help, file: /home/jenkins/agent/workspace/ease.verify.core.target.2018-12/plugins/org.eclipse.ease.help/help/api-docs/javadoc/org/eclipse/ease/ui/propertytester/package-summary.html -> help/api-docs/javadoc/org/eclipse/ease/ui/propertytester/package-summary.html
23:41:24 [2021-06-19T03:41:24.242Z] [INFO] Make relative - base: /home/jenkins/agent/workspace/ease.verify.core.target.2018-12/plugins/org.eclipse.ease.help, file: /home/jenkins/agent/workspace/ease.verify.core.target.2018-12/plugins/org.eclipse.ease.help/help/api-docs/javadoc/org/eclipse/ease/ui/scripts/package-summary.html -> help/api-docs/javadoc/org/eclipse/ease/ui/scripts/package-summary.html
23:41:24 [2021-06-19T03:41:24.242Z] [INFO] Make relative - base: /home/jenkins/agent/workspace/ease.verify.core.target.2018-12/plugins/org.eclipse.ease.help, file: /home/jenkins/agent/workspace/ease.verify.core.target.2018-12/plugins/org.eclipse.ease.help/help/api-docs/javadoc/org/eclipse/ease/ui/scripts/expressions/package-summary.html -> help/api-docs/javadoc/org/eclipse/ease/ui/scripts/expressions/package-summary.html
23:41:24 [2021-06-19T03:41:24.242Z] [INFO] Make relative - base: /home/jenkins/agent/workspace/ease.verify.core.target.2018-12/plugins/org.eclipse.ease.help, file: /home/jenkins/agent/workspace/ease.verify.core.target.2018-12/plugins/org.eclipse.ease.help/help/api-docs/javadoc/org/eclipse/ease/ui/scripts/expressions/definitions/package-summary.html -> help/api-docs/javadoc/org/eclipse/ease/ui/scripts/expressions/definitions/package-summary.html
23:41:24 [2021-06-19T03:41:24.242Z] [INFO] Make relative - base: /home/jenkins/agent/workspace/ease.verify.core.target.2018-12/plugins/org.eclipse.ease.help, file: /home/jenkins/agent/workspace/ease.verify.core.target.2018-12/plugins/org.eclipse.ease.help/help/api-docs/javadoc/org/eclipse/ease/ui/scripts/expressions/handler/package-summary.html -> help/api-docs/javadoc/org/eclipse/ease/ui/scripts/expressions/handler/package-summary.html
23:41:24 [2021-06-19T03:41:24.242Z] [INFO] Make relative - base: /home/jenkins/agent/workspace/ease.verify.core.target.2018-12/plugins/org.eclipse.ease.help, file: /home/jenkins/agent/workspace/ease.verify.core.target.2018-12/plugins/org.eclipse.ease.help/help/api-docs/javadoc/org/eclipse/ease/ui/scripts/expressions/ui/package-summary.html -> help/api-docs/javadoc/org/eclipse/ease/ui/scripts/expressions/ui/package-summary.html
23:41:24 [2021-06-19T03:41:24.242Z] [INFO] Make relative - base: /home/jenkins/agent/workspace/ease.verify.core.target.2018-12/plugins/org.eclipse.ease.help, file: /home/jenkins/agent/workspace/ease.verify.core.target.2018-12/plugins/org.eclipse.ease.help/help/api-docs/javadoc/org/eclipse/ease/ui/scripts/keywordhandler/package-summary.html -> help/api-docs/javadoc/org/eclipse/ease/ui/scripts/keywordhandler/package-summary.html
23:41:24 [2021-06-19T03:41:24.242Z] [INFO] Make relative - base: /home/jenkins/agent/workspace/ease.verify.core.target.2018-12/plugins/org.eclipse.ease.help, file: /home/jenkins/agent/workspace/ease.verify.core.target.2018-12/plugins/org.eclipse.ease.help/help/api-docs/javadoc/org/eclipse/ease/ui/scripts/preferences/package-summary.html -> help/api-docs/javadoc/org/eclipse/ease/ui/scripts/preferences/package-summary.html
23:41:24 [2021-06-19T03:41:24.242Z] [INFO] Make relative - base: /home/jenkins/agent/workspace/ease.verify.core.target.2018-12/plugins/org.eclipse.ease.help, file: /home/jenkins/agent/workspace/ease.verify.core.target.2018-12/plugins/org.eclipse.ease.help/help/api-docs/javadoc/org/eclipse/ease/ui/scripts/repository/package-summary.html -> help/api-docs/javadoc/org/eclipse/ease/ui/scripts/repository/package-summary.html
23:41:24 [2021-06-19T03:41:24.242Z] [INFO] Make relative - base: /home/jenkins/agent/workspace/ease.verify.core.target.2018-12/plugins/org.eclipse.ease.help, file: /home/jenkins/agent/workspace/ease.verify.core.target.2018-12/plugins/org.eclipse.ease.help/help/api-docs/javadoc/org/eclipse/ease/ui/scripts/ui/package-summary.html -> help/api-docs/javadoc/org/eclipse/ease/ui/scripts/ui/package-summary.html
23:41:24 [2021-06-19T03:41:24.242Z] [INFO] Make relative - base: /home/jenkins/agent/workspace/ease.verify.core.target.2018-12/plugins/org.eclipse.ease.help, file: /home/jenkins/agent/workspace/ease.verify.core.target.2018-12/plugins/org.eclipse.ease.help/help/api-docs/javadoc/org/eclipse/ease/ui/tools/package-summary.html -> help/api-docs/javadoc/org/eclipse/ease/ui/tools/package-summary.html
23:41:24 [2021-06-19T03:41:24.242Z] [INFO] Make relative - base: /home/jenkins/agent/workspace/ease.verify.core.target.2018-12/plugins/org.eclipse.ease.help, file: /home/jenkins/agent/workspace/ease.verify.core.target.2018-12/plugins/org.eclipse.ease.help/help/api-docs/javadoc/org/eclipse/ease/ui/view/package-summary.html -> help/api-docs/javadoc/org/eclipse/ease/ui/view/package-summary.html
23:41:24 [2021-06-19T03:41:24.242Z] [INFO] Make relative - base: /home/jenkins/agent/workspace/ease.verify.core.target.2018-12/plugins/org.eclipse.ease.help, file: /home/jenkins/agent/workspace/ease.verify.core.target.2018-12/plugins/org.eclipse.ease.help/help/api-docs/javadoc/org/eclipse/ease/ui/views/shell/dropins/package-summary.html -> help/api-docs/javadoc/org/eclipse/ease/ui/views/shell/dropins/package-summary.html
23:41:24 [2021-06-19T03:41:24.242Z] [INFO] Make relative - base: /home/jenkins/agent/workspace/ease.verify.core.target.2018-12/plugins/org.eclipse.ease.help, file: /home/jenkins/agent/workspace/ease.verify.core.target.2018-12/plugins/org.eclipse.ease.help/help/api-docs/javadoc/org/eclipse/ease/urlhandler/package-summary.html -> help/api-docs/javadoc/org/eclipse/ease/urlhandler/package-summary.html
23:41:24 [2021-06-19T03:41:24.242Z] [INFO] 
23:41:24 [2021-06-19T03:41:24.242Z] [INFO] --- maven-resources-plugin:2.4.3:resources (default-resources) @ org.eclipse.ease.help ---
23:41:24 [2021-06-19T03:41:24.242Z] [INFO] Using 'UTF-8' encoding to copy filtered resources.
23:41:24 [2021-06-19T03:41:24.242Z] [INFO] skip non existing resourceDirectory /home/jenkins/agent/workspace/ease.verify.core.target.2018-12/plugins/org.eclipse.ease.help/src/main/resources
23:41:24 [2021-06-19T03:41:24.242Z] [INFO] 
23:41:24 [2021-06-19T03:41:24.242Z] [INFO] --- tycho-compiler-plugin:2.2.0:compile (default-compile) @ org.eclipse.ease.help ---
23:41:24 [2021-06-19T03:41:24.242Z] [INFO] 
23:41:24 [2021-06-19T03:41:24.242Z] [INFO] --- maven-resources-plugin:2.4.3:testResources (default-testResources) @ org.eclipse.ease.help ---
23:41:24 [2021-06-19T03:41:24.242Z] [INFO] Using 'UTF-8' encoding to copy filtered resources.
23:41:24 [2021-06-19T03:41:24.242Z] [INFO] skip non existing resourceDirectory /home/jenkins/agent/workspace/ease.verify.core.target.2018-12/plugins/org.eclipse.ease.help/src/test/resources
23:41:24 [2021-06-19T03:41:24.242Z] [INFO] 
23:41:24 [2021-06-19T03:41:24.242Z] [INFO] --- target-platform-configuration:2.2.0:target-platform (default-target-platform) @ org.eclipse.ease.help ---
23:41:24 [2021-06-19T03:41:24.242Z] [INFO] 
23:41:24 [2021-06-19T03:41:24.243Z] [INFO] --- tycho-packaging-plugin:2.2.0:package-plugin (default-package-plugin) @ org.eclipse.ease.help ---
23:41:24 [2021-06-19T03:41:24.243Z] [INFO] Building jar: /home/jenkins/agent/workspace/ease.verify.core.target.2018-12/plugins/org.eclipse.ease.help/target/org.eclipse.ease.help-0.8.0-SNAPSHOT.jar
23:41:24 [2021-06-19T03:41:24.500Z] [INFO] 
23:41:24 [2021-06-19T03:41:24.500Z] [INFO] --- tycho-p2-plugin:2.2.0:p2-metadata-default (default-p2-metadata-default) @ org.eclipse.ease.help ---
23:41:24 [2021-06-19T03:41:24.500Z] [INFO] 
23:41:24 [2021-06-19T03:41:24.500Z] [INFO] --- maven-install-plugin:2.3.1:install (default-install) @ org.eclipse.ease.help ---
23:41:24 [2021-06-19T03:41:24.500Z] [INFO] Installing /home/jenkins/agent/workspace/ease.verify.core.target.2018-12/plugins/org.eclipse.ease.help/target/org.eclipse.ease.help-0.8.0-SNAPSHOT.jar to /home/jenkins/.m2/repository/org/eclipse/ease/org.eclipse.ease.help/0.8.0-SNAPSHOT/org.eclipse.ease.help-0.8.0-SNAPSHOT.jar
23:41:24 [2021-06-19T03:41:24.500Z] [INFO] Installing /home/jenkins/agent/workspace/ease.verify.core.target.2018-12/plugins/org.eclipse.ease.help/pom.xml to /home/jenkins/.m2/repository/org/eclipse/ease/org.eclipse.ease.help/0.8.0-SNAPSHOT/org.eclipse.ease.help-0.8.0-SNAPSHOT.pom
23:41:24 [2021-06-19T03:41:24.500Z] [INFO] Installing /home/jenkins/agent/workspace/ease.verify.core.target.2018-12/plugins/org.eclipse.ease.help/target/p2content.xml to /home/jenkins/.m2/repository/org/eclipse/ease/org.eclipse.ease.help/0.8.0-SNAPSHOT/org.eclipse.ease.help-0.8.0-SNAPSHOT-p2metadata.xml
23:41:24 [2021-06-19T03:41:24.500Z] [INFO] Installing /home/jenkins/agent/workspace/ease.verify.core.target.2018-12/plugins/org.eclipse.ease.help/target/p2artifacts.xml to /home/jenkins/.m2/repository/org/eclipse/ease/org.eclipse.ease.help/0.8.0-SNAPSHOT/org.eclipse.ease.help-0.8.0-SNAPSHOT-p2artifacts.xml
23:41:24 [2021-06-19T03:41:24.500Z] [INFO] 
23:41:24 [2021-06-19T03:41:24.500Z] [INFO] --- tycho-p2-plugin:2.2.0:update-local-index (default-update-local-index) @ org.eclipse.ease.help ---
23:41:24 [2021-06-19T03:41:24.500Z] [INFO] 
23:41:24 [2021-06-19T03:41:24.500Z] [INFO] -------------< org.eclipse.ease:org.eclipse.ease.feature >--------------
23:41:24 [2021-06-19T03:41:24.500Z] [INFO] Building org.eclipse.ease.feature 0.8.0-SNAPSHOT                 [24/48]
23:41:24 [2021-06-19T03:41:24.500Z] [INFO] --------------------------[ eclipse-feature ]---------------------------
23:41:24 [2021-06-19T03:41:24.500Z] [INFO] 
23:41:24 [2021-06-19T03:41:24.500Z] [INFO] --- maven-clean-plugin:2.5:clean (default-clean) @ org.eclipse.ease.feature ---
23:41:24 [2021-06-19T03:41:24.500Z] [INFO] Deleting /home/jenkins/agent/workspace/ease.verify.core.target.2018-12/features/org.eclipse.ease.feature/target
23:41:24 [2021-06-19T03:41:24.500Z] [INFO] 
23:41:24 [2021-06-19T03:41:24.500Z] [INFO] --- tycho-packaging-plugin:2.2.0:build-qualifier-aggregator (default-build-qualifier-aggregator) @ org.eclipse.ease.feature ---
23:41:24 [2021-06-19T03:41:24.757Z] [INFO] The project's OSGi version is 0.8.0.I202106150726
23:41:24 [2021-06-19T03:41:24.757Z] [INFO] 
23:41:24 [2021-06-19T03:41:24.757Z] [INFO] --- tycho-packaging-plugin:2.2.0:validate-id (default-validate-id) @ org.eclipse.ease.feature ---
23:41:24 [2021-06-19T03:41:24.757Z] [INFO] 
23:41:24 [2021-06-19T03:41:24.757Z] [INFO] --- tycho-packaging-plugin:2.2.0:validate-version (default-validate-version) @ org.eclipse.ease.feature ---
23:41:24 [2021-06-19T03:41:24.757Z] [INFO] 
23:41:24 [2021-06-19T03:41:24.757Z] [INFO] --- target-platform-configuration:2.2.0:target-platform (default-target-platform) @ org.eclipse.ease.feature ---
23:41:24 [2021-06-19T03:41:24.757Z] [INFO] 
23:41:24 [2021-06-19T03:41:24.757Z] [INFO] --- tycho-packaging-plugin:2.2.0:package-feature (default-package-feature) @ org.eclipse.ease.feature ---
23:41:24 [2021-06-19T03:41:24.757Z] [INFO] Building jar: /home/jenkins/agent/workspace/ease.verify.core.target.2018-12/features/org.eclipse.ease.feature/target/org.eclipse.ease.feature-0.8.0-SNAPSHOT.jar
23:41:24 [2021-06-19T03:41:24.757Z] [INFO] 
23:41:24 [2021-06-19T03:41:24.757Z] [INFO] --- tycho-p2-plugin:2.2.0:p2-metadata-default (default-p2-metadata-default) @ org.eclipse.ease.feature ---
23:41:24 [2021-06-19T03:41:24.757Z] [INFO] 
23:41:24 [2021-06-19T03:41:24.757Z] [INFO] --- tycho-p2-plugin:2.2.0:feature-p2-metadata (default-feature-p2-metadata) @ org.eclipse.ease.feature ---
23:41:24 [2021-06-19T03:41:24.757Z] [INFO] 
23:41:24 [2021-06-19T03:41:24.757Z] [INFO] --- tycho-source-feature-plugin:2.2.0:source-feature (source-feature) @ org.eclipse.ease.feature ---
23:41:24 [2021-06-19T03:41:24.757Z] [WARNING] Mojo tycho-source-feature-plugin:source-feature is replaced by the tycho-source-plugin:feature-source which offers equivalent and even enhanced functionality
23:41:24 [2021-06-19T03:41:24.757Z] [INFO] Building jar: /home/jenkins/agent/workspace/ease.verify.core.target.2018-12/features/org.eclipse.ease.feature/target/org.eclipse.ease.feature-0.8.0-SNAPSHOT-sources-feature.jar
23:41:24 [2021-06-19T03:41:24.757Z] [INFO] 
23:41:24 [2021-06-19T03:41:24.757Z] [INFO] --- tycho-p2-plugin:2.2.0:p2-metadata (attached-p2-metadata) @ org.eclipse.ease.feature ---
23:41:24 [2021-06-19T03:41:24.757Z] [INFO] 
23:41:24 [2021-06-19T03:41:24.757Z] [INFO] --- maven-install-plugin:2.3.1:install (default-install) @ org.eclipse.ease.feature ---
23:41:24 [2021-06-19T03:41:24.757Z] [INFO] Installing /home/jenkins/agent/workspace/ease.verify.core.target.2018-12/features/org.eclipse.ease.feature/target/org.eclipse.ease.feature-0.8.0-SNAPSHOT.jar to /home/jenkins/.m2/repository/org/eclipse/ease/org.eclipse.ease.feature/0.8.0-SNAPSHOT/org.eclipse.ease.feature-0.8.0-SNAPSHOT.jar
23:41:24 [2021-06-19T03:41:24.757Z] [INFO] Installing /home/jenkins/agent/workspace/ease.verify.core.target.2018-12/features/org.eclipse.ease.feature/pom.xml to /home/jenkins/.m2/repository/org/eclipse/ease/org.eclipse.ease.feature/0.8.0-SNAPSHOT/org.eclipse.ease.feature-0.8.0-SNAPSHOT.pom
23:41:24 [2021-06-19T03:41:24.757Z] [INFO] Installing /home/jenkins/agent/workspace/ease.verify.core.target.2018-12/features/org.eclipse.ease.feature/target/p2content.xml to /home/jenkins/.m2/repository/org/eclipse/ease/org.eclipse.ease.feature/0.8.0-SNAPSHOT/org.eclipse.ease.feature-0.8.0-SNAPSHOT-p2metadata.xml
23:41:24 [2021-06-19T03:41:24.757Z] [INFO] Installing /home/jenkins/agent/workspace/ease.verify.core.target.2018-12/features/org.eclipse.ease.feature/target/p2artifacts.xml to /home/jenkins/.m2/repository/org/eclipse/ease/org.eclipse.ease.feature/0.8.0-SNAPSHOT/org.eclipse.ease.feature-0.8.0-SNAPSHOT-p2artifacts.xml
23:41:24 [2021-06-19T03:41:24.757Z] [INFO] Installing /home/jenkins/agent/workspace/ease.verify.core.target.2018-12/features/org.eclipse.ease.feature/target/org.eclipse.ease.feature-0.8.0-SNAPSHOT-sources-feature.jar to /home/jenkins/.m2/repository/org/eclipse/ease/org.eclipse.ease.feature/0.8.0-SNAPSHOT/org.eclipse.ease.feature-0.8.0-SNAPSHOT-sources-feature.jar
23:41:24 [2021-06-19T03:41:24.757Z] [INFO] Installing /home/jenkins/agent/workspace/ease.verify.core.target.2018-12/features/org.eclipse.ease.feature/target/p2content.xml to /home/jenkins/.m2/repository/org/eclipse/ease/org.eclipse.ease.feature/0.8.0-SNAPSHOT/org.eclipse.ease.feature-0.8.0-SNAPSHOT-p2metadata.xml
23:41:24 [2021-06-19T03:41:24.757Z] [INFO] Installing /home/jenkins/agent/workspace/ease.verify.core.target.2018-12/features/org.eclipse.ease.feature/target/p2artifacts.xml to /home/jenkins/.m2/repository/org/eclipse/ease/org.eclipse.ease.feature/0.8.0-SNAPSHOT/org.eclipse.ease.feature-0.8.0-SNAPSHOT-p2artifacts.xml
23:41:24 [2021-06-19T03:41:24.758Z] [INFO] 
23:41:24 [2021-06-19T03:41:24.758Z] [INFO] --- tycho-p2-plugin:2.2.0:update-local-index (default-update-local-index) @ org.eclipse.ease.feature ---
23:41:24 [2021-06-19T03:41:24.758Z] [INFO] 
23:41:24 [2021-06-19T03:41:24.758Z] [INFO] ------------< org.eclipse.ease:org.eclipse.ease.ui.feature >------------
23:41:24 [2021-06-19T03:41:24.758Z] [INFO] Building org.eclipse.ease.ui.feature 0.8.0-SNAPSHOT              [25/48]
23:41:24 [2021-06-19T03:41:24.758Z] [INFO] --------------------------[ eclipse-feature ]---------------------------
23:41:25 [2021-06-19T03:41:25.015Z] [INFO] 
23:41:25 [2021-06-19T03:41:25.015Z] [INFO] --- maven-clean-plugin:2.5:clean (default-clean) @ org.eclipse.ease.ui.feature ---
23:41:25 [2021-06-19T03:41:25.015Z] [INFO] Deleting /home/jenkins/agent/workspace/ease.verify.core.target.2018-12/features/org.eclipse.ease.ui.feature/target
23:41:25 [2021-06-19T03:41:25.015Z] [INFO] 
23:41:25 [2021-06-19T03:41:25.015Z] [INFO] --- tycho-packaging-plugin:2.2.0:build-qualifier-aggregator (default-build-qualifier-aggregator) @ org.eclipse.ease.ui.feature ---
23:41:25 [2021-06-19T03:41:25.015Z] [INFO] The project's OSGi version is 0.8.0.I202106190336
23:41:25 [2021-06-19T03:41:25.015Z] [INFO] 
23:41:25 [2021-06-19T03:41:25.015Z] [INFO] --- tycho-packaging-plugin:2.2.0:validate-id (default-validate-id) @ org.eclipse.ease.ui.feature ---
23:41:25 [2021-06-19T03:41:25.015Z] [INFO] 
23:41:25 [2021-06-19T03:41:25.015Z] [INFO] --- tycho-packaging-plugin:2.2.0:validate-version (default-validate-version) @ org.eclipse.ease.ui.feature ---
23:41:25 [2021-06-19T03:41:25.015Z] [INFO] 
23:41:25 [2021-06-19T03:41:25.015Z] [INFO] --- target-platform-configuration:2.2.0:target-platform (default-target-platform) @ org.eclipse.ease.ui.feature ---
23:41:25 [2021-06-19T03:41:25.015Z] [INFO] 
23:41:25 [2021-06-19T03:41:25.015Z] [INFO] --- tycho-packaging-plugin:2.2.0:package-feature (default-package-feature) @ org.eclipse.ease.ui.feature ---
23:41:25 [2021-06-19T03:41:25.015Z] [INFO] Building jar: /home/jenkins/agent/workspace/ease.verify.core.target.2018-12/features/org.eclipse.ease.ui.feature/target/org.eclipse.ease.ui.feature-0.8.0-SNAPSHOT.jar
23:41:25 [2021-06-19T03:41:25.015Z] [INFO] 
23:41:25 [2021-06-19T03:41:25.015Z] [INFO] --- tycho-p2-plugin:2.2.0:p2-metadata-default (default-p2-metadata-default) @ org.eclipse.ease.ui.feature ---
23:41:25 [2021-06-19T03:41:25.015Z] [INFO] 
23:41:25 [2021-06-19T03:41:25.015Z] [INFO] --- tycho-p2-plugin:2.2.0:feature-p2-metadata (default-feature-p2-metadata) @ org.eclipse.ease.ui.feature ---
23:41:25 [2021-06-19T03:41:25.015Z] [INFO] 
23:41:25 [2021-06-19T03:41:25.015Z] [INFO] --- tycho-source-feature-plugin:2.2.0:source-feature (source-feature) @ org.eclipse.ease.ui.feature ---
23:41:25 [2021-06-19T03:41:25.015Z] [WARNING] Mojo tycho-source-feature-plugin:source-feature is replaced by the tycho-source-plugin:feature-source which offers equivalent and even enhanced functionality
23:41:25 [2021-06-19T03:41:25.015Z] [INFO] Building jar: /home/jenkins/agent/workspace/ease.verify.core.target.2018-12/features/org.eclipse.ease.ui.feature/target/org.eclipse.ease.ui.feature-0.8.0-SNAPSHOT-sources-feature.jar
23:41:25 [2021-06-19T03:41:25.015Z] [INFO] 
23:41:25 [2021-06-19T03:41:25.015Z] [INFO] --- tycho-p2-plugin:2.2.0:p2-metadata (attached-p2-metadata) @ org.eclipse.ease.ui.feature ---
23:41:25 [2021-06-19T03:41:25.015Z] [INFO] 
23:41:25 [2021-06-19T03:41:25.015Z] [INFO] --- maven-install-plugin:2.3.1:install (default-install) @ org.eclipse.ease.ui.feature ---
23:41:25 [2021-06-19T03:41:25.015Z] [INFO] Installing /home/jenkins/agent/workspace/ease.verify.core.target.2018-12/features/org.eclipse.ease.ui.feature/target/org.eclipse.ease.ui.feature-0.8.0-SNAPSHOT.jar to /home/jenkins/.m2/repository/org/eclipse/ease/org.eclipse.ease.ui.feature/0.8.0-SNAPSHOT/org.eclipse.ease.ui.feature-0.8.0-SNAPSHOT.jar
23:41:25 [2021-06-19T03:41:25.015Z] [INFO] Installing /home/jenkins/agent/workspace/ease.verify.core.target.2018-12/features/org.eclipse.ease.ui.feature/pom.xml to /home/jenkins/.m2/repository/org/eclipse/ease/org.eclipse.ease.ui.feature/0.8.0-SNAPSHOT/org.eclipse.ease.ui.feature-0.8.0-SNAPSHOT.pom
23:41:25 [2021-06-19T03:41:25.015Z] [INFO] Installing /home/jenkins/agent/workspace/ease.verify.core.target.2018-12/features/org.eclipse.ease.ui.feature/target/p2content.xml to /home/jenkins/.m2/repository/org/eclipse/ease/org.eclipse.ease.ui.feature/0.8.0-SNAPSHOT/org.eclipse.ease.ui.feature-0.8.0-SNAPSHOT-p2metadata.xml
23:41:25 [2021-06-19T03:41:25.015Z] [INFO] Installing /home/jenkins/agent/workspace/ease.verify.core.target.2018-12/features/org.eclipse.ease.ui.feature/target/p2artifacts.xml to /home/jenkins/.m2/repository/org/eclipse/ease/org.eclipse.ease.ui.feature/0.8.0-SNAPSHOT/org.eclipse.ease.ui.feature-0.8.0-SNAPSHOT-p2artifacts.xml
23:41:25 [2021-06-19T03:41:25.015Z] [INFO] Installing /home/jenkins/agent/workspace/ease.verify.core.target.2018-12/features/org.eclipse.ease.ui.feature/target/org.eclipse.ease.ui.feature-0.8.0-SNAPSHOT-sources-feature.jar to /home/jenkins/.m2/repository/org/eclipse/ease/org.eclipse.ease.ui.feature/0.8.0-SNAPSHOT/org.eclipse.ease.ui.feature-0.8.0-SNAPSHOT-sources-feature.jar
23:41:25 [2021-06-19T03:41:25.015Z] [INFO] Installing /home/jenkins/agent/workspace/ease.verify.core.target.2018-12/features/org.eclipse.ease.ui.feature/target/p2content.xml to /home/jenkins/.m2/repository/org/eclipse/ease/org.eclipse.ease.ui.feature/0.8.0-SNAPSHOT/org.eclipse.ease.ui.feature-0.8.0-SNAPSHOT-p2metadata.xml
23:41:25 [2021-06-19T03:41:25.015Z] [INFO] Installing /home/jenkins/agent/workspace/ease.verify.core.target.2018-12/features/org.eclipse.ease.ui.feature/target/p2artifacts.xml to /home/jenkins/.m2/repository/org/eclipse/ease/org.eclipse.ease.ui.feature/0.8.0-SNAPSHOT/org.eclipse.ease.ui.feature-0.8.0-SNAPSHOT-p2artifacts.xml
23:41:25 [2021-06-19T03:41:25.015Z] [INFO] 
23:41:25 [2021-06-19T03:41:25.015Z] [INFO] --- tycho-p2-plugin:2.2.0:update-local-index (default-update-local-index) @ org.eclipse.ease.ui.feature ---
23:41:25 [2021-06-19T03:41:25.015Z] [INFO] 
23:41:25 [2021-06-19T03:41:25.015Z] [INFO] -----< org.eclipse.ease:org.eclipse.ease.lang.javascript.feature >------
23:41:25 [2021-06-19T03:41:25.015Z] [INFO] Building org.eclipse.ease.lang.javascript.feature 0.8.0-SNAPSHOT [26/48]
23:41:25 [2021-06-19T03:41:25.015Z] [INFO] --------------------------[ eclipse-feature ]---------------------------
23:41:25 [2021-06-19T03:41:25.015Z] [INFO] 
23:41:25 [2021-06-19T03:41:25.016Z] [INFO] --- maven-clean-plugin:2.5:clean (default-clean) @ org.eclipse.ease.lang.javascript.feature ---
23:41:25 [2021-06-19T03:41:25.016Z] [INFO] Deleting /home/jenkins/agent/workspace/ease.verify.core.target.2018-12/features/org.eclipse.ease.lang.javascript.feature/target
23:41:25 [2021-06-19T03:41:25.016Z] [INFO] 
23:41:25 [2021-06-19T03:41:25.016Z] [INFO] --- tycho-packaging-plugin:2.2.0:build-qualifier-aggregator (default-build-qualifier-aggregator) @ org.eclipse.ease.lang.javascript.feature ---
23:41:25 [2021-06-19T03:41:25.016Z] [INFO] The project's OSGi version is 0.8.0.I202106150726
23:41:25 [2021-06-19T03:41:25.016Z] [INFO] 
23:41:25 [2021-06-19T03:41:25.016Z] [INFO] --- tycho-packaging-plugin:2.2.0:validate-id (default-validate-id) @ org.eclipse.ease.lang.javascript.feature ---
23:41:25 [2021-06-19T03:41:25.016Z] [INFO] 
23:41:25 [2021-06-19T03:41:25.016Z] [INFO] --- tycho-packaging-plugin:2.2.0:validate-version (default-validate-version) @ org.eclipse.ease.lang.javascript.feature ---
23:41:25 [2021-06-19T03:41:25.016Z] [INFO] 
23:41:25 [2021-06-19T03:41:25.016Z] [INFO] --- target-platform-configuration:2.2.0:target-platform (default-target-platform) @ org.eclipse.ease.lang.javascript.feature ---
23:41:25 [2021-06-19T03:41:25.016Z] [INFO] 
23:41:25 [2021-06-19T03:41:25.016Z] [INFO] --- tycho-packaging-plugin:2.2.0:package-feature (default-package-feature) @ org.eclipse.ease.lang.javascript.feature ---
23:41:25 [2021-06-19T03:41:25.016Z] [INFO] Building jar: /home/jenkins/agent/workspace/ease.verify.core.target.2018-12/features/org.eclipse.ease.lang.javascript.feature/target/org.eclipse.ease.lang.javascript.feature-0.8.0-SNAPSHOT.jar
23:41:25 [2021-06-19T03:41:25.016Z] [INFO] 
23:41:25 [2021-06-19T03:41:25.016Z] [INFO] --- tycho-p2-plugin:2.2.0:p2-metadata-default (default-p2-metadata-default) @ org.eclipse.ease.lang.javascript.feature ---
23:41:25 [2021-06-19T03:41:25.272Z] [INFO] 
23:41:25 [2021-06-19T03:41:25.272Z] [INFO] --- tycho-p2-plugin:2.2.0:feature-p2-metadata (default-feature-p2-metadata) @ org.eclipse.ease.lang.javascript.feature ---
23:41:25 [2021-06-19T03:41:25.272Z] [INFO] 
23:41:25 [2021-06-19T03:41:25.272Z] [INFO] --- tycho-source-feature-plugin:2.2.0:source-feature (source-feature) @ org.eclipse.ease.lang.javascript.feature ---
23:41:25 [2021-06-19T03:41:25.272Z] [WARNING] Mojo tycho-source-feature-plugin:source-feature is replaced by the tycho-source-plugin:feature-source which offers equivalent and even enhanced functionality
23:41:25 [2021-06-19T03:41:25.272Z] [INFO] Building jar: /home/jenkins/agent/workspace/ease.verify.core.target.2018-12/features/org.eclipse.ease.lang.javascript.feature/target/org.eclipse.ease.lang.javascript.feature-0.8.0-SNAPSHOT-sources-feature.jar
23:41:25 [2021-06-19T03:41:25.272Z] [INFO] 
23:41:25 [2021-06-19T03:41:25.272Z] [INFO] --- tycho-p2-plugin:2.2.0:p2-metadata (attached-p2-metadata) @ org.eclipse.ease.lang.javascript.feature ---
23:41:25 [2021-06-19T03:41:25.272Z] [INFO] 
23:41:25 [2021-06-19T03:41:25.272Z] [INFO] --- maven-install-plugin:2.3.1:install (default-install) @ org.eclipse.ease.lang.javascript.feature ---
23:41:25 [2021-06-19T03:41:25.273Z] [INFO] Installing /home/jenkins/agent/workspace/ease.verify.core.target.2018-12/features/org.eclipse.ease.lang.javascript.feature/target/org.eclipse.ease.lang.javascript.feature-0.8.0-SNAPSHOT.jar to /home/jenkins/.m2/repository/org/eclipse/ease/org.eclipse.ease.lang.javascript.feature/0.8.0-SNAPSHOT/org.eclipse.ease.lang.javascript.feature-0.8.0-SNAPSHOT.jar
23:41:25 [2021-06-19T03:41:25.273Z] [INFO] Installing /home/jenkins/agent/workspace/ease.verify.core.target.2018-12/features/org.eclipse.ease.lang.javascript.feature/pom.xml to /home/jenkins/.m2/repository/org/eclipse/ease/org.eclipse.ease.lang.javascript.feature/0.8.0-SNAPSHOT/org.eclipse.ease.lang.javascript.feature-0.8.0-SNAPSHOT.pom
23:41:25 [2021-06-19T03:41:25.273Z] [INFO] Installing /home/jenkins/agent/workspace/ease.verify.core.target.2018-12/features/org.eclipse.ease.lang.javascript.feature/target/p2content.xml to /home/jenkins/.m2/repository/org/eclipse/ease/org.eclipse.ease.lang.javascript.feature/0.8.0-SNAPSHOT/org.eclipse.ease.lang.javascript.feature-0.8.0-SNAPSHOT-p2metadata.xml
23:41:25 [2021-06-19T03:41:25.273Z] [INFO] Installing /home/jenkins/agent/workspace/ease.verify.core.target.2018-12/features/org.eclipse.ease.lang.javascript.feature/target/p2artifacts.xml to /home/jenkins/.m2/repository/org/eclipse/ease/org.eclipse.ease.lang.javascript.feature/0.8.0-SNAPSHOT/org.eclipse.ease.lang.javascript.feature-0.8.0-SNAPSHOT-p2artifacts.xml
23:41:25 [2021-06-19T03:41:25.273Z] [INFO] Installing /home/jenkins/agent/workspace/ease.verify.core.target.2018-12/features/org.eclipse.ease.lang.javascript.feature/target/org.eclipse.ease.lang.javascript.feature-0.8.0-SNAPSHOT-sources-feature.jar to /home/jenkins/.m2/repository/org/eclipse/ease/org.eclipse.ease.lang.javascript.feature/0.8.0-SNAPSHOT/org.eclipse.ease.lang.javascript.feature-0.8.0-SNAPSHOT-sources-feature.jar
23:41:25 [2021-06-19T03:41:25.273Z] [INFO] Installing /home/jenkins/agent/workspace/ease.verify.core.target.2018-12/features/org.eclipse.ease.lang.javascript.feature/target/p2content.xml to /home/jenkins/.m2/repository/org/eclipse/ease/org.eclipse.ease.lang.javascript.feature/0.8.0-SNAPSHOT/org.eclipse.ease.lang.javascript.feature-0.8.0-SNAPSHOT-p2metadata.xml
23:41:25 [2021-06-19T03:41:25.273Z] [INFO] Installing /home/jenkins/agent/workspace/ease.verify.core.target.2018-12/features/org.eclipse.ease.lang.javascript.feature/target/p2artifacts.xml to /home/jenkins/.m2/repository/org/eclipse/ease/org.eclipse.ease.lang.javascript.feature/0.8.0-SNAPSHOT/org.eclipse.ease.lang.javascript.feature-0.8.0-SNAPSHOT-p2artifacts.xml
23:41:25 [2021-06-19T03:41:25.273Z] [INFO] 
23:41:25 [2021-06-19T03:41:25.273Z] [INFO] --- tycho-p2-plugin:2.2.0:update-local-index (default-update-local-index) @ org.eclipse.ease.lang.javascript.feature ---
23:41:25 [2021-06-19T03:41:25.273Z] [INFO] 
23:41:25 [2021-06-19T03:41:25.273Z] [INFO] -------< org.eclipse.ease:org.eclipse.ease.lang.python.feature >--------
23:41:25 [2021-06-19T03:41:25.273Z] [INFO] Building org.eclipse.ease.lang.python.feature 0.8.0-SNAPSHOT     [27/48]
23:41:25 [2021-06-19T03:41:25.273Z] [INFO] --------------------------[ eclipse-feature ]---------------------------
23:41:25 [2021-06-19T03:41:25.273Z] [INFO] 
23:41:25 [2021-06-19T03:41:25.273Z] [INFO] --- maven-clean-plugin:2.5:clean (default-clean) @ org.eclipse.ease.lang.python.feature ---
23:41:25 [2021-06-19T03:41:25.273Z] [INFO] Deleting /home/jenkins/agent/workspace/ease.verify.core.target.2018-12/features/org.eclipse.ease.lang.python.feature/target
23:41:25 [2021-06-19T03:41:25.273Z] [INFO] 
23:41:25 [2021-06-19T03:41:25.273Z] [INFO] --- tycho-packaging-plugin:2.2.0:build-qualifier-aggregator (default-build-qualifier-aggregator) @ org.eclipse.ease.lang.python.feature ---
23:41:25 [2021-06-19T03:41:25.273Z] [INFO] The project's OSGi version is 0.8.0.I202106150726
23:41:25 [2021-06-19T03:41:25.273Z] [INFO] 
23:41:25 [2021-06-19T03:41:25.273Z] [INFO] --- tycho-packaging-plugin:2.2.0:validate-id (default-validate-id) @ org.eclipse.ease.lang.python.feature ---
23:41:25 [2021-06-19T03:41:25.273Z] [INFO] 
23:41:25 [2021-06-19T03:41:25.273Z] [INFO] --- tycho-packaging-plugin:2.2.0:validate-version (default-validate-version) @ org.eclipse.ease.lang.python.feature ---
23:41:25 [2021-06-19T03:41:25.273Z] [INFO] 
23:41:25 [2021-06-19T03:41:25.273Z] [INFO] --- target-platform-configuration:2.2.0:target-platform (default-target-platform) @ org.eclipse.ease.lang.python.feature ---
23:41:25 [2021-06-19T03:41:25.273Z] [INFO] 
23:41:25 [2021-06-19T03:41:25.273Z] [INFO] --- tycho-packaging-plugin:2.2.0:package-feature (default-package-feature) @ org.eclipse.ease.lang.python.feature ---
23:41:25 [2021-06-19T03:41:25.273Z] [INFO] Building jar: /home/jenkins/agent/workspace/ease.verify.core.target.2018-12/features/org.eclipse.ease.lang.python.feature/target/org.eclipse.ease.lang.python.feature-0.8.0-SNAPSHOT.jar
23:41:25 [2021-06-19T03:41:25.273Z] [INFO] 
23:41:25 [2021-06-19T03:41:25.273Z] [INFO] --- tycho-p2-plugin:2.2.0:p2-metadata-default (default-p2-metadata-default) @ org.eclipse.ease.lang.python.feature ---
23:41:25 [2021-06-19T03:41:25.273Z] [INFO] 
23:41:25 [2021-06-19T03:41:25.273Z] [INFO] --- tycho-p2-plugin:2.2.0:feature-p2-metadata (default-feature-p2-metadata) @ org.eclipse.ease.lang.python.feature ---
23:41:25 [2021-06-19T03:41:25.273Z] [INFO] 
23:41:25 [2021-06-19T03:41:25.273Z] [INFO] --- tycho-source-feature-plugin:2.2.0:source-feature (source-feature) @ org.eclipse.ease.lang.python.feature ---
23:41:25 [2021-06-19T03:41:25.273Z] [WARNING] Mojo tycho-source-feature-plugin:source-feature is replaced by the tycho-source-plugin:feature-source which offers equivalent and even enhanced functionality
23:41:25 [2021-06-19T03:41:25.273Z] [INFO] Building jar: /home/jenkins/agent/workspace/ease.verify.core.target.2018-12/features/org.eclipse.ease.lang.python.feature/target/org.eclipse.ease.lang.python.feature-0.8.0-SNAPSHOT-sources-feature.jar
23:41:25 [2021-06-19T03:41:25.273Z] [INFO] 
23:41:25 [2021-06-19T03:41:25.273Z] [INFO] --- tycho-p2-plugin:2.2.0:p2-metadata (attached-p2-metadata) @ org.eclipse.ease.lang.python.feature ---
23:41:25 [2021-06-19T03:41:25.273Z] [INFO] 
23:41:25 [2021-06-19T03:41:25.274Z] [INFO] --- maven-install-plugin:2.3.1:install (default-install) @ org.eclipse.ease.lang.python.feature ---
23:41:25 [2021-06-19T03:41:25.274Z] [INFO] Installing /home/jenkins/agent/workspace/ease.verify.core.target.2018-12/features/org.eclipse.ease.lang.python.feature/target/org.eclipse.ease.lang.python.feature-0.8.0-SNAPSHOT.jar to /home/jenkins/.m2/repository/org/eclipse/ease/org.eclipse.ease.lang.python.feature/0.8.0-SNAPSHOT/org.eclipse.ease.lang.python.feature-0.8.0-SNAPSHOT.jar
23:41:25 [2021-06-19T03:41:25.274Z] [INFO] Installing /home/jenkins/agent/workspace/ease.verify.core.target.2018-12/features/org.eclipse.ease.lang.python.feature/pom.xml to /home/jenkins/.m2/repository/org/eclipse/ease/org.eclipse.ease.lang.python.feature/0.8.0-SNAPSHOT/org.eclipse.ease.lang.python.feature-0.8.0-SNAPSHOT.pom
23:41:25 [2021-06-19T03:41:25.274Z] [INFO] Installing /home/jenkins/agent/workspace/ease.verify.core.target.2018-12/features/org.eclipse.ease.lang.python.feature/target/p2content.xml to /home/jenkins/.m2/repository/org/eclipse/ease/org.eclipse.ease.lang.python.feature/0.8.0-SNAPSHOT/org.eclipse.ease.lang.python.feature-0.8.0-SNAPSHOT-p2metadata.xml
23:41:25 [2021-06-19T03:41:25.274Z] [INFO] Installing /home/jenkins/agent/workspace/ease.verify.core.target.2018-12/features/org.eclipse.ease.lang.python.feature/target/p2artifacts.xml to /home/jenkins/.m2/repository/org/eclipse/ease/org.eclipse.ease.lang.python.feature/0.8.0-SNAPSHOT/org.eclipse.ease.lang.python.feature-0.8.0-SNAPSHOT-p2artifacts.xml
23:41:25 [2021-06-19T03:41:25.274Z] [INFO] Installing /home/jenkins/agent/workspace/ease.verify.core.target.2018-12/features/org.eclipse.ease.lang.python.feature/target/org.eclipse.ease.lang.python.feature-0.8.0-SNAPSHOT-sources-feature.jar to /home/jenkins/.m2/repository/org/eclipse/ease/org.eclipse.ease.lang.python.feature/0.8.0-SNAPSHOT/org.eclipse.ease.lang.python.feature-0.8.0-SNAPSHOT-sources-feature.jar
23:41:25 [2021-06-19T03:41:25.274Z] [INFO] Installing /home/jenkins/agent/workspace/ease.verify.core.target.2018-12/features/org.eclipse.ease.lang.python.feature/target/p2content.xml to /home/jenkins/.m2/repository/org/eclipse/ease/org.eclipse.ease.lang.python.feature/0.8.0-SNAPSHOT/org.eclipse.ease.lang.python.feature-0.8.0-SNAPSHOT-p2metadata.xml
23:41:25 [2021-06-19T03:41:25.274Z] [INFO] Installing /home/jenkins/agent/workspace/ease.verify.core.target.2018-12/features/org.eclipse.ease.lang.python.feature/target/p2artifacts.xml to /home/jenkins/.m2/repository/org/eclipse/ease/org.eclipse.ease.lang.python.feature/0.8.0-SNAPSHOT/org.eclipse.ease.lang.python.feature-0.8.0-SNAPSHOT-p2artifacts.xml
23:41:25 [2021-06-19T03:41:25.274Z] [INFO] 
23:41:25 [2021-06-19T03:41:25.274Z] [INFO] --- tycho-p2-plugin:2.2.0:update-local-index (default-update-local-index) @ org.eclipse.ease.lang.python.feature ---
23:41:25 [2021-06-19T03:41:25.274Z] [INFO] 
23:41:25 [2021-06-19T03:41:25.274Z] [INFO] ------< org.eclipse.ease:org.eclipse.ease.python.jython.feature >-------
23:41:25 [2021-06-19T03:41:25.274Z] [INFO] Building org.eclipse.ease.python.jython.feature 0.8.0-SNAPSHOT   [28/48]
23:41:25 [2021-06-19T03:41:25.274Z] [INFO] --------------------------[ eclipse-feature ]---------------------------
23:41:25 [2021-06-19T03:41:25.274Z] [INFO] 
23:41:25 [2021-06-19T03:41:25.274Z] [INFO] --- maven-clean-plugin:2.5:clean (default-clean) @ org.eclipse.ease.python.jython.feature ---
23:41:25 [2021-06-19T03:41:25.274Z] [INFO] Deleting /home/jenkins/agent/workspace/ease.verify.core.target.2018-12/features/org.eclipse.ease.lang.python.jython.feature/target
23:41:25 [2021-06-19T03:41:25.274Z] [INFO] 
23:41:25 [2021-06-19T03:41:25.274Z] [INFO] --- tycho-packaging-plugin:2.2.0:build-qualifier-aggregator (default-build-qualifier-aggregator) @ org.eclipse.ease.python.jython.feature ---
23:41:25 [2021-06-19T03:41:25.274Z] [INFO] The project's OSGi version is 0.8.0.I202106150726
23:41:25 [2021-06-19T03:41:25.274Z] [INFO] 
23:41:25 [2021-06-19T03:41:25.274Z] [INFO] --- tycho-packaging-plugin:2.2.0:validate-id (default-validate-id) @ org.eclipse.ease.python.jython.feature ---
23:41:25 [2021-06-19T03:41:25.274Z] [INFO] 
23:41:25 [2021-06-19T03:41:25.274Z] [INFO] --- tycho-packaging-plugin:2.2.0:validate-version (default-validate-version) @ org.eclipse.ease.python.jython.feature ---
23:41:25 [2021-06-19T03:41:25.274Z] [INFO] 
23:41:25 [2021-06-19T03:41:25.274Z] [INFO] --- target-platform-configuration:2.2.0:target-platform (default-target-platform) @ org.eclipse.ease.python.jython.feature ---
23:41:25 [2021-06-19T03:41:25.274Z] [INFO] 
23:41:25 [2021-06-19T03:41:25.274Z] [INFO] --- tycho-packaging-plugin:2.2.0:package-feature (default-package-feature) @ org.eclipse.ease.python.jython.feature ---
23:41:25 [2021-06-19T03:41:25.274Z] [INFO] Building jar: /home/jenkins/agent/workspace/ease.verify.core.target.2018-12/features/org.eclipse.ease.lang.python.jython.feature/target/org.eclipse.ease.python.jython.feature-0.8.0-SNAPSHOT.jar
23:41:25 [2021-06-19T03:41:25.274Z] [INFO] 
23:41:25 [2021-06-19T03:41:25.274Z] [INFO] --- tycho-p2-plugin:2.2.0:p2-metadata-default (default-p2-metadata-default) @ org.eclipse.ease.python.jython.feature ---
23:41:25 [2021-06-19T03:41:25.274Z] [INFO] 
23:41:25 [2021-06-19T03:41:25.274Z] [INFO] --- tycho-p2-plugin:2.2.0:feature-p2-metadata (default-feature-p2-metadata) @ org.eclipse.ease.python.jython.feature ---
23:41:25 [2021-06-19T03:41:25.274Z] [INFO] 
23:41:25 [2021-06-19T03:41:25.274Z] [INFO] --- tycho-source-feature-plugin:2.2.0:source-feature (source-feature) @ org.eclipse.ease.python.jython.feature ---
23:41:25 [2021-06-19T03:41:25.274Z] [WARNING] Mojo tycho-source-feature-plugin:source-feature is replaced by the tycho-source-plugin:feature-source which offers equivalent and even enhanced functionality
23:41:25 [2021-06-19T03:41:25.275Z] [INFO] Building jar: /home/jenkins/agent/workspace/ease.verify.core.target.2018-12/features/org.eclipse.ease.lang.python.jython.feature/target/org.eclipse.ease.python.jython.feature-0.8.0-SNAPSHOT-sources-feature.jar
23:41:25 [2021-06-19T03:41:25.531Z] [INFO] 
23:41:25 [2021-06-19T03:41:25.531Z] [INFO] --- tycho-p2-plugin:2.2.0:p2-metadata (attached-p2-metadata) @ org.eclipse.ease.python.jython.feature ---
23:41:25 [2021-06-19T03:41:25.531Z] [INFO] 
23:41:25 [2021-06-19T03:41:25.531Z] [INFO] --- maven-install-plugin:2.3.1:install (default-install) @ org.eclipse.ease.python.jython.feature ---
23:41:25 [2021-06-19T03:41:25.531Z] [INFO] Installing /home/jenkins/agent/workspace/ease.verify.core.target.2018-12/features/org.eclipse.ease.lang.python.jython.feature/target/org.eclipse.ease.python.jython.feature-0.8.0-SNAPSHOT.jar to /home/jenkins/.m2/repository/org/eclipse/ease/org.eclipse.ease.python.jython.feature/0.8.0-SNAPSHOT/org.eclipse.ease.python.jython.feature-0.8.0-SNAPSHOT.jar
23:41:25 [2021-06-19T03:41:25.531Z] [INFO] Installing /home/jenkins/agent/workspace/ease.verify.core.target.2018-12/features/org.eclipse.ease.lang.python.jython.feature/pom.xml to /home/jenkins/.m2/repository/org/eclipse/ease/org.eclipse.ease.python.jython.feature/0.8.0-SNAPSHOT/org.eclipse.ease.python.jython.feature-0.8.0-SNAPSHOT.pom
23:41:25 [2021-06-19T03:41:25.531Z] [INFO] Installing /home/jenkins/agent/workspace/ease.verify.core.target.2018-12/features/org.eclipse.ease.lang.python.jython.feature/target/p2content.xml to /home/jenkins/.m2/repository/org/eclipse/ease/org.eclipse.ease.python.jython.feature/0.8.0-SNAPSHOT/org.eclipse.ease.python.jython.feature-0.8.0-SNAPSHOT-p2metadata.xml
23:41:25 [2021-06-19T03:41:25.531Z] [INFO] Installing /home/jenkins/agent/workspace/ease.verify.core.target.2018-12/features/org.eclipse.ease.lang.python.jython.feature/target/p2artifacts.xml to /home/jenkins/.m2/repository/org/eclipse/ease/org.eclipse.ease.python.jython.feature/0.8.0-SNAPSHOT/org.eclipse.ease.python.jython.feature-0.8.0-SNAPSHOT-p2artifacts.xml
23:41:25 [2021-06-19T03:41:25.531Z] [INFO] Installing /home/jenkins/agent/workspace/ease.verify.core.target.2018-12/features/org.eclipse.ease.lang.python.jython.feature/target/org.eclipse.ease.python.jython.feature-0.8.0-SNAPSHOT-sources-feature.jar to /home/jenkins/.m2/repository/org/eclipse/ease/org.eclipse.ease.python.jython.feature/0.8.0-SNAPSHOT/org.eclipse.ease.python.jython.feature-0.8.0-SNAPSHOT-sources-feature.jar
23:41:25 [2021-06-19T03:41:25.531Z] [INFO] Installing /home/jenkins/agent/workspace/ease.verify.core.target.2018-12/features/org.eclipse.ease.lang.python.jython.feature/target/p2content.xml to /home/jenkins/.m2/repository/org/eclipse/ease/org.eclipse.ease.python.jython.feature/0.8.0-SNAPSHOT/org.eclipse.ease.python.jython.feature-0.8.0-SNAPSHOT-p2metadata.xml
23:41:25 [2021-06-19T03:41:25.531Z] [INFO] Installing /home/jenkins/agent/workspace/ease.verify.core.target.2018-12/features/org.eclipse.ease.lang.python.jython.feature/target/p2artifacts.xml to /home/jenkins/.m2/repository/org/eclipse/ease/org.eclipse.ease.python.jython.feature/0.8.0-SNAPSHOT/org.eclipse.ease.python.jython.feature-0.8.0-SNAPSHOT-p2artifacts.xml
23:41:25 [2021-06-19T03:41:25.531Z] [INFO] 
23:41:25 [2021-06-19T03:41:25.531Z] [INFO] --- tycho-p2-plugin:2.2.0:update-local-index (default-update-local-index) @ org.eclipse.ease.python.jython.feature ---
23:41:25 [2021-06-19T03:41:25.531Z] [INFO] 
23:41:25 [2021-06-19T03:41:25.531Z] [INFO] -----< org.eclipse.ease:org.eclipse.ease.lang.python.py4j.feature >-----
23:41:25 [2021-06-19T03:41:25.531Z] [INFO] Building org.eclipse.ease.lang.python.py4j.feature 0.8.0-SNAPSHOT [29/48]
23:41:25 [2021-06-19T03:41:25.531Z] [INFO] --------------------------[ eclipse-feature ]---------------------------
23:41:25 [2021-06-19T03:41:25.531Z] [INFO] 
23:41:25 [2021-06-19T03:41:25.531Z] [INFO] --- maven-clean-plugin:2.5:clean (default-clean) @ org.eclipse.ease.lang.python.py4j.feature ---
23:41:25 [2021-06-19T03:41:25.531Z] [INFO] Deleting /home/jenkins/agent/workspace/ease.verify.core.target.2018-12/features/org.eclipse.ease.lang.python.py4j.feature/target
23:41:25 [2021-06-19T03:41:25.531Z] [INFO] 
23:41:25 [2021-06-19T03:41:25.531Z] [INFO] --- tycho-packaging-plugin:2.2.0:build-qualifier-aggregator (default-build-qualifier-aggregator) @ org.eclipse.ease.lang.python.py4j.feature ---
23:41:25 [2021-06-19T03:41:25.531Z] [INFO] The project's OSGi version is 0.8.0.I202106150726
23:41:25 [2021-06-19T03:41:25.531Z] [INFO] 
23:41:25 [2021-06-19T03:41:25.531Z] [INFO] --- tycho-packaging-plugin:2.2.0:validate-id (default-validate-id) @ org.eclipse.ease.lang.python.py4j.feature ---
23:41:25 [2021-06-19T03:41:25.531Z] [INFO] 
23:41:25 [2021-06-19T03:41:25.531Z] [INFO] --- tycho-packaging-plugin:2.2.0:validate-version (default-validate-version) @ org.eclipse.ease.lang.python.py4j.feature ---
23:41:25 [2021-06-19T03:41:25.531Z] [INFO] 
23:41:25 [2021-06-19T03:41:25.532Z] [INFO] --- target-platform-configuration:2.2.0:target-platform (default-target-platform) @ org.eclipse.ease.lang.python.py4j.feature ---
23:41:25 [2021-06-19T03:41:25.532Z] [INFO] 
23:41:25 [2021-06-19T03:41:25.532Z] [INFO] --- tycho-packaging-plugin:2.2.0:package-feature (default-package-feature) @ org.eclipse.ease.lang.python.py4j.feature ---
23:41:25 [2021-06-19T03:41:25.532Z] [INFO] Building jar: /home/jenkins/agent/workspace/ease.verify.core.target.2018-12/features/org.eclipse.ease.lang.python.py4j.feature/target/org.eclipse.ease.lang.python.py4j.feature-0.8.0-SNAPSHOT.jar
23:41:25 [2021-06-19T03:41:25.532Z] [INFO] 
23:41:25 [2021-06-19T03:41:25.532Z] [INFO] --- tycho-p2-plugin:2.2.0:p2-metadata-default (default-p2-metadata-default) @ org.eclipse.ease.lang.python.py4j.feature ---
23:41:25 [2021-06-19T03:41:25.532Z] [INFO] 
23:41:25 [2021-06-19T03:41:25.532Z] [INFO] --- tycho-p2-plugin:2.2.0:feature-p2-metadata (default-feature-p2-metadata) @ org.eclipse.ease.lang.python.py4j.feature ---
23:41:25 [2021-06-19T03:41:25.532Z] [INFO] 
23:41:25 [2021-06-19T03:41:25.532Z] [INFO] --- tycho-source-feature-plugin:2.2.0:source-feature (source-feature) @ org.eclipse.ease.lang.python.py4j.feature ---
23:41:25 [2021-06-19T03:41:25.532Z] [WARNING] Mojo tycho-source-feature-plugin:source-feature is replaced by the tycho-source-plugin:feature-source which offers equivalent and even enhanced functionality
23:41:25 [2021-06-19T03:41:25.532Z] [INFO] Building jar: /home/jenkins/agent/workspace/ease.verify.core.target.2018-12/features/org.eclipse.ease.lang.python.py4j.feature/target/org.eclipse.ease.lang.python.py4j.feature-0.8.0-SNAPSHOT-sources-feature.jar
23:41:25 [2021-06-19T03:41:25.532Z] [INFO] 
23:41:25 [2021-06-19T03:41:25.532Z] [INFO] --- tycho-p2-plugin:2.2.0:p2-metadata (attached-p2-metadata) @ org.eclipse.ease.lang.python.py4j.feature ---
23:41:25 [2021-06-19T03:41:25.532Z] [INFO] 
23:41:25 [2021-06-19T03:41:25.532Z] [INFO] --- maven-install-plugin:2.3.1:install (default-install) @ org.eclipse.ease.lang.python.py4j.feature ---
23:41:25 [2021-06-19T03:41:25.532Z] [INFO] Installing /home/jenkins/agent/workspace/ease.verify.core.target.2018-12/features/org.eclipse.ease.lang.python.py4j.feature/target/org.eclipse.ease.lang.python.py4j.feature-0.8.0-SNAPSHOT.jar to /home/jenkins/.m2/repository/org/eclipse/ease/org.eclipse.ease.lang.python.py4j.feature/0.8.0-SNAPSHOT/org.eclipse.ease.lang.python.py4j.feature-0.8.0-SNAPSHOT.jar
23:41:25 [2021-06-19T03:41:25.532Z] [INFO] Installing /home/jenkins/agent/workspace/ease.verify.core.target.2018-12/features/org.eclipse.ease.lang.python.py4j.feature/pom.xml to /home/jenkins/.m2/repository/org/eclipse/ease/org.eclipse.ease.lang.python.py4j.feature/0.8.0-SNAPSHOT/org.eclipse.ease.lang.python.py4j.feature-0.8.0-SNAPSHOT.pom
23:41:25 [2021-06-19T03:41:25.532Z] [INFO] Installing /home/jenkins/agent/workspace/ease.verify.core.target.2018-12/features/org.eclipse.ease.lang.python.py4j.feature/target/p2content.xml to /home/jenkins/.m2/repository/org/eclipse/ease/org.eclipse.ease.lang.python.py4j.feature/0.8.0-SNAPSHOT/org.eclipse.ease.lang.python.py4j.feature-0.8.0-SNAPSHOT-p2metadata.xml
23:41:25 [2021-06-19T03:41:25.532Z] [INFO] Installing /home/jenkins/agent/workspace/ease.verify.core.target.2018-12/features/org.eclipse.ease.lang.python.py4j.feature/target/p2artifacts.xml to /home/jenkins/.m2/repository/org/eclipse/ease/org.eclipse.ease.lang.python.py4j.feature/0.8.0-SNAPSHOT/org.eclipse.ease.lang.python.py4j.feature-0.8.0-SNAPSHOT-p2artifacts.xml
23:41:25 [2021-06-19T03:41:25.532Z] [INFO] Installing /home/jenkins/agent/workspace/ease.verify.core.target.2018-12/features/org.eclipse.ease.lang.python.py4j.feature/target/org.eclipse.ease.lang.python.py4j.feature-0.8.0-SNAPSHOT-sources-feature.jar to /home/jenkins/.m2/repository/org/eclipse/ease/org.eclipse.ease.lang.python.py4j.feature/0.8.0-SNAPSHOT/org.eclipse.ease.lang.python.py4j.feature-0.8.0-SNAPSHOT-sources-feature.jar
23:41:25 [2021-06-19T03:41:25.532Z] [INFO] Installing /home/jenkins/agent/workspace/ease.verify.core.target.2018-12/features/org.eclipse.ease.lang.python.py4j.feature/target/p2content.xml to /home/jenkins/.m2/repository/org/eclipse/ease/org.eclipse.ease.lang.python.py4j.feature/0.8.0-SNAPSHOT/org.eclipse.ease.lang.python.py4j.feature-0.8.0-SNAPSHOT-p2metadata.xml
23:41:25 [2021-06-19T03:41:25.532Z] [INFO] Installing /home/jenkins/agent/workspace/ease.verify.core.target.2018-12/features/org.eclipse.ease.lang.python.py4j.feature/target/p2artifacts.xml to /home/jenkins/.m2/repository/org/eclipse/ease/org.eclipse.ease.lang.python.py4j.feature/0.8.0-SNAPSHOT/org.eclipse.ease.lang.python.py4j.feature-0.8.0-SNAPSHOT-p2artifacts.xml
23:41:25 [2021-06-19T03:41:25.532Z] [INFO] 
23:41:25 [2021-06-19T03:41:25.532Z] [INFO] --- tycho-p2-plugin:2.2.0:update-local-index (default-update-local-index) @ org.eclipse.ease.lang.python.py4j.feature ---
23:41:25 [2021-06-19T03:41:25.532Z] [INFO] 
23:41:25 [2021-06-19T03:41:25.532Z] [INFO] ---------< org.eclipse.ease:org.eclipse.ease.lang.jvm.feature >---------
23:41:25 [2021-06-19T03:41:25.532Z] [INFO] Building org.eclipse.ease.lang.jvm.feature 0.8.0-SNAPSHOT        [30/48]
23:41:25 [2021-06-19T03:41:25.532Z] [INFO] --------------------------[ eclipse-feature ]---------------------------
23:41:25 [2021-06-19T03:41:25.532Z] [INFO] 
23:41:25 [2021-06-19T03:41:25.532Z] [INFO] --- maven-clean-plugin:2.5:clean (default-clean) @ org.eclipse.ease.lang.jvm.feature ---
23:41:25 [2021-06-19T03:41:25.532Z] [INFO] Deleting /home/jenkins/agent/workspace/ease.verify.core.target.2018-12/features/org.eclipse.ease.lang.jvm.feature/target
23:41:25 [2021-06-19T03:41:25.532Z] [INFO] 
23:41:25 [2021-06-19T03:41:25.532Z] [INFO] --- tycho-packaging-plugin:2.2.0:build-qualifier-aggregator (default-build-qualifier-aggregator) @ org.eclipse.ease.lang.jvm.feature ---
23:41:25 [2021-06-19T03:41:25.532Z] [INFO] The project's OSGi version is 0.8.0.I202106150726
23:41:25 [2021-06-19T03:41:25.532Z] [INFO] 
23:41:25 [2021-06-19T03:41:25.532Z] [INFO] --- tycho-packaging-plugin:2.2.0:validate-id (default-validate-id) @ org.eclipse.ease.lang.jvm.feature ---
23:41:25 [2021-06-19T03:41:25.532Z] [INFO] 
23:41:25 [2021-06-19T03:41:25.532Z] [INFO] --- tycho-packaging-plugin:2.2.0:validate-version (default-validate-version) @ org.eclipse.ease.lang.jvm.feature ---
23:41:25 [2021-06-19T03:41:25.532Z] [INFO] 
23:41:25 [2021-06-19T03:41:25.532Z] [INFO] --- target-platform-configuration:2.2.0:target-platform (default-target-platform) @ org.eclipse.ease.lang.jvm.feature ---
23:41:25 [2021-06-19T03:41:25.532Z] [INFO] 
23:41:25 [2021-06-19T03:41:25.532Z] [INFO] --- tycho-packaging-plugin:2.2.0:package-feature (default-package-feature) @ org.eclipse.ease.lang.jvm.feature ---
23:41:25 [2021-06-19T03:41:25.533Z] [INFO] Building jar: /home/jenkins/agent/workspace/ease.verify.core.target.2018-12/features/org.eclipse.ease.lang.jvm.feature/target/org.eclipse.ease.lang.jvm.feature-0.8.0-SNAPSHOT.jar
23:41:25 [2021-06-19T03:41:25.533Z] [INFO] 
23:41:25 [2021-06-19T03:41:25.533Z] [INFO] --- tycho-p2-plugin:2.2.0:p2-metadata-default (default-p2-metadata-default) @ org.eclipse.ease.lang.jvm.feature ---
23:41:25 [2021-06-19T03:41:25.533Z] [INFO] 
23:41:25 [2021-06-19T03:41:25.533Z] [INFO] --- tycho-p2-plugin:2.2.0:feature-p2-metadata (default-feature-p2-metadata) @ org.eclipse.ease.lang.jvm.feature ---
23:41:25 [2021-06-19T03:41:25.533Z] [INFO] 
23:41:25 [2021-06-19T03:41:25.533Z] [INFO] --- tycho-source-feature-plugin:2.2.0:source-feature (source-feature) @ org.eclipse.ease.lang.jvm.feature ---
23:41:25 [2021-06-19T03:41:25.533Z] [WARNING] Mojo tycho-source-feature-plugin:source-feature is replaced by the tycho-source-plugin:feature-source which offers equivalent and even enhanced functionality
23:41:25 [2021-06-19T03:41:25.533Z] [INFO] Building jar: /home/jenkins/agent/workspace/ease.verify.core.target.2018-12/features/org.eclipse.ease.lang.jvm.feature/target/org.eclipse.ease.lang.jvm.feature-0.8.0-SNAPSHOT-sources-feature.jar
23:41:25 [2021-06-19T03:41:25.533Z] [INFO] 
23:41:25 [2021-06-19T03:41:25.533Z] [INFO] --- tycho-p2-plugin:2.2.0:p2-metadata (attached-p2-metadata) @ org.eclipse.ease.lang.jvm.feature ---
23:41:25 [2021-06-19T03:41:25.533Z] [INFO] 
23:41:25 [2021-06-19T03:41:25.533Z] [INFO] --- maven-install-plugin:2.3.1:install (default-install) @ org.eclipse.ease.lang.jvm.feature ---
23:41:25 [2021-06-19T03:41:25.533Z] [INFO] Installing /home/jenkins/agent/workspace/ease.verify.core.target.2018-12/features/org.eclipse.ease.lang.jvm.feature/target/org.eclipse.ease.lang.jvm.feature-0.8.0-SNAPSHOT.jar to /home/jenkins/.m2/repository/org/eclipse/ease/org.eclipse.ease.lang.jvm.feature/0.8.0-SNAPSHOT/org.eclipse.ease.lang.jvm.feature-0.8.0-SNAPSHOT.jar
23:41:25 [2021-06-19T03:41:25.533Z] [INFO] Installing /home/jenkins/agent/workspace/ease.verify.core.target.2018-12/features/org.eclipse.ease.lang.jvm.feature/pom.xml to /home/jenkins/.m2/repository/org/eclipse/ease/org.eclipse.ease.lang.jvm.feature/0.8.0-SNAPSHOT/org.eclipse.ease.lang.jvm.feature-0.8.0-SNAPSHOT.pom
23:41:25 [2021-06-19T03:41:25.533Z] [INFO] Installing /home/jenkins/agent/workspace/ease.verify.core.target.2018-12/features/org.eclipse.ease.lang.jvm.feature/target/p2content.xml to /home/jenkins/.m2/repository/org/eclipse/ease/org.eclipse.ease.lang.jvm.feature/0.8.0-SNAPSHOT/org.eclipse.ease.lang.jvm.feature-0.8.0-SNAPSHOT-p2metadata.xml
23:41:25 [2021-06-19T03:41:25.533Z] [INFO] Installing /home/jenkins/agent/workspace/ease.verify.core.target.2018-12/features/org.eclipse.ease.lang.jvm.feature/target/p2artifacts.xml to /home/jenkins/.m2/repository/org/eclipse/ease/org.eclipse.ease.lang.jvm.feature/0.8.0-SNAPSHOT/org.eclipse.ease.lang.jvm.feature-0.8.0-SNAPSHOT-p2artifacts.xml
23:41:25 [2021-06-19T03:41:25.533Z] [INFO] Installing /home/jenkins/agent/workspace/ease.verify.core.target.2018-12/features/org.eclipse.ease.lang.jvm.feature/target/org.eclipse.ease.lang.jvm.feature-0.8.0-SNAPSHOT-sources-feature.jar to /home/jenkins/.m2/repository/org/eclipse/ease/org.eclipse.ease.lang.jvm.feature/0.8.0-SNAPSHOT/org.eclipse.ease.lang.jvm.feature-0.8.0-SNAPSHOT-sources-feature.jar
23:41:25 [2021-06-19T03:41:25.533Z] [INFO] Installing /home/jenkins/agent/workspace/ease.verify.core.target.2018-12/features/org.eclipse.ease.lang.jvm.feature/target/p2content.xml to /home/jenkins/.m2/repository/org/eclipse/ease/org.eclipse.ease.lang.jvm.feature/0.8.0-SNAPSHOT/org.eclipse.ease.lang.jvm.feature-0.8.0-SNAPSHOT-p2metadata.xml
23:41:25 [2021-06-19T03:41:25.533Z] [INFO] Installing /home/jenkins/agent/workspace/ease.verify.core.target.2018-12/features/org.eclipse.ease.lang.jvm.feature/target/p2artifacts.xml to /home/jenkins/.m2/repository/org/eclipse/ease/org.eclipse.ease.lang.jvm.feature/0.8.0-SNAPSHOT/org.eclipse.ease.lang.jvm.feature-0.8.0-SNAPSHOT-p2artifacts.xml
23:41:25 [2021-06-19T03:41:25.533Z] [INFO] 
23:41:25 [2021-06-19T03:41:25.533Z] [INFO] --- tycho-p2-plugin:2.2.0:update-local-index (default-update-local-index) @ org.eclipse.ease.lang.jvm.feature ---
23:41:25 [2021-06-19T03:41:25.533Z] [INFO] 
23:41:25 [2021-06-19T03:41:25.533Z] [INFO] -------< org.eclipse.ease:org.eclipse.ease.lang.groovy.feature >--------
23:41:25 [2021-06-19T03:41:25.533Z] [INFO] Building org.eclipse.ease.lang.groovy.feature 0.8.0-SNAPSHOT     [31/48]
23:41:25 [2021-06-19T03:41:25.533Z] [INFO] --------------------------[ eclipse-feature ]---------------------------
23:41:25 [2021-06-19T03:41:25.533Z] [INFO] 
23:41:25 [2021-06-19T03:41:25.533Z] [INFO] --- maven-clean-plugin:2.5:clean (default-clean) @ org.eclipse.ease.lang.groovy.feature ---
23:41:25 [2021-06-19T03:41:25.533Z] [INFO] Deleting /home/jenkins/agent/workspace/ease.verify.core.target.2018-12/features/org.eclipse.ease.lang.groovy.feature/target
23:41:25 [2021-06-19T03:41:25.533Z] [INFO] 
23:41:25 [2021-06-19T03:41:25.533Z] [INFO] --- tycho-packaging-plugin:2.2.0:build-qualifier-aggregator (default-build-qualifier-aggregator) @ org.eclipse.ease.lang.groovy.feature ---
23:41:25 [2021-06-19T03:41:25.533Z] [INFO] The project's OSGi version is 0.8.0.I202106150726
23:41:25 [2021-06-19T03:41:25.533Z] [INFO] 
23:41:25 [2021-06-19T03:41:25.533Z] [INFO] --- tycho-packaging-plugin:2.2.0:validate-id (default-validate-id) @ org.eclipse.ease.lang.groovy.feature ---
23:41:25 [2021-06-19T03:41:25.807Z] [INFO] 
23:41:25 [2021-06-19T03:41:25.807Z] [INFO] --- tycho-packaging-plugin:2.2.0:validate-version (default-validate-version) @ org.eclipse.ease.lang.groovy.feature ---
23:41:25 [2021-06-19T03:41:25.807Z] [INFO] 
23:41:25 [2021-06-19T03:41:25.807Z] [INFO] --- target-platform-configuration:2.2.0:target-platform (default-target-platform) @ org.eclipse.ease.lang.groovy.feature ---
23:41:25 [2021-06-19T03:41:25.807Z] [INFO] 
23:41:25 [2021-06-19T03:41:25.807Z] [INFO] --- tycho-packaging-plugin:2.2.0:package-feature (default-package-feature) @ org.eclipse.ease.lang.groovy.feature ---
23:41:25 [2021-06-19T03:41:25.807Z] [INFO] Building jar: /home/jenkins/agent/workspace/ease.verify.core.target.2018-12/features/org.eclipse.ease.lang.groovy.feature/target/org.eclipse.ease.lang.groovy.feature-0.8.0-SNAPSHOT.jar
23:41:25 [2021-06-19T03:41:25.807Z] [INFO] 
23:41:25 [2021-06-19T03:41:25.807Z] [INFO] --- tycho-p2-plugin:2.2.0:p2-metadata-default (default-p2-metadata-default) @ org.eclipse.ease.lang.groovy.feature ---
23:41:25 [2021-06-19T03:41:25.807Z] [INFO] 
23:41:25 [2021-06-19T03:41:25.807Z] [INFO] --- tycho-p2-plugin:2.2.0:feature-p2-metadata (default-feature-p2-metadata) @ org.eclipse.ease.lang.groovy.feature ---
23:41:25 [2021-06-19T03:41:25.807Z] [INFO] 
23:41:25 [2021-06-19T03:41:25.807Z] [INFO] --- tycho-source-feature-plugin:2.2.0:source-feature (source-feature) @ org.eclipse.ease.lang.groovy.feature ---
23:41:25 [2021-06-19T03:41:25.807Z] [WARNING] Mojo tycho-source-feature-plugin:source-feature is replaced by the tycho-source-plugin:feature-source which offers equivalent and even enhanced functionality
23:41:25 [2021-06-19T03:41:25.807Z] [INFO] Building jar: /home/jenkins/agent/workspace/ease.verify.core.target.2018-12/features/org.eclipse.ease.lang.groovy.feature/target/org.eclipse.ease.lang.groovy.feature-0.8.0-SNAPSHOT-sources-feature.jar
23:41:25 [2021-06-19T03:41:25.807Z] [INFO] 
23:41:25 [2021-06-19T03:41:25.807Z] [INFO] --- tycho-p2-plugin:2.2.0:p2-metadata (attached-p2-metadata) @ org.eclipse.ease.lang.groovy.feature ---
23:41:25 [2021-06-19T03:41:25.807Z] [INFO] 
23:41:25 [2021-06-19T03:41:25.807Z] [INFO] --- maven-install-plugin:2.3.1:install (default-install) @ org.eclipse.ease.lang.groovy.feature ---
23:41:25 [2021-06-19T03:41:25.807Z] [INFO] Installing /home/jenkins/agent/workspace/ease.verify.core.target.2018-12/features/org.eclipse.ease.lang.groovy.feature/target/org.eclipse.ease.lang.groovy.feature-0.8.0-SNAPSHOT.jar to /home/jenkins/.m2/repository/org/eclipse/ease/org.eclipse.ease.lang.groovy.feature/0.8.0-SNAPSHOT/org.eclipse.ease.lang.groovy.feature-0.8.0-SNAPSHOT.jar
23:41:25 [2021-06-19T03:41:25.807Z] [INFO] Installing /home/jenkins/agent/workspace/ease.verify.core.target.2018-12/features/org.eclipse.ease.lang.groovy.feature/pom.xml to /home/jenkins/.m2/repository/org/eclipse/ease/org.eclipse.ease.lang.groovy.feature/0.8.0-SNAPSHOT/org.eclipse.ease.lang.groovy.feature-0.8.0-SNAPSHOT.pom
23:41:25 [2021-06-19T03:41:25.807Z] [INFO] Installing /home/jenkins/agent/workspace/ease.verify.core.target.2018-12/features/org.eclipse.ease.lang.groovy.feature/target/p2content.xml to /home/jenkins/.m2/repository/org/eclipse/ease/org.eclipse.ease.lang.groovy.feature/0.8.0-SNAPSHOT/org.eclipse.ease.lang.groovy.feature-0.8.0-SNAPSHOT-p2metadata.xml
23:41:25 [2021-06-19T03:41:25.807Z] [INFO] Installing /home/jenkins/agent/workspace/ease.verify.core.target.2018-12/features/org.eclipse.ease.lang.groovy.feature/target/p2artifacts.xml to /home/jenkins/.m2/repository/org/eclipse/ease/org.eclipse.ease.lang.groovy.feature/0.8.0-SNAPSHOT/org.eclipse.ease.lang.groovy.feature-0.8.0-SNAPSHOT-p2artifacts.xml
23:41:25 [2021-06-19T03:41:25.807Z] [INFO] Installing /home/jenkins/agent/workspace/ease.verify.core.target.2018-12/features/org.eclipse.ease.lang.groovy.feature/target/org.eclipse.ease.lang.groovy.feature-0.8.0-SNAPSHOT-sources-feature.jar to /home/jenkins/.m2/repository/org/eclipse/ease/org.eclipse.ease.lang.groovy.feature/0.8.0-SNAPSHOT/org.eclipse.ease.lang.groovy.feature-0.8.0-SNAPSHOT-sources-feature.jar
23:41:25 [2021-06-19T03:41:25.807Z] [INFO] Installing /home/jenkins/agent/workspace/ease.verify.core.target.2018-12/features/org.eclipse.ease.lang.groovy.feature/target/p2content.xml to /home/jenkins/.m2/repository/org/eclipse/ease/org.eclipse.ease.lang.groovy.feature/0.8.0-SNAPSHOT/org.eclipse.ease.lang.groovy.feature-0.8.0-SNAPSHOT-p2metadata.xml
23:41:25 [2021-06-19T03:41:25.807Z] [INFO] Installing /home/jenkins/agent/workspace/ease.verify.core.target.2018-12/features/org.eclipse.ease.lang.groovy.feature/target/p2artifacts.xml to /home/jenkins/.m2/repository/org/eclipse/ease/org.eclipse.ease.lang.groovy.feature/0.8.0-SNAPSHOT/org.eclipse.ease.lang.groovy.feature-0.8.0-SNAPSHOT-p2artifacts.xml
23:41:25 [2021-06-19T03:41:25.807Z] [INFO] 
23:41:25 [2021-06-19T03:41:25.807Z] [INFO] --- tycho-p2-plugin:2.2.0:update-local-index (default-update-local-index) @ org.eclipse.ease.lang.groovy.feature ---
23:41:25 [2021-06-19T03:41:25.807Z] [INFO] 
23:41:25 [2021-06-19T03:41:25.807Z] [INFO] --------< org.eclipse.ease:org.eclipse.ease.lang.ruby.feature >---------
23:41:25 [2021-06-19T03:41:25.807Z] [INFO] Building org.eclipse.ease.lang.ruby.feature 0.8.0-SNAPSHOT       [32/48]
23:41:25 [2021-06-19T03:41:25.807Z] [INFO] --------------------------[ eclipse-feature ]---------------------------
23:41:25 [2021-06-19T03:41:25.807Z] [INFO] 
23:41:25 [2021-06-19T03:41:25.807Z] [INFO] --- maven-clean-plugin:2.5:clean (default-clean) @ org.eclipse.ease.lang.ruby.feature ---
23:41:25 [2021-06-19T03:41:25.807Z] [INFO] Deleting /home/jenkins/agent/workspace/ease.verify.core.target.2018-12/features/org.eclipse.ease.lang.ruby.feature/target
23:41:25 [2021-06-19T03:41:25.807Z] [INFO] 
23:41:25 [2021-06-19T03:41:25.807Z] [INFO] --- tycho-packaging-plugin:2.2.0:build-qualifier-aggregator (default-build-qualifier-aggregator) @ org.eclipse.ease.lang.ruby.feature ---
23:41:25 [2021-06-19T03:41:25.808Z] [INFO] The project's OSGi version is 0.8.0.I202106150726
23:41:25 [2021-06-19T03:41:25.808Z] [INFO] 
23:41:25 [2021-06-19T03:41:25.808Z] [INFO] --- tycho-packaging-plugin:2.2.0:validate-id (default-validate-id) @ org.eclipse.ease.lang.ruby.feature ---
23:41:25 [2021-06-19T03:41:25.808Z] [INFO] 
23:41:25 [2021-06-19T03:41:25.808Z] [INFO] --- tycho-packaging-plugin:2.2.0:validate-version (default-validate-version) @ org.eclipse.ease.lang.ruby.feature ---
23:41:25 [2021-06-19T03:41:25.808Z] [INFO] 
23:41:25 [2021-06-19T03:41:25.808Z] [INFO] --- target-platform-configuration:2.2.0:target-platform (default-target-platform) @ org.eclipse.ease.lang.ruby.feature ---
23:41:25 [2021-06-19T03:41:25.808Z] [INFO] 
23:41:25 [2021-06-19T03:41:25.808Z] [INFO] --- tycho-packaging-plugin:2.2.0:package-feature (default-package-feature) @ org.eclipse.ease.lang.ruby.feature ---
23:41:25 [2021-06-19T03:41:25.808Z] [INFO] Building jar: /home/jenkins/agent/workspace/ease.verify.core.target.2018-12/features/org.eclipse.ease.lang.ruby.feature/target/org.eclipse.ease.lang.ruby.feature-0.8.0-SNAPSHOT.jar
23:41:25 [2021-06-19T03:41:25.808Z] [INFO] 
23:41:25 [2021-06-19T03:41:25.808Z] [INFO] --- tycho-p2-plugin:2.2.0:p2-metadata-default (default-p2-metadata-default) @ org.eclipse.ease.lang.ruby.feature ---
23:41:25 [2021-06-19T03:41:25.808Z] [INFO] 
23:41:25 [2021-06-19T03:41:25.808Z] [INFO] --- tycho-p2-plugin:2.2.0:feature-p2-metadata (default-feature-p2-metadata) @ org.eclipse.ease.lang.ruby.feature ---
23:41:25 [2021-06-19T03:41:25.808Z] [INFO] 
23:41:25 [2021-06-19T03:41:25.808Z] [INFO] --- tycho-source-feature-plugin:2.2.0:source-feature (source-feature) @ org.eclipse.ease.lang.ruby.feature ---
23:41:25 [2021-06-19T03:41:25.808Z] [WARNING] Mojo tycho-source-feature-plugin:source-feature is replaced by the tycho-source-plugin:feature-source which offers equivalent and even enhanced functionality
23:41:25 [2021-06-19T03:41:25.808Z] [INFO] Building jar: /home/jenkins/agent/workspace/ease.verify.core.target.2018-12/features/org.eclipse.ease.lang.ruby.feature/target/org.eclipse.ease.lang.ruby.feature-0.8.0-SNAPSHOT-sources-feature.jar
23:41:25 [2021-06-19T03:41:25.808Z] [INFO] 
23:41:25 [2021-06-19T03:41:25.808Z] [INFO] --- tycho-p2-plugin:2.2.0:p2-metadata (attached-p2-metadata) @ org.eclipse.ease.lang.ruby.feature ---
23:41:25 [2021-06-19T03:41:25.808Z] [INFO] 
23:41:25 [2021-06-19T03:41:25.808Z] [INFO] --- maven-install-plugin:2.3.1:install (default-install) @ org.eclipse.ease.lang.ruby.feature ---
23:41:25 [2021-06-19T03:41:25.808Z] [INFO] Installing /home/jenkins/agent/workspace/ease.verify.core.target.2018-12/features/org.eclipse.ease.lang.ruby.feature/target/org.eclipse.ease.lang.ruby.feature-0.8.0-SNAPSHOT.jar to /home/jenkins/.m2/repository/org/eclipse/ease/org.eclipse.ease.lang.ruby.feature/0.8.0-SNAPSHOT/org.eclipse.ease.lang.ruby.feature-0.8.0-SNAPSHOT.jar
23:41:25 [2021-06-19T03:41:25.808Z] [INFO] Installing /home/jenkins/agent/workspace/ease.verify.core.target.2018-12/features/org.eclipse.ease.lang.ruby.feature/pom.xml to /home/jenkins/.m2/repository/org/eclipse/ease/org.eclipse.ease.lang.ruby.feature/0.8.0-SNAPSHOT/org.eclipse.ease.lang.ruby.feature-0.8.0-SNAPSHOT.pom
23:41:25 [2021-06-19T03:41:25.808Z] [INFO] Installing /home/jenkins/agent/workspace/ease.verify.core.target.2018-12/features/org.eclipse.ease.lang.ruby.feature/target/p2content.xml to /home/jenkins/.m2/repository/org/eclipse/ease/org.eclipse.ease.lang.ruby.feature/0.8.0-SNAPSHOT/org.eclipse.ease.lang.ruby.feature-0.8.0-SNAPSHOT-p2metadata.xml
23:41:25 [2021-06-19T03:41:25.808Z] [INFO] Installing /home/jenkins/agent/workspace/ease.verify.core.target.2018-12/features/org.eclipse.ease.lang.ruby.feature/target/p2artifacts.xml to /home/jenkins/.m2/repository/org/eclipse/ease/org.eclipse.ease.lang.ruby.feature/0.8.0-SNAPSHOT/org.eclipse.ease.lang.ruby.feature-0.8.0-SNAPSHOT-p2artifacts.xml
23:41:25 [2021-06-19T03:41:25.808Z] [INFO] Installing /home/jenkins/agent/workspace/ease.verify.core.target.2018-12/features/org.eclipse.ease.lang.ruby.feature/target/org.eclipse.ease.lang.ruby.feature-0.8.0-SNAPSHOT-sources-feature.jar to /home/jenkins/.m2/repository/org/eclipse/ease/org.eclipse.ease.lang.ruby.feature/0.8.0-SNAPSHOT/org.eclipse.ease.lang.ruby.feature-0.8.0-SNAPSHOT-sources-feature.jar
23:41:25 [2021-06-19T03:41:25.808Z] [INFO] Installing /home/jenkins/agent/workspace/ease.verify.core.target.2018-12/features/org.eclipse.ease.lang.ruby.feature/target/p2content.xml to /home/jenkins/.m2/repository/org/eclipse/ease/org.eclipse.ease.lang.ruby.feature/0.8.0-SNAPSHOT/org.eclipse.ease.lang.ruby.feature-0.8.0-SNAPSHOT-p2metadata.xml
23:41:25 [2021-06-19T03:41:25.808Z] [INFO] Installing /home/jenkins/agent/workspace/ease.verify.core.target.2018-12/features/org.eclipse.ease.lang.ruby.feature/target/p2artifacts.xml to /home/jenkins/.m2/repository/org/eclipse/ease/org.eclipse.ease.lang.ruby.feature/0.8.0-SNAPSHOT/org.eclipse.ease.lang.ruby.feature-0.8.0-SNAPSHOT-p2artifacts.xml
23:41:25 [2021-06-19T03:41:25.808Z] [INFO] 
23:41:25 [2021-06-19T03:41:25.808Z] [INFO] --- tycho-p2-plugin:2.2.0:update-local-index (default-update-local-index) @ org.eclipse.ease.lang.ruby.feature ---
23:41:25 [2021-06-19T03:41:25.808Z] [INFO] 
23:41:25 [2021-06-19T03:41:25.808Z] [INFO] ----< org.eclipse.ease:org.eclipse.ease.lang.scriptarchive.feature >----
23:41:25 [2021-06-19T03:41:25.808Z] [INFO] Building org.eclipse.ease.lang.scriptarchive.feature 0.8.0-SNAPSHOT [33/48]
23:41:25 [2021-06-19T03:41:25.808Z] [INFO] --------------------------[ eclipse-feature ]---------------------------
23:41:25 [2021-06-19T03:41:25.808Z] [INFO] 
23:41:25 [2021-06-19T03:41:25.808Z] [INFO] --- maven-clean-plugin:2.5:clean (default-clean) @ org.eclipse.ease.lang.scriptarchive.feature ---
23:41:25 [2021-06-19T03:41:25.808Z] [INFO] Deleting /home/jenkins/agent/workspace/ease.verify.core.target.2018-12/features/org.eclipse.ease.lang.scriptarchive.feature/target
23:41:25 [2021-06-19T03:41:25.808Z] [INFO] 
23:41:25 [2021-06-19T03:41:25.808Z] [INFO] --- tycho-packaging-plugin:2.2.0:build-qualifier-aggregator (default-build-qualifier-aggregator) @ org.eclipse.ease.lang.scriptarchive.feature ---
23:41:25 [2021-06-19T03:41:25.808Z] [INFO] The project's OSGi version is 0.8.0.I202106150726
23:41:25 [2021-06-19T03:41:25.808Z] [INFO] 
23:41:25 [2021-06-19T03:41:25.809Z] [INFO] --- tycho-packaging-plugin:2.2.0:validate-id (default-validate-id) @ org.eclipse.ease.lang.scriptarchive.feature ---
23:41:25 [2021-06-19T03:41:25.809Z] [INFO] 
23:41:25 [2021-06-19T03:41:25.809Z] [INFO] --- tycho-packaging-plugin:2.2.0:validate-version (default-validate-version) @ org.eclipse.ease.lang.scriptarchive.feature ---
23:41:25 [2021-06-19T03:41:25.809Z] [INFO] 
23:41:25 [2021-06-19T03:41:25.809Z] [INFO] --- target-platform-configuration:2.2.0:target-platform (default-target-platform) @ org.eclipse.ease.lang.scriptarchive.feature ---
23:41:25 [2021-06-19T03:41:25.809Z] [INFO] 
23:41:25 [2021-06-19T03:41:25.809Z] [INFO] --- tycho-packaging-plugin:2.2.0:package-feature (default-package-feature) @ org.eclipse.ease.lang.scriptarchive.feature ---
23:41:26 [2021-06-19T03:41:26.065Z] [INFO] Building jar: /home/jenkins/agent/workspace/ease.verify.core.target.2018-12/features/org.eclipse.ease.lang.scriptarchive.feature/target/org.eclipse.ease.lang.scriptarchive.feature-0.8.0-SNAPSHOT.jar
23:41:26 [2021-06-19T03:41:26.065Z] [INFO] 
23:41:26 [2021-06-19T03:41:26.065Z] [INFO] --- tycho-p2-plugin:2.2.0:p2-metadata-default (default-p2-metadata-default) @ org.eclipse.ease.lang.scriptarchive.feature ---
23:41:26 [2021-06-19T03:41:26.065Z] [INFO] 
23:41:26 [2021-06-19T03:41:26.065Z] [INFO] --- tycho-p2-plugin:2.2.0:feature-p2-metadata (default-feature-p2-metadata) @ org.eclipse.ease.lang.scriptarchive.feature ---
23:41:26 [2021-06-19T03:41:26.065Z] [INFO] 
23:41:26 [2021-06-19T03:41:26.065Z] [INFO] --- tycho-source-feature-plugin:2.2.0:source-feature (source-feature) @ org.eclipse.ease.lang.scriptarchive.feature ---
23:41:26 [2021-06-19T03:41:26.065Z] [WARNING] Mojo tycho-source-feature-plugin:source-feature is replaced by the tycho-source-plugin:feature-source which offers equivalent and even enhanced functionality
23:41:26 [2021-06-19T03:41:26.065Z] [INFO] Building jar: /home/jenkins/agent/workspace/ease.verify.core.target.2018-12/features/org.eclipse.ease.lang.scriptarchive.feature/target/org.eclipse.ease.lang.scriptarchive.feature-0.8.0-SNAPSHOT-sources-feature.jar
23:41:26 [2021-06-19T03:41:26.065Z] [INFO] 
23:41:26 [2021-06-19T03:41:26.065Z] [INFO] --- tycho-p2-plugin:2.2.0:p2-metadata (attached-p2-metadata) @ org.eclipse.ease.lang.scriptarchive.feature ---
23:41:26 [2021-06-19T03:41:26.065Z] [INFO] 
23:41:26 [2021-06-19T03:41:26.066Z] [INFO] --- maven-install-plugin:2.3.1:install (default-install) @ org.eclipse.ease.lang.scriptarchive.feature ---
23:41:26 [2021-06-19T03:41:26.066Z] [INFO] Installing /home/jenkins/agent/workspace/ease.verify.core.target.2018-12/features/org.eclipse.ease.lang.scriptarchive.feature/target/org.eclipse.ease.lang.scriptarchive.feature-0.8.0-SNAPSHOT.jar to /home/jenkins/.m2/repository/org/eclipse/ease/org.eclipse.ease.lang.scriptarchive.feature/0.8.0-SNAPSHOT/org.eclipse.ease.lang.scriptarchive.feature-0.8.0-SNAPSHOT.jar
23:41:26 [2021-06-19T03:41:26.066Z] [INFO] Installing /home/jenkins/agent/workspace/ease.verify.core.target.2018-12/features/org.eclipse.ease.lang.scriptarchive.feature/pom.xml to /home/jenkins/.m2/repository/org/eclipse/ease/org.eclipse.ease.lang.scriptarchive.feature/0.8.0-SNAPSHOT/org.eclipse.ease.lang.scriptarchive.feature-0.8.0-SNAPSHOT.pom
23:41:26 [2021-06-19T03:41:26.066Z] [INFO] Installing /home/jenkins/agent/workspace/ease.verify.core.target.2018-12/features/org.eclipse.ease.lang.scriptarchive.feature/target/p2content.xml to /home/jenkins/.m2/repository/org/eclipse/ease/org.eclipse.ease.lang.scriptarchive.feature/0.8.0-SNAPSHOT/org.eclipse.ease.lang.scriptarchive.feature-0.8.0-SNAPSHOT-p2metadata.xml
23:41:26 [2021-06-19T03:41:26.066Z] [INFO] Installing /home/jenkins/agent/workspace/ease.verify.core.target.2018-12/features/org.eclipse.ease.lang.scriptarchive.feature/target/p2artifacts.xml to /home/jenkins/.m2/repository/org/eclipse/ease/org.eclipse.ease.lang.scriptarchive.feature/0.8.0-SNAPSHOT/org.eclipse.ease.lang.scriptarchive.feature-0.8.0-SNAPSHOT-p2artifacts.xml
23:41:26 [2021-06-19T03:41:26.066Z] [INFO] Installing /home/jenkins/agent/workspace/ease.verify.core.target.2018-12/features/org.eclipse.ease.lang.scriptarchive.feature/target/org.eclipse.ease.lang.scriptarchive.feature-0.8.0-SNAPSHOT-sources-feature.jar to /home/jenkins/.m2/repository/org/eclipse/ease/org.eclipse.ease.lang.scriptarchive.feature/0.8.0-SNAPSHOT/org.eclipse.ease.lang.scriptarchive.feature-0.8.0-SNAPSHOT-sources-feature.jar
23:41:26 [2021-06-19T03:41:26.066Z] [INFO] Installing /home/jenkins/agent/workspace/ease.verify.core.target.2018-12/features/org.eclipse.ease.lang.scriptarchive.feature/target/p2content.xml to /home/jenkins/.m2/repository/org/eclipse/ease/org.eclipse.ease.lang.scriptarchive.feature/0.8.0-SNAPSHOT/org.eclipse.ease.lang.scriptarchive.feature-0.8.0-SNAPSHOT-p2metadata.xml
23:41:26 [2021-06-19T03:41:26.066Z] [INFO] Installing /home/jenkins/agent/workspace/ease.verify.core.target.2018-12/features/org.eclipse.ease.lang.scriptarchive.feature/target/p2artifacts.xml to /home/jenkins/.m2/repository/org/eclipse/ease/org.eclipse.ease.lang.scriptarchive.feature/0.8.0-SNAPSHOT/org.eclipse.ease.lang.scriptarchive.feature-0.8.0-SNAPSHOT-p2artifacts.xml
23:41:26 [2021-06-19T03:41:26.066Z] [INFO] 
23:41:26 [2021-06-19T03:41:26.066Z] [INFO] --- tycho-p2-plugin:2.2.0:update-local-index (default-update-local-index) @ org.eclipse.ease.lang.scriptarchive.feature ---
23:41:26 [2021-06-19T03:41:26.066Z] [INFO] 
23:41:26 [2021-06-19T03:41:26.066Z] [INFO] ------< org.eclipse.ease:org.eclipse.ease.lang.unittest.feature >-------
23:41:26 [2021-06-19T03:41:26.066Z] [INFO] Building org.eclipse.ease.lang.unittest.feature 0.8.0-SNAPSHOT   [34/48]
23:41:26 [2021-06-19T03:41:26.066Z] [INFO] --------------------------[ eclipse-feature ]---------------------------
23:41:26 [2021-06-19T03:41:26.066Z] [INFO] 
23:41:26 [2021-06-19T03:41:26.066Z] [INFO] --- maven-clean-plugin:2.5:clean (default-clean) @ org.eclipse.ease.lang.unittest.feature ---
23:41:26 [2021-06-19T03:41:26.066Z] [INFO] Deleting /home/jenkins/agent/workspace/ease.verify.core.target.2018-12/features/org.eclipse.ease.lang.unittest.feature/target
23:41:26 [2021-06-19T03:41:26.066Z] [INFO] 
23:41:26 [2021-06-19T03:41:26.066Z] [INFO] --- tycho-packaging-plugin:2.2.0:build-qualifier-aggregator (default-build-qualifier-aggregator) @ org.eclipse.ease.lang.unittest.feature ---
23:41:26 [2021-06-19T03:41:26.066Z] [INFO] The project's OSGi version is 0.8.0.I202106150726
23:41:26 [2021-06-19T03:41:26.066Z] [INFO] 
23:41:26 [2021-06-19T03:41:26.066Z] [INFO] --- tycho-packaging-plugin:2.2.0:validate-id (default-validate-id) @ org.eclipse.ease.lang.unittest.feature ---
23:41:26 [2021-06-19T03:41:26.066Z] [INFO] 
23:41:26 [2021-06-19T03:41:26.066Z] [INFO] --- tycho-packaging-plugin:2.2.0:validate-version (default-validate-version) @ org.eclipse.ease.lang.unittest.feature ---
23:41:26 [2021-06-19T03:41:26.066Z] [INFO] 
23:41:26 [2021-06-19T03:41:26.066Z] [INFO] --- target-platform-configuration:2.2.0:target-platform (default-target-platform) @ org.eclipse.ease.lang.unittest.feature ---
23:41:26 [2021-06-19T03:41:26.066Z] [INFO] 
23:41:26 [2021-06-19T03:41:26.066Z] [INFO] --- tycho-packaging-plugin:2.2.0:package-feature (default-package-feature) @ org.eclipse.ease.lang.unittest.feature ---
23:41:26 [2021-06-19T03:41:26.066Z] [INFO] Building jar: /home/jenkins/agent/workspace/ease.verify.core.target.2018-12/features/org.eclipse.ease.lang.unittest.feature/target/org.eclipse.ease.lang.unittest.feature-0.8.0-SNAPSHOT.jar
23:41:26 [2021-06-19T03:41:26.066Z] [INFO] 
23:41:26 [2021-06-19T03:41:26.066Z] [INFO] --- tycho-p2-plugin:2.2.0:p2-metadata-default (default-p2-metadata-default) @ org.eclipse.ease.lang.unittest.feature ---
23:41:26 [2021-06-19T03:41:26.066Z] [INFO] 
23:41:26 [2021-06-19T03:41:26.066Z] [INFO] --- tycho-p2-plugin:2.2.0:feature-p2-metadata (default-feature-p2-metadata) @ org.eclipse.ease.lang.unittest.feature ---
23:41:26 [2021-06-19T03:41:26.066Z] [INFO] 
23:41:26 [2021-06-19T03:41:26.066Z] [INFO] --- tycho-source-feature-plugin:2.2.0:source-feature (source-feature) @ org.eclipse.ease.lang.unittest.feature ---
23:41:26 [2021-06-19T03:41:26.066Z] [WARNING] Mojo tycho-source-feature-plugin:source-feature is replaced by the tycho-source-plugin:feature-source which offers equivalent and even enhanced functionality
23:41:26 [2021-06-19T03:41:26.066Z] [INFO] Building jar: /home/jenkins/agent/workspace/ease.verify.core.target.2018-12/features/org.eclipse.ease.lang.unittest.feature/target/org.eclipse.ease.lang.unittest.feature-0.8.0-SNAPSHOT-sources-feature.jar
23:41:26 [2021-06-19T03:41:26.066Z] [INFO] 
23:41:26 [2021-06-19T03:41:26.066Z] [INFO] --- tycho-p2-plugin:2.2.0:p2-metadata (attached-p2-metadata) @ org.eclipse.ease.lang.unittest.feature ---
23:41:26 [2021-06-19T03:41:26.066Z] [INFO] 
23:41:26 [2021-06-19T03:41:26.066Z] [INFO] --- maven-install-plugin:2.3.1:install (default-install) @ org.eclipse.ease.lang.unittest.feature ---
23:41:26 [2021-06-19T03:41:26.066Z] [INFO] Installing /home/jenkins/agent/workspace/ease.verify.core.target.2018-12/features/org.eclipse.ease.lang.unittest.feature/target/org.eclipse.ease.lang.unittest.feature-0.8.0-SNAPSHOT.jar to /home/jenkins/.m2/repository/org/eclipse/ease/org.eclipse.ease.lang.unittest.feature/0.8.0-SNAPSHOT/org.eclipse.ease.lang.unittest.feature-0.8.0-SNAPSHOT.jar
23:41:26 [2021-06-19T03:41:26.067Z] [INFO] Installing /home/jenkins/agent/workspace/ease.verify.core.target.2018-12/features/org.eclipse.ease.lang.unittest.feature/pom.xml to /home/jenkins/.m2/repository/org/eclipse/ease/org.eclipse.ease.lang.unittest.feature/0.8.0-SNAPSHOT/org.eclipse.ease.lang.unittest.feature-0.8.0-SNAPSHOT.pom
23:41:26 [2021-06-19T03:41:26.067Z] [INFO] Installing /home/jenkins/agent/workspace/ease.verify.core.target.2018-12/features/org.eclipse.ease.lang.unittest.feature/target/p2content.xml to /home/jenkins/.m2/repository/org/eclipse/ease/org.eclipse.ease.lang.unittest.feature/0.8.0-SNAPSHOT/org.eclipse.ease.lang.unittest.feature-0.8.0-SNAPSHOT-p2metadata.xml
23:41:26 [2021-06-19T03:41:26.067Z] [INFO] Installing /home/jenkins/agent/workspace/ease.verify.core.target.2018-12/features/org.eclipse.ease.lang.unittest.feature/target/p2artifacts.xml to /home/jenkins/.m2/repository/org/eclipse/ease/org.eclipse.ease.lang.unittest.feature/0.8.0-SNAPSHOT/org.eclipse.ease.lang.unittest.feature-0.8.0-SNAPSHOT-p2artifacts.xml
23:41:26 [2021-06-19T03:41:26.067Z] [INFO] Installing /home/jenkins/agent/workspace/ease.verify.core.target.2018-12/features/org.eclipse.ease.lang.unittest.feature/target/org.eclipse.ease.lang.unittest.feature-0.8.0-SNAPSHOT-sources-feature.jar to /home/jenkins/.m2/repository/org/eclipse/ease/org.eclipse.ease.lang.unittest.feature/0.8.0-SNAPSHOT/org.eclipse.ease.lang.unittest.feature-0.8.0-SNAPSHOT-sources-feature.jar
23:41:26 [2021-06-19T03:41:26.067Z] [INFO] Installing /home/jenkins/agent/workspace/ease.verify.core.target.2018-12/features/org.eclipse.ease.lang.unittest.feature/target/p2content.xml to /home/jenkins/.m2/repository/org/eclipse/ease/org.eclipse.ease.lang.unittest.feature/0.8.0-SNAPSHOT/org.eclipse.ease.lang.unittest.feature-0.8.0-SNAPSHOT-p2metadata.xml
23:41:26 [2021-06-19T03:41:26.067Z] [INFO] Installing /home/jenkins/agent/workspace/ease.verify.core.target.2018-12/features/org.eclipse.ease.lang.unittest.feature/target/p2artifacts.xml to /home/jenkins/.m2/repository/org/eclipse/ease/org.eclipse.ease.lang.unittest.feature/0.8.0-SNAPSHOT/org.eclipse.ease.lang.unittest.feature-0.8.0-SNAPSHOT-p2artifacts.xml
23:41:26 [2021-06-19T03:41:26.067Z] [INFO] 
23:41:26 [2021-06-19T03:41:26.067Z] [INFO] --- tycho-p2-plugin:2.2.0:update-local-index (default-update-local-index) @ org.eclipse.ease.lang.unittest.feature ---
23:41:26 [2021-06-19T03:41:26.067Z] [INFO] 
23:41:26 [2021-06-19T03:41:26.067Z] [INFO] ----------< org.eclipse.ease:org.eclipse.ease.releng.target >-----------
23:41:26 [2021-06-19T03:41:26.067Z] [INFO] Building org.eclipse.ease.releng.target 0.8.0-SNAPSHOT           [35/48]
23:41:26 [2021-06-19T03:41:26.067Z] [INFO] ---------------------[ eclipse-target-definition ]----------------------
23:41:26 [2021-06-19T03:41:26.067Z] [INFO] 
23:41:26 [2021-06-19T03:41:26.067Z] [INFO] --- maven-clean-plugin:2.5:clean (default-clean) @ org.eclipse.ease.releng.target ---
23:41:26 [2021-06-19T03:41:26.067Z] [INFO] 
23:41:26 [2021-06-19T03:41:26.067Z] [INFO] --- tycho-packaging-plugin:2.2.0:package-target-definition (default-package-target-definition) @ org.eclipse.ease.releng.target ---
23:41:26 [2021-06-19T03:41:26.067Z] [INFO] 
23:41:26 [2021-06-19T03:41:26.067Z] [INFO] --- maven-install-plugin:2.3.1:install (default-install) @ org.eclipse.ease.releng.target ---
23:41:26 [2021-06-19T03:41:26.067Z] [INFO] Installing /home/jenkins/agent/workspace/ease.verify.core.target.2018-12/releng/org.eclipse.ease.releng.target/org.eclipse.ease.releng.target.target to /home/jenkins/.m2/repository/org/eclipse/ease/org.eclipse.ease.releng.target/0.8.0-SNAPSHOT/org.eclipse.ease.releng.target-0.8.0-SNAPSHOT.target
23:41:26 [2021-06-19T03:41:26.067Z] [INFO] Installing /home/jenkins/agent/workspace/ease.verify.core.target.2018-12/releng/org.eclipse.ease.releng.target/pom.xml to /home/jenkins/.m2/repository/org/eclipse/ease/org.eclipse.ease.releng.target/0.8.0-SNAPSHOT/org.eclipse.ease.releng.target-0.8.0-SNAPSHOT.pom
23:41:26 [2021-06-19T03:41:26.067Z] [INFO] 
23:41:26 [2021-06-19T03:41:26.067Z] [INFO] ------------< org.eclipse.ease:org.eclipse.ease.releng.p2 >-------------
23:41:26 [2021-06-19T03:41:26.067Z] [INFO] Building org.eclipse.ease.releng.p2 0.8.0-SNAPSHOT               [36/48]
23:41:26 [2021-06-19T03:41:26.067Z] [INFO] -------------------------[ eclipse-repository ]-------------------------
23:41:26 [2021-06-19T03:41:26.067Z] [INFO] ------------------------------------------------------------------------
23:41:26 [2021-06-19T03:41:26.067Z] [INFO] Reactor Summary:
23:41:26 [2021-06-19T03:41:26.067Z] [INFO] 
23:41:26 [2021-06-19T03:41:26.067Z] [INFO] org.eclipse.ease.classloader 0.8.0-SNAPSHOT ........ SUCCESS [ 26.604 s]
23:41:26 [2021-06-19T03:41:26.067Z] [INFO] org.eclipse.ease 0.8.0-SNAPSHOT .................... SUCCESS [ 19.776 s]
23:41:26 [2021-06-19T03:41:26.067Z] [INFO] org.eclipse.ease.ui 0.8.0-SNAPSHOT ................. SUCCESS [ 23.750 s]
23:41:26 [2021-06-19T03:41:26.067Z] [INFO] org.eclipse.ease.ui.completions.java 0.8.0-SNAPSHOT  SUCCESS [  8.901 s]
23:41:26 [2021-06-19T03:41:26.067Z] [INFO] org.eclipse.ease.ui.scripts 0.8.0-SNAPSHOT ......... SUCCESS [ 18.745 s]
23:41:26 [2021-06-19T03:41:26.067Z] [INFO] org.eclipse.ease.releng 0.8.0-SNAPSHOT ............. SUCCESS [  0.284 s]
23:41:26 [2021-06-19T03:41:26.067Z] [INFO] org.eclipse.ease.lang.javascript 0.8.0-SNAPSHOT .... SUCCESS [  7.576 s]
23:41:26 [2021-06-19T03:41:26.067Z] [INFO] org.eclipse.ease.lang.scriptarchive 0.8.0-SNAPSHOT . SUCCESS [  6.055 s]
23:41:26 [2021-06-19T03:41:26.067Z] [INFO] org.eclipse.ease.lang.python 0.8.0-SNAPSHOT ........ SUCCESS [  7.537 s]
23:41:26 [2021-06-19T03:41:26.067Z] [INFO] org.eclipse.ease.lang.python.py4j 0.8.0-SNAPSHOT ... SUCCESS [  7.303 s]
23:41:26 [2021-06-19T03:41:26.067Z] [INFO] org.eclipse.ease.lang.groovy 0.8.0-SNAPSHOT ........ SUCCESS [  5.130 s]
23:41:26 [2021-06-19T03:41:26.067Z] [INFO] org.eclipse.ease.lang.groovy.interpreter 0.8.0-SNAPSHOT SUCCESS [  5.741 s]
23:41:26 [2021-06-19T03:41:26.067Z] [INFO] org.eclipse.ease.lang.unittest 0.8.0-SNAPSHOT ...... SUCCESS [ 11.375 s]
23:41:26 [2021-06-19T03:41:26.067Z] [INFO] org.eclipse.ease.lang.unittest.ui 0.8.0-SNAPSHOT ... SUCCESS [ 16.149 s]
23:41:26 [2021-06-19T03:41:26.067Z] [INFO] org.eclipse.ease.lang.ruby 0.8.0-SNAPSHOT .......... SUCCESS [  5.296 s]
23:41:26 [2021-06-19T03:41:26.067Z] [INFO] org.eclipse.ease.lang.ruby.jruby 0.8.0-SNAPSHOT .... SUCCESS [  5.931 s]
23:41:26 [2021-06-19T03:41:26.067Z] [INFO] org.eclipse.ease.lang.javascript.nashorn 0.8.0-SNAPSHOT SUCCESS [  5.615 s]
23:41:26 [2021-06-19T03:41:26.067Z] [INFO] org.eclipse.ease.lang.javascript.rhino 0.8.0-SNAPSHOT SUCCESS [  9.335 s]
23:41:26 [2021-06-19T03:41:26.067Z] [INFO] org.eclipse.ease.lang.python.jython 0.8.0-SNAPSHOT . SUCCESS [  9.765 s]
23:41:26 [2021-06-19T03:41:26.067Z] [INFO] org.eclipse.ease.lang.javascript.ui 0.8.0-SNAPSHOT . SUCCESS [  6.593 s]
23:41:26 [2021-06-19T03:41:26.067Z] [INFO] org.eclipse.ease.lang.jvm.compiled 0.8.0-SNAPSHOT .. SUCCESS [  6.537 s]
23:41:26 [2021-06-19T03:41:26.067Z] [INFO] org.eclipse.ease.lang.scriptarchive.ui 0.8.0-SNAPSHOT SUCCESS [  7.559 s]
23:41:26 [2021-06-19T03:41:26.067Z] [INFO] org.eclipse.ease.help 0.8.0-SNAPSHOT ............... SUCCESS [  9.894 s]
23:41:26 [2021-06-19T03:41:26.067Z] [INFO] org.eclipse.ease.feature 0.8.0-SNAPSHOT ............ SUCCESS [  0.268 s]
23:41:26 [2021-06-19T03:41:26.067Z] [INFO] org.eclipse.ease.ui.feature 0.8.0-SNAPSHOT ......... SUCCESS [  0.148 s]
23:41:26 [2021-06-19T03:41:26.067Z] [INFO] org.eclipse.ease.lang.javascript.feature 0.8.0-SNAPSHOT SUCCESS [  0.174 s]
23:41:26 [2021-06-19T03:41:26.067Z] [INFO] org.eclipse.ease.lang.python.feature 0.8.0-SNAPSHOT  SUCCESS [  0.109 s]
23:41:26 [2021-06-19T03:41:26.067Z] [INFO] org.eclipse.ease.python.jython.feature 0.8.0-SNAPSHOT SUCCESS [  0.104 s]
23:41:26 [2021-06-19T03:41:26.067Z] [INFO] org.eclipse.ease.lang.python.py4j.feature 0.8.0-SNAPSHOT SUCCESS [  0.097 s]
23:41:26 [2021-06-19T03:41:26.067Z] [INFO] org.eclipse.ease.lang.jvm.feature 0.8.0-SNAPSHOT ... SUCCESS [  0.108 s]
23:41:26 [2021-06-19T03:41:26.067Z] [INFO] org.eclipse.ease.lang.groovy.feature 0.8.0-SNAPSHOT  SUCCESS [  0.182 s]
23:41:26 [2021-06-19T03:41:26.067Z] [INFO] org.eclipse.ease.lang.ruby.feature 0.8.0-SNAPSHOT .. SUCCESS [  0.103 s]
23:41:26 [2021-06-19T03:41:26.067Z] [INFO] org.eclipse.ease.lang.scriptarchive.feature 0.8.0-SNAPSHOT SUCCESS [  0.103 s]
23:41:26 [2021-06-19T03:41:26.067Z] [INFO] org.eclipse.ease.lang.unittest.feature 0.8.0-SNAPSHOT SUCCESS [  0.099 s]
23:41:26 [2021-06-19T03:41:26.068Z] [INFO] org.eclipse.ease.releng.target 0.8.0-SNAPSHOT ...... SUCCESS [  0.006 s]
23:41:26 [2021-06-19T03:41:26.068Z] [INFO] org.eclipse.ease.releng.p2 0.8.0-SNAPSHOT .......... FAILURE [  0.001 s]
23:41:26 [2021-06-19T03:41:26.068Z] [INFO] org.eclipse.ease.testhelper 0.8.0-SNAPSHOT ......... SKIPPED
23:41:26 [2021-06-19T03:41:26.068Z] [INFO] org.eclipse.ease.test 0.8.0-SNAPSHOT ............... SKIPPED
23:41:26 [2021-06-19T03:41:26.068Z] [INFO] org.eclipse.ease.lang.javascript.rhino.test 0.8.0-SNAPSHOT SKIPPED
23:41:26 [2021-06-19T03:41:26.068Z] [INFO] org.eclipse.ease.lang.javascript.test 0.8.0-SNAPSHOT SKIPPED
23:41:26 [2021-06-19T03:41:26.068Z] [INFO] org.eclipse.ease.lang.python.test 0.8.0-SNAPSHOT ... SKIPPED
23:41:26 [2021-06-19T03:41:26.068Z] [INFO] org.eclipse.ease.lang.python.jython.test 0.8.0-SNAPSHOT SKIPPED
23:41:26 [2021-06-19T03:41:26.068Z] [INFO] org.eclipse.ease.lang.scriptarchive.test 0.8.0-SNAPSHOT SKIPPED
23:41:26 [2021-06-19T03:41:26.068Z] [INFO] org.eclipse.ease.lang.unittest.test 0.8.0-SNAPSHOT . SKIPPED
23:41:26 [2021-06-19T03:41:26.068Z] [INFO] org.eclipse.ease.ui.scripts.test 0.8.0-SNAPSHOT .... SKIPPED
23:41:26 [2021-06-19T03:41:26.068Z] [INFO] org.eclipse.ease.ui.test 0.8.0-SNAPSHOT ............ SKIPPED
23:41:26 [2021-06-19T03:41:26.068Z] [INFO] org.eclipse.ease.releng.coverage 0.8.0-SNAPSHOT .... SKIPPED
23:41:26 [2021-06-19T03:41:26.068Z] [INFO] EASE (Incubation) 0.4.0-SNAPSHOT ................... SKIPPED
23:41:26 [2021-06-19T03:41:26.068Z] [INFO] ------------------------------------------------------------------------
23:41:26 [2021-06-19T03:41:26.068Z] [INFO] BUILD FAILURE
23:41:26 [2021-06-19T03:41:26.068Z] [INFO] ------------------------------------------------------------------------
23:41:26 [2021-06-19T03:41:26.068Z] [INFO] Total time:  04:53 min
23:41:26 [2021-06-19T03:41:26.068Z] [INFO] Finished at: 2021-06-19T03:41:26Z
23:41:26 [2021-06-19T03:41:26.068Z] [INFO] ------------------------------------------------------------------------
23:41:26 [2021-06-19T03:41:26.068Z] [INFO] [jenkins-event-spy] Generated /home/jenkins/agent/workspace/ease.verify.core.target.2018-12@tmp/withMaven5ceb62ba/maven-spy-20210619-033631-95112229159567221860280.log
23:41:26 [2021-06-19T03:41:26.068Z] [ERROR] Plugin org.jboss.tools.tycho-plugins:repository-utils:2.2.0 or one of its dependencies could not be resolved: Failed to read artifact descriptor for org.jboss.tools.tycho-plugins:repository-utils:jar:2.2.0: org.jboss.tools.tycho-plugins:repository-utils:pom:2.2.0 failed to transfer from http://0.0.0.0/ during a previous attempt. This failure was cached in the local repository and resolution is not reattempted until the update interval of maven-default-http-blocker has elapsed or updates are forced. Original error: Could not transfer artifact org.jboss.tools.tycho-plugins:repository-utils:pom:2.2.0 from/to maven-default-http-blocker (http://0.0.0.0/): Blocked mirror for repositories: [jboss-public-repository-group (http://repository.jboss.org/nexus/content/groups/public/, default, releases+snapshots)] -> [Help 1]
23:41:26 [2021-06-19T03:41:26.068Z] [ERROR] 
23:41:26 [2021-06-19T03:41:26.068Z] [ERROR] To see the full stack trace of the errors, re-run Maven with the -e switch.
23:41:26 [2021-06-19T03:41:26.068Z] [ERROR] Re-run Maven using the -X switch to enable full debug logging.
23:41:26 [2021-06-19T03:41:26.068Z] [ERROR] 
23:41:26 [2021-06-19T03:41:26.068Z] [ERROR] For more information about the errors and possible solutions, please read the following articles:
23:41:26 [2021-06-19T03:41:26.068Z] [ERROR] [Help 1] http://cwiki.apache.org/confluence/display/MAVEN/PluginResolutionException