SuccessConsole Output

Skipping 966 KB.. Full Log
20200915-1508.jar, -data, /home/jenkins/agent/workspace/ease.verify.core.target.2018-12/tests/org.eclipse.ease.lang.scriptarchive.test/target/work/data, -install, /home/jenkins/agent/workspace/ease.verify.core.target.2018-12/tests/org.eclipse.ease.lang.scriptarchive.test/target/work, -configuration, /home/jenkins/agent/workspace/ease.verify.core.target.2018-12/tests/org.eclipse.ease.lang.scriptarchive.test/target/work/configuration, -application, org.eclipse.tycho.surefire.osgibooter.headlesstest, -testproperties, /home/jenkins/agent/workspace/ease.verify.core.target.2018-12/tests/org.eclipse.ease.lang.scriptarchive.test/target/surefire.properties]
23:59:28 [2021-05-29T03:59:28.553Z] Picked up JAVA_TOOL_OPTIONS: -Dmaven.ext.class.path="/home/jenkins/agent/workspace/ease.verify.core.target.2018-12@tmp/withMaven984a5d0d/pipeline-maven-spy.jar" -Dorg.jenkinsci.plugins.pipeline.maven.reportsFolder="/home/jenkins/agent/workspace/ease.verify.core.target.2018-12@tmp/withMaven984a5d0d" 
23:59:32 [2021-05-29T03:59:32.790Z] May 29, 2021 3:59:31 AM org.junit.platform.launcher.core.DefaultLauncher handleThrowable
23:59:32 [2021-05-29T03:59:32.790Z] WARNING: TestEngine with ID 'junit-vintage' failed to discover tests
23:59:32 [2021-05-29T03:59:32.790Z] java.lang.NoClassDefFoundError: org/junit/runners/model/RunnerBuilder
23:59:32 [2021-05-29T03:59:32.790Z] 	at org.junit.vintage.engine.discovery.VintageDiscoverer.<init>(VintageDiscoverer.java:48)
23:59:32 [2021-05-29T03:59:32.790Z] 	at org.junit.vintage.engine.VintageTestEngine.discover(VintageTestEngine.java:65)
23:59:32 [2021-05-29T03:59:32.790Z] 	at org.junit.platform.launcher.core.DefaultLauncher.discoverEngineRoot(DefaultLauncher.java:130)
23:59:32 [2021-05-29T03:59:32.790Z] 	at org.junit.platform.launcher.core.DefaultLauncher.discoverRoot(DefaultLauncher.java:117)
23:59:32 [2021-05-29T03:59:32.790Z] 	at org.junit.platform.launcher.core.DefaultLauncher.discover(DefaultLauncher.java:82)
23:59:32 [2021-05-29T03:59:32.790Z] 	at org.apache.maven.surefire.junitplatform.TestPlanScannerFilter.accept(TestPlanScannerFilter.java:56)
23:59:32 [2021-05-29T03:59:32.790Z] 	at org.apache.maven.surefire.util.DefaultScanResult.applyFilter(DefaultScanResult.java:102)
23:59:32 [2021-05-29T03:59:32.790Z] 	at org.apache.maven.surefire.junitplatform.JUnitPlatformProvider.scanClasspath(JUnitPlatformProvider.java:143)
23:59:32 [2021-05-29T03:59:32.790Z] 	at org.apache.maven.surefire.junitplatform.JUnitPlatformProvider.invoke(JUnitPlatformProvider.java:124)
23:59:32 [2021-05-29T03:59:32.790Z] 	at java.base/jdk.internal.reflect.NativeMethodAccessorImpl.invoke0(Native Method)
23:59:32 [2021-05-29T03:59:32.790Z] 	at java.base/jdk.internal.reflect.NativeMethodAccessorImpl.invoke(NativeMethodAccessorImpl.java:64)
23:59:32 [2021-05-29T03:59:32.790Z] 	at java.base/jdk.internal.reflect.DelegatingMethodAccessorImpl.invoke(DelegatingMethodAccessorImpl.java:43)
23:59:32 [2021-05-29T03:59:32.790Z] 	at java.base/java.lang.reflect.Method.invoke(Method.java:564)
23:59:32 [2021-05-29T03:59:32.790Z] 	at org.apache.maven.surefire.util.ReflectionUtils.invokeMethodWithArray2(ReflectionUtils.java:206)
23:59:32 [2021-05-29T03:59:32.790Z] 	at org.apache.maven.surefire.booter.ProviderFactory$ProviderProxy.invoke(ProviderFactory.java:161)
23:59:32 [2021-05-29T03:59:32.790Z] 	at org.apache.maven.surefire.booter.ProviderFactory.invokeProvider(ProviderFactory.java:84)
23:59:32 [2021-05-29T03:59:32.790Z] 	at org.eclipse.tycho.surefire.osgibooter.OsgiSurefireBooter.run(OsgiSurefireBooter.java:116)
23:59:32 [2021-05-29T03:59:32.790Z] 	at org.eclipse.tycho.surefire.osgibooter.HeadlessTestApplication.start(HeadlessTestApplication.java:23)
23:59:32 [2021-05-29T03:59:32.790Z] 	at org.eclipse.equinox.internal.app.EclipseAppHandle.run(EclipseAppHandle.java:203)
23:59:32 [2021-05-29T03:59:32.791Z] 	at org.eclipse.core.runtime.internal.adaptor.EclipseAppLauncher.runApplication(EclipseAppLauncher.java:134)
23:59:32 [2021-05-29T03:59:32.791Z] 	at org.eclipse.core.runtime.internal.adaptor.EclipseAppLauncher.start(EclipseAppLauncher.java:104)
23:59:32 [2021-05-29T03:59:32.791Z] 	at org.eclipse.core.runtime.adaptor.EclipseStarter.run(EclipseStarter.java:401)
23:59:32 [2021-05-29T03:59:32.791Z] 	at org.eclipse.core.runtime.adaptor.EclipseStarter.run(EclipseStarter.java:255)
23:59:32 [2021-05-29T03:59:32.791Z] 	at java.base/jdk.internal.reflect.NativeMethodAccessorImpl.invoke0(Native Method)
23:59:32 [2021-05-29T03:59:32.791Z] 	at java.base/jdk.internal.reflect.NativeMethodAccessorImpl.invoke(NativeMethodAccessorImpl.java:64)
23:59:32 [2021-05-29T03:59:32.791Z] 	at java.base/jdk.internal.reflect.DelegatingMethodAccessorImpl.invoke(DelegatingMethodAccessorImpl.java:43)
23:59:32 [2021-05-29T03:59:32.791Z] 	at java.base/java.lang.reflect.Method.invoke(Method.java:564)
23:59:32 [2021-05-29T03:59:32.791Z] 	at org.eclipse.equinox.launcher.Main.invokeFramework(Main.java:653)
23:59:32 [2021-05-29T03:59:32.791Z] 	at org.eclipse.equinox.launcher.Main.basicRun(Main.java:590)
23:59:32 [2021-05-29T03:59:32.791Z] 	at org.eclipse.equinox.launcher.Main.run(Main.java:1461)
23:59:32 [2021-05-29T03:59:32.791Z] 	at org.eclipse.equinox.launcher.Main.main(Main.java:1434)
23:59:32 [2021-05-29T03:59:32.791Z] Caused by: java.lang.ClassNotFoundException: org.junit.runners.model.RunnerBuilder cannot be found by org.eclipse.tycho.surefire.osgibooter_2.2.0
23:59:32 [2021-05-29T03:59:32.791Z] 	at org.eclipse.osgi.internal.loader.BundleLoader.findClass(BundleLoader.java:516)
23:59:32 [2021-05-29T03:59:32.791Z] 	at org.eclipse.osgi.internal.loader.ModuleClassLoader.loadClass(ModuleClassLoader.java:171)
23:59:32 [2021-05-29T03:59:32.791Z] 	at java.base/java.lang.ClassLoader.loadClass(ClassLoader.java:522)
23:59:32 [2021-05-29T03:59:32.791Z] 	... 31 more
23:59:32 [2021-05-29T03:59:32.791Z] 
23:59:32 [2021-05-29T03:59:32.791Z] May 29, 2021 3:59:31 AM org.junit.platform.launcher.core.DefaultLauncher handleThrowable
23:59:32 [2021-05-29T03:59:32.791Z] WARNING: TestEngine with ID 'junit-vintage' failed to discover tests
23:59:32 [2021-05-29T03:59:32.791Z] java.lang.NoClassDefFoundError: org/junit/runners/model/RunnerBuilder
23:59:32 [2021-05-29T03:59:32.791Z] 	at org.junit.vintage.engine.discovery.VintageDiscoverer.<init>(VintageDiscoverer.java:48)
23:59:32 [2021-05-29T03:59:32.791Z] 	at org.junit.vintage.engine.VintageTestEngine.discover(VintageTestEngine.java:65)
23:59:32 [2021-05-29T03:59:32.791Z] 	at org.junit.platform.launcher.core.DefaultLauncher.discoverEngineRoot(DefaultLauncher.java:130)
23:59:32 [2021-05-29T03:59:32.791Z] 	at org.junit.platform.launcher.core.DefaultLauncher.discoverRoot(DefaultLauncher.java:117)
23:59:32 [2021-05-29T03:59:32.791Z] 	at org.junit.platform.launcher.core.DefaultLauncher.execute(DefaultLauncher.java:90)
23:59:32 [2021-05-29T03:59:32.791Z] 	at org.apache.maven.surefire.junitplatform.JUnitPlatformProvider.invokeAllTests(JUnitPlatformProvider.java:150)
23:59:32 [2021-05-29T03:59:32.791Z] 	at org.apache.maven.surefire.junitplatform.JUnitPlatformProvider.invoke(JUnitPlatformProvider.java:124)
23:59:32 [2021-05-29T03:59:32.791Z] 	at java.base/jdk.internal.reflect.NativeMethodAccessorImpl.invoke0(Native Method)
23:59:32 [2021-05-29T03:59:32.791Z] 	at java.base/jdk.internal.reflect.NativeMethodAccessorImpl.invoke(NativeMethodAccessorImpl.java:64)
23:59:32 [2021-05-29T03:59:32.791Z] 	at java.base/jdk.internal.reflect.DelegatingMethodAccessorImpl.invoke(DelegatingMethodAccessorImpl.java:43)
23:59:32 [2021-05-29T03:59:32.791Z] 	at java.base/java.lang.reflect.Method.invoke(Method.java:564)
23:59:32 [2021-05-29T03:59:32.791Z] 	at org.apache.maven.surefire.util.ReflectionUtils.invokeMethodWithArray2(ReflectionUtils.java:206)
23:59:32 [2021-05-29T03:59:32.791Z] 	at org.apache.maven.surefire.booter.ProviderFactory$ProviderProxy.invoke(ProviderFactory.java:161)
23:59:32 [2021-05-29T03:59:32.791Z] 	at org.apache.maven.surefire.booter.ProviderFactory.invokeProvider(ProviderFactory.java:84)
23:59:32 [2021-05-29T03:59:32.791Z] 	at org.eclipse.tycho.surefire.osgibooter.OsgiSurefireBooter.run(OsgiSurefireBooter.java:116)
23:59:32 [2021-05-29T03:59:32.791Z] 	at org.eclipse.tycho.surefire.osgibooter.HeadlessTestApplication.start(HeadlessTestApplication.java:23)
23:59:32 [2021-05-29T03:59:32.791Z] 	at org.eclipse.equinox.internal.app.EclipseAppHandle.run(EclipseAppHandle.java:203)
23:59:32 [2021-05-29T03:59:32.791Z] 	at org.eclipse.core.runtime.internal.adaptor.EclipseAppLauncher.runApplication(EclipseAppLauncher.java:134)
23:59:32 [2021-05-29T03:59:32.791Z] 	at org.eclipse.core.runtime.internal.adaptor.EclipseAppLauncher.start(EclipseAppLauncher.java:104)
23:59:32 [2021-05-29T03:59:32.791Z] 	at org.eclipse.core.runtime.adaptor.EclipseStarter.run(EclipseStarter.java:401)
23:59:32 [2021-05-29T03:59:32.791Z] 	at org.eclipse.core.runtime.adaptor.EclipseStarter.run(EclipseStarter.java:255)
23:59:32 [2021-05-29T03:59:32.791Z] 	at java.base/jdk.internal.reflect.NativeMethodAccessorImpl.invoke0(Native Method)
23:59:32 [2021-05-29T03:59:32.791Z] 	at java.base/jdk.internal.reflect.NativeMethodAccessorImpl.invoke(NativeMethodAccessorImpl.java:64)
23:59:32 [2021-05-29T03:59:32.791Z] 	at java.base/jdk.internal.reflect.DelegatingMethodAccessorImpl.invoke(DelegatingMethodAccessorImpl.java:43)
23:59:32 [2021-05-29T03:59:32.791Z] 	at java.base/java.lang.reflect.Method.invoke(Method.java:564)
23:59:32 [2021-05-29T03:59:32.791Z] 	at org.eclipse.equinox.launcher.Main.invokeFramework(Main.java:653)
23:59:32 [2021-05-29T03:59:32.791Z] 	at org.eclipse.equinox.launcher.Main.basicRun(Main.java:590)
23:59:32 [2021-05-29T03:59:32.791Z] 	at org.eclipse.equinox.launcher.Main.run(Main.java:1461)
23:59:32 [2021-05-29T03:59:32.791Z] 	at org.eclipse.equinox.launcher.Main.main(Main.java:1434)
23:59:32 [2021-05-29T03:59:32.791Z] Caused by: java.lang.ClassNotFoundException: org.junit.runners.model.RunnerBuilder cannot be found by org.eclipse.tycho.surefire.osgibooter_2.2.0
23:59:32 [2021-05-29T03:59:32.791Z] 	at org.eclipse.osgi.internal.loader.BundleLoader.findClass(BundleLoader.java:516)
23:59:32 [2021-05-29T03:59:32.791Z] 	at org.eclipse.osgi.internal.loader.ModuleClassLoader.loadClass(ModuleClassLoader.java:171)
23:59:32 [2021-05-29T03:59:32.791Z] 	at java.base/java.lang.ClassLoader.loadClass(ClassLoader.java:522)
23:59:32 [2021-05-29T03:59:32.791Z] 	... 29 more
23:59:32 [2021-05-29T03:59:32.791Z] 
23:59:32 [2021-05-29T03:59:32.791Z] Running org.eclipse.ease.lang.scriptarchive.ArchiveEngineTest
23:59:33 [2021-05-29T03:59:33.049Z] We are running from a zip file!
23:59:33 [2021-05-29T03:59:33.049Z] org.eclipse.ease.ScriptExecutionException: SyntaxError: missing ; before statement (workspace://__EASE_ScriptArchive_1/scripts/Master.js#3)
23:59:33 [2021-05-29T03:59:33.049Z] this is an error
23:59:33 [2021-05-29T03:59:33.049Z]        ^
23:59:33 [2021-05-29T03:59:33.049Z] 	at Master.js,workspace://__EASE_ScriptArchive_1/scripts/Master.js
23:59:33 [2021-05-29T03:59:33.306Z] org.eclipse.ease.ScriptExecutionException: SyntaxError: missing ; before statement (workspace://__EASE_ScriptArchive_1/scripts/Master.js#3)
23:59:33 [2021-05-29T03:59:33.306Z] this is an error
23:59:33 [2021-05-29T03:59:33.306Z]        ^
23:59:33 [2021-05-29T03:59:33.306Z] 	at Master.js,workspace://__EASE_ScriptArchive_1/scripts/Master.js
23:59:33 [2021-05-29T03:59:33.306Z] Tests run: 7, Failures: 0, Errors: 0, Skipped: 0, Time elapsed: 1.144 s - in org.eclipse.ease.lang.scriptarchive.ArchiveEngineTest
23:59:33 [2021-05-29T03:59:33.306Z] executeWithManifest  Time elapsed: 0.883 s
23:59:33 [2021-05-29T03:59:33.306Z] zipFileRegistration  Time elapsed: 0.012 s
23:59:33 [2021-05-29T03:59:33.306Z] engineIdRegistration  Time elapsed: 0.001 s
23:59:33 [2021-05-29T03:59:33.306Z] jarFileRegistration  Time elapsed: 0 s
23:59:33 [2021-05-29T03:59:33.306Z] sarFileRegistration  Time elapsed: 0 s
23:59:33 [2021-05-29T03:59:33.306Z] executeWithErrors  Time elapsed: 0.141 s
23:59:33 [2021-05-29T03:59:33.306Z] executeWithIncludes  Time elapsed: 0.096 s
23:59:33 [2021-05-29T03:59:33.306Z] 
23:59:33 [2021-05-29T03:59:33.306Z] Results:
23:59:33 [2021-05-29T03:59:33.306Z] 
23:59:33 [2021-05-29T03:59:33.306Z] Tests run: 7, Failures: 0, Errors: 0, Skipped: 0
23:59:33 [2021-05-29T03:59:33.306Z] 
23:59:35 [2021-05-29T03:59:35.830Z] [INFO] All tests passed!
23:59:35 [2021-05-29T03:59:35.830Z] [INFO] 
23:59:35 [2021-05-29T03:59:35.830Z] [INFO] --- maven-pmd-plugin:3.14.0:pmd (pmd-integration) @ org.eclipse.ease.lang.scriptarchive.test ---
23:59:36 [2021-05-29T03:59:36.394Z] [INFO] 
23:59:36 [2021-05-29T03:59:36.394Z] [INFO] --- maven-pmd-plugin:3.14.0:cpd (pmd-integration) @ org.eclipse.ease.lang.scriptarchive.test ---
23:59:36 [2021-05-29T03:59:36.394Z] [INFO] 
23:59:36 [2021-05-29T03:59:36.394Z] [INFO] --- spotbugs-maven-plugin:4.1.4:spotbugs (spotbugs-integration) @ org.eclipse.ease.lang.scriptarchive.test ---
23:59:36 [2021-05-29T03:59:36.394Z] [INFO] Fork Value is false
23:59:36 [2021-05-29T03:59:36.394Z]      [java] JVM args ignored when same JVM is used.
23:59:39 [2021-05-29T03:59:39.791Z] [INFO] Done SpotBugs Analysis....
23:59:39 [2021-05-29T03:59:39.791Z] [INFO] 
23:59:39 [2021-05-29T03:59:39.791Z] [INFO] --- maven-checkstyle-plugin:3.1.1:check (checkstyle-integration) @ org.eclipse.ease.lang.scriptarchive.test ---
23:59:39 [2021-05-29T03:59:39.791Z] [INFO] You have 0 Checkstyle violations.
23:59:39 [2021-05-29T03:59:39.791Z] [INFO] 
23:59:39 [2021-05-29T03:59:39.791Z] [INFO] --- maven-install-plugin:2.3.1:install (default-install) @ org.eclipse.ease.lang.scriptarchive.test ---
23:59:39 [2021-05-29T03:59:39.791Z] [INFO] Installing /home/jenkins/agent/workspace/ease.verify.core.target.2018-12/tests/org.eclipse.ease.lang.scriptarchive.test/target/org.eclipse.ease.lang.scriptarchive.test-0.8.0-SNAPSHOT.jar to /home/jenkins/.m2/repository/org/eclipse/ease/org.eclipse.ease.lang.scriptarchive.test/0.8.0-SNAPSHOT/org.eclipse.ease.lang.scriptarchive.test-0.8.0-SNAPSHOT.jar
23:59:39 [2021-05-29T03:59:39.791Z] [INFO] Installing /home/jenkins/agent/workspace/ease.verify.core.target.2018-12/tests/org.eclipse.ease.lang.scriptarchive.test/pom.xml to /home/jenkins/.m2/repository/org/eclipse/ease/org.eclipse.ease.lang.scriptarchive.test/0.8.0-SNAPSHOT/org.eclipse.ease.lang.scriptarchive.test-0.8.0-SNAPSHOT.pom
23:59:39 [2021-05-29T03:59:39.792Z] [INFO] Installing /home/jenkins/agent/workspace/ease.verify.core.target.2018-12/tests/org.eclipse.ease.lang.scriptarchive.test/target/p2content.xml to /home/jenkins/.m2/repository/org/eclipse/ease/org.eclipse.ease.lang.scriptarchive.test/0.8.0-SNAPSHOT/org.eclipse.ease.lang.scriptarchive.test-0.8.0-SNAPSHOT-p2metadata.xml
23:59:40 [2021-05-29T03:59:40.387Z] [INFO] Installing /home/jenkins/agent/workspace/ease.verify.core.target.2018-12/tests/org.eclipse.ease.lang.scriptarchive.test/target/p2artifacts.xml to /home/jenkins/.m2/repository/org/eclipse/ease/org.eclipse.ease.lang.scriptarchive.test/0.8.0-SNAPSHOT/org.eclipse.ease.lang.scriptarchive.test-0.8.0-SNAPSHOT-p2artifacts.xml
23:59:40 [2021-05-29T03:59:40.387Z] [INFO] 
23:59:40 [2021-05-29T03:59:40.387Z] [INFO] --- tycho-p2-plugin:2.2.0:update-local-index (default-update-local-index) @ org.eclipse.ease.lang.scriptarchive.test ---
23:59:40 [2021-05-29T03:59:40.387Z] [INFO] 
23:59:40 [2021-05-29T03:59:40.387Z] [INFO] --------< org.eclipse.ease:org.eclipse.ease.lang.unittest.test >--------
23:59:40 [2021-05-29T03:59:40.387Z] [INFO] Building org.eclipse.ease.lang.unittest.test 0.8.0-SNAPSHOT      [44/48]
23:59:40 [2021-05-29T03:59:40.387Z] [INFO] ------------------------[ eclipse-test-plugin ]-------------------------
23:59:40 [2021-05-29T03:59:40.387Z] [INFO] 
23:59:40 [2021-05-29T03:59:40.387Z] [INFO] --- maven-clean-plugin:2.5:clean (default-clean) @ org.eclipse.ease.lang.unittest.test ---
23:59:40 [2021-05-29T03:59:40.387Z] [INFO] 
23:59:40 [2021-05-29T03:59:40.387Z] [INFO] --- tycho-packaging-plugin:2.2.0:build-qualifier (default-build-qualifier) @ org.eclipse.ease.lang.unittest.test ---
23:59:40 [2021-05-29T03:59:40.387Z] [INFO] The project's OSGi version is 0.8.0.I202104091518
23:59:40 [2021-05-29T03:59:40.387Z] [INFO] 
23:59:40 [2021-05-29T03:59:40.387Z] [INFO] --- tycho-packaging-plugin:2.2.0:validate-id (default-validate-id) @ org.eclipse.ease.lang.unittest.test ---
23:59:40 [2021-05-29T03:59:40.387Z] [INFO] 
23:59:40 [2021-05-29T03:59:40.387Z] [INFO] --- tycho-packaging-plugin:2.2.0:validate-version (default-validate-version) @ org.eclipse.ease.lang.unittest.test ---
23:59:40 [2021-05-29T03:59:40.387Z] [INFO] 
23:59:40 [2021-05-29T03:59:40.387Z] [INFO] --- maven-resources-plugin:2.4.3:resources (default-resources) @ org.eclipse.ease.lang.unittest.test ---
23:59:40 [2021-05-29T03:59:40.387Z] [INFO] Using 'UTF-8' encoding to copy filtered resources.
23:59:40 [2021-05-29T03:59:40.387Z] [INFO] skip non existing resourceDirectory /home/jenkins/agent/workspace/ease.verify.core.target.2018-12/tests/org.eclipse.ease.lang.unittest.test/src/main/resources
23:59:40 [2021-05-29T03:59:40.387Z] [INFO] 
23:59:40 [2021-05-29T03:59:40.388Z] [INFO] --- tycho-compiler-plugin:2.2.0:compile (default-compile) @ org.eclipse.ease.lang.unittest.test ---
23:59:40 [2021-05-29T03:59:40.388Z] [INFO] Compiling 3 source files to /home/jenkins/agent/workspace/ease.verify.core.target.2018-12/tests/org.eclipse.ease.lang.unittest.test/target/classes
23:59:40 [2021-05-29T03:59:40.645Z] [INFO] 
23:59:40 [2021-05-29T03:59:40.645Z] [INFO] --- maven-resources-plugin:2.4.3:testResources (default-testResources) @ org.eclipse.ease.lang.unittest.test ---
23:59:40 [2021-05-29T03:59:40.645Z] [INFO] Using 'UTF-8' encoding to copy filtered resources.
23:59:40 [2021-05-29T03:59:40.645Z] [INFO] skip non existing resourceDirectory /home/jenkins/agent/workspace/ease.verify.core.target.2018-12/tests/org.eclipse.ease.lang.unittest.test/src/test/resources
23:59:40 [2021-05-29T03:59:40.645Z] [INFO] 
23:59:40 [2021-05-29T03:59:40.645Z] [INFO] --- target-platform-configuration:2.2.0:target-platform (default-target-platform) @ org.eclipse.ease.lang.unittest.test ---
23:59:40 [2021-05-29T03:59:40.645Z] [INFO] 
23:59:40 [2021-05-29T03:59:40.645Z] [INFO] --- tycho-packaging-plugin:2.2.0:package-plugin (default-package-plugin) @ org.eclipse.ease.lang.unittest.test ---
23:59:40 [2021-05-29T03:59:40.645Z] [INFO] Building jar: /home/jenkins/agent/workspace/ease.verify.core.target.2018-12/tests/org.eclipse.ease.lang.unittest.test/target/org.eclipse.ease.lang.unittest.test-0.8.0-SNAPSHOT.jar
23:59:40 [2021-05-29T03:59:40.645Z] [INFO] 
23:59:40 [2021-05-29T03:59:40.645Z] [INFO] --- tycho-p2-plugin:2.2.0:p2-metadata-default (default-p2-metadata-default) @ org.eclipse.ease.lang.unittest.test ---
23:59:40 [2021-05-29T03:59:40.645Z] [INFO] 
23:59:40 [2021-05-29T03:59:40.645Z] [INFO] --- tycho-surefire-plugin:2.2.0:test (default-test) @ org.eclipse.ease.lang.unittest.test ---
23:59:41 [2021-05-29T03:59:41.212Z] [INFO] Executing Test Runtime with timeout 0, logs (if any) will be placed at: /home/jenkins/agent/workspace/ease.verify.core.target.2018-12/tests/org.eclipse.ease.lang.unittest.test/target/work/data/.metadata/.log
23:59:41 [2021-05-29T03:59:41.212Z] [INFO] Command line:
23:59:41 [2021-05-29T03:59:41.212Z] 	[/opt/tools/java/openjdk/jdk-15/15.0.2+7/bin/java, -Dosgi.noShutdown=false, -Dosgi.os=linux, -Dosgi.ws=gtk, -Dosgi.arch=x86_64, -Dosgi.clean=true, -jar, /home/jenkins/.m2/repository/p2/osgi/bundle/org.eclipse.equinox.launcher/1.6.0.v20200915-1508/org.eclipse.equinox.launcher-1.6.0.v20200915-1508.jar, -data, /home/jenkins/agent/workspace/ease.verify.core.target.2018-12/tests/org.eclipse.ease.lang.unittest.test/target/work/data, -install, /home/jenkins/agent/workspace/ease.verify.core.target.2018-12/tests/org.eclipse.ease.lang.unittest.test/target/work, -configuration, /home/jenkins/agent/workspace/ease.verify.core.target.2018-12/tests/org.eclipse.ease.lang.unittest.test/target/work/configuration, -application, org.eclipse.tycho.surefire.osgibooter.headlesstest, -testproperties, /home/jenkins/agent/workspace/ease.verify.core.target.2018-12/tests/org.eclipse.ease.lang.unittest.test/target/surefire.properties]
23:59:41 [2021-05-29T03:59:41.212Z] Picked up JAVA_TOOL_OPTIONS: -Dmaven.ext.class.path="/home/jenkins/agent/workspace/ease.verify.core.target.2018-12@tmp/withMaven984a5d0d/pipeline-maven-spy.jar" -Dorg.jenkinsci.plugins.pipeline.maven.reportsFolder="/home/jenkins/agent/workspace/ease.verify.core.target.2018-12@tmp/withMaven984a5d0d" 
23:59:43 [2021-05-29T03:59:43.153Z] May 29, 2021 3:59:43 AM org.junit.platform.launcher.core.DefaultLauncher handleThrowable
23:59:43 [2021-05-29T03:59:43.153Z] WARNING: TestEngine with ID 'junit-vintage' failed to discover tests
23:59:43 [2021-05-29T03:59:43.153Z] java.lang.NoClassDefFoundError: org/junit/runners/model/RunnerBuilder
23:59:43 [2021-05-29T03:59:43.153Z] 	at org.junit.vintage.engine.discovery.VintageDiscoverer.<init>(VintageDiscoverer.java:48)
23:59:43 [2021-05-29T03:59:43.153Z] 	at org.junit.vintage.engine.VintageTestEngine.discover(VintageTestEngine.java:65)
23:59:43 [2021-05-29T03:59:43.153Z] 	at org.junit.platform.launcher.core.DefaultLauncher.discoverEngineRoot(DefaultLauncher.java:130)
23:59:43 [2021-05-29T03:59:43.153Z] 	at org.junit.platform.launcher.core.DefaultLauncher.discoverRoot(DefaultLauncher.java:117)
23:59:43 [2021-05-29T03:59:43.153Z] 	at org.junit.platform.launcher.core.DefaultLauncher.discover(DefaultLauncher.java:82)
23:59:43 [2021-05-29T03:59:43.153Z] 	at org.apache.maven.surefire.junitplatform.TestPlanScannerFilter.accept(TestPlanScannerFilter.java:56)
23:59:43 [2021-05-29T03:59:43.153Z] 	at org.apache.maven.surefire.util.DefaultScanResult.applyFilter(DefaultScanResult.java:102)
23:59:43 [2021-05-29T03:59:43.153Z] 	at org.apache.maven.surefire.junitplatform.JUnitPlatformProvider.scanClasspath(JUnitPlatformProvider.java:143)
23:59:43 [2021-05-29T03:59:43.153Z] 	at org.apache.maven.surefire.junitplatform.JUnitPlatformProvider.invoke(JUnitPlatformProvider.java:124)
23:59:43 [2021-05-29T03:59:43.153Z] 	at java.base/jdk.internal.reflect.NativeMethodAccessorImpl.invoke0(Native Method)
23:59:43 [2021-05-29T03:59:43.153Z] 	at java.base/jdk.internal.reflect.NativeMethodAccessorImpl.invoke(NativeMethodAccessorImpl.java:64)
23:59:43 [2021-05-29T03:59:43.153Z] 	at java.base/jdk.internal.reflect.DelegatingMethodAccessorImpl.invoke(DelegatingMethodAccessorImpl.java:43)
23:59:43 [2021-05-29T03:59:43.153Z] 	at java.base/java.lang.reflect.Method.invoke(Method.java:564)
23:59:43 [2021-05-29T03:59:43.153Z] 	at org.apache.maven.surefire.util.ReflectionUtils.invokeMethodWithArray2(ReflectionUtils.java:206)
23:59:43 [2021-05-29T03:59:43.154Z] 	at org.apache.maven.surefire.booter.ProviderFactory$ProviderProxy.invoke(ProviderFactory.java:161)
23:59:43 [2021-05-29T03:59:43.154Z] 	at org.apache.maven.surefire.booter.ProviderFactory.invokeProvider(ProviderFactory.java:84)
23:59:43 [2021-05-29T03:59:43.154Z] 	at org.eclipse.tycho.surefire.osgibooter.OsgiSurefireBooter.run(OsgiSurefireBooter.java:116)
23:59:43 [2021-05-29T03:59:43.154Z] 	at org.eclipse.tycho.surefire.osgibooter.HeadlessTestApplication.start(HeadlessTestApplication.java:23)
23:59:43 [2021-05-29T03:59:43.154Z] 	at org.eclipse.equinox.internal.app.EclipseAppHandle.run(EclipseAppHandle.java:203)
23:59:43 [2021-05-29T03:59:43.154Z] 	at org.eclipse.core.runtime.internal.adaptor.EclipseAppLauncher.runApplication(EclipseAppLauncher.java:134)
23:59:43 [2021-05-29T03:59:43.154Z] 	at org.eclipse.core.runtime.internal.adaptor.EclipseAppLauncher.start(EclipseAppLauncher.java:104)
23:59:43 [2021-05-29T03:59:43.154Z] 	at org.eclipse.core.runtime.adaptor.EclipseStarter.run(EclipseStarter.java:401)
23:59:43 [2021-05-29T03:59:43.154Z] 	at org.eclipse.core.runtime.adaptor.EclipseStarter.run(EclipseStarter.java:255)
23:59:43 [2021-05-29T03:59:43.154Z] 	at java.base/jdk.internal.reflect.NativeMethodAccessorImpl.invoke0(Native Method)
23:59:43 [2021-05-29T03:59:43.154Z] 	at java.base/jdk.internal.reflect.NativeMethodAccessorImpl.invoke(NativeMethodAccessorImpl.java:64)
23:59:43 [2021-05-29T03:59:43.154Z] 	at java.base/jdk.internal.reflect.DelegatingMethodAccessorImpl.invoke(DelegatingMethodAccessorImpl.java:43)
23:59:43 [2021-05-29T03:59:43.154Z] 	at java.base/java.lang.reflect.Method.invoke(Method.java:564)
23:59:43 [2021-05-29T03:59:43.154Z] 	at org.eclipse.equinox.launcher.Main.invokeFramework(Main.java:653)
23:59:43 [2021-05-29T03:59:43.154Z] 	at org.eclipse.equinox.launcher.Main.basicRun(Main.java:590)
23:59:43 [2021-05-29T03:59:43.154Z] 	at org.eclipse.equinox.launcher.Main.run(Main.java:1461)
23:59:43 [2021-05-29T03:59:43.154Z] 	at org.eclipse.equinox.launcher.Main.main(Main.java:1434)
23:59:43 [2021-05-29T03:59:43.154Z] Caused by: java.lang.ClassNotFoundException: org.junit.runners.model.RunnerBuilder cannot be found by org.eclipse.tycho.surefire.osgibooter_2.2.0
23:59:43 [2021-05-29T03:59:43.154Z] 	at org.eclipse.osgi.internal.loader.BundleLoader.findClass(BundleLoader.java:516)
23:59:43 [2021-05-29T03:59:43.154Z] 	at org.eclipse.osgi.internal.loader.ModuleClassLoader.loadClass(ModuleClassLoader.java:171)
23:59:43 [2021-05-29T03:59:43.154Z] 	at java.base/java.lang.ClassLoader.loadClass(ClassLoader.java:522)
23:59:43 [2021-05-29T03:59:43.154Z] 	... 31 more
23:59:43 [2021-05-29T03:59:43.154Z] 
23:59:43 [2021-05-29T03:59:43.154Z] May 29, 2021 3:59:43 AM org.junit.platform.launcher.core.DefaultLauncher handleThrowable
23:59:43 [2021-05-29T03:59:43.154Z] WARNING: TestEngine with ID 'junit-vintage' failed to discover tests
23:59:43 [2021-05-29T03:59:43.154Z] java.lang.NoClassDefFoundError: org/junit/runners/model/RunnerBuilder
23:59:43 [2021-05-29T03:59:43.154Z] 	at org.junit.vintage.engine.discovery.VintageDiscoverer.<init>(VintageDiscoverer.java:48)
23:59:43 [2021-05-29T03:59:43.154Z] 	at org.junit.vintage.engine.VintageTestEngine.discover(VintageTestEngine.java:65)
23:59:43 [2021-05-29T03:59:43.154Z] 	at org.junit.platform.launcher.core.DefaultLauncher.discoverEngineRoot(DefaultLauncher.java:130)
23:59:43 [2021-05-29T03:59:43.154Z] 	at org.junit.platform.launcher.core.DefaultLauncher.discoverRoot(DefaultLauncher.java:117)
23:59:43 [2021-05-29T03:59:43.154Z] 	at org.junit.platform.launcher.core.DefaultLauncher.discover(DefaultLauncher.java:82)
23:59:43 [2021-05-29T03:59:43.154Z] 	at org.apache.maven.surefire.junitplatform.TestPlanScannerFilter.accept(TestPlanScannerFilter.java:56)
23:59:43 [2021-05-29T03:59:43.154Z] 	at org.apache.maven.surefire.util.DefaultScanResult.applyFilter(DefaultScanResult.java:102)
23:59:43 [2021-05-29T03:59:43.154Z] 	at org.apache.maven.surefire.junitplatform.JUnitPlatformProvider.scanClasspath(JUnitPlatformProvider.java:143)
23:59:43 [2021-05-29T03:59:43.154Z] 	at org.apache.maven.surefire.junitplatform.JUnitPlatformProvider.invoke(JUnitPlatformProvider.java:124)
23:59:43 [2021-05-29T03:59:43.154Z] 	at java.base/jdk.internal.reflect.NativeMethodAccessorImpl.invoke0(Native Method)
23:59:43 [2021-05-29T03:59:43.154Z] 	at java.base/jdk.internal.reflect.NativeMethodAccessorImpl.invoke(NativeMethodAccessorImpl.java:64)
23:59:43 [2021-05-29T03:59:43.154Z] 	at java.base/jdk.internal.reflect.DelegatingMethodAccessorImpl.invoke(DelegatingMethodAccessorImpl.java:43)
23:59:43 [2021-05-29T03:59:43.154Z] 	at java.base/java.lang.reflect.Method.invoke(Method.java:564)
23:59:43 [2021-05-29T03:59:43.154Z] 	at org.apache.maven.surefire.util.ReflectionUtils.invokeMethodWithArray2(ReflectionUtils.java:206)
23:59:43 [2021-05-29T03:59:43.154Z] 	at org.apache.maven.surefire.booter.ProviderFactory$ProviderProxy.invoke(ProviderFactory.java:161)
23:59:43 [2021-05-29T03:59:43.154Z] 	at org.apache.maven.surefire.booter.ProviderFactory.invokeProvider(ProviderFactory.java:84)
23:59:43 [2021-05-29T03:59:43.154Z] 	at org.eclipse.tycho.surefire.osgibooter.OsgiSurefireBooter.run(OsgiSurefireBooter.java:116)
23:59:43 [2021-05-29T03:59:43.154Z] 	at org.eclipse.tycho.surefire.osgibooter.HeadlessTestApplication.start(HeadlessTestApplication.java:23)
23:59:43 [2021-05-29T03:59:43.154Z] 	at org.eclipse.equinox.internal.app.EclipseAppHandle.run(EclipseAppHandle.java:203)
23:59:43 [2021-05-29T03:59:43.154Z] 	at org.eclipse.core.runtime.internal.adaptor.EclipseAppLauncher.runApplication(EclipseAppLauncher.java:134)
23:59:43 [2021-05-29T03:59:43.154Z] 	at org.eclipse.core.runtime.internal.adaptor.EclipseAppLauncher.start(EclipseAppLauncher.java:104)
23:59:43 [2021-05-29T03:59:43.154Z] 	at org.eclipse.core.runtime.adaptor.EclipseStarter.run(EclipseStarter.java:401)
23:59:43 [2021-05-29T03:59:43.154Z] 	at org.eclipse.core.runtime.adaptor.EclipseStarter.run(EclipseStarter.java:255)
23:59:43 [2021-05-29T03:59:43.154Z] 	at java.base/jdk.internal.reflect.NativeMethodAccessorImpl.invoke0(Native Method)
23:59:43 [2021-05-29T03:59:43.154Z] 	at java.base/jdk.internal.reflect.NativeMethodAccessorImpl.invoke(NativeMethodAccessorImpl.java:64)
23:59:43 [2021-05-29T03:59:43.154Z] 	at java.base/jdk.internal.reflect.DelegatingMethodAccessorImpl.invoke(DelegatingMethodAccessorImpl.java:43)
23:59:43 [2021-05-29T03:59:43.154Z] 	at java.base/java.lang.reflect.Method.invoke(Method.java:564)
23:59:43 [2021-05-29T03:59:43.154Z] 	at org.eclipse.equinox.launcher.Main.invokeFramework(Main.java:653)
23:59:43 [2021-05-29T03:59:43.154Z] 	at org.eclipse.equinox.launcher.Main.basicRun(Main.java:590)
23:59:43 [2021-05-29T03:59:43.154Z] 	at org.eclipse.equinox.launcher.Main.run(Main.java:1461)
23:59:43 [2021-05-29T03:59:43.154Z] 	at org.eclipse.equinox.launcher.Main.main(Main.java:1434)
23:59:43 [2021-05-29T03:59:43.154Z] Caused by: java.lang.ClassNotFoundException: org.junit.runners.model.RunnerBuilder cannot be found by org.eclipse.tycho.surefire.osgibooter_2.2.0
23:59:43 [2021-05-29T03:59:43.155Z] 	at org.eclipse.osgi.internal.loader.BundleLoader.findClass(BundleLoader.java:516)
23:59:43 [2021-05-29T03:59:43.155Z] 	at org.eclipse.osgi.internal.loader.ModuleClassLoader.loadClass(ModuleClassLoader.java:171)
23:59:43 [2021-05-29T03:59:43.155Z] 	at java.base/java.lang.ClassLoader.loadClass(ClassLoader.java:522)
23:59:43 [2021-05-29T03:59:43.155Z] 	... 31 more
23:59:43 [2021-05-29T03:59:43.155Z] 
23:59:43 [2021-05-29T03:59:43.155Z] May 29, 2021 3:59:43 AM org.junit.platform.launcher.core.DefaultLauncher handleThrowable
23:59:43 [2021-05-29T03:59:43.155Z] WARNING: TestEngine with ID 'junit-vintage' failed to discover tests
23:59:43 [2021-05-29T03:59:43.155Z] java.lang.NoClassDefFoundError: org/junit/runners/model/RunnerBuilder
23:59:43 [2021-05-29T03:59:43.155Z] 	at org.junit.vintage.engine.discovery.VintageDiscoverer.<init>(VintageDiscoverer.java:48)
23:59:43 [2021-05-29T03:59:43.155Z] 	at org.junit.vintage.engine.VintageTestEngine.discover(VintageTestEngine.java:65)
23:59:43 [2021-05-29T03:59:43.155Z] 	at org.junit.platform.launcher.core.DefaultLauncher.discoverEngineRoot(DefaultLauncher.java:130)
23:59:43 [2021-05-29T03:59:43.155Z] 	at org.junit.platform.launcher.core.DefaultLauncher.discoverRoot(DefaultLauncher.java:117)
23:59:43 [2021-05-29T03:59:43.155Z] 	at org.junit.platform.launcher.core.DefaultLauncher.discover(DefaultLauncher.java:82)
23:59:43 [2021-05-29T03:59:43.155Z] 	at org.apache.maven.surefire.junitplatform.TestPlanScannerFilter.accept(TestPlanScannerFilter.java:56)
23:59:43 [2021-05-29T03:59:43.155Z] 	at org.apache.maven.surefire.util.DefaultScanResult.applyFilter(DefaultScanResult.java:102)
23:59:43 [2021-05-29T03:59:43.155Z] 	at org.apache.maven.surefire.junitplatform.JUnitPlatformProvider.scanClasspath(JUnitPlatformProvider.java:143)
23:59:43 [2021-05-29T03:59:43.155Z] 	at org.apache.maven.surefire.junitplatform.JUnitPlatformProvider.invoke(JUnitPlatformProvider.java:124)
23:59:43 [2021-05-29T03:59:43.155Z] 	at java.base/jdk.internal.reflect.NativeMethodAccessorImpl.invoke0(Native Method)
23:59:43 [2021-05-29T03:59:43.155Z] 	at java.base/jdk.internal.reflect.NativeMethodAccessorImpl.invoke(NativeMethodAccessorImpl.java:64)
23:59:43 [2021-05-29T03:59:43.155Z] 	at java.base/jdk.internal.reflect.DelegatingMethodAccessorImpl.invoke(DelegatingMethodAccessorImpl.java:43)
23:59:43 [2021-05-29T03:59:43.155Z] 	at java.base/java.lang.reflect.Method.invoke(Method.java:564)
23:59:43 [2021-05-29T03:59:43.155Z] 	at org.apache.maven.surefire.util.ReflectionUtils.invokeMethodWithArray2(ReflectionUtils.java:206)
23:59:43 [2021-05-29T03:59:43.155Z] 	at org.apache.maven.surefire.booter.ProviderFactory$ProviderProxy.invoke(ProviderFactory.java:161)
23:59:43 [2021-05-29T03:59:43.155Z] 	at org.apache.maven.surefire.booter.ProviderFactory.invokeProvider(ProviderFactory.java:84)
23:59:43 [2021-05-29T03:59:43.155Z] 	at org.eclipse.tycho.surefire.osgibooter.OsgiSurefireBooter.run(OsgiSurefireBooter.java:116)
23:59:43 [2021-05-29T03:59:43.155Z] 	at org.eclipse.tycho.surefire.osgibooter.HeadlessTestApplication.start(HeadlessTestApplication.java:23)
23:59:43 [2021-05-29T03:59:43.155Z] 	at org.eclipse.equinox.internal.app.EclipseAppHandle.run(EclipseAppHandle.java:203)
23:59:43 [2021-05-29T03:59:43.155Z] 	at org.eclipse.core.runtime.internal.adaptor.EclipseAppLauncher.runApplication(EclipseAppLauncher.java:134)
23:59:43 [2021-05-29T03:59:43.155Z] 	at org.eclipse.core.runtime.internal.adaptor.EclipseAppLauncher.start(EclipseAppLauncher.java:104)
23:59:43 [2021-05-29T03:59:43.155Z] 	at org.eclipse.core.runtime.adaptor.EclipseStarter.run(EclipseStarter.java:401)
23:59:43 [2021-05-29T03:59:43.155Z] 	at org.eclipse.core.runtime.adaptor.EclipseStarter.run(EclipseStarter.java:255)
23:59:43 [2021-05-29T03:59:43.155Z] 	at java.base/jdk.internal.reflect.NativeMethodAccessorImpl.invoke0(Native Method)
23:59:43 [2021-05-29T03:59:43.155Z] 	at java.base/jdk.internal.reflect.NativeMethodAccessorImpl.invoke(NativeMethodAccessorImpl.java:64)
23:59:43 [2021-05-29T03:59:43.155Z] 	at java.base/jdk.internal.reflect.DelegatingMethodAccessorImpl.invoke(DelegatingMethodAccessorImpl.java:43)
23:59:43 [2021-05-29T03:59:43.155Z] 	at java.base/java.lang.reflect.Method.invoke(Method.java:564)
23:59:43 [2021-05-29T03:59:43.155Z] 	at org.eclipse.equinox.launcher.Main.invokeFramework(Main.java:653)
23:59:43 [2021-05-29T03:59:43.155Z] 	at org.eclipse.equinox.launcher.Main.basicRun(Main.java:590)
23:59:43 [2021-05-29T03:59:43.155Z] 	at org.eclipse.equinox.launcher.Main.run(Main.java:1461)
23:59:43 [2021-05-29T03:59:43.155Z] 	at org.eclipse.equinox.launcher.Main.main(Main.java:1434)
23:59:43 [2021-05-29T03:59:43.155Z] Caused by: java.lang.ClassNotFoundException: org.junit.runners.model.RunnerBuilder cannot be found by org.eclipse.tycho.surefire.osgibooter_2.2.0
23:59:43 [2021-05-29T03:59:43.155Z] 	at org.eclipse.osgi.internal.loader.BundleLoader.findClass(BundleLoader.java:516)
23:59:43 [2021-05-29T03:59:43.155Z] 	at org.eclipse.osgi.internal.loader.ModuleClassLoader.loadClass(ModuleClassLoader.java:171)
23:59:43 [2021-05-29T03:59:43.155Z] 	at java.base/java.lang.ClassLoader.loadClass(ClassLoader.java:522)
23:59:43 [2021-05-29T03:59:43.155Z] 	... 31 more
23:59:43 [2021-05-29T03:59:43.155Z] 
23:59:43 [2021-05-29T03:59:43.155Z] May 29, 2021 3:59:43 AM org.junit.platform.launcher.core.DefaultLauncher handleThrowable
23:59:43 [2021-05-29T03:59:43.155Z] WARNING: TestEngine with ID 'junit-vintage' failed to discover tests
23:59:43 [2021-05-29T03:59:43.155Z] java.lang.NoClassDefFoundError: org/junit/runners/model/RunnerBuilder
23:59:43 [2021-05-29T03:59:43.155Z] 	at org.junit.vintage.engine.discovery.VintageDiscoverer.<init>(VintageDiscoverer.java:48)
23:59:43 [2021-05-29T03:59:43.155Z] 	at org.junit.vintage.engine.VintageTestEngine.discover(VintageTestEngine.java:65)
23:59:43 [2021-05-29T03:59:43.155Z] 	at org.junit.platform.launcher.core.DefaultLauncher.discoverEngineRoot(DefaultLauncher.java:130)
23:59:43 [2021-05-29T03:59:43.155Z] 	at org.junit.platform.launcher.core.DefaultLauncher.discoverRoot(DefaultLauncher.java:117)
23:59:43 [2021-05-29T03:59:43.155Z] 	at org.junit.platform.launcher.core.DefaultLauncher.execute(DefaultLauncher.java:90)
23:59:43 [2021-05-29T03:59:43.155Z] 	at org.apache.maven.surefire.junitplatform.JUnitPlatformProvider.invokeAllTests(JUnitPlatformProvider.java:150)
23:59:43 [2021-05-29T03:59:43.155Z] 	at org.apache.maven.surefire.junitplatform.JUnitPlatformProvider.invoke(JUnitPlatformProvider.java:124)
23:59:43 [2021-05-29T03:59:43.155Z] 	at java.base/jdk.internal.reflect.NativeMethodAccessorImpl.invoke0(Native Method)
23:59:43 [2021-05-29T03:59:43.155Z] 	at java.base/jdk.internal.reflect.NativeMethodAccessorImpl.invoke(NativeMethodAccessorImpl.java:64)
23:59:43 [2021-05-29T03:59:43.155Z] 	at java.base/jdk.internal.reflect.DelegatingMethodAccessorImpl.invoke(DelegatingMethodAccessorImpl.java:43)
23:59:43 [2021-05-29T03:59:43.155Z] 	at java.base/java.lang.reflect.Method.invoke(Method.java:564)
23:59:43 [2021-05-29T03:59:43.156Z] 	at org.apache.maven.surefire.util.ReflectionUtils.invokeMethodWithArray2(ReflectionUtils.java:206)
23:59:43 [2021-05-29T03:59:43.156Z] 	at org.apache.maven.surefire.booter.ProviderFactory$ProviderProxy.invoke(ProviderFactory.java:161)
23:59:43 [2021-05-29T03:59:43.156Z] 	at org.apache.maven.surefire.booter.ProviderFactory.invokeProvider(ProviderFactory.java:84)
23:59:43 [2021-05-29T03:59:43.156Z] 	at org.eclipse.tycho.surefire.osgibooter.OsgiSurefireBooter.run(OsgiSurefireBooter.java:116)
23:59:43 [2021-05-29T03:59:43.156Z] 	at org.eclipse.tycho.surefire.osgibooter.HeadlessTestApplication.start(HeadlessTestApplication.java:23)
23:59:43 [2021-05-29T03:59:43.156Z] 	at org.eclipse.equinox.internal.app.EclipseAppHandle.run(EclipseAppHandle.java:203)
23:59:43 [2021-05-29T03:59:43.156Z] 	at org.eclipse.core.runtime.internal.adaptor.EclipseAppLauncher.runApplication(EclipseAppLauncher.java:134)
23:59:43 [2021-05-29T03:59:43.156Z] 	at org.eclipse.core.runtime.internal.adaptor.EclipseAppLauncher.start(EclipseAppLauncher.java:104)
23:59:43 [2021-05-29T03:59:43.156Z] 	at org.eclipse.core.runtime.adaptor.EclipseStarter.run(EclipseStarter.java:401)
23:59:43 [2021-05-29T03:59:43.156Z] 	at org.eclipse.core.runtime.adaptor.EclipseStarter.run(EclipseStarter.java:255)
23:59:43 [2021-05-29T03:59:43.156Z] 	at java.base/jdk.internal.reflect.NativeMethodAccessorImpl.invoke0(Native Method)
23:59:43 [2021-05-29T03:59:43.156Z] 	at java.base/jdk.internal.reflect.NativeMethodAccessorImpl.invoke(NativeMethodAccessorImpl.java:64)
23:59:43 [2021-05-29T03:59:43.156Z] 	at java.base/jdk.internal.reflect.DelegatingMethodAccessorImpl.invoke(DelegatingMethodAccessorImpl.java:43)
23:59:43 [2021-05-29T03:59:43.156Z] 	at java.base/java.lang.reflect.Method.invoke(Method.java:564)
23:59:43 [2021-05-29T03:59:43.156Z] 	at org.eclipse.equinox.launcher.Main.invokeFramework(Main.java:653)
23:59:43 [2021-05-29T03:59:43.156Z] 	at org.eclipse.equinox.launcher.Main.basicRun(Main.java:590)
23:59:43 [2021-05-29T03:59:43.156Z] 	at org.eclipse.equinox.launcher.Main.run(Main.java:1461)
23:59:43 [2021-05-29T03:59:43.156Z] 	at org.eclipse.equinox.launcher.Main.main(Main.java:1434)
23:59:43 [2021-05-29T03:59:43.156Z] Caused by: java.lang.ClassNotFoundException: org.junit.runners.model.RunnerBuilder cannot be found by org.eclipse.tycho.surefire.osgibooter_2.2.0
23:59:43 [2021-05-29T03:59:43.156Z] 	at org.eclipse.osgi.internal.loader.BundleLoader.findClass(BundleLoader.java:516)
23:59:43 [2021-05-29T03:59:43.156Z] 	at org.eclipse.osgi.internal.loader.ModuleClassLoader.loadClass(ModuleClassLoader.java:171)
23:59:43 [2021-05-29T03:59:43.156Z] 	at java.base/java.lang.ClassLoader.loadClass(ClassLoader.java:522)
23:59:43 [2021-05-29T03:59:43.156Z] 	... 29 more
23:59:43 [2021-05-29T03:59:43.156Z] 
23:59:43 [2021-05-29T03:59:43.156Z] Running org.eclipse.ease.lang.unittest.ModernJavaScriptTest
23:59:45 [2021-05-29T03:59:45.683Z] Tests run: 8, Failures: 0, Errors: 0, Skipped: 0, Time elapsed: 2.187 s - in org.eclipse.ease.lang.unittest.ModernJavaScriptTest
23:59:45 [2021-05-29T03:59:45.683Z] folderStatus  Time elapsed: 0.789 s
23:59:45 [2021-05-29T03:59:45.683Z] verifyOutput  Time elapsed: 0.229 s
23:59:45 [2021-05-29T03:59:45.683Z] suiteStatus  Time elapsed: 0.423 s
23:59:45 [2021-05-29T03:59:45.683Z] ignoreTestStatus  Time elapsed: 0.168 s
23:59:45 [2021-05-29T03:59:45.683Z] ignoreTestClassStatus  Time elapsed: 0.12 s
23:59:45 [2021-05-29T03:59:45.683Z] failureTestClassStatus  Time elapsed: 0.114 s
23:59:45 [2021-05-29T03:59:45.683Z] errorTestClassStatus  Time elapsed: 0.113 s
23:59:45 [2021-05-29T03:59:45.683Z] passTestClassStatus  Time elapsed: 0.138 s
23:59:45 [2021-05-29T03:59:45.683Z] Running org.eclipse.ease.lang.unittest.ClassicJavaScriptTest
23:59:45 [2021-05-29T03:59:45.944Z] Tests run: 7, Failures: 0, Errors: 0, Skipped: 0, Time elapsed: 0.624 s - in org.eclipse.ease.lang.unittest.ClassicJavaScriptTest
23:59:45 [2021-05-29T03:59:45.944Z] folderStatus  Time elapsed: 0.097 s
23:59:45 [2021-05-29T03:59:45.944Z] errorTestStatus  Time elapsed: 0.092 s
23:59:45 [2021-05-29T03:59:45.944Z] failureTestStatus  Time elapsed: 0.092 s
23:59:45 [2021-05-29T03:59:45.944Z] verifyOutput  Time elapsed: 0.066 s
23:59:45 [2021-05-29T03:59:45.944Z] suiteStatus  Time elapsed: 0.104 s
23:59:45 [2021-05-29T03:59:45.944Z] ignoreTestStatus  Time elapsed: 0.087 s
23:59:45 [2021-05-29T03:59:45.944Z] passTestStatus  Time elapsed: 0.083 s
23:59:45 [2021-05-29T03:59:45.944Z] 
23:59:45 [2021-05-29T03:59:45.944Z] Results:
23:59:45 [2021-05-29T03:59:45.944Z] 
23:59:45 [2021-05-29T03:59:45.944Z] Tests run: 15, Failures: 0, Errors: 0, Skipped: 0
23:59:45 [2021-05-29T03:59:45.944Z] 
23:59:47 [2021-05-29T03:59:47.839Z] [INFO] All tests passed!
23:59:47 [2021-05-29T03:59:47.839Z] [INFO] 
23:59:47 [2021-05-29T03:59:47.839Z] [INFO] --- maven-install-plugin:2.3.1:install (default-install) @ org.eclipse.ease.lang.unittest.test ---
23:59:47 [2021-05-29T03:59:47.839Z] [INFO] Installing /home/jenkins/agent/workspace/ease.verify.core.target.2018-12/tests/org.eclipse.ease.lang.unittest.test/target/org.eclipse.ease.lang.unittest.test-0.8.0-SNAPSHOT.jar to /home/jenkins/.m2/repository/org/eclipse/ease/org.eclipse.ease.lang.unittest.test/0.8.0-SNAPSHOT/org.eclipse.ease.lang.unittest.test-0.8.0-SNAPSHOT.jar
23:59:48 [2021-05-29T03:59:48.096Z] [INFO] Installing /home/jenkins/agent/workspace/ease.verify.core.target.2018-12/tests/org.eclipse.ease.lang.unittest.test/pom.xml to /home/jenkins/.m2/repository/org/eclipse/ease/org.eclipse.ease.lang.unittest.test/0.8.0-SNAPSHOT/org.eclipse.ease.lang.unittest.test-0.8.0-SNAPSHOT.pom
23:59:48 [2021-05-29T03:59:48.096Z] [INFO] Installing /home/jenkins/agent/workspace/ease.verify.core.target.2018-12/tests/org.eclipse.ease.lang.unittest.test/target/p2content.xml to /home/jenkins/.m2/repository/org/eclipse/ease/org.eclipse.ease.lang.unittest.test/0.8.0-SNAPSHOT/org.eclipse.ease.lang.unittest.test-0.8.0-SNAPSHOT-p2metadata.xml
23:59:48 [2021-05-29T03:59:48.096Z] [INFO] Installing /home/jenkins/agent/workspace/ease.verify.core.target.2018-12/tests/org.eclipse.ease.lang.unittest.test/target/p2artifacts.xml to /home/jenkins/.m2/repository/org/eclipse/ease/org.eclipse.ease.lang.unittest.test/0.8.0-SNAPSHOT/org.eclipse.ease.lang.unittest.test-0.8.0-SNAPSHOT-p2artifacts.xml
23:59:48 [2021-05-29T03:59:48.096Z] [INFO] 
23:59:48 [2021-05-29T03:59:48.096Z] [INFO] --- tycho-p2-plugin:2.2.0:update-local-index (default-update-local-index) @ org.eclipse.ease.lang.unittest.test ---
23:59:48 [2021-05-29T03:59:48.096Z] [INFO] 
23:59:48 [2021-05-29T03:59:48.096Z] [INFO] ---------< org.eclipse.ease:org.eclipse.ease.ui.scripts.test >----------
23:59:48 [2021-05-29T03:59:48.096Z] [INFO] Building org.eclipse.ease.ui.scripts.test 0.8.0-SNAPSHOT         [45/48]
23:59:48 [2021-05-29T03:59:48.096Z] [INFO] ------------------------[ eclipse-test-plugin ]-------------------------
23:59:48 [2021-05-29T03:59:48.096Z] [INFO] 
23:59:48 [2021-05-29T03:59:48.096Z] [INFO] --- maven-clean-plugin:2.5:clean (default-clean) @ org.eclipse.ease.ui.scripts.test ---
23:59:48 [2021-05-29T03:59:48.096Z] [INFO] 
23:59:48 [2021-05-29T03:59:48.096Z] [INFO] --- tycho-packaging-plugin:2.2.0:build-qualifier (default-build-qualifier) @ org.eclipse.ease.ui.scripts.test ---
23:59:48 [2021-05-29T03:59:48.096Z] [INFO] The project's OSGi version is 0.8.0.I202104091518
23:59:48 [2021-05-29T03:59:48.096Z] [INFO] 
23:59:48 [2021-05-29T03:59:48.096Z] [INFO] --- tycho-packaging-plugin:2.2.0:validate-id (default-validate-id) @ org.eclipse.ease.ui.scripts.test ---
23:59:48 [2021-05-29T03:59:48.096Z] [INFO] 
23:59:48 [2021-05-29T03:59:48.096Z] [INFO] --- tycho-packaging-plugin:2.2.0:validate-version (default-validate-version) @ org.eclipse.ease.ui.scripts.test ---
23:59:48 [2021-05-29T03:59:48.096Z] [INFO] 
23:59:48 [2021-05-29T03:59:48.096Z] [INFO] --- maven-resources-plugin:2.4.3:resources (default-resources) @ org.eclipse.ease.ui.scripts.test ---
23:59:48 [2021-05-29T03:59:48.096Z] [INFO] Using 'UTF-8' encoding to copy filtered resources.
23:59:48 [2021-05-29T03:59:48.096Z] [INFO] skip non existing resourceDirectory /home/jenkins/agent/workspace/ease.verify.core.target.2018-12/tests/org.eclipse.ease.ui.scripts.test/src/main/resources
23:59:48 [2021-05-29T03:59:48.096Z] [INFO] 
23:59:48 [2021-05-29T03:59:48.096Z] [INFO] --- tycho-compiler-plugin:2.2.0:compile (default-compile) @ org.eclipse.ease.ui.scripts.test ---
23:59:48 [2021-05-29T03:59:48.096Z] [INFO] Compiling 1 source file to /home/jenkins/agent/workspace/ease.verify.core.target.2018-12/tests/org.eclipse.ease.ui.scripts.test/target/classes
23:59:48 [2021-05-29T03:59:48.354Z] [INFO] 
23:59:48 [2021-05-29T03:59:48.354Z] [INFO] --- maven-resources-plugin:2.4.3:testResources (default-testResources) @ org.eclipse.ease.ui.scripts.test ---
23:59:48 [2021-05-29T03:59:48.354Z] [INFO] Using 'UTF-8' encoding to copy filtered resources.
23:59:48 [2021-05-29T03:59:48.354Z] [INFO] skip non existing resourceDirectory /home/jenkins/agent/workspace/ease.verify.core.target.2018-12/tests/org.eclipse.ease.ui.scripts.test/src/test/resources
23:59:48 [2021-05-29T03:59:48.354Z] [INFO] 
23:59:48 [2021-05-29T03:59:48.354Z] [INFO] --- target-platform-configuration:2.2.0:target-platform (default-target-platform) @ org.eclipse.ease.ui.scripts.test ---
23:59:48 [2021-05-29T03:59:48.354Z] [INFO] 
23:59:48 [2021-05-29T03:59:48.354Z] [INFO] --- tycho-packaging-plugin:2.2.0:package-plugin (default-package-plugin) @ org.eclipse.ease.ui.scripts.test ---
23:59:48 [2021-05-29T03:59:48.354Z] [INFO] Building jar: /home/jenkins/agent/workspace/ease.verify.core.target.2018-12/tests/org.eclipse.ease.ui.scripts.test/target/org.eclipse.ease.ui.scripts.test-0.8.0-SNAPSHOT.jar
23:59:48 [2021-05-29T03:59:48.354Z] [INFO] 
23:59:48 [2021-05-29T03:59:48.354Z] [INFO] --- tycho-p2-plugin:2.2.0:p2-metadata-default (default-p2-metadata-default) @ org.eclipse.ease.ui.scripts.test ---
23:59:48 [2021-05-29T03:59:48.354Z] [INFO] 
23:59:48 [2021-05-29T03:59:48.354Z] [INFO] --- jacoco-maven-plugin:0.8.6:prepare-agent (jacoco-initialize) @ org.eclipse.ease.ui.scripts.test ---
23:59:48 [2021-05-29T03:59:48.354Z] [INFO] tycho.testArgLine set to -javaagent:/home/jenkins/.m2/repository/org/jacoco/org.jacoco.agent/0.8.6/org.jacoco.agent-0.8.6-runtime.jar=destfile=/home/jenkins/agent/workspace/ease.verify.core.target.2018-12/tests/org.eclipse.ease.ui.scripts.test/target/jacoco.exec,output=file
23:59:48 [2021-05-29T03:59:48.354Z] [INFO] 
23:59:48 [2021-05-29T03:59:48.354Z] [INFO] --- tycho-surefire-plugin:2.2.0:test (default-test) @ org.eclipse.ease.ui.scripts.test ---
23:59:48 [2021-05-29T03:59:48.354Z] [INFO] Executing Test Runtime with timeout 0, logs (if any) will be placed at: /home/jenkins/agent/workspace/ease.verify.core.target.2018-12/tests/org.eclipse.ease.ui.scripts.test/target/work/data/.metadata/.log
23:59:48 [2021-05-29T03:59:48.354Z] [INFO] Command line:
23:59:48 [2021-05-29T03:59:48.354Z] 	[/opt/tools/java/openjdk/jdk-15/15.0.2+7/bin/java, -Dosgi.noShutdown=false, -Dosgi.os=linux, -Dosgi.ws=gtk, -Dosgi.arch=x86_64, -javaagent:/home/jenkins/.m2/repository/org/jacoco/org.jacoco.agent/0.8.6/org.jacoco.agent-0.8.6-runtime.jar=destfile=/home/jenkins/agent/workspace/ease.verify.core.target.2018-12/tests/org.eclipse.ease.ui.scripts.test/target/jacoco.exec,output=file, -Dosgi.clean=true, -jar, /home/jenkins/.m2/repository/p2/osgi/bundle/org.eclipse.equinox.launcher/1.6.0.v20200915-1508/org.eclipse.equinox.launcher-1.6.0.v20200915-1508.jar, -data, /home/jenkins/agent/workspace/ease.verify.core.target.2018-12/tests/org.eclipse.ease.ui.scripts.test/target/work/data, -install, /home/jenkins/agent/workspace/ease.verify.core.target.2018-12/tests/org.eclipse.ease.ui.scripts.test/target/work, -configuration, /home/jenkins/agent/workspace/ease.verify.core.target.2018-12/tests/org.eclipse.ease.ui.scripts.test/target/work/configuration, -application, org.eclipse.tycho.surefire.osgibooter.headlesstest, -testproperties, /home/jenkins/agent/workspace/ease.verify.core.target.2018-12/tests/org.eclipse.ease.ui.scripts.test/target/surefire.properties]
23:59:48 [2021-05-29T03:59:48.355Z] Picked up JAVA_TOOL_OPTIONS: -Dmaven.ext.class.path="/home/jenkins/agent/workspace/ease.verify.core.target.2018-12@tmp/withMaven984a5d0d/pipeline-maven-spy.jar" -Dorg.jenkinsci.plugins.pipeline.maven.reportsFolder="/home/jenkins/agent/workspace/ease.verify.core.target.2018-12@tmp/withMaven984a5d0d" 
23:59:52 [2021-05-29T03:59:52.633Z] May 29, 2021 3:59:52 AM org.junit.platform.launcher.core.DefaultLauncher handleThrowable
23:59:52 [2021-05-29T03:59:52.633Z] WARNING: TestEngine with ID 'junit-vintage' failed to discover tests
23:59:52 [2021-05-29T03:59:52.633Z] java.lang.NoClassDefFoundError: org/junit/runners/model/RunnerBuilder
23:59:52 [2021-05-29T03:59:52.633Z] 	at org.junit.vintage.engine.discovery.VintageDiscoverer.<init>(VintageDiscoverer.java:48)
23:59:52 [2021-05-29T03:59:52.633Z] 	at org.junit.vintage.engine.VintageTestEngine.discover(VintageTestEngine.java:65)
23:59:52 [2021-05-29T03:59:52.633Z] 	at org.junit.platform.launcher.core.DefaultLauncher.discoverEngineRoot(DefaultLauncher.java:130)
23:59:52 [2021-05-29T03:59:52.633Z] 	at org.junit.platform.launcher.core.DefaultLauncher.discoverRoot(DefaultLauncher.java:117)
23:59:52 [2021-05-29T03:59:52.633Z] 	at org.junit.platform.launcher.core.DefaultLauncher.discover(DefaultLauncher.java:82)
23:59:52 [2021-05-29T03:59:52.633Z] 	at org.apache.maven.surefire.junitplatform.TestPlanScannerFilter.accept(TestPlanScannerFilter.java:56)
23:59:52 [2021-05-29T03:59:52.633Z] 	at org.apache.maven.surefire.util.DefaultScanResult.applyFilter(DefaultScanResult.java:102)
23:59:52 [2021-05-29T03:59:52.633Z] 	at org.apache.maven.surefire.junitplatform.JUnitPlatformProvider.scanClasspath(JUnitPlatformProvider.java:143)
23:59:52 [2021-05-29T03:59:52.633Z] 	at org.apache.maven.surefire.junitplatform.JUnitPlatformProvider.invoke(JUnitPlatformProvider.java:124)
23:59:52 [2021-05-29T03:59:52.633Z] 	at java.base/jdk.internal.reflect.NativeMethodAccessorImpl.invoke0(Native Method)
23:59:52 [2021-05-29T03:59:52.633Z] 	at java.base/jdk.internal.reflect.NativeMethodAccessorImpl.invoke(NativeMethodAccessorImpl.java:64)
23:59:52 [2021-05-29T03:59:52.633Z] 	at java.base/jdk.internal.reflect.DelegatingMethodAccessorImpl.invoke(DelegatingMethodAccessorImpl.java:43)
23:59:52 [2021-05-29T03:59:52.633Z] 	at java.base/java.lang.reflect.Method.invoke(Method.java:564)
23:59:52 [2021-05-29T03:59:52.633Z] 	at org.apache.maven.surefire.util.ReflectionUtils.invokeMethodWithArray2(ReflectionUtils.java:206)
23:59:52 [2021-05-29T03:59:52.633Z] 	at org.apache.maven.surefire.booter.ProviderFactory$ProviderProxy.invoke(ProviderFactory.java:161)
23:59:52 [2021-05-29T03:59:52.633Z] 	at org.apache.maven.surefire.booter.ProviderFactory.invokeProvider(ProviderFactory.java:84)
23:59:52 [2021-05-29T03:59:52.633Z] 	at org.eclipse.tycho.surefire.osgibooter.OsgiSurefireBooter.run(OsgiSurefireBooter.java:116)
23:59:52 [2021-05-29T03:59:52.633Z] 	at org.eclipse.tycho.surefire.osgibooter.HeadlessTestApplication.start(HeadlessTestApplication.java:23)
23:59:52 [2021-05-29T03:59:52.633Z] 	at org.eclipse.equinox.internal.app.EclipseAppHandle.run(EclipseAppHandle.java:203)
23:59:52 [2021-05-29T03:59:52.633Z] 	at org.eclipse.core.runtime.internal.adaptor.EclipseAppLauncher.runApplication(EclipseAppLauncher.java:134)
23:59:52 [2021-05-29T03:59:52.633Z] 	at org.eclipse.core.runtime.internal.adaptor.EclipseAppLauncher.start(EclipseAppLauncher.java:104)
23:59:52 [2021-05-29T03:59:52.634Z] 	at org.eclipse.core.runtime.adaptor.EclipseStarter.run(EclipseStarter.java:401)
23:59:52 [2021-05-29T03:59:52.634Z] 	at org.eclipse.core.runtime.adaptor.EclipseStarter.run(EclipseStarter.java:255)
23:59:52 [2021-05-29T03:59:52.634Z] 	at java.base/jdk.internal.reflect.NativeMethodAccessorImpl.invoke0(Native Method)
23:59:52 [2021-05-29T03:59:52.634Z] 	at java.base/jdk.internal.reflect.NativeMethodAccessorImpl.invoke(NativeMethodAccessorImpl.java:64)
23:59:52 [2021-05-29T03:59:52.634Z] 	at java.base/jdk.internal.reflect.DelegatingMethodAccessorImpl.invoke(DelegatingMethodAccessorImpl.java:43)
23:59:52 [2021-05-29T03:59:52.634Z] 	at java.base/java.lang.reflect.Method.invoke(Method.java:564)
23:59:52 [2021-05-29T03:59:52.634Z] 	at org.eclipse.equinox.launcher.Main.invokeFramework(Main.java:653)
23:59:52 [2021-05-29T03:59:52.634Z] 	at org.eclipse.equinox.launcher.Main.basicRun(Main.java:590)
23:59:52 [2021-05-29T03:59:52.634Z] 	at org.eclipse.equinox.launcher.Main.run(Main.java:1461)
23:59:52 [2021-05-29T03:59:52.634Z] 	at org.eclipse.equinox.launcher.Main.main(Main.java:1434)
23:59:52 [2021-05-29T03:59:52.634Z] Caused by: java.lang.ClassNotFoundException: org.junit.runners.model.RunnerBuilder cannot be found by org.eclipse.tycho.surefire.osgibooter_2.2.0
23:59:52 [2021-05-29T03:59:52.634Z] 	at org.eclipse.osgi.internal.loader.BundleLoader.findClass(BundleLoader.java:516)
23:59:52 [2021-05-29T03:59:52.634Z] 	at org.eclipse.osgi.internal.loader.ModuleClassLoader.loadClass(ModuleClassLoader.java:171)
23:59:52 [2021-05-29T03:59:52.634Z] 	at java.base/java.lang.ClassLoader.loadClass(ClassLoader.java:522)
23:59:52 [2021-05-29T03:59:52.634Z] 	... 31 more
23:59:52 [2021-05-29T03:59:52.634Z] 
23:59:52 [2021-05-29T03:59:52.634Z] May 29, 2021 3:59:52 AM org.junit.platform.launcher.core.DefaultLauncher handleThrowable
23:59:52 [2021-05-29T03:59:52.634Z] WARNING: TestEngine with ID 'junit-vintage' failed to discover tests
23:59:52 [2021-05-29T03:59:52.634Z] java.lang.NoClassDefFoundError: org/junit/runners/model/RunnerBuilder
23:59:52 [2021-05-29T03:59:52.634Z] 	at org.junit.vintage.engine.discovery.VintageDiscoverer.<init>(VintageDiscoverer.java:48)
23:59:52 [2021-05-29T03:59:52.634Z] 	at org.junit.vintage.engine.VintageTestEngine.discover(VintageTestEngine.java:65)
23:59:52 [2021-05-29T03:59:52.634Z] 	at org.junit.platform.launcher.core.DefaultLauncher.discoverEngineRoot(DefaultLauncher.java:130)
23:59:52 [2021-05-29T03:59:52.634Z] 	at org.junit.platform.launcher.core.DefaultLauncher.discoverRoot(DefaultLauncher.java:117)
23:59:52 [2021-05-29T03:59:52.634Z] 	at org.junit.platform.launcher.core.DefaultLauncher.execute(DefaultLauncher.java:90)
23:59:52 [2021-05-29T03:59:52.634Z] 	at org.apache.maven.surefire.junitplatform.JUnitPlatformProvider.invokeAllTests(JUnitPlatformProvider.java:150)
23:59:52 [2021-05-29T03:59:52.634Z] 	at org.apache.maven.surefire.junitplatform.JUnitPlatformProvider.invoke(JUnitPlatformProvider.java:124)
23:59:52 [2021-05-29T03:59:52.634Z] 	at java.base/jdk.internal.reflect.NativeMethodAccessorImpl.invoke0(Native Method)
23:59:52 [2021-05-29T03:59:52.634Z] 	at java.base/jdk.internal.reflect.NativeMethodAccessorImpl.invoke(NativeMethodAccessorImpl.java:64)
23:59:52 [2021-05-29T03:59:52.634Z] 	at java.base/jdk.internal.reflect.DelegatingMethodAccessorImpl.invoke(DelegatingMethodAccessorImpl.java:43)
23:59:52 [2021-05-29T03:59:52.634Z] 	at java.base/java.lang.reflect.Method.invoke(Method.java:564)
23:59:52 [2021-05-29T03:59:52.634Z] 	at org.apache.maven.surefire.util.ReflectionUtils.invokeMethodWithArray2(ReflectionUtils.java:206)
23:59:52 [2021-05-29T03:59:52.634Z] 	at org.apache.maven.surefire.booter.ProviderFactory$ProviderProxy.invoke(ProviderFactory.java:161)
23:59:52 [2021-05-29T03:59:52.634Z] 	at org.apache.maven.surefire.booter.ProviderFactory.invokeProvider(ProviderFactory.java:84)
23:59:52 [2021-05-29T03:59:52.634Z] 	at org.eclipse.tycho.surefire.osgibooter.OsgiSurefireBooter.run(OsgiSurefireBooter.java:116)
23:59:52 [2021-05-29T03:59:52.634Z] 	at org.eclipse.tycho.surefire.osgibooter.HeadlessTestApplication.start(HeadlessTestApplication.java:23)
23:59:52 [2021-05-29T03:59:52.634Z] 	at org.eclipse.equinox.internal.app.EclipseAppHandle.run(EclipseAppHandle.java:203)
23:59:52 [2021-05-29T03:59:52.634Z] 	at org.eclipse.core.runtime.internal.adaptor.EclipseAppLauncher.runApplication(EclipseAppLauncher.java:134)
23:59:52 [2021-05-29T03:59:52.634Z] 	at org.eclipse.core.runtime.internal.adaptor.EclipseAppLauncher.start(EclipseAppLauncher.java:104)
23:59:52 [2021-05-29T03:59:52.634Z] 	at org.eclipse.core.runtime.adaptor.EclipseStarter.run(EclipseStarter.java:401)
23:59:52 [2021-05-29T03:59:52.634Z] 	at org.eclipse.core.runtime.adaptor.EclipseStarter.run(EclipseStarter.java:255)
23:59:52 [2021-05-29T03:59:52.634Z] 	at java.base/jdk.internal.reflect.NativeMethodAccessorImpl.invoke0(Native Method)
23:59:52 [2021-05-29T03:59:52.634Z] 	at java.base/jdk.internal.reflect.NativeMethodAccessorImpl.invoke(NativeMethodAccessorImpl.java:64)
23:59:52 [2021-05-29T03:59:52.634Z] 	at java.base/jdk.internal.reflect.DelegatingMethodAccessorImpl.invoke(DelegatingMethodAccessorImpl.java:43)
23:59:52 [2021-05-29T03:59:52.634Z] 	at java.base/java.lang.reflect.Method.invoke(Method.java:564)
23:59:52 [2021-05-29T03:59:52.634Z] 	at org.eclipse.equinox.launcher.Main.invokeFramework(Main.java:653)
23:59:52 [2021-05-29T03:59:52.634Z] 	at org.eclipse.equinox.launcher.Main.basicRun(Main.java:590)
23:59:52 [2021-05-29T03:59:52.634Z] 	at org.eclipse.equinox.launcher.Main.run(Main.java:1461)
23:59:52 [2021-05-29T03:59:52.634Z] 	at org.eclipse.equinox.launcher.Main.main(Main.java:1434)
23:59:52 [2021-05-29T03:59:52.634Z] Caused by: java.lang.ClassNotFoundException: org.junit.runners.model.RunnerBuilder cannot be found by org.eclipse.tycho.surefire.osgibooter_2.2.0
23:59:52 [2021-05-29T03:59:52.634Z] 	at org.eclipse.osgi.internal.loader.BundleLoader.findClass(BundleLoader.java:516)
23:59:52 [2021-05-29T03:59:52.634Z] 	at org.eclipse.osgi.internal.loader.ModuleClassLoader.loadClass(ModuleClassLoader.java:171)
23:59:52 [2021-05-29T03:59:52.634Z] 	at java.base/java.lang.ClassLoader.loadClass(ClassLoader.java:522)
23:59:52 [2021-05-29T03:59:52.634Z] 	... 29 more
23:59:52 [2021-05-29T03:59:52.634Z] 
23:59:52 [2021-05-29T03:59:52.634Z] Running org.eclipse.ease.ui.scripts.expressions.definitions.ExpressionFactoryTest
23:59:52 [2021-05-29T03:59:52.634Z] Tests run: 14, Failures: 0, Errors: 0, Skipped: 0, Time elapsed: 0.063 s - in org.eclipse.ease.ui.scripts.expressions.definitions.ExpressionFactoryTest
23:59:52 [2021-05-29T03:59:52.634Z] loadClassWithExpression  Time elapsed: 0.017 s
23:59:52 [2021-05-29T03:59:52.634Z] createWithExpression  Time elapsed: 0 s
23:59:52 [2021-05-29T03:59:52.634Z] createReferenceExpression  Time elapsed: 0.002 s
23:59:52 [2021-05-29T03:59:52.634Z] loadClassReferenceExpression  Time elapsed: 0 s
23:59:52 [2021-05-29T03:59:52.635Z] loadClassTestExpression  Time elapsed: 0.001 s
23:59:52 [2021-05-29T03:59:52.635Z] createEqualsExpression  Time elapsed: 0.001 s
23:59:52 [2021-05-29T03:59:52.635Z] loadClassCountExpression  Time elapsed: 0.001 s
23:59:52 [2021-05-29T03:59:52.635Z] loadClassOrExpression  Time elapsed: 0.001 s
23:59:52 [2021-05-29T03:59:52.635Z] createTestExpression  Time elapsed: 0.004 s
23:59:52 [2021-05-29T03:59:52.635Z] createOrExpression  Time elapsed: 0.002 s
23:59:52 [2021-05-29T03:59:52.635Z] loadClassAndExpression  Time elapsed: 0.001 s
23:59:52 [2021-05-29T03:59:52.635Z] createAndExpression  Time elapsed: 0.001 s
23:59:52 [2021-05-29T03:59:52.635Z] loadClassEqualsExpression  Time elapsed: 0.019 s
23:59:52 [2021-05-29T03:59:52.635Z] createCountExpression  Time elapsed: 0.001 s
23:59:52 [2021-05-29T03:59:52.635Z] 
23:59:52 [2021-05-29T03:59:52.635Z] Results:
23:59:52 [2021-05-29T03:59:52.635Z] 
23:59:52 [2021-05-29T03:59:52.635Z] Tests run: 14, Failures: 0, Errors: 0, Skipped: 0
23:59:52 [2021-05-29T03:59:52.635Z] 
23:59:54 [2021-05-29T03:59:54.530Z] [INFO] All tests passed!
23:59:54 [2021-05-29T03:59:54.530Z] [INFO] 
23:59:54 [2021-05-29T03:59:54.530Z] [INFO] --- maven-pmd-plugin:3.14.0:pmd (pmd-integration) @ org.eclipse.ease.ui.scripts.test ---
23:59:54 [2021-05-29T03:59:54.530Z] [INFO] 
23:59:54 [2021-05-29T03:59:54.530Z] [INFO] --- maven-pmd-plugin:3.14.0:cpd (pmd-integration) @ org.eclipse.ease.ui.scripts.test ---
23:59:54 [2021-05-29T03:59:54.791Z] [INFO] 
23:59:54 [2021-05-29T03:59:54.791Z] [INFO] --- spotbugs-maven-plugin:4.1.4:spotbugs (spotbugs-integration) @ org.eclipse.ease.ui.scripts.test ---
23:59:54 [2021-05-29T03:59:54.791Z] [INFO] Fork Value is false
23:59:54 [2021-05-29T03:59:54.791Z]      [java] JVM args ignored when same JVM is used.
23:59:57 [2021-05-29T03:59:57.357Z] [INFO] Done SpotBugs Analysis....
23:59:57 [2021-05-29T03:59:57.357Z] [INFO] 
23:59:57 [2021-05-29T03:59:57.357Z] [INFO] --- maven-checkstyle-plugin:3.1.1:check (checkstyle-integration) @ org.eclipse.ease.ui.scripts.test ---
23:59:57 [2021-05-29T03:59:57.357Z] [INFO] You have 0 Checkstyle violations.
23:59:57 [2021-05-29T03:59:57.357Z] [INFO] 
23:59:57 [2021-05-29T03:59:57.357Z] [INFO] --- maven-install-plugin:2.3.1:install (default-install) @ org.eclipse.ease.ui.scripts.test ---
23:59:57 [2021-05-29T03:59:57.357Z] [INFO] Installing /home/jenkins/agent/workspace/ease.verify.core.target.2018-12/tests/org.eclipse.ease.ui.scripts.test/target/org.eclipse.ease.ui.scripts.test-0.8.0-SNAPSHOT.jar to /home/jenkins/.m2/repository/org/eclipse/ease/org.eclipse.ease.ui.scripts.test/0.8.0-SNAPSHOT/org.eclipse.ease.ui.scripts.test-0.8.0-SNAPSHOT.jar
23:59:57 [2021-05-29T03:59:57.357Z] [INFO] Installing /home/jenkins/agent/workspace/ease.verify.core.target.2018-12/tests/org.eclipse.ease.ui.scripts.test/pom.xml to /home/jenkins/.m2/repository/org/eclipse/ease/org.eclipse.ease.ui.scripts.test/0.8.0-SNAPSHOT/org.eclipse.ease.ui.scripts.test-0.8.0-SNAPSHOT.pom
23:59:57 [2021-05-29T03:59:57.614Z] [INFO] Installing /home/jenkins/agent/workspace/ease.verify.core.target.2018-12/tests/org.eclipse.ease.ui.scripts.test/target/p2content.xml to /home/jenkins/.m2/repository/org/eclipse/ease/org.eclipse.ease.ui.scripts.test/0.8.0-SNAPSHOT/org.eclipse.ease.ui.scripts.test-0.8.0-SNAPSHOT-p2metadata.xml
23:59:57 [2021-05-29T03:59:57.614Z] [INFO] Installing /home/jenkins/agent/workspace/ease.verify.core.target.2018-12/tests/org.eclipse.ease.ui.scripts.test/target/p2artifacts.xml to /home/jenkins/.m2/repository/org/eclipse/ease/org.eclipse.ease.ui.scripts.test/0.8.0-SNAPSHOT/org.eclipse.ease.ui.scripts.test-0.8.0-SNAPSHOT-p2artifacts.xml
23:59:57 [2021-05-29T03:59:57.614Z] [INFO] 
23:59:57 [2021-05-29T03:59:57.614Z] [INFO] --- tycho-p2-plugin:2.2.0:update-local-index (default-update-local-index) @ org.eclipse.ease.ui.scripts.test ---
23:59:57 [2021-05-29T03:59:57.614Z] [INFO] 
23:59:57 [2021-05-29T03:59:57.614Z] [INFO] -------------< org.eclipse.ease:org.eclipse.ease.ui.test >--------------
23:59:57 [2021-05-29T03:59:57.614Z] [INFO] Building org.eclipse.ease.ui.test 0.8.0-SNAPSHOT                 [46/48]
23:59:57 [2021-05-29T03:59:57.615Z] [INFO] ------------------------[ eclipse-test-plugin ]-------------------------
23:59:57 [2021-05-29T03:59:57.615Z] [INFO] 
23:59:57 [2021-05-29T03:59:57.615Z] [INFO] --- maven-clean-plugin:2.5:clean (default-clean) @ org.eclipse.ease.ui.test ---
23:59:57 [2021-05-29T03:59:57.615Z] [INFO] 
23:59:57 [2021-05-29T03:59:57.615Z] [INFO] --- tycho-packaging-plugin:2.2.0:build-qualifier (default-build-qualifier) @ org.eclipse.ease.ui.test ---
23:59:57 [2021-05-29T03:59:57.615Z] [INFO] The project's OSGi version is 0.8.0.I202104091518
23:59:57 [2021-05-29T03:59:57.615Z] [INFO] 
23:59:57 [2021-05-29T03:59:57.615Z] [INFO] --- tycho-packaging-plugin:2.2.0:validate-id (default-validate-id) @ org.eclipse.ease.ui.test ---
23:59:57 [2021-05-29T03:59:57.615Z] [INFO] 
23:59:57 [2021-05-29T03:59:57.615Z] [INFO] --- tycho-packaging-plugin:2.2.0:validate-version (default-validate-version) @ org.eclipse.ease.ui.test ---
23:59:57 [2021-05-29T03:59:57.615Z] [INFO] 
23:59:57 [2021-05-29T03:59:57.615Z] [INFO] --- maven-resources-plugin:2.4.3:resources (default-resources) @ org.eclipse.ease.ui.test ---
23:59:57 [2021-05-29T03:59:57.615Z] [INFO] Using 'UTF-8' encoding to copy filtered resources.
23:59:57 [2021-05-29T03:59:57.615Z] [INFO] skip non existing resourceDirectory /home/jenkins/agent/workspace/ease.verify.core.target.2018-12/tests/org.eclipse.ease.ui.test/src/main/resources
23:59:57 [2021-05-29T03:59:57.615Z] [INFO] 
23:59:57 [2021-05-29T03:59:57.615Z] [INFO] --- tycho-compiler-plugin:2.2.0:compile (default-compile) @ org.eclipse.ease.ui.test ---
23:59:57 [2021-05-29T03:59:57.615Z] [INFO] Compiling 13 source files to /home/jenkins/agent/workspace/ease.verify.core.target.2018-12/tests/org.eclipse.ease.ui.test/target/classes
23:59:58 [2021-05-29T03:59:58.197Z] [INFO] 
23:59:58 [2021-05-29T03:59:58.197Z] [INFO] --- maven-resources-plugin:2.4.3:testResources (default-testResources) @ org.eclipse.ease.ui.test ---
23:59:58 [2021-05-29T03:59:58.197Z] [INFO] Using 'UTF-8' encoding to copy filtered resources.
23:59:58 [2021-05-29T03:59:58.197Z] [INFO] skip non existing resourceDirectory /home/jenkins/agent/workspace/ease.verify.core.target.2018-12/tests/org.eclipse.ease.ui.test/src/test/resources
23:59:58 [2021-05-29T03:59:58.197Z] [INFO] 
23:59:58 [2021-05-29T03:59:58.197Z] [INFO] --- target-platform-configuration:2.2.0:target-platform (default-target-platform) @ org.eclipse.ease.ui.test ---
23:59:58 [2021-05-29T03:59:58.197Z] [INFO] 
23:59:58 [2021-05-29T03:59:58.197Z] [INFO] --- tycho-packaging-plugin:2.2.0:package-plugin (default-package-plugin) @ org.eclipse.ease.ui.test ---
23:59:58 [2021-05-29T03:59:58.197Z] [INFO] Building jar: /home/jenkins/agent/workspace/ease.verify.core.target.2018-12/tests/org.eclipse.ease.ui.test/target/org.eclipse.ease.ui.test-0.8.0-SNAPSHOT.jar
23:59:58 [2021-05-29T03:59:58.197Z] [INFO] 
23:59:58 [2021-05-29T03:59:58.197Z] [INFO] --- tycho-p2-plugin:2.2.0:p2-metadata-default (default-p2-metadata-default) @ org.eclipse.ease.ui.test ---
23:59:58 [2021-05-29T03:59:58.197Z] [INFO] 
23:59:58 [2021-05-29T03:59:58.198Z] [INFO] --- jacoco-maven-plugin:0.8.6:prepare-agent (jacoco-initialize) @ org.eclipse.ease.ui.test ---
23:59:58 [2021-05-29T03:59:58.198Z] [INFO] tycho.testArgLine set to -javaagent:/home/jenkins/.m2/repository/org/jacoco/org.jacoco.agent/0.8.6/org.jacoco.agent-0.8.6-runtime.jar=destfile=/home/jenkins/agent/workspace/ease.verify.core.target.2018-12/tests/org.eclipse.ease.ui.test/target/jacoco.exec,output=file
23:59:58 [2021-05-29T03:59:58.198Z] [INFO] 
23:59:58 [2021-05-29T03:59:58.198Z] [INFO] --- tycho-surefire-plugin:2.2.0:test (default-test) @ org.eclipse.ease.ui.test ---
23:59:58 [2021-05-29T03:59:58.198Z] [INFO] Executing Test Runtime with timeout 0, logs (if any) will be placed at: /home/jenkins/agent/workspace/ease.verify.core.target.2018-12/tests/org.eclipse.ease.ui.test/target/work/data/.metadata/.log
23:59:58 [2021-05-29T03:59:58.198Z] [INFO] Command line:
23:59:58 [2021-05-29T03:59:58.198Z] 	[/opt/tools/java/openjdk/jdk-15/15.0.2+7/bin/java, -Dosgi.noShutdown=false, -Dosgi.os=linux, -Dosgi.ws=gtk, -Dosgi.arch=x86_64, -javaagent:/home/jenkins/.m2/repository/org/jacoco/org.jacoco.agent/0.8.6/org.jacoco.agent-0.8.6-runtime.jar=destfile=/home/jenkins/agent/workspace/ease.verify.core.target.2018-12/tests/org.eclipse.ease.ui.test/target/jacoco.exec,output=file, -Dosgi.clean=true, -jar, /home/jenkins/.m2/repository/p2/osgi/bundle/org.eclipse.equinox.launcher/1.6.0.v20200915-1508/org.eclipse.equinox.launcher-1.6.0.v20200915-1508.jar, -data, /home/jenkins/agent/workspace/ease.verify.core.target.2018-12/tests/org.eclipse.ease.ui.test/target/work/data, -install, /home/jenkins/agent/workspace/ease.verify.core.target.2018-12/tests/org.eclipse.ease.ui.test/target/work, -configuration, /home/jenkins/agent/workspace/ease.verify.core.target.2018-12/tests/org.eclipse.ease.ui.test/target/work/configuration, -application, org.eclipse.tycho.surefire.osgibooter.headlesstest, -testproperties, /home/jenkins/agent/workspace/ease.verify.core.target.2018-12/tests/org.eclipse.ease.ui.test/target/surefire.properties]
23:59:58 [2021-05-29T03:59:58.198Z] Picked up JAVA_TOOL_OPTIONS: -Dmaven.ext.class.path="/home/jenkins/agent/workspace/ease.verify.core.target.2018-12@tmp/withMaven984a5d0d/pipeline-maven-spy.jar" -Dorg.jenkinsci.plugins.pipeline.maven.reportsFolder="/home/jenkins/agent/workspace/ease.verify.core.target.2018-12@tmp/withMaven984a5d0d" 
00:00:03 [2021-05-29T04:00:03.139Z] May 29, 2021 4:00:01 AM org.junit.platform.launcher.core.DefaultLauncher handleThrowable
00:00:03 [2021-05-29T04:00:03.139Z] WARNING: TestEngine with ID 'junit-vintage' failed to discover tests
00:00:03 [2021-05-29T04:00:03.139Z] java.lang.NoClassDefFoundError: org/junit/runners/model/RunnerBuilder
00:00:03 [2021-05-29T04:00:03.139Z] 	at org.junit.vintage.engine.discovery.VintageDiscoverer.<init>(VintageDiscoverer.java:48)
00:00:03 [2021-05-29T04:00:03.139Z] 	at org.junit.vintage.engine.VintageTestEngine.discover(VintageTestEngine.java:65)
00:00:03 [2021-05-29T04:00:03.139Z] 	at org.junit.platform.launcher.core.DefaultLauncher.discoverEngineRoot(DefaultLauncher.java:130)
00:00:03 [2021-05-29T04:00:03.139Z] 	at org.junit.platform.launcher.core.DefaultLauncher.discoverRoot(DefaultLauncher.java:117)
00:00:03 [2021-05-29T04:00:03.139Z] 	at org.junit.platform.launcher.core.DefaultLauncher.discover(DefaultLauncher.java:82)
00:00:03 [2021-05-29T04:00:03.139Z] 	at org.apache.maven.surefire.junitplatform.TestPlanScannerFilter.accept(TestPlanScannerFilter.java:56)
00:00:03 [2021-05-29T04:00:03.139Z] 	at org.apache.maven.surefire.util.DefaultScanResult.applyFilter(DefaultScanResult.java:102)
00:00:03 [2021-05-29T04:00:03.139Z] 	at org.apache.maven.surefire.junitplatform.JUnitPlatformProvider.scanClasspath(JUnitPlatformProvider.java:143)
00:00:03 [2021-05-29T04:00:03.139Z] 	at org.apache.maven.surefire.junitplatform.JUnitPlatformProvider.invoke(JUnitPlatformProvider.java:124)
00:00:03 [2021-05-29T04:00:03.139Z] 	at java.base/jdk.internal.reflect.NativeMethodAccessorImpl.invoke0(Native Method)
00:00:03 [2021-05-29T04:00:03.139Z] 	at java.base/jdk.internal.reflect.NativeMethodAccessorImpl.invoke(NativeMethodAccessorImpl.java:64)
00:00:03 [2021-05-29T04:00:03.139Z] 	at java.base/jdk.internal.reflect.DelegatingMethodAccessorImpl.invoke(DelegatingMethodAccessorImpl.java:43)
00:00:03 [2021-05-29T04:00:03.139Z] 	at java.base/java.lang.reflect.Method.invoke(Method.java:564)
00:00:03 [2021-05-29T04:00:03.139Z] 	at org.apache.maven.surefire.util.ReflectionUtils.invokeMethodWithArray2(ReflectionUtils.java:206)
00:00:03 [2021-05-29T04:00:03.139Z] 	at org.apache.maven.surefire.booter.ProviderFactory$ProviderProxy.invoke(ProviderFactory.java:161)
00:00:03 [2021-05-29T04:00:03.139Z] 	at org.apache.maven.surefire.booter.ProviderFactory.invokeProvider(ProviderFactory.java:84)
00:00:03 [2021-05-29T04:00:03.139Z] 	at org.eclipse.tycho.surefire.osgibooter.OsgiSurefireBooter.run(OsgiSurefireBooter.java:116)
00:00:03 [2021-05-29T04:00:03.139Z] 	at org.eclipse.tycho.surefire.osgibooter.HeadlessTestApplication.start(HeadlessTestApplication.java:23)
00:00:03 [2021-05-29T04:00:03.139Z] 	at org.eclipse.equinox.internal.app.EclipseAppHandle.run(EclipseAppHandle.java:203)
00:00:03 [2021-05-29T04:00:03.139Z] 	at org.eclipse.core.runtime.internal.adaptor.EclipseAppLauncher.runApplication(EclipseAppLauncher.java:134)
00:00:03 [2021-05-29T04:00:03.139Z] 	at org.eclipse.core.runtime.internal.adaptor.EclipseAppLauncher.start(EclipseAppLauncher.java:104)
00:00:03 [2021-05-29T04:00:03.139Z] 	at org.eclipse.core.runtime.adaptor.EclipseStarter.run(EclipseStarter.java:401)
00:00:03 [2021-05-29T04:00:03.139Z] 	at org.eclipse.core.runtime.adaptor.EclipseStarter.run(EclipseStarter.java:255)
00:00:03 [2021-05-29T04:00:03.139Z] 	at java.base/jdk.internal.reflect.NativeMethodAccessorImpl.invoke0(Native Method)
00:00:03 [2021-05-29T04:00:03.139Z] 	at java.base/jdk.internal.reflect.NativeMethodAccessorImpl.invoke(NativeMethodAccessorImpl.java:64)
00:00:03 [2021-05-29T04:00:03.139Z] 	at java.base/jdk.internal.reflect.DelegatingMethodAccessorImpl.invoke(DelegatingMethodAccessorImpl.java:43)
00:00:03 [2021-05-29T04:00:03.139Z] 	at java.base/java.lang.reflect.Method.invoke(Method.java:564)
00:00:03 [2021-05-29T04:00:03.139Z] 	at org.eclipse.equinox.launcher.Main.invokeFramework(Main.java:653)
00:00:03 [2021-05-29T04:00:03.139Z] 	at org.eclipse.equinox.launcher.Main.basicRun(Main.java:590)
00:00:03 [2021-05-29T04:00:03.139Z] 	at org.eclipse.equinox.launcher.Main.run(Main.java:1461)
00:00:03 [2021-05-29T04:00:03.139Z] 	at org.eclipse.equinox.launcher.Main.main(Main.java:1434)
00:00:03 [2021-05-29T04:00:03.139Z] Caused by: java.lang.ClassNotFoundException: org.junit.runners.model.RunnerBuilder cannot be found by org.eclipse.tycho.surefire.osgibooter_2.2.0
00:00:03 [2021-05-29T04:00:03.139Z] 	at org.eclipse.osgi.internal.loader.BundleLoader.findClass(BundleLoader.java:516)
00:00:03 [2021-05-29T04:00:03.139Z] 	at org.eclipse.osgi.internal.loader.ModuleClassLoader.loadClass(ModuleClassLoader.java:171)
00:00:03 [2021-05-29T04:00:03.139Z] 	at java.base/java.lang.ClassLoader.loadClass(ClassLoader.java:522)
00:00:03 [2021-05-29T04:00:03.139Z] 	... 31 more
00:00:03 [2021-05-29T04:00:03.139Z] 
00:00:03 [2021-05-29T04:00:03.139Z] May 29, 2021 4:00:01 AM org.junit.platform.launcher.core.DefaultLauncher handleThrowable
00:00:03 [2021-05-29T04:00:03.139Z] WARNING: TestEngine with ID 'junit-vintage' failed to discover tests
00:00:03 [2021-05-29T04:00:03.139Z] java.lang.NoClassDefFoundError: org/junit/runners/model/RunnerBuilder
00:00:03 [2021-05-29T04:00:03.139Z] 	at org.junit.vintage.engine.discovery.VintageDiscoverer.<init>(VintageDiscoverer.java:48)
00:00:03 [2021-05-29T04:00:03.139Z] 	at org.junit.vintage.engine.VintageTestEngine.discover(VintageTestEngine.java:65)
00:00:03 [2021-05-29T04:00:03.140Z] 	at org.junit.platform.launcher.core.DefaultLauncher.discoverEngineRoot(DefaultLauncher.java:130)
00:00:03 [2021-05-29T04:00:03.140Z] 	at org.junit.platform.launcher.core.DefaultLauncher.discoverRoot(DefaultLauncher.java:117)
00:00:03 [2021-05-29T04:00:03.140Z] 	at org.junit.platform.launcher.core.DefaultLauncher.discover(DefaultLauncher.java:82)
00:00:03 [2021-05-29T04:00:03.140Z] 	at org.apache.maven.surefire.junitplatform.TestPlanScannerFilter.accept(TestPlanScannerFilter.java:56)
00:00:03 [2021-05-29T04:00:03.140Z] 	at org.apache.maven.surefire.util.DefaultScanResult.applyFilter(DefaultScanResult.java:102)
00:00:03 [2021-05-29T04:00:03.140Z] 	at org.apache.maven.surefire.junitplatform.JUnitPlatformProvider.scanClasspath(JUnitPlatformProvider.java:143)
00:00:03 [2021-05-29T04:00:03.140Z] 	at org.apache.maven.surefire.junitplatform.JUnitPlatformProvider.invoke(JUnitPlatformProvider.java:124)
00:00:03 [2021-05-29T04:00:03.140Z] 	at java.base/jdk.internal.reflect.NativeMethodAccessorImpl.invoke0(Native Method)
00:00:03 [2021-05-29T04:00:03.140Z] 	at java.base/jdk.internal.reflect.NativeMethodAccessorImpl.invoke(NativeMethodAccessorImpl.java:64)
00:00:03 [2021-05-29T04:00:03.140Z] 	at java.base/jdk.internal.reflect.DelegatingMethodAccessorImpl.invoke(DelegatingMethodAccessorImpl.java:43)
00:00:03 [2021-05-29T04:00:03.140Z] 	at java.base/java.lang.reflect.Method.invoke(Method.java:564)
00:00:03 [2021-05-29T04:00:03.140Z] 	at org.apache.maven.surefire.util.ReflectionUtils.invokeMethodWithArray2(ReflectionUtils.java:206)
00:00:03 [2021-05-29T04:00:03.140Z] 	at org.apache.maven.surefire.booter.ProviderFactory$ProviderProxy.invoke(ProviderFactory.java:161)
00:00:03 [2021-05-29T04:00:03.140Z] 	at org.apache.maven.surefire.booter.ProviderFactory.invokeProvider(ProviderFactory.java:84)
00:00:03 [2021-05-29T04:00:03.140Z] 	at org.eclipse.tycho.surefire.osgibooter.OsgiSurefireBooter.run(OsgiSurefireBooter.java:116)
00:00:03 [2021-05-29T04:00:03.140Z] 	at org.eclipse.tycho.surefire.osgibooter.HeadlessTestApplication.start(HeadlessTestApplication.java:23)
00:00:03 [2021-05-29T04:00:03.140Z] 	at org.eclipse.equinox.internal.app.EclipseAppHandle.run(EclipseAppHandle.java:203)
00:00:03 [2021-05-29T04:00:03.140Z] 	at org.eclipse.core.runtime.internal.adaptor.EclipseAppLauncher.runApplication(EclipseAppLauncher.java:134)
00:00:03 [2021-05-29T04:00:03.140Z] 	at org.eclipse.core.runtime.internal.adaptor.EclipseAppLauncher.start(EclipseAppLauncher.java:104)
00:00:03 [2021-05-29T04:00:03.140Z] 	at org.eclipse.core.runtime.adaptor.EclipseStarter.run(EclipseStarter.java:401)
00:00:03 [2021-05-29T04:00:03.140Z] 	at org.eclipse.core.runtime.adaptor.EclipseStarter.run(EclipseStarter.java:255)
00:00:03 [2021-05-29T04:00:03.140Z] 	at java.base/jdk.internal.reflect.NativeMethodAccessorImpl.invoke0(Native Method)
00:00:03 [2021-05-29T04:00:03.140Z] 	at java.base/jdk.internal.reflect.NativeMethodAccessorImpl.invoke(NativeMethodAccessorImpl.java:64)
00:00:03 [2021-05-29T04:00:03.140Z] 	at java.base/jdk.internal.reflect.DelegatingMethodAccessorImpl.invoke(DelegatingMethodAccessorImpl.java:43)
00:00:03 [2021-05-29T04:00:03.140Z] 	at java.base/java.lang.reflect.Method.invoke(Method.java:564)
00:00:03 [2021-05-29T04:00:03.140Z] 	at org.eclipse.equinox.launcher.Main.invokeFramework(Main.java:653)
00:00:03 [2021-05-29T04:00:03.140Z] 	at org.eclipse.equinox.launcher.Main.basicRun(Main.java:590)
00:00:03 [2021-05-29T04:00:03.140Z] 	at org.eclipse.equinox.launcher.Main.run(Main.java:1461)
00:00:03 [2021-05-29T04:00:03.140Z] 	at org.eclipse.equinox.launcher.Main.main(Main.java:1434)
00:00:03 [2021-05-29T04:00:03.140Z] Caused by: java.lang.ClassNotFoundException: org.junit.runners.model.RunnerBuilder cannot be found by org.eclipse.tycho.surefire.osgibooter_2.2.0
00:00:03 [2021-05-29T04:00:03.140Z] 	at org.eclipse.osgi.internal.loader.BundleLoader.findClass(BundleLoader.java:516)
00:00:03 [2021-05-29T04:00:03.140Z] 	at org.eclipse.osgi.internal.loader.ModuleClassLoader.loadClass(ModuleClassLoader.java:171)
00:00:03 [2021-05-29T04:00:03.140Z] 	at java.base/java.lang.ClassLoader.loadClass(ClassLoader.java:522)
00:00:03 [2021-05-29T04:00:03.140Z] 	... 31 more
00:00:03 [2021-05-29T04:00:03.140Z] 
00:00:03 [2021-05-29T04:00:03.140Z] May 29, 2021 4:00:01 AM org.junit.platform.launcher.core.DefaultLauncher handleThrowable
00:00:03 [2021-05-29T04:00:03.140Z] WARNING: TestEngine with ID 'junit-vintage' failed to discover tests
00:00:03 [2021-05-29T04:00:03.140Z] java.lang.NoClassDefFoundError: org/junit/runners/model/RunnerBuilder
00:00:03 [2021-05-29T04:00:03.140Z] 	at org.junit.vintage.engine.discovery.VintageDiscoverer.<init>(VintageDiscoverer.java:48)
00:00:03 [2021-05-29T04:00:03.140Z] 	at org.junit.vintage.engine.VintageTestEngine.discover(VintageTestEngine.java:65)
00:00:03 [2021-05-29T04:00:03.140Z] 	at org.junit.platform.launcher.core.DefaultLauncher.discoverEngineRoot(DefaultLauncher.java:130)
00:00:03 [2021-05-29T04:00:03.140Z] 	at org.junit.platform.launcher.core.DefaultLauncher.discoverRoot(DefaultLauncher.java:117)
00:00:03 [2021-05-29T04:00:03.140Z] 	at org.junit.platform.launcher.core.DefaultLauncher.discover(DefaultLauncher.java:82)
00:00:03 [2021-05-29T04:00:03.140Z] 	at org.apache.maven.surefire.junitplatform.TestPlanScannerFilter.accept(TestPlanScannerFilter.java:56)
00:00:03 [2021-05-29T04:00:03.140Z] 	at org.apache.maven.surefire.util.DefaultScanResult.applyFilter(DefaultScanResult.java:102)
00:00:03 [2021-05-29T04:00:03.140Z] 	at org.apache.maven.surefire.junitplatform.JUnitPlatformProvider.scanClasspath(JUnitPlatformProvider.java:143)
00:00:03 [2021-05-29T04:00:03.140Z] 	at org.apache.maven.surefire.junitplatform.JUnitPlatformProvider.invoke(JUnitPlatformProvider.java:124)
00:00:03 [2021-05-29T04:00:03.140Z] 	at java.base/jdk.internal.reflect.NativeMethodAccessorImpl.invoke0(Native Method)
00:00:03 [2021-05-29T04:00:03.140Z] 	at java.base/jdk.internal.reflect.NativeMethodAccessorImpl.invoke(NativeMethodAccessorImpl.java:64)
00:00:03 [2021-05-29T04:00:03.140Z] 	at java.base/jdk.internal.reflect.DelegatingMethodAccessorImpl.invoke(DelegatingMethodAccessorImpl.java:43)
00:00:03 [2021-05-29T04:00:03.140Z] 	at java.base/java.lang.reflect.Method.invoke(Method.java:564)
00:00:03 [2021-05-29T04:00:03.140Z] 	at org.apache.maven.surefire.util.ReflectionUtils.invokeMethodWithArray2(ReflectionUtils.java:206)
00:00:03 [2021-05-29T04:00:03.140Z] 	at org.apache.maven.surefire.booter.ProviderFactory$ProviderProxy.invoke(ProviderFactory.java:161)
00:00:03 [2021-05-29T04:00:03.140Z] 	at org.apache.maven.surefire.booter.ProviderFactory.invokeProvider(ProviderFactory.java:84)
00:00:03 [2021-05-29T04:00:03.140Z] 	at org.eclipse.tycho.surefire.osgibooter.OsgiSurefireBooter.run(OsgiSurefireBooter.java:116)
00:00:03 [2021-05-29T04:00:03.141Z] 	at org.eclipse.tycho.surefire.osgibooter.HeadlessTestApplication.start(HeadlessTestApplication.java:23)
00:00:03 [2021-05-29T04:00:03.141Z] 	at org.eclipse.equinox.internal.app.EclipseAppHandle.run(EclipseAppHandle.java:203)
00:00:03 [2021-05-29T04:00:03.141Z] 	at org.eclipse.core.runtime.internal.adaptor.EclipseAppLauncher.runApplication(EclipseAppLauncher.java:134)
00:00:03 [2021-05-29T04:00:03.141Z] 	at org.eclipse.core.runtime.internal.adaptor.EclipseAppLauncher.start(EclipseAppLauncher.java:104)
00:00:03 [2021-05-29T04:00:03.141Z] 	at org.eclipse.core.runtime.adaptor.EclipseStarter.run(EclipseStarter.java:401)
00:00:03 [2021-05-29T04:00:03.141Z] 	at org.eclipse.core.runtime.adaptor.EclipseStarter.run(EclipseStarter.java:255)
00:00:03 [2021-05-29T04:00:03.141Z] 	at java.base/jdk.internal.reflect.NativeMethodAccessorImpl.invoke0(Native Method)
00:00:03 [2021-05-29T04:00:03.141Z] 	at java.base/jdk.internal.reflect.NativeMethodAccessorImpl.invoke(NativeMethodAccessorImpl.java:64)
00:00:03 [2021-05-29T04:00:03.141Z] 	at java.base/jdk.internal.reflect.DelegatingMethodAccessorImpl.invoke(DelegatingMethodAccessorImpl.java:43)
00:00:03 [2021-05-29T04:00:03.141Z] 	at java.base/java.lang.reflect.Method.invoke(Method.java:564)
00:00:03 [2021-05-29T04:00:03.141Z] 	at org.eclipse.equinox.launcher.Main.invokeFramework(Main.java:653)
00:00:03 [2021-05-29T04:00:03.141Z] 	at org.eclipse.equinox.launcher.Main.basicRun(Main.java:590)
00:00:03 [2021-05-29T04:00:03.141Z] 	at org.eclipse.equinox.launcher.Main.run(Main.java:1461)
00:00:03 [2021-05-29T04:00:03.141Z] 	at org.eclipse.equinox.launcher.Main.main(Main.java:1434)
00:00:03 [2021-05-29T04:00:03.141Z] Caused by: java.lang.ClassNotFoundException: org.junit.runners.model.RunnerBuilder cannot be found by org.eclipse.tycho.surefire.osgibooter_2.2.0
00:00:03 [2021-05-29T04:00:03.141Z] 	at org.eclipse.osgi.internal.loader.BundleLoader.findClass(BundleLoader.java:516)
00:00:03 [2021-05-29T04:00:03.141Z] 	at org.eclipse.osgi.internal.loader.ModuleClassLoader.loadClass(ModuleClassLoader.java:171)
00:00:03 [2021-05-29T04:00:03.141Z] 	at java.base/java.lang.ClassLoader.loadClass(ClassLoader.java:522)
00:00:03 [2021-05-29T04:00:03.141Z] 	... 31 more
00:00:03 [2021-05-29T04:00:03.141Z] 
00:00:03 [2021-05-29T04:00:03.141Z] May 29, 2021 4:00:01 AM org.junit.platform.launcher.core.DefaultLauncher handleThrowable
00:00:03 [2021-05-29T04:00:03.141Z] WARNING: TestEngine with ID 'junit-vintage' failed to discover tests
00:00:03 [2021-05-29T04:00:03.141Z] java.lang.NoClassDefFoundError: org/junit/runners/model/RunnerBuilder
00:00:03 [2021-05-29T04:00:03.141Z] 	at org.junit.vintage.engine.discovery.VintageDiscoverer.<init>(VintageDiscoverer.java:48)
00:00:03 [2021-05-29T04:00:03.141Z] 	at org.junit.vintage.engine.VintageTestEngine.discover(VintageTestEngine.java:65)
00:00:03 [2021-05-29T04:00:03.141Z] 	at org.junit.platform.launcher.core.DefaultLauncher.discoverEngineRoot(DefaultLauncher.java:130)
00:00:03 [2021-05-29T04:00:03.141Z] 	at org.junit.platform.launcher.core.DefaultLauncher.discoverRoot(DefaultLauncher.java:117)
00:00:03 [2021-05-29T04:00:03.141Z] 	at org.junit.platform.launcher.core.DefaultLauncher.discover(DefaultLauncher.java:82)
00:00:03 [2021-05-29T04:00:03.141Z] 	at org.apache.maven.surefire.junitplatform.TestPlanScannerFilter.accept(TestPlanScannerFilter.java:56)
00:00:03 [2021-05-29T04:00:03.141Z] 	at org.apache.maven.surefire.util.DefaultScanResult.applyFilter(DefaultScanResult.java:102)
00:00:03 [2021-05-29T04:00:03.141Z] 	at org.apache.maven.surefire.junitplatform.JUnitPlatformProvider.scanClasspath(JUnitPlatformProvider.java:143)
00:00:03 [2021-05-29T04:00:03.141Z] 	at org.apache.maven.surefire.junitplatform.JUnitPlatformProvider.invoke(JUnitPlatformProvider.java:124)
00:00:03 [2021-05-29T04:00:03.141Z] 	at java.base/jdk.internal.reflect.NativeMethodAccessorImpl.invoke0(Native Method)
00:00:03 [2021-05-29T04:00:03.141Z] 	at java.base/jdk.internal.reflect.NativeMethodAccessorImpl.invoke(NativeMethodAccessorImpl.java:64)
00:00:03 [2021-05-29T04:00:03.141Z] 	at java.base/jdk.internal.reflect.DelegatingMethodAccessorImpl.invoke(DelegatingMethodAccessorImpl.java:43)
00:00:03 [2021-05-29T04:00:03.141Z] 	at java.base/java.lang.reflect.Method.invoke(Method.java:564)
00:00:03 [2021-05-29T04:00:03.141Z] 	at org.apache.maven.surefire.util.ReflectionUtils.invokeMethodWithArray2(ReflectionUtils.java:206)
00:00:03 [2021-05-29T04:00:03.141Z] 	at org.apache.maven.surefire.booter.ProviderFactory$ProviderProxy.invoke(ProviderFactory.java:161)
00:00:03 [2021-05-29T04:00:03.141Z] 	at org.apache.maven.surefire.booter.ProviderFactory.invokeProvider(ProviderFactory.java:84)
00:00:03 [2021-05-29T04:00:03.141Z] 	at org.eclipse.tycho.surefire.osgibooter.OsgiSurefireBooter.run(OsgiSurefireBooter.java:116)
00:00:03 [2021-05-29T04:00:03.141Z] 	at org.eclipse.tycho.surefire.osgibooter.HeadlessTestApplication.start(HeadlessTestApplication.java:23)
00:00:03 [2021-05-29T04:00:03.141Z] 	at org.eclipse.equinox.internal.app.EclipseAppHandle.run(EclipseAppHandle.java:203)
00:00:03 [2021-05-29T04:00:03.141Z] 	at org.eclipse.core.runtime.internal.adaptor.EclipseAppLauncher.runApplication(EclipseAppLauncher.java:134)
00:00:03 [2021-05-29T04:00:03.141Z] 	at org.eclipse.core.runtime.internal.adaptor.EclipseAppLauncher.start(EclipseAppLauncher.java:104)
00:00:03 [2021-05-29T04:00:03.141Z] 	at org.eclipse.core.runtime.adaptor.EclipseStarter.run(EclipseStarter.java:401)
00:00:03 [2021-05-29T04:00:03.141Z] 	at org.eclipse.core.runtime.adaptor.EclipseStarter.run(EclipseStarter.java:255)
00:00:03 [2021-05-29T04:00:03.141Z] 	at java.base/jdk.internal.reflect.NativeMethodAccessorImpl.invoke0(Native Method)
00:00:03 [2021-05-29T04:00:03.141Z] 	at java.base/jdk.internal.reflect.NativeMethodAccessorImpl.invoke(NativeMethodAccessorImpl.java:64)
00:00:03 [2021-05-29T04:00:03.141Z] 	at java.base/jdk.internal.reflect.DelegatingMethodAccessorImpl.invoke(DelegatingMethodAccessorImpl.java:43)
00:00:03 [2021-05-29T04:00:03.141Z] 	at java.base/java.lang.reflect.Method.invoke(Method.java:564)
00:00:03 [2021-05-29T04:00:03.141Z] 	at org.eclipse.equinox.launcher.Main.invokeFramework(Main.java:653)
00:00:03 [2021-05-29T04:00:03.141Z] 	at org.eclipse.equinox.launcher.Main.basicRun(Main.java:590)
00:00:03 [2021-05-29T04:00:03.141Z] 	at org.eclipse.equinox.launcher.Main.run(Main.java:1461)
00:00:03 [2021-05-29T04:00:03.141Z] 	at org.eclipse.equinox.launcher.Main.main(Main.java:1434)
00:00:03 [2021-05-29T04:00:03.141Z] Caused by: java.lang.ClassNotFoundException: org.junit.runners.model.RunnerBuilder cannot be found by org.eclipse.tycho.surefire.osgibooter_2.2.0
00:00:03 [2021-05-29T04:00:03.142Z] 	at org.eclipse.osgi.internal.loader.BundleLoader.findClass(BundleLoader.java:516)
00:00:03 [2021-05-29T04:00:03.142Z] 	at org.eclipse.osgi.internal.loader.ModuleClassLoader.loadClass(ModuleClassLoader.java:171)
00:00:03 [2021-05-29T04:00:03.142Z] 	at java.base/java.lang.ClassLoader.loadClass(ClassLoader.java:522)
00:00:03 [2021-05-29T04:00:03.142Z] 	... 31 more
00:00:03 [2021-05-29T04:00:03.142Z] 
00:00:03 [2021-05-29T04:00:03.142Z] May 29, 2021 4:00:01 AM org.junit.platform.launcher.core.DefaultLauncher handleThrowable
00:00:03 [2021-05-29T04:00:03.142Z] WARNING: TestEngine with ID 'junit-vintage' failed to discover tests
00:00:03 [2021-05-29T04:00:03.142Z] java.lang.NoClassDefFoundError: org/junit/runners/model/RunnerBuilder
00:00:03 [2021-05-29T04:00:03.142Z] 	at org.junit.vintage.engine.discovery.VintageDiscoverer.<init>(VintageDiscoverer.java:48)
00:00:03 [2021-05-29T04:00:03.142Z] 	at org.junit.vintage.engine.VintageTestEngine.discover(VintageTestEngine.java:65)
00:00:03 [2021-05-29T04:00:03.142Z] 	at org.junit.platform.launcher.core.DefaultLauncher.discoverEngineRoot(DefaultLauncher.java:130)
00:00:03 [2021-05-29T04:00:03.142Z] 	at org.junit.platform.launcher.core.DefaultLauncher.discoverRoot(DefaultLauncher.java:117)
00:00:03 [2021-05-29T04:00:03.142Z] 	at org.junit.platform.launcher.core.DefaultLauncher.discover(DefaultLauncher.java:82)
00:00:03 [2021-05-29T04:00:03.142Z] 	at org.apache.maven.surefire.junitplatform.TestPlanScannerFilter.accept(TestPlanScannerFilter.java:56)
00:00:03 [2021-05-29T04:00:03.142Z] 	at org.apache.maven.surefire.util.DefaultScanResult.applyFilter(DefaultScanResult.java:102)
00:00:03 [2021-05-29T04:00:03.142Z] 	at org.apache.maven.surefire.junitplatform.JUnitPlatformProvider.scanClasspath(JUnitPlatformProvider.java:143)
00:00:03 [2021-05-29T04:00:03.142Z] 	at org.apache.maven.surefire.junitplatform.JUnitPlatformProvider.invoke(JUnitPlatformProvider.java:124)
00:00:03 [2021-05-29T04:00:03.142Z] 	at java.base/jdk.internal.reflect.NativeMethodAccessorImpl.invoke0(Native Method)
00:00:03 [2021-05-29T04:00:03.142Z] 	at java.base/jdk.internal.reflect.NativeMethodAccessorImpl.invoke(NativeMethodAccessorImpl.java:64)
00:00:03 [2021-05-29T04:00:03.142Z] 	at java.base/jdk.internal.reflect.DelegatingMethodAccessorImpl.invoke(DelegatingMethodAccessorImpl.java:43)
00:00:03 [2021-05-29T04:00:03.142Z] 	at java.base/java.lang.reflect.Method.invoke(Method.java:564)
00:00:03 [2021-05-29T04:00:03.142Z] 	at org.apache.maven.surefire.util.ReflectionUtils.invokeMethodWithArray2(ReflectionUtils.java:206)
00:00:03 [2021-05-29T04:00:03.142Z] 	at org.apache.maven.surefire.booter.ProviderFactory$ProviderProxy.invoke(ProviderFactory.java:161)
00:00:03 [2021-05-29T04:00:03.142Z] 	at org.apache.maven.surefire.booter.ProviderFactory.invokeProvider(ProviderFactory.java:84)
00:00:03 [2021-05-29T04:00:03.142Z] 	at org.eclipse.tycho.surefire.osgibooter.OsgiSurefireBooter.run(OsgiSurefireBooter.java:116)
00:00:03 [2021-05-29T04:00:03.142Z] 	at org.eclipse.tycho.surefire.osgibooter.HeadlessTestApplication.start(HeadlessTestApplication.java:23)
00:00:03 [2021-05-29T04:00:03.142Z] 	at org.eclipse.equinox.internal.app.EclipseAppHandle.run(EclipseAppHandle.java:203)
00:00:03 [2021-05-29T04:00:03.142Z] 	at org.eclipse.core.runtime.internal.adaptor.EclipseAppLauncher.runApplication(EclipseAppLauncher.java:134)
00:00:03 [2021-05-29T04:00:03.142Z] 	at org.eclipse.core.runtime.internal.adaptor.EclipseAppLauncher.start(EclipseAppLauncher.java:104)
00:00:03 [2021-05-29T04:00:03.142Z] 	at org.eclipse.core.runtime.adaptor.EclipseStarter.run(EclipseStarter.java:401)
00:00:03 [2021-05-29T04:00:03.142Z] 	at org.eclipse.core.runtime.adaptor.EclipseStarter.run(EclipseStarter.java:255)
00:00:03 [2021-05-29T04:00:03.142Z] 	at java.base/jdk.internal.reflect.NativeMethodAccessorImpl.invoke0(Native Method)
00:00:03 [2021-05-29T04:00:03.142Z] 	at java.base/jdk.internal.reflect.NativeMethodAccessorImpl.invoke(NativeMethodAccessorImpl.java:64)
00:00:03 [2021-05-29T04:00:03.142Z] 	at java.base/jdk.internal.reflect.DelegatingMethodAccessorImpl.invoke(DelegatingMethodAccessorImpl.java:43)
00:00:03 [2021-05-29T04:00:03.142Z] 	at java.base/java.lang.reflect.Method.invoke(Method.java:564)
00:00:03 [2021-05-29T04:00:03.142Z] 	at org.eclipse.equinox.launcher.Main.invokeFramework(Main.java:653)
00:00:03 [2021-05-29T04:00:03.142Z] 	at org.eclipse.equinox.launcher.Main.basicRun(Main.java:590)
00:00:03 [2021-05-29T04:00:03.142Z] 	at org.eclipse.equinox.launcher.Main.run(Main.java:1461)
00:00:03 [2021-05-29T04:00:03.142Z] 	at org.eclipse.equinox.launcher.Main.main(Main.java:1434)
00:00:03 [2021-05-29T04:00:03.142Z] Caused by: java.lang.ClassNotFoundException: org.junit.runners.model.RunnerBuilder cannot be found by org.eclipse.tycho.surefire.osgibooter_2.2.0
00:00:03 [2021-05-29T04:00:03.142Z] 	at org.eclipse.osgi.internal.loader.BundleLoader.findClass(BundleLoader.java:516)
00:00:03 [2021-05-29T04:00:03.142Z] 	at org.eclipse.osgi.internal.loader.ModuleClassLoader.loadClass(ModuleClassLoader.java:171)
00:00:03 [2021-05-29T04:00:03.142Z] 	at java.base/java.lang.ClassLoader.loadClass(ClassLoader.java:522)
00:00:03 [2021-05-29T04:00:03.142Z] 	... 31 more
00:00:03 [2021-05-29T04:00:03.142Z] 
00:00:03 [2021-05-29T04:00:03.142Z] May 29, 2021 4:00:01 AM org.junit.platform.launcher.core.DefaultLauncher handleThrowable
00:00:03 [2021-05-29T04:00:03.142Z] WARNING: TestEngine with ID 'junit-vintage' failed to discover tests
00:00:03 [2021-05-29T04:00:03.142Z] java.lang.NoClassDefFoundError: org/junit/runners/model/RunnerBuilder
00:00:03 [2021-05-29T04:00:03.142Z] 	at org.junit.vintage.engine.discovery.VintageDiscoverer.<init>(VintageDiscoverer.java:48)
00:00:03 [2021-05-29T04:00:03.142Z] 	at org.junit.vintage.engine.VintageTestEngine.discover(VintageTestEngine.java:65)
00:00:03 [2021-05-29T04:00:03.142Z] 	at org.junit.platform.launcher.core.DefaultLauncher.discoverEngineRoot(DefaultLauncher.java:130)
00:00:03 [2021-05-29T04:00:03.142Z] 	at org.junit.platform.launcher.core.DefaultLauncher.discoverRoot(DefaultLauncher.java:117)
00:00:03 [2021-05-29T04:00:03.142Z] 	at org.junit.platform.launcher.core.DefaultLauncher.discover(DefaultLauncher.java:82)
00:00:03 [2021-05-29T04:00:03.142Z] 	at org.apache.maven.surefire.junitplatform.TestPlanScannerFilter.accept(TestPlanScannerFilter.java:56)
00:00:03 [2021-05-29T04:00:03.142Z] 	at org.apache.maven.surefire.util.DefaultScanResult.applyFilter(DefaultScanResult.java:102)
00:00:03 [2021-05-29T04:00:03.142Z] 	at org.apache.maven.surefire.junitplatform.JUnitPlatformProvider.scanClasspath(JUnitPlatformProvider.java:143)
00:00:03 [2021-05-29T04:00:03.143Z] 	at org.apache.maven.surefire.junitplatform.JUnitPlatformProvider.invoke(JUnitPlatformProvider.java:124)
00:00:03 [2021-05-29T04:00:03.143Z] 	at java.base/jdk.internal.reflect.NativeMethodAccessorImpl.invoke0(Native Method)
00:00:03 [2021-05-29T04:00:03.143Z] 	at java.base/jdk.internal.reflect.NativeMethodAccessorImpl.invoke(NativeMethodAccessorImpl.java:64)
00:00:03 [2021-05-29T04:00:03.143Z] 	at java.base/jdk.internal.reflect.DelegatingMethodAccessorImpl.invoke(DelegatingMethodAccessorImpl.java:43)
00:00:03 [2021-05-29T04:00:03.143Z] 	at java.base/java.lang.reflect.Method.invoke(Method.java:564)
00:00:03 [2021-05-29T04:00:03.143Z] 	at org.apache.maven.surefire.util.ReflectionUtils.invokeMethodWithArray2(ReflectionUtils.java:206)
00:00:03 [2021-05-29T04:00:03.143Z] 	at org.apache.maven.surefire.booter.ProviderFactory$ProviderProxy.invoke(ProviderFactory.java:161)
00:00:03 [2021-05-29T04:00:03.143Z] 	at org.apache.maven.surefire.booter.ProviderFactory.invokeProvider(ProviderFactory.java:84)
00:00:03 [2021-05-29T04:00:03.143Z] 	at org.eclipse.tycho.surefire.osgibooter.OsgiSurefireBooter.run(OsgiSurefireBooter.java:116)
00:00:03 [2021-05-29T04:00:03.143Z] 	at org.eclipse.tycho.surefire.osgibooter.HeadlessTestApplication.start(HeadlessTestApplication.java:23)
00:00:03 [2021-05-29T04:00:03.143Z] 	at org.eclipse.equinox.internal.app.EclipseAppHandle.run(EclipseAppHandle.java:203)
00:00:03 [2021-05-29T04:00:03.143Z] 	at org.eclipse.core.runtime.internal.adaptor.EclipseAppLauncher.runApplication(EclipseAppLauncher.java:134)
00:00:03 [2021-05-29T04:00:03.143Z] 	at org.eclipse.core.runtime.internal.adaptor.EclipseAppLauncher.start(EclipseAppLauncher.java:104)
00:00:03 [2021-05-29T04:00:03.143Z] 	at org.eclipse.core.runtime.adaptor.EclipseStarter.run(EclipseStarter.java:401)
00:00:03 [2021-05-29T04:00:03.143Z] 	at org.eclipse.core.runtime.adaptor.EclipseStarter.run(EclipseStarter.java:255)
00:00:03 [2021-05-29T04:00:03.143Z] 	at java.base/jdk.internal.reflect.NativeMethodAccessorImpl.invoke0(Native Method)
00:00:03 [2021-05-29T04:00:03.143Z] 	at java.base/jdk.internal.reflect.NativeMethodAccessorImpl.invoke(NativeMethodAccessorImpl.java:64)
00:00:03 [2021-05-29T04:00:03.143Z] 	at java.base/jdk.internal.reflect.DelegatingMethodAccessorImpl.invoke(DelegatingMethodAccessorImpl.java:43)
00:00:03 [2021-05-29T04:00:03.143Z] 	at java.base/java.lang.reflect.Method.invoke(Method.java:564)
00:00:03 [2021-05-29T04:00:03.143Z] 	at org.eclipse.equinox.launcher.Main.invokeFramework(Main.java:653)
00:00:03 [2021-05-29T04:00:03.143Z] 	at org.eclipse.equinox.launcher.Main.basicRun(Main.java:590)
00:00:03 [2021-05-29T04:00:03.143Z] 	at org.eclipse.equinox.launcher.Main.run(Main.java:1461)
00:00:03 [2021-05-29T04:00:03.143Z] 	at org.eclipse.equinox.launcher.Main.main(Main.java:1434)
00:00:03 [2021-05-29T04:00:03.143Z] Caused by: java.lang.ClassNotFoundException: org.junit.runners.model.RunnerBuilder cannot be found by org.eclipse.tycho.surefire.osgibooter_2.2.0
00:00:03 [2021-05-29T04:00:03.143Z] 	at org.eclipse.osgi.internal.loader.BundleLoader.findClass(BundleLoader.java:516)
00:00:03 [2021-05-29T04:00:03.143Z] 	at org.eclipse.osgi.internal.loader.ModuleClassLoader.loadClass(ModuleClassLoader.java:171)
00:00:03 [2021-05-29T04:00:03.143Z] 	at java.base/java.lang.ClassLoader.loadClass(ClassLoader.java:522)
00:00:03 [2021-05-29T04:00:03.143Z] 	... 31 more
00:00:03 [2021-05-29T04:00:03.143Z] 
00:00:03 [2021-05-29T04:00:03.143Z] May 29, 2021 4:00:01 AM org.junit.platform.launcher.core.DefaultLauncher handleThrowable
00:00:03 [2021-05-29T04:00:03.143Z] WARNING: TestEngine with ID 'junit-vintage' failed to discover tests
00:00:03 [2021-05-29T04:00:03.143Z] java.lang.NoClassDefFoundError: org/junit/runners/model/RunnerBuilder
00:00:03 [2021-05-29T04:00:03.143Z] 	at org.junit.vintage.engine.discovery.VintageDiscoverer.<init>(VintageDiscoverer.java:48)
00:00:03 [2021-05-29T04:00:03.143Z] 	at org.junit.vintage.engine.VintageTestEngine.discover(VintageTestEngine.java:65)
00:00:03 [2021-05-29T04:00:03.143Z] 	at org.junit.platform.launcher.core.DefaultLauncher.discoverEngineRoot(DefaultLauncher.java:130)
00:00:03 [2021-05-29T04:00:03.143Z] 	at org.junit.platform.launcher.core.DefaultLauncher.discoverRoot(DefaultLauncher.java:117)
00:00:03 [2021-05-29T04:00:03.143Z] 	at org.junit.platform.launcher.core.DefaultLauncher.discover(DefaultLauncher.java:82)
00:00:03 [2021-05-29T04:00:03.143Z] 	at org.apache.maven.surefire.junitplatform.TestPlanScannerFilter.accept(TestPlanScannerFilter.java:56)
00:00:03 [2021-05-29T04:00:03.143Z] 	at org.apache.maven.surefire.util.DefaultScanResult.applyFilter(DefaultScanResult.java:102)
00:00:03 [2021-05-29T04:00:03.143Z] 	at org.apache.maven.surefire.junitplatform.JUnitPlatformProvider.scanClasspath(JUnitPlatformProvider.java:143)
00:00:03 [2021-05-29T04:00:03.143Z] 	at org.apache.maven.surefire.junitplatform.JUnitPlatformProvider.invoke(JUnitPlatformProvider.java:124)
00:00:03 [2021-05-29T04:00:03.143Z] 	at java.base/jdk.internal.reflect.NativeMethodAccessorImpl.invoke0(Native Method)
00:00:03 [2021-05-29T04:00:03.143Z] 	at java.base/jdk.internal.reflect.NativeMethodAccessorImpl.invoke(NativeMethodAccessorImpl.java:64)
00:00:03 [2021-05-29T04:00:03.143Z] 	at java.base/jdk.internal.reflect.DelegatingMethodAccessorImpl.invoke(DelegatingMethodAccessorImpl.java:43)
00:00:03 [2021-05-29T04:00:03.143Z] 	at java.base/java.lang.reflect.Method.invoke(Method.java:564)
00:00:03 [2021-05-29T04:00:03.143Z] 	at org.apache.maven.surefire.util.ReflectionUtils.invokeMethodWithArray2(ReflectionUtils.java:206)
00:00:03 [2021-05-29T04:00:03.143Z] 	at org.apache.maven.surefire.booter.ProviderFactory$ProviderProxy.invoke(ProviderFactory.java:161)
00:00:03 [2021-05-29T04:00:03.143Z] 	at org.apache.maven.surefire.booter.ProviderFactory.invokeProvider(ProviderFactory.java:84)
00:00:03 [2021-05-29T04:00:03.143Z] 	at org.eclipse.tycho.surefire.osgibooter.OsgiSurefireBooter.run(OsgiSurefireBooter.java:116)
00:00:03 [2021-05-29T04:00:03.143Z] 	at org.eclipse.tycho.surefire.osgibooter.HeadlessTestApplication.start(HeadlessTestApplication.java:23)
00:00:03 [2021-05-29T04:00:03.143Z] 	at org.eclipse.equinox.internal.app.EclipseAppHandle.run(EclipseAppHandle.java:203)
00:00:03 [2021-05-29T04:00:03.143Z] 	at org.eclipse.core.runtime.internal.adaptor.EclipseAppLauncher.runApplication(EclipseAppLauncher.java:134)
00:00:03 [2021-05-29T04:00:03.143Z] 	at org.eclipse.core.runtime.internal.adaptor.EclipseAppLauncher.start(EclipseAppLauncher.java:104)
00:00:03 [2021-05-29T04:00:03.143Z] 	at org.eclipse.core.runtime.adaptor.EclipseStarter.run(EclipseStarter.java:401)
00:00:03 [2021-05-29T04:00:03.143Z] 	at org.eclipse.core.runtime.adaptor.EclipseStarter.run(EclipseStarter.java:255)
00:00:03 [2021-05-29T04:00:03.143Z] 	at java.base/jdk.internal.reflect.NativeMethodAccessorImpl.invoke0(Native Method)
00:00:03 [2021-05-29T04:00:03.143Z] 	at java.base/jdk.internal.reflect.NativeMethodAccessorImpl.invoke(NativeMethodAccessorImpl.java:64)
00:00:03 [2021-05-29T04:00:03.144Z] 	at java.base/jdk.internal.reflect.DelegatingMethodAccessorImpl.invoke(DelegatingMethodAccessorImpl.java:43)
00:00:03 [2021-05-29T04:00:03.144Z] 	at java.base/java.lang.reflect.Method.invoke(Method.java:564)
00:00:03 [2021-05-29T04:00:03.144Z] 	at org.eclipse.equinox.launcher.Main.invokeFramework(Main.java:653)
00:00:03 [2021-05-29T04:00:03.144Z] 	at org.eclipse.equinox.launcher.Main.basicRun(Main.java:590)
00:00:03 [2021-05-29T04:00:03.144Z] 	at org.eclipse.equinox.launcher.Main.run(Main.java:1461)
00:00:03 [2021-05-29T04:00:03.144Z] 	at org.eclipse.equinox.launcher.Main.main(Main.java:1434)
00:00:03 [2021-05-29T04:00:03.144Z] Caused by: java.lang.ClassNotFoundException: org.junit.runners.model.RunnerBuilder cannot be found by org.eclipse.tycho.surefire.osgibooter_2.2.0
00:00:03 [2021-05-29T04:00:03.144Z] 	at org.eclipse.osgi.internal.loader.BundleLoader.findClass(BundleLoader.java:516)
00:00:03 [2021-05-29T04:00:03.144Z] 	at org.eclipse.osgi.internal.loader.ModuleClassLoader.loadClass(ModuleClassLoader.java:171)
00:00:03 [2021-05-29T04:00:03.144Z] 	at java.base/java.lang.ClassLoader.loadClass(ClassLoader.java:522)
00:00:03 [2021-05-29T04:00:03.144Z] 	... 31 more
00:00:03 [2021-05-29T04:00:03.144Z] 
00:00:03 [2021-05-29T04:00:03.144Z] May 29, 2021 4:00:01 AM org.junit.platform.launcher.core.DefaultLauncher handleThrowable
00:00:03 [2021-05-29T04:00:03.144Z] WARNING: TestEngine with ID 'junit-vintage' failed to discover tests
00:00:03 [2021-05-29T04:00:03.144Z] java.lang.NoClassDefFoundError: org/junit/runners/model/RunnerBuilder
00:00:03 [2021-05-29T04:00:03.144Z] 	at org.junit.vintage.engine.discovery.VintageDiscoverer.<init>(VintageDiscoverer.java:48)
00:00:03 [2021-05-29T04:00:03.144Z] 	at org.junit.vintage.engine.VintageTestEngine.discover(VintageTestEngine.java:65)
00:00:03 [2021-05-29T04:00:03.144Z] 	at org.junit.platform.launcher.core.DefaultLauncher.discoverEngineRoot(DefaultLauncher.java:130)
00:00:03 [2021-05-29T04:00:03.144Z] 	at org.junit.platform.launcher.core.DefaultLauncher.discoverRoot(DefaultLauncher.java:117)
00:00:03 [2021-05-29T04:00:03.144Z] 	at org.junit.platform.launcher.core.DefaultLauncher.discover(DefaultLauncher.java:82)
00:00:03 [2021-05-29T04:00:03.144Z] 	at org.apache.maven.surefire.junitplatform.TestPlanScannerFilter.accept(TestPlanScannerFilter.java:56)
00:00:03 [2021-05-29T04:00:03.144Z] 	at org.apache.maven.surefire.util.DefaultScanResult.applyFilter(DefaultScanResult.java:102)
00:00:03 [2021-05-29T04:00:03.144Z] 	at org.apache.maven.surefire.junitplatform.JUnitPlatformProvider.scanClasspath(JUnitPlatformProvider.java:143)
00:00:03 [2021-05-29T04:00:03.144Z] 	at org.apache.maven.surefire.junitplatform.JUnitPlatformProvider.invoke(JUnitPlatformProvider.java:124)
00:00:03 [2021-05-29T04:00:03.144Z] 	at java.base/jdk.internal.reflect.NativeMethodAccessorImpl.invoke0(Native Method)
00:00:03 [2021-05-29T04:00:03.144Z] 	at java.base/jdk.internal.reflect.NativeMethodAccessorImpl.invoke(NativeMethodAccessorImpl.java:64)
00:00:03 [2021-05-29T04:00:03.144Z] 	at java.base/jdk.internal.reflect.DelegatingMethodAccessorImpl.invoke(DelegatingMethodAccessorImpl.java:43)
00:00:03 [2021-05-29T04:00:03.144Z] 	at java.base/java.lang.reflect.Method.invoke(Method.java:564)
00:00:03 [2021-05-29T04:00:03.144Z] 	at org.apache.maven.surefire.util.ReflectionUtils.invokeMethodWithArray2(ReflectionUtils.java:206)
00:00:03 [2021-05-29T04:00:03.144Z] 	at org.apache.maven.surefire.booter.ProviderFactory$ProviderProxy.invoke(ProviderFactory.java:161)
00:00:03 [2021-05-29T04:00:03.144Z] 	at org.apache.maven.surefire.booter.ProviderFactory.invokeProvider(ProviderFactory.java:84)
00:00:03 [2021-05-29T04:00:03.144Z] 	at org.eclipse.tycho.surefire.osgibooter.OsgiSurefireBooter.run(OsgiSurefireBooter.java:116)
00:00:03 [2021-05-29T04:00:03.144Z] 	at org.eclipse.tycho.surefire.osgibooter.HeadlessTestApplication.start(HeadlessTestApplication.java:23)
00:00:03 [2021-05-29T04:00:03.144Z] 	at org.eclipse.equinox.internal.app.EclipseAppHandle.run(EclipseAppHandle.java:203)
00:00:03 [2021-05-29T04:00:03.144Z] 	at org.eclipse.core.runtime.internal.adaptor.EclipseAppLauncher.runApplication(EclipseAppLauncher.java:134)
00:00:03 [2021-05-29T04:00:03.144Z] 	at org.eclipse.core.runtime.internal.adaptor.EclipseAppLauncher.start(EclipseAppLauncher.java:104)
00:00:03 [2021-05-29T04:00:03.144Z] 	at org.eclipse.core.runtime.adaptor.EclipseStarter.run(EclipseStarter.java:401)
00:00:03 [2021-05-29T04:00:03.144Z] 	at org.eclipse.core.runtime.adaptor.EclipseStarter.run(EclipseStarter.java:255)
00:00:03 [2021-05-29T04:00:03.144Z] 	at java.base/jdk.internal.reflect.NativeMethodAccessorImpl.invoke0(Native Method)
00:00:03 [2021-05-29T04:00:03.144Z] 	at java.base/jdk.internal.reflect.NativeMethodAccessorImpl.invoke(NativeMethodAccessorImpl.java:64)
00:00:03 [2021-05-29T04:00:03.144Z] 	at java.base/jdk.internal.reflect.DelegatingMethodAccessorImpl.invoke(DelegatingMethodAccessorImpl.java:43)
00:00:03 [2021-05-29T04:00:03.144Z] 	at java.base/java.lang.reflect.Method.invoke(Method.java:564)
00:00:03 [2021-05-29T04:00:03.144Z] 	at org.eclipse.equinox.launcher.Main.invokeFramework(Main.java:653)
00:00:03 [2021-05-29T04:00:03.144Z] 	at org.eclipse.equinox.launcher.Main.basicRun(Main.java:590)
00:00:03 [2021-05-29T04:00:03.144Z] 	at org.eclipse.equinox.launcher.Main.run(Main.java:1461)
00:00:03 [2021-05-29T04:00:03.144Z] 	at org.eclipse.equinox.launcher.Main.main(Main.java:1434)
00:00:03 [2021-05-29T04:00:03.144Z] Caused by: java.lang.ClassNotFoundException: org.junit.runners.model.RunnerBuilder cannot be found by org.eclipse.tycho.surefire.osgibooter_2.2.0
00:00:03 [2021-05-29T04:00:03.144Z] 	at org.eclipse.osgi.internal.loader.BundleLoader.findClass(BundleLoader.java:516)
00:00:03 [2021-05-29T04:00:03.144Z] 	at org.eclipse.osgi.internal.loader.ModuleClassLoader.loadClass(ModuleClassLoader.java:171)
00:00:03 [2021-05-29T04:00:03.144Z] 	at java.base/java.lang.ClassLoader.loadClass(ClassLoader.java:522)
00:00:03 [2021-05-29T04:00:03.144Z] 	... 31 more
00:00:03 [2021-05-29T04:00:03.144Z] 
00:00:03 [2021-05-29T04:00:03.144Z] May 29, 2021 4:00:01 AM org.junit.platform.launcher.core.DefaultLauncher handleThrowable
00:00:03 [2021-05-29T04:00:03.144Z] WARNING: TestEngine with ID 'junit-vintage' failed to discover tests
00:00:03 [2021-05-29T04:00:03.144Z] java.lang.NoClassDefFoundError: org/junit/runners/model/RunnerBuilder
00:00:03 [2021-05-29T04:00:03.144Z] 	at org.junit.vintage.engine.discovery.VintageDiscoverer.<init>(VintageDiscoverer.java:48)
00:00:03 [2021-05-29T04:00:03.144Z] 	at org.junit.vintage.engine.VintageTestEngine.discover(VintageTestEngine.java:65)
00:00:03 [2021-05-29T04:00:03.144Z] 	at org.junit.platform.launcher.core.DefaultLauncher.discoverEngineRoot(DefaultLauncher.java:130)
00:00:03 [2021-05-29T04:00:03.144Z] 	at org.junit.platform.launcher.core.DefaultLauncher.discoverRoot(DefaultLauncher.java:117)
00:00:03 [2021-05-29T04:00:03.144Z] 	at org.junit.platform.launcher.core.DefaultLauncher.discover(DefaultLauncher.java:82)
00:00:03 [2021-05-29T04:00:03.144Z] 	at org.apache.maven.surefire.junitplatform.TestPlanScannerFilter.accept(TestPlanScannerFilter.java:56)
00:00:03 [2021-05-29T04:00:03.145Z] 	at org.apache.maven.surefire.util.DefaultScanResult.applyFilter(DefaultScanResult.java:102)
00:00:03 [2021-05-29T04:00:03.145Z] 	at org.apache.maven.surefire.junitplatform.JUnitPlatformProvider.scanClasspath(JUnitPlatformProvider.java:143)
00:00:03 [2021-05-29T04:00:03.145Z] 	at org.apache.maven.surefire.junitplatform.JUnitPlatformProvider.invoke(JUnitPlatformProvider.java:124)
00:00:03 [2021-05-29T04:00:03.145Z] 	at java.base/jdk.internal.reflect.NativeMethodAccessorImpl.invoke0(Native Method)
00:00:03 [2021-05-29T04:00:03.145Z] 	at java.base/jdk.internal.reflect.NativeMethodAccessorImpl.invoke(NativeMethodAccessorImpl.java:64)
00:00:03 [2021-05-29T04:00:03.145Z] 	at java.base/jdk.internal.reflect.DelegatingMethodAccessorImpl.invoke(DelegatingMethodAccessorImpl.java:43)
00:00:03 [2021-05-29T04:00:03.145Z] 	at java.base/java.lang.reflect.Method.invoke(Method.java:564)
00:00:03 [2021-05-29T04:00:03.145Z] 	at org.apache.maven.surefire.util.ReflectionUtils.invokeMethodWithArray2(ReflectionUtils.java:206)
00:00:03 [2021-05-29T04:00:03.145Z] 	at org.apache.maven.surefire.booter.ProviderFactory$ProviderProxy.invoke(ProviderFactory.java:161)
00:00:03 [2021-05-29T04:00:03.145Z] 	at org.apache.maven.surefire.booter.ProviderFactory.invokeProvider(ProviderFactory.java:84)
00:00:03 [2021-05-29T04:00:03.145Z] 	at org.eclipse.tycho.surefire.osgibooter.OsgiSurefireBooter.run(OsgiSurefireBooter.java:116)
00:00:03 [2021-05-29T04:00:03.145Z] 	at org.eclipse.tycho.surefire.osgibooter.HeadlessTestApplication.start(HeadlessTestApplication.java:23)
00:00:03 [2021-05-29T04:00:03.145Z] 	at org.eclipse.equinox.internal.app.EclipseAppHandle.run(EclipseAppHandle.java:203)
00:00:03 [2021-05-29T04:00:03.145Z] 	at org.eclipse.core.runtime.internal.adaptor.EclipseAppLauncher.runApplication(EclipseAppLauncher.java:134)
00:00:03 [2021-05-29T04:00:03.145Z] 	at org.eclipse.core.runtime.internal.adaptor.EclipseAppLauncher.start(EclipseAppLauncher.java:104)
00:00:03 [2021-05-29T04:00:03.145Z] 	at org.eclipse.core.runtime.adaptor.EclipseStarter.run(EclipseStarter.java:401)
00:00:03 [2021-05-29T04:00:03.145Z] 	at org.eclipse.core.runtime.adaptor.EclipseStarter.run(EclipseStarter.java:255)
00:00:03 [2021-05-29T04:00:03.145Z] 	at java.base/jdk.internal.reflect.NativeMethodAccessorImpl.invoke0(Native Method)
00:00:03 [2021-05-29T04:00:03.145Z] 	at java.base/jdk.internal.reflect.NativeMethodAccessorImpl.invoke(NativeMethodAccessorImpl.java:64)
00:00:03 [2021-05-29T04:00:03.145Z] 	at java.base/jdk.internal.reflect.DelegatingMethodAccessorImpl.invoke(DelegatingMethodAccessorImpl.java:43)
00:00:03 [2021-05-29T04:00:03.145Z] 	at java.base/java.lang.reflect.Method.invoke(Method.java:564)
00:00:03 [2021-05-29T04:00:03.145Z] 	at org.eclipse.equinox.launcher.Main.invokeFramework(Main.java:653)
00:00:03 [2021-05-29T04:00:03.145Z] 	at org.eclipse.equinox.launcher.Main.basicRun(Main.java:590)
00:00:03 [2021-05-29T04:00:03.145Z] 	at org.eclipse.equinox.launcher.Main.run(Main.java:1461)
00:00:03 [2021-05-29T04:00:03.145Z] 	at org.eclipse.equinox.launcher.Main.main(Main.java:1434)
00:00:03 [2021-05-29T04:00:03.145Z] Caused by: java.lang.ClassNotFoundException: org.junit.runners.model.RunnerBuilder cannot be found by org.eclipse.tycho.surefire.osgibooter_2.2.0
00:00:03 [2021-05-29T04:00:03.145Z] 	at org.eclipse.osgi.internal.loader.BundleLoader.findClass(BundleLoader.java:516)
00:00:03 [2021-05-29T04:00:03.145Z] 	at org.eclipse.osgi.internal.loader.ModuleClassLoader.loadClass(ModuleClassLoader.java:171)
00:00:03 [2021-05-29T04:00:03.145Z] 	at java.base/java.lang.ClassLoader.loadClass(ClassLoader.java:522)
00:00:03 [2021-05-29T04:00:03.145Z] 	... 31 more
00:00:03 [2021-05-29T04:00:03.145Z] 
00:00:03 [2021-05-29T04:00:03.145Z] May 29, 2021 4:00:01 AM org.junit.platform.launcher.core.DefaultLauncher handleThrowable
00:00:03 [2021-05-29T04:00:03.145Z] WARNING: TestEngine with ID 'junit-vintage' failed to discover tests
00:00:03 [2021-05-29T04:00:03.145Z] java.lang.NoClassDefFoundError: org/junit/runners/model/RunnerBuilder
00:00:03 [2021-05-29T04:00:03.145Z] 	at org.junit.vintage.engine.discovery.VintageDiscoverer.<init>(VintageDiscoverer.java:48)
00:00:03 [2021-05-29T04:00:03.145Z] 	at org.junit.vintage.engine.VintageTestEngine.discover(VintageTestEngine.java:65)
00:00:03 [2021-05-29T04:00:03.145Z] 	at org.junit.platform.launcher.core.DefaultLauncher.discoverEngineRoot(DefaultLauncher.java:130)
00:00:03 [2021-05-29T04:00:03.145Z] 	at org.junit.platform.launcher.core.DefaultLauncher.discoverRoot(DefaultLauncher.java:117)
00:00:03 [2021-05-29T04:00:03.145Z] 	at org.junit.platform.launcher.core.DefaultLauncher.discover(DefaultLauncher.java:82)
00:00:03 [2021-05-29T04:00:03.145Z] 	at org.apache.maven.surefire.junitplatform.TestPlanScannerFilter.accept(TestPlanScannerFilter.java:56)
00:00:03 [2021-05-29T04:00:03.145Z] 	at org.apache.maven.surefire.util.DefaultScanResult.applyFilter(DefaultScanResult.java:102)
00:00:03 [2021-05-29T04:00:03.145Z] 	at org.apache.maven.surefire.junitplatform.JUnitPlatformProvider.scanClasspath(JUnitPlatformProvider.java:143)
00:00:03 [2021-05-29T04:00:03.145Z] 	at org.apache.maven.surefire.junitplatform.JUnitPlatformProvider.invoke(JUnitPlatformProvider.java:124)
00:00:03 [2021-05-29T04:00:03.145Z] 	at java.base/jdk.internal.reflect.NativeMethodAccessorImpl.invoke0(Native Method)
00:00:03 [2021-05-29T04:00:03.145Z] 	at java.base/jdk.internal.reflect.NativeMethodAccessorImpl.invoke(NativeMethodAccessorImpl.java:64)
00:00:03 [2021-05-29T04:00:03.145Z] 	at java.base/jdk.internal.reflect.DelegatingMethodAccessorImpl.invoke(DelegatingMethodAccessorImpl.java:43)
00:00:03 [2021-05-29T04:00:03.145Z] 	at java.base/java.lang.reflect.Method.invoke(Method.java:564)
00:00:03 [2021-05-29T04:00:03.145Z] 	at org.apache.maven.surefire.util.ReflectionUtils.invokeMethodWithArray2(ReflectionUtils.java:206)
00:00:03 [2021-05-29T04:00:03.145Z] 	at org.apache.maven.surefire.booter.ProviderFactory$ProviderProxy.invoke(ProviderFactory.java:161)
00:00:03 [2021-05-29T04:00:03.145Z] 	at org.apache.maven.surefire.booter.ProviderFactory.invokeProvider(ProviderFactory.java:84)
00:00:03 [2021-05-29T04:00:03.145Z] 	at org.eclipse.tycho.surefire.osgibooter.OsgiSurefireBooter.run(OsgiSurefireBooter.java:116)
00:00:03 [2021-05-29T04:00:03.145Z] 	at org.eclipse.tycho.surefire.osgibooter.HeadlessTestApplication.start(HeadlessTestApplication.java:23)
00:00:03 [2021-05-29T04:00:03.145Z] 	at org.eclipse.equinox.internal.app.EclipseAppHandle.run(EclipseAppHandle.java:203)
00:00:03 [2021-05-29T04:00:03.145Z] 	at org.eclipse.core.runtime.internal.adaptor.EclipseAppLauncher.runApplication(EclipseAppLauncher.java:134)
00:00:03 [2021-05-29T04:00:03.145Z] 	at org.eclipse.core.runtime.internal.adaptor.EclipseAppLauncher.start(EclipseAppLauncher.java:104)
00:00:03 [2021-05-29T04:00:03.145Z] 	at org.eclipse.core.runtime.adaptor.EclipseStarter.run(EclipseStarter.java:401)
00:00:03 [2021-05-29T04:00:03.146Z] 	at org.eclipse.core.runtime.adaptor.EclipseStarter.run(EclipseStarter.java:255)
00:00:03 [2021-05-29T04:00:03.146Z] 	at java.base/jdk.internal.reflect.NativeMethodAccessorImpl.invoke0(Native Method)
00:00:03 [2021-05-29T04:00:03.146Z] 	at java.base/jdk.internal.reflect.NativeMethodAccessorImpl.invoke(NativeMethodAccessorImpl.java:64)
00:00:03 [2021-05-29T04:00:03.146Z] 	at java.base/jdk.internal.reflect.DelegatingMethodAccessorImpl.invoke(DelegatingMethodAccessorImpl.java:43)
00:00:03 [2021-05-29T04:00:03.146Z] 	at java.base/java.lang.reflect.Method.invoke(Method.java:564)
00:00:03 [2021-05-29T04:00:03.146Z] 	at org.eclipse.equinox.launcher.Main.invokeFramework(Main.java:653)
00:00:03 [2021-05-29T04:00:03.146Z] 	at org.eclipse.equinox.launcher.Main.basicRun(Main.java:590)
00:00:03 [2021-05-29T04:00:03.146Z] 	at org.eclipse.equinox.launcher.Main.run(Main.java:1461)
00:00:03 [2021-05-29T04:00:03.146Z] 	at org.eclipse.equinox.launcher.Main.main(Main.java:1434)
00:00:03 [2021-05-29T04:00:03.146Z] Caused by: java.lang.ClassNotFoundException: org.junit.runners.model.RunnerBuilder cannot be found by org.eclipse.tycho.surefire.osgibooter_2.2.0
00:00:03 [2021-05-29T04:00:03.146Z] 	at org.eclipse.osgi.internal.loader.BundleLoader.findClass(BundleLoader.java:516)
00:00:03 [2021-05-29T04:00:03.146Z] 	at org.eclipse.osgi.internal.loader.ModuleClassLoader.loadClass(ModuleClassLoader.java:171)
00:00:03 [2021-05-29T04:00:03.146Z] 	at java.base/java.lang.ClassLoader.loadClass(ClassLoader.java:522)
00:00:03 [2021-05-29T04:00:03.146Z] 	... 31 more
00:00:03 [2021-05-29T04:00:03.146Z] 
00:00:03 [2021-05-29T04:00:03.146Z] May 29, 2021 4:00:01 AM org.junit.platform.launcher.core.DefaultLauncher handleThrowable
00:00:03 [2021-05-29T04:00:03.146Z] WARNING: TestEngine with ID 'junit-vintage' failed to discover tests
00:00:03 [2021-05-29T04:00:03.146Z] java.lang.NoClassDefFoundError: org/junit/runners/model/RunnerBuilder
00:00:03 [2021-05-29T04:00:03.146Z] 	at org.junit.vintage.engine.discovery.VintageDiscoverer.<init>(VintageDiscoverer.java:48)
00:00:03 [2021-05-29T04:00:03.146Z] 	at org.junit.vintage.engine.VintageTestEngine.discover(VintageTestEngine.java:65)
00:00:03 [2021-05-29T04:00:03.146Z] 	at org.junit.platform.launcher.core.DefaultLauncher.discoverEngineRoot(DefaultLauncher.java:130)
00:00:03 [2021-05-29T04:00:03.146Z] 	at org.junit.platform.launcher.core.DefaultLauncher.discoverRoot(DefaultLauncher.java:117)
00:00:03 [2021-05-29T04:00:03.146Z] 	at org.junit.platform.launcher.core.DefaultLauncher.discover(DefaultLauncher.java:82)
00:00:03 [2021-05-29T04:00:03.146Z] 	at org.apache.maven.surefire.junitplatform.TestPlanScannerFilter.accept(TestPlanScannerFilter.java:56)
00:00:03 [2021-05-29T04:00:03.146Z] 	at org.apache.maven.surefire.util.DefaultScanResult.applyFilter(DefaultScanResult.java:102)
00:00:03 [2021-05-29T04:00:03.146Z] 	at org.apache.maven.surefire.junitplatform.JUnitPlatformProvider.scanClasspath(JUnitPlatformProvider.java:143)
00:00:03 [2021-05-29T04:00:03.146Z] 	at org.apache.maven.surefire.junitplatform.JUnitPlatformProvider.invoke(JUnitPlatformProvider.java:124)
00:00:03 [2021-05-29T04:00:03.146Z] 	at java.base/jdk.internal.reflect.NativeMethodAccessorImpl.invoke0(Native Method)
00:00:03 [2021-05-29T04:00:03.146Z] 	at java.base/jdk.internal.reflect.NativeMethodAccessorImpl.invoke(NativeMethodAccessorImpl.java:64)
00:00:03 [2021-05-29T04:00:03.146Z] 	at java.base/jdk.internal.reflect.DelegatingMethodAccessorImpl.invoke(DelegatingMethodAccessorImpl.java:43)
00:00:03 [2021-05-29T04:00:03.146Z] 	at java.base/java.lang.reflect.Method.invoke(Method.java:564)
00:00:03 [2021-05-29T04:00:03.146Z] 	at org.apache.maven.surefire.util.ReflectionUtils.invokeMethodWithArray2(ReflectionUtils.java:206)
00:00:03 [2021-05-29T04:00:03.146Z] 	at org.apache.maven.surefire.booter.ProviderFactory$ProviderProxy.invoke(ProviderFactory.java:161)
00:00:03 [2021-05-29T04:00:03.146Z] 	at org.apache.maven.surefire.booter.ProviderFactory.invokeProvider(ProviderFactory.java:84)
00:00:03 [2021-05-29T04:00:03.146Z] 	at org.eclipse.tycho.surefire.osgibooter.OsgiSurefireBooter.run(OsgiSurefireBooter.java:116)
00:00:03 [2021-05-29T04:00:03.146Z] 	at org.eclipse.tycho.surefire.osgibooter.HeadlessTestApplication.start(HeadlessTestApplication.java:23)
00:00:03 [2021-05-29T04:00:03.146Z] 	at org.eclipse.equinox.internal.app.EclipseAppHandle.run(EclipseAppHandle.java:203)
00:00:03 [2021-05-29T04:00:03.146Z] 	at org.eclipse.core.runtime.internal.adaptor.EclipseAppLauncher.runApplication(EclipseAppLauncher.java:134)
00:00:03 [2021-05-29T04:00:03.146Z] 	at org.eclipse.core.runtime.internal.adaptor.EclipseAppLauncher.start(EclipseAppLauncher.java:104)
00:00:03 [2021-05-29T04:00:03.146Z] 	at org.eclipse.core.runtime.adaptor.EclipseStarter.run(EclipseStarter.java:401)
00:00:03 [2021-05-29T04:00:03.146Z] 	at org.eclipse.core.runtime.adaptor.EclipseStarter.run(EclipseStarter.java:255)
00:00:03 [2021-05-29T04:00:03.146Z] 	at java.base/jdk.internal.reflect.NativeMethodAccessorImpl.invoke0(Native Method)
00:00:03 [2021-05-29T04:00:03.146Z] 	at java.base/jdk.internal.reflect.NativeMethodAccessorImpl.invoke(NativeMethodAccessorImpl.java:64)
00:00:03 [2021-05-29T04:00:03.146Z] 	at java.base/jdk.internal.reflect.DelegatingMethodAccessorImpl.invoke(DelegatingMethodAccessorImpl.java:43)
00:00:03 [2021-05-29T04:00:03.146Z] 	at java.base/java.lang.reflect.Method.invoke(Method.java:564)
00:00:03 [2021-05-29T04:00:03.146Z] 	at org.eclipse.equinox.launcher.Main.invokeFramework(Main.java:653)
00:00:03 [2021-05-29T04:00:03.146Z] 	at org.eclipse.equinox.launcher.Main.basicRun(Main.java:590)
00:00:03 [2021-05-29T04:00:03.146Z] 	at org.eclipse.equinox.launcher.Main.run(Main.java:1461)
00:00:03 [2021-05-29T04:00:03.146Z] 	at org.eclipse.equinox.launcher.Main.main(Main.java:1434)
00:00:03 [2021-05-29T04:00:03.146Z] Caused by: java.lang.ClassNotFoundException: org.junit.runners.model.RunnerBuilder cannot be found by org.eclipse.tycho.surefire.osgibooter_2.2.0
00:00:03 [2021-05-29T04:00:03.146Z] 	at org.eclipse.osgi.internal.loader.BundleLoader.findClass(BundleLoader.java:516)
00:00:03 [2021-05-29T04:00:03.146Z] 	at org.eclipse.osgi.internal.loader.ModuleClassLoader.loadClass(ModuleClassLoader.java:171)
00:00:03 [2021-05-29T04:00:03.146Z] 	at java.base/java.lang.ClassLoader.loadClass(ClassLoader.java:522)
00:00:03 [2021-05-29T04:00:03.146Z] 	... 31 more
00:00:03 [2021-05-29T04:00:03.146Z] 
00:00:03 [2021-05-29T04:00:03.146Z] May 29, 2021 4:00:01 AM org.junit.platform.launcher.core.DefaultLauncher handleThrowable
00:00:03 [2021-05-29T04:00:03.146Z] WARNING: TestEngine with ID 'junit-vintage' failed to discover tests
00:00:03 [2021-05-29T04:00:03.146Z] java.lang.NoClassDefFoundError: org/junit/runners/model/RunnerBuilder
00:00:03 [2021-05-29T04:00:03.146Z] 	at org.junit.vintage.engine.discovery.VintageDiscoverer.<init>(VintageDiscoverer.java:48)
00:00:03 [2021-05-29T04:00:03.146Z] 	at org.junit.vintage.engine.VintageTestEngine.discover(VintageTestEngine.java:65)
00:00:03 [2021-05-29T04:00:03.146Z] 	at org.junit.platform.launcher.core.DefaultLauncher.discoverEngineRoot(DefaultLauncher.java:130)
00:00:03 [2021-05-29T04:00:03.146Z] 	at org.junit.platform.launcher.core.DefaultLauncher.discoverRoot(DefaultLauncher.java:117)
00:00:03 [2021-05-29T04:00:03.146Z] 	at org.junit.platform.launcher.core.DefaultLauncher.discover(DefaultLauncher.java:82)
00:00:03 [2021-05-29T04:00:03.147Z] 	at org.apache.maven.surefire.junitplatform.TestPlanScannerFilter.accept(TestPlanScannerFilter.java:56)
00:00:03 [2021-05-29T04:00:03.147Z] 	at org.apache.maven.surefire.util.DefaultScanResult.applyFilter(DefaultScanResult.java:102)
00:00:03 [2021-05-29T04:00:03.147Z] 	at org.apache.maven.surefire.junitplatform.JUnitPlatformProvider.scanClasspath(JUnitPlatformProvider.java:143)
00:00:03 [2021-05-29T04:00:03.147Z] 	at org.apache.maven.surefire.junitplatform.JUnitPlatformProvider.invoke(JUnitPlatformProvider.java:124)
00:00:03 [2021-05-29T04:00:03.147Z] 	at java.base/jdk.internal.reflect.NativeMethodAccessorImpl.invoke0(Native Method)
00:00:03 [2021-05-29T04:00:03.147Z] 	at java.base/jdk.internal.reflect.NativeMethodAccessorImpl.invoke(NativeMethodAccessorImpl.java:64)
00:00:03 [2021-05-29T04:00:03.147Z] 	at java.base/jdk.internal.reflect.DelegatingMethodAccessorImpl.invoke(DelegatingMethodAccessorImpl.java:43)
00:00:03 [2021-05-29T04:00:03.147Z] 	at java.base/java.lang.reflect.Method.invoke(Method.java:564)
00:00:03 [2021-05-29T04:00:03.147Z] 	at org.apache.maven.surefire.util.ReflectionUtils.invokeMethodWithArray2(ReflectionUtils.java:206)
00:00:03 [2021-05-29T04:00:03.147Z] 	at org.apache.maven.surefire.booter.ProviderFactory$ProviderProxy.invoke(ProviderFactory.java:161)
00:00:03 [2021-05-29T04:00:03.147Z] 	at org.apache.maven.surefire.booter.ProviderFactory.invokeProvider(ProviderFactory.java:84)
00:00:03 [2021-05-29T04:00:03.147Z] 	at org.eclipse.tycho.surefire.osgibooter.OsgiSurefireBooter.run(OsgiSurefireBooter.java:116)
00:00:03 [2021-05-29T04:00:03.147Z] 	at org.eclipse.tycho.surefire.osgibooter.HeadlessTestApplication.start(HeadlessTestApplication.java:23)
00:00:03 [2021-05-29T04:00:03.147Z] 	at org.eclipse.equinox.internal.app.EclipseAppHandle.run(EclipseAppHandle.java:203)
00:00:03 [2021-05-29T04:00:03.147Z] 	at org.eclipse.core.runtime.internal.adaptor.EclipseAppLauncher.runApplication(EclipseAppLauncher.java:134)
00:00:03 [2021-05-29T04:00:03.147Z] 	at org.eclipse.core.runtime.internal.adaptor.EclipseAppLauncher.start(EclipseAppLauncher.java:104)
00:00:03 [2021-05-29T04:00:03.147Z] 	at org.eclipse.core.runtime.adaptor.EclipseStarter.run(EclipseStarter.java:401)
00:00:03 [2021-05-29T04:00:03.147Z] 	at org.eclipse.core.runtime.adaptor.EclipseStarter.run(EclipseStarter.java:255)
00:00:03 [2021-05-29T04:00:03.147Z] 	at java.base/jdk.internal.reflect.NativeMethodAccessorImpl.invoke0(Native Method)
00:00:03 [2021-05-29T04:00:03.147Z] 	at java.base/jdk.internal.reflect.NativeMethodAccessorImpl.invoke(NativeMethodAccessorImpl.java:64)
00:00:03 [2021-05-29T04:00:03.147Z] 	at java.base/jdk.internal.reflect.DelegatingMethodAccessorImpl.invoke(DelegatingMethodAccessorImpl.java:43)
00:00:03 [2021-05-29T04:00:03.147Z] 	at java.base/java.lang.reflect.Method.invoke(Method.java:564)
00:00:03 [2021-05-29T04:00:03.147Z] 	at org.eclipse.equinox.launcher.Main.invokeFramework(Main.java:653)
00:00:03 [2021-05-29T04:00:03.147Z] 	at org.eclipse.equinox.launcher.Main.basicRun(Main.java:590)
00:00:03 [2021-05-29T04:00:03.147Z] 	at org.eclipse.equinox.launcher.Main.run(Main.java:1461)
00:00:03 [2021-05-29T04:00:03.147Z] 	at org.eclipse.equinox.launcher.Main.main(Main.java:1434)
00:00:03 [2021-05-29T04:00:03.147Z] Caused by: java.lang.ClassNotFoundException: org.junit.runners.model.RunnerBuilder cannot be found by org.eclipse.tycho.surefire.osgibooter_2.2.0
00:00:03 [2021-05-29T04:00:03.147Z] 	at org.eclipse.osgi.internal.loader.BundleLoader.findClass(BundleLoader.java:516)
00:00:03 [2021-05-29T04:00:03.147Z] 	at org.eclipse.osgi.internal.loader.ModuleClassLoader.loadClass(ModuleClassLoader.java:171)
00:00:03 [2021-05-29T04:00:03.147Z] 	at java.base/java.lang.ClassLoader.loadClass(ClassLoader.java:522)
00:00:03 [2021-05-29T04:00:03.147Z] 	... 31 more
00:00:03 [2021-05-29T04:00:03.147Z] 
00:00:03 [2021-05-29T04:00:03.147Z] May 29, 2021 4:00:01 AM org.junit.platform.launcher.core.DefaultLauncher handleThrowable
00:00:03 [2021-05-29T04:00:03.147Z] WARNING: TestEngine with ID 'junit-vintage' failed to discover tests
00:00:03 [2021-05-29T04:00:03.147Z] java.lang.NoClassDefFoundError: org/junit/runners/model/RunnerBuilder
00:00:03 [2021-05-29T04:00:03.147Z] 	at org.junit.vintage.engine.discovery.VintageDiscoverer.<init>(VintageDiscoverer.java:48)
00:00:03 [2021-05-29T04:00:03.147Z] 	at org.junit.vintage.engine.VintageTestEngine.discover(VintageTestEngine.java:65)
00:00:03 [2021-05-29T04:00:03.147Z] 	at org.junit.platform.launcher.core.DefaultLauncher.discoverEngineRoot(DefaultLauncher.java:130)
00:00:03 [2021-05-29T04:00:03.147Z] 	at org.junit.platform.launcher.core.DefaultLauncher.discoverRoot(DefaultLauncher.java:117)
00:00:03 [2021-05-29T04:00:03.147Z] 	at org.junit.platform.launcher.core.DefaultLauncher.execute(DefaultLauncher.java:90)
00:00:03 [2021-05-29T04:00:03.147Z] 	at org.apache.maven.surefire.junitplatform.JUnitPlatformProvider.invokeAllTests(JUnitPlatformProvider.java:150)
00:00:03 [2021-05-29T04:00:03.147Z] 	at org.apache.maven.surefire.junitplatform.JUnitPlatformProvider.invoke(JUnitPlatformProvider.java:124)
00:00:03 [2021-05-29T04:00:03.147Z] 	at java.base/jdk.internal.reflect.NativeMethodAccessorImpl.invoke0(Native Method)
00:00:03 [2021-05-29T04:00:03.147Z] 	at java.base/jdk.internal.reflect.NativeMethodAccessorImpl.invoke(NativeMethodAccessorImpl.java:64)
00:00:03 [2021-05-29T04:00:03.147Z] 	at java.base/jdk.internal.reflect.DelegatingMethodAccessorImpl.invoke(DelegatingMethodAccessorImpl.java:43)
00:00:03 [2021-05-29T04:00:03.147Z] 	at java.base/java.lang.reflect.Method.invoke(Method.java:564)
00:00:03 [2021-05-29T04:00:03.147Z] 	at org.apache.maven.surefire.util.ReflectionUtils.invokeMethodWithArray2(ReflectionUtils.java:206)
00:00:03 [2021-05-29T04:00:03.147Z] 	at org.apache.maven.surefire.booter.ProviderFactory$ProviderProxy.invoke(ProviderFactory.java:161)
00:00:03 [2021-05-29T04:00:03.147Z] 	at org.apache.maven.surefire.booter.ProviderFactory.invokeProvider(ProviderFactory.java:84)
00:00:03 [2021-05-29T04:00:03.147Z] 	at org.eclipse.tycho.surefire.osgibooter.OsgiSurefireBooter.run(OsgiSurefireBooter.java:116)
00:00:03 [2021-05-29T04:00:03.147Z] 	at org.eclipse.tycho.surefire.osgibooter.HeadlessTestApplication.start(HeadlessTestApplication.java:23)
00:00:03 [2021-05-29T04:00:03.147Z] 	at org.eclipse.equinox.internal.app.EclipseAppHandle.run(EclipseAppHandle.java:203)
00:00:03 [2021-05-29T04:00:03.147Z] 	at org.eclipse.core.runtime.internal.adaptor.EclipseAppLauncher.runApplication(EclipseAppLauncher.java:134)
00:00:03 [2021-05-29T04:00:03.147Z] 	at org.eclipse.core.runtime.internal.adaptor.EclipseAppLauncher.start(EclipseAppLauncher.java:104)
00:00:03 [2021-05-29T04:00:03.147Z] 	at org.eclipse.core.runtime.adaptor.EclipseStarter.run(EclipseStarter.java:401)
00:00:03 [2021-05-29T04:00:03.147Z] 	at org.eclipse.core.runtime.adaptor.EclipseStarter.run(EclipseStarter.java:255)
00:00:03 [2021-05-29T04:00:03.147Z] 	at java.base/jdk.internal.reflect.NativeMethodAccessorImpl.invoke0(Native Method)
00:00:03 [2021-05-29T04:00:03.147Z] 	at java.base/jdk.internal.reflect.NativeMethodAccessorImpl.invoke(NativeMethodAccessorImpl.java:64)
00:00:03 [2021-05-29T04:00:03.148Z] 	at java.base/jdk.internal.reflect.DelegatingMethodAccessorImpl.invoke(DelegatingMethodAccessorImpl.java:43)
00:00:03 [2021-05-29T04:00:03.148Z] 	at java.base/java.lang.reflect.Method.invoke(Method.java:564)
00:00:03 [2021-05-29T04:00:03.148Z] 	at org.eclipse.equinox.launcher.Main.invokeFramework(Main.java:653)
00:00:03 [2021-05-29T04:00:03.148Z] 	at org.eclipse.equinox.launcher.Main.basicRun(Main.java:590)
00:00:03 [2021-05-29T04:00:03.148Z] 	at org.eclipse.equinox.launcher.Main.run(Main.java:1461)
00:00:03 [2021-05-29T04:00:03.148Z] 	at org.eclipse.equinox.launcher.Main.main(Main.java:1434)
00:00:03 [2021-05-29T04:00:03.148Z] Caused by: java.lang.ClassNotFoundException: org.junit.runners.model.RunnerBuilder cannot be found by org.eclipse.tycho.surefire.osgibooter_2.2.0
00:00:03 [2021-05-29T04:00:03.148Z] 	at org.eclipse.osgi.internal.loader.BundleLoader.findClass(BundleLoader.java:516)
00:00:03 [2021-05-29T04:00:03.148Z] 	at org.eclipse.osgi.internal.loader.ModuleClassLoader.loadClass(ModuleClassLoader.java:171)
00:00:03 [2021-05-29T04:00:03.148Z] 	at java.base/java.lang.ClassLoader.loadClass(ClassLoader.java:522)
00:00:03 [2021-05-29T04:00:03.148Z] 	... 29 more
00:00:03 [2021-05-29T04:00:03.148Z] 
00:00:03 [2021-05-29T04:00:03.148Z] Running org.eclipse.ease.ui.views.shell.dropins.variables.VariablesComparatorTest
00:00:03 [2021-05-29T04:00:03.148Z] Tests run: 1, Failures: 0, Errors: 0, Skipped: 0, Time elapsed: 1.073 s - in org.eclipse.ease.ui.views.shell.dropins.variables.VariablesComparatorTest
00:00:03 [2021-05-29T04:00:03.148Z] lastExecutionResult_comes_before_debugVariable  Time elapsed: 1.066 s
00:00:03 [2021-05-29T04:00:03.148Z] Running org.eclipse.ease.ui.views.shell.dropins.variables.HiddenVariablesFilterTest
00:00:03 [2021-05-29T04:00:03.406Z] Tests run: 3, Failures: 0, Errors: 0, Skipped: 0, Time elapsed: 0.016 s - in org.eclipse.ease.ui.views.shell.dropins.variables.HiddenVariablesFilterTest
00:00:03 [2021-05-29T04:00:03.406Z] select_accepts_unknown_classes  Time elapsed: 0.001 s
00:00:03 [2021-05-29T04:00:03.406Z] select_accepts_script_variables  Time elapsed: 0.013 s
00:00:03 [2021-05-29T04:00:03.406Z] select_declines_hidden_script_variables  Time elapsed: 0.001 s
00:00:03 [2021-05-29T04:00:03.406Z] Running org.eclipse.ease.ui.views.shell.dropins.variables.ContentLabelProviderTest
00:00:03 [2021-05-29T04:00:03.406Z] Tests run: 1, Failures: 0, Errors: 0, Skipped: 0, Time elapsed: 0.076 s - in org.eclipse.ease.ui.views.shell.dropins.variables.ContentLabelProviderTest
00:00:03 [2021-05-29T04:00:03.406Z] getText_returns_variable_content  Time elapsed: 0.075 s
00:00:03 [2021-05-29T04:00:03.406Z] Running org.eclipse.ease.ui.views.shell.dropins.variables.VariablesLabelProviderTest
00:00:03 [2021-05-29T04:00:03.406Z] Tests run: 1, Failures: 0, Errors: 0, Skipped: 0, Time elapsed: 0.003 s - in org.eclipse.ease.ui.views.shell.dropins.variables.VariablesLabelProviderTest
00:00:03 [2021-05-29T04:00:03.406Z] getText_returns_variable_name  Time elapsed: 0.003 s
00:00:03 [2021-05-29T04:00:03.406Z] Running org.eclipse.ease.ui.views.shell.dropins.variables.VariablesContentProviderTest
00:00:03 [2021-05-29T04:00:03.406Z] Tests run: 5, Failures: 0, Errors: 0, Skipped: 0, Time elapsed: 0.069 s - in org.eclipse.ease.ui.views.shell.dropins.variables.VariablesContentProviderTest
00:00:03 [2021-05-29T04:00:03.406Z] hasChildren_true_when_child_nodes_are_available  Time elapsed: 0.001 s
00:00:03 [2021-05-29T04:00:03.406Z] getChildren_is_empty_when_no_child_nodes_are_available  Time elapsed: 0.002 s
00:00:03 [2021-05-29T04:00:03.406Z] getElements_contains_variables_from_engine  Time elapsed: 0.064 s
00:00:03 [2021-05-29T04:00:03.406Z] hasChildren_false_when_no_child_nodes_are_available  Time elapsed: 0 s
00:00:03 [2021-05-29T04:00:03.406Z] getChildren_not_empty_when_child_nodes_are_available  Time elapsed: 0 s
00:00:03 [2021-05-29T04:00:03.406Z] Running org.eclipse.ease.ui.views.shell.dropins.modules.ModulesStackContentProviderTest
00:00:03 [2021-05-29T04:00:03.406Z] Tests run: 2, Failures: 0, Errors: 0, Skipped: 0, Time elapsed: 0.1 s - in org.eclipse.ease.ui.views.shell.dropins.modules.ModulesStackContentProviderTest
00:00:03 [2021-05-29T04:00:03.406Z] getElements_returns_modules  Time elapsed: 0.099 s
00:00:03 [2021-05-29T04:00:03.406Z] getElements_returns_empty_list_without_environment  Time elapsed: 0.001 s
00:00:03 [2021-05-29T04:00:03.406Z] Running org.eclipse.ease.ui.views.shell.dropins.modules.ModulesStackLabelProviderTest
00:00:03 [2021-05-29T04:00:03.664Z] Tests run: 3, Failures: 0, Errors: 0, Skipped: 0, Time elapsed: 0.054 s - in org.eclipse.ease.ui.views.shell.dropins.modules.ModulesStackLabelProviderTest
00:00:03 [2021-05-29T04:00:03.664Z] getText_null_returns_empty_string  Time elapsed: 0 s
00:00:03 [2021-05-29T04:00:03.664Z] getText_returns_definition_name  Time elapsed: 0.051 s
00:00:03 [2021-05-29T04:00:03.664Z] getText_returns_full_class_name_name  Time elapsed: 0 s
00:00:03 [2021-05-29T04:00:03.664Z] Running org.eclipse.ease.ui.help.hovers.ModuleHelpTest
00:00:03 [2021-05-29T04:00:03.664Z] Tests run: 4, Failures: 0, Errors: 0, Skipped: 4, Time elapsed: 0.002 s - in org.eclipse.ease.ui.help.hovers.ModuleHelpTest
00:00:03 [2021-05-29T04:00:03.664Z] getModuleHelpLocation skipped
00:00:03 [2021-05-29T04:00:03.664Z] getModuleHelp skipped
00:00:03 [2021-05-29T04:00:03.664Z] getMethodHelp skipped
00:00:03 [2021-05-29T04:00:03.664Z] getConstantHelp skipped
00:00:03 [2021-05-29T04:00:03.664Z] Running org.eclipse.ease.ui.dnd.ModulesDropHandlerTest
00:00:03 [2021-05-29T04:00:03.664Z] Tests run: 2, Failures: 0, Errors: 0, Skipped: 0, Time elapsed: 0.043 s - in org.eclipse.ease.ui.dnd.ModulesDropHandlerTest
00:00:03 [2021-05-29T04:00:03.664Z] accepts_true_for_ModuleEntry  Time elapsed: 0.042 s
00:00:03 [2021-05-29T04:00:03.664Z] accepts_true_for_ModuleDefinition  Time elapsed: 0.001 s
00:00:03 [2021-05-29T04:00:03.664Z] Running org.eclipse.ease.ui.completion.CompletionContextTest
00:00:03 [2021-05-29T04:00:03.664Z] Tests run: 9, Failures: 0, Errors: 0, Skipped: 0, Time elapsed: 0.008 s - in org.eclipse.ease.ui.completion.CompletionContextTest
00:00:03 [2021-05-29T04:00:03.664Z] resolveStaticClass  Time elapsed: 0.004 s
00:00:03 [2021-05-29T04:00:03.664Z] resolveClassWithFilter  Time elapsed: 0 s
00:00:03 [2021-05-29T04:00:03.664Z] simplifyCalls  Time elapsed: 0.001 s
00:00:03 [2021-05-29T04:00:03.664Z] resolveClass  Time elapsed: 0 s
00:00:03 [2021-05-29T04:00:03.664Z] replaceEscapedStringLiterals  Time elapsed: 0 s
00:00:03 [2021-05-29T04:00:03.664Z] replaceSimpleStringLiterals  Time elapsed: 0.001 s
00:00:03 [2021-05-29T04:00:03.664Z] resolveStaticClassWithFilter  Time elapsed: 0 s
00:00:03 [2021-05-29T04:00:03.664Z] resolveClassWithParameters  Time elapsed: 0 s
00:00:03 [2021-05-29T04:00:03.664Z] replaceMultipleStringLiterals  Time elapsed: 0 s
00:00:03 [2021-05-29T04:00:03.664Z] Running org.eclipse.ease.ui.completion.provider.AbstractFileLocationCompletionProviderTest
00:00:03 [2021-05-29T04:00:03.664Z] Tests run: 8, Failures: 0, Errors: 0, Skipped: 8, Time elapsed: 0.03 s - in org.eclipse.ease.ui.completion.provider.AbstractFileLocationCompletionProviderTest
00:00:03 [2021-05-29T04:00:03.664Z] workspaceProjectProposals skipped
00:00:03 [2021-05-29T04:00:03.664Z] checkOperatingSystem skipped
00:00:03 [2021-05-29T04:00:03.664Z] absoluteRootWorkspaceProposals skipped
00:00:03 [2021-05-29T04:00:03.664Z] workspaceFolderProposals skipped
00:00:03 [2021-05-29T04:00:03.664Z] fileSystemFolderProposals skipped
00:00:03 [2021-05-29T04:00:03.664Z] workspaceProposals skipped
00:00:03 [2021-05-29T04:00:03.665Z] relativeRootWorkspaceProposals skipped
00:00:03 [2021-05-29T04:00:03.665Z] fileSystemRootProposals skipped
00:00:03 [2021-05-29T04:00:03.665Z] 
00:00:03 [2021-05-29T04:00:03.665Z] Results:
00:00:03 [2021-05-29T04:00:03.665Z] 
00:00:03 [2021-05-29T04:00:03.665Z] Tests run: 39, Failures: 0, Errors: 0, Skipped: 12
00:00:03 [2021-05-29T04:00:03.665Z] 
00:00:05 [2021-05-29T04:00:05.590Z] [INFO] All tests passed!
00:00:05 [2021-05-29T04:00:05.590Z] [INFO] 
00:00:05 [2021-05-29T04:00:05.591Z] [INFO] --- maven-pmd-plugin:3.14.0:pmd (pmd-integration) @ org.eclipse.ease.ui.test ---
00:00:06 [2021-05-29T04:00:06.196Z] [INFO] 
00:00:06 [2021-05-29T04:00:06.196Z] [INFO] --- maven-pmd-plugin:3.14.0:cpd (pmd-integration) @ org.eclipse.ease.ui.test ---
00:00:06 [2021-05-29T04:00:06.196Z] [INFO] 
00:00:06 [2021-05-29T04:00:06.196Z] [INFO] --- spotbugs-maven-plugin:4.1.4:spotbugs (spotbugs-integration) @ org.eclipse.ease.ui.test ---
00:00:06 [2021-05-29T04:00:06.196Z] [INFO] Fork Value is false
00:00:06 [2021-05-29T04:00:06.196Z]      [java] JVM args ignored when same JVM is used.
00:00:10 [2021-05-29T04:00:10.496Z] [INFO] Done SpotBugs Analysis....
00:00:10 [2021-05-29T04:00:10.496Z] [INFO] 
00:00:10 [2021-05-29T04:00:10.496Z] [INFO] --- maven-checkstyle-plugin:3.1.1:check (checkstyle-integration) @ org.eclipse.ease.ui.test ---
00:00:10 [2021-05-29T04:00:10.496Z] [INFO] You have 0 Checkstyle violations.
00:00:10 [2021-05-29T04:00:10.496Z] [INFO] 
00:00:10 [2021-05-29T04:00:10.496Z] [INFO] --- maven-install-plugin:2.3.1:install (default-install) @ org.eclipse.ease.ui.test ---
00:00:10 [2021-05-29T04:00:10.496Z] [INFO] Installing /home/jenkins/agent/workspace/ease.verify.core.target.2018-12/tests/org.eclipse.ease.ui.test/target/org.eclipse.ease.ui.test-0.8.0-SNAPSHOT.jar to /home/jenkins/.m2/repository/org/eclipse/ease/org.eclipse.ease.ui.test/0.8.0-SNAPSHOT/org.eclipse.ease.ui.test-0.8.0-SNAPSHOT.jar
00:00:10 [2021-05-29T04:00:10.497Z] [INFO] Installing /home/jenkins/agent/workspace/ease.verify.core.target.2018-12/tests/org.eclipse.ease.ui.test/pom.xml to /home/jenkins/.m2/repository/org/eclipse/ease/org.eclipse.ease.ui.test/0.8.0-SNAPSHOT/org.eclipse.ease.ui.test-0.8.0-SNAPSHOT.pom
00:00:10 [2021-05-29T04:00:10.753Z] [INFO] Installing /home/jenkins/agent/workspace/ease.verify.core.target.2018-12/tests/org.eclipse.ease.ui.test/target/p2content.xml to /home/jenkins/.m2/repository/org/eclipse/ease/org.eclipse.ease.ui.test/0.8.0-SNAPSHOT/org.eclipse.ease.ui.test-0.8.0-SNAPSHOT-p2metadata.xml
00:00:11 [2021-05-29T04:00:11.011Z] [INFO] Installing /home/jenkins/agent/workspace/ease.verify.core.target.2018-12/tests/org.eclipse.ease.ui.test/target/p2artifacts.xml to /home/jenkins/.m2/repository/org/eclipse/ease/org.eclipse.ease.ui.test/0.8.0-SNAPSHOT/org.eclipse.ease.ui.test-0.8.0-SNAPSHOT-p2artifacts.xml
00:00:11 [2021-05-29T04:00:11.011Z] [INFO] 
00:00:11 [2021-05-29T04:00:11.011Z] [INFO] --- tycho-p2-plugin:2.2.0:update-local-index (default-update-local-index) @ org.eclipse.ease.ui.test ---
00:00:11 [2021-05-29T04:00:11.011Z] [INFO] 
00:00:11 [2021-05-29T04:00:11.011Z] [INFO] ---------< org.eclipse.ease:org.eclipse.ease.releng.coverage >----------
00:00:11 [2021-05-29T04:00:11.011Z] [INFO] Building org.eclipse.ease.releng.coverage 0.8.0-SNAPSHOT         [47/48]
00:00:11 [2021-05-29T04:00:11.011Z] [INFO] --------------------------------[ pom ]---------------------------------
00:00:11 [2021-05-29T04:00:11.011Z] [INFO] 
00:00:11 [2021-05-29T04:00:11.011Z] [INFO] --- maven-clean-plugin:2.5:clean (default-clean) @ org.eclipse.ease.releng.coverage ---
00:00:11 [2021-05-29T04:00:11.011Z] [INFO] 
00:00:11 [2021-05-29T04:00:11.011Z] [INFO] --- jacoco-maven-plugin:0.8.6:report-aggregate (default) @ org.eclipse.ease.releng.coverage ---
00:00:11 [2021-05-29T04:00:11.011Z] [INFO] Loading execution data file /home/jenkins/agent/workspace/ease.verify.core.target.2018-12/tests/org.eclipse.ease.test/target/jacoco.exec
00:00:11 [2021-05-29T04:00:11.288Z] [INFO] Loading execution data file /home/jenkins/agent/workspace/ease.verify.core.target.2018-12/tests/org.eclipse.ease.lang.javascript.rhino.test/target/jacoco.exec
00:00:11 [2021-05-29T04:00:11.288Z] [INFO] Loading execution data file /home/jenkins/agent/workspace/ease.verify.core.target.2018-12/tests/org.eclipse.ease.lang.javascript.test/target/jacoco.exec
00:00:11 [2021-05-29T04:00:11.288Z] [INFO] Loading execution data file /home/jenkins/agent/workspace/ease.verify.core.target.2018-12/tests/org.eclipse.ease.lang.python.test/target/jacoco.exec
00:00:11 [2021-05-29T04:00:11.288Z] [INFO] Loading execution data file /home/jenkins/agent/workspace/ease.verify.core.target.2018-12/tests/org.eclipse.ease.lang.python.jython.test/target/jacoco.exec
00:00:11 [2021-05-29T04:00:11.288Z] [INFO] Loading execution data file /home/jenkins/agent/workspace/ease.verify.core.target.2018-12/tests/org.eclipse.ease.lang.scriptarchive.test/target/jacoco.exec
00:00:11 [2021-05-29T04:00:11.288Z] [INFO] Loading execution data file /home/jenkins/agent/workspace/ease.verify.core.target.2018-12/tests/org.eclipse.ease.ui.scripts.test/target/jacoco.exec
00:00:11 [2021-05-29T04:00:11.288Z] [INFO] Loading execution data file /home/jenkins/agent/workspace/ease.verify.core.target.2018-12/tests/org.eclipse.ease.ui.test/target/jacoco.exec
00:00:11 [2021-05-29T04:00:11.546Z] [INFO] Analyzed bundle 'org.eclipse.ease' with 106 classes
00:00:11 [2021-05-29T04:00:11.803Z] [INFO] Analyzed bundle 'org.eclipse.ease.classloader' with 1 classes
00:00:12 [2021-05-29T04:00:12.089Z] [INFO] Analyzed bundle 'org.eclipse.ease.ui' with 211 classes
00:00:12 [2021-05-29T04:00:12.653Z] [INFO] Analyzed bundle 'org.eclipse.ease.ui.completions.java' with 13 classes
00:00:12 [2021-05-29T04:00:12.653Z] [INFO] Analyzed bundle 'org.eclipse.ease.ui.scripts' with 157 classes
00:00:13 [2021-05-29T04:00:13.250Z] [INFO] Analyzed bundle 'org.eclipse.ease.help' with 0 classes
00:00:13 [2021-05-29T04:00:13.250Z] [INFO] Analyzed bundle 'org.eclipse.ease.lang.javascript' with 4 classes
00:00:13 [2021-05-29T04:00:13.250Z] [INFO] Analyzed bundle 'org.eclipse.ease.lang.javascript.ui' with 4 classes
00:00:13 [2021-05-29T04:00:13.250Z] [INFO] Analyzed bundle 'org.eclipse.ease.lang.javascript.rhino' with 21 classes
00:00:13 [2021-05-29T04:00:13.250Z] [INFO] Analyzed bundle 'org.eclipse.ease.lang.javascript.nashorn' with 2 classes
00:00:13 [2021-05-29T04:00:13.250Z] [INFO] Analyzed bundle 'org.eclipse.ease.lang.python' with 21 classes
00:00:13 [2021-05-29T04:00:13.250Z] [INFO] Analyzed bundle 'org.eclipse.ease.lang.python.jython' with 13 classes
00:00:13 [2021-05-29T04:00:13.250Z] [INFO] Analyzed bundle 'org.eclipse.ease.lang.python.py4j' with 11 classes
00:00:13 [2021-05-29T04:00:13.250Z] [INFO] Analyzed bundle 'org.eclipse.ease.lang.jvm.compiled' with 2 classes
00:00:13 [2021-05-29T04:00:13.250Z] [INFO] Analyzed bundle 'org.eclipse.ease.lang.groovy' with 3 classes
00:00:13 [2021-05-29T04:00:13.250Z] [INFO] Analyzed bundle 'org.eclipse.ease.lang.groovy.interpreter' with 3 classes
00:00:13 [2021-05-29T04:00:13.250Z] [INFO] Analyzed bundle 'org.eclipse.ease.lang.ruby' with 3 classes
00:00:13 [2021-05-29T04:00:13.250Z] [INFO] Analyzed bundle 'org.eclipse.ease.lang.ruby.jruby' with 2 classes
00:00:13 [2021-05-29T04:00:13.250Z] [INFO] Analyzed bundle 'org.eclipse.ease.lang.scriptarchive' with 3 classes
00:00:13 [2021-05-29T04:00:13.251Z] [INFO] Analyzed bundle 'org.eclipse.ease.lang.scriptarchive.ui' with 8 classes
00:00:13 [2021-05-29T04:00:13.251Z] [INFO] Analyzed bundle 'org.eclipse.ease.lang.unittest' with 50 classes
00:00:13 [2021-05-29T04:00:13.508Z] [INFO] Analyzed bundle 'org.eclipse.ease.lang.unittest.ui' with 79 classes
00:00:13 [2021-05-29T04:00:13.508Z] [INFO] 
00:00:13 [2021-05-29T04:00:13.508Z] [INFO] --- maven-install-plugin:2.4:install (default-install) @ org.eclipse.ease.releng.coverage ---
00:00:13 [2021-05-29T04:00:13.508Z] [INFO] Installing /home/jenkins/agent/workspace/ease.verify.core.target.2018-12/releng/org.eclipse.ease.releng.coverage/pom.xml to /home/jenkins/.m2/repository/org/eclipse/ease/org.eclipse.ease.releng.coverage/0.8.0-SNAPSHOT/org.eclipse.ease.releng.coverage-0.8.0-SNAPSHOT.pom
00:00:13 [2021-05-29T04:00:13.508Z] [INFO] 
00:00:13 [2021-05-29T04:00:13.508Z] [INFO] ---------------------< org.eclipse.ease:ease.core >---------------------
00:00:13 [2021-05-29T04:00:13.508Z] [INFO] Building EASE (Incubation) 0.4.0-SNAPSHOT                        [48/48]
00:00:13 [2021-05-29T04:00:13.508Z] [INFO] --------------------------------[ pom ]---------------------------------
00:00:13 [2021-05-29T04:00:13.765Z] [INFO] 
00:00:13 [2021-05-29T04:00:13.765Z] [INFO] --- maven-clean-plugin:2.5:clean (default-clean) @ ease.core ---
00:00:14 [2021-05-29T04:00:14.022Z] [INFO] 
00:00:14 [2021-05-29T04:00:14.022Z] [INFO] --- maven-install-plugin:2.4:install (default-install) @ ease.core ---
00:00:14 [2021-05-29T04:00:14.279Z] [INFO] Installing /home/jenkins/agent/workspace/ease.verify.core.target.2018-12/pom.xml to /home/jenkins/.m2/repository/org/eclipse/ease/ease.core/0.4.0-SNAPSHOT/ease.core-0.4.0-SNAPSHOT.pom
00:00:14 [2021-05-29T04:00:14.279Z] [INFO] ------------------------------------------------------------------------
00:00:14 [2021-05-29T04:00:14.279Z] [INFO] Reactor Summary:
00:00:14 [2021-05-29T04:00:14.279Z] [INFO] 
00:00:14 [2021-05-29T04:00:14.279Z] [INFO] org.eclipse.ease.classloader 0.8.0-SNAPSHOT ........ SUCCESS [01:59 min]
00:00:14 [2021-05-29T04:00:14.279Z] [INFO] org.eclipse.ease 0.8.0-SNAPSHOT .................... SUCCESS [ 24.218 s]
00:00:14 [2021-05-29T04:00:14.279Z] [INFO] org.eclipse.ease.ui 0.8.0-SNAPSHOT ................. SUCCESS [ 23.447 s]
00:00:14 [2021-05-29T04:00:14.279Z] [INFO] org.eclipse.ease.ui.completions.java 0.8.0-SNAPSHOT  SUCCESS [  9.681 s]
00:00:14 [2021-05-29T04:00:14.279Z] [INFO] org.eclipse.ease.ui.scripts 0.8.0-SNAPSHOT ......... SUCCESS [ 20.512 s]
00:00:14 [2021-05-29T04:00:14.279Z] [INFO] org.eclipse.ease.releng 0.8.0-SNAPSHOT ............. SUCCESS [  3.154 s]
00:00:14 [2021-05-29T04:00:14.279Z] [INFO] org.eclipse.ease.lang.javascript 0.8.0-SNAPSHOT .... SUCCESS [  7.025 s]
00:00:14 [2021-05-29T04:00:14.279Z] [INFO] org.eclipse.ease.lang.scriptarchive 0.8.0-SNAPSHOT . SUCCESS [  6.199 s]
00:00:14 [2021-05-29T04:00:14.279Z] [INFO] org.eclipse.ease.lang.python 0.8.0-SNAPSHOT ........ SUCCESS [  8.947 s]
00:00:14 [2021-05-29T04:00:14.279Z] [INFO] org.eclipse.ease.lang.python.py4j 0.8.0-SNAPSHOT ... SUCCESS [  9.496 s]
00:00:14 [2021-05-29T04:00:14.279Z] [INFO] org.eclipse.ease.lang.groovy 0.8.0-SNAPSHOT ........ SUCCESS [  6.229 s]
00:00:14 [2021-05-29T04:00:14.279Z] [INFO] org.eclipse.ease.lang.groovy.interpreter 0.8.0-SNAPSHOT SUCCESS [  6.153 s]
00:00:14 [2021-05-29T04:00:14.279Z] [INFO] org.eclipse.ease.lang.unittest 0.8.0-SNAPSHOT ...... SUCCESS [ 11.647 s]
00:00:14 [2021-05-29T04:00:14.279Z] [INFO] org.eclipse.ease.lang.unittest.ui 0.8.0-SNAPSHOT ... SUCCESS [ 15.625 s]
00:00:14 [2021-05-29T04:00:14.279Z] [INFO] org.eclipse.ease.lang.ruby 0.8.0-SNAPSHOT .......... SUCCESS [  5.875 s]
00:00:14 [2021-05-29T04:00:14.279Z] [INFO] org.eclipse.ease.lang.ruby.jruby 0.8.0-SNAPSHOT .... SUCCESS [  7.082 s]
00:00:14 [2021-05-29T04:00:14.279Z] [INFO] org.eclipse.ease.lang.javascript.nashorn 0.8.0-SNAPSHOT SUCCESS [  7.279 s]
00:00:14 [2021-05-29T04:00:14.280Z] [INFO] org.eclipse.ease.lang.javascript.rhino 0.8.0-SNAPSHOT SUCCESS [  9.376 s]
00:00:14 [2021-05-29T04:00:14.280Z] [INFO] org.eclipse.ease.lang.python.jython 0.8.0-SNAPSHOT . SUCCESS [  9.559 s]
00:00:14 [2021-05-29T04:00:14.280Z] [INFO] org.eclipse.ease.lang.javascript.ui 0.8.0-SNAPSHOT . SUCCESS [  8.086 s]
00:00:14 [2021-05-29T04:00:14.280Z] [INFO] org.eclipse.ease.lang.jvm.compiled 0.8.0-SNAPSHOT .. SUCCESS [ 11.139 s]
00:00:14 [2021-05-29T04:00:14.280Z] [INFO] org.eclipse.ease.lang.scriptarchive.ui 0.8.0-SNAPSHOT SUCCESS [ 11.988 s]
00:00:14 [2021-05-29T04:00:14.280Z] [INFO] org.eclipse.ease.help 0.8.0-SNAPSHOT ............... SUCCESS [ 10.251 s]
00:00:14 [2021-05-29T04:00:14.280Z] [INFO] org.eclipse.ease.feature 0.8.0-SNAPSHOT ............ SUCCESS [  4.357 s]
00:00:14 [2021-05-29T04:00:14.280Z] [INFO] org.eclipse.ease.ui.feature 0.8.0-SNAPSHOT ......... SUCCESS [  2.866 s]
00:00:14 [2021-05-29T04:00:14.280Z] [INFO] org.eclipse.ease.lang.javascript.feature 0.8.0-SNAPSHOT SUCCESS [  1.282 s]
00:00:14 [2021-05-29T04:00:14.280Z] [INFO] org.eclipse.ease.lang.python.feature 0.8.0-SNAPSHOT  SUCCESS [ 19.318 s]
00:00:14 [2021-05-29T04:00:14.280Z] [INFO] org.eclipse.ease.python.jython.feature 0.8.0-SNAPSHOT SUCCESS [  2.185 s]
00:00:14 [2021-05-29T04:00:14.280Z] [INFO] org.eclipse.ease.lang.python.py4j.feature 0.8.0-SNAPSHOT SUCCESS [  1.789 s]
00:00:14 [2021-05-29T04:00:14.280Z] [INFO] org.eclipse.ease.lang.jvm.feature 0.8.0-SNAPSHOT ... SUCCESS [  1.972 s]
00:00:14 [2021-05-29T04:00:14.280Z] [INFO] org.eclipse.ease.lang.groovy.feature 0.8.0-SNAPSHOT  SUCCESS [  2.769 s]
00:00:14 [2021-05-29T04:00:14.280Z] [INFO] org.eclipse.ease.lang.ruby.feature 0.8.0-SNAPSHOT .. SUCCESS [  1.996 s]
00:00:14 [2021-05-29T04:00:14.280Z] [INFO] org.eclipse.ease.lang.scriptarchive.feature 0.8.0-SNAPSHOT SUCCESS [  1.956 s]
00:00:14 [2021-05-29T04:00:14.280Z] [INFO] org.eclipse.ease.lang.unittest.feature 0.8.0-SNAPSHOT SUCCESS [  3.308 s]
00:00:14 [2021-05-29T04:00:14.280Z] [INFO] org.eclipse.ease.releng.target 0.8.0-SNAPSHOT ...... SUCCESS [  0.165 s]
00:00:14 [2021-05-29T04:00:14.280Z] [INFO] org.eclipse.ease.releng.p2 0.8.0-SNAPSHOT .......... SUCCESS [ 39.919 s]
00:00:14 [2021-05-29T04:00:14.280Z] [INFO] org.eclipse.ease.testhelper 0.8.0-SNAPSHOT ......... SUCCESS [ 28.556 s]
00:00:14 [2021-05-29T04:00:14.280Z] [INFO] org.eclipse.ease.test 0.8.0-SNAPSHOT ............... SUCCESS [ 33.358 s]
00:00:14 [2021-05-29T04:00:14.280Z] [INFO] org.eclipse.ease.lang.javascript.rhino.test 0.8.0-SNAPSHOT SUCCESS [ 29.014 s]
00:00:14 [2021-05-29T04:00:14.280Z] [INFO] org.eclipse.ease.lang.javascript.test 0.8.0-SNAPSHOT SUCCESS [ 15.461 s]
00:00:14 [2021-05-29T04:00:14.280Z] [INFO] org.eclipse.ease.lang.python.test 0.8.0-SNAPSHOT ... SUCCESS [  9.394 s]
00:00:14 [2021-05-29T04:00:14.280Z] [INFO] org.eclipse.ease.lang.python.jython.test 0.8.0-SNAPSHOT SUCCESS [ 28.016 s]
00:00:14 [2021-05-29T04:00:14.280Z] [INFO] org.eclipse.ease.lang.scriptarchive.test 0.8.0-SNAPSHOT SUCCESS [ 12.151 s]
00:00:14 [2021-05-29T04:00:14.280Z] [INFO] org.eclipse.ease.lang.unittest.test 0.8.0-SNAPSHOT . SUCCESS [  7.800 s]
00:00:14 [2021-05-29T04:00:14.280Z] [INFO] org.eclipse.ease.ui.scripts.test 0.8.0-SNAPSHOT .... SUCCESS [  9.583 s]
00:00:14 [2021-05-29T04:00:14.280Z] [INFO] org.eclipse.ease.ui.test 0.8.0-SNAPSHOT ............ SUCCESS [ 13.403 s]
00:00:14 [2021-05-29T04:00:14.280Z] [INFO] org.eclipse.ease.releng.coverage 0.8.0-SNAPSHOT .... SUCCESS [  2.542 s]
00:00:14 [2021-05-29T04:00:14.280Z] [INFO] EASE (Incubation) 0.4.0-SNAPSHOT ................... SUCCESS [  0.834 s]
00:00:14 [2021-05-29T04:00:14.280Z] [INFO] ------------------------------------------------------------------------
00:00:14 [2021-05-29T04:00:14.280Z] [INFO] BUILD SUCCESS
00:00:14 [2021-05-29T04:00:14.280Z] [INFO] ------------------------------------------------------------------------
00:00:14 [2021-05-29T04:00:14.280Z] [INFO] Total time:  14:17 min
00:00:14 [2021-05-29T04:00:14.280Z] [INFO] Finished at: 2021-05-29T04:00:14Z
00:00:14 [2021-05-29T04:00:14.280Z] [INFO] ------------------------------------------------------------------------
00:00:14 [2021-05-29T04:00:14.280Z] [INFO] [jenkins-event-spy] Generated /home/jenkins/agent/workspace/ease.verify.core.target.2018-12@tmp/withMaven984a5d0d/maven-spy-20210529-034557-10810198260668020640233.log