SuccessConsole Output

Skipping 274 KB.. Full Log
e.ease.lang.python.test/target/work/data, -install, /home/jenkins/agent/workspace/ease.verify.core.target.2018-12/tests/org.eclipse.ease.lang.python.test/target/work, -configuration, /home/jenkins/agent/workspace/ease.verify.core.target.2018-12/tests/org.eclipse.ease.lang.python.test/target/work/configuration, -application, org.eclipse.tycho.surefire.osgibooter.headlesstest, -testproperties, /home/jenkins/agent/workspace/ease.verify.core.target.2018-12/tests/org.eclipse.ease.lang.python.test/target/surefire.properties]
23:58:55 [2021-05-22T03:58:55.946Z] Picked up JAVA_TOOL_OPTIONS: -Dmaven.ext.class.path="/home/jenkins/agent/workspace/ease.verify.core.target.2018-12@tmp/withMaven712aadef/pipeline-maven-spy.jar" -Dorg.jenkinsci.plugins.pipeline.maven.reportsFolder="/home/jenkins/agent/workspace/ease.verify.core.target.2018-12@tmp/withMaven712aadef" 
23:59:00 [2021-05-22T03:59:00.185Z] May 22, 2021 3:58:59 AM org.junit.platform.launcher.core.DefaultLauncher handleThrowable
23:59:00 [2021-05-22T03:59:00.185Z] WARNING: TestEngine with ID 'junit-vintage' failed to discover tests
23:59:00 [2021-05-22T03:59:00.185Z] java.lang.NoClassDefFoundError: org/junit/runners/model/RunnerBuilder
23:59:00 [2021-05-22T03:59:00.186Z] 	at org.junit.vintage.engine.discovery.VintageDiscoverer.<init>(VintageDiscoverer.java:48)
23:59:00 [2021-05-22T03:59:00.186Z] 	at org.junit.vintage.engine.VintageTestEngine.discover(VintageTestEngine.java:65)
23:59:00 [2021-05-22T03:59:00.186Z] 	at org.junit.platform.launcher.core.DefaultLauncher.discoverEngineRoot(DefaultLauncher.java:130)
23:59:00 [2021-05-22T03:59:00.186Z] 	at org.junit.platform.launcher.core.DefaultLauncher.discoverRoot(DefaultLauncher.java:117)
23:59:00 [2021-05-22T03:59:00.186Z] 	at org.junit.platform.launcher.core.DefaultLauncher.discover(DefaultLauncher.java:82)
23:59:00 [2021-05-22T03:59:00.186Z] 	at org.apache.maven.surefire.junitplatform.TestPlanScannerFilter.accept(TestPlanScannerFilter.java:56)
23:59:00 [2021-05-22T03:59:00.186Z] 	at org.apache.maven.surefire.util.DefaultScanResult.applyFilter(DefaultScanResult.java:102)
23:59:00 [2021-05-22T03:59:00.186Z] 	at org.apache.maven.surefire.junitplatform.JUnitPlatformProvider.scanClasspath(JUnitPlatformProvider.java:143)
23:59:00 [2021-05-22T03:59:00.186Z] 	at org.apache.maven.surefire.junitplatform.JUnitPlatformProvider.invoke(JUnitPlatformProvider.java:124)
23:59:00 [2021-05-22T03:59:00.186Z] 	at java.base/jdk.internal.reflect.NativeMethodAccessorImpl.invoke0(Native Method)
23:59:00 [2021-05-22T03:59:00.186Z] 	at java.base/jdk.internal.reflect.NativeMethodAccessorImpl.invoke(NativeMethodAccessorImpl.java:64)
23:59:00 [2021-05-22T03:59:00.186Z] 	at java.base/jdk.internal.reflect.DelegatingMethodAccessorImpl.invoke(DelegatingMethodAccessorImpl.java:43)
23:59:00 [2021-05-22T03:59:00.186Z] 	at java.base/java.lang.reflect.Method.invoke(Method.java:564)
23:59:00 [2021-05-22T03:59:00.186Z] 	at org.apache.maven.surefire.util.ReflectionUtils.invokeMethodWithArray2(ReflectionUtils.java:206)
23:59:00 [2021-05-22T03:59:00.186Z] 	at org.apache.maven.surefire.booter.ProviderFactory$ProviderProxy.invoke(ProviderFactory.java:161)
23:59:00 [2021-05-22T03:59:00.186Z] 	at org.apache.maven.surefire.booter.ProviderFactory.invokeProvider(ProviderFactory.java:84)
23:59:00 [2021-05-22T03:59:00.186Z] 	at org.eclipse.tycho.surefire.osgibooter.OsgiSurefireBooter.run(OsgiSurefireBooter.java:116)
23:59:00 [2021-05-22T03:59:00.186Z] 	at org.eclipse.tycho.surefire.osgibooter.HeadlessTestApplication.start(HeadlessTestApplication.java:23)
23:59:00 [2021-05-22T03:59:00.186Z] 	at org.eclipse.equinox.internal.app.EclipseAppHandle.run(EclipseAppHandle.java:203)
23:59:00 [2021-05-22T03:59:00.186Z] 	at org.eclipse.core.runtime.internal.adaptor.EclipseAppLauncher.runApplication(EclipseAppLauncher.java:137)
23:59:00 [2021-05-22T03:59:00.186Z] 	at org.eclipse.core.runtime.internal.adaptor.EclipseAppLauncher.start(EclipseAppLauncher.java:107)
23:59:00 [2021-05-22T03:59:00.186Z] 	at org.eclipse.core.runtime.adaptor.EclipseStarter.run(EclipseStarter.java:400)
23:59:00 [2021-05-22T03:59:00.186Z] 	at org.eclipse.core.runtime.adaptor.EclipseStarter.run(EclipseStarter.java:255)
23:59:00 [2021-05-22T03:59:00.186Z] 	at java.base/jdk.internal.reflect.NativeMethodAccessorImpl.invoke0(Native Method)
23:59:00 [2021-05-22T03:59:00.186Z] 	at java.base/jdk.internal.reflect.NativeMethodAccessorImpl.invoke(NativeMethodAccessorImpl.java:64)
23:59:00 [2021-05-22T03:59:00.186Z] 	at java.base/jdk.internal.reflect.DelegatingMethodAccessorImpl.invoke(DelegatingMethodAccessorImpl.java:43)
23:59:00 [2021-05-22T03:59:00.186Z] 	at java.base/java.lang.reflect.Method.invoke(Method.java:564)
23:59:00 [2021-05-22T03:59:00.186Z] 	at org.eclipse.equinox.launcher.Main.invokeFramework(Main.java:659)
23:59:00 [2021-05-22T03:59:00.186Z] 	at org.eclipse.equinox.launcher.Main.basicRun(Main.java:595)
23:59:00 [2021-05-22T03:59:00.186Z] 	at org.eclipse.equinox.launcher.Main.run(Main.java:1501)
23:59:00 [2021-05-22T03:59:00.186Z] 	at org.eclipse.equinox.launcher.Main.main(Main.java:1474)
23:59:00 [2021-05-22T03:59:00.186Z] Caused by: java.lang.ClassNotFoundException: org.junit.runners.model.RunnerBuilder cannot be found by org.eclipse.tycho.surefire.osgibooter_2.2.0
23:59:00 [2021-05-22T03:59:00.186Z] 	at org.eclipse.osgi.internal.loader.BundleLoader.findClassInternal(BundleLoader.java:511)
23:59:00 [2021-05-22T03:59:00.186Z] 	at org.eclipse.osgi.internal.loader.BundleLoader.findClass(BundleLoader.java:422)
23:59:00 [2021-05-22T03:59:00.186Z] 	at org.eclipse.osgi.internal.loader.BundleLoader.findClass(BundleLoader.java:414)
23:59:00 [2021-05-22T03:59:00.186Z] 	at org.eclipse.osgi.internal.loader.ModuleClassLoader.loadClass(ModuleClassLoader.java:153)
23:59:00 [2021-05-22T03:59:00.186Z] 	at java.base/java.lang.ClassLoader.loadClass(ClassLoader.java:522)
23:59:00 [2021-05-22T03:59:00.186Z] 	... 31 more
23:59:00 [2021-05-22T03:59:00.186Z] 
23:59:00 [2021-05-22T03:59:00.186Z] May 22, 2021 3:58:59 AM org.junit.platform.launcher.core.DefaultLauncher handleThrowable
23:59:00 [2021-05-22T03:59:00.186Z] WARNING: TestEngine with ID 'junit-vintage' failed to discover tests
23:59:00 [2021-05-22T03:59:00.186Z] java.lang.NoClassDefFoundError: org/junit/runners/model/RunnerBuilder
23:59:00 [2021-05-22T03:59:00.186Z] 	at org.junit.vintage.engine.discovery.VintageDiscoverer.<init>(VintageDiscoverer.java:48)
23:59:00 [2021-05-22T03:59:00.186Z] 	at org.junit.vintage.engine.VintageTestEngine.discover(VintageTestEngine.java:65)
23:59:00 [2021-05-22T03:59:00.186Z] 	at org.junit.platform.launcher.core.DefaultLauncher.discoverEngineRoot(DefaultLauncher.java:130)
23:59:00 [2021-05-22T03:59:00.186Z] 	at org.junit.platform.launcher.core.DefaultLauncher.discoverRoot(DefaultLauncher.java:117)
23:59:00 [2021-05-22T03:59:00.186Z] 	at org.junit.platform.launcher.core.DefaultLauncher.execute(DefaultLauncher.java:90)
23:59:00 [2021-05-22T03:59:00.186Z] 	at org.apache.maven.surefire.junitplatform.JUnitPlatformProvider.invokeAllTests(JUnitPlatformProvider.java:150)
23:59:00 [2021-05-22T03:59:00.186Z] 	at org.apache.maven.surefire.junitplatform.JUnitPlatformProvider.invoke(JUnitPlatformProvider.java:124)
23:59:00 [2021-05-22T03:59:00.186Z] 	at java.base/jdk.internal.reflect.NativeMethodAccessorImpl.invoke0(Native Method)
23:59:00 [2021-05-22T03:59:00.186Z] 	at java.base/jdk.internal.reflect.NativeMethodAccessorImpl.invoke(NativeMethodAccessorImpl.java:64)
23:59:00 [2021-05-22T03:59:00.186Z] 	at java.base/jdk.internal.reflect.DelegatingMethodAccessorImpl.invoke(DelegatingMethodAccessorImpl.java:43)
23:59:00 [2021-05-22T03:59:00.186Z] 	at java.base/java.lang.reflect.Method.invoke(Method.java:564)
23:59:00 [2021-05-22T03:59:00.186Z] 	at org.apache.maven.surefire.util.ReflectionUtils.invokeMethodWithArray2(ReflectionUtils.java:206)
23:59:00 [2021-05-22T03:59:00.186Z] 	at org.apache.maven.surefire.booter.ProviderFactory$ProviderProxy.invoke(ProviderFactory.java:161)
23:59:00 [2021-05-22T03:59:00.186Z] 	at org.apache.maven.surefire.booter.ProviderFactory.invokeProvider(ProviderFactory.java:84)
23:59:00 [2021-05-22T03:59:00.187Z] 	at org.eclipse.tycho.surefire.osgibooter.OsgiSurefireBooter.run(OsgiSurefireBooter.java:116)
23:59:00 [2021-05-22T03:59:00.187Z] 	at org.eclipse.tycho.surefire.osgibooter.HeadlessTestApplication.start(HeadlessTestApplication.java:23)
23:59:00 [2021-05-22T03:59:00.187Z] 	at org.eclipse.equinox.internal.app.EclipseAppHandle.run(EclipseAppHandle.java:203)
23:59:00 [2021-05-22T03:59:00.187Z] 	at org.eclipse.core.runtime.internal.adaptor.EclipseAppLauncher.runApplication(EclipseAppLauncher.java:137)
23:59:00 [2021-05-22T03:59:00.187Z] 	at org.eclipse.core.runtime.internal.adaptor.EclipseAppLauncher.start(EclipseAppLauncher.java:107)
23:59:00 [2021-05-22T03:59:00.187Z] 	at org.eclipse.core.runtime.adaptor.EclipseStarter.run(EclipseStarter.java:400)
23:59:00 [2021-05-22T03:59:00.187Z] 	at org.eclipse.core.runtime.adaptor.EclipseStarter.run(EclipseStarter.java:255)
23:59:00 [2021-05-22T03:59:00.187Z] 	at java.base/jdk.internal.reflect.NativeMethodAccessorImpl.invoke0(Native Method)
23:59:00 [2021-05-22T03:59:00.187Z] 	at java.base/jdk.internal.reflect.NativeMethodAccessorImpl.invoke(NativeMethodAccessorImpl.java:64)
23:59:00 [2021-05-22T03:59:00.187Z] 	at java.base/jdk.internal.reflect.DelegatingMethodAccessorImpl.invoke(DelegatingMethodAccessorImpl.java:43)
23:59:00 [2021-05-22T03:59:00.187Z] 	at java.base/java.lang.reflect.Method.invoke(Method.java:564)
23:59:00 [2021-05-22T03:59:00.187Z] 	at org.eclipse.equinox.launcher.Main.invokeFramework(Main.java:659)
23:59:00 [2021-05-22T03:59:00.187Z] 	at org.eclipse.equinox.launcher.Main.basicRun(Main.java:595)
23:59:00 [2021-05-22T03:59:00.187Z] 	at org.eclipse.equinox.launcher.Main.run(Main.java:1501)
23:59:00 [2021-05-22T03:59:00.187Z] 	at org.eclipse.equinox.launcher.Main.main(Main.java:1474)
23:59:00 [2021-05-22T03:59:00.187Z] Caused by: java.lang.ClassNotFoundException: org.junit.runners.model.RunnerBuilder cannot be found by org.eclipse.tycho.surefire.osgibooter_2.2.0
23:59:00 [2021-05-22T03:59:00.187Z] 	at org.eclipse.osgi.internal.loader.BundleLoader.findClassInternal(BundleLoader.java:511)
23:59:00 [2021-05-22T03:59:00.187Z] 	at org.eclipse.osgi.internal.loader.BundleLoader.findClass(BundleLoader.java:422)
23:59:00 [2021-05-22T03:59:00.187Z] 	at org.eclipse.osgi.internal.loader.BundleLoader.findClass(BundleLoader.java:414)
23:59:00 [2021-05-22T03:59:00.187Z] 	at org.eclipse.osgi.internal.loader.ModuleClassLoader.loadClass(ModuleClassLoader.java:153)
23:59:00 [2021-05-22T03:59:00.187Z] 	at java.base/java.lang.ClassLoader.loadClass(ClassLoader.java:522)
23:59:00 [2021-05-22T03:59:00.187Z] 	... 29 more
23:59:00 [2021-05-22T03:59:00.187Z] 
23:59:00 [2021-05-22T03:59:00.187Z] Running org.eclipse.ease.lang.python.PythonCodeFactoryTest
23:59:00 [2021-05-22T03:59:00.752Z] Tests run: 3, Failures: 0, Errors: 0, Skipped: 0, Time elapsed: 1.159 s - in org.eclipse.ease.lang.python.PythonCodeFactoryTest
23:59:00 [2021-05-22T03:59:00.752Z] createFunctionWrapper_creates_return_andParameters_for_Py4J  Time elapsed: 1.147 s
23:59:00 [2021-05-22T03:59:00.752Z] testCommentCreator  Time elapsed: 0.001 s
23:59:00 [2021-05-22T03:59:00.752Z] createFunctionWrapper_creates_void_return_types_for_Py4J  Time elapsed: 0.002 s
23:59:00 [2021-05-22T03:59:00.752Z] 
23:59:00 [2021-05-22T03:59:00.752Z] Results:
23:59:00 [2021-05-22T03:59:00.752Z] 
23:59:00 [2021-05-22T03:59:00.753Z] Tests run: 3, Failures: 0, Errors: 0, Skipped: 0
23:59:00 [2021-05-22T03:59:00.753Z] 
23:59:01 [2021-05-22T03:59:01.732Z] [INFO] All tests passed!
23:59:01 [2021-05-22T03:59:01.732Z] [INFO] 
23:59:01 [2021-05-22T03:59:01.732Z] [INFO] -----< org.eclipse.ease:org.eclipse.ease.lang.python.jython.test >------
23:59:01 [2021-05-22T03:59:01.732Z] [INFO] Building org.eclipse.ease.lang.python.jython.test 0.8.0-SNAPSHOT   [7/9]
23:59:01 [2021-05-22T03:59:01.732Z] [INFO] ------------------------[ eclipse-test-plugin ]-------------------------
23:59:01 [2021-05-22T03:59:01.732Z] [INFO] 
23:59:01 [2021-05-22T03:59:01.732Z] [INFO] --- tycho-packaging-plugin:2.2.0:build-qualifier (default-build-qualifier) @ org.eclipse.ease.lang.python.jython.test ---
23:59:01 [2021-05-22T03:59:01.732Z] [INFO] The project's OSGi version is 0.8.0.I202104091518
23:59:01 [2021-05-22T03:59:01.732Z] [INFO] 
23:59:01 [2021-05-22T03:59:01.732Z] [INFO] --- tycho-packaging-plugin:2.2.0:validate-id (default-validate-id) @ org.eclipse.ease.lang.python.jython.test ---
23:59:01 [2021-05-22T03:59:01.732Z] [INFO] 
23:59:01 [2021-05-22T03:59:01.732Z] [INFO] --- tycho-packaging-plugin:2.2.0:validate-version (default-validate-version) @ org.eclipse.ease.lang.python.jython.test ---
23:59:01 [2021-05-22T03:59:01.732Z] [INFO] 
23:59:01 [2021-05-22T03:59:01.732Z] [INFO] --- maven-resources-plugin:2.4.3:resources (default-resources) @ org.eclipse.ease.lang.python.jython.test ---
23:59:01 [2021-05-22T03:59:01.732Z] [INFO] Using 'UTF-8' encoding to copy filtered resources.
23:59:01 [2021-05-22T03:59:01.732Z] [INFO] skip non existing resourceDirectory /home/jenkins/agent/workspace/ease.verify.core.target.2018-12/tests/org.eclipse.ease.lang.python.jython.test/src/main/resources
23:59:01 [2021-05-22T03:59:01.732Z] [INFO] 
23:59:01 [2021-05-22T03:59:01.732Z] [INFO] --- tycho-compiler-plugin:2.2.0:compile (default-compile) @ org.eclipse.ease.lang.python.jython.test ---
23:59:01 [2021-05-22T03:59:01.732Z] [INFO] Nothing to compile - all classes are up to date
23:59:01 [2021-05-22T03:59:01.732Z] [INFO] 
23:59:01 [2021-05-22T03:59:01.732Z] [INFO] --- maven-resources-plugin:2.4.3:testResources (default-testResources) @ org.eclipse.ease.lang.python.jython.test ---
23:59:01 [2021-05-22T03:59:01.732Z] [INFO] Using 'UTF-8' encoding to copy filtered resources.
23:59:01 [2021-05-22T03:59:01.733Z] [INFO] skip non existing resourceDirectory /home/jenkins/agent/workspace/ease.verify.core.target.2018-12/tests/org.eclipse.ease.lang.python.jython.test/src/test/resources
23:59:01 [2021-05-22T03:59:01.733Z] [INFO] 
23:59:01 [2021-05-22T03:59:01.733Z] [INFO] --- target-platform-configuration:2.2.0:target-platform (default-target-platform) @ org.eclipse.ease.lang.python.jython.test ---
23:59:01 [2021-05-22T03:59:01.733Z] [INFO] 
23:59:01 [2021-05-22T03:59:01.733Z] [INFO] --- tycho-packaging-plugin:2.2.0:package-plugin (default-package-plugin) @ org.eclipse.ease.lang.python.jython.test ---
23:59:01 [2021-05-22T03:59:01.733Z] [INFO] Building jar: /home/jenkins/agent/workspace/ease.verify.core.target.2018-12/tests/org.eclipse.ease.lang.python.jython.test/target/org.eclipse.ease.lang.python.jython.test-0.8.0-SNAPSHOT.jar
23:59:01 [2021-05-22T03:59:01.733Z] [INFO] 
23:59:01 [2021-05-22T03:59:01.733Z] [INFO] --- tycho-p2-plugin:2.2.0:p2-metadata-default (default-p2-metadata-default) @ org.eclipse.ease.lang.python.jython.test ---
23:59:01 [2021-05-22T03:59:01.733Z] [INFO] 
23:59:01 [2021-05-22T03:59:01.733Z] [INFO] --- jacoco-maven-plugin:0.8.6:prepare-agent (jacoco-initialize) @ org.eclipse.ease.lang.python.jython.test ---
23:59:01 [2021-05-22T03:59:01.733Z] [INFO] tycho.testArgLine set to -javaagent:/home/jenkins/.m2/repository/org/jacoco/org.jacoco.agent/0.8.6/org.jacoco.agent-0.8.6-runtime.jar=destfile=/home/jenkins/agent/workspace/ease.verify.core.target.2018-12/tests/org.eclipse.ease.lang.python.jython.test/target/jacoco.exec,output=file
23:59:01 [2021-05-22T03:59:01.733Z] [INFO] 
23:59:01 [2021-05-22T03:59:01.733Z] [INFO] --- tycho-surefire-plugin:2.2.0:test (default-test) @ org.eclipse.ease.lang.python.jython.test ---
23:59:02 [2021-05-22T03:59:02.665Z] [INFO] Executing Test Runtime with timeout 0, logs (if any) will be placed at: /home/jenkins/agent/workspace/ease.verify.core.target.2018-12/tests/org.eclipse.ease.lang.python.jython.test/target/work/data/.metadata/.log
23:59:02 [2021-05-22T03:59:02.665Z] [INFO] Command line:
23:59:02 [2021-05-22T03:59:02.666Z] 	[/opt/tools/java/openjdk/jdk-15/15.0.2+7/bin/java, -Dosgi.noShutdown=false, -Dosgi.os=linux, -Dosgi.ws=gtk, -Dosgi.arch=x86_64, -javaagent:/home/jenkins/.m2/repository/org/jacoco/org.jacoco.agent/0.8.6/org.jacoco.agent-0.8.6-runtime.jar=destfile=/home/jenkins/agent/workspace/ease.verify.core.target.2018-12/tests/org.eclipse.ease.lang.python.jython.test/target/jacoco.exec,output=file, -Dosgi.clean=true, -jar, /home/jenkins/.m2/repository/p2/osgi/bundle/org.eclipse.equinox.launcher/1.5.200.v20180922-1751/org.eclipse.equinox.launcher-1.5.200.v20180922-1751.jar, -data, /home/jenkins/agent/workspace/ease.verify.core.target.2018-12/tests/org.eclipse.ease.lang.python.jython.test/target/work/data, -install, /home/jenkins/agent/workspace/ease.verify.core.target.2018-12/tests/org.eclipse.ease.lang.python.jython.test/target/work, -configuration, /home/jenkins/agent/workspace/ease.verify.core.target.2018-12/tests/org.eclipse.ease.lang.python.jython.test/target/work/configuration, -application, org.eclipse.tycho.surefire.osgibooter.headlesstest, -testproperties, /home/jenkins/agent/workspace/ease.verify.core.target.2018-12/tests/org.eclipse.ease.lang.python.jython.test/target/surefire.properties]
23:59:02 [2021-05-22T03:59:02.666Z] Picked up JAVA_TOOL_OPTIONS: -Dmaven.ext.class.path="/home/jenkins/agent/workspace/ease.verify.core.target.2018-12@tmp/withMaven712aadef/pipeline-maven-spy.jar" -Dorg.jenkinsci.plugins.pipeline.maven.reportsFolder="/home/jenkins/agent/workspace/ease.verify.core.target.2018-12@tmp/withMaven712aadef" 
23:59:06 [2021-05-22T03:59:06.845Z] WARNING: An illegal reflective access operation has occurred
23:59:06 [2021-05-22T03:59:06.845Z] WARNING: Illegal reflective access by org.python.core.PySystemState (file:/home/jenkins/agent/workspace/ease.verify.core.target.2018-12/tests/org.eclipse.ease.lang.python.jython.test/target/work/plugins/org.jython_2.7.0.I202104151016/jython.jar) to method java.io.Console.encoding()
23:59:06 [2021-05-22T03:59:06.845Z] WARNING: Please consider reporting this to the maintainers of org.python.core.PySystemState
23:59:06 [2021-05-22T03:59:06.845Z] WARNING: Use --illegal-access=warn to enable warnings of further illegal reflective access operations
23:59:06 [2021-05-22T03:59:06.845Z] WARNING: All illegal access operations will be denied in a future release
23:59:06 [2021-05-22T03:59:06.845Z] May 22, 2021 3:59:06 AM org.junit.platform.launcher.core.DefaultLauncher handleThrowable
23:59:06 [2021-05-22T03:59:06.845Z] WARNING: TestEngine with ID 'junit-vintage' failed to discover tests
23:59:06 [2021-05-22T03:59:06.845Z] java.lang.NoClassDefFoundError: org/junit/runners/model/RunnerBuilder
23:59:06 [2021-05-22T03:59:06.845Z] 	at org.junit.vintage.engine.discovery.VintageDiscoverer.<init>(VintageDiscoverer.java:48)
23:59:06 [2021-05-22T03:59:06.845Z] 	at org.junit.vintage.engine.VintageTestEngine.discover(VintageTestEngine.java:65)
23:59:06 [2021-05-22T03:59:06.845Z] 	at org.junit.platform.launcher.core.DefaultLauncher.discoverEngineRoot(DefaultLauncher.java:130)
23:59:06 [2021-05-22T03:59:06.845Z] 	at org.junit.platform.launcher.core.DefaultLauncher.discoverRoot(DefaultLauncher.java:117)
23:59:06 [2021-05-22T03:59:06.845Z] 	at org.junit.platform.launcher.core.DefaultLauncher.discover(DefaultLauncher.java:82)
23:59:06 [2021-05-22T03:59:06.845Z] 	at org.apache.maven.surefire.junitplatform.TestPlanScannerFilter.accept(TestPlanScannerFilter.java:56)
23:59:06 [2021-05-22T03:59:06.845Z] 	at org.apache.maven.surefire.util.DefaultScanResult.applyFilter(DefaultScanResult.java:102)
23:59:06 [2021-05-22T03:59:06.845Z] 	at org.apache.maven.surefire.junitplatform.JUnitPlatformProvider.scanClasspath(JUnitPlatformProvider.java:143)
23:59:06 [2021-05-22T03:59:06.845Z] 	at org.apache.maven.surefire.junitplatform.JUnitPlatformProvider.invoke(JUnitPlatformProvider.java:124)
23:59:06 [2021-05-22T03:59:06.845Z] 	at java.base/jdk.internal.reflect.NativeMethodAccessorImpl.invoke0(Native Method)
23:59:06 [2021-05-22T03:59:06.845Z] 	at java.base/jdk.internal.reflect.NativeMethodAccessorImpl.invoke(NativeMethodAccessorImpl.java:64)
23:59:06 [2021-05-22T03:59:06.845Z] 	at java.base/jdk.internal.reflect.DelegatingMethodAccessorImpl.invoke(DelegatingMethodAccessorImpl.java:43)
23:59:06 [2021-05-22T03:59:06.845Z] 	at java.base/java.lang.reflect.Method.invoke(Method.java:564)
23:59:06 [2021-05-22T03:59:06.845Z] 	at org.apache.maven.surefire.util.ReflectionUtils.invokeMethodWithArray2(ReflectionUtils.java:206)
23:59:06 [2021-05-22T03:59:06.845Z] 	at org.apache.maven.surefire.booter.ProviderFactory$ProviderProxy.invoke(ProviderFactory.java:161)
23:59:06 [2021-05-22T03:59:06.845Z] 	at org.apache.maven.surefire.booter.ProviderFactory.invokeProvider(ProviderFactory.java:84)
23:59:06 [2021-05-22T03:59:06.845Z] 	at org.eclipse.tycho.surefire.osgibooter.OsgiSurefireBooter.run(OsgiSurefireBooter.java:116)
23:59:06 [2021-05-22T03:59:06.845Z] 	at org.eclipse.tycho.surefire.osgibooter.HeadlessTestApplication.start(HeadlessTestApplication.java:23)
23:59:06 [2021-05-22T03:59:06.845Z] 	at org.eclipse.equinox.internal.app.EclipseAppHandle.run(EclipseAppHandle.java:203)
23:59:06 [2021-05-22T03:59:06.845Z] 	at org.eclipse.core.runtime.internal.adaptor.EclipseAppLauncher.runApplication(EclipseAppLauncher.java:137)
23:59:06 [2021-05-22T03:59:06.845Z] 	at org.eclipse.core.runtime.internal.adaptor.EclipseAppLauncher.start(EclipseAppLauncher.java:107)
23:59:06 [2021-05-22T03:59:06.845Z] 	at org.eclipse.core.runtime.adaptor.EclipseStarter.run(EclipseStarter.java:400)
23:59:06 [2021-05-22T03:59:06.845Z] 	at org.eclipse.core.runtime.adaptor.EclipseStarter.run(EclipseStarter.java:255)
23:59:06 [2021-05-22T03:59:06.845Z] 	at java.base/jdk.internal.reflect.NativeMethodAccessorImpl.invoke0(Native Method)
23:59:06 [2021-05-22T03:59:06.845Z] 	at java.base/jdk.internal.reflect.NativeMethodAccessorImpl.invoke(NativeMethodAccessorImpl.java:64)
23:59:06 [2021-05-22T03:59:06.845Z] 	at java.base/jdk.internal.reflect.DelegatingMethodAccessorImpl.invoke(DelegatingMethodAccessorImpl.java:43)
23:59:06 [2021-05-22T03:59:06.845Z] 	at java.base/java.lang.reflect.Method.invoke(Method.java:564)
23:59:06 [2021-05-22T03:59:06.845Z] 	at org.eclipse.equinox.launcher.Main.invokeFramework(Main.java:659)
23:59:06 [2021-05-22T03:59:06.845Z] 	at org.eclipse.equinox.launcher.Main.basicRun(Main.java:595)
23:59:06 [2021-05-22T03:59:06.845Z] 	at org.eclipse.equinox.launcher.Main.run(Main.java:1501)
23:59:06 [2021-05-22T03:59:06.845Z] 	at org.eclipse.equinox.launcher.Main.main(Main.java:1474)
23:59:06 [2021-05-22T03:59:06.845Z] Caused by: java.lang.ClassNotFoundException: org.junit.runners.model.RunnerBuilder cannot be found by org.eclipse.tycho.surefire.osgibooter_2.2.0
23:59:06 [2021-05-22T03:59:06.845Z] 	at org.eclipse.osgi.internal.loader.BundleLoader.findClassInternal(BundleLoader.java:511)
23:59:06 [2021-05-22T03:59:06.846Z] 	at org.eclipse.osgi.internal.loader.BundleLoader.findClass(BundleLoader.java:422)
23:59:06 [2021-05-22T03:59:06.846Z] 	at org.eclipse.osgi.internal.loader.BundleLoader.findClass(BundleLoader.java:414)
23:59:06 [2021-05-22T03:59:06.846Z] 	at org.eclipse.osgi.internal.loader.ModuleClassLoader.loadClass(ModuleClassLoader.java:153)
23:59:06 [2021-05-22T03:59:06.846Z] 	at java.base/java.lang.ClassLoader.loadClass(ClassLoader.java:522)
23:59:06 [2021-05-22T03:59:06.846Z] 	... 31 more
23:59:06 [2021-05-22T03:59:06.846Z] 
23:59:06 [2021-05-22T03:59:06.846Z] May 22, 2021 3:59:06 AM org.junit.platform.launcher.core.DefaultLauncher handleThrowable
23:59:06 [2021-05-22T03:59:06.846Z] WARNING: TestEngine with ID 'junit-vintage' failed to discover tests
23:59:06 [2021-05-22T03:59:06.846Z] java.lang.NoClassDefFoundError: org/junit/runners/model/RunnerBuilder
23:59:06 [2021-05-22T03:59:06.846Z] 	at org.junit.vintage.engine.discovery.VintageDiscoverer.<init>(VintageDiscoverer.java:48)
23:59:06 [2021-05-22T03:59:06.846Z] 	at org.junit.vintage.engine.VintageTestEngine.discover(VintageTestEngine.java:65)
23:59:06 [2021-05-22T03:59:06.846Z] 	at org.junit.platform.launcher.core.DefaultLauncher.discoverEngineRoot(DefaultLauncher.java:130)
23:59:06 [2021-05-22T03:59:06.846Z] 	at org.junit.platform.launcher.core.DefaultLauncher.discoverRoot(DefaultLauncher.java:117)
23:59:06 [2021-05-22T03:59:06.846Z] 	at org.junit.platform.launcher.core.DefaultLauncher.execute(DefaultLauncher.java:90)
23:59:06 [2021-05-22T03:59:06.846Z] 	at org.apache.maven.surefire.junitplatform.JUnitPlatformProvider.invokeAllTests(JUnitPlatformProvider.java:150)
23:59:06 [2021-05-22T03:59:06.846Z] 	at org.apache.maven.surefire.junitplatform.JUnitPlatformProvider.invoke(JUnitPlatformProvider.java:124)
23:59:06 [2021-05-22T03:59:06.846Z] 	at java.base/jdk.internal.reflect.NativeMethodAccessorImpl.invoke0(Native Method)
23:59:06 [2021-05-22T03:59:06.846Z] 	at java.base/jdk.internal.reflect.NativeMethodAccessorImpl.invoke(NativeMethodAccessorImpl.java:64)
23:59:06 [2021-05-22T03:59:06.846Z] 	at java.base/jdk.internal.reflect.DelegatingMethodAccessorImpl.invoke(DelegatingMethodAccessorImpl.java:43)
23:59:06 [2021-05-22T03:59:06.846Z] 	at java.base/java.lang.reflect.Method.invoke(Method.java:564)
23:59:06 [2021-05-22T03:59:06.846Z] 	at org.apache.maven.surefire.util.ReflectionUtils.invokeMethodWithArray2(ReflectionUtils.java:206)
23:59:06 [2021-05-22T03:59:06.846Z] 	at org.apache.maven.surefire.booter.ProviderFactory$ProviderProxy.invoke(ProviderFactory.java:161)
23:59:06 [2021-05-22T03:59:06.846Z] 	at org.apache.maven.surefire.booter.ProviderFactory.invokeProvider(ProviderFactory.java:84)
23:59:06 [2021-05-22T03:59:06.846Z] 	at org.eclipse.tycho.surefire.osgibooter.OsgiSurefireBooter.run(OsgiSurefireBooter.java:116)
23:59:06 [2021-05-22T03:59:06.846Z] 	at org.eclipse.tycho.surefire.osgibooter.HeadlessTestApplication.start(HeadlessTestApplication.java:23)
23:59:06 [2021-05-22T03:59:06.846Z] 	at org.eclipse.equinox.internal.app.EclipseAppHandle.run(EclipseAppHandle.java:203)
23:59:06 [2021-05-22T03:59:06.846Z] 	at org.eclipse.core.runtime.internal.adaptor.EclipseAppLauncher.runApplication(EclipseAppLauncher.java:137)
23:59:06 [2021-05-22T03:59:06.846Z] 	at org.eclipse.core.runtime.internal.adaptor.EclipseAppLauncher.start(EclipseAppLauncher.java:107)
23:59:06 [2021-05-22T03:59:06.846Z] 	at org.eclipse.core.runtime.adaptor.EclipseStarter.run(EclipseStarter.java:400)
23:59:06 [2021-05-22T03:59:06.846Z] 	at org.eclipse.core.runtime.adaptor.EclipseStarter.run(EclipseStarter.java:255)
23:59:06 [2021-05-22T03:59:06.846Z] 	at java.base/jdk.internal.reflect.NativeMethodAccessorImpl.invoke0(Native Method)
23:59:06 [2021-05-22T03:59:06.846Z] 	at java.base/jdk.internal.reflect.NativeMethodAccessorImpl.invoke(NativeMethodAccessorImpl.java:64)
23:59:06 [2021-05-22T03:59:06.846Z] 	at java.base/jdk.internal.reflect.DelegatingMethodAccessorImpl.invoke(DelegatingMethodAccessorImpl.java:43)
23:59:06 [2021-05-22T03:59:06.846Z] 	at java.base/java.lang.reflect.Method.invoke(Method.java:564)
23:59:06 [2021-05-22T03:59:06.846Z] 	at org.eclipse.equinox.launcher.Main.invokeFramework(Main.java:659)
23:59:06 [2021-05-22T03:59:06.846Z] 	at org.eclipse.equinox.launcher.Main.basicRun(Main.java:595)
23:59:06 [2021-05-22T03:59:06.846Z] 	at org.eclipse.equinox.launcher.Main.run(Main.java:1501)
23:59:06 [2021-05-22T03:59:06.846Z] 	at org.eclipse.equinox.launcher.Main.main(Main.java:1474)
23:59:06 [2021-05-22T03:59:06.846Z] Caused by: java.lang.ClassNotFoundException: org.junit.runners.model.RunnerBuilder cannot be found by org.eclipse.tycho.surefire.osgibooter_2.2.0
23:59:06 [2021-05-22T03:59:06.846Z] 	at org.eclipse.osgi.internal.loader.BundleLoader.findClassInternal(BundleLoader.java:511)
23:59:06 [2021-05-22T03:59:06.846Z] 	at org.eclipse.osgi.internal.loader.BundleLoader.findClass(BundleLoader.java:422)
23:59:06 [2021-05-22T03:59:06.846Z] 	at org.eclipse.osgi.internal.loader.BundleLoader.findClass(BundleLoader.java:414)
23:59:06 [2021-05-22T03:59:06.846Z] 	at org.eclipse.osgi.internal.loader.ModuleClassLoader.loadClass(ModuleClassLoader.java:153)
23:59:06 [2021-05-22T03:59:06.846Z] 	at java.base/java.lang.ClassLoader.loadClass(ClassLoader.java:522)
23:59:06 [2021-05-22T03:59:06.846Z] 	... 29 more
23:59:06 [2021-05-22T03:59:06.846Z] 
23:59:07 [2021-05-22T03:59:07.104Z] Running org.eclipse.ease.lang.python.jython.debugger.JythonDebugTest
23:59:10 [2021-05-22T03:59:10.384Z] Start of script
23:59:10 [2021-05-22T03:59:10.384Z] include file start
23:59:10 [2021-05-22T03:59:10.385Z] include file processed
23:59:10 [2021-05-22T03:59:10.385Z] Result of testMethod = 5
23:59:10 [2021-05-22T03:59:10.385Z] End of script
23:59:10 [2021-05-22T03:59:10.385Z] Start of script
23:59:10 [2021-05-22T03:59:10.385Z] include file start
23:59:10 [2021-05-22T03:59:10.385Z] include file processed
23:59:10 [2021-05-22T03:59:10.385Z] Result of testMethod = 5
23:59:10 [2021-05-22T03:59:10.385Z] End of script
23:59:10 [2021-05-22T03:59:10.385Z] Start of script
23:59:10 [2021-05-22T03:59:10.642Z] include file start
23:59:10 [2021-05-22T03:59:10.642Z] include file processed
23:59:10 [2021-05-22T03:59:10.642Z] Result of testMethod = 5
23:59:10 [2021-05-22T03:59:10.642Z] Traceback (most recent call last):
23:59:10 [2021-05-22T03:59:10.642Z]   File "(none)", line 184, in run
23:59:10 [2021-05-22T03:59:10.642Z]   File "__ref_L/Debug Test/Main.py_ltjmgnxugp", line 23, in <module>
23:59:10 [2021-05-22T03:59:10.642Z]   File "(none)", line 161, in trace_dispatch
23:59:10 [2021-05-22T03:59:10.642Z] 	at org.eclipse.ease.debugging.AbstractEaseDebugger.handleEventsInSuspendedState(AbstractEaseDebugger.java:329)
23:59:10 [2021-05-22T03:59:10.642Z] 	at org.eclipse.ease.debugging.AbstractEaseDebugger.suspend(AbstractEaseDebugger.java:255)
23:59:10 [2021-05-22T03:59:10.642Z] 	at org.eclipse.ease.debugging.AbstractEaseDebugger.processLine(AbstractEaseDebugger.java:490)
23:59:10 [2021-05-22T03:59:10.642Z] 	at org.eclipse.ease.lang.python.debugger.PythonDebugger.traceDispatch(PythonDebugger.java:177)
23:59:10 [2021-05-22T03:59:10.642Z] 	at org.eclipse.ease.lang.python.jython.debugger.JythonDebugger.traceDispatch(JythonDebugger.java:44)
23:59:10 [2021-05-22T03:59:10.642Z] 	at jdk.internal.reflect.GeneratedMethodAccessor25.invoke(Unknown Source)
23:59:10 [2021-05-22T03:59:10.642Z] 	at java.base/jdk.internal.reflect.DelegatingMethodAccessorImpl.invoke(DelegatingMethodAccessorImpl.java:43)
23:59:10 [2021-05-22T03:59:10.642Z] 	at java.base/java.lang.reflect.Method.invoke(Method.java:564)
23:59:10 [2021-05-22T03:59:10.642Z] 
23:59:10 [2021-05-22T03:59:10.642Z] org.eclipse.ease.ScriptEngineCancellationException: org.eclipse.ease.ScriptEngineCancellationException: Terminated on user request
23:59:10 [2021-05-22T03:59:10.900Z] Start of script
23:59:10 [2021-05-22T03:59:10.900Z] include file start
23:59:10 [2021-05-22T03:59:10.900Z] include file processed
23:59:11 [2021-05-22T03:59:11.157Z] Result of testMethod = 5
23:59:11 [2021-05-22T03:59:11.157Z] End of script
23:59:11 [2021-05-22T03:59:11.722Z] Start of script
23:59:11 [2021-05-22T03:59:11.722Z] include file start
23:59:11 [2021-05-22T03:59:11.722Z] include file processed
23:59:11 [2021-05-22T03:59:11.722Z] Result of testMethod = 5
23:59:11 [2021-05-22T03:59:11.722Z] End of script
23:59:11 [2021-05-22T03:59:11.722Z] Start of script
23:59:11 [2021-05-22T03:59:11.722Z] include file start
23:59:11 [2021-05-22T03:59:11.722Z] include file processed
23:59:11 [2021-05-22T03:59:11.980Z] Result of testMethod = 5
23:59:11 [2021-05-22T03:59:11.980Z] End of script
23:59:11 [2021-05-22T03:59:11.980Z] Start of script
23:59:11 [2021-05-22T03:59:11.980Z] include file start
23:59:11 [2021-05-22T03:59:11.980Z] include file processed
23:59:11 [2021-05-22T03:59:11.980Z] Result of testMethod = 5
23:59:12 [2021-05-22T03:59:12.238Z] Traceback (most recent call last):
23:59:12 [2021-05-22T03:59:12.238Z]   File "(none)", line 184, in run
23:59:12 [2021-05-22T03:59:12.238Z]   File "__ref_L/Debug Test/Main.py_odykkccqcf", line 23, in <module>
23:59:12 [2021-05-22T03:59:12.238Z]   File "(none)", line 161, in trace_dispatch
23:59:12 [2021-05-22T03:59:12.238Z] 	at org.eclipse.ease.debugging.AbstractEaseDebugger.handleEventsInSuspendedState(AbstractEaseDebugger.java:329)
23:59:12 [2021-05-22T03:59:12.238Z] 	at org.eclipse.ease.debugging.AbstractEaseDebugger.suspend(AbstractEaseDebugger.java:255)
23:59:12 [2021-05-22T03:59:12.238Z] 	at org.eclipse.ease.debugging.AbstractEaseDebugger.processLine(AbstractEaseDebugger.java:490)
23:59:12 [2021-05-22T03:59:12.238Z] 	at org.eclipse.ease.lang.python.debugger.PythonDebugger.traceDispatch(PythonDebugger.java:177)
23:59:12 [2021-05-22T03:59:12.238Z] 	at org.eclipse.ease.lang.python.jython.debugger.JythonDebugger.traceDispatch(JythonDebugger.java:44)
23:59:12 [2021-05-22T03:59:12.238Z] 	at jdk.internal.reflect.GeneratedMethodAccessor25.invoke(Unknown Source)
23:59:12 [2021-05-22T03:59:12.238Z] 	at java.base/jdk.internal.reflect.DelegatingMethodAccessorImpl.invoke(DelegatingMethodAccessorImpl.java:43)
23:59:12 [2021-05-22T03:59:12.238Z] 	at java.base/java.lang.reflect.Method.invoke(Method.java:564)
23:59:12 [2021-05-22T03:59:12.238Z] 
23:59:12 [2021-05-22T03:59:12.238Z] org.eclipse.ease.ScriptEngineCancellationException: org.eclipse.ease.ScriptEngineCancellationException: Terminated on user request
23:59:12 [2021-05-22T03:59:12.528Z] Start of script
23:59:12 [2021-05-22T03:59:12.528Z] include file start
23:59:12 [2021-05-22T03:59:12.529Z] include file processed
23:59:12 [2021-05-22T03:59:12.786Z] Result of testMethod = 5
23:59:12 [2021-05-22T03:59:12.786Z] End of script
23:59:13 [2021-05-22T03:59:13.044Z] Start of script
23:59:13 [2021-05-22T03:59:13.044Z] include file start
23:59:13 [2021-05-22T03:59:13.044Z] include file processed
23:59:13 [2021-05-22T03:59:13.044Z] Result of testMethod = 5
23:59:13 [2021-05-22T03:59:13.044Z] End of script
23:59:13 [2021-05-22T03:59:13.044Z] Start of script
23:59:13 [2021-05-22T03:59:13.044Z] include file start
23:59:13 [2021-05-22T03:59:13.044Z] include file processed
23:59:13 [2021-05-22T03:59:13.609Z] Traceback (most recent call last):
23:59:13 [2021-05-22T03:59:13.609Z]   File "(none)", line 184, in run
23:59:13 [2021-05-22T03:59:13.609Z]   File "__ref_L/Debug Test/Main.py_jgydqefewl", line 22, in <module>
23:59:13 [2021-05-22T03:59:13.609Z]   File "(none)", line 161, in trace_dispatch
23:59:13 [2021-05-22T03:59:13.609Z] 	at org.eclipse.ease.debugging.AbstractEaseDebugger.handleEventsInSuspendedState(AbstractEaseDebugger.java:329)
23:59:13 [2021-05-22T03:59:13.610Z] 	at org.eclipse.ease.debugging.AbstractEaseDebugger.suspend(AbstractEaseDebugger.java:255)
23:59:13 [2021-05-22T03:59:13.610Z] 	at org.eclipse.ease.debugging.AbstractEaseDebugger.processLine(AbstractEaseDebugger.java:510)
23:59:13 [2021-05-22T03:59:13.610Z] 	at org.eclipse.ease.lang.python.debugger.PythonDebugger.traceDispatch(PythonDebugger.java:177)
23:59:13 [2021-05-22T03:59:13.610Z] 	at org.eclipse.ease.lang.python.jython.debugger.JythonDebugger.traceDispatch(JythonDebugger.java:44)
23:59:13 [2021-05-22T03:59:13.610Z] 	at jdk.internal.reflect.GeneratedMethodAccessor25.invoke(Unknown Source)
23:59:13 [2021-05-22T03:59:13.610Z] 	at java.base/jdk.internal.reflect.DelegatingMethodAccessorImpl.invoke(DelegatingMethodAccessorImpl.java:43)
23:59:13 [2021-05-22T03:59:13.610Z] 	at java.base/java.lang.reflect.Method.invoke(Method.java:564)
23:59:13 [2021-05-22T03:59:13.610Z] 
23:59:13 [2021-05-22T03:59:13.610Z] org.eclipse.ease.ScriptEngineCancellationException: org.eclipse.ease.ScriptEngineCancellationException: Terminated on user request
23:59:13 [2021-05-22T03:59:13.610Z] Start of script
23:59:13 [2021-05-22T03:59:13.610Z] include file start
23:59:13 [2021-05-22T03:59:13.870Z] include file processed
23:59:13 [2021-05-22T03:59:13.870Z] Result of testMethod = 5
23:59:13 [2021-05-22T03:59:13.870Z] End of script
23:59:14 [2021-05-22T03:59:14.129Z] Start of script
23:59:14 [2021-05-22T03:59:14.129Z] include file start
23:59:14 [2021-05-22T03:59:14.129Z] include file processed
23:59:14 [2021-05-22T03:59:14.129Z] Result of testMethod = 5
23:59:14 [2021-05-22T03:59:14.129Z] End of script
23:59:14 [2021-05-22T03:59:14.387Z] Traceback (most recent call last):
23:59:14 [2021-05-22T03:59:14.387Z]   File "(none)", line 184, in run
23:59:14 [2021-05-22T03:59:14.387Z]   File "__ref_L/Debug Test/Main.py_fhoflkhorw", line 1, in <module>
23:59:14 [2021-05-22T03:59:14.387Z]   File "(none)", line 161, in trace_dispatch
23:59:14 [2021-05-22T03:59:14.387Z] 	at org.eclipse.ease.debugging.AbstractEaseDebugger.handleEventsInSuspendedState(AbstractEaseDebugger.java:329)
23:59:14 [2021-05-22T03:59:14.387Z] 	at org.eclipse.ease.debugging.AbstractEaseDebugger.suspend(AbstractEaseDebugger.java:255)
23:59:14 [2021-05-22T03:59:14.387Z] 	at org.eclipse.ease.debugging.AbstractEaseDebugger.processLine(AbstractEaseDebugger.java:490)
23:59:14 [2021-05-22T03:59:14.387Z] 	at org.eclipse.ease.lang.python.debugger.PythonDebugger.traceDispatch(PythonDebugger.java:177)
23:59:14 [2021-05-22T03:59:14.387Z] 	at org.eclipse.ease.lang.python.jython.debugger.JythonDebugger.traceDispatch(JythonDebugger.java:44)
23:59:14 [2021-05-22T03:59:14.387Z] 	at jdk.internal.reflect.GeneratedMethodAccessor25.invoke(Unknown Source)
23:59:14 [2021-05-22T03:59:14.387Z] 	at java.base/jdk.internal.reflect.DelegatingMethodAccessorImpl.invoke(DelegatingMethodAccessorImpl.java:43)
23:59:14 [2021-05-22T03:59:14.387Z] 	at java.base/java.lang.reflect.Method.invoke(Method.java:564)
23:59:14 [2021-05-22T03:59:14.387Z] 
23:59:14 [2021-05-22T03:59:14.387Z] org.eclipse.ease.ScriptEngineCancellationException: org.eclipse.ease.ScriptEngineCancellationException: Terminated on user request
23:59:14 [2021-05-22T03:59:14.645Z] Start of script
23:59:14 [2021-05-22T03:59:14.645Z] include file start
23:59:14 [2021-05-22T03:59:14.645Z] include file processed
23:59:14 [2021-05-22T03:59:14.645Z] Result of testMethod = 5
23:59:14 [2021-05-22T03:59:14.645Z] End of script
23:59:14 [2021-05-22T03:59:14.903Z] Start of script
23:59:14 [2021-05-22T03:59:14.903Z] include file start
23:59:14 [2021-05-22T03:59:14.903Z] include file processed
23:59:14 [2021-05-22T03:59:14.903Z] Result of testMethod = 5
23:59:14 [2021-05-22T03:59:14.903Z] End of script
23:59:15 [2021-05-22T03:59:15.161Z] Start of script
23:59:15 [2021-05-22T03:59:15.161Z] include file start
23:59:15 [2021-05-22T03:59:15.161Z] include file processed
23:59:15 [2021-05-22T03:59:15.161Z] Result of testMethod = 5
23:59:15 [2021-05-22T03:59:15.419Z] Traceback (most recent call last):
23:59:15 [2021-05-22T03:59:15.419Z]   File "(none)", line 184, in run
23:59:15 [2021-05-22T03:59:15.419Z]   File "__ref_L/Debug Test/Main.py_rektkayqdq", line 23, in <module>
23:59:15 [2021-05-22T03:59:15.419Z]   File "(none)", line 161, in trace_dispatch
23:59:15 [2021-05-22T03:59:15.419Z] 	at org.eclipse.ease.debugging.AbstractEaseDebugger.handleEventsInSuspendedState(AbstractEaseDebugger.java:329)
23:59:15 [2021-05-22T03:59:15.419Z] 	at org.eclipse.ease.debugging.AbstractEaseDebugger.suspend(AbstractEaseDebugger.java:255)
23:59:15 [2021-05-22T03:59:15.419Z] 	at org.eclipse.ease.debugging.AbstractEaseDebugger.processLine(AbstractEaseDebugger.java:490)
23:59:15 [2021-05-22T03:59:15.419Z] 	at org.eclipse.ease.lang.python.debugger.PythonDebugger.traceDispatch(PythonDebugger.java:177)
23:59:15 [2021-05-22T03:59:15.419Z] 	at org.eclipse.ease.lang.python.jython.debugger.JythonDebugger.traceDispatch(JythonDebugger.java:44)
23:59:15 [2021-05-22T03:59:15.419Z] 	at jdk.internal.reflect.GeneratedMethodAccessor25.invoke(Unknown Source)
23:59:15 [2021-05-22T03:59:15.419Z] 	at java.base/jdk.internal.reflect.DelegatingMethodAccessorImpl.invoke(DelegatingMethodAccessorImpl.java:43)
23:59:15 [2021-05-22T03:59:15.419Z] 	at java.base/java.lang.reflect.Method.invoke(Method.java:564)
23:59:15 [2021-05-22T03:59:15.419Z] 
23:59:15 [2021-05-22T03:59:15.419Z] org.eclipse.ease.ScriptEngineCancellationException: org.eclipse.ease.ScriptEngineCancellationException: Terminated on user request
23:59:15 [2021-05-22T03:59:15.419Z] Start of script
23:59:15 [2021-05-22T03:59:15.419Z] include file start
23:59:15 [2021-05-22T03:59:15.419Z] include file processed
23:59:15 [2021-05-22T03:59:15.677Z] Result of testMethod = 5
23:59:15 [2021-05-22T03:59:15.677Z] End of script
23:59:15 [2021-05-22T03:59:15.935Z] Traceback (most recent call last):
23:59:15 [2021-05-22T03:59:15.935Z]   File "(none)", line 184, in run
23:59:15 [2021-05-22T03:59:15.935Z]   File "__ref_L/Debug Test/Main.py_tercmqsiix", line 1, in <module>
23:59:15 [2021-05-22T03:59:15.935Z]   File "(none)", line 161, in trace_dispatch
23:59:15 [2021-05-22T03:59:15.935Z] 	at org.eclipse.ease.debugging.AbstractEaseDebugger.handleEventsInSuspendedState(AbstractEaseDebugger.java:329)
23:59:15 [2021-05-22T03:59:15.935Z] 	at org.eclipse.ease.debugging.AbstractEaseDebugger.suspend(AbstractEaseDebugger.java:255)
23:59:15 [2021-05-22T03:59:15.935Z] 	at org.eclipse.ease.debugging.AbstractEaseDebugger.processLine(AbstractEaseDebugger.java:490)
23:59:15 [2021-05-22T03:59:15.935Z] 	at org.eclipse.ease.lang.python.debugger.PythonDebugger.traceDispatch(PythonDebugger.java:177)
23:59:15 [2021-05-22T03:59:15.936Z] 	at org.eclipse.ease.lang.python.jython.debugger.JythonDebugger.traceDispatch(JythonDebugger.java:44)
23:59:15 [2021-05-22T03:59:15.936Z] 	at jdk.internal.reflect.GeneratedMethodAccessor25.invoke(Unknown Source)
23:59:15 [2021-05-22T03:59:15.936Z] 	at java.base/jdk.internal.reflect.DelegatingMethodAccessorImpl.invoke(DelegatingMethodAccessorImpl.java:43)
23:59:15 [2021-05-22T03:59:15.936Z] 	at java.base/java.lang.reflect.Method.invoke(Method.java:564)
23:59:15 [2021-05-22T03:59:15.936Z] 
23:59:15 [2021-05-22T03:59:15.936Z] org.eclipse.ease.ScriptEngineCancellationException: org.eclipse.ease.ScriptEngineCancellationException: Terminated on user request
23:59:16 [2021-05-22T03:59:16.193Z] Start of script
23:59:16 [2021-05-22T03:59:16.193Z] include file start
23:59:16 [2021-05-22T03:59:16.193Z] include file processed
23:59:16 [2021-05-22T03:59:16.194Z] Result of testMethod = 5
23:59:16 [2021-05-22T03:59:16.194Z] End of script
23:59:16 [2021-05-22T03:59:16.452Z] Start of script
23:59:16 [2021-05-22T03:59:16.452Z] include file start
23:59:16 [2021-05-22T03:59:16.452Z] include file processed
23:59:16 [2021-05-22T03:59:16.452Z] Result of testMethod = 5
23:59:16 [2021-05-22T03:59:16.452Z] End of script
23:59:16 [2021-05-22T03:59:16.710Z] Traceback (most recent call last):
23:59:16 [2021-05-22T03:59:16.710Z]   File "(none)", line 184, in run
23:59:16 [2021-05-22T03:59:16.710Z]   File "__ref_L/Debug Test/Main.py_stwfpslkvw", line 1, in <module>
23:59:16 [2021-05-22T03:59:16.710Z]   File "(none)", line 161, in trace_dispatch
23:59:16 [2021-05-22T03:59:16.710Z] 	at org.eclipse.ease.debugging.AbstractEaseDebugger.handleEventsInSuspendedState(AbstractEaseDebugger.java:329)
23:59:16 [2021-05-22T03:59:16.710Z] 	at org.eclipse.ease.debugging.AbstractEaseDebugger.suspend(AbstractEaseDebugger.java:255)
23:59:16 [2021-05-22T03:59:16.710Z] 	at org.eclipse.ease.debugging.AbstractEaseDebugger.processLine(AbstractEaseDebugger.java:490)
23:59:16 [2021-05-22T03:59:16.710Z] 	at org.eclipse.ease.lang.python.debugger.PythonDebugger.traceDispatch(PythonDebugger.java:177)
23:59:16 [2021-05-22T03:59:16.710Z] 	at org.eclipse.ease.lang.python.jython.debugger.JythonDebugger.traceDispatch(JythonDebugger.java:44)
23:59:16 [2021-05-22T03:59:16.710Z] 	at jdk.internal.reflect.GeneratedMethodAccessor25.invoke(Unknown Source)
23:59:16 [2021-05-22T03:59:16.710Z] 	at java.base/jdk.internal.reflect.DelegatingMethodAccessorImpl.invoke(DelegatingMethodAccessorImpl.java:43)
23:59:16 [2021-05-22T03:59:16.710Z] 	at java.base/java.lang.reflect.Method.invoke(Method.java:564)
23:59:16 [2021-05-22T03:59:16.710Z] 
23:59:16 [2021-05-22T03:59:16.710Z] org.eclipse.ease.ScriptEngineCancellationException: org.eclipse.ease.ScriptEngineCancellationException: Terminated on user request
23:59:16 [2021-05-22T03:59:16.968Z] Start of script
23:59:16 [2021-05-22T03:59:16.968Z] include file start
23:59:16 [2021-05-22T03:59:16.968Z] include file processed
23:59:16 [2021-05-22T03:59:16.968Z] Result of testMethod = 5
23:59:16 [2021-05-22T03:59:16.968Z] End of script
23:59:17 [2021-05-22T03:59:17.226Z] Start of script
23:59:17 [2021-05-22T03:59:17.226Z] include file start
23:59:17 [2021-05-22T03:59:17.226Z] include file processed
23:59:17 [2021-05-22T03:59:17.226Z] Result of testMethod = 5
23:59:17 [2021-05-22T03:59:17.484Z] Traceback (most recent call last):
23:59:17 [2021-05-22T03:59:17.484Z]   File "(none)", line 184, in run
23:59:17 [2021-05-22T03:59:17.484Z]   File "__ref_L/Debug Test/Main.py_ypjyhmrzzw", line 23, in <module>
23:59:17 [2021-05-22T03:59:17.484Z]   File "(none)", line 161, in trace_dispatch
23:59:17 [2021-05-22T03:59:17.484Z] 	at org.eclipse.ease.debugging.AbstractEaseDebugger.handleEventsInSuspendedState(AbstractEaseDebugger.java:329)
23:59:17 [2021-05-22T03:59:17.484Z] 	at org.eclipse.ease.debugging.AbstractEaseDebugger.suspend(AbstractEaseDebugger.java:255)
23:59:17 [2021-05-22T03:59:17.484Z] 	at org.eclipse.ease.debugging.AbstractEaseDebugger.processLine(AbstractEaseDebugger.java:490)
23:59:17 [2021-05-22T03:59:17.484Z] 	at org.eclipse.ease.lang.python.debugger.PythonDebugger.traceDispatch(PythonDebugger.java:177)
23:59:17 [2021-05-22T03:59:17.484Z] 	at org.eclipse.ease.lang.python.jython.debugger.JythonDebugger.traceDispatch(JythonDebugger.java:44)
23:59:17 [2021-05-22T03:59:17.485Z] 	at jdk.internal.reflect.GeneratedMethodAccessor25.invoke(Unknown Source)
23:59:17 [2021-05-22T03:59:17.485Z] 	at java.base/jdk.internal.reflect.DelegatingMethodAccessorImpl.invoke(DelegatingMethodAccessorImpl.java:43)
23:59:17 [2021-05-22T03:59:17.485Z] 	at java.base/java.lang.reflect.Method.invoke(Method.java:564)
23:59:17 [2021-05-22T03:59:17.485Z] 
23:59:17 [2021-05-22T03:59:17.485Z] org.eclipse.ease.ScriptEngineCancellationException: org.eclipse.ease.ScriptEngineCancellationException: Terminated on user request
23:59:17 [2021-05-22T03:59:17.742Z] Start of script
23:59:17 [2021-05-22T03:59:17.742Z] include file start
23:59:17 [2021-05-22T03:59:17.742Z] include file processed
23:59:17 [2021-05-22T03:59:17.742Z] Result of testMethod = 5
23:59:17 [2021-05-22T03:59:17.742Z] End of script
23:59:18 [2021-05-22T03:59:18.000Z] Start of script
23:59:18 [2021-05-22T03:59:18.000Z] include file start
23:59:18 [2021-05-22T03:59:18.000Z] include file processed
23:59:18 [2021-05-22T03:59:18.000Z] Result of testMethod = 5
23:59:18 [2021-05-22T03:59:18.000Z] End of script
23:59:18 [2021-05-22T03:59:18.258Z] Start of script
23:59:18 [2021-05-22T03:59:18.258Z] include file start
23:59:18 [2021-05-22T03:59:18.258Z] include file processed
23:59:18 [2021-05-22T03:59:18.258Z] Result of testMethod = 5
23:59:18 [2021-05-22T03:59:18.258Z] End of script
23:59:18 [2021-05-22T03:59:18.822Z] Start of script
23:59:18 [2021-05-22T03:59:18.822Z] include file start
23:59:18 [2021-05-22T03:59:18.822Z] include file processed
23:59:18 [2021-05-22T03:59:18.822Z] Result of testMethod = 5
23:59:18 [2021-05-22T03:59:18.822Z] End of script
23:59:19 [2021-05-22T03:59:19.080Z] Start of script
23:59:19 [2021-05-22T03:59:19.080Z] include file start
23:59:19 [2021-05-22T03:59:19.080Z] include file processed
23:59:19 [2021-05-22T03:59:19.337Z] Traceback (most recent call last):
23:59:19 [2021-05-22T03:59:19.337Z]   File "(none)", line 184, in run
23:59:19 [2021-05-22T03:59:19.337Z]   File "__ref_L/Debug Test/Main.py_buzekzpjtf", line 21, in <module>
23:59:19 [2021-05-22T03:59:19.337Z]   File "__ref_L/Debug Test/Main.py_buzekzpjtf", line 18, in testMethod
23:59:19 [2021-05-22T03:59:19.337Z]   File "(none)", line 161, in trace_dispatch
23:59:19 [2021-05-22T03:59:19.337Z] 	at org.eclipse.ease.debugging.AbstractEaseDebugger.handleEventsInSuspendedState(AbstractEaseDebugger.java:329)
23:59:19 [2021-05-22T03:59:19.337Z] 	at org.eclipse.ease.debugging.AbstractEaseDebugger.suspend(AbstractEaseDebugger.java:255)
23:59:19 [2021-05-22T03:59:19.337Z] 	at org.eclipse.ease.debugging.AbstractEaseDebugger.processLine(AbstractEaseDebugger.java:490)
23:59:19 [2021-05-22T03:59:19.337Z] 	at org.eclipse.ease.lang.python.debugger.PythonDebugger.traceDispatch(PythonDebugger.java:177)
23:59:19 [2021-05-22T03:59:19.337Z] 	at org.eclipse.ease.lang.python.jython.debugger.JythonDebugger.traceDispatch(JythonDebugger.java:44)
23:59:19 [2021-05-22T03:59:19.337Z] 	at jdk.internal.reflect.GeneratedMethodAccessor25.invoke(Unknown Source)
23:59:19 [2021-05-22T03:59:19.338Z] 	at java.base/jdk.internal.reflect.DelegatingMethodAccessorImpl.invoke(DelegatingMethodAccessorImpl.java:43)
23:59:19 [2021-05-22T03:59:19.338Z] 	at java.base/java.lang.reflect.Method.invoke(Method.java:564)
23:59:19 [2021-05-22T03:59:19.338Z] 
23:59:19 [2021-05-22T03:59:19.338Z] org.eclipse.ease.ScriptEngineCancellationException: org.eclipse.ease.ScriptEngineCancellationException: Terminated on user request
23:59:19 [2021-05-22T03:59:19.338Z] Start of script
23:59:19 [2021-05-22T03:59:19.595Z] include file start
23:59:19 [2021-05-22T03:59:19.595Z] include file processed
23:59:19 [2021-05-22T03:59:19.595Z] Result of testMethod = 5
23:59:19 [2021-05-22T03:59:19.595Z] End of script
23:59:19 [2021-05-22T03:59:19.595Z] Start of script
23:59:19 [2021-05-22T03:59:19.595Z] include file start
23:59:19 [2021-05-22T03:59:19.595Z] include file processed
23:59:19 [2021-05-22T03:59:19.595Z] Result of testMethod = 5
23:59:19 [2021-05-22T03:59:19.853Z] Traceback (most recent call last):
23:59:19 [2021-05-22T03:59:19.853Z]   File "(none)", line 184, in run
23:59:19 [2021-05-22T03:59:19.853Z]   File "__ref_L/Debug Test/Main.py_trkbowhlkx", line 23, in <module>
23:59:19 [2021-05-22T03:59:19.853Z]   File "(none)", line 161, in trace_dispatch
23:59:19 [2021-05-22T03:59:19.853Z] 	at org.eclipse.ease.debugging.AbstractEaseDebugger.handleEventsInSuspendedState(AbstractEaseDebugger.java:329)
23:59:19 [2021-05-22T03:59:19.853Z] 	at org.eclipse.ease.debugging.AbstractEaseDebugger.suspend(AbstractEaseDebugger.java:255)
23:59:19 [2021-05-22T03:59:19.853Z] 	at org.eclipse.ease.debugging.AbstractEaseDebugger.processLine(AbstractEaseDebugger.java:490)
23:59:19 [2021-05-22T03:59:19.853Z] 	at org.eclipse.ease.lang.python.debugger.PythonDebugger.traceDispatch(PythonDebugger.java:177)
23:59:19 [2021-05-22T03:59:19.853Z] 	at org.eclipse.ease.lang.python.jython.debugger.JythonDebugger.traceDispatch(JythonDebugger.java:44)
23:59:19 [2021-05-22T03:59:19.853Z] 	at jdk.internal.reflect.GeneratedMethodAccessor25.invoke(Unknown Source)
23:59:19 [2021-05-22T03:59:19.853Z] 	at java.base/jdk.internal.reflect.DelegatingMethodAccessorImpl.invoke(DelegatingMethodAccessorImpl.java:43)
23:59:19 [2021-05-22T03:59:19.853Z] 	at java.base/java.lang.reflect.Method.invoke(Method.java:564)
23:59:19 [2021-05-22T03:59:19.853Z] 
23:59:19 [2021-05-22T03:59:19.853Z] org.eclipse.ease.ScriptEngineCancellationException: org.eclipse.ease.ScriptEngineCancellationException: Terminated on user request
23:59:19 [2021-05-22T03:59:19.853Z] Start of script
23:59:20 [2021-05-22T03:59:20.111Z] include file start
23:59:20 [2021-05-22T03:59:20.111Z] include file processed
23:59:20 [2021-05-22T03:59:20.111Z] Result of testMethod = 5
23:59:20 [2021-05-22T03:59:20.111Z] End of script
23:59:20 [2021-05-22T03:59:20.111Z] Start of script
23:59:20 [2021-05-22T03:59:20.111Z] include file start
23:59:20 [2021-05-22T03:59:20.111Z] include file processed
23:59:20 [2021-05-22T03:59:20.369Z] Result of testMethod = 5
23:59:20 [2021-05-22T03:59:20.369Z] End of script
23:59:20 [2021-05-22T03:59:20.369Z] Start of script
23:59:20 [2021-05-22T03:59:20.627Z] include file start
23:59:20 [2021-05-22T03:59:20.627Z] include file processed
23:59:20 [2021-05-22T03:59:20.627Z] Result of testMethod = 5
23:59:20 [2021-05-22T03:59:20.627Z] End of script
23:59:20 [2021-05-22T03:59:20.885Z] Start of script
23:59:20 [2021-05-22T03:59:20.885Z] include file start
23:59:20 [2021-05-22T03:59:20.885Z] include file processed
23:59:20 [2021-05-22T03:59:20.885Z] Result of testMethod = 5
23:59:20 [2021-05-22T03:59:20.885Z] End of script
23:59:21 [2021-05-22T03:59:21.143Z] Start of script
23:59:21 [2021-05-22T03:59:21.143Z] include file start
23:59:21 [2021-05-22T03:59:21.143Z] include file processed
23:59:21 [2021-05-22T03:59:21.143Z] Result of testMethod = 5
23:59:21 [2021-05-22T03:59:21.401Z] Traceback (most recent call last):
23:59:21 [2021-05-22T03:59:21.401Z]   File "(none)", line 184, in run
23:59:21 [2021-05-22T03:59:21.401Z]   File "__ref_L/Debug Test/Main.py_iqdllqxkwu", line 23, in <module>
23:59:21 [2021-05-22T03:59:21.402Z]   File "(none)", line 161, in trace_dispatch
23:59:21 [2021-05-22T03:59:21.402Z] 	at org.eclipse.ease.debugging.AbstractEaseDebugger.handleEventsInSuspendedState(AbstractEaseDebugger.java:329)
23:59:21 [2021-05-22T03:59:21.402Z] 	at org.eclipse.ease.debugging.AbstractEaseDebugger.suspend(AbstractEaseDebugger.java:255)
23:59:21 [2021-05-22T03:59:21.402Z] 	at org.eclipse.ease.debugging.AbstractEaseDebugger.processLine(AbstractEaseDebugger.java:490)
23:59:21 [2021-05-22T03:59:21.402Z] 	at org.eclipse.ease.lang.python.debugger.PythonDebugger.traceDispatch(PythonDebugger.java:177)
23:59:21 [2021-05-22T03:59:21.402Z] 	at org.eclipse.ease.lang.python.jython.debugger.JythonDebugger.traceDispatch(JythonDebugger.java:44)
23:59:21 [2021-05-22T03:59:21.402Z] 	at jdk.internal.reflect.GeneratedMethodAccessor25.invoke(Unknown Source)
23:59:21 [2021-05-22T03:59:21.402Z] 	at java.base/jdk.internal.reflect.DelegatingMethodAccessorImpl.invoke(DelegatingMethodAccessorImpl.java:43)
23:59:21 [2021-05-22T03:59:21.402Z] 	at java.base/java.lang.reflect.Method.invoke(Method.java:564)
23:59:21 [2021-05-22T03:59:21.402Z] 
23:59:21 [2021-05-22T03:59:21.402Z] org.eclipse.ease.ScriptEngineCancellationException: org.eclipse.ease.ScriptEngineCancellationException: Terminated on user request
23:59:21 [2021-05-22T03:59:21.402Z] Start of script
23:59:21 [2021-05-22T03:59:21.402Z] include file start
23:59:21 [2021-05-22T03:59:21.402Z] include file processed
23:59:21 [2021-05-22T03:59:21.402Z] Result of testMethod = 5
23:59:21 [2021-05-22T03:59:21.402Z] End of script
23:59:21 [2021-05-22T03:59:21.660Z] Start of script
23:59:21 [2021-05-22T03:59:21.660Z] include file start
23:59:21 [2021-05-22T03:59:21.660Z] include file processed
23:59:21 [2021-05-22T03:59:21.660Z] Result of testMethod = 5
23:59:21 [2021-05-22T03:59:21.660Z] Traceback (most recent call last):
23:59:21 [2021-05-22T03:59:21.660Z]   File "(none)", line 184, in run
23:59:21 [2021-05-22T03:59:21.660Z]   File "__ref_L/Debug Test/Main.py_uotmeofvab", line 23, in <module>
23:59:21 [2021-05-22T03:59:21.660Z]   File "(none)", line 161, in trace_dispatch
23:59:21 [2021-05-22T03:59:21.660Z] 	at org.eclipse.ease.debugging.AbstractEaseDebugger.handleEventsInSuspendedState(AbstractEaseDebugger.java:329)
23:59:21 [2021-05-22T03:59:21.660Z] 	at org.eclipse.ease.debugging.AbstractEaseDebugger.suspend(AbstractEaseDebugger.java:255)
23:59:21 [2021-05-22T03:59:21.660Z] 	at org.eclipse.ease.debugging.AbstractEaseDebugger.processLine(AbstractEaseDebugger.java:490)
23:59:21 [2021-05-22T03:59:21.660Z] 	at org.eclipse.ease.lang.python.debugger.PythonDebugger.traceDispatch(PythonDebugger.java:177)
23:59:21 [2021-05-22T03:59:21.660Z] 	at org.eclipse.ease.lang.python.jython.debugger.JythonDebugger.traceDispatch(JythonDebugger.java:44)
23:59:21 [2021-05-22T03:59:21.660Z] 	at jdk.internal.reflect.GeneratedMethodAccessor25.invoke(Unknown Source)
23:59:21 [2021-05-22T03:59:21.661Z] 	at java.base/jdk.internal.reflect.DelegatingMethodAccessorImpl.invoke(DelegatingMethodAccessorImpl.java:43)
23:59:21 [2021-05-22T03:59:21.661Z] 	at java.base/java.lang.reflect.Method.invoke(Method.java:564)
23:59:21 [2021-05-22T03:59:21.661Z] 
23:59:21 [2021-05-22T03:59:21.661Z] org.eclipse.ease.ScriptEngineCancellationException: org.eclipse.ease.ScriptEngineCancellationException: Terminated on user request
23:59:21 [2021-05-22T03:59:21.918Z] Traceback (most recent call last):
23:59:21 [2021-05-22T03:59:21.918Z]   File "(none)", line 184, in run
23:59:21 [2021-05-22T03:59:21.918Z]   File "__ref_L/Debug Test/Main.py_wfahipgrsw", line 1, in <module>
23:59:21 [2021-05-22T03:59:21.918Z]   File "(none)", line 161, in trace_dispatch
23:59:21 [2021-05-22T03:59:21.918Z] 	at org.eclipse.ease.debugging.AbstractEaseDebugger.handleEventsInSuspendedState(AbstractEaseDebugger.java:329)
23:59:21 [2021-05-22T03:59:21.918Z] 	at org.eclipse.ease.debugging.AbstractEaseDebugger.suspend(AbstractEaseDebugger.java:255)
23:59:21 [2021-05-22T03:59:21.918Z] 	at org.eclipse.ease.debugging.AbstractEaseDebugger.processLine(AbstractEaseDebugger.java:490)
23:59:21 [2021-05-22T03:59:21.918Z] 	at org.eclipse.ease.lang.python.debugger.PythonDebugger.traceDispatch(PythonDebugger.java:177)
23:59:21 [2021-05-22T03:59:21.918Z] 	at org.eclipse.ease.lang.python.jython.debugger.JythonDebugger.traceDispatch(JythonDebugger.java:44)
23:59:21 [2021-05-22T03:59:21.918Z] 	at jdk.internal.reflect.GeneratedMethodAccessor25.invoke(Unknown Source)
23:59:21 [2021-05-22T03:59:21.918Z] 	at java.base/jdk.internal.reflect.DelegatingMethodAccessorImpl.invoke(DelegatingMethodAccessorImpl.java:43)
23:59:21 [2021-05-22T03:59:21.918Z] 	at java.base/java.lang.reflect.Method.invoke(Method.java:564)
23:59:21 [2021-05-22T03:59:21.918Z] 
23:59:21 [2021-05-22T03:59:21.918Z] org.eclipse.ease.ScriptEngineCancellationException: org.eclipse.ease.ScriptEngineCancellationException: Terminated on user request
23:59:22 [2021-05-22T03:59:22.176Z] Start of script
23:59:22 [2021-05-22T03:59:22.176Z] include file start
23:59:22 [2021-05-22T03:59:22.176Z] include file processed
23:59:22 [2021-05-22T03:59:22.176Z] Result of testMethod = 5
23:59:22 [2021-05-22T03:59:22.176Z] End of script
23:59:22 [2021-05-22T03:59:22.433Z] Start of script
23:59:22 [2021-05-22T03:59:22.433Z] include file start
23:59:22 [2021-05-22T03:59:22.433Z] include file processed
23:59:22 [2021-05-22T03:59:22.433Z] Result of testMethod = 5
23:59:22 [2021-05-22T03:59:22.433Z] End of script
23:59:22 [2021-05-22T03:59:22.694Z] Start of script
23:59:22 [2021-05-22T03:59:22.694Z] include file start
23:59:22 [2021-05-22T03:59:22.694Z] include file processed
23:59:22 [2021-05-22T03:59:22.694Z] Result of testMethod = 5
23:59:22 [2021-05-22T03:59:22.694Z] End of script
23:59:22 [2021-05-22T03:59:22.951Z] Tests run: 42, Failures: 0, Errors: 0, Skipped: 0, Time elapsed: 15.834 s - in org.eclipse.ease.lang.python.jython.debugger.JythonDebugTest
23:59:22 [2021-05-22T03:59:22.951Z] disconnectProcessInSuspendedState  Time elapsed: 3.028 s
23:59:22 [2021-05-22T03:59:22.951Z] stepReturnIncludeCommand  Time elapsed: 0.314 s
23:59:22 [2021-05-22T03:59:22.951Z] arrayVariableSorting  Time elapsed: 0.512 s
23:59:22 [2021-05-22T03:59:22.951Z] stepOverOnDebugTarget  Time elapsed: 0.411 s
23:59:22 [2021-05-22T03:59:22.951Z] hasDebugTarget  Time elapsed: 0.206 s
23:59:22 [2021-05-22T03:59:22.951Z] disconnectThreadInSuspendedState  Time elapsed: 0.209 s
23:59:22 [2021-05-22T03:59:22.951Z] stepReturnOnDebugTarget  Time elapsed: 0.312 s
23:59:22 [2021-05-22T03:59:22.951Z] nullVariable  Time elapsed: 0.309 s
23:59:22 [2021-05-22T03:59:22.951Z] stepOverOnStackFrame  Time elapsed: 0.547 s
23:59:22 [2021-05-22T03:59:22.951Z] resumeOnDebugTarget  Time elapsed: 0.208 s
23:59:22 [2021-05-22T03:59:22.952Z] modifyVariableKeepingType  Time elapsed: 0.509 s
23:59:22 [2021-05-22T03:59:22.952Z] resumeOnLastIncludeLine  Time elapsed: 0.308 s
23:59:22 [2021-05-22T03:59:22.952Z] stepReturnOnStackFrame  Time elapsed: 0.408 s
23:59:22 [2021-05-22T03:59:22.952Z] terminateStackFrameInSuspendedState  Time elapsed: 0.208 s
23:59:22 [2021-05-22T03:59:22.952Z] breakpointLocation  Time elapsed: 0.21 s
23:59:22 [2021-05-22T03:59:22.952Z] stepReturnOnThread  Time elapsed: 0.409 s
23:59:22 [2021-05-22T03:59:22.952Z] javaClassVariable  Time elapsed: 0.31 s
23:59:22 [2021-05-22T03:59:22.952Z] stepIntoOnThread  Time elapsed: 0.309 s
23:59:22 [2021-05-22T03:59:22.952Z] terminateThreadInSuspendedState  Time elapsed: 0.308 s
23:59:22 [2021-05-22T03:59:22.952Z] resumeOnThread  Time elapsed: 0.208 s
23:59:22 [2021-05-22T03:59:22.952Z] stepIntoOnStackFrame  Time elapsed: 0.308 s
23:59:22 [2021-05-22T03:59:22.952Z] terminateProcessInSuspendedState  Time elapsed: 0.281 s
23:59:22 [2021-05-22T03:59:22.952Z] stepOverOnProcess  Time elapsed: 0.317 s
23:59:22 [2021-05-22T03:59:22.952Z] nativeArrayVariable  Time elapsed: 0.343 s
23:59:22 [2021-05-22T03:59:22.952Z] disconnectDebugTargetInSuspendedState  Time elapsed: 0.333 s
23:59:22 [2021-05-22T03:59:22.952Z] stepIntoOnProcess  Time elapsed: 0.313 s
23:59:22 [2021-05-22T03:59:22.952Z] terminatedState  Time elapsed: 0.105 s
23:59:22 [2021-05-22T03:59:22.952Z] stepOverIncludeCommand  Time elapsed: 0.747 s
23:59:22 [2021-05-22T03:59:22.952Z] innerScopeVariableBeforeOuterScopeVariable  Time elapsed: 0.306 s
23:59:22 [2021-05-22T03:59:22.952Z] stepIntoIncludeCommand  Time elapsed: 0.307 s
23:59:22 [2021-05-22T03:59:22.952Z] primitiveStringVariable  Time elapsed: 0.306 s
23:59:22 [2021-05-22T03:59:22.952Z] resumeOnProcess  Time elapsed: 0.206 s
23:59:22 [2021-05-22T03:59:22.952Z] stepIntoOnDebugTarget  Time elapsed: 0.306 s
23:59:22 [2021-05-22T03:59:22.952Z] stepOverOnThread  Time elapsed: 0.306 s
23:59:22 [2021-05-22T03:59:22.952Z] suspendedState  Time elapsed: 0.307 s
23:59:22 [2021-05-22T03:59:22.952Z] primitiveDoubleVariable  Time elapsed: 0.313 s
23:59:22 [2021-05-22T03:59:22.952Z] resumeOnStackFrame  Time elapsed: 0.207 s
23:59:22 [2021-05-22T03:59:22.952Z] nativeObjectVariable  Time elapsed: 0.306 s
23:59:22 [2021-05-22T03:59:22.952Z] terminateDebugTargetInSuspendedState  Time elapsed: 0.205 s
23:59:22 [2021-05-22T03:59:22.952Z] disconnectStackFrameInSuspendedState  Time elapsed: 0.207 s
23:59:22 [2021-05-22T03:59:22.952Z] stepReturnOnProcess  Time elapsed: 0.308 s
23:59:22 [2021-05-22T03:59:22.952Z] evaluateWatchExpression  Time elapsed: 0.227 s
23:59:22 [2021-05-22T03:59:22.952Z] 
23:59:22 [2021-05-22T03:59:22.952Z] Results:
23:59:22 [2021-05-22T03:59:22.952Z] 
23:59:22 [2021-05-22T03:59:22.952Z] Tests run: 42, Failures: 0, Errors: 0, Skipped: 0
23:59:22 [2021-05-22T03:59:22.952Z] 
23:59:23 [2021-05-22T03:59:23.886Z] [INFO] All tests passed!
23:59:23 [2021-05-22T03:59:23.886Z] [INFO] 
23:59:23 [2021-05-22T03:59:23.886Z] [INFO] -----< org.eclipse.ease:org.eclipse.ease.lang.scriptarchive.test >------
23:59:23 [2021-05-22T03:59:23.886Z] [INFO] Building org.eclipse.ease.lang.scriptarchive.test 0.8.0-SNAPSHOT   [8/9]
23:59:23 [2021-05-22T03:59:23.886Z] [INFO] ------------------------[ eclipse-test-plugin ]-------------------------
23:59:23 [2021-05-22T03:59:23.886Z] [INFO] 
23:59:23 [2021-05-22T03:59:23.886Z] [INFO] --- tycho-packaging-plugin:2.2.0:build-qualifier (default-build-qualifier) @ org.eclipse.ease.lang.scriptarchive.test ---
23:59:23 [2021-05-22T03:59:23.886Z] [INFO] The project's OSGi version is 0.8.0.I202104091518
23:59:23 [2021-05-22T03:59:23.886Z] [INFO] 
23:59:23 [2021-05-22T03:59:23.886Z] [INFO] --- tycho-packaging-plugin:2.2.0:validate-id (default-validate-id) @ org.eclipse.ease.lang.scriptarchive.test ---
23:59:23 [2021-05-22T03:59:23.886Z] [INFO] 
23:59:23 [2021-05-22T03:59:23.886Z] [INFO] --- tycho-packaging-plugin:2.2.0:validate-version (default-validate-version) @ org.eclipse.ease.lang.scriptarchive.test ---
23:59:23 [2021-05-22T03:59:23.886Z] [INFO] 
23:59:23 [2021-05-22T03:59:23.886Z] [INFO] --- maven-resources-plugin:2.4.3:resources (default-resources) @ org.eclipse.ease.lang.scriptarchive.test ---
23:59:23 [2021-05-22T03:59:23.886Z] [INFO] Using 'UTF-8' encoding to copy filtered resources.
23:59:23 [2021-05-22T03:59:23.886Z] [INFO] skip non existing resourceDirectory /home/jenkins/agent/workspace/ease.verify.core.target.2018-12/tests/org.eclipse.ease.lang.scriptarchive.test/src/main/resources
23:59:23 [2021-05-22T03:59:23.886Z] [INFO] 
23:59:23 [2021-05-22T03:59:23.886Z] [INFO] --- tycho-compiler-plugin:2.2.0:compile (default-compile) @ org.eclipse.ease.lang.scriptarchive.test ---
23:59:23 [2021-05-22T03:59:23.886Z] [INFO] Nothing to compile - all classes are up to date
23:59:23 [2021-05-22T03:59:23.886Z] [INFO] 
23:59:23 [2021-05-22T03:59:23.886Z] [INFO] --- maven-resources-plugin:2.4.3:testResources (default-testResources) @ org.eclipse.ease.lang.scriptarchive.test ---
23:59:23 [2021-05-22T03:59:23.886Z] [INFO] Using 'UTF-8' encoding to copy filtered resources.
23:59:23 [2021-05-22T03:59:23.886Z] [INFO] skip non existing resourceDirectory /home/jenkins/agent/workspace/ease.verify.core.target.2018-12/tests/org.eclipse.ease.lang.scriptarchive.test/src/test/resources
23:59:23 [2021-05-22T03:59:23.886Z] [INFO] 
23:59:23 [2021-05-22T03:59:23.886Z] [INFO] --- target-platform-configuration:2.2.0:target-platform (default-target-platform) @ org.eclipse.ease.lang.scriptarchive.test ---
23:59:23 [2021-05-22T03:59:23.886Z] [INFO] 
23:59:23 [2021-05-22T03:59:23.886Z] [INFO] --- tycho-packaging-plugin:2.2.0:package-plugin (default-package-plugin) @ org.eclipse.ease.lang.scriptarchive.test ---
23:59:23 [2021-05-22T03:59:23.887Z] [INFO] Building jar: /home/jenkins/agent/workspace/ease.verify.core.target.2018-12/tests/org.eclipse.ease.lang.scriptarchive.test/target/org.eclipse.ease.lang.scriptarchive.test-0.8.0-SNAPSHOT.jar
23:59:23 [2021-05-22T03:59:23.887Z] [INFO] 
23:59:23 [2021-05-22T03:59:23.887Z] [INFO] --- tycho-p2-plugin:2.2.0:p2-metadata-default (default-p2-metadata-default) @ org.eclipse.ease.lang.scriptarchive.test ---
23:59:23 [2021-05-22T03:59:23.887Z] [INFO] 
23:59:23 [2021-05-22T03:59:23.887Z] [INFO] --- jacoco-maven-plugin:0.8.6:prepare-agent (jacoco-initialize) @ org.eclipse.ease.lang.scriptarchive.test ---
23:59:23 [2021-05-22T03:59:23.887Z] [INFO] tycho.testArgLine set to -javaagent:/home/jenkins/.m2/repository/org/jacoco/org.jacoco.agent/0.8.6/org.jacoco.agent-0.8.6-runtime.jar=destfile=/home/jenkins/agent/workspace/ease.verify.core.target.2018-12/tests/org.eclipse.ease.lang.scriptarchive.test/target/jacoco.exec,output=file
23:59:23 [2021-05-22T03:59:23.887Z] [INFO] 
23:59:23 [2021-05-22T03:59:23.887Z] [INFO] --- tycho-surefire-plugin:2.2.0:test (default-test) @ org.eclipse.ease.lang.scriptarchive.test ---
23:59:23 [2021-05-22T03:59:23.887Z] [INFO] Executing Test Runtime with timeout 0, logs (if any) will be placed at: /home/jenkins/agent/workspace/ease.verify.core.target.2018-12/tests/org.eclipse.ease.lang.scriptarchive.test/target/work/data/.metadata/.log
23:59:23 [2021-05-22T03:59:23.887Z] [INFO] Command line:
23:59:23 [2021-05-22T03:59:23.887Z] 	[/opt/tools/java/openjdk/jdk-15/15.0.2+7/bin/java, -Dosgi.noShutdown=false, -Dosgi.os=linux, -Dosgi.ws=gtk, -Dosgi.arch=x86_64, -javaagent:/home/jenkins/.m2/repository/org/jacoco/org.jacoco.agent/0.8.6/org.jacoco.agent-0.8.6-runtime.jar=destfile=/home/jenkins/agent/workspace/ease.verify.core.target.2018-12/tests/org.eclipse.ease.lang.scriptarchive.test/target/jacoco.exec,output=file, -Dosgi.clean=true, -jar, /home/jenkins/.m2/repository/p2/osgi/bundle/org.eclipse.equinox.launcher/1.5.200.v20180922-1751/org.eclipse.equinox.launcher-1.5.200.v20180922-1751.jar, -data, /home/jenkins/agent/workspace/ease.verify.core.target.2018-12/tests/org.eclipse.ease.lang.scriptarchive.test/target/work/data, -install, /home/jenkins/agent/workspace/ease.verify.core.target.2018-12/tests/org.eclipse.ease.lang.scriptarchive.test/target/work, -configuration, /home/jenkins/agent/workspace/ease.verify.core.target.2018-12/tests/org.eclipse.ease.lang.scriptarchive.test/target/work/configuration, -application, org.eclipse.tycho.surefire.osgibooter.headlesstest, -testproperties, /home/jenkins/agent/workspace/ease.verify.core.target.2018-12/tests/org.eclipse.ease.lang.scriptarchive.test/target/surefire.properties]
23:59:23 [2021-05-22T03:59:23.887Z] Picked up JAVA_TOOL_OPTIONS: -Dmaven.ext.class.path="/home/jenkins/agent/workspace/ease.verify.core.target.2018-12@tmp/withMaven712aadef/pipeline-maven-spy.jar" -Dorg.jenkinsci.plugins.pipeline.maven.reportsFolder="/home/jenkins/agent/workspace/ease.verify.core.target.2018-12@tmp/withMaven712aadef" 
23:59:27 [2021-05-22T03:59:27.185Z] May 22, 2021 3:59:27 AM org.junit.platform.launcher.core.DefaultLauncher handleThrowable
23:59:27 [2021-05-22T03:59:27.185Z] WARNING: TestEngine with ID 'junit-vintage' failed to discover tests
23:59:27 [2021-05-22T03:59:27.185Z] java.lang.NoClassDefFoundError: org/junit/runners/model/RunnerBuilder
23:59:27 [2021-05-22T03:59:27.185Z] 	at org.junit.vintage.engine.discovery.VintageDiscoverer.<init>(VintageDiscoverer.java:48)
23:59:27 [2021-05-22T03:59:27.185Z] 	at org.junit.vintage.engine.VintageTestEngine.discover(VintageTestEngine.java:65)
23:59:27 [2021-05-22T03:59:27.185Z] 	at org.junit.platform.launcher.core.DefaultLauncher.discoverEngineRoot(DefaultLauncher.java:130)
23:59:27 [2021-05-22T03:59:27.185Z] 	at org.junit.platform.launcher.core.DefaultLauncher.discoverRoot(DefaultLauncher.java:117)
23:59:27 [2021-05-22T03:59:27.185Z] 	at org.junit.platform.launcher.core.DefaultLauncher.discover(DefaultLauncher.java:82)
23:59:27 [2021-05-22T03:59:27.185Z] 	at org.apache.maven.surefire.junitplatform.TestPlanScannerFilter.accept(TestPlanScannerFilter.java:56)
23:59:27 [2021-05-22T03:59:27.185Z] 	at org.apache.maven.surefire.util.DefaultScanResult.applyFilter(DefaultScanResult.java:102)
23:59:27 [2021-05-22T03:59:27.185Z] 	at org.apache.maven.surefire.junitplatform.JUnitPlatformProvider.scanClasspath(JUnitPlatformProvider.java:143)
23:59:27 [2021-05-22T03:59:27.185Z] 	at org.apache.maven.surefire.junitplatform.JUnitPlatformProvider.invoke(JUnitPlatformProvider.java:124)
23:59:27 [2021-05-22T03:59:27.185Z] 	at java.base/jdk.internal.reflect.NativeMethodAccessorImpl.invoke0(Native Method)
23:59:27 [2021-05-22T03:59:27.185Z] 	at java.base/jdk.internal.reflect.NativeMethodAccessorImpl.invoke(NativeMethodAccessorImpl.java:64)
23:59:27 [2021-05-22T03:59:27.185Z] 	at java.base/jdk.internal.reflect.DelegatingMethodAccessorImpl.invoke(DelegatingMethodAccessorImpl.java:43)
23:59:27 [2021-05-22T03:59:27.185Z] 	at java.base/java.lang.reflect.Method.invoke(Method.java:564)
23:59:27 [2021-05-22T03:59:27.185Z] 	at org.apache.maven.surefire.util.ReflectionUtils.invokeMethodWithArray2(ReflectionUtils.java:206)
23:59:27 [2021-05-22T03:59:27.185Z] 	at org.apache.maven.surefire.booter.ProviderFactory$ProviderProxy.invoke(ProviderFactory.java:161)
23:59:27 [2021-05-22T03:59:27.185Z] 	at org.apache.maven.surefire.booter.ProviderFactory.invokeProvider(ProviderFactory.java:84)
23:59:27 [2021-05-22T03:59:27.185Z] 	at org.eclipse.tycho.surefire.osgibooter.OsgiSurefireBooter.run(OsgiSurefireBooter.java:116)
23:59:27 [2021-05-22T03:59:27.185Z] 	at org.eclipse.tycho.surefire.osgibooter.HeadlessTestApplication.start(HeadlessTestApplication.java:23)
23:59:27 [2021-05-22T03:59:27.186Z] 	at org.eclipse.equinox.internal.app.EclipseAppHandle.run(EclipseAppHandle.java:203)
23:59:27 [2021-05-22T03:59:27.186Z] 	at org.eclipse.core.runtime.internal.adaptor.EclipseAppLauncher.runApplication(EclipseAppLauncher.java:137)
23:59:27 [2021-05-22T03:59:27.186Z] 	at org.eclipse.core.runtime.internal.adaptor.EclipseAppLauncher.start(EclipseAppLauncher.java:107)
23:59:27 [2021-05-22T03:59:27.186Z] 	at org.eclipse.core.runtime.adaptor.EclipseStarter.run(EclipseStarter.java:400)
23:59:27 [2021-05-22T03:59:27.186Z] 	at org.eclipse.core.runtime.adaptor.EclipseStarter.run(EclipseStarter.java:255)
23:59:27 [2021-05-22T03:59:27.186Z] 	at java.base/jdk.internal.reflect.NativeMethodAccessorImpl.invoke0(Native Method)
23:59:27 [2021-05-22T03:59:27.186Z] 	at java.base/jdk.internal.reflect.NativeMethodAccessorImpl.invoke(NativeMethodAccessorImpl.java:64)
23:59:27 [2021-05-22T03:59:27.186Z] 	at java.base/jdk.internal.reflect.DelegatingMethodAccessorImpl.invoke(DelegatingMethodAccessorImpl.java:43)
23:59:27 [2021-05-22T03:59:27.186Z] 	at java.base/java.lang.reflect.Method.invoke(Method.java:564)
23:59:27 [2021-05-22T03:59:27.186Z] 	at org.eclipse.equinox.launcher.Main.invokeFramework(Main.java:659)
23:59:27 [2021-05-22T03:59:27.186Z] 	at org.eclipse.equinox.launcher.Main.basicRun(Main.java:595)
23:59:27 [2021-05-22T03:59:27.186Z] 	at org.eclipse.equinox.launcher.Main.run(Main.java:1501)
23:59:27 [2021-05-22T03:59:27.186Z] 	at org.eclipse.equinox.launcher.Main.main(Main.java:1474)
23:59:27 [2021-05-22T03:59:27.186Z] Caused by: java.lang.ClassNotFoundException: org.junit.runners.model.RunnerBuilder cannot be found by org.eclipse.tycho.surefire.osgibooter_2.2.0
23:59:27 [2021-05-22T03:59:27.186Z] 	at org.eclipse.osgi.internal.loader.BundleLoader.findClassInternal(BundleLoader.java:511)
23:59:27 [2021-05-22T03:59:27.186Z] 	at org.eclipse.osgi.internal.loader.BundleLoader.findClass(BundleLoader.java:422)
23:59:27 [2021-05-22T03:59:27.186Z] 	at org.eclipse.osgi.internal.loader.BundleLoader.findClass(BundleLoader.java:414)
23:59:27 [2021-05-22T03:59:27.186Z] 	at org.eclipse.osgi.internal.loader.ModuleClassLoader.loadClass(ModuleClassLoader.java:153)
23:59:27 [2021-05-22T03:59:27.186Z] 	at java.base/java.lang.ClassLoader.loadClass(ClassLoader.java:522)
23:59:27 [2021-05-22T03:59:27.186Z] 	... 31 more
23:59:27 [2021-05-22T03:59:27.186Z] 
23:59:27 [2021-05-22T03:59:27.186Z] May 22, 2021 3:59:27 AM org.junit.platform.launcher.core.DefaultLauncher handleThrowable
23:59:27 [2021-05-22T03:59:27.186Z] WARNING: TestEngine with ID 'junit-vintage' failed to discover tests
23:59:27 [2021-05-22T03:59:27.186Z] java.lang.NoClassDefFoundError: org/junit/runners/model/RunnerBuilder
23:59:27 [2021-05-22T03:59:27.186Z] 	at org.junit.vintage.engine.discovery.VintageDiscoverer.<init>(VintageDiscoverer.java:48)
23:59:27 [2021-05-22T03:59:27.186Z] 	at org.junit.vintage.engine.VintageTestEngine.discover(VintageTestEngine.java:65)
23:59:27 [2021-05-22T03:59:27.186Z] 	at org.junit.platform.launcher.core.DefaultLauncher.discoverEngineRoot(DefaultLauncher.java:130)
23:59:27 [2021-05-22T03:59:27.186Z] 	at org.junit.platform.launcher.core.DefaultLauncher.discoverRoot(DefaultLauncher.java:117)
23:59:27 [2021-05-22T03:59:27.186Z] 	at org.junit.platform.launcher.core.DefaultLauncher.execute(DefaultLauncher.java:90)
23:59:27 [2021-05-22T03:59:27.186Z] 	at org.apache.maven.surefire.junitplatform.JUnitPlatformProvider.invokeAllTests(JUnitPlatformProvider.java:150)
23:59:27 [2021-05-22T03:59:27.186Z] 	at org.apache.maven.surefire.junitplatform.JUnitPlatformProvider.invoke(JUnitPlatformProvider.java:124)
23:59:27 [2021-05-22T03:59:27.186Z] 	at java.base/jdk.internal.reflect.NativeMethodAccessorImpl.invoke0(Native Method)
23:59:27 [2021-05-22T03:59:27.186Z] 	at java.base/jdk.internal.reflect.NativeMethodAccessorImpl.invoke(NativeMethodAccessorImpl.java:64)
23:59:27 [2021-05-22T03:59:27.186Z] 	at java.base/jdk.internal.reflect.DelegatingMethodAccessorImpl.invoke(DelegatingMethodAccessorImpl.java:43)
23:59:27 [2021-05-22T03:59:27.186Z] 	at java.base/java.lang.reflect.Method.invoke(Method.java:564)
23:59:27 [2021-05-22T03:59:27.186Z] 	at org.apache.maven.surefire.util.ReflectionUtils.invokeMethodWithArray2(ReflectionUtils.java:206)
23:59:27 [2021-05-22T03:59:27.186Z] 	at org.apache.maven.surefire.booter.ProviderFactory$ProviderProxy.invoke(ProviderFactory.java:161)
23:59:27 [2021-05-22T03:59:27.186Z] 	at org.apache.maven.surefire.booter.ProviderFactory.invokeProvider(ProviderFactory.java:84)
23:59:27 [2021-05-22T03:59:27.186Z] 	at org.eclipse.tycho.surefire.osgibooter.OsgiSurefireBooter.run(OsgiSurefireBooter.java:116)
23:59:27 [2021-05-22T03:59:27.186Z] 	at org.eclipse.tycho.surefire.osgibooter.HeadlessTestApplication.start(HeadlessTestApplication.java:23)
23:59:27 [2021-05-22T03:59:27.186Z] 	at org.eclipse.equinox.internal.app.EclipseAppHandle.run(EclipseAppHandle.java:203)
23:59:27 [2021-05-22T03:59:27.186Z] 	at org.eclipse.core.runtime.internal.adaptor.EclipseAppLauncher.runApplication(EclipseAppLauncher.java:137)
23:59:27 [2021-05-22T03:59:27.186Z] 	at org.eclipse.core.runtime.internal.adaptor.EclipseAppLauncher.start(EclipseAppLauncher.java:107)
23:59:27 [2021-05-22T03:59:27.186Z] 	at org.eclipse.core.runtime.adaptor.EclipseStarter.run(EclipseStarter.java:400)
23:59:27 [2021-05-22T03:59:27.186Z] 	at org.eclipse.core.runtime.adaptor.EclipseStarter.run(EclipseStarter.java:255)
23:59:27 [2021-05-22T03:59:27.186Z] 	at java.base/jdk.internal.reflect.NativeMethodAccessorImpl.invoke0(Native Method)
23:59:27 [2021-05-22T03:59:27.186Z] 	at java.base/jdk.internal.reflect.NativeMethodAccessorImpl.invoke(NativeMethodAccessorImpl.java:64)
23:59:27 [2021-05-22T03:59:27.186Z] 	at java.base/jdk.internal.reflect.DelegatingMethodAccessorImpl.invoke(DelegatingMethodAccessorImpl.java:43)
23:59:27 [2021-05-22T03:59:27.186Z] 	at java.base/java.lang.reflect.Method.invoke(Method.java:564)
23:59:27 [2021-05-22T03:59:27.186Z] 	at org.eclipse.equinox.launcher.Main.invokeFramework(Main.java:659)
23:59:27 [2021-05-22T03:59:27.186Z] 	at org.eclipse.equinox.launcher.Main.basicRun(Main.java:595)
23:59:27 [2021-05-22T03:59:27.186Z] 	at org.eclipse.equinox.launcher.Main.run(Main.java:1501)
23:59:27 [2021-05-22T03:59:27.186Z] 	at org.eclipse.equinox.launcher.Main.main(Main.java:1474)
23:59:27 [2021-05-22T03:59:27.186Z] Caused by: java.lang.ClassNotFoundException: org.junit.runners.model.RunnerBuilder cannot be found by org.eclipse.tycho.surefire.osgibooter_2.2.0
23:59:27 [2021-05-22T03:59:27.186Z] 	at org.eclipse.osgi.internal.loader.BundleLoader.findClassInternal(BundleLoader.java:511)
23:59:27 [2021-05-22T03:59:27.186Z] 	at org.eclipse.osgi.internal.loader.BundleLoader.findClass(BundleLoader.java:422)
23:59:27 [2021-05-22T03:59:27.186Z] 	at org.eclipse.osgi.internal.loader.BundleLoader.findClass(BundleLoader.java:414)
23:59:27 [2021-05-22T03:59:27.186Z] 	at org.eclipse.osgi.internal.loader.ModuleClassLoader.loadClass(ModuleClassLoader.java:153)
23:59:27 [2021-05-22T03:59:27.187Z] 	at java.base/java.lang.ClassLoader.loadClass(ClassLoader.java:522)
23:59:27 [2021-05-22T03:59:27.187Z] 	... 29 more
23:59:27 [2021-05-22T03:59:27.187Z] 
23:59:27 [2021-05-22T03:59:27.443Z] Running org.eclipse.ease.lang.scriptarchive.ArchiveEngineTest
23:59:28 [2021-05-22T03:59:28.032Z] We are running from a zip file!
23:59:28 [2021-05-22T03:59:28.290Z] org.eclipse.ease.ScriptExecutionException: SyntaxError: missing ; before statement (workspace://__EASE_ScriptArchive_1/scripts/Master.js#3)
23:59:28 [2021-05-22T03:59:28.291Z] this is an error
23:59:28 [2021-05-22T03:59:28.291Z]        ^
23:59:28 [2021-05-22T03:59:28.291Z] 	at Master.js,workspace://__EASE_ScriptArchive_1/scripts/Master.js
23:59:28 [2021-05-22T03:59:28.291Z] org.eclipse.ease.ScriptExecutionException: SyntaxError: missing ; before statement (workspace://__EASE_ScriptArchive_1/scripts/Master.js#3)
23:59:28 [2021-05-22T03:59:28.291Z] this is an error
23:59:28 [2021-05-22T03:59:28.291Z]        ^
23:59:28 [2021-05-22T03:59:28.291Z] 	at Master.js,workspace://__EASE_ScriptArchive_1/scripts/Master.js
23:59:28 [2021-05-22T03:59:28.291Z] Tests run: 7, Failures: 0, Errors: 0, Skipped: 0, Time elapsed: 1.052 s - in org.eclipse.ease.lang.scriptarchive.ArchiveEngineTest
23:59:28 [2021-05-22T03:59:28.291Z] executeWithManifest  Time elapsed: 0.861 s
23:59:28 [2021-05-22T03:59:28.291Z] zipFileRegistration  Time elapsed: 0.016 s
23:59:28 [2021-05-22T03:59:28.291Z] engineIdRegistration  Time elapsed: 0 s
23:59:28 [2021-05-22T03:59:28.291Z] jarFileRegistration  Time elapsed: 0 s
23:59:28 [2021-05-22T03:59:28.291Z] sarFileRegistration  Time elapsed: 0 s
23:59:28 [2021-05-22T03:59:28.291Z] executeWithErrors  Time elapsed: 0.081 s
23:59:28 [2021-05-22T03:59:28.291Z] executeWithIncludes  Time elapsed: 0.083 s
23:59:28 [2021-05-22T03:59:28.291Z] 
23:59:28 [2021-05-22T03:59:28.291Z] Results:
23:59:28 [2021-05-22T03:59:28.291Z] 
23:59:28 [2021-05-22T03:59:28.291Z] Tests run: 7, Failures: 0, Errors: 0, Skipped: 0
23:59:28 [2021-05-22T03:59:28.291Z] 
23:59:29 [2021-05-22T03:59:29.232Z] [INFO] All tests passed!
23:59:29 [2021-05-22T03:59:29.232Z] [INFO] 
23:59:29 [2021-05-22T03:59:29.232Z] [INFO] -------------< org.eclipse.ease:org.eclipse.ease.ui.test >--------------
23:59:29 [2021-05-22T03:59:29.232Z] [INFO] Building org.eclipse.ease.ui.test 0.8.0-SNAPSHOT                   [9/9]
23:59:29 [2021-05-22T03:59:29.232Z] [INFO] ------------------------[ eclipse-test-plugin ]-------------------------
23:59:29 [2021-05-22T03:59:29.232Z] [INFO] 
23:59:29 [2021-05-22T03:59:29.232Z] [INFO] --- tycho-packaging-plugin:2.2.0:build-qualifier (default-build-qualifier) @ org.eclipse.ease.ui.test ---
23:59:29 [2021-05-22T03:59:29.232Z] [INFO] The project's OSGi version is 0.8.0.I202104091518
23:59:29 [2021-05-22T03:59:29.232Z] [INFO] 
23:59:29 [2021-05-22T03:59:29.232Z] [INFO] --- tycho-packaging-plugin:2.2.0:validate-id (default-validate-id) @ org.eclipse.ease.ui.test ---
23:59:29 [2021-05-22T03:59:29.232Z] [INFO] 
23:59:29 [2021-05-22T03:59:29.232Z] [INFO] --- tycho-packaging-plugin:2.2.0:validate-version (default-validate-version) @ org.eclipse.ease.ui.test ---
23:59:29 [2021-05-22T03:59:29.232Z] [INFO] 
23:59:29 [2021-05-22T03:59:29.232Z] [INFO] --- maven-resources-plugin:2.4.3:resources (default-resources) @ org.eclipse.ease.ui.test ---
23:59:29 [2021-05-22T03:59:29.232Z] [INFO] Using 'UTF-8' encoding to copy filtered resources.
23:59:29 [2021-05-22T03:59:29.232Z] [INFO] skip non existing resourceDirectory /home/jenkins/agent/workspace/ease.verify.core.target.2018-12/tests/org.eclipse.ease.ui.test/src/main/resources
23:59:29 [2021-05-22T03:59:29.232Z] [INFO] 
23:59:29 [2021-05-22T03:59:29.232Z] [INFO] --- tycho-compiler-plugin:2.2.0:compile (default-compile) @ org.eclipse.ease.ui.test ---
23:59:29 [2021-05-22T03:59:29.232Z] [INFO] Nothing to compile - all classes are up to date
23:59:29 [2021-05-22T03:59:29.232Z] [INFO] 
23:59:29 [2021-05-22T03:59:29.233Z] [INFO] --- maven-resources-plugin:2.4.3:testResources (default-testResources) @ org.eclipse.ease.ui.test ---
23:59:29 [2021-05-22T03:59:29.233Z] [INFO] Using 'UTF-8' encoding to copy filtered resources.
23:59:29 [2021-05-22T03:59:29.233Z] [INFO] skip non existing resourceDirectory /home/jenkins/agent/workspace/ease.verify.core.target.2018-12/tests/org.eclipse.ease.ui.test/src/test/resources
23:59:29 [2021-05-22T03:59:29.233Z] [INFO] 
23:59:29 [2021-05-22T03:59:29.233Z] [INFO] --- target-platform-configuration:2.2.0:target-platform (default-target-platform) @ org.eclipse.ease.ui.test ---
23:59:29 [2021-05-22T03:59:29.233Z] [INFO] 
23:59:29 [2021-05-22T03:59:29.233Z] [INFO] --- tycho-packaging-plugin:2.2.0:package-plugin (default-package-plugin) @ org.eclipse.ease.ui.test ---
23:59:29 [2021-05-22T03:59:29.233Z] [INFO] Building jar: /home/jenkins/agent/workspace/ease.verify.core.target.2018-12/tests/org.eclipse.ease.ui.test/target/org.eclipse.ease.ui.test-0.8.0-SNAPSHOT.jar
23:59:29 [2021-05-22T03:59:29.233Z] [INFO] 
23:59:29 [2021-05-22T03:59:29.233Z] [INFO] --- tycho-p2-plugin:2.2.0:p2-metadata-default (default-p2-metadata-default) @ org.eclipse.ease.ui.test ---
23:59:29 [2021-05-22T03:59:29.233Z] [INFO] 
23:59:29 [2021-05-22T03:59:29.233Z] [INFO] --- jacoco-maven-plugin:0.8.6:prepare-agent (jacoco-initialize) @ org.eclipse.ease.ui.test ---
23:59:29 [2021-05-22T03:59:29.233Z] [INFO] tycho.testArgLine set to -javaagent:/home/jenkins/.m2/repository/org/jacoco/org.jacoco.agent/0.8.6/org.jacoco.agent-0.8.6-runtime.jar=destfile=/home/jenkins/agent/workspace/ease.verify.core.target.2018-12/tests/org.eclipse.ease.ui.test/target/jacoco.exec,output=file
23:59:29 [2021-05-22T03:59:29.233Z] [INFO] 
23:59:29 [2021-05-22T03:59:29.233Z] [INFO] --- tycho-surefire-plugin:2.2.0:test (default-test) @ org.eclipse.ease.ui.test ---
23:59:29 [2021-05-22T03:59:29.233Z] [INFO] Executing Test Runtime with timeout 0, logs (if any) will be placed at: /home/jenkins/agent/workspace/ease.verify.core.target.2018-12/tests/org.eclipse.ease.ui.test/target/work/data/.metadata/.log
23:59:29 [2021-05-22T03:59:29.233Z] [INFO] Command line:
23:59:29 [2021-05-22T03:59:29.233Z] 	[/opt/tools/java/openjdk/jdk-15/15.0.2+7/bin/java, -Dosgi.noShutdown=false, -Dosgi.os=linux, -Dosgi.ws=gtk, -Dosgi.arch=x86_64, -javaagent:/home/jenkins/.m2/repository/org/jacoco/org.jacoco.agent/0.8.6/org.jacoco.agent-0.8.6-runtime.jar=destfile=/home/jenkins/agent/workspace/ease.verify.core.target.2018-12/tests/org.eclipse.ease.ui.test/target/jacoco.exec,output=file, -Dosgi.clean=true, -jar, /home/jenkins/.m2/repository/p2/osgi/bundle/org.eclipse.equinox.launcher/1.5.200.v20180922-1751/org.eclipse.equinox.launcher-1.5.200.v20180922-1751.jar, -data, /home/jenkins/agent/workspace/ease.verify.core.target.2018-12/tests/org.eclipse.ease.ui.test/target/work/data, -install, /home/jenkins/agent/workspace/ease.verify.core.target.2018-12/tests/org.eclipse.ease.ui.test/target/work, -configuration, /home/jenkins/agent/workspace/ease.verify.core.target.2018-12/tests/org.eclipse.ease.ui.test/target/work/configuration, -application, org.eclipse.tycho.surefire.osgibooter.headlesstest, -testproperties, /home/jenkins/agent/workspace/ease.verify.core.target.2018-12/tests/org.eclipse.ease.ui.test/target/surefire.properties]
23:59:29 [2021-05-22T03:59:29.233Z] Picked up JAVA_TOOL_OPTIONS: -Dmaven.ext.class.path="/home/jenkins/agent/workspace/ease.verify.core.target.2018-12@tmp/withMaven712aadef/pipeline-maven-spy.jar" -Dorg.jenkinsci.plugins.pipeline.maven.reportsFolder="/home/jenkins/agent/workspace/ease.verify.core.target.2018-12@tmp/withMaven712aadef" 
23:59:33 [2021-05-22T03:59:33.457Z] May 22, 2021 3:59:32 AM org.junit.platform.launcher.core.DefaultLauncher handleThrowable
23:59:33 [2021-05-22T03:59:33.457Z] WARNING: TestEngine with ID 'junit-vintage' failed to discover tests
23:59:33 [2021-05-22T03:59:33.457Z] java.lang.NoClassDefFoundError: org/junit/runners/model/RunnerBuilder
23:59:33 [2021-05-22T03:59:33.457Z] 	at org.junit.vintage.engine.discovery.VintageDiscoverer.<init>(VintageDiscoverer.java:48)
23:59:33 [2021-05-22T03:59:33.457Z] 	at org.junit.vintage.engine.VintageTestEngine.discover(VintageTestEngine.java:65)
23:59:33 [2021-05-22T03:59:33.457Z] 	at org.junit.platform.launcher.core.DefaultLauncher.discoverEngineRoot(DefaultLauncher.java:130)
23:59:33 [2021-05-22T03:59:33.457Z] 	at org.junit.platform.launcher.core.DefaultLauncher.discoverRoot(DefaultLauncher.java:117)
23:59:33 [2021-05-22T03:59:33.457Z] 	at org.junit.platform.launcher.core.DefaultLauncher.discover(DefaultLauncher.java:82)
23:59:33 [2021-05-22T03:59:33.457Z] 	at org.apache.maven.surefire.junitplatform.TestPlanScannerFilter.accept(TestPlanScannerFilter.java:56)
23:59:33 [2021-05-22T03:59:33.457Z] 	at org.apache.maven.surefire.util.DefaultScanResult.applyFilter(DefaultScanResult.java:102)
23:59:33 [2021-05-22T03:59:33.457Z] 	at org.apache.maven.surefire.junitplatform.JUnitPlatformProvider.scanClasspath(JUnitPlatformProvider.java:143)
23:59:33 [2021-05-22T03:59:33.457Z] 	at org.apache.maven.surefire.junitplatform.JUnitPlatformProvider.invoke(JUnitPlatformProvider.java:124)
23:59:33 [2021-05-22T03:59:33.457Z] 	at java.base/jdk.internal.reflect.NativeMethodAccessorImpl.invoke0(Native Method)
23:59:33 [2021-05-22T03:59:33.457Z] 	at java.base/jdk.internal.reflect.NativeMethodAccessorImpl.invoke(NativeMethodAccessorImpl.java:64)
23:59:33 [2021-05-22T03:59:33.457Z] 	at java.base/jdk.internal.reflect.DelegatingMethodAccessorImpl.invoke(DelegatingMethodAccessorImpl.java:43)
23:59:33 [2021-05-22T03:59:33.457Z] 	at java.base/java.lang.reflect.Method.invoke(Method.java:564)
23:59:33 [2021-05-22T03:59:33.457Z] 	at org.apache.maven.surefire.util.ReflectionUtils.invokeMethodWithArray2(ReflectionUtils.java:206)
23:59:33 [2021-05-22T03:59:33.457Z] 	at org.apache.maven.surefire.booter.ProviderFactory$ProviderProxy.invoke(ProviderFactory.java:161)
23:59:33 [2021-05-22T03:59:33.457Z] 	at org.apache.maven.surefire.booter.ProviderFactory.invokeProvider(ProviderFactory.java:84)
23:59:33 [2021-05-22T03:59:33.457Z] 	at org.eclipse.tycho.surefire.osgibooter.OsgiSurefireBooter.run(OsgiSurefireBooter.java:116)
23:59:33 [2021-05-22T03:59:33.457Z] 	at org.eclipse.tycho.surefire.osgibooter.HeadlessTestApplication.start(HeadlessTestApplication.java:23)
23:59:33 [2021-05-22T03:59:33.457Z] 	at org.eclipse.equinox.internal.app.EclipseAppHandle.run(EclipseAppHandle.java:203)
23:59:33 [2021-05-22T03:59:33.457Z] 	at org.eclipse.core.runtime.internal.adaptor.EclipseAppLauncher.runApplication(EclipseAppLauncher.java:137)
23:59:33 [2021-05-22T03:59:33.457Z] 	at org.eclipse.core.runtime.internal.adaptor.EclipseAppLauncher.start(EclipseAppLauncher.java:107)
23:59:33 [2021-05-22T03:59:33.457Z] 	at org.eclipse.core.runtime.adaptor.EclipseStarter.run(EclipseStarter.java:400)
23:59:33 [2021-05-22T03:59:33.457Z] 	at org.eclipse.core.runtime.adaptor.EclipseStarter.run(EclipseStarter.java:255)
23:59:33 [2021-05-22T03:59:33.457Z] 	at java.base/jdk.internal.reflect.NativeMethodAccessorImpl.invoke0(Native Method)
23:59:33 [2021-05-22T03:59:33.457Z] 	at java.base/jdk.internal.reflect.NativeMethodAccessorImpl.invoke(NativeMethodAccessorImpl.java:64)
23:59:33 [2021-05-22T03:59:33.457Z] 	at java.base/jdk.internal.reflect.DelegatingMethodAccessorImpl.invoke(DelegatingMethodAccessorImpl.java:43)
23:59:33 [2021-05-22T03:59:33.457Z] 	at java.base/java.lang.reflect.Method.invoke(Method.java:564)
23:59:33 [2021-05-22T03:59:33.457Z] 	at org.eclipse.equinox.launcher.Main.invokeFramework(Main.java:659)
23:59:33 [2021-05-22T03:59:33.457Z] 	at org.eclipse.equinox.launcher.Main.basicRun(Main.java:595)
23:59:33 [2021-05-22T03:59:33.457Z] 	at org.eclipse.equinox.launcher.Main.run(Main.java:1501)
23:59:33 [2021-05-22T03:59:33.457Z] 	at org.eclipse.equinox.launcher.Main.main(Main.java:1474)
23:59:33 [2021-05-22T03:59:33.457Z] Caused by: java.lang.ClassNotFoundException: org.junit.runners.model.RunnerBuilder cannot be found by org.eclipse.tycho.surefire.osgibooter_2.2.0
23:59:33 [2021-05-22T03:59:33.457Z] 	at org.eclipse.osgi.internal.loader.BundleLoader.findClassInternal(BundleLoader.java:511)
23:59:33 [2021-05-22T03:59:33.457Z] 	at org.eclipse.osgi.internal.loader.BundleLoader.findClass(BundleLoader.java:422)
23:59:33 [2021-05-22T03:59:33.457Z] 	at org.eclipse.osgi.internal.loader.BundleLoader.findClass(BundleLoader.java:414)
23:59:33 [2021-05-22T03:59:33.457Z] 	at org.eclipse.osgi.internal.loader.ModuleClassLoader.loadClass(ModuleClassLoader.java:153)
23:59:33 [2021-05-22T03:59:33.457Z] 	at java.base/java.lang.ClassLoader.loadClass(ClassLoader.java:522)
23:59:33 [2021-05-22T03:59:33.458Z] 	... 31 more
23:59:33 [2021-05-22T03:59:33.458Z] 
23:59:33 [2021-05-22T03:59:33.458Z] May 22, 2021 3:59:32 AM org.junit.platform.launcher.core.DefaultLauncher handleThrowable
23:59:33 [2021-05-22T03:59:33.458Z] WARNING: TestEngine with ID 'junit-vintage' failed to discover tests
23:59:33 [2021-05-22T03:59:33.458Z] java.lang.NoClassDefFoundError: org/junit/runners/model/RunnerBuilder
23:59:33 [2021-05-22T03:59:33.458Z] 	at org.junit.vintage.engine.discovery.VintageDiscoverer.<init>(VintageDiscoverer.java:48)
23:59:33 [2021-05-22T03:59:33.458Z] 	at org.junit.vintage.engine.VintageTestEngine.discover(VintageTestEngine.java:65)
23:59:33 [2021-05-22T03:59:33.458Z] 	at org.junit.platform.launcher.core.DefaultLauncher.discoverEngineRoot(DefaultLauncher.java:130)
23:59:33 [2021-05-22T03:59:33.458Z] 	at org.junit.platform.launcher.core.DefaultLauncher.discoverRoot(DefaultLauncher.java:117)
23:59:33 [2021-05-22T03:59:33.458Z] 	at org.junit.platform.launcher.core.DefaultLauncher.discover(DefaultLauncher.java:82)
23:59:33 [2021-05-22T03:59:33.458Z] 	at org.apache.maven.surefire.junitplatform.TestPlanScannerFilter.accept(TestPlanScannerFilter.java:56)
23:59:33 [2021-05-22T03:59:33.458Z] 	at org.apache.maven.surefire.util.DefaultScanResult.applyFilter(DefaultScanResult.java:102)
23:59:33 [2021-05-22T03:59:33.458Z] 	at org.apache.maven.surefire.junitplatform.JUnitPlatformProvider.scanClasspath(JUnitPlatformProvider.java:143)
23:59:33 [2021-05-22T03:59:33.458Z] 	at org.apache.maven.surefire.junitplatform.JUnitPlatformProvider.invoke(JUnitPlatformProvider.java:124)
23:59:33 [2021-05-22T03:59:33.458Z] 	at java.base/jdk.internal.reflect.NativeMethodAccessorImpl.invoke0(Native Method)
23:59:33 [2021-05-22T03:59:33.458Z] 	at java.base/jdk.internal.reflect.NativeMethodAccessorImpl.invoke(NativeMethodAccessorImpl.java:64)
23:59:33 [2021-05-22T03:59:33.458Z] 	at java.base/jdk.internal.reflect.DelegatingMethodAccessorImpl.invoke(DelegatingMethodAccessorImpl.java:43)
23:59:33 [2021-05-22T03:59:33.458Z] 	at java.base/java.lang.reflect.Method.invoke(Method.java:564)
23:59:33 [2021-05-22T03:59:33.458Z] 	at org.apache.maven.surefire.util.ReflectionUtils.invokeMethodWithArray2(ReflectionUtils.java:206)
23:59:33 [2021-05-22T03:59:33.458Z] 	at org.apache.maven.surefire.booter.ProviderFactory$ProviderProxy.invoke(ProviderFactory.java:161)
23:59:33 [2021-05-22T03:59:33.458Z] 	at org.apache.maven.surefire.booter.ProviderFactory.invokeProvider(ProviderFactory.java:84)
23:59:33 [2021-05-22T03:59:33.458Z] 	at org.eclipse.tycho.surefire.osgibooter.OsgiSurefireBooter.run(OsgiSurefireBooter.java:116)
23:59:33 [2021-05-22T03:59:33.458Z] 	at org.eclipse.tycho.surefire.osgibooter.HeadlessTestApplication.start(HeadlessTestApplication.java:23)
23:59:33 [2021-05-22T03:59:33.458Z] 	at org.eclipse.equinox.internal.app.EclipseAppHandle.run(EclipseAppHandle.java:203)
23:59:33 [2021-05-22T03:59:33.458Z] 	at org.eclipse.core.runtime.internal.adaptor.EclipseAppLauncher.runApplication(EclipseAppLauncher.java:137)
23:59:33 [2021-05-22T03:59:33.458Z] 	at org.eclipse.core.runtime.internal.adaptor.EclipseAppLauncher.start(EclipseAppLauncher.java:107)
23:59:33 [2021-05-22T03:59:33.458Z] 	at org.eclipse.core.runtime.adaptor.EclipseStarter.run(EclipseStarter.java:400)
23:59:33 [2021-05-22T03:59:33.458Z] 	at org.eclipse.core.runtime.adaptor.EclipseStarter.run(EclipseStarter.java:255)
23:59:33 [2021-05-22T03:59:33.458Z] 	at java.base/jdk.internal.reflect.NativeMethodAccessorImpl.invoke0(Native Method)
23:59:33 [2021-05-22T03:59:33.458Z] 	at java.base/jdk.internal.reflect.NativeMethodAccessorImpl.invoke(NativeMethodAccessorImpl.java:64)
23:59:33 [2021-05-22T03:59:33.458Z] 	at java.base/jdk.internal.reflect.DelegatingMethodAccessorImpl.invoke(DelegatingMethodAccessorImpl.java:43)
23:59:33 [2021-05-22T03:59:33.458Z] 	at java.base/java.lang.reflect.Method.invoke(Method.java:564)
23:59:33 [2021-05-22T03:59:33.458Z] 	at org.eclipse.equinox.launcher.Main.invokeFramework(Main.java:659)
23:59:33 [2021-05-22T03:59:33.458Z] 	at org.eclipse.equinox.launcher.Main.basicRun(Main.java:595)
23:59:33 [2021-05-22T03:59:33.458Z] 	at org.eclipse.equinox.launcher.Main.run(Main.java:1501)
23:59:33 [2021-05-22T03:59:33.458Z] 	at org.eclipse.equinox.launcher.Main.main(Main.java:1474)
23:59:33 [2021-05-22T03:59:33.458Z] Caused by: java.lang.ClassNotFoundException: org.junit.runners.model.RunnerBuilder cannot be found by org.eclipse.tycho.surefire.osgibooter_2.2.0
23:59:33 [2021-05-22T03:59:33.458Z] 	at org.eclipse.osgi.internal.loader.BundleLoader.findClassInternal(BundleLoader.java:511)
23:59:33 [2021-05-22T03:59:33.458Z] 	at org.eclipse.osgi.internal.loader.BundleLoader.findClass(BundleLoader.java:422)
23:59:33 [2021-05-22T03:59:33.458Z] 	at org.eclipse.osgi.internal.loader.BundleLoader.findClass(BundleLoader.java:414)
23:59:33 [2021-05-22T03:59:33.458Z] 	at org.eclipse.osgi.internal.loader.ModuleClassLoader.loadClass(ModuleClassLoader.java:153)
23:59:33 [2021-05-22T03:59:33.458Z] 	at java.base/java.lang.ClassLoader.loadClass(ClassLoader.java:522)
23:59:33 [2021-05-22T03:59:33.458Z] 	... 31 more
23:59:33 [2021-05-22T03:59:33.458Z] 
23:59:33 [2021-05-22T03:59:33.458Z] May 22, 2021 3:59:32 AM org.junit.platform.launcher.core.DefaultLauncher handleThrowable
23:59:33 [2021-05-22T03:59:33.458Z] WARNING: TestEngine with ID 'junit-vintage' failed to discover tests
23:59:33 [2021-05-22T03:59:33.458Z] java.lang.NoClassDefFoundError: org/junit/runners/model/RunnerBuilder
23:59:33 [2021-05-22T03:59:33.458Z] 	at org.junit.vintage.engine.discovery.VintageDiscoverer.<init>(VintageDiscoverer.java:48)
23:59:33 [2021-05-22T03:59:33.458Z] 	at org.junit.vintage.engine.VintageTestEngine.discover(VintageTestEngine.java:65)
23:59:33 [2021-05-22T03:59:33.458Z] 	at org.junit.platform.launcher.core.DefaultLauncher.discoverEngineRoot(DefaultLauncher.java:130)
23:59:33 [2021-05-22T03:59:33.458Z] 	at org.junit.platform.launcher.core.DefaultLauncher.discoverRoot(DefaultLauncher.java:117)
23:59:33 [2021-05-22T03:59:33.458Z] 	at org.junit.platform.launcher.core.DefaultLauncher.discover(DefaultLauncher.java:82)
23:59:33 [2021-05-22T03:59:33.458Z] 	at org.apache.maven.surefire.junitplatform.TestPlanScannerFilter.accept(TestPlanScannerFilter.java:56)
23:59:33 [2021-05-22T03:59:33.458Z] 	at org.apache.maven.surefire.util.DefaultScanResult.applyFilter(DefaultScanResult.java:102)
23:59:33 [2021-05-22T03:59:33.458Z] 	at org.apache.maven.surefire.junitplatform.JUnitPlatformProvider.scanClasspath(JUnitPlatformProvider.java:143)
23:59:33 [2021-05-22T03:59:33.458Z] 	at org.apache.maven.surefire.junitplatform.JUnitPlatformProvider.invoke(JUnitPlatformProvider.java:124)
23:59:33 [2021-05-22T03:59:33.458Z] 	at java.base/jdk.internal.reflect.NativeMethodAccessorImpl.invoke0(Native Method)
23:59:33 [2021-05-22T03:59:33.459Z] 	at java.base/jdk.internal.reflect.NativeMethodAccessorImpl.invoke(NativeMethodAccessorImpl.java:64)
23:59:33 [2021-05-22T03:59:33.459Z] 	at java.base/jdk.internal.reflect.DelegatingMethodAccessorImpl.invoke(DelegatingMethodAccessorImpl.java:43)
23:59:33 [2021-05-22T03:59:33.459Z] 	at java.base/java.lang.reflect.Method.invoke(Method.java:564)
23:59:33 [2021-05-22T03:59:33.459Z] 	at org.apache.maven.surefire.util.ReflectionUtils.invokeMethodWithArray2(ReflectionUtils.java:206)
23:59:33 [2021-05-22T03:59:33.459Z] 	at org.apache.maven.surefire.booter.ProviderFactory$ProviderProxy.invoke(ProviderFactory.java:161)
23:59:33 [2021-05-22T03:59:33.459Z] 	at org.apache.maven.surefire.booter.ProviderFactory.invokeProvider(ProviderFactory.java:84)
23:59:33 [2021-05-22T03:59:33.459Z] 	at org.eclipse.tycho.surefire.osgibooter.OsgiSurefireBooter.run(OsgiSurefireBooter.java:116)
23:59:33 [2021-05-22T03:59:33.459Z] 	at org.eclipse.tycho.surefire.osgibooter.HeadlessTestApplication.start(HeadlessTestApplication.java:23)
23:59:33 [2021-05-22T03:59:33.459Z] 	at org.eclipse.equinox.internal.app.EclipseAppHandle.run(EclipseAppHandle.java:203)
23:59:33 [2021-05-22T03:59:33.459Z] 	at org.eclipse.core.runtime.internal.adaptor.EclipseAppLauncher.runApplication(EclipseAppLauncher.java:137)
23:59:33 [2021-05-22T03:59:33.459Z] 	at org.eclipse.core.runtime.internal.adaptor.EclipseAppLauncher.start(EclipseAppLauncher.java:107)
23:59:33 [2021-05-22T03:59:33.459Z] 	at org.eclipse.core.runtime.adaptor.EclipseStarter.run(EclipseStarter.java:400)
23:59:33 [2021-05-22T03:59:33.459Z] 	at org.eclipse.core.runtime.adaptor.EclipseStarter.run(EclipseStarter.java:255)
23:59:33 [2021-05-22T03:59:33.459Z] 	at java.base/jdk.internal.reflect.NativeMethodAccessorImpl.invoke0(Native Method)
23:59:33 [2021-05-22T03:59:33.459Z] 	at java.base/jdk.internal.reflect.NativeMethodAccessorImpl.invoke(NativeMethodAccessorImpl.java:64)
23:59:33 [2021-05-22T03:59:33.459Z] 	at java.base/jdk.internal.reflect.DelegatingMethodAccessorImpl.invoke(DelegatingMethodAccessorImpl.java:43)
23:59:33 [2021-05-22T03:59:33.459Z] 	at java.base/java.lang.reflect.Method.invoke(Method.java:564)
23:59:33 [2021-05-22T03:59:33.459Z] 	at org.eclipse.equinox.launcher.Main.invokeFramework(Main.java:659)
23:59:33 [2021-05-22T03:59:33.459Z] 	at org.eclipse.equinox.launcher.Main.basicRun(Main.java:595)
23:59:33 [2021-05-22T03:59:33.459Z] 	at org.eclipse.equinox.launcher.Main.run(Main.java:1501)
23:59:33 [2021-05-22T03:59:33.459Z] 	at org.eclipse.equinox.launcher.Main.main(Main.java:1474)
23:59:33 [2021-05-22T03:59:33.459Z] Caused by: java.lang.ClassNotFoundException: org.junit.runners.model.RunnerBuilder cannot be found by org.eclipse.tycho.surefire.osgibooter_2.2.0
23:59:33 [2021-05-22T03:59:33.459Z] 	at org.eclipse.osgi.internal.loader.BundleLoader.findClassInternal(BundleLoader.java:511)
23:59:33 [2021-05-22T03:59:33.459Z] 	at org.eclipse.osgi.internal.loader.BundleLoader.findClass(BundleLoader.java:422)
23:59:33 [2021-05-22T03:59:33.459Z] 	at org.eclipse.osgi.internal.loader.BundleLoader.findClass(BundleLoader.java:414)
23:59:33 [2021-05-22T03:59:33.459Z] 	at org.eclipse.osgi.internal.loader.ModuleClassLoader.loadClass(ModuleClassLoader.java:153)
23:59:33 [2021-05-22T03:59:33.459Z] 	at java.base/java.lang.ClassLoader.loadClass(ClassLoader.java:522)
23:59:33 [2021-05-22T03:59:33.459Z] 	... 31 more
23:59:33 [2021-05-22T03:59:33.459Z] 
23:59:33 [2021-05-22T03:59:33.459Z] May 22, 2021 3:59:32 AM org.junit.platform.launcher.core.DefaultLauncher handleThrowable
23:59:33 [2021-05-22T03:59:33.459Z] WARNING: TestEngine with ID 'junit-vintage' failed to discover tests
23:59:33 [2021-05-22T03:59:33.459Z] java.lang.NoClassDefFoundError: org/junit/runners/model/RunnerBuilder
23:59:33 [2021-05-22T03:59:33.459Z] 	at org.junit.vintage.engine.discovery.VintageDiscoverer.<init>(VintageDiscoverer.java:48)
23:59:33 [2021-05-22T03:59:33.459Z] 	at org.junit.vintage.engine.VintageTestEngine.discover(VintageTestEngine.java:65)
23:59:33 [2021-05-22T03:59:33.459Z] 	at org.junit.platform.launcher.core.DefaultLauncher.discoverEngineRoot(DefaultLauncher.java:130)
23:59:33 [2021-05-22T03:59:33.459Z] 	at org.junit.platform.launcher.core.DefaultLauncher.discoverRoot(DefaultLauncher.java:117)
23:59:33 [2021-05-22T03:59:33.459Z] 	at org.junit.platform.launcher.core.DefaultLauncher.discover(DefaultLauncher.java:82)
23:59:33 [2021-05-22T03:59:33.459Z] 	at org.apache.maven.surefire.junitplatform.TestPlanScannerFilter.accept(TestPlanScannerFilter.java:56)
23:59:33 [2021-05-22T03:59:33.459Z] 	at org.apache.maven.surefire.util.DefaultScanResult.applyFilter(DefaultScanResult.java:102)
23:59:33 [2021-05-22T03:59:33.459Z] 	at org.apache.maven.surefire.junitplatform.JUnitPlatformProvider.scanClasspath(JUnitPlatformProvider.java:143)
23:59:33 [2021-05-22T03:59:33.459Z] 	at org.apache.maven.surefire.junitplatform.JUnitPlatformProvider.invoke(JUnitPlatformProvider.java:124)
23:59:33 [2021-05-22T03:59:33.459Z] 	at java.base/jdk.internal.reflect.NativeMethodAccessorImpl.invoke0(Native Method)
23:59:33 [2021-05-22T03:59:33.459Z] 	at java.base/jdk.internal.reflect.NativeMethodAccessorImpl.invoke(NativeMethodAccessorImpl.java:64)
23:59:33 [2021-05-22T03:59:33.459Z] 	at java.base/jdk.internal.reflect.DelegatingMethodAccessorImpl.invoke(DelegatingMethodAccessorImpl.java:43)
23:59:33 [2021-05-22T03:59:33.459Z] 	at java.base/java.lang.reflect.Method.invoke(Method.java:564)
23:59:33 [2021-05-22T03:59:33.459Z] 	at org.apache.maven.surefire.util.ReflectionUtils.invokeMethodWithArray2(ReflectionUtils.java:206)
23:59:33 [2021-05-22T03:59:33.459Z] 	at org.apache.maven.surefire.booter.ProviderFactory$ProviderProxy.invoke(ProviderFactory.java:161)
23:59:33 [2021-05-22T03:59:33.459Z] 	at org.apache.maven.surefire.booter.ProviderFactory.invokeProvider(ProviderFactory.java:84)
23:59:33 [2021-05-22T03:59:33.459Z] 	at org.eclipse.tycho.surefire.osgibooter.OsgiSurefireBooter.run(OsgiSurefireBooter.java:116)
23:59:33 [2021-05-22T03:59:33.459Z] 	at org.eclipse.tycho.surefire.osgibooter.HeadlessTestApplication.start(HeadlessTestApplication.java:23)
23:59:33 [2021-05-22T03:59:33.459Z] 	at org.eclipse.equinox.internal.app.EclipseAppHandle.run(EclipseAppHandle.java:203)
23:59:33 [2021-05-22T03:59:33.459Z] 	at org.eclipse.core.runtime.internal.adaptor.EclipseAppLauncher.runApplication(EclipseAppLauncher.java:137)
23:59:33 [2021-05-22T03:59:33.459Z] 	at org.eclipse.core.runtime.internal.adaptor.EclipseAppLauncher.start(EclipseAppLauncher.java:107)
23:59:33 [2021-05-22T03:59:33.459Z] 	at org.eclipse.core.runtime.adaptor.EclipseStarter.run(EclipseStarter.java:400)
23:59:33 [2021-05-22T03:59:33.459Z] 	at org.eclipse.core.runtime.adaptor.EclipseStarter.run(EclipseStarter.java:255)
23:59:33 [2021-05-22T03:59:33.459Z] 	at java.base/jdk.internal.reflect.NativeMethodAccessorImpl.invoke0(Native Method)
23:59:33 [2021-05-22T03:59:33.459Z] 	at java.base/jdk.internal.reflect.NativeMethodAccessorImpl.invoke(NativeMethodAccessorImpl.java:64)
23:59:33 [2021-05-22T03:59:33.459Z] 	at java.base/jdk.internal.reflect.DelegatingMethodAccessorImpl.invoke(DelegatingMethodAccessorImpl.java:43)
23:59:33 [2021-05-22T03:59:33.459Z] 	at java.base/java.lang.reflect.Method.invoke(Method.java:564)
23:59:33 [2021-05-22T03:59:33.460Z] 	at org.eclipse.equinox.launcher.Main.invokeFramework(Main.java:659)
23:59:33 [2021-05-22T03:59:33.460Z] 	at org.eclipse.equinox.launcher.Main.basicRun(Main.java:595)
23:59:33 [2021-05-22T03:59:33.460Z] 	at org.eclipse.equinox.launcher.Main.run(Main.java:1501)
23:59:33 [2021-05-22T03:59:33.460Z] 	at org.eclipse.equinox.launcher.Main.main(Main.java:1474)
23:59:33 [2021-05-22T03:59:33.460Z] Caused by: java.lang.ClassNotFoundException: org.junit.runners.model.RunnerBuilder cannot be found by org.eclipse.tycho.surefire.osgibooter_2.2.0
23:59:33 [2021-05-22T03:59:33.460Z] 	at org.eclipse.osgi.internal.loader.BundleLoader.findClassInternal(BundleLoader.java:511)
23:59:33 [2021-05-22T03:59:33.460Z] 	at org.eclipse.osgi.internal.loader.BundleLoader.findClass(BundleLoader.java:422)
23:59:33 [2021-05-22T03:59:33.460Z] 	at org.eclipse.osgi.internal.loader.BundleLoader.findClass(BundleLoader.java:414)
23:59:33 [2021-05-22T03:59:33.460Z] 	at org.eclipse.osgi.internal.loader.ModuleClassLoader.loadClass(ModuleClassLoader.java:153)
23:59:33 [2021-05-22T03:59:33.460Z] 	at java.base/java.lang.ClassLoader.loadClass(ClassLoader.java:522)
23:59:33 [2021-05-22T03:59:33.460Z] 	... 31 more
23:59:33 [2021-05-22T03:59:33.460Z] 
23:59:33 [2021-05-22T03:59:33.460Z] May 22, 2021 3:59:32 AM org.junit.platform.launcher.core.DefaultLauncher handleThrowable
23:59:33 [2021-05-22T03:59:33.460Z] WARNING: TestEngine with ID 'junit-vintage' failed to discover tests
23:59:33 [2021-05-22T03:59:33.460Z] java.lang.NoClassDefFoundError: org/junit/runners/model/RunnerBuilder
23:59:33 [2021-05-22T03:59:33.460Z] 	at org.junit.vintage.engine.discovery.VintageDiscoverer.<init>(VintageDiscoverer.java:48)
23:59:33 [2021-05-22T03:59:33.460Z] 	at org.junit.vintage.engine.VintageTestEngine.discover(VintageTestEngine.java:65)
23:59:33 [2021-05-22T03:59:33.460Z] 	at org.junit.platform.launcher.core.DefaultLauncher.discoverEngineRoot(DefaultLauncher.java:130)
23:59:33 [2021-05-22T03:59:33.460Z] 	at org.junit.platform.launcher.core.DefaultLauncher.discoverRoot(DefaultLauncher.java:117)
23:59:33 [2021-05-22T03:59:33.460Z] 	at org.junit.platform.launcher.core.DefaultLauncher.discover(DefaultLauncher.java:82)
23:59:33 [2021-05-22T03:59:33.460Z] 	at org.apache.maven.surefire.junitplatform.TestPlanScannerFilter.accept(TestPlanScannerFilter.java:56)
23:59:33 [2021-05-22T03:59:33.460Z] 	at org.apache.maven.surefire.util.DefaultScanResult.applyFilter(DefaultScanResult.java:102)
23:59:33 [2021-05-22T03:59:33.460Z] 	at org.apache.maven.surefire.junitplatform.JUnitPlatformProvider.scanClasspath(JUnitPlatformProvider.java:143)
23:59:33 [2021-05-22T03:59:33.460Z] 	at org.apache.maven.surefire.junitplatform.JUnitPlatformProvider.invoke(JUnitPlatformProvider.java:124)
23:59:33 [2021-05-22T03:59:33.460Z] 	at java.base/jdk.internal.reflect.NativeMethodAccessorImpl.invoke0(Native Method)
23:59:33 [2021-05-22T03:59:33.460Z] 	at java.base/jdk.internal.reflect.NativeMethodAccessorImpl.invoke(NativeMethodAccessorImpl.java:64)
23:59:33 [2021-05-22T03:59:33.460Z] 	at java.base/jdk.internal.reflect.DelegatingMethodAccessorImpl.invoke(DelegatingMethodAccessorImpl.java:43)
23:59:33 [2021-05-22T03:59:33.460Z] 	at java.base/java.lang.reflect.Method.invoke(Method.java:564)
23:59:33 [2021-05-22T03:59:33.460Z] 	at org.apache.maven.surefire.util.ReflectionUtils.invokeMethodWithArray2(ReflectionUtils.java:206)
23:59:33 [2021-05-22T03:59:33.460Z] 	at org.apache.maven.surefire.booter.ProviderFactory$ProviderProxy.invoke(ProviderFactory.java:161)
23:59:33 [2021-05-22T03:59:33.460Z] 	at org.apache.maven.surefire.booter.ProviderFactory.invokeProvider(ProviderFactory.java:84)
23:59:33 [2021-05-22T03:59:33.460Z] 	at org.eclipse.tycho.surefire.osgibooter.OsgiSurefireBooter.run(OsgiSurefireBooter.java:116)
23:59:33 [2021-05-22T03:59:33.460Z] 	at org.eclipse.tycho.surefire.osgibooter.HeadlessTestApplication.start(HeadlessTestApplication.java:23)
23:59:33 [2021-05-22T03:59:33.460Z] 	at org.eclipse.equinox.internal.app.EclipseAppHandle.run(EclipseAppHandle.java:203)
23:59:33 [2021-05-22T03:59:33.460Z] 	at org.eclipse.core.runtime.internal.adaptor.EclipseAppLauncher.runApplication(EclipseAppLauncher.java:137)
23:59:33 [2021-05-22T03:59:33.460Z] 	at org.eclipse.core.runtime.internal.adaptor.EclipseAppLauncher.start(EclipseAppLauncher.java:107)
23:59:33 [2021-05-22T03:59:33.460Z] 	at org.eclipse.core.runtime.adaptor.EclipseStarter.run(EclipseStarter.java:400)
23:59:33 [2021-05-22T03:59:33.460Z] 	at org.eclipse.core.runtime.adaptor.EclipseStarter.run(EclipseStarter.java:255)
23:59:33 [2021-05-22T03:59:33.460Z] 	at java.base/jdk.internal.reflect.NativeMethodAccessorImpl.invoke0(Native Method)
23:59:33 [2021-05-22T03:59:33.460Z] 	at java.base/jdk.internal.reflect.NativeMethodAccessorImpl.invoke(NativeMethodAccessorImpl.java:64)
23:59:33 [2021-05-22T03:59:33.460Z] 	at java.base/jdk.internal.reflect.DelegatingMethodAccessorImpl.invoke(DelegatingMethodAccessorImpl.java:43)
23:59:33 [2021-05-22T03:59:33.460Z] 	at java.base/java.lang.reflect.Method.invoke(Method.java:564)
23:59:33 [2021-05-22T03:59:33.460Z] 	at org.eclipse.equinox.launcher.Main.invokeFramework(Main.java:659)
23:59:33 [2021-05-22T03:59:33.460Z] 	at org.eclipse.equinox.launcher.Main.basicRun(Main.java:595)
23:59:33 [2021-05-22T03:59:33.460Z] 	at org.eclipse.equinox.launcher.Main.run(Main.java:1501)
23:59:33 [2021-05-22T03:59:33.460Z] 	at org.eclipse.equinox.launcher.Main.main(Main.java:1474)
23:59:33 [2021-05-22T03:59:33.460Z] Caused by: java.lang.ClassNotFoundException: org.junit.runners.model.RunnerBuilder cannot be found by org.eclipse.tycho.surefire.osgibooter_2.2.0
23:59:33 [2021-05-22T03:59:33.460Z] 	at org.eclipse.osgi.internal.loader.BundleLoader.findClassInternal(BundleLoader.java:511)
23:59:33 [2021-05-22T03:59:33.460Z] 	at org.eclipse.osgi.internal.loader.BundleLoader.findClass(BundleLoader.java:422)
23:59:33 [2021-05-22T03:59:33.460Z] 	at org.eclipse.osgi.internal.loader.BundleLoader.findClass(BundleLoader.java:414)
23:59:33 [2021-05-22T03:59:33.460Z] 	at org.eclipse.osgi.internal.loader.ModuleClassLoader.loadClass(ModuleClassLoader.java:153)
23:59:33 [2021-05-22T03:59:33.460Z] 	at java.base/java.lang.ClassLoader.loadClass(ClassLoader.java:522)
23:59:33 [2021-05-22T03:59:33.460Z] 	... 31 more
23:59:33 [2021-05-22T03:59:33.460Z] 
23:59:33 [2021-05-22T03:59:33.460Z] May 22, 2021 3:59:32 AM org.junit.platform.launcher.core.DefaultLauncher handleThrowable
23:59:33 [2021-05-22T03:59:33.460Z] WARNING: TestEngine with ID 'junit-vintage' failed to discover tests
23:59:33 [2021-05-22T03:59:33.460Z] java.lang.NoClassDefFoundError: org/junit/runners/model/RunnerBuilder
23:59:33 [2021-05-22T03:59:33.460Z] 	at org.junit.vintage.engine.discovery.VintageDiscoverer.<init>(VintageDiscoverer.java:48)
23:59:33 [2021-05-22T03:59:33.460Z] 	at org.junit.vintage.engine.VintageTestEngine.discover(VintageTestEngine.java:65)
23:59:33 [2021-05-22T03:59:33.460Z] 	at org.junit.platform.launcher.core.DefaultLauncher.discoverEngineRoot(DefaultLauncher.java:130)
23:59:33 [2021-05-22T03:59:33.460Z] 	at org.junit.platform.launcher.core.DefaultLauncher.discoverRoot(DefaultLauncher.java:117)
23:59:33 [2021-05-22T03:59:33.460Z] 	at org.junit.platform.launcher.core.DefaultLauncher.discover(DefaultLauncher.java:82)
23:59:33 [2021-05-22T03:59:33.461Z] 	at org.apache.maven.surefire.junitplatform.TestPlanScannerFilter.accept(TestPlanScannerFilter.java:56)
23:59:33 [2021-05-22T03:59:33.461Z] 	at org.apache.maven.surefire.util.DefaultScanResult.applyFilter(DefaultScanResult.java:102)
23:59:33 [2021-05-22T03:59:33.461Z] 	at org.apache.maven.surefire.junitplatform.JUnitPlatformProvider.scanClasspath(JUnitPlatformProvider.java:143)
23:59:33 [2021-05-22T03:59:33.461Z] 	at org.apache.maven.surefire.junitplatform.JUnitPlatformProvider.invoke(JUnitPlatformProvider.java:124)
23:59:33 [2021-05-22T03:59:33.461Z] 	at java.base/jdk.internal.reflect.NativeMethodAccessorImpl.invoke0(Native Method)
23:59:33 [2021-05-22T03:59:33.461Z] 	at java.base/jdk.internal.reflect.NativeMethodAccessorImpl.invoke(NativeMethodAccessorImpl.java:64)
23:59:33 [2021-05-22T03:59:33.461Z] 	at java.base/jdk.internal.reflect.DelegatingMethodAccessorImpl.invoke(DelegatingMethodAccessorImpl.java:43)
23:59:33 [2021-05-22T03:59:33.461Z] 	at java.base/java.lang.reflect.Method.invoke(Method.java:564)
23:59:33 [2021-05-22T03:59:33.461Z] 	at org.apache.maven.surefire.util.ReflectionUtils.invokeMethodWithArray2(ReflectionUtils.java:206)
23:59:33 [2021-05-22T03:59:33.461Z] 	at org.apache.maven.surefire.booter.ProviderFactory$ProviderProxy.invoke(ProviderFactory.java:161)
23:59:33 [2021-05-22T03:59:33.461Z] 	at org.apache.maven.surefire.booter.ProviderFactory.invokeProvider(ProviderFactory.java:84)
23:59:33 [2021-05-22T03:59:33.461Z] 	at org.eclipse.tycho.surefire.osgibooter.OsgiSurefireBooter.run(OsgiSurefireBooter.java:116)
23:59:33 [2021-05-22T03:59:33.461Z] 	at org.eclipse.tycho.surefire.osgibooter.HeadlessTestApplication.start(HeadlessTestApplication.java:23)
23:59:33 [2021-05-22T03:59:33.461Z] 	at org.eclipse.equinox.internal.app.EclipseAppHandle.run(EclipseAppHandle.java:203)
23:59:33 [2021-05-22T03:59:33.461Z] 	at org.eclipse.core.runtime.internal.adaptor.EclipseAppLauncher.runApplication(EclipseAppLauncher.java:137)
23:59:33 [2021-05-22T03:59:33.461Z] 	at org.eclipse.core.runtime.internal.adaptor.EclipseAppLauncher.start(EclipseAppLauncher.java:107)
23:59:33 [2021-05-22T03:59:33.461Z] 	at org.eclipse.core.runtime.adaptor.EclipseStarter.run(EclipseStarter.java:400)
23:59:33 [2021-05-22T03:59:33.461Z] 	at org.eclipse.core.runtime.adaptor.EclipseStarter.run(EclipseStarter.java:255)
23:59:33 [2021-05-22T03:59:33.461Z] 	at java.base/jdk.internal.reflect.NativeMethodAccessorImpl.invoke0(Native Method)
23:59:33 [2021-05-22T03:59:33.461Z] 	at java.base/jdk.internal.reflect.NativeMethodAccessorImpl.invoke(NativeMethodAccessorImpl.java:64)
23:59:33 [2021-05-22T03:59:33.461Z] 	at java.base/jdk.internal.reflect.DelegatingMethodAccessorImpl.invoke(DelegatingMethodAccessorImpl.java:43)
23:59:33 [2021-05-22T03:59:33.461Z] 	at java.base/java.lang.reflect.Method.invoke(Method.java:564)
23:59:33 [2021-05-22T03:59:33.461Z] 	at org.eclipse.equinox.launcher.Main.invokeFramework(Main.java:659)
23:59:33 [2021-05-22T03:59:33.461Z] 	at org.eclipse.equinox.launcher.Main.basicRun(Main.java:595)
23:59:33 [2021-05-22T03:59:33.461Z] 	at org.eclipse.equinox.launcher.Main.run(Main.java:1501)
23:59:33 [2021-05-22T03:59:33.461Z] 	at org.eclipse.equinox.launcher.Main.main(Main.java:1474)
23:59:33 [2021-05-22T03:59:33.461Z] Caused by: java.lang.ClassNotFoundException: org.junit.runners.model.RunnerBuilder cannot be found by org.eclipse.tycho.surefire.osgibooter_2.2.0
23:59:33 [2021-05-22T03:59:33.461Z] 	at org.eclipse.osgi.internal.loader.BundleLoader.findClassInternal(BundleLoader.java:511)
23:59:33 [2021-05-22T03:59:33.461Z] 	at org.eclipse.osgi.internal.loader.BundleLoader.findClass(BundleLoader.java:422)
23:59:33 [2021-05-22T03:59:33.461Z] 	at org.eclipse.osgi.internal.loader.BundleLoader.findClass(BundleLoader.java:414)
23:59:33 [2021-05-22T03:59:33.461Z] 	at org.eclipse.osgi.internal.loader.ModuleClassLoader.loadClass(ModuleClassLoader.java:153)
23:59:33 [2021-05-22T03:59:33.461Z] 	at java.base/java.lang.ClassLoader.loadClass(ClassLoader.java:522)
23:59:33 [2021-05-22T03:59:33.461Z] 	... 31 more
23:59:33 [2021-05-22T03:59:33.461Z] 
23:59:33 [2021-05-22T03:59:33.461Z] May 22, 2021 3:59:32 AM org.junit.platform.launcher.core.DefaultLauncher handleThrowable
23:59:33 [2021-05-22T03:59:33.461Z] WARNING: TestEngine with ID 'junit-vintage' failed to discover tests
23:59:33 [2021-05-22T03:59:33.461Z] java.lang.NoClassDefFoundError: org/junit/runners/model/RunnerBuilder
23:59:33 [2021-05-22T03:59:33.461Z] 	at org.junit.vintage.engine.discovery.VintageDiscoverer.<init>(VintageDiscoverer.java:48)
23:59:33 [2021-05-22T03:59:33.461Z] 	at org.junit.vintage.engine.VintageTestEngine.discover(VintageTestEngine.java:65)
23:59:33 [2021-05-22T03:59:33.461Z] 	at org.junit.platform.launcher.core.DefaultLauncher.discoverEngineRoot(DefaultLauncher.java:130)
23:59:33 [2021-05-22T03:59:33.461Z] 	at org.junit.platform.launcher.core.DefaultLauncher.discoverRoot(DefaultLauncher.java:117)
23:59:33 [2021-05-22T03:59:33.461Z] 	at org.junit.platform.launcher.core.DefaultLauncher.discover(DefaultLauncher.java:82)
23:59:33 [2021-05-22T03:59:33.461Z] 	at org.apache.maven.surefire.junitplatform.TestPlanScannerFilter.accept(TestPlanScannerFilter.java:56)
23:59:33 [2021-05-22T03:59:33.461Z] 	at org.apache.maven.surefire.util.DefaultScanResult.applyFilter(DefaultScanResult.java:102)
23:59:33 [2021-05-22T03:59:33.461Z] 	at org.apache.maven.surefire.junitplatform.JUnitPlatformProvider.scanClasspath(JUnitPlatformProvider.java:143)
23:59:33 [2021-05-22T03:59:33.461Z] 	at org.apache.maven.surefire.junitplatform.JUnitPlatformProvider.invoke(JUnitPlatformProvider.java:124)
23:59:33 [2021-05-22T03:59:33.461Z] 	at java.base/jdk.internal.reflect.NativeMethodAccessorImpl.invoke0(Native Method)
23:59:33 [2021-05-22T03:59:33.461Z] 	at java.base/jdk.internal.reflect.NativeMethodAccessorImpl.invoke(NativeMethodAccessorImpl.java:64)
23:59:33 [2021-05-22T03:59:33.461Z] 	at java.base/jdk.internal.reflect.DelegatingMethodAccessorImpl.invoke(DelegatingMethodAccessorImpl.java:43)
23:59:33 [2021-05-22T03:59:33.461Z] 	at java.base/java.lang.reflect.Method.invoke(Method.java:564)
23:59:33 [2021-05-22T03:59:33.461Z] 	at org.apache.maven.surefire.util.ReflectionUtils.invokeMethodWithArray2(ReflectionUtils.java:206)
23:59:33 [2021-05-22T03:59:33.461Z] 	at org.apache.maven.surefire.booter.ProviderFactory$ProviderProxy.invoke(ProviderFactory.java:161)
23:59:33 [2021-05-22T03:59:33.461Z] 	at org.apache.maven.surefire.booter.ProviderFactory.invokeProvider(ProviderFactory.java:84)
23:59:33 [2021-05-22T03:59:33.461Z] 	at org.eclipse.tycho.surefire.osgibooter.OsgiSurefireBooter.run(OsgiSurefireBooter.java:116)
23:59:33 [2021-05-22T03:59:33.461Z] 	at org.eclipse.tycho.surefire.osgibooter.HeadlessTestApplication.start(HeadlessTestApplication.java:23)
23:59:33 [2021-05-22T03:59:33.461Z] 	at org.eclipse.equinox.internal.app.EclipseAppHandle.run(EclipseAppHandle.java:203)
23:59:33 [2021-05-22T03:59:33.461Z] 	at org.eclipse.core.runtime.internal.adaptor.EclipseAppLauncher.runApplication(EclipseAppLauncher.java:137)
23:59:33 [2021-05-22T03:59:33.461Z] 	at org.eclipse.core.runtime.internal.adaptor.EclipseAppLauncher.start(EclipseAppLauncher.java:107)
23:59:33 [2021-05-22T03:59:33.461Z] 	at org.eclipse.core.runtime.adaptor.EclipseStarter.run(EclipseStarter.java:400)
23:59:33 [2021-05-22T03:59:33.461Z] 	at org.eclipse.core.runtime.adaptor.EclipseStarter.run(EclipseStarter.java:255)
23:59:33 [2021-05-22T03:59:33.462Z] 	at java.base/jdk.internal.reflect.NativeMethodAccessorImpl.invoke0(Native Method)
23:59:33 [2021-05-22T03:59:33.462Z] 	at java.base/jdk.internal.reflect.NativeMethodAccessorImpl.invoke(NativeMethodAccessorImpl.java:64)
23:59:33 [2021-05-22T03:59:33.462Z] 	at java.base/jdk.internal.reflect.DelegatingMethodAccessorImpl.invoke(DelegatingMethodAccessorImpl.java:43)
23:59:33 [2021-05-22T03:59:33.462Z] 	at java.base/java.lang.reflect.Method.invoke(Method.java:564)
23:59:33 [2021-05-22T03:59:33.462Z] 	at org.eclipse.equinox.launcher.Main.invokeFramework(Main.java:659)
23:59:33 [2021-05-22T03:59:33.462Z] 	at org.eclipse.equinox.launcher.Main.basicRun(Main.java:595)
23:59:33 [2021-05-22T03:59:33.462Z] 	at org.eclipse.equinox.launcher.Main.run(Main.java:1501)
23:59:33 [2021-05-22T03:59:33.462Z] 	at org.eclipse.equinox.launcher.Main.main(Main.java:1474)
23:59:33 [2021-05-22T03:59:33.462Z] Caused by: java.lang.ClassNotFoundException: org.junit.runners.model.RunnerBuilder cannot be found by org.eclipse.tycho.surefire.osgibooter_2.2.0
23:59:33 [2021-05-22T03:59:33.462Z] 	at org.eclipse.osgi.internal.loader.BundleLoader.findClassInternal(BundleLoader.java:511)
23:59:33 [2021-05-22T03:59:33.462Z] 	at org.eclipse.osgi.internal.loader.BundleLoader.findClass(BundleLoader.java:422)
23:59:33 [2021-05-22T03:59:33.462Z] 	at org.eclipse.osgi.internal.loader.BundleLoader.findClass(BundleLoader.java:414)
23:59:33 [2021-05-22T03:59:33.462Z] 	at org.eclipse.osgi.internal.loader.ModuleClassLoader.loadClass(ModuleClassLoader.java:153)
23:59:33 [2021-05-22T03:59:33.462Z] 	at java.base/java.lang.ClassLoader.loadClass(ClassLoader.java:522)
23:59:33 [2021-05-22T03:59:33.462Z] 	... 31 more
23:59:33 [2021-05-22T03:59:33.462Z] 
23:59:33 [2021-05-22T03:59:33.462Z] May 22, 2021 3:59:32 AM org.junit.platform.launcher.core.DefaultLauncher handleThrowable
23:59:33 [2021-05-22T03:59:33.462Z] WARNING: TestEngine with ID 'junit-vintage' failed to discover tests
23:59:33 [2021-05-22T03:59:33.462Z] java.lang.NoClassDefFoundError: org/junit/runners/model/RunnerBuilder
23:59:33 [2021-05-22T03:59:33.462Z] 	at org.junit.vintage.engine.discovery.VintageDiscoverer.<init>(VintageDiscoverer.java:48)
23:59:33 [2021-05-22T03:59:33.462Z] 	at org.junit.vintage.engine.VintageTestEngine.discover(VintageTestEngine.java:65)
23:59:33 [2021-05-22T03:59:33.462Z] 	at org.junit.platform.launcher.core.DefaultLauncher.discoverEngineRoot(DefaultLauncher.java:130)
23:59:33 [2021-05-22T03:59:33.462Z] 	at org.junit.platform.launcher.core.DefaultLauncher.discoverRoot(DefaultLauncher.java:117)
23:59:33 [2021-05-22T03:59:33.462Z] 	at org.junit.platform.launcher.core.DefaultLauncher.discover(DefaultLauncher.java:82)
23:59:33 [2021-05-22T03:59:33.462Z] 	at org.apache.maven.surefire.junitplatform.TestPlanScannerFilter.accept(TestPlanScannerFilter.java:56)
23:59:33 [2021-05-22T03:59:33.462Z] 	at org.apache.maven.surefire.util.DefaultScanResult.applyFilter(DefaultScanResult.java:102)
23:59:33 [2021-05-22T03:59:33.462Z] 	at org.apache.maven.surefire.junitplatform.JUnitPlatformProvider.scanClasspath(JUnitPlatformProvider.java:143)
23:59:33 [2021-05-22T03:59:33.462Z] 	at org.apache.maven.surefire.junitplatform.JUnitPlatformProvider.invoke(JUnitPlatformProvider.java:124)
23:59:33 [2021-05-22T03:59:33.462Z] 	at java.base/jdk.internal.reflect.NativeMethodAccessorImpl.invoke0(Native Method)
23:59:33 [2021-05-22T03:59:33.462Z] 	at java.base/jdk.internal.reflect.NativeMethodAccessorImpl.invoke(NativeMethodAccessorImpl.java:64)
23:59:33 [2021-05-22T03:59:33.462Z] 	at java.base/jdk.internal.reflect.DelegatingMethodAccessorImpl.invoke(DelegatingMethodAccessorImpl.java:43)
23:59:33 [2021-05-22T03:59:33.462Z] 	at java.base/java.lang.reflect.Method.invoke(Method.java:564)
23:59:33 [2021-05-22T03:59:33.462Z] 	at org.apache.maven.surefire.util.ReflectionUtils.invokeMethodWithArray2(ReflectionUtils.java:206)
23:59:33 [2021-05-22T03:59:33.462Z] 	at org.apache.maven.surefire.booter.ProviderFactory$ProviderProxy.invoke(ProviderFactory.java:161)
23:59:33 [2021-05-22T03:59:33.462Z] 	at org.apache.maven.surefire.booter.ProviderFactory.invokeProvider(ProviderFactory.java:84)
23:59:33 [2021-05-22T03:59:33.462Z] 	at org.eclipse.tycho.surefire.osgibooter.OsgiSurefireBooter.run(OsgiSurefireBooter.java:116)
23:59:33 [2021-05-22T03:59:33.462Z] 	at org.eclipse.tycho.surefire.osgibooter.HeadlessTestApplication.start(HeadlessTestApplication.java:23)
23:59:33 [2021-05-22T03:59:33.462Z] 	at org.eclipse.equinox.internal.app.EclipseAppHandle.run(EclipseAppHandle.java:203)
23:59:33 [2021-05-22T03:59:33.462Z] 	at org.eclipse.core.runtime.internal.adaptor.EclipseAppLauncher.runApplication(EclipseAppLauncher.java:137)
23:59:33 [2021-05-22T03:59:33.462Z] 	at org.eclipse.core.runtime.internal.adaptor.EclipseAppLauncher.start(EclipseAppLauncher.java:107)
23:59:33 [2021-05-22T03:59:33.462Z] 	at org.eclipse.core.runtime.adaptor.EclipseStarter.run(EclipseStarter.java:400)
23:59:33 [2021-05-22T03:59:33.462Z] 	at org.eclipse.core.runtime.adaptor.EclipseStarter.run(EclipseStarter.java:255)
23:59:33 [2021-05-22T03:59:33.462Z] 	at java.base/jdk.internal.reflect.NativeMethodAccessorImpl.invoke0(Native Method)
23:59:33 [2021-05-22T03:59:33.462Z] 	at java.base/jdk.internal.reflect.NativeMethodAccessorImpl.invoke(NativeMethodAccessorImpl.java:64)
23:59:33 [2021-05-22T03:59:33.462Z] 	at java.base/jdk.internal.reflect.DelegatingMethodAccessorImpl.invoke(DelegatingMethodAccessorImpl.java:43)
23:59:33 [2021-05-22T03:59:33.462Z] 	at java.base/java.lang.reflect.Method.invoke(Method.java:564)
23:59:33 [2021-05-22T03:59:33.462Z] 	at org.eclipse.equinox.launcher.Main.invokeFramework(Main.java:659)
23:59:33 [2021-05-22T03:59:33.462Z] 	at org.eclipse.equinox.launcher.Main.basicRun(Main.java:595)
23:59:33 [2021-05-22T03:59:33.462Z] 	at org.eclipse.equinox.launcher.Main.run(Main.java:1501)
23:59:33 [2021-05-22T03:59:33.462Z] 	at org.eclipse.equinox.launcher.Main.main(Main.java:1474)
23:59:33 [2021-05-22T03:59:33.462Z] Caused by: java.lang.ClassNotFoundException: org.junit.runners.model.RunnerBuilder cannot be found by org.eclipse.tycho.surefire.osgibooter_2.2.0
23:59:33 [2021-05-22T03:59:33.462Z] 	at org.eclipse.osgi.internal.loader.BundleLoader.findClassInternal(BundleLoader.java:511)
23:59:33 [2021-05-22T03:59:33.462Z] 	at org.eclipse.osgi.internal.loader.BundleLoader.findClass(BundleLoader.java:422)
23:59:33 [2021-05-22T03:59:33.462Z] 	at org.eclipse.osgi.internal.loader.BundleLoader.findClass(BundleLoader.java:414)
23:59:33 [2021-05-22T03:59:33.462Z] 	at org.eclipse.osgi.internal.loader.ModuleClassLoader.loadClass(ModuleClassLoader.java:153)
23:59:33 [2021-05-22T03:59:33.462Z] 	at java.base/java.lang.ClassLoader.loadClass(ClassLoader.java:522)
23:59:33 [2021-05-22T03:59:33.462Z] 	... 31 more
23:59:33 [2021-05-22T03:59:33.462Z] 
23:59:33 [2021-05-22T03:59:33.462Z] May 22, 2021 3:59:32 AM org.junit.platform.launcher.core.DefaultLauncher handleThrowable
23:59:33 [2021-05-22T03:59:33.462Z] WARNING: TestEngine with ID 'junit-vintage' failed to discover tests
23:59:33 [2021-05-22T03:59:33.462Z] java.lang.NoClassDefFoundError: org/junit/runners/model/RunnerBuilder
23:59:33 [2021-05-22T03:59:33.462Z] 	at org.junit.vintage.engine.discovery.VintageDiscoverer.<init>(VintageDiscoverer.java:48)
23:59:33 [2021-05-22T03:59:33.463Z] 	at org.junit.vintage.engine.VintageTestEngine.discover(VintageTestEngine.java:65)
23:59:33 [2021-05-22T03:59:33.463Z] 	at org.junit.platform.launcher.core.DefaultLauncher.discoverEngineRoot(DefaultLauncher.java:130)
23:59:33 [2021-05-22T03:59:33.463Z] 	at org.junit.platform.launcher.core.DefaultLauncher.discoverRoot(DefaultLauncher.java:117)
23:59:33 [2021-05-22T03:59:33.463Z] 	at org.junit.platform.launcher.core.DefaultLauncher.discover(DefaultLauncher.java:82)
23:59:33 [2021-05-22T03:59:33.463Z] 	at org.apache.maven.surefire.junitplatform.TestPlanScannerFilter.accept(TestPlanScannerFilter.java:56)
23:59:33 [2021-05-22T03:59:33.463Z] 	at org.apache.maven.surefire.util.DefaultScanResult.applyFilter(DefaultScanResult.java:102)
23:59:33 [2021-05-22T03:59:33.463Z] 	at org.apache.maven.surefire.junitplatform.JUnitPlatformProvider.scanClasspath(JUnitPlatformProvider.java:143)
23:59:33 [2021-05-22T03:59:33.463Z] 	at org.apache.maven.surefire.junitplatform.JUnitPlatformProvider.invoke(JUnitPlatformProvider.java:124)
23:59:33 [2021-05-22T03:59:33.463Z] 	at java.base/jdk.internal.reflect.NativeMethodAccessorImpl.invoke0(Native Method)
23:59:33 [2021-05-22T03:59:33.463Z] 	at java.base/jdk.internal.reflect.NativeMethodAccessorImpl.invoke(NativeMethodAccessorImpl.java:64)
23:59:33 [2021-05-22T03:59:33.463Z] 	at java.base/jdk.internal.reflect.DelegatingMethodAccessorImpl.invoke(DelegatingMethodAccessorImpl.java:43)
23:59:33 [2021-05-22T03:59:33.463Z] 	at java.base/java.lang.reflect.Method.invoke(Method.java:564)
23:59:33 [2021-05-22T03:59:33.463Z] 	at org.apache.maven.surefire.util.ReflectionUtils.invokeMethodWithArray2(ReflectionUtils.java:206)
23:59:33 [2021-05-22T03:59:33.463Z] 	at org.apache.maven.surefire.booter.ProviderFactory$ProviderProxy.invoke(ProviderFactory.java:161)
23:59:33 [2021-05-22T03:59:33.463Z] 	at org.apache.maven.surefire.booter.ProviderFactory.invokeProvider(ProviderFactory.java:84)
23:59:33 [2021-05-22T03:59:33.463Z] 	at org.eclipse.tycho.surefire.osgibooter.OsgiSurefireBooter.run(OsgiSurefireBooter.java:116)
23:59:33 [2021-05-22T03:59:33.463Z] 	at org.eclipse.tycho.surefire.osgibooter.HeadlessTestApplication.start(HeadlessTestApplication.java:23)
23:59:33 [2021-05-22T03:59:33.463Z] 	at org.eclipse.equinox.internal.app.EclipseAppHandle.run(EclipseAppHandle.java:203)
23:59:33 [2021-05-22T03:59:33.463Z] 	at org.eclipse.core.runtime.internal.adaptor.EclipseAppLauncher.runApplication(EclipseAppLauncher.java:137)
23:59:33 [2021-05-22T03:59:33.463Z] 	at org.eclipse.core.runtime.internal.adaptor.EclipseAppLauncher.start(EclipseAppLauncher.java:107)
23:59:33 [2021-05-22T03:59:33.463Z] 	at org.eclipse.core.runtime.adaptor.EclipseStarter.run(EclipseStarter.java:400)
23:59:33 [2021-05-22T03:59:33.463Z] 	at org.eclipse.core.runtime.adaptor.EclipseStarter.run(EclipseStarter.java:255)
23:59:33 [2021-05-22T03:59:33.463Z] 	at java.base/jdk.internal.reflect.NativeMethodAccessorImpl.invoke0(Native Method)
23:59:33 [2021-05-22T03:59:33.463Z] 	at java.base/jdk.internal.reflect.NativeMethodAccessorImpl.invoke(NativeMethodAccessorImpl.java:64)
23:59:33 [2021-05-22T03:59:33.463Z] 	at java.base/jdk.internal.reflect.DelegatingMethodAccessorImpl.invoke(DelegatingMethodAccessorImpl.java:43)
23:59:33 [2021-05-22T03:59:33.463Z] 	at java.base/java.lang.reflect.Method.invoke(Method.java:564)
23:59:33 [2021-05-22T03:59:33.463Z] 	at org.eclipse.equinox.launcher.Main.invokeFramework(Main.java:659)
23:59:33 [2021-05-22T03:59:33.463Z] 	at org.eclipse.equinox.launcher.Main.basicRun(Main.java:595)
23:59:33 [2021-05-22T03:59:33.463Z] 	at org.eclipse.equinox.launcher.Main.run(Main.java:1501)
23:59:33 [2021-05-22T03:59:33.463Z] 	at org.eclipse.equinox.launcher.Main.main(Main.java:1474)
23:59:33 [2021-05-22T03:59:33.463Z] Caused by: java.lang.ClassNotFoundException: org.junit.runners.model.RunnerBuilder cannot be found by org.eclipse.tycho.surefire.osgibooter_2.2.0
23:59:33 [2021-05-22T03:59:33.463Z] 	at org.eclipse.osgi.internal.loader.BundleLoader.findClassInternal(BundleLoader.java:511)
23:59:33 [2021-05-22T03:59:33.463Z] 	at org.eclipse.osgi.internal.loader.BundleLoader.findClass(BundleLoader.java:422)
23:59:33 [2021-05-22T03:59:33.463Z] 	at org.eclipse.osgi.internal.loader.BundleLoader.findClass(BundleLoader.java:414)
23:59:33 [2021-05-22T03:59:33.463Z] 	at org.eclipse.osgi.internal.loader.ModuleClassLoader.loadClass(ModuleClassLoader.java:153)
23:59:33 [2021-05-22T03:59:33.463Z] 	at java.base/java.lang.ClassLoader.loadClass(ClassLoader.java:522)
23:59:33 [2021-05-22T03:59:33.463Z] 	... 31 more
23:59:33 [2021-05-22T03:59:33.463Z] 
23:59:33 [2021-05-22T03:59:33.463Z] May 22, 2021 3:59:32 AM org.junit.platform.launcher.core.DefaultLauncher handleThrowable
23:59:33 [2021-05-22T03:59:33.463Z] WARNING: TestEngine with ID 'junit-vintage' failed to discover tests
23:59:33 [2021-05-22T03:59:33.463Z] java.lang.NoClassDefFoundError: org/junit/runners/model/RunnerBuilder
23:59:33 [2021-05-22T03:59:33.463Z] 	at org.junit.vintage.engine.discovery.VintageDiscoverer.<init>(VintageDiscoverer.java:48)
23:59:33 [2021-05-22T03:59:33.463Z] 	at org.junit.vintage.engine.VintageTestEngine.discover(VintageTestEngine.java:65)
23:59:33 [2021-05-22T03:59:33.463Z] 	at org.junit.platform.launcher.core.DefaultLauncher.discoverEngineRoot(DefaultLauncher.java:130)
23:59:33 [2021-05-22T03:59:33.463Z] 	at org.junit.platform.launcher.core.DefaultLauncher.discoverRoot(DefaultLauncher.java:117)
23:59:33 [2021-05-22T03:59:33.463Z] 	at org.junit.platform.launcher.core.DefaultLauncher.discover(DefaultLauncher.java:82)
23:59:33 [2021-05-22T03:59:33.463Z] 	at org.apache.maven.surefire.junitplatform.TestPlanScannerFilter.accept(TestPlanScannerFilter.java:56)
23:59:33 [2021-05-22T03:59:33.463Z] 	at org.apache.maven.surefire.util.DefaultScanResult.applyFilter(DefaultScanResult.java:102)
23:59:33 [2021-05-22T03:59:33.463Z] 	at org.apache.maven.surefire.junitplatform.JUnitPlatformProvider.scanClasspath(JUnitPlatformProvider.java:143)
23:59:33 [2021-05-22T03:59:33.463Z] 	at org.apache.maven.surefire.junitplatform.JUnitPlatformProvider.invoke(JUnitPlatformProvider.java:124)
23:59:33 [2021-05-22T03:59:33.463Z] 	at java.base/jdk.internal.reflect.NativeMethodAccessorImpl.invoke0(Native Method)
23:59:33 [2021-05-22T03:59:33.463Z] 	at java.base/jdk.internal.reflect.NativeMethodAccessorImpl.invoke(NativeMethodAccessorImpl.java:64)
23:59:33 [2021-05-22T03:59:33.463Z] 	at java.base/jdk.internal.reflect.DelegatingMethodAccessorImpl.invoke(DelegatingMethodAccessorImpl.java:43)
23:59:33 [2021-05-22T03:59:33.463Z] 	at java.base/java.lang.reflect.Method.invoke(Method.java:564)
23:59:33 [2021-05-22T03:59:33.463Z] 	at org.apache.maven.surefire.util.ReflectionUtils.invokeMethodWithArray2(ReflectionUtils.java:206)
23:59:33 [2021-05-22T03:59:33.463Z] 	at org.apache.maven.surefire.booter.ProviderFactory$ProviderProxy.invoke(ProviderFactory.java:161)
23:59:33 [2021-05-22T03:59:33.463Z] 	at org.apache.maven.surefire.booter.ProviderFactory.invokeProvider(ProviderFactory.java:84)
23:59:33 [2021-05-22T03:59:33.464Z] 	at org.eclipse.tycho.surefire.osgibooter.OsgiSurefireBooter.run(OsgiSurefireBooter.java:116)
23:59:33 [2021-05-22T03:59:33.464Z] 	at org.eclipse.tycho.surefire.osgibooter.HeadlessTestApplication.start(HeadlessTestApplication.java:23)
23:59:33 [2021-05-22T03:59:33.464Z] 	at org.eclipse.equinox.internal.app.EclipseAppHandle.run(EclipseAppHandle.java:203)
23:59:33 [2021-05-22T03:59:33.464Z] 	at org.eclipse.core.runtime.internal.adaptor.EclipseAppLauncher.runApplication(EclipseAppLauncher.java:137)
23:59:33 [2021-05-22T03:59:33.464Z] 	at org.eclipse.core.runtime.internal.adaptor.EclipseAppLauncher.start(EclipseAppLauncher.java:107)
23:59:33 [2021-05-22T03:59:33.464Z] 	at org.eclipse.core.runtime.adaptor.EclipseStarter.run(EclipseStarter.java:400)
23:59:33 [2021-05-22T03:59:33.464Z] 	at org.eclipse.core.runtime.adaptor.EclipseStarter.run(EclipseStarter.java:255)
23:59:33 [2021-05-22T03:59:33.464Z] 	at java.base/jdk.internal.reflect.NativeMethodAccessorImpl.invoke0(Native Method)
23:59:33 [2021-05-22T03:59:33.464Z] 	at java.base/jdk.internal.reflect.NativeMethodAccessorImpl.invoke(NativeMethodAccessorImpl.java:64)
23:59:33 [2021-05-22T03:59:33.464Z] 	at java.base/jdk.internal.reflect.DelegatingMethodAccessorImpl.invoke(DelegatingMethodAccessorImpl.java:43)
23:59:33 [2021-05-22T03:59:33.464Z] 	at java.base/java.lang.reflect.Method.invoke(Method.java:564)
23:59:33 [2021-05-22T03:59:33.464Z] 	at org.eclipse.equinox.launcher.Main.invokeFramework(Main.java:659)
23:59:33 [2021-05-22T03:59:33.464Z] 	at org.eclipse.equinox.launcher.Main.basicRun(Main.java:595)
23:59:33 [2021-05-22T03:59:33.464Z] 	at org.eclipse.equinox.launcher.Main.run(Main.java:1501)
23:59:33 [2021-05-22T03:59:33.464Z] 	at org.eclipse.equinox.launcher.Main.main(Main.java:1474)
23:59:33 [2021-05-22T03:59:33.464Z] Caused by: java.lang.ClassNotFoundException: org.junit.runners.model.RunnerBuilder cannot be found by org.eclipse.tycho.surefire.osgibooter_2.2.0
23:59:33 [2021-05-22T03:59:33.464Z] 	at org.eclipse.osgi.internal.loader.BundleLoader.findClassInternal(BundleLoader.java:511)
23:59:33 [2021-05-22T03:59:33.464Z] 	at org.eclipse.osgi.internal.loader.BundleLoader.findClass(BundleLoader.java:422)
23:59:33 [2021-05-22T03:59:33.464Z] 	at org.eclipse.osgi.internal.loader.BundleLoader.findClass(BundleLoader.java:414)
23:59:33 [2021-05-22T03:59:33.464Z] 	at org.eclipse.osgi.internal.loader.ModuleClassLoader.loadClass(ModuleClassLoader.java:153)
23:59:33 [2021-05-22T03:59:33.464Z] 	at java.base/java.lang.ClassLoader.loadClass(ClassLoader.java:522)
23:59:33 [2021-05-22T03:59:33.464Z] 	... 31 more
23:59:33 [2021-05-22T03:59:33.464Z] 
23:59:33 [2021-05-22T03:59:33.464Z] May 22, 2021 3:59:32 AM org.junit.platform.launcher.core.DefaultLauncher handleThrowable
23:59:33 [2021-05-22T03:59:33.464Z] WARNING: TestEngine with ID 'junit-vintage' failed to discover tests
23:59:33 [2021-05-22T03:59:33.464Z] java.lang.NoClassDefFoundError: org/junit/runners/model/RunnerBuilder
23:59:33 [2021-05-22T03:59:33.464Z] 	at org.junit.vintage.engine.discovery.VintageDiscoverer.<init>(VintageDiscoverer.java:48)
23:59:33 [2021-05-22T03:59:33.464Z] 	at org.junit.vintage.engine.VintageTestEngine.discover(VintageTestEngine.java:65)
23:59:33 [2021-05-22T03:59:33.464Z] 	at org.junit.platform.launcher.core.DefaultLauncher.discoverEngineRoot(DefaultLauncher.java:130)
23:59:33 [2021-05-22T03:59:33.464Z] 	at org.junit.platform.launcher.core.DefaultLauncher.discoverRoot(DefaultLauncher.java:117)
23:59:33 [2021-05-22T03:59:33.464Z] 	at org.junit.platform.launcher.core.DefaultLauncher.discover(DefaultLauncher.java:82)
23:59:33 [2021-05-22T03:59:33.464Z] 	at org.apache.maven.surefire.junitplatform.TestPlanScannerFilter.accept(TestPlanScannerFilter.java:56)
23:59:33 [2021-05-22T03:59:33.464Z] 	at org.apache.maven.surefire.util.DefaultScanResult.applyFilter(DefaultScanResult.java:102)
23:59:33 [2021-05-22T03:59:33.464Z] 	at org.apache.maven.surefire.junitplatform.JUnitPlatformProvider.scanClasspath(JUnitPlatformProvider.java:143)
23:59:33 [2021-05-22T03:59:33.464Z] 	at org.apache.maven.surefire.junitplatform.JUnitPlatformProvider.invoke(JUnitPlatformProvider.java:124)
23:59:33 [2021-05-22T03:59:33.464Z] 	at java.base/jdk.internal.reflect.NativeMethodAccessorImpl.invoke0(Native Method)
23:59:33 [2021-05-22T03:59:33.464Z] 	at java.base/jdk.internal.reflect.NativeMethodAccessorImpl.invoke(NativeMethodAccessorImpl.java:64)
23:59:33 [2021-05-22T03:59:33.464Z] 	at java.base/jdk.internal.reflect.DelegatingMethodAccessorImpl.invoke(DelegatingMethodAccessorImpl.java:43)
23:59:33 [2021-05-22T03:59:33.464Z] 	at java.base/java.lang.reflect.Method.invoke(Method.java:564)
23:59:33 [2021-05-22T03:59:33.464Z] 	at org.apache.maven.surefire.util.ReflectionUtils.invokeMethodWithArray2(ReflectionUtils.java:206)
23:59:33 [2021-05-22T03:59:33.464Z] 	at org.apache.maven.surefire.booter.ProviderFactory$ProviderProxy.invoke(ProviderFactory.java:161)
23:59:33 [2021-05-22T03:59:33.464Z] 	at org.apache.maven.surefire.booter.ProviderFactory.invokeProvider(ProviderFactory.java:84)
23:59:33 [2021-05-22T03:59:33.464Z] 	at org.eclipse.tycho.surefire.osgibooter.OsgiSurefireBooter.run(OsgiSurefireBooter.java:116)
23:59:33 [2021-05-22T03:59:33.464Z] 	at org.eclipse.tycho.surefire.osgibooter.HeadlessTestApplication.start(HeadlessTestApplication.java:23)
23:59:33 [2021-05-22T03:59:33.464Z] 	at org.eclipse.equinox.internal.app.EclipseAppHandle.run(EclipseAppHandle.java:203)
23:59:33 [2021-05-22T03:59:33.464Z] 	at org.eclipse.core.runtime.internal.adaptor.EclipseAppLauncher.runApplication(EclipseAppLauncher.java:137)
23:59:33 [2021-05-22T03:59:33.464Z] 	at org.eclipse.core.runtime.internal.adaptor.EclipseAppLauncher.start(EclipseAppLauncher.java:107)
23:59:33 [2021-05-22T03:59:33.464Z] 	at org.eclipse.core.runtime.adaptor.EclipseStarter.run(EclipseStarter.java:400)
23:59:33 [2021-05-22T03:59:33.464Z] 	at org.eclipse.core.runtime.adaptor.EclipseStarter.run(EclipseStarter.java:255)
23:59:33 [2021-05-22T03:59:33.464Z] 	at java.base/jdk.internal.reflect.NativeMethodAccessorImpl.invoke0(Native Method)
23:59:33 [2021-05-22T03:59:33.464Z] 	at java.base/jdk.internal.reflect.NativeMethodAccessorImpl.invoke(NativeMethodAccessorImpl.java:64)
23:59:33 [2021-05-22T03:59:33.464Z] 	at java.base/jdk.internal.reflect.DelegatingMethodAccessorImpl.invoke(DelegatingMethodAccessorImpl.java:43)
23:59:33 [2021-05-22T03:59:33.464Z] 	at java.base/java.lang.reflect.Method.invoke(Method.java:564)
23:59:33 [2021-05-22T03:59:33.464Z] 	at org.eclipse.equinox.launcher.Main.invokeFramework(Main.java:659)
23:59:33 [2021-05-22T03:59:33.464Z] 	at org.eclipse.equinox.launcher.Main.basicRun(Main.java:595)
23:59:33 [2021-05-22T03:59:33.464Z] 	at org.eclipse.equinox.launcher.Main.run(Main.java:1501)
23:59:33 [2021-05-22T03:59:33.464Z] 	at org.eclipse.equinox.launcher.Main.main(Main.java:1474)
23:59:33 [2021-05-22T03:59:33.464Z] Caused by: java.lang.ClassNotFoundException: org.junit.runners.model.RunnerBuilder cannot be found by org.eclipse.tycho.surefire.osgibooter_2.2.0
23:59:33 [2021-05-22T03:59:33.464Z] 	at org.eclipse.osgi.internal.loader.BundleLoader.findClassInternal(BundleLoader.java:511)
23:59:33 [2021-05-22T03:59:33.464Z] 	at org.eclipse.osgi.internal.loader.BundleLoader.findClass(BundleLoader.java:422)
23:59:33 [2021-05-22T03:59:33.465Z] 	at org.eclipse.osgi.internal.loader.BundleLoader.findClass(BundleLoader.java:414)
23:59:33 [2021-05-22T03:59:33.465Z] 	at org.eclipse.osgi.internal.loader.ModuleClassLoader.loadClass(ModuleClassLoader.java:153)
23:59:33 [2021-05-22T03:59:33.465Z] 	at java.base/java.lang.ClassLoader.loadClass(ClassLoader.java:522)
23:59:33 [2021-05-22T03:59:33.465Z] 	... 31 more
23:59:33 [2021-05-22T03:59:33.465Z] 
23:59:33 [2021-05-22T03:59:33.465Z] May 22, 2021 3:59:32 AM org.junit.platform.launcher.core.DefaultLauncher handleThrowable
23:59:33 [2021-05-22T03:59:33.465Z] WARNING: TestEngine with ID 'junit-vintage' failed to discover tests
23:59:33 [2021-05-22T03:59:33.465Z] java.lang.NoClassDefFoundError: org/junit/runners/model/RunnerBuilder
23:59:33 [2021-05-22T03:59:33.465Z] 	at org.junit.vintage.engine.discovery.VintageDiscoverer.<init>(VintageDiscoverer.java:48)
23:59:33 [2021-05-22T03:59:33.465Z] 	at org.junit.vintage.engine.VintageTestEngine.discover(VintageTestEngine.java:65)
23:59:33 [2021-05-22T03:59:33.465Z] 	at org.junit.platform.launcher.core.DefaultLauncher.discoverEngineRoot(DefaultLauncher.java:130)
23:59:33 [2021-05-22T03:59:33.465Z] 	at org.junit.platform.launcher.core.DefaultLauncher.discoverRoot(DefaultLauncher.java:117)
23:59:33 [2021-05-22T03:59:33.465Z] 	at org.junit.platform.launcher.core.DefaultLauncher.discover(DefaultLauncher.java:82)
23:59:33 [2021-05-22T03:59:33.465Z] 	at org.apache.maven.surefire.junitplatform.TestPlanScannerFilter.accept(TestPlanScannerFilter.java:56)
23:59:33 [2021-05-22T03:59:33.465Z] 	at org.apache.maven.surefire.util.DefaultScanResult.applyFilter(DefaultScanResult.java:102)
23:59:33 [2021-05-22T03:59:33.465Z] 	at org.apache.maven.surefire.junitplatform.JUnitPlatformProvider.scanClasspath(JUnitPlatformProvider.java:143)
23:59:33 [2021-05-22T03:59:33.465Z] 	at org.apache.maven.surefire.junitplatform.JUnitPlatformProvider.invoke(JUnitPlatformProvider.java:124)
23:59:33 [2021-05-22T03:59:33.465Z] 	at java.base/jdk.internal.reflect.NativeMethodAccessorImpl.invoke0(Native Method)
23:59:33 [2021-05-22T03:59:33.465Z] 	at java.base/jdk.internal.reflect.NativeMethodAccessorImpl.invoke(NativeMethodAccessorImpl.java:64)
23:59:33 [2021-05-22T03:59:33.465Z] 	at java.base/jdk.internal.reflect.DelegatingMethodAccessorImpl.invoke(DelegatingMethodAccessorImpl.java:43)
23:59:33 [2021-05-22T03:59:33.465Z] 	at java.base/java.lang.reflect.Method.invoke(Method.java:564)
23:59:33 [2021-05-22T03:59:33.465Z] 	at org.apache.maven.surefire.util.ReflectionUtils.invokeMethodWithArray2(ReflectionUtils.java:206)
23:59:33 [2021-05-22T03:59:33.465Z] 	at org.apache.maven.surefire.booter.ProviderFactory$ProviderProxy.invoke(ProviderFactory.java:161)
23:59:33 [2021-05-22T03:59:33.465Z] 	at org.apache.maven.surefire.booter.ProviderFactory.invokeProvider(ProviderFactory.java:84)
23:59:33 [2021-05-22T03:59:33.465Z] 	at org.eclipse.tycho.surefire.osgibooter.OsgiSurefireBooter.run(OsgiSurefireBooter.java:116)
23:59:33 [2021-05-22T03:59:33.465Z] 	at org.eclipse.tycho.surefire.osgibooter.HeadlessTestApplication.start(HeadlessTestApplication.java:23)
23:59:33 [2021-05-22T03:59:33.465Z] 	at org.eclipse.equinox.internal.app.EclipseAppHandle.run(EclipseAppHandle.java:203)
23:59:33 [2021-05-22T03:59:33.465Z] 	at org.eclipse.core.runtime.internal.adaptor.EclipseAppLauncher.runApplication(EclipseAppLauncher.java:137)
23:59:33 [2021-05-22T03:59:33.465Z] 	at org.eclipse.core.runtime.internal.adaptor.EclipseAppLauncher.start(EclipseAppLauncher.java:107)
23:59:33 [2021-05-22T03:59:33.465Z] 	at org.eclipse.core.runtime.adaptor.EclipseStarter.run(EclipseStarter.java:400)
23:59:33 [2021-05-22T03:59:33.465Z] 	at org.eclipse.core.runtime.adaptor.EclipseStarter.run(EclipseStarter.java:255)
23:59:33 [2021-05-22T03:59:33.465Z] 	at java.base/jdk.internal.reflect.NativeMethodAccessorImpl.invoke0(Native Method)
23:59:33 [2021-05-22T03:59:33.465Z] 	at java.base/jdk.internal.reflect.NativeMethodAccessorImpl.invoke(NativeMethodAccessorImpl.java:64)
23:59:33 [2021-05-22T03:59:33.465Z] 	at java.base/jdk.internal.reflect.DelegatingMethodAccessorImpl.invoke(DelegatingMethodAccessorImpl.java:43)
23:59:33 [2021-05-22T03:59:33.465Z] 	at java.base/java.lang.reflect.Method.invoke(Method.java:564)
23:59:33 [2021-05-22T03:59:33.465Z] 	at org.eclipse.equinox.launcher.Main.invokeFramework(Main.java:659)
23:59:33 [2021-05-22T03:59:33.465Z] 	at org.eclipse.equinox.launcher.Main.basicRun(Main.java:595)
23:59:33 [2021-05-22T03:59:33.465Z] 	at org.eclipse.equinox.launcher.Main.run(Main.java:1501)
23:59:33 [2021-05-22T03:59:33.465Z] 	at org.eclipse.equinox.launcher.Main.main(Main.java:1474)
23:59:33 [2021-05-22T03:59:33.465Z] Caused by: java.lang.ClassNotFoundException: org.junit.runners.model.RunnerBuilder cannot be found by org.eclipse.tycho.surefire.osgibooter_2.2.0
23:59:33 [2021-05-22T03:59:33.465Z] 	at org.eclipse.osgi.internal.loader.BundleLoader.findClassInternal(BundleLoader.java:511)
23:59:33 [2021-05-22T03:59:33.465Z] 	at org.eclipse.osgi.internal.loader.BundleLoader.findClass(BundleLoader.java:422)
23:59:33 [2021-05-22T03:59:33.465Z] 	at org.eclipse.osgi.internal.loader.BundleLoader.findClass(BundleLoader.java:414)
23:59:33 [2021-05-22T03:59:33.465Z] 	at org.eclipse.osgi.internal.loader.ModuleClassLoader.loadClass(ModuleClassLoader.java:153)
23:59:33 [2021-05-22T03:59:33.465Z] 	at java.base/java.lang.ClassLoader.loadClass(ClassLoader.java:522)
23:59:33 [2021-05-22T03:59:33.465Z] 	... 31 more
23:59:33 [2021-05-22T03:59:33.465Z] 
23:59:33 [2021-05-22T03:59:33.465Z] May 22, 2021 3:59:32 AM org.junit.platform.launcher.core.DefaultLauncher handleThrowable
23:59:33 [2021-05-22T03:59:33.465Z] WARNING: TestEngine with ID 'junit-vintage' failed to discover tests
23:59:33 [2021-05-22T03:59:33.465Z] java.lang.NoClassDefFoundError: org/junit/runners/model/RunnerBuilder
23:59:33 [2021-05-22T03:59:33.465Z] 	at org.junit.vintage.engine.discovery.VintageDiscoverer.<init>(VintageDiscoverer.java:48)
23:59:33 [2021-05-22T03:59:33.465Z] 	at org.junit.vintage.engine.VintageTestEngine.discover(VintageTestEngine.java:65)
23:59:33 [2021-05-22T03:59:33.465Z] 	at org.junit.platform.launcher.core.DefaultLauncher.discoverEngineRoot(DefaultLauncher.java:130)
23:59:33 [2021-05-22T03:59:33.465Z] 	at org.junit.platform.launcher.core.DefaultLauncher.discoverRoot(DefaultLauncher.java:117)
23:59:33 [2021-05-22T03:59:33.465Z] 	at org.junit.platform.launcher.core.DefaultLauncher.execute(DefaultLauncher.java:90)
23:59:33 [2021-05-22T03:59:33.465Z] 	at org.apache.maven.surefire.junitplatform.JUnitPlatformProvider.invokeAllTests(JUnitPlatformProvider.java:150)
23:59:33 [2021-05-22T03:59:33.465Z] 	at org.apache.maven.surefire.junitplatform.JUnitPlatformProvider.invoke(JUnitPlatformProvider.java:124)
23:59:33 [2021-05-22T03:59:33.465Z] 	at java.base/jdk.internal.reflect.NativeMethodAccessorImpl.invoke0(Native Method)
23:59:33 [2021-05-22T03:59:33.465Z] 	at java.base/jdk.internal.reflect.NativeMethodAccessorImpl.invoke(NativeMethodAccessorImpl.java:64)
23:59:33 [2021-05-22T03:59:33.465Z] 	at java.base/jdk.internal.reflect.DelegatingMethodAccessorImpl.invoke(DelegatingMethodAccessorImpl.java:43)
23:59:33 [2021-05-22T03:59:33.465Z] 	at java.base/java.lang.reflect.Method.invoke(Method.java:564)
23:59:33 [2021-05-22T03:59:33.466Z] 	at org.apache.maven.surefire.util.ReflectionUtils.invokeMethodWithArray2(ReflectionUtils.java:206)
23:59:33 [2021-05-22T03:59:33.466Z] 	at org.apache.maven.surefire.booter.ProviderFactory$ProviderProxy.invoke(ProviderFactory.java:161)
23:59:33 [2021-05-22T03:59:33.466Z] 	at org.apache.maven.surefire.booter.ProviderFactory.invokeProvider(ProviderFactory.java:84)
23:59:33 [2021-05-22T03:59:33.466Z] 	at org.eclipse.tycho.surefire.osgibooter.OsgiSurefireBooter.run(OsgiSurefireBooter.java:116)
23:59:33 [2021-05-22T03:59:33.466Z] 	at org.eclipse.tycho.surefire.osgibooter.HeadlessTestApplication.start(HeadlessTestApplication.java:23)
23:59:33 [2021-05-22T03:59:33.466Z] 	at org.eclipse.equinox.internal.app.EclipseAppHandle.run(EclipseAppHandle.java:203)
23:59:33 [2021-05-22T03:59:33.466Z] 	at org.eclipse.core.runtime.internal.adaptor.EclipseAppLauncher.runApplication(EclipseAppLauncher.java:137)
23:59:33 [2021-05-22T03:59:33.466Z] 	at org.eclipse.core.runtime.internal.adaptor.EclipseAppLauncher.start(EclipseAppLauncher.java:107)
23:59:33 [2021-05-22T03:59:33.466Z] 	at org.eclipse.core.runtime.adaptor.EclipseStarter.run(EclipseStarter.java:400)
23:59:33 [2021-05-22T03:59:33.466Z] 	at org.eclipse.core.runtime.adaptor.EclipseStarter.run(EclipseStarter.java:255)
23:59:33 [2021-05-22T03:59:33.466Z] 	at java.base/jdk.internal.reflect.NativeMethodAccessorImpl.invoke0(Native Method)
23:59:33 [2021-05-22T03:59:33.466Z] 	at java.base/jdk.internal.reflect.NativeMethodAccessorImpl.invoke(NativeMethodAccessorImpl.java:64)
23:59:33 [2021-05-22T03:59:33.466Z] 	at java.base/jdk.internal.reflect.DelegatingMethodAccessorImpl.invoke(DelegatingMethodAccessorImpl.java:43)
23:59:33 [2021-05-22T03:59:33.466Z] 	at java.base/java.lang.reflect.Method.invoke(Method.java:564)
23:59:33 [2021-05-22T03:59:33.466Z] 	at org.eclipse.equinox.launcher.Main.invokeFramework(Main.java:659)
23:59:33 [2021-05-22T03:59:33.466Z] 	at org.eclipse.equinox.launcher.Main.basicRun(Main.java:595)
23:59:33 [2021-05-22T03:59:33.466Z] 	at org.eclipse.equinox.launcher.Main.run(Main.java:1501)
23:59:33 [2021-05-22T03:59:33.466Z] 	at org.eclipse.equinox.launcher.Main.main(Main.java:1474)
23:59:33 [2021-05-22T03:59:33.466Z] Caused by: java.lang.ClassNotFoundException: org.junit.runners.model.RunnerBuilder cannot be found by org.eclipse.tycho.surefire.osgibooter_2.2.0
23:59:33 [2021-05-22T03:59:33.466Z] 	at org.eclipse.osgi.internal.loader.BundleLoader.findClassInternal(BundleLoader.java:511)
23:59:33 [2021-05-22T03:59:33.466Z] 	at org.eclipse.osgi.internal.loader.BundleLoader.findClass(BundleLoader.java:422)
23:59:33 [2021-05-22T03:59:33.466Z] 	at org.eclipse.osgi.internal.loader.BundleLoader.findClass(BundleLoader.java:414)
23:59:33 [2021-05-22T03:59:33.466Z] 	at org.eclipse.osgi.internal.loader.ModuleClassLoader.loadClass(ModuleClassLoader.java:153)
23:59:33 [2021-05-22T03:59:33.466Z] 	at java.base/java.lang.ClassLoader.loadClass(ClassLoader.java:522)
23:59:33 [2021-05-22T03:59:33.466Z] 	... 29 more
23:59:33 [2021-05-22T03:59:33.466Z] 
23:59:33 [2021-05-22T03:59:33.466Z] Running org.eclipse.ease.ui.views.shell.dropins.variables.VariablesComparatorTest
23:59:34 [2021-05-22T03:59:34.429Z] Tests run: 1, Failures: 0, Errors: 0, Skipped: 0, Time elapsed: 1.145 s - in org.eclipse.ease.ui.views.shell.dropins.variables.VariablesComparatorTest
23:59:34 [2021-05-22T03:59:34.429Z] lastExecutionResult_comes_before_debugVariable  Time elapsed: 1.137 s
23:59:34 [2021-05-22T03:59:34.429Z] Running org.eclipse.ease.ui.views.shell.dropins.variables.HiddenVariablesFilterTest
23:59:34 [2021-05-22T03:59:34.429Z] Tests run: 3, Failures: 0, Errors: 0, Skipped: 0, Time elapsed: 0.037 s - in org.eclipse.ease.ui.views.shell.dropins.variables.HiddenVariablesFilterTest
23:59:34 [2021-05-22T03:59:34.429Z] select_accepts_unknown_classes  Time elapsed: 0.001 s
23:59:34 [2021-05-22T03:59:34.429Z] select_accepts_script_variables  Time elapsed: 0.033 s
23:59:34 [2021-05-22T03:59:34.429Z] select_declines_hidden_script_variables  Time elapsed: 0.001 s
23:59:34 [2021-05-22T03:59:34.429Z] Running org.eclipse.ease.ui.views.shell.dropins.variables.ContentLabelProviderTest
23:59:34 [2021-05-22T03:59:34.429Z] Tests run: 1, Failures: 0, Errors: 0, Skipped: 0, Time elapsed: 0.067 s - in org.eclipse.ease.ui.views.shell.dropins.variables.ContentLabelProviderTest
23:59:34 [2021-05-22T03:59:34.429Z] getText_returns_variable_content  Time elapsed: 0.067 s
23:59:34 [2021-05-22T03:59:34.429Z] Running org.eclipse.ease.ui.views.shell.dropins.variables.VariablesLabelProviderTest
23:59:34 [2021-05-22T03:59:34.429Z] Tests run: 1, Failures: 0, Errors: 0, Skipped: 0, Time elapsed: 0.003 s - in org.eclipse.ease.ui.views.shell.dropins.variables.VariablesLabelProviderTest
23:59:34 [2021-05-22T03:59:34.429Z] getText_returns_variable_name  Time elapsed: 0.003 s
23:59:34 [2021-05-22T03:59:34.429Z] Running org.eclipse.ease.ui.views.shell.dropins.variables.VariablesContentProviderTest
23:59:34 [2021-05-22T03:59:34.429Z] Tests run: 5, Failures: 0, Errors: 0, Skipped: 0, Time elapsed: 0.058 s - in org.eclipse.ease.ui.views.shell.dropins.variables.VariablesContentProviderTest
23:59:34 [2021-05-22T03:59:34.429Z] hasChildren_true_when_child_nodes_are_available  Time elapsed: 0.001 s
23:59:34 [2021-05-22T03:59:34.429Z] getChildren_is_empty_when_no_child_nodes_are_available  Time elapsed: 0.002 s
23:59:34 [2021-05-22T03:59:34.429Z] getElements_contains_variables_from_engine  Time elapsed: 0.05 s
23:59:34 [2021-05-22T03:59:34.429Z] hasChildren_false_when_no_child_nodes_are_available  Time elapsed: 0.001 s
23:59:34 [2021-05-22T03:59:34.429Z] getChildren_not_empty_when_child_nodes_are_available  Time elapsed: 0 s
23:59:34 [2021-05-22T03:59:34.429Z] Running org.eclipse.ease.ui.views.shell.dropins.modules.ModulesStackContentProviderTest
23:59:34 [2021-05-22T03:59:34.687Z] Tests run: 2, Failures: 0, Errors: 0, Skipped: 0, Time elapsed: 0.099 s - in org.eclipse.ease.ui.views.shell.dropins.modules.ModulesStackContentProviderTest
23:59:34 [2021-05-22T03:59:34.687Z] getElements_returns_modules  Time elapsed: 0.098 s
23:59:34 [2021-05-22T03:59:34.687Z] getElements_returns_empty_list_without_environment  Time elapsed: 0 s
23:59:34 [2021-05-22T03:59:34.687Z] Running org.eclipse.ease.ui.views.shell.dropins.modules.ModulesStackLabelProviderTest
23:59:34 [2021-05-22T03:59:34.687Z] Tests run: 3, Failures: 0, Errors: 0, Skipped: 0, Time elapsed: 0.079 s - in org.eclipse.ease.ui.views.shell.dropins.modules.ModulesStackLabelProviderTest
23:59:34 [2021-05-22T03:59:34.687Z] getText_null_returns_empty_string  Time elapsed: 0 s
23:59:34 [2021-05-22T03:59:34.687Z] getText_returns_definition_name  Time elapsed: 0.077 s
23:59:34 [2021-05-22T03:59:34.687Z] getText_returns_full_class_name_name  Time elapsed: 0.001 s
23:59:34 [2021-05-22T03:59:34.687Z] Running org.eclipse.ease.ui.help.hovers.ModuleHelpTest
23:59:34 [2021-05-22T03:59:34.687Z] Tests run: 4, Failures: 0, Errors: 0, Skipped: 4, Time elapsed: 0.002 s - in org.eclipse.ease.ui.help.hovers.ModuleHelpTest
23:59:34 [2021-05-22T03:59:34.687Z] getModuleHelpLocation skipped
23:59:34 [2021-05-22T03:59:34.687Z] getModuleHelp skipped
23:59:34 [2021-05-22T03:59:34.687Z] getMethodHelp skipped
23:59:34 [2021-05-22T03:59:34.687Z] getConstantHelp skipped
23:59:34 [2021-05-22T03:59:34.687Z] Running org.eclipse.ease.ui.dnd.ModulesDropHandlerTest
23:59:34 [2021-05-22T03:59:34.687Z] Tests run: 2, Failures: 0, Errors: 0, Skipped: 0, Time elapsed: 0.02 s - in org.eclipse.ease.ui.dnd.ModulesDropHandlerTest
23:59:34 [2021-05-22T03:59:34.687Z] accepts_true_for_ModuleEntry  Time elapsed: 0.019 s
23:59:34 [2021-05-22T03:59:34.687Z] accepts_true_for_ModuleDefinition  Time elapsed: 0 s
23:59:34 [2021-05-22T03:59:34.687Z] Running org.eclipse.ease.ui.completion.CompletionContextTest
23:59:34 [2021-05-22T03:59:34.687Z] Tests run: 9, Failures: 0, Errors: 0, Skipped: 0, Time elapsed: 0.031 s - in org.eclipse.ease.ui.completion.CompletionContextTest
23:59:34 [2021-05-22T03:59:34.687Z] resolveStaticClass  Time elapsed: 0.027 s
23:59:34 [2021-05-22T03:59:34.687Z] resolveClassWithFilter  Time elapsed: 0.001 s
23:59:34 [2021-05-22T03:59:34.687Z] simplifyCalls  Time elapsed: 0.001 s
23:59:34 [2021-05-22T03:59:34.687Z] resolveClass  Time elapsed: 0 s
23:59:34 [2021-05-22T03:59:34.687Z] replaceEscapedStringLiterals  Time elapsed: 0 s
23:59:34 [2021-05-22T03:59:34.687Z] replaceSimpleStringLiterals  Time elapsed: 0 s
23:59:34 [2021-05-22T03:59:34.687Z] resolveStaticClassWithFilter  Time elapsed: 0 s
23:59:34 [2021-05-22T03:59:34.687Z] resolveClassWithParameters  Time elapsed: 0 s
23:59:34 [2021-05-22T03:59:34.687Z] replaceMultipleStringLiterals  Time elapsed: 0 s
23:59:34 [2021-05-22T03:59:34.687Z] Running org.eclipse.ease.ui.completion.provider.AbstractFileLocationCompletionProviderTest
23:59:34 [2021-05-22T03:59:34.687Z] Tests run: 8, Failures: 0, Errors: 0, Skipped: 8, Time elapsed: 0.034 s - in org.eclipse.ease.ui.completion.provider.AbstractFileLocationCompletionProviderTest
23:59:34 [2021-05-22T03:59:34.687Z] workspaceProjectProposals skipped
23:59:34 [2021-05-22T03:59:34.687Z] checkOperatingSystem skipped
23:59:34 [2021-05-22T03:59:34.687Z] absoluteRootWorkspaceProposals skipped
23:59:34 [2021-05-22T03:59:34.687Z] workspaceFolderProposals skipped
23:59:34 [2021-05-22T03:59:34.687Z] fileSystemFolderProposals skipped
23:59:34 [2021-05-22T03:59:34.687Z] workspaceProposals skipped
23:59:34 [2021-05-22T03:59:34.687Z] relativeRootWorkspaceProposals skipped
23:59:34 [2021-05-22T03:59:34.687Z] fileSystemRootProposals skipped
23:59:34 [2021-05-22T03:59:34.687Z] 
23:59:34 [2021-05-22T03:59:34.687Z] Results:
23:59:34 [2021-05-22T03:59:34.687Z] 
23:59:34 [2021-05-22T03:59:34.687Z] Tests run: 39, Failures: 0, Errors: 0, Skipped: 12
23:59:34 [2021-05-22T03:59:34.687Z] 
23:59:35 [2021-05-22T03:59:35.620Z] [INFO] All tests passed!
23:59:35 [2021-05-22T03:59:35.620Z] [INFO] ------------------------------------------------------------------------
23:59:35 [2021-05-22T03:59:35.620Z] [INFO] Reactor Summary for org.eclipse.ease.releng 0.8.0-SNAPSHOT:
23:59:35 [2021-05-22T03:59:35.620Z] [INFO] 
23:59:35 [2021-05-22T03:59:35.620Z] [INFO] org.eclipse.ease.releng ............................ SUCCESS [  0.002 s]
23:59:35 [2021-05-22T03:59:35.620Z] [INFO] org.eclipse.ease.releng.target ..................... SUCCESS [  0.190 s]
23:59:35 [2021-05-22T03:59:35.620Z] [INFO] org.eclipse.ease.test .............................. SUCCESS [ 26.406 s]
23:59:35 [2021-05-22T03:59:35.620Z] [INFO] org.eclipse.ease.lang.javascript.rhino.test ........ SUCCESS [ 20.255 s]
23:59:35 [2021-05-22T03:59:35.620Z] [INFO] org.eclipse.ease.lang.javascript.test .............. SUCCESS [  5.209 s]
23:59:35 [2021-05-22T03:59:35.620Z] [INFO] org.eclipse.ease.lang.python.test .................. SUCCESS [  5.724 s]
23:59:35 [2021-05-22T03:59:35.620Z] [INFO] org.eclipse.ease.lang.python.jython.test ........... SUCCESS [ 22.136 s]
23:59:35 [2021-05-22T03:59:35.620Z] [INFO] org.eclipse.ease.lang.scriptarchive.test ........... SUCCESS [  5.400 s]
23:59:35 [2021-05-22T03:59:35.620Z] [INFO] org.eclipse.ease.ui.test ........................... SUCCESS [  6.459 s]
23:59:35 [2021-05-22T03:59:35.620Z] [INFO] ------------------------------------------------------------------------
23:59:35 [2021-05-22T03:59:35.620Z] [INFO] BUILD SUCCESS
23:59:35 [2021-05-22T03:59:35.620Z] [INFO] ------------------------------------------------------------------------
23:59:35 [2021-05-22T03:59:35.620Z] [INFO] Total time:  02:21 min
23:59:35 [2021-05-22T03:59:35.620Z] [INFO] Finished at: 2021-05-22T03:59:35Z
23:59:35 [2021-05-22T03:59:35.620Z] [INFO] ------------------------------------------------------------------------
23:59:35 [2021-05-22T03:59:35.620Z] [WARNING] [jenkins-event-spy] Unexpected Maven project file name 'target-tests-pom.xml', problems may occur
23:59:35 [2021-05-22T03:59:35.620Z] [INFO] [jenkins-event-spy] Generated /home/jenkins/agent/workspace/ease.verify.core.target.2018-12@tmp/withMaven712aadef/maven-spy-20210522-035714-13813222893824788835087.log