SuccessConsole Output

Skipping 966 KB.. Full Log
-1508.jar, -data, /home/jenkins/agent/workspace/ease.verify.core.target.2018-12/tests/org.eclipse.ease.lang.scriptarchive.test/target/work/data, -install, /home/jenkins/agent/workspace/ease.verify.core.target.2018-12/tests/org.eclipse.ease.lang.scriptarchive.test/target/work, -configuration, /home/jenkins/agent/workspace/ease.verify.core.target.2018-12/tests/org.eclipse.ease.lang.scriptarchive.test/target/work/configuration, -application, org.eclipse.tycho.surefire.osgibooter.headlesstest, -testproperties, /home/jenkins/agent/workspace/ease.verify.core.target.2018-12/tests/org.eclipse.ease.lang.scriptarchive.test/target/surefire.properties]
23:56:25 [2021-05-22T03:56:25.234Z] Picked up JAVA_TOOL_OPTIONS: -Dmaven.ext.class.path="/home/jenkins/agent/workspace/ease.verify.core.target.2018-12@tmp/withMaven20d5a577/pipeline-maven-spy.jar" -Dorg.jenkinsci.plugins.pipeline.maven.reportsFolder="/home/jenkins/agent/workspace/ease.verify.core.target.2018-12@tmp/withMaven20d5a577" 
23:56:29 [2021-05-22T03:56:29.487Z] May 22, 2021 3:56:29 AM org.junit.platform.launcher.core.DefaultLauncher handleThrowable
23:56:29 [2021-05-22T03:56:29.487Z] WARNING: TestEngine with ID 'junit-vintage' failed to discover tests
23:56:29 [2021-05-22T03:56:29.487Z] java.lang.NoClassDefFoundError: org/junit/runners/model/RunnerBuilder
23:56:29 [2021-05-22T03:56:29.487Z] 	at org.junit.vintage.engine.discovery.VintageDiscoverer.<init>(VintageDiscoverer.java:48)
23:56:29 [2021-05-22T03:56:29.487Z] 	at org.junit.vintage.engine.VintageTestEngine.discover(VintageTestEngine.java:65)
23:56:29 [2021-05-22T03:56:29.487Z] 	at org.junit.platform.launcher.core.DefaultLauncher.discoverEngineRoot(DefaultLauncher.java:130)
23:56:29 [2021-05-22T03:56:29.487Z] 	at org.junit.platform.launcher.core.DefaultLauncher.discoverRoot(DefaultLauncher.java:117)
23:56:29 [2021-05-22T03:56:29.487Z] 	at org.junit.platform.launcher.core.DefaultLauncher.discover(DefaultLauncher.java:82)
23:56:29 [2021-05-22T03:56:29.487Z] 	at org.apache.maven.surefire.junitplatform.TestPlanScannerFilter.accept(TestPlanScannerFilter.java:56)
23:56:29 [2021-05-22T03:56:29.487Z] 	at org.apache.maven.surefire.util.DefaultScanResult.applyFilter(DefaultScanResult.java:102)
23:56:29 [2021-05-22T03:56:29.487Z] 	at org.apache.maven.surefire.junitplatform.JUnitPlatformProvider.scanClasspath(JUnitPlatformProvider.java:143)
23:56:29 [2021-05-22T03:56:29.487Z] 	at org.apache.maven.surefire.junitplatform.JUnitPlatformProvider.invoke(JUnitPlatformProvider.java:124)
23:56:29 [2021-05-22T03:56:29.487Z] 	at java.base/jdk.internal.reflect.NativeMethodAccessorImpl.invoke0(Native Method)
23:56:29 [2021-05-22T03:56:29.487Z] 	at java.base/jdk.internal.reflect.NativeMethodAccessorImpl.invoke(NativeMethodAccessorImpl.java:64)
23:56:29 [2021-05-22T03:56:29.487Z] 	at java.base/jdk.internal.reflect.DelegatingMethodAccessorImpl.invoke(DelegatingMethodAccessorImpl.java:43)
23:56:29 [2021-05-22T03:56:29.487Z] 	at java.base/java.lang.reflect.Method.invoke(Method.java:564)
23:56:29 [2021-05-22T03:56:29.487Z] 	at org.apache.maven.surefire.util.ReflectionUtils.invokeMethodWithArray2(ReflectionUtils.java:206)
23:56:29 [2021-05-22T03:56:29.487Z] 	at org.apache.maven.surefire.booter.ProviderFactory$ProviderProxy.invoke(ProviderFactory.java:161)
23:56:29 [2021-05-22T03:56:29.487Z] 	at org.apache.maven.surefire.booter.ProviderFactory.invokeProvider(ProviderFactory.java:84)
23:56:29 [2021-05-22T03:56:29.487Z] 	at org.eclipse.tycho.surefire.osgibooter.OsgiSurefireBooter.run(OsgiSurefireBooter.java:116)
23:56:29 [2021-05-22T03:56:29.487Z] 	at org.eclipse.tycho.surefire.osgibooter.HeadlessTestApplication.start(HeadlessTestApplication.java:23)
23:56:29 [2021-05-22T03:56:29.487Z] 	at org.eclipse.equinox.internal.app.EclipseAppHandle.run(EclipseAppHandle.java:203)
23:56:29 [2021-05-22T03:56:29.487Z] 	at org.eclipse.core.runtime.internal.adaptor.EclipseAppLauncher.runApplication(EclipseAppLauncher.java:134)
23:56:29 [2021-05-22T03:56:29.488Z] 	at org.eclipse.core.runtime.internal.adaptor.EclipseAppLauncher.start(EclipseAppLauncher.java:104)
23:56:29 [2021-05-22T03:56:29.488Z] 	at org.eclipse.core.runtime.adaptor.EclipseStarter.run(EclipseStarter.java:401)
23:56:29 [2021-05-22T03:56:29.488Z] 	at org.eclipse.core.runtime.adaptor.EclipseStarter.run(EclipseStarter.java:255)
23:56:29 [2021-05-22T03:56:29.488Z] 	at java.base/jdk.internal.reflect.NativeMethodAccessorImpl.invoke0(Native Method)
23:56:29 [2021-05-22T03:56:29.488Z] 	at java.base/jdk.internal.reflect.NativeMethodAccessorImpl.invoke(NativeMethodAccessorImpl.java:64)
23:56:29 [2021-05-22T03:56:29.488Z] 	at java.base/jdk.internal.reflect.DelegatingMethodAccessorImpl.invoke(DelegatingMethodAccessorImpl.java:43)
23:56:29 [2021-05-22T03:56:29.488Z] 	at java.base/java.lang.reflect.Method.invoke(Method.java:564)
23:56:29 [2021-05-22T03:56:29.488Z] 	at org.eclipse.equinox.launcher.Main.invokeFramework(Main.java:653)
23:56:29 [2021-05-22T03:56:29.488Z] 	at org.eclipse.equinox.launcher.Main.basicRun(Main.java:590)
23:56:29 [2021-05-22T03:56:29.488Z] 	at org.eclipse.equinox.launcher.Main.run(Main.java:1461)
23:56:29 [2021-05-22T03:56:29.488Z] 	at org.eclipse.equinox.launcher.Main.main(Main.java:1434)
23:56:29 [2021-05-22T03:56:29.488Z] Caused by: java.lang.ClassNotFoundException: org.junit.runners.model.RunnerBuilder cannot be found by org.eclipse.tycho.surefire.osgibooter_2.2.0
23:56:29 [2021-05-22T03:56:29.488Z] 	at org.eclipse.osgi.internal.loader.BundleLoader.findClass(BundleLoader.java:516)
23:56:29 [2021-05-22T03:56:29.488Z] 	at org.eclipse.osgi.internal.loader.ModuleClassLoader.loadClass(ModuleClassLoader.java:171)
23:56:29 [2021-05-22T03:56:29.488Z] 	at java.base/java.lang.ClassLoader.loadClass(ClassLoader.java:522)
23:56:29 [2021-05-22T03:56:29.488Z] 	... 31 more
23:56:29 [2021-05-22T03:56:29.488Z] 
23:56:29 [2021-05-22T03:56:29.488Z] May 22, 2021 3:56:29 AM org.junit.platform.launcher.core.DefaultLauncher handleThrowable
23:56:29 [2021-05-22T03:56:29.488Z] WARNING: TestEngine with ID 'junit-vintage' failed to discover tests
23:56:29 [2021-05-22T03:56:29.488Z] java.lang.NoClassDefFoundError: org/junit/runners/model/RunnerBuilder
23:56:29 [2021-05-22T03:56:29.488Z] 	at org.junit.vintage.engine.discovery.VintageDiscoverer.<init>(VintageDiscoverer.java:48)
23:56:29 [2021-05-22T03:56:29.488Z] 	at org.junit.vintage.engine.VintageTestEngine.discover(VintageTestEngine.java:65)
23:56:29 [2021-05-22T03:56:29.488Z] 	at org.junit.platform.launcher.core.DefaultLauncher.discoverEngineRoot(DefaultLauncher.java:130)
23:56:29 [2021-05-22T03:56:29.488Z] 	at org.junit.platform.launcher.core.DefaultLauncher.discoverRoot(DefaultLauncher.java:117)
23:56:29 [2021-05-22T03:56:29.488Z] 	at org.junit.platform.launcher.core.DefaultLauncher.execute(DefaultLauncher.java:90)
23:56:29 [2021-05-22T03:56:29.488Z] 	at org.apache.maven.surefire.junitplatform.JUnitPlatformProvider.invokeAllTests(JUnitPlatformProvider.java:150)
23:56:29 [2021-05-22T03:56:29.488Z] 	at org.apache.maven.surefire.junitplatform.JUnitPlatformProvider.invoke(JUnitPlatformProvider.java:124)
23:56:29 [2021-05-22T03:56:29.488Z] 	at java.base/jdk.internal.reflect.NativeMethodAccessorImpl.invoke0(Native Method)
23:56:29 [2021-05-22T03:56:29.488Z] 	at java.base/jdk.internal.reflect.NativeMethodAccessorImpl.invoke(NativeMethodAccessorImpl.java:64)
23:56:29 [2021-05-22T03:56:29.488Z] 	at java.base/jdk.internal.reflect.DelegatingMethodAccessorImpl.invoke(DelegatingMethodAccessorImpl.java:43)
23:56:29 [2021-05-22T03:56:29.488Z] 	at java.base/java.lang.reflect.Method.invoke(Method.java:564)
23:56:29 [2021-05-22T03:56:29.488Z] 	at org.apache.maven.surefire.util.ReflectionUtils.invokeMethodWithArray2(ReflectionUtils.java:206)
23:56:29 [2021-05-22T03:56:29.488Z] 	at org.apache.maven.surefire.booter.ProviderFactory$ProviderProxy.invoke(ProviderFactory.java:161)
23:56:29 [2021-05-22T03:56:29.488Z] 	at org.apache.maven.surefire.booter.ProviderFactory.invokeProvider(ProviderFactory.java:84)
23:56:29 [2021-05-22T03:56:29.488Z] 	at org.eclipse.tycho.surefire.osgibooter.OsgiSurefireBooter.run(OsgiSurefireBooter.java:116)
23:56:29 [2021-05-22T03:56:29.488Z] 	at org.eclipse.tycho.surefire.osgibooter.HeadlessTestApplication.start(HeadlessTestApplication.java:23)
23:56:29 [2021-05-22T03:56:29.488Z] 	at org.eclipse.equinox.internal.app.EclipseAppHandle.run(EclipseAppHandle.java:203)
23:56:29 [2021-05-22T03:56:29.488Z] 	at org.eclipse.core.runtime.internal.adaptor.EclipseAppLauncher.runApplication(EclipseAppLauncher.java:134)
23:56:29 [2021-05-22T03:56:29.488Z] 	at org.eclipse.core.runtime.internal.adaptor.EclipseAppLauncher.start(EclipseAppLauncher.java:104)
23:56:29 [2021-05-22T03:56:29.488Z] 	at org.eclipse.core.runtime.adaptor.EclipseStarter.run(EclipseStarter.java:401)
23:56:29 [2021-05-22T03:56:29.488Z] 	at org.eclipse.core.runtime.adaptor.EclipseStarter.run(EclipseStarter.java:255)
23:56:29 [2021-05-22T03:56:29.488Z] 	at java.base/jdk.internal.reflect.NativeMethodAccessorImpl.invoke0(Native Method)
23:56:29 [2021-05-22T03:56:29.488Z] 	at java.base/jdk.internal.reflect.NativeMethodAccessorImpl.invoke(NativeMethodAccessorImpl.java:64)
23:56:29 [2021-05-22T03:56:29.488Z] 	at java.base/jdk.internal.reflect.DelegatingMethodAccessorImpl.invoke(DelegatingMethodAccessorImpl.java:43)
23:56:29 [2021-05-22T03:56:29.488Z] 	at java.base/java.lang.reflect.Method.invoke(Method.java:564)
23:56:29 [2021-05-22T03:56:29.488Z] 	at org.eclipse.equinox.launcher.Main.invokeFramework(Main.java:653)
23:56:29 [2021-05-22T03:56:29.488Z] 	at org.eclipse.equinox.launcher.Main.basicRun(Main.java:590)
23:56:29 [2021-05-22T03:56:29.488Z] 	at org.eclipse.equinox.launcher.Main.run(Main.java:1461)
23:56:29 [2021-05-22T03:56:29.488Z] 	at org.eclipse.equinox.launcher.Main.main(Main.java:1434)
23:56:29 [2021-05-22T03:56:29.488Z] Caused by: java.lang.ClassNotFoundException: org.junit.runners.model.RunnerBuilder cannot be found by org.eclipse.tycho.surefire.osgibooter_2.2.0
23:56:29 [2021-05-22T03:56:29.488Z] 	at org.eclipse.osgi.internal.loader.BundleLoader.findClass(BundleLoader.java:516)
23:56:29 [2021-05-22T03:56:29.488Z] 	at org.eclipse.osgi.internal.loader.ModuleClassLoader.loadClass(ModuleClassLoader.java:171)
23:56:29 [2021-05-22T03:56:29.488Z] 	at java.base/java.lang.ClassLoader.loadClass(ClassLoader.java:522)
23:56:29 [2021-05-22T03:56:29.488Z] 	... 29 more
23:56:29 [2021-05-22T03:56:29.488Z] 
23:56:29 [2021-05-22T03:56:29.488Z] Running org.eclipse.ease.lang.scriptarchive.ArchiveEngineTest
23:56:30 [2021-05-22T03:56:30.422Z] We are running from a zip file!
23:56:30 [2021-05-22T03:56:30.422Z] org.eclipse.ease.ScriptExecutionException: SyntaxError: missing ; before statement (workspace://__EASE_ScriptArchive_1/scripts/Master.js#3)
23:56:30 [2021-05-22T03:56:30.422Z] this is an error
23:56:30 [2021-05-22T03:56:30.422Z]        ^
23:56:30 [2021-05-22T03:56:30.422Z] 	at Master.js,workspace://__EASE_ScriptArchive_1/scripts/Master.js
23:56:30 [2021-05-22T03:56:30.422Z] org.eclipse.ease.ScriptExecutionException: SyntaxError: missing ; before statement (workspace://__EASE_ScriptArchive_1/scripts/Master.js#3)
23:56:30 [2021-05-22T03:56:30.422Z] this is an error
23:56:30 [2021-05-22T03:56:30.422Z]        ^
23:56:30 [2021-05-22T03:56:30.422Z] 	at Master.js,workspace://__EASE_ScriptArchive_1/scripts/Master.js
23:56:30 [2021-05-22T03:56:30.684Z] Tests run: 7, Failures: 0, Errors: 0, Skipped: 0, Time elapsed: 1.201 s - in org.eclipse.ease.lang.scriptarchive.ArchiveEngineTest
23:56:30 [2021-05-22T03:56:30.684Z] executeWithManifest  Time elapsed: 0.986 s
23:56:30 [2021-05-22T03:56:30.684Z] zipFileRegistration  Time elapsed: 0.013 s
23:56:30 [2021-05-22T03:56:30.684Z] engineIdRegistration  Time elapsed: 0 s
23:56:30 [2021-05-22T03:56:30.684Z] jarFileRegistration  Time elapsed: 0 s
23:56:30 [2021-05-22T03:56:30.684Z] sarFileRegistration  Time elapsed: 0.001 s
23:56:30 [2021-05-22T03:56:30.684Z] executeWithErrors  Time elapsed: 0.091 s
23:56:30 [2021-05-22T03:56:30.684Z] executeWithIncludes  Time elapsed: 0.093 s
23:56:30 [2021-05-22T03:56:30.684Z] 
23:56:30 [2021-05-22T03:56:30.684Z] Results:
23:56:30 [2021-05-22T03:56:30.684Z] 
23:56:30 [2021-05-22T03:56:30.684Z] Tests run: 7, Failures: 0, Errors: 0, Skipped: 0
23:56:30 [2021-05-22T03:56:30.684Z] 
23:56:31 [2021-05-22T03:56:31.632Z] [INFO] All tests passed!
23:56:31 [2021-05-22T03:56:31.632Z] [INFO] 
23:56:31 [2021-05-22T03:56:31.632Z] [INFO] --- maven-pmd-plugin:3.14.0:pmd (pmd-integration) @ org.eclipse.ease.lang.scriptarchive.test ---
23:56:31 [2021-05-22T03:56:31.890Z] [INFO] 
23:56:31 [2021-05-22T03:56:31.890Z] [INFO] --- maven-pmd-plugin:3.14.0:cpd (pmd-integration) @ org.eclipse.ease.lang.scriptarchive.test ---
23:56:31 [2021-05-22T03:56:31.890Z] [INFO] 
23:56:31 [2021-05-22T03:56:31.890Z] [INFO] --- spotbugs-maven-plugin:4.1.4:spotbugs (spotbugs-integration) @ org.eclipse.ease.lang.scriptarchive.test ---
23:56:31 [2021-05-22T03:56:31.890Z] [INFO] Fork Value is false
23:56:31 [2021-05-22T03:56:31.890Z]      [java] JVM args ignored when same JVM is used.
23:56:36 [2021-05-22T03:56:36.112Z] [INFO] Done SpotBugs Analysis....
23:56:36 [2021-05-22T03:56:36.112Z] [INFO] 
23:56:36 [2021-05-22T03:56:36.112Z] [INFO] --- maven-checkstyle-plugin:3.1.1:check (checkstyle-integration) @ org.eclipse.ease.lang.scriptarchive.test ---
23:56:36 [2021-05-22T03:56:36.112Z] [INFO] You have 0 Checkstyle violations.
23:56:36 [2021-05-22T03:56:36.112Z] [INFO] 
23:56:36 [2021-05-22T03:56:36.113Z] [INFO] --- maven-install-plugin:2.3.1:install (default-install) @ org.eclipse.ease.lang.scriptarchive.test ---
23:56:36 [2021-05-22T03:56:36.113Z] [INFO] Installing /home/jenkins/agent/workspace/ease.verify.core.target.2018-12/tests/org.eclipse.ease.lang.scriptarchive.test/target/org.eclipse.ease.lang.scriptarchive.test-0.8.0-SNAPSHOT.jar to /home/jenkins/.m2/repository/org/eclipse/ease/org.eclipse.ease.lang.scriptarchive.test/0.8.0-SNAPSHOT/org.eclipse.ease.lang.scriptarchive.test-0.8.0-SNAPSHOT.jar
23:56:36 [2021-05-22T03:56:36.113Z] [INFO] Installing /home/jenkins/agent/workspace/ease.verify.core.target.2018-12/tests/org.eclipse.ease.lang.scriptarchive.test/pom.xml to /home/jenkins/.m2/repository/org/eclipse/ease/org.eclipse.ease.lang.scriptarchive.test/0.8.0-SNAPSHOT/org.eclipse.ease.lang.scriptarchive.test-0.8.0-SNAPSHOT.pom
23:56:36 [2021-05-22T03:56:36.113Z] [INFO] Installing /home/jenkins/agent/workspace/ease.verify.core.target.2018-12/tests/org.eclipse.ease.lang.scriptarchive.test/target/p2content.xml to /home/jenkins/.m2/repository/org/eclipse/ease/org.eclipse.ease.lang.scriptarchive.test/0.8.0-SNAPSHOT/org.eclipse.ease.lang.scriptarchive.test-0.8.0-SNAPSHOT-p2metadata.xml
23:56:36 [2021-05-22T03:56:36.113Z] [INFO] Installing /home/jenkins/agent/workspace/ease.verify.core.target.2018-12/tests/org.eclipse.ease.lang.scriptarchive.test/target/p2artifacts.xml to /home/jenkins/.m2/repository/org/eclipse/ease/org.eclipse.ease.lang.scriptarchive.test/0.8.0-SNAPSHOT/org.eclipse.ease.lang.scriptarchive.test-0.8.0-SNAPSHOT-p2artifacts.xml
23:56:36 [2021-05-22T03:56:36.113Z] [INFO] 
23:56:36 [2021-05-22T03:56:36.113Z] [INFO] --- tycho-p2-plugin:2.2.0:update-local-index (default-update-local-index) @ org.eclipse.ease.lang.scriptarchive.test ---
23:56:36 [2021-05-22T03:56:36.113Z] [INFO] 
23:56:36 [2021-05-22T03:56:36.113Z] [INFO] --------< org.eclipse.ease:org.eclipse.ease.lang.unittest.test >--------
23:56:36 [2021-05-22T03:56:36.113Z] [INFO] Building org.eclipse.ease.lang.unittest.test 0.8.0-SNAPSHOT      [44/48]
23:56:36 [2021-05-22T03:56:36.113Z] [INFO] ------------------------[ eclipse-test-plugin ]-------------------------
23:56:36 [2021-05-22T03:56:36.113Z] [INFO] 
23:56:36 [2021-05-22T03:56:36.113Z] [INFO] --- maven-clean-plugin:2.5:clean (default-clean) @ org.eclipse.ease.lang.unittest.test ---
23:56:36 [2021-05-22T03:56:36.113Z] [INFO] 
23:56:36 [2021-05-22T03:56:36.113Z] [INFO] --- tycho-packaging-plugin:2.2.0:build-qualifier (default-build-qualifier) @ org.eclipse.ease.lang.unittest.test ---
23:56:36 [2021-05-22T03:56:36.113Z] [INFO] The project's OSGi version is 0.8.0.I202104091518
23:56:36 [2021-05-22T03:56:36.113Z] [INFO] 
23:56:36 [2021-05-22T03:56:36.113Z] [INFO] --- tycho-packaging-plugin:2.2.0:validate-id (default-validate-id) @ org.eclipse.ease.lang.unittest.test ---
23:56:36 [2021-05-22T03:56:36.113Z] [INFO] 
23:56:36 [2021-05-22T03:56:36.113Z] [INFO] --- tycho-packaging-plugin:2.2.0:validate-version (default-validate-version) @ org.eclipse.ease.lang.unittest.test ---
23:56:36 [2021-05-22T03:56:36.113Z] [INFO] 
23:56:36 [2021-05-22T03:56:36.113Z] [INFO] --- maven-resources-plugin:2.4.3:resources (default-resources) @ org.eclipse.ease.lang.unittest.test ---
23:56:36 [2021-05-22T03:56:36.113Z] [INFO] Using 'UTF-8' encoding to copy filtered resources.
23:56:36 [2021-05-22T03:56:36.113Z] [INFO] skip non existing resourceDirectory /home/jenkins/agent/workspace/ease.verify.core.target.2018-12/tests/org.eclipse.ease.lang.unittest.test/src/main/resources
23:56:36 [2021-05-22T03:56:36.113Z] [INFO] 
23:56:36 [2021-05-22T03:56:36.113Z] [INFO] --- tycho-compiler-plugin:2.2.0:compile (default-compile) @ org.eclipse.ease.lang.unittest.test ---
23:56:36 [2021-05-22T03:56:36.113Z] [INFO] Compiling 3 source files to /home/jenkins/agent/workspace/ease.verify.core.target.2018-12/tests/org.eclipse.ease.lang.unittest.test/target/classes
23:56:36 [2021-05-22T03:56:36.113Z] [INFO] 
23:56:36 [2021-05-22T03:56:36.113Z] [INFO] --- maven-resources-plugin:2.4.3:testResources (default-testResources) @ org.eclipse.ease.lang.unittest.test ---
23:56:36 [2021-05-22T03:56:36.113Z] [INFO] Using 'UTF-8' encoding to copy filtered resources.
23:56:36 [2021-05-22T03:56:36.113Z] [INFO] skip non existing resourceDirectory /home/jenkins/agent/workspace/ease.verify.core.target.2018-12/tests/org.eclipse.ease.lang.unittest.test/src/test/resources
23:56:36 [2021-05-22T03:56:36.113Z] [INFO] 
23:56:36 [2021-05-22T03:56:36.113Z] [INFO] --- target-platform-configuration:2.2.0:target-platform (default-target-platform) @ org.eclipse.ease.lang.unittest.test ---
23:56:36 [2021-05-22T03:56:36.113Z] [INFO] 
23:56:36 [2021-05-22T03:56:36.113Z] [INFO] --- tycho-packaging-plugin:2.2.0:package-plugin (default-package-plugin) @ org.eclipse.ease.lang.unittest.test ---
23:56:36 [2021-05-22T03:56:36.113Z] [INFO] Building jar: /home/jenkins/agent/workspace/ease.verify.core.target.2018-12/tests/org.eclipse.ease.lang.unittest.test/target/org.eclipse.ease.lang.unittest.test-0.8.0-SNAPSHOT.jar
23:56:36 [2021-05-22T03:56:36.113Z] [INFO] 
23:56:36 [2021-05-22T03:56:36.114Z] [INFO] --- tycho-p2-plugin:2.2.0:p2-metadata-default (default-p2-metadata-default) @ org.eclipse.ease.lang.unittest.test ---
23:56:36 [2021-05-22T03:56:36.114Z] [INFO] 
23:56:36 [2021-05-22T03:56:36.114Z] [INFO] --- tycho-surefire-plugin:2.2.0:test (default-test) @ org.eclipse.ease.lang.unittest.test ---
23:56:36 [2021-05-22T03:56:36.114Z] [INFO] Executing Test Runtime with timeout 0, logs (if any) will be placed at: /home/jenkins/agent/workspace/ease.verify.core.target.2018-12/tests/org.eclipse.ease.lang.unittest.test/target/work/data/.metadata/.log
23:56:36 [2021-05-22T03:56:36.114Z] [INFO] Command line:
23:56:36 [2021-05-22T03:56:36.114Z] 	[/opt/tools/java/openjdk/jdk-15/15.0.2+7/bin/java, -Dosgi.noShutdown=false, -Dosgi.os=linux, -Dosgi.ws=gtk, -Dosgi.arch=x86_64, -Dosgi.clean=true, -jar, /home/jenkins/.m2/repository/p2/osgi/bundle/org.eclipse.equinox.launcher/1.6.0.v20200915-1508/org.eclipse.equinox.launcher-1.6.0.v20200915-1508.jar, -data, /home/jenkins/agent/workspace/ease.verify.core.target.2018-12/tests/org.eclipse.ease.lang.unittest.test/target/work/data, -install, /home/jenkins/agent/workspace/ease.verify.core.target.2018-12/tests/org.eclipse.ease.lang.unittest.test/target/work, -configuration, /home/jenkins/agent/workspace/ease.verify.core.target.2018-12/tests/org.eclipse.ease.lang.unittest.test/target/work/configuration, -application, org.eclipse.tycho.surefire.osgibooter.headlesstest, -testproperties, /home/jenkins/agent/workspace/ease.verify.core.target.2018-12/tests/org.eclipse.ease.lang.unittest.test/target/surefire.properties]
23:56:36 [2021-05-22T03:56:36.114Z] Picked up JAVA_TOOL_OPTIONS: -Dmaven.ext.class.path="/home/jenkins/agent/workspace/ease.verify.core.target.2018-12@tmp/withMaven20d5a577/pipeline-maven-spy.jar" -Dorg.jenkinsci.plugins.pipeline.maven.reportsFolder="/home/jenkins/agent/workspace/ease.verify.core.target.2018-12@tmp/withMaven20d5a577" 
23:56:38 [2021-05-22T03:56:38.656Z] May 22, 2021 3:56:38 AM org.junit.platform.launcher.core.DefaultLauncher handleThrowable
23:56:38 [2021-05-22T03:56:38.657Z] WARNING: TestEngine with ID 'junit-vintage' failed to discover tests
23:56:38 [2021-05-22T03:56:38.657Z] java.lang.NoClassDefFoundError: org/junit/runners/model/RunnerBuilder
23:56:38 [2021-05-22T03:56:38.657Z] 	at org.junit.vintage.engine.discovery.VintageDiscoverer.<init>(VintageDiscoverer.java:48)
23:56:38 [2021-05-22T03:56:38.657Z] 	at org.junit.vintage.engine.VintageTestEngine.discover(VintageTestEngine.java:65)
23:56:38 [2021-05-22T03:56:38.657Z] 	at org.junit.platform.launcher.core.DefaultLauncher.discoverEngineRoot(DefaultLauncher.java:130)
23:56:38 [2021-05-22T03:56:38.657Z] 	at org.junit.platform.launcher.core.DefaultLauncher.discoverRoot(DefaultLauncher.java:117)
23:56:38 [2021-05-22T03:56:38.657Z] 	at org.junit.platform.launcher.core.DefaultLauncher.discover(DefaultLauncher.java:82)
23:56:38 [2021-05-22T03:56:38.657Z] 	at org.apache.maven.surefire.junitplatform.TestPlanScannerFilter.accept(TestPlanScannerFilter.java:56)
23:56:38 [2021-05-22T03:56:38.657Z] 	at org.apache.maven.surefire.util.DefaultScanResult.applyFilter(DefaultScanResult.java:102)
23:56:38 [2021-05-22T03:56:38.657Z] 	at org.apache.maven.surefire.junitplatform.JUnitPlatformProvider.scanClasspath(JUnitPlatformProvider.java:143)
23:56:38 [2021-05-22T03:56:38.657Z] 	at org.apache.maven.surefire.junitplatform.JUnitPlatformProvider.invoke(JUnitPlatformProvider.java:124)
23:56:38 [2021-05-22T03:56:38.657Z] 	at java.base/jdk.internal.reflect.NativeMethodAccessorImpl.invoke0(Native Method)
23:56:38 [2021-05-22T03:56:38.657Z] 	at java.base/jdk.internal.reflect.NativeMethodAccessorImpl.invoke(NativeMethodAccessorImpl.java:64)
23:56:38 [2021-05-22T03:56:38.657Z] 	at java.base/jdk.internal.reflect.DelegatingMethodAccessorImpl.invoke(DelegatingMethodAccessorImpl.java:43)
23:56:38 [2021-05-22T03:56:38.657Z] 	at java.base/java.lang.reflect.Method.invoke(Method.java:564)
23:56:38 [2021-05-22T03:56:38.657Z] 	at org.apache.maven.surefire.util.ReflectionUtils.invokeMethodWithArray2(ReflectionUtils.java:206)
23:56:38 [2021-05-22T03:56:38.657Z] 	at org.apache.maven.surefire.booter.ProviderFactory$ProviderProxy.invoke(ProviderFactory.java:161)
23:56:38 [2021-05-22T03:56:38.657Z] 	at org.apache.maven.surefire.booter.ProviderFactory.invokeProvider(ProviderFactory.java:84)
23:56:38 [2021-05-22T03:56:38.657Z] 	at org.eclipse.tycho.surefire.osgibooter.OsgiSurefireBooter.run(OsgiSurefireBooter.java:116)
23:56:38 [2021-05-22T03:56:38.657Z] 	at org.eclipse.tycho.surefire.osgibooter.HeadlessTestApplication.start(HeadlessTestApplication.java:23)
23:56:38 [2021-05-22T03:56:38.657Z] 	at org.eclipse.equinox.internal.app.EclipseAppHandle.run(EclipseAppHandle.java:203)
23:56:38 [2021-05-22T03:56:38.657Z] 	at org.eclipse.core.runtime.internal.adaptor.EclipseAppLauncher.runApplication(EclipseAppLauncher.java:134)
23:56:38 [2021-05-22T03:56:38.657Z] 	at org.eclipse.core.runtime.internal.adaptor.EclipseAppLauncher.start(EclipseAppLauncher.java:104)
23:56:38 [2021-05-22T03:56:38.657Z] 	at org.eclipse.core.runtime.adaptor.EclipseStarter.run(EclipseStarter.java:401)
23:56:38 [2021-05-22T03:56:38.657Z] 	at org.eclipse.core.runtime.adaptor.EclipseStarter.run(EclipseStarter.java:255)
23:56:38 [2021-05-22T03:56:38.657Z] 	at java.base/jdk.internal.reflect.NativeMethodAccessorImpl.invoke0(Native Method)
23:56:38 [2021-05-22T03:56:38.657Z] 	at java.base/jdk.internal.reflect.NativeMethodAccessorImpl.invoke(NativeMethodAccessorImpl.java:64)
23:56:38 [2021-05-22T03:56:38.657Z] 	at java.base/jdk.internal.reflect.DelegatingMethodAccessorImpl.invoke(DelegatingMethodAccessorImpl.java:43)
23:56:38 [2021-05-22T03:56:38.657Z] 	at java.base/java.lang.reflect.Method.invoke(Method.java:564)
23:56:38 [2021-05-22T03:56:38.657Z] 	at org.eclipse.equinox.launcher.Main.invokeFramework(Main.java:653)
23:56:38 [2021-05-22T03:56:38.657Z] 	at org.eclipse.equinox.launcher.Main.basicRun(Main.java:590)
23:56:38 [2021-05-22T03:56:38.657Z] 	at org.eclipse.equinox.launcher.Main.run(Main.java:1461)
23:56:38 [2021-05-22T03:56:38.657Z] 	at org.eclipse.equinox.launcher.Main.main(Main.java:1434)
23:56:38 [2021-05-22T03:56:38.657Z] Caused by: java.lang.ClassNotFoundException: org.junit.runners.model.RunnerBuilder cannot be found by org.eclipse.tycho.surefire.osgibooter_2.2.0
23:56:38 [2021-05-22T03:56:38.657Z] 	at org.eclipse.osgi.internal.loader.BundleLoader.findClass(BundleLoader.java:516)
23:56:38 [2021-05-22T03:56:38.657Z] 	at org.eclipse.osgi.internal.loader.ModuleClassLoader.loadClass(ModuleClassLoader.java:171)
23:56:38 [2021-05-22T03:56:38.657Z] 	at java.base/java.lang.ClassLoader.loadClass(ClassLoader.java:522)
23:56:38 [2021-05-22T03:56:38.657Z] 	... 31 more
23:56:38 [2021-05-22T03:56:38.657Z] 
23:56:38 [2021-05-22T03:56:38.657Z] May 22, 2021 3:56:38 AM org.junit.platform.launcher.core.DefaultLauncher handleThrowable
23:56:38 [2021-05-22T03:56:38.657Z] WARNING: TestEngine with ID 'junit-vintage' failed to discover tests
23:56:38 [2021-05-22T03:56:38.657Z] java.lang.NoClassDefFoundError: org/junit/runners/model/RunnerBuilder
23:56:38 [2021-05-22T03:56:38.657Z] 	at org.junit.vintage.engine.discovery.VintageDiscoverer.<init>(VintageDiscoverer.java:48)
23:56:38 [2021-05-22T03:56:38.657Z] 	at org.junit.vintage.engine.VintageTestEngine.discover(VintageTestEngine.java:65)
23:56:38 [2021-05-22T03:56:38.657Z] 	at org.junit.platform.launcher.core.DefaultLauncher.discoverEngineRoot(DefaultLauncher.java:130)
23:56:38 [2021-05-22T03:56:38.657Z] 	at org.junit.platform.launcher.core.DefaultLauncher.discoverRoot(DefaultLauncher.java:117)
23:56:38 [2021-05-22T03:56:38.657Z] 	at org.junit.platform.launcher.core.DefaultLauncher.discover(DefaultLauncher.java:82)
23:56:38 [2021-05-22T03:56:38.657Z] 	at org.apache.maven.surefire.junitplatform.TestPlanScannerFilter.accept(TestPlanScannerFilter.java:56)
23:56:38 [2021-05-22T03:56:38.657Z] 	at org.apache.maven.surefire.util.DefaultScanResult.applyFilter(DefaultScanResult.java:102)
23:56:38 [2021-05-22T03:56:38.657Z] 	at org.apache.maven.surefire.junitplatform.JUnitPlatformProvider.scanClasspath(JUnitPlatformProvider.java:143)
23:56:38 [2021-05-22T03:56:38.657Z] 	at org.apache.maven.surefire.junitplatform.JUnitPlatformProvider.invoke(JUnitPlatformProvider.java:124)
23:56:38 [2021-05-22T03:56:38.657Z] 	at java.base/jdk.internal.reflect.NativeMethodAccessorImpl.invoke0(Native Method)
23:56:38 [2021-05-22T03:56:38.657Z] 	at java.base/jdk.internal.reflect.NativeMethodAccessorImpl.invoke(NativeMethodAccessorImpl.java:64)
23:56:38 [2021-05-22T03:56:38.657Z] 	at java.base/jdk.internal.reflect.DelegatingMethodAccessorImpl.invoke(DelegatingMethodAccessorImpl.java:43)
23:56:38 [2021-05-22T03:56:38.657Z] 	at java.base/java.lang.reflect.Method.invoke(Method.java:564)
23:56:38 [2021-05-22T03:56:38.657Z] 	at org.apache.maven.surefire.util.ReflectionUtils.invokeMethodWithArray2(ReflectionUtils.java:206)
23:56:38 [2021-05-22T03:56:38.658Z] 	at org.apache.maven.surefire.booter.ProviderFactory$ProviderProxy.invoke(ProviderFactory.java:161)
23:56:38 [2021-05-22T03:56:38.658Z] 	at org.apache.maven.surefire.booter.ProviderFactory.invokeProvider(ProviderFactory.java:84)
23:56:38 [2021-05-22T03:56:38.658Z] 	at org.eclipse.tycho.surefire.osgibooter.OsgiSurefireBooter.run(OsgiSurefireBooter.java:116)
23:56:38 [2021-05-22T03:56:38.658Z] 	at org.eclipse.tycho.surefire.osgibooter.HeadlessTestApplication.start(HeadlessTestApplication.java:23)
23:56:38 [2021-05-22T03:56:38.658Z] 	at org.eclipse.equinox.internal.app.EclipseAppHandle.run(EclipseAppHandle.java:203)
23:56:38 [2021-05-22T03:56:38.658Z] 	at org.eclipse.core.runtime.internal.adaptor.EclipseAppLauncher.runApplication(EclipseAppLauncher.java:134)
23:56:38 [2021-05-22T03:56:38.658Z] 	at org.eclipse.core.runtime.internal.adaptor.EclipseAppLauncher.start(EclipseAppLauncher.java:104)
23:56:38 [2021-05-22T03:56:38.658Z] 	at org.eclipse.core.runtime.adaptor.EclipseStarter.run(EclipseStarter.java:401)
23:56:38 [2021-05-22T03:56:38.658Z] 	at org.eclipse.core.runtime.adaptor.EclipseStarter.run(EclipseStarter.java:255)
23:56:38 [2021-05-22T03:56:38.658Z] 	at java.base/jdk.internal.reflect.NativeMethodAccessorImpl.invoke0(Native Method)
23:56:38 [2021-05-22T03:56:38.658Z] 	at java.base/jdk.internal.reflect.NativeMethodAccessorImpl.invoke(NativeMethodAccessorImpl.java:64)
23:56:38 [2021-05-22T03:56:38.658Z] 	at java.base/jdk.internal.reflect.DelegatingMethodAccessorImpl.invoke(DelegatingMethodAccessorImpl.java:43)
23:56:38 [2021-05-22T03:56:38.658Z] 	at java.base/java.lang.reflect.Method.invoke(Method.java:564)
23:56:38 [2021-05-22T03:56:38.658Z] 	at org.eclipse.equinox.launcher.Main.invokeFramework(Main.java:653)
23:56:38 [2021-05-22T03:56:38.658Z] 	at org.eclipse.equinox.launcher.Main.basicRun(Main.java:590)
23:56:38 [2021-05-22T03:56:38.658Z] 	at org.eclipse.equinox.launcher.Main.run(Main.java:1461)
23:56:38 [2021-05-22T03:56:38.658Z] 	at org.eclipse.equinox.launcher.Main.main(Main.java:1434)
23:56:38 [2021-05-22T03:56:38.658Z] Caused by: java.lang.ClassNotFoundException: org.junit.runners.model.RunnerBuilder cannot be found by org.eclipse.tycho.surefire.osgibooter_2.2.0
23:56:38 [2021-05-22T03:56:38.658Z] 	at org.eclipse.osgi.internal.loader.BundleLoader.findClass(BundleLoader.java:516)
23:56:38 [2021-05-22T03:56:38.658Z] 	at org.eclipse.osgi.internal.loader.ModuleClassLoader.loadClass(ModuleClassLoader.java:171)
23:56:38 [2021-05-22T03:56:38.658Z] 	at java.base/java.lang.ClassLoader.loadClass(ClassLoader.java:522)
23:56:38 [2021-05-22T03:56:38.658Z] 	... 31 more
23:56:38 [2021-05-22T03:56:38.658Z] 
23:56:38 [2021-05-22T03:56:38.658Z] May 22, 2021 3:56:38 AM org.junit.platform.launcher.core.DefaultLauncher handleThrowable
23:56:38 [2021-05-22T03:56:38.658Z] WARNING: TestEngine with ID 'junit-vintage' failed to discover tests
23:56:38 [2021-05-22T03:56:38.658Z] java.lang.NoClassDefFoundError: org/junit/runners/model/RunnerBuilder
23:56:38 [2021-05-22T03:56:38.658Z] 	at org.junit.vintage.engine.discovery.VintageDiscoverer.<init>(VintageDiscoverer.java:48)
23:56:38 [2021-05-22T03:56:38.658Z] 	at org.junit.vintage.engine.VintageTestEngine.discover(VintageTestEngine.java:65)
23:56:38 [2021-05-22T03:56:38.658Z] 	at org.junit.platform.launcher.core.DefaultLauncher.discoverEngineRoot(DefaultLauncher.java:130)
23:56:38 [2021-05-22T03:56:38.658Z] 	at org.junit.platform.launcher.core.DefaultLauncher.discoverRoot(DefaultLauncher.java:117)
23:56:38 [2021-05-22T03:56:38.658Z] 	at org.junit.platform.launcher.core.DefaultLauncher.discover(DefaultLauncher.java:82)
23:56:38 [2021-05-22T03:56:38.658Z] 	at org.apache.maven.surefire.junitplatform.TestPlanScannerFilter.accept(TestPlanScannerFilter.java:56)
23:56:38 [2021-05-22T03:56:38.658Z] 	at org.apache.maven.surefire.util.DefaultScanResult.applyFilter(DefaultScanResult.java:102)
23:56:38 [2021-05-22T03:56:38.658Z] 	at org.apache.maven.surefire.junitplatform.JUnitPlatformProvider.scanClasspath(JUnitPlatformProvider.java:143)
23:56:38 [2021-05-22T03:56:38.658Z] 	at org.apache.maven.surefire.junitplatform.JUnitPlatformProvider.invoke(JUnitPlatformProvider.java:124)
23:56:38 [2021-05-22T03:56:38.658Z] 	at java.base/jdk.internal.reflect.NativeMethodAccessorImpl.invoke0(Native Method)
23:56:38 [2021-05-22T03:56:38.658Z] 	at java.base/jdk.internal.reflect.NativeMethodAccessorImpl.invoke(NativeMethodAccessorImpl.java:64)
23:56:38 [2021-05-22T03:56:38.658Z] 	at java.base/jdk.internal.reflect.DelegatingMethodAccessorImpl.invoke(DelegatingMethodAccessorImpl.java:43)
23:56:38 [2021-05-22T03:56:38.658Z] 	at java.base/java.lang.reflect.Method.invoke(Method.java:564)
23:56:38 [2021-05-22T03:56:38.658Z] 	at org.apache.maven.surefire.util.ReflectionUtils.invokeMethodWithArray2(ReflectionUtils.java:206)
23:56:38 [2021-05-22T03:56:38.658Z] 	at org.apache.maven.surefire.booter.ProviderFactory$ProviderProxy.invoke(ProviderFactory.java:161)
23:56:38 [2021-05-22T03:56:38.658Z] 	at org.apache.maven.surefire.booter.ProviderFactory.invokeProvider(ProviderFactory.java:84)
23:56:38 [2021-05-22T03:56:38.658Z] 	at org.eclipse.tycho.surefire.osgibooter.OsgiSurefireBooter.run(OsgiSurefireBooter.java:116)
23:56:38 [2021-05-22T03:56:38.658Z] 	at org.eclipse.tycho.surefire.osgibooter.HeadlessTestApplication.start(HeadlessTestApplication.java:23)
23:56:38 [2021-05-22T03:56:38.658Z] 	at org.eclipse.equinox.internal.app.EclipseAppHandle.run(EclipseAppHandle.java:203)
23:56:38 [2021-05-22T03:56:38.658Z] 	at org.eclipse.core.runtime.internal.adaptor.EclipseAppLauncher.runApplication(EclipseAppLauncher.java:134)
23:56:38 [2021-05-22T03:56:38.658Z] 	at org.eclipse.core.runtime.internal.adaptor.EclipseAppLauncher.start(EclipseAppLauncher.java:104)
23:56:38 [2021-05-22T03:56:38.658Z] 	at org.eclipse.core.runtime.adaptor.EclipseStarter.run(EclipseStarter.java:401)
23:56:38 [2021-05-22T03:56:38.658Z] 	at org.eclipse.core.runtime.adaptor.EclipseStarter.run(EclipseStarter.java:255)
23:56:38 [2021-05-22T03:56:38.658Z] 	at java.base/jdk.internal.reflect.NativeMethodAccessorImpl.invoke0(Native Method)
23:56:38 [2021-05-22T03:56:38.658Z] 	at java.base/jdk.internal.reflect.NativeMethodAccessorImpl.invoke(NativeMethodAccessorImpl.java:64)
23:56:38 [2021-05-22T03:56:38.658Z] 	at java.base/jdk.internal.reflect.DelegatingMethodAccessorImpl.invoke(DelegatingMethodAccessorImpl.java:43)
23:56:38 [2021-05-22T03:56:38.658Z] 	at java.base/java.lang.reflect.Method.invoke(Method.java:564)
23:56:38 [2021-05-22T03:56:38.658Z] 	at org.eclipse.equinox.launcher.Main.invokeFramework(Main.java:653)
23:56:38 [2021-05-22T03:56:38.658Z] 	at org.eclipse.equinox.launcher.Main.basicRun(Main.java:590)
23:56:38 [2021-05-22T03:56:38.658Z] 	at org.eclipse.equinox.launcher.Main.run(Main.java:1461)
23:56:38 [2021-05-22T03:56:38.658Z] 	at org.eclipse.equinox.launcher.Main.main(Main.java:1434)
23:56:38 [2021-05-22T03:56:38.658Z] Caused by: java.lang.ClassNotFoundException: org.junit.runners.model.RunnerBuilder cannot be found by org.eclipse.tycho.surefire.osgibooter_2.2.0
23:56:38 [2021-05-22T03:56:38.658Z] 	at org.eclipse.osgi.internal.loader.BundleLoader.findClass(BundleLoader.java:516)
23:56:38 [2021-05-22T03:56:38.658Z] 	at org.eclipse.osgi.internal.loader.ModuleClassLoader.loadClass(ModuleClassLoader.java:171)
23:56:38 [2021-05-22T03:56:38.658Z] 	at java.base/java.lang.ClassLoader.loadClass(ClassLoader.java:522)
23:56:38 [2021-05-22T03:56:38.658Z] 	... 31 more
23:56:38 [2021-05-22T03:56:38.658Z] 
23:56:38 [2021-05-22T03:56:38.658Z] May 22, 2021 3:56:38 AM org.junit.platform.launcher.core.DefaultLauncher handleThrowable
23:56:38 [2021-05-22T03:56:38.659Z] WARNING: TestEngine with ID 'junit-vintage' failed to discover tests
23:56:38 [2021-05-22T03:56:38.659Z] java.lang.NoClassDefFoundError: org/junit/runners/model/RunnerBuilder
23:56:38 [2021-05-22T03:56:38.659Z] 	at org.junit.vintage.engine.discovery.VintageDiscoverer.<init>(VintageDiscoverer.java:48)
23:56:38 [2021-05-22T03:56:38.659Z] 	at org.junit.vintage.engine.VintageTestEngine.discover(VintageTestEngine.java:65)
23:56:38 [2021-05-22T03:56:38.659Z] 	at org.junit.platform.launcher.core.DefaultLauncher.discoverEngineRoot(DefaultLauncher.java:130)
23:56:38 [2021-05-22T03:56:38.659Z] 	at org.junit.platform.launcher.core.DefaultLauncher.discoverRoot(DefaultLauncher.java:117)
23:56:38 [2021-05-22T03:56:38.659Z] 	at org.junit.platform.launcher.core.DefaultLauncher.execute(DefaultLauncher.java:90)
23:56:38 [2021-05-22T03:56:38.659Z] 	at org.apache.maven.surefire.junitplatform.JUnitPlatformProvider.invokeAllTests(JUnitPlatformProvider.java:150)
23:56:38 [2021-05-22T03:56:38.659Z] 	at org.apache.maven.surefire.junitplatform.JUnitPlatformProvider.invoke(JUnitPlatformProvider.java:124)
23:56:38 [2021-05-22T03:56:38.659Z] 	at java.base/jdk.internal.reflect.NativeMethodAccessorImpl.invoke0(Native Method)
23:56:38 [2021-05-22T03:56:38.659Z] 	at java.base/jdk.internal.reflect.NativeMethodAccessorImpl.invoke(NativeMethodAccessorImpl.java:64)
23:56:38 [2021-05-22T03:56:38.659Z] 	at java.base/jdk.internal.reflect.DelegatingMethodAccessorImpl.invoke(DelegatingMethodAccessorImpl.java:43)
23:56:38 [2021-05-22T03:56:38.659Z] 	at java.base/java.lang.reflect.Method.invoke(Method.java:564)
23:56:38 [2021-05-22T03:56:38.659Z] 	at org.apache.maven.surefire.util.ReflectionUtils.invokeMethodWithArray2(ReflectionUtils.java:206)
23:56:38 [2021-05-22T03:56:38.659Z] 	at org.apache.maven.surefire.booter.ProviderFactory$ProviderProxy.invoke(ProviderFactory.java:161)
23:56:38 [2021-05-22T03:56:38.659Z] 	at org.apache.maven.surefire.booter.ProviderFactory.invokeProvider(ProviderFactory.java:84)
23:56:38 [2021-05-22T03:56:38.659Z] 	at org.eclipse.tycho.surefire.osgibooter.OsgiSurefireBooter.run(OsgiSurefireBooter.java:116)
23:56:38 [2021-05-22T03:56:38.659Z] 	at org.eclipse.tycho.surefire.osgibooter.HeadlessTestApplication.start(HeadlessTestApplication.java:23)
23:56:38 [2021-05-22T03:56:38.659Z] 	at org.eclipse.equinox.internal.app.EclipseAppHandle.run(EclipseAppHandle.java:203)
23:56:38 [2021-05-22T03:56:38.659Z] 	at org.eclipse.core.runtime.internal.adaptor.EclipseAppLauncher.runApplication(EclipseAppLauncher.java:134)
23:56:38 [2021-05-22T03:56:38.659Z] 	at org.eclipse.core.runtime.internal.adaptor.EclipseAppLauncher.start(EclipseAppLauncher.java:104)
23:56:38 [2021-05-22T03:56:38.659Z] 	at org.eclipse.core.runtime.adaptor.EclipseStarter.run(EclipseStarter.java:401)
23:56:38 [2021-05-22T03:56:38.659Z] 	at org.eclipse.core.runtime.adaptor.EclipseStarter.run(EclipseStarter.java:255)
23:56:38 [2021-05-22T03:56:38.659Z] 	at java.base/jdk.internal.reflect.NativeMethodAccessorImpl.invoke0(Native Method)
23:56:38 [2021-05-22T03:56:38.659Z] 	at java.base/jdk.internal.reflect.NativeMethodAccessorImpl.invoke(NativeMethodAccessorImpl.java:64)
23:56:38 [2021-05-22T03:56:38.659Z] 	at java.base/jdk.internal.reflect.DelegatingMethodAccessorImpl.invoke(DelegatingMethodAccessorImpl.java:43)
23:56:38 [2021-05-22T03:56:38.659Z] 	at java.base/java.lang.reflect.Method.invoke(Method.java:564)
23:56:38 [2021-05-22T03:56:38.659Z] 	at org.eclipse.equinox.launcher.Main.invokeFramework(Main.java:653)
23:56:38 [2021-05-22T03:56:38.659Z] 	at org.eclipse.equinox.launcher.Main.basicRun(Main.java:590)
23:56:38 [2021-05-22T03:56:38.659Z] 	at org.eclipse.equinox.launcher.Main.run(Main.java:1461)
23:56:38 [2021-05-22T03:56:38.659Z] 	at org.eclipse.equinox.launcher.Main.main(Main.java:1434)
23:56:38 [2021-05-22T03:56:38.659Z] Caused by: java.lang.ClassNotFoundException: org.junit.runners.model.RunnerBuilder cannot be found by org.eclipse.tycho.surefire.osgibooter_2.2.0
23:56:38 [2021-05-22T03:56:38.659Z] 	at org.eclipse.osgi.internal.loader.BundleLoader.findClass(BundleLoader.java:516)
23:56:38 [2021-05-22T03:56:38.659Z] 	at org.eclipse.osgi.internal.loader.ModuleClassLoader.loadClass(ModuleClassLoader.java:171)
23:56:38 [2021-05-22T03:56:38.659Z] 	at java.base/java.lang.ClassLoader.loadClass(ClassLoader.java:522)
23:56:38 [2021-05-22T03:56:38.659Z] 	... 29 more
23:56:38 [2021-05-22T03:56:38.659Z] 
23:56:38 [2021-05-22T03:56:38.659Z] Running org.eclipse.ease.lang.unittest.ModernJavaScriptTest
23:56:41 [2021-05-22T03:56:41.193Z] Tests run: 8, Failures: 0, Errors: 0, Skipped: 0, Time elapsed: 2.337 s - in org.eclipse.ease.lang.unittest.ModernJavaScriptTest
23:56:41 [2021-05-22T03:56:41.194Z] folderStatus  Time elapsed: 0.958 s
23:56:41 [2021-05-22T03:56:41.194Z] verifyOutput  Time elapsed: 0.263 s
23:56:41 [2021-05-22T03:56:41.194Z] suiteStatus  Time elapsed: 0.261 s
23:56:41 [2021-05-22T03:56:41.194Z] ignoreTestStatus  Time elapsed: 0.224 s
23:56:41 [2021-05-22T03:56:41.194Z] ignoreTestClassStatus  Time elapsed: 0.16 s
23:56:41 [2021-05-22T03:56:41.194Z] failureTestClassStatus  Time elapsed: 0.131 s
23:56:41 [2021-05-22T03:56:41.194Z] errorTestClassStatus  Time elapsed: 0.12 s
23:56:41 [2021-05-22T03:56:41.194Z] passTestClassStatus  Time elapsed: 0.137 s
23:56:41 [2021-05-22T03:56:41.194Z] Running org.eclipse.ease.lang.unittest.ClassicJavaScriptTest
23:56:41 [2021-05-22T03:56:41.759Z] Tests run: 7, Failures: 0, Errors: 0, Skipped: 0, Time elapsed: 0.604 s - in org.eclipse.ease.lang.unittest.ClassicJavaScriptTest
23:56:41 [2021-05-22T03:56:41.759Z] folderStatus  Time elapsed: 0.092 s
23:56:41 [2021-05-22T03:56:41.759Z] errorTestStatus  Time elapsed: 0.099 s
23:56:41 [2021-05-22T03:56:41.759Z] failureTestStatus  Time elapsed: 0.087 s
23:56:41 [2021-05-22T03:56:41.759Z] verifyOutput  Time elapsed: 0.071 s
23:56:41 [2021-05-22T03:56:41.759Z] suiteStatus  Time elapsed: 0.09 s
23:56:41 [2021-05-22T03:56:41.759Z] ignoreTestStatus  Time elapsed: 0.078 s
23:56:41 [2021-05-22T03:56:41.759Z] passTestStatus  Time elapsed: 0.083 s
23:56:41 [2021-05-22T03:56:41.759Z] 
23:56:41 [2021-05-22T03:56:41.759Z] Results:
23:56:41 [2021-05-22T03:56:41.759Z] 
23:56:41 [2021-05-22T03:56:41.759Z] Tests run: 15, Failures: 0, Errors: 0, Skipped: 0
23:56:41 [2021-05-22T03:56:41.759Z] 
23:56:42 [2021-05-22T03:56:42.692Z] [INFO] All tests passed!
23:56:42 [2021-05-22T03:56:42.692Z] [INFO] 
23:56:42 [2021-05-22T03:56:42.692Z] [INFO] --- maven-install-plugin:2.3.1:install (default-install) @ org.eclipse.ease.lang.unittest.test ---
23:56:42 [2021-05-22T03:56:42.692Z] [INFO] Installing /home/jenkins/agent/workspace/ease.verify.core.target.2018-12/tests/org.eclipse.ease.lang.unittest.test/target/org.eclipse.ease.lang.unittest.test-0.8.0-SNAPSHOT.jar to /home/jenkins/.m2/repository/org/eclipse/ease/org.eclipse.ease.lang.unittest.test/0.8.0-SNAPSHOT/org.eclipse.ease.lang.unittest.test-0.8.0-SNAPSHOT.jar
23:56:42 [2021-05-22T03:56:42.692Z] [INFO] Installing /home/jenkins/agent/workspace/ease.verify.core.target.2018-12/tests/org.eclipse.ease.lang.unittest.test/pom.xml to /home/jenkins/.m2/repository/org/eclipse/ease/org.eclipse.ease.lang.unittest.test/0.8.0-SNAPSHOT/org.eclipse.ease.lang.unittest.test-0.8.0-SNAPSHOT.pom
23:56:42 [2021-05-22T03:56:42.692Z] [INFO] Installing /home/jenkins/agent/workspace/ease.verify.core.target.2018-12/tests/org.eclipse.ease.lang.unittest.test/target/p2content.xml to /home/jenkins/.m2/repository/org/eclipse/ease/org.eclipse.ease.lang.unittest.test/0.8.0-SNAPSHOT/org.eclipse.ease.lang.unittest.test-0.8.0-SNAPSHOT-p2metadata.xml
23:56:42 [2021-05-22T03:56:42.692Z] [INFO] Installing /home/jenkins/agent/workspace/ease.verify.core.target.2018-12/tests/org.eclipse.ease.lang.unittest.test/target/p2artifacts.xml to /home/jenkins/.m2/repository/org/eclipse/ease/org.eclipse.ease.lang.unittest.test/0.8.0-SNAPSHOT/org.eclipse.ease.lang.unittest.test-0.8.0-SNAPSHOT-p2artifacts.xml
23:56:42 [2021-05-22T03:56:42.692Z] [INFO] 
23:56:42 [2021-05-22T03:56:42.692Z] [INFO] --- tycho-p2-plugin:2.2.0:update-local-index (default-update-local-index) @ org.eclipse.ease.lang.unittest.test ---
23:56:42 [2021-05-22T03:56:42.692Z] [INFO] 
23:56:42 [2021-05-22T03:56:42.692Z] [INFO] ---------< org.eclipse.ease:org.eclipse.ease.ui.scripts.test >----------
23:56:42 [2021-05-22T03:56:42.692Z] [INFO] Building org.eclipse.ease.ui.scripts.test 0.8.0-SNAPSHOT         [45/48]
23:56:42 [2021-05-22T03:56:42.692Z] [INFO] ------------------------[ eclipse-test-plugin ]-------------------------
23:56:42 [2021-05-22T03:56:42.692Z] [INFO] 
23:56:42 [2021-05-22T03:56:42.693Z] [INFO] --- maven-clean-plugin:2.5:clean (default-clean) @ org.eclipse.ease.ui.scripts.test ---
23:56:42 [2021-05-22T03:56:42.693Z] [INFO] 
23:56:42 [2021-05-22T03:56:42.693Z] [INFO] --- tycho-packaging-plugin:2.2.0:build-qualifier (default-build-qualifier) @ org.eclipse.ease.ui.scripts.test ---
23:56:42 [2021-05-22T03:56:42.693Z] [INFO] The project's OSGi version is 0.8.0.I202104091518
23:56:42 [2021-05-22T03:56:42.693Z] [INFO] 
23:56:42 [2021-05-22T03:56:42.693Z] [INFO] --- tycho-packaging-plugin:2.2.0:validate-id (default-validate-id) @ org.eclipse.ease.ui.scripts.test ---
23:56:42 [2021-05-22T03:56:42.693Z] [INFO] 
23:56:42 [2021-05-22T03:56:42.693Z] [INFO] --- tycho-packaging-plugin:2.2.0:validate-version (default-validate-version) @ org.eclipse.ease.ui.scripts.test ---
23:56:42 [2021-05-22T03:56:42.693Z] [INFO] 
23:56:42 [2021-05-22T03:56:42.693Z] [INFO] --- maven-resources-plugin:2.4.3:resources (default-resources) @ org.eclipse.ease.ui.scripts.test ---
23:56:42 [2021-05-22T03:56:42.693Z] [INFO] Using 'UTF-8' encoding to copy filtered resources.
23:56:42 [2021-05-22T03:56:42.693Z] [INFO] skip non existing resourceDirectory /home/jenkins/agent/workspace/ease.verify.core.target.2018-12/tests/org.eclipse.ease.ui.scripts.test/src/main/resources
23:56:42 [2021-05-22T03:56:42.693Z] [INFO] 
23:56:42 [2021-05-22T03:56:42.693Z] [INFO] --- tycho-compiler-plugin:2.2.0:compile (default-compile) @ org.eclipse.ease.ui.scripts.test ---
23:56:42 [2021-05-22T03:56:42.693Z] [INFO] Compiling 1 source file to /home/jenkins/agent/workspace/ease.verify.core.target.2018-12/tests/org.eclipse.ease.ui.scripts.test/target/classes
23:56:42 [2021-05-22T03:56:42.693Z] [INFO] 
23:56:42 [2021-05-22T03:56:42.693Z] [INFO] --- maven-resources-plugin:2.4.3:testResources (default-testResources) @ org.eclipse.ease.ui.scripts.test ---
23:56:42 [2021-05-22T03:56:42.693Z] [INFO] Using 'UTF-8' encoding to copy filtered resources.
23:56:42 [2021-05-22T03:56:42.693Z] [INFO] skip non existing resourceDirectory /home/jenkins/agent/workspace/ease.verify.core.target.2018-12/tests/org.eclipse.ease.ui.scripts.test/src/test/resources
23:56:42 [2021-05-22T03:56:42.693Z] [INFO] 
23:56:42 [2021-05-22T03:56:42.693Z] [INFO] --- target-platform-configuration:2.2.0:target-platform (default-target-platform) @ org.eclipse.ease.ui.scripts.test ---
23:56:42 [2021-05-22T03:56:42.693Z] [INFO] 
23:56:42 [2021-05-22T03:56:42.693Z] [INFO] --- tycho-packaging-plugin:2.2.0:package-plugin (default-package-plugin) @ org.eclipse.ease.ui.scripts.test ---
23:56:42 [2021-05-22T03:56:42.693Z] [INFO] Building jar: /home/jenkins/agent/workspace/ease.verify.core.target.2018-12/tests/org.eclipse.ease.ui.scripts.test/target/org.eclipse.ease.ui.scripts.test-0.8.0-SNAPSHOT.jar
23:56:42 [2021-05-22T03:56:42.693Z] [INFO] 
23:56:42 [2021-05-22T03:56:42.693Z] [INFO] --- tycho-p2-plugin:2.2.0:p2-metadata-default (default-p2-metadata-default) @ org.eclipse.ease.ui.scripts.test ---
23:56:42 [2021-05-22T03:56:42.693Z] [INFO] 
23:56:42 [2021-05-22T03:56:42.693Z] [INFO] --- jacoco-maven-plugin:0.8.6:prepare-agent (jacoco-initialize) @ org.eclipse.ease.ui.scripts.test ---
23:56:42 [2021-05-22T03:56:42.693Z] [INFO] tycho.testArgLine set to -javaagent:/home/jenkins/.m2/repository/org/jacoco/org.jacoco.agent/0.8.6/org.jacoco.agent-0.8.6-runtime.jar=destfile=/home/jenkins/agent/workspace/ease.verify.core.target.2018-12/tests/org.eclipse.ease.ui.scripts.test/target/jacoco.exec,output=file
23:56:42 [2021-05-22T03:56:42.693Z] [INFO] 
23:56:42 [2021-05-22T03:56:42.693Z] [INFO] --- tycho-surefire-plugin:2.2.0:test (default-test) @ org.eclipse.ease.ui.scripts.test ---
23:56:42 [2021-05-22T03:56:42.985Z] [INFO] Executing Test Runtime with timeout 0, logs (if any) will be placed at: /home/jenkins/agent/workspace/ease.verify.core.target.2018-12/tests/org.eclipse.ease.ui.scripts.test/target/work/data/.metadata/.log
23:56:42 [2021-05-22T03:56:42.985Z] [INFO] Command line:
23:56:42 [2021-05-22T03:56:42.985Z] 	[/opt/tools/java/openjdk/jdk-15/15.0.2+7/bin/java, -Dosgi.noShutdown=false, -Dosgi.os=linux, -Dosgi.ws=gtk, -Dosgi.arch=x86_64, -javaagent:/home/jenkins/.m2/repository/org/jacoco/org.jacoco.agent/0.8.6/org.jacoco.agent-0.8.6-runtime.jar=destfile=/home/jenkins/agent/workspace/ease.verify.core.target.2018-12/tests/org.eclipse.ease.ui.scripts.test/target/jacoco.exec,output=file, -Dosgi.clean=true, -jar, /home/jenkins/.m2/repository/p2/osgi/bundle/org.eclipse.equinox.launcher/1.6.0.v20200915-1508/org.eclipse.equinox.launcher-1.6.0.v20200915-1508.jar, -data, /home/jenkins/agent/workspace/ease.verify.core.target.2018-12/tests/org.eclipse.ease.ui.scripts.test/target/work/data, -install, /home/jenkins/agent/workspace/ease.verify.core.target.2018-12/tests/org.eclipse.ease.ui.scripts.test/target/work, -configuration, /home/jenkins/agent/workspace/ease.verify.core.target.2018-12/tests/org.eclipse.ease.ui.scripts.test/target/work/configuration, -application, org.eclipse.tycho.surefire.osgibooter.headlesstest, -testproperties, /home/jenkins/agent/workspace/ease.verify.core.target.2018-12/tests/org.eclipse.ease.ui.scripts.test/target/surefire.properties]
23:56:42 [2021-05-22T03:56:42.985Z] Picked up JAVA_TOOL_OPTIONS: -Dmaven.ext.class.path="/home/jenkins/agent/workspace/ease.verify.core.target.2018-12@tmp/withMaven20d5a577/pipeline-maven-spy.jar" -Dorg.jenkinsci.plugins.pipeline.maven.reportsFolder="/home/jenkins/agent/workspace/ease.verify.core.target.2018-12@tmp/withMaven20d5a577" 
23:56:47 [2021-05-22T03:56:47.182Z] May 22, 2021 3:56:46 AM org.junit.platform.launcher.core.DefaultLauncher handleThrowable
23:56:47 [2021-05-22T03:56:47.182Z] WARNING: TestEngine with ID 'junit-vintage' failed to discover tests
23:56:47 [2021-05-22T03:56:47.182Z] java.lang.NoClassDefFoundError: org/junit/runners/model/RunnerBuilder
23:56:47 [2021-05-22T03:56:47.182Z] 	at org.junit.vintage.engine.discovery.VintageDiscoverer.<init>(VintageDiscoverer.java:48)
23:56:47 [2021-05-22T03:56:47.182Z] 	at org.junit.vintage.engine.VintageTestEngine.discover(VintageTestEngine.java:65)
23:56:47 [2021-05-22T03:56:47.182Z] 	at org.junit.platform.launcher.core.DefaultLauncher.discoverEngineRoot(DefaultLauncher.java:130)
23:56:47 [2021-05-22T03:56:47.182Z] 	at org.junit.platform.launcher.core.DefaultLauncher.discoverRoot(DefaultLauncher.java:117)
23:56:47 [2021-05-22T03:56:47.182Z] 	at org.junit.platform.launcher.core.DefaultLauncher.discover(DefaultLauncher.java:82)
23:56:47 [2021-05-22T03:56:47.182Z] 	at org.apache.maven.surefire.junitplatform.TestPlanScannerFilter.accept(TestPlanScannerFilter.java:56)
23:56:47 [2021-05-22T03:56:47.182Z] 	at org.apache.maven.surefire.util.DefaultScanResult.applyFilter(DefaultScanResult.java:102)
23:56:47 [2021-05-22T03:56:47.182Z] 	at org.apache.maven.surefire.junitplatform.JUnitPlatformProvider.scanClasspath(JUnitPlatformProvider.java:143)
23:56:47 [2021-05-22T03:56:47.182Z] 	at org.apache.maven.surefire.junitplatform.JUnitPlatformProvider.invoke(JUnitPlatformProvider.java:124)
23:56:47 [2021-05-22T03:56:47.182Z] 	at java.base/jdk.internal.reflect.NativeMethodAccessorImpl.invoke0(Native Method)
23:56:47 [2021-05-22T03:56:47.182Z] 	at java.base/jdk.internal.reflect.NativeMethodAccessorImpl.invoke(NativeMethodAccessorImpl.java:64)
23:56:47 [2021-05-22T03:56:47.182Z] 	at java.base/jdk.internal.reflect.DelegatingMethodAccessorImpl.invoke(DelegatingMethodAccessorImpl.java:43)
23:56:47 [2021-05-22T03:56:47.182Z] 	at java.base/java.lang.reflect.Method.invoke(Method.java:564)
23:56:47 [2021-05-22T03:56:47.182Z] 	at org.apache.maven.surefire.util.ReflectionUtils.invokeMethodWithArray2(ReflectionUtils.java:206)
23:56:47 [2021-05-22T03:56:47.182Z] 	at org.apache.maven.surefire.booter.ProviderFactory$ProviderProxy.invoke(ProviderFactory.java:161)
23:56:47 [2021-05-22T03:56:47.182Z] 	at org.apache.maven.surefire.booter.ProviderFactory.invokeProvider(ProviderFactory.java:84)
23:56:47 [2021-05-22T03:56:47.182Z] 	at org.eclipse.tycho.surefire.osgibooter.OsgiSurefireBooter.run(OsgiSurefireBooter.java:116)
23:56:47 [2021-05-22T03:56:47.182Z] 	at org.eclipse.tycho.surefire.osgibooter.HeadlessTestApplication.start(HeadlessTestApplication.java:23)
23:56:47 [2021-05-22T03:56:47.182Z] 	at org.eclipse.equinox.internal.app.EclipseAppHandle.run(EclipseAppHandle.java:203)
23:56:47 [2021-05-22T03:56:47.183Z] 	at org.eclipse.core.runtime.internal.adaptor.EclipseAppLauncher.runApplication(EclipseAppLauncher.java:134)
23:56:47 [2021-05-22T03:56:47.183Z] 	at org.eclipse.core.runtime.internal.adaptor.EclipseAppLauncher.start(EclipseAppLauncher.java:104)
23:56:47 [2021-05-22T03:56:47.183Z] 	at org.eclipse.core.runtime.adaptor.EclipseStarter.run(EclipseStarter.java:401)
23:56:47 [2021-05-22T03:56:47.183Z] 	at org.eclipse.core.runtime.adaptor.EclipseStarter.run(EclipseStarter.java:255)
23:56:47 [2021-05-22T03:56:47.183Z] 	at java.base/jdk.internal.reflect.NativeMethodAccessorImpl.invoke0(Native Method)
23:56:47 [2021-05-22T03:56:47.183Z] 	at java.base/jdk.internal.reflect.NativeMethodAccessorImpl.invoke(NativeMethodAccessorImpl.java:64)
23:56:47 [2021-05-22T03:56:47.183Z] 	at java.base/jdk.internal.reflect.DelegatingMethodAccessorImpl.invoke(DelegatingMethodAccessorImpl.java:43)
23:56:47 [2021-05-22T03:56:47.183Z] 	at java.base/java.lang.reflect.Method.invoke(Method.java:564)
23:56:47 [2021-05-22T03:56:47.183Z] 	at org.eclipse.equinox.launcher.Main.invokeFramework(Main.java:653)
23:56:47 [2021-05-22T03:56:47.183Z] 	at org.eclipse.equinox.launcher.Main.basicRun(Main.java:590)
23:56:47 [2021-05-22T03:56:47.183Z] 	at org.eclipse.equinox.launcher.Main.run(Main.java:1461)
23:56:47 [2021-05-22T03:56:47.183Z] 	at org.eclipse.equinox.launcher.Main.main(Main.java:1434)
23:56:47 [2021-05-22T03:56:47.183Z] Caused by: java.lang.ClassNotFoundException: org.junit.runners.model.RunnerBuilder cannot be found by org.eclipse.tycho.surefire.osgibooter_2.2.0
23:56:47 [2021-05-22T03:56:47.183Z] 	at org.eclipse.osgi.internal.loader.BundleLoader.findClass(BundleLoader.java:516)
23:56:47 [2021-05-22T03:56:47.183Z] 	at org.eclipse.osgi.internal.loader.ModuleClassLoader.loadClass(ModuleClassLoader.java:171)
23:56:47 [2021-05-22T03:56:47.183Z] 	at java.base/java.lang.ClassLoader.loadClass(ClassLoader.java:522)
23:56:47 [2021-05-22T03:56:47.183Z] 	... 31 more
23:56:47 [2021-05-22T03:56:47.183Z] 
23:56:47 [2021-05-22T03:56:47.183Z] May 22, 2021 3:56:46 AM org.junit.platform.launcher.core.DefaultLauncher handleThrowable
23:56:47 [2021-05-22T03:56:47.183Z] WARNING: TestEngine with ID 'junit-vintage' failed to discover tests
23:56:47 [2021-05-22T03:56:47.183Z] java.lang.NoClassDefFoundError: org/junit/runners/model/RunnerBuilder
23:56:47 [2021-05-22T03:56:47.183Z] 	at org.junit.vintage.engine.discovery.VintageDiscoverer.<init>(VintageDiscoverer.java:48)
23:56:47 [2021-05-22T03:56:47.183Z] 	at org.junit.vintage.engine.VintageTestEngine.discover(VintageTestEngine.java:65)
23:56:47 [2021-05-22T03:56:47.183Z] 	at org.junit.platform.launcher.core.DefaultLauncher.discoverEngineRoot(DefaultLauncher.java:130)
23:56:47 [2021-05-22T03:56:47.183Z] 	at org.junit.platform.launcher.core.DefaultLauncher.discoverRoot(DefaultLauncher.java:117)
23:56:47 [2021-05-22T03:56:47.183Z] 	at org.junit.platform.launcher.core.DefaultLauncher.execute(DefaultLauncher.java:90)
23:56:47 [2021-05-22T03:56:47.183Z] 	at org.apache.maven.surefire.junitplatform.JUnitPlatformProvider.invokeAllTests(JUnitPlatformProvider.java:150)
23:56:47 [2021-05-22T03:56:47.183Z] 	at org.apache.maven.surefire.junitplatform.JUnitPlatformProvider.invoke(JUnitPlatformProvider.java:124)
23:56:47 [2021-05-22T03:56:47.183Z] 	at java.base/jdk.internal.reflect.NativeMethodAccessorImpl.invoke0(Native Method)
23:56:47 [2021-05-22T03:56:47.183Z] 	at java.base/jdk.internal.reflect.NativeMethodAccessorImpl.invoke(NativeMethodAccessorImpl.java:64)
23:56:47 [2021-05-22T03:56:47.183Z] 	at java.base/jdk.internal.reflect.DelegatingMethodAccessorImpl.invoke(DelegatingMethodAccessorImpl.java:43)
23:56:47 [2021-05-22T03:56:47.183Z] 	at java.base/java.lang.reflect.Method.invoke(Method.java:564)
23:56:47 [2021-05-22T03:56:47.183Z] 	at org.apache.maven.surefire.util.ReflectionUtils.invokeMethodWithArray2(ReflectionUtils.java:206)
23:56:47 [2021-05-22T03:56:47.183Z] 	at org.apache.maven.surefire.booter.ProviderFactory$ProviderProxy.invoke(ProviderFactory.java:161)
23:56:47 [2021-05-22T03:56:47.183Z] 	at org.apache.maven.surefire.booter.ProviderFactory.invokeProvider(ProviderFactory.java:84)
23:56:47 [2021-05-22T03:56:47.183Z] 	at org.eclipse.tycho.surefire.osgibooter.OsgiSurefireBooter.run(OsgiSurefireBooter.java:116)
23:56:47 [2021-05-22T03:56:47.183Z] 	at org.eclipse.tycho.surefire.osgibooter.HeadlessTestApplication.start(HeadlessTestApplication.java:23)
23:56:47 [2021-05-22T03:56:47.183Z] 	at org.eclipse.equinox.internal.app.EclipseAppHandle.run(EclipseAppHandle.java:203)
23:56:47 [2021-05-22T03:56:47.183Z] 	at org.eclipse.core.runtime.internal.adaptor.EclipseAppLauncher.runApplication(EclipseAppLauncher.java:134)
23:56:47 [2021-05-22T03:56:47.183Z] 	at org.eclipse.core.runtime.internal.adaptor.EclipseAppLauncher.start(EclipseAppLauncher.java:104)
23:56:47 [2021-05-22T03:56:47.183Z] 	at org.eclipse.core.runtime.adaptor.EclipseStarter.run(EclipseStarter.java:401)
23:56:47 [2021-05-22T03:56:47.183Z] 	at org.eclipse.core.runtime.adaptor.EclipseStarter.run(EclipseStarter.java:255)
23:56:47 [2021-05-22T03:56:47.183Z] 	at java.base/jdk.internal.reflect.NativeMethodAccessorImpl.invoke0(Native Method)
23:56:47 [2021-05-22T03:56:47.183Z] 	at java.base/jdk.internal.reflect.NativeMethodAccessorImpl.invoke(NativeMethodAccessorImpl.java:64)
23:56:47 [2021-05-22T03:56:47.183Z] 	at java.base/jdk.internal.reflect.DelegatingMethodAccessorImpl.invoke(DelegatingMethodAccessorImpl.java:43)
23:56:47 [2021-05-22T03:56:47.183Z] 	at java.base/java.lang.reflect.Method.invoke(Method.java:564)
23:56:47 [2021-05-22T03:56:47.183Z] 	at org.eclipse.equinox.launcher.Main.invokeFramework(Main.java:653)
23:56:47 [2021-05-22T03:56:47.183Z] 	at org.eclipse.equinox.launcher.Main.basicRun(Main.java:590)
23:56:47 [2021-05-22T03:56:47.183Z] 	at org.eclipse.equinox.launcher.Main.run(Main.java:1461)
23:56:47 [2021-05-22T03:56:47.183Z] 	at org.eclipse.equinox.launcher.Main.main(Main.java:1434)
23:56:47 [2021-05-22T03:56:47.183Z] Caused by: java.lang.ClassNotFoundException: org.junit.runners.model.RunnerBuilder cannot be found by org.eclipse.tycho.surefire.osgibooter_2.2.0
23:56:47 [2021-05-22T03:56:47.183Z] 	at org.eclipse.osgi.internal.loader.BundleLoader.findClass(BundleLoader.java:516)
23:56:47 [2021-05-22T03:56:47.183Z] 	at org.eclipse.osgi.internal.loader.ModuleClassLoader.loadClass(ModuleClassLoader.java:171)
23:56:47 [2021-05-22T03:56:47.183Z] 	at java.base/java.lang.ClassLoader.loadClass(ClassLoader.java:522)
23:56:47 [2021-05-22T03:56:47.183Z] 	... 29 more
23:56:47 [2021-05-22T03:56:47.183Z] 
23:56:47 [2021-05-22T03:56:47.183Z] Running org.eclipse.ease.ui.scripts.expressions.definitions.ExpressionFactoryTest
23:56:47 [2021-05-22T03:56:47.183Z] Tests run: 14, Failures: 0, Errors: 0, Skipped: 0, Time elapsed: 0.048 s - in org.eclipse.ease.ui.scripts.expressions.definitions.ExpressionFactoryTest
23:56:47 [2021-05-22T03:56:47.183Z] loadClassWithExpression  Time elapsed: 0.018 s
23:56:47 [2021-05-22T03:56:47.183Z] createWithExpression  Time elapsed: 0.001 s
23:56:47 [2021-05-22T03:56:47.183Z] createReferenceExpression  Time elapsed: 0.001 s
23:56:47 [2021-05-22T03:56:47.184Z] loadClassReferenceExpression  Time elapsed: 0.001 s
23:56:47 [2021-05-22T03:56:47.184Z] loadClassTestExpression  Time elapsed: 0.002 s
23:56:47 [2021-05-22T03:56:47.184Z] createEqualsExpression  Time elapsed: 0.001 s
23:56:47 [2021-05-22T03:56:47.184Z] loadClassCountExpression  Time elapsed: 0.001 s
23:56:47 [2021-05-22T03:56:47.184Z] loadClassOrExpression  Time elapsed: 0.001 s
23:56:47 [2021-05-22T03:56:47.184Z] createTestExpression  Time elapsed: 0.004 s
23:56:47 [2021-05-22T03:56:47.184Z] createOrExpression  Time elapsed: 0.002 s
23:56:47 [2021-05-22T03:56:47.184Z] loadClassAndExpression  Time elapsed: 0.001 s
23:56:47 [2021-05-22T03:56:47.184Z] createAndExpression  Time elapsed: 0.001 s
23:56:47 [2021-05-22T03:56:47.184Z] loadClassEqualsExpression  Time elapsed: 0 s
23:56:47 [2021-05-22T03:56:47.184Z] createCountExpression  Time elapsed: 0.001 s
23:56:47 [2021-05-22T03:56:47.184Z] 
23:56:47 [2021-05-22T03:56:47.184Z] Results:
23:56:47 [2021-05-22T03:56:47.184Z] 
23:56:47 [2021-05-22T03:56:47.184Z] Tests run: 14, Failures: 0, Errors: 0, Skipped: 0
23:56:47 [2021-05-22T03:56:47.184Z] 
23:56:48 [2021-05-22T03:56:48.556Z] [INFO] All tests passed!
23:56:48 [2021-05-22T03:56:48.556Z] [INFO] 
23:56:48 [2021-05-22T03:56:48.556Z] [INFO] --- maven-pmd-plugin:3.14.0:pmd (pmd-integration) @ org.eclipse.ease.ui.scripts.test ---
23:56:48 [2021-05-22T03:56:48.556Z] [INFO] 
23:56:48 [2021-05-22T03:56:48.556Z] [INFO] --- maven-pmd-plugin:3.14.0:cpd (pmd-integration) @ org.eclipse.ease.ui.scripts.test ---
23:56:48 [2021-05-22T03:56:48.830Z] [INFO] 
23:56:48 [2021-05-22T03:56:48.830Z] [INFO] --- spotbugs-maven-plugin:4.1.4:spotbugs (spotbugs-integration) @ org.eclipse.ease.ui.scripts.test ---
23:56:48 [2021-05-22T03:56:48.830Z] [INFO] Fork Value is false
23:56:48 [2021-05-22T03:56:48.830Z]      [java] JVM args ignored when same JVM is used.
23:56:51 [2021-05-22T03:56:51.392Z] [INFO] Done SpotBugs Analysis....
23:56:51 [2021-05-22T03:56:51.392Z] [INFO] 
23:56:51 [2021-05-22T03:56:51.392Z] [INFO] --- maven-checkstyle-plugin:3.1.1:check (checkstyle-integration) @ org.eclipse.ease.ui.scripts.test ---
23:56:51 [2021-05-22T03:56:51.392Z] [INFO] You have 0 Checkstyle violations.
23:56:51 [2021-05-22T03:56:51.392Z] [INFO] 
23:56:51 [2021-05-22T03:56:51.392Z] [INFO] --- maven-install-plugin:2.3.1:install (default-install) @ org.eclipse.ease.ui.scripts.test ---
23:56:51 [2021-05-22T03:56:51.392Z] [INFO] Installing /home/jenkins/agent/workspace/ease.verify.core.target.2018-12/tests/org.eclipse.ease.ui.scripts.test/target/org.eclipse.ease.ui.scripts.test-0.8.0-SNAPSHOT.jar to /home/jenkins/.m2/repository/org/eclipse/ease/org.eclipse.ease.ui.scripts.test/0.8.0-SNAPSHOT/org.eclipse.ease.ui.scripts.test-0.8.0-SNAPSHOT.jar
23:56:51 [2021-05-22T03:56:51.392Z] [INFO] Installing /home/jenkins/agent/workspace/ease.verify.core.target.2018-12/tests/org.eclipse.ease.ui.scripts.test/pom.xml to /home/jenkins/.m2/repository/org/eclipse/ease/org.eclipse.ease.ui.scripts.test/0.8.0-SNAPSHOT/org.eclipse.ease.ui.scripts.test-0.8.0-SNAPSHOT.pom
23:56:51 [2021-05-22T03:56:51.392Z] [INFO] Installing /home/jenkins/agent/workspace/ease.verify.core.target.2018-12/tests/org.eclipse.ease.ui.scripts.test/target/p2content.xml to /home/jenkins/.m2/repository/org/eclipse/ease/org.eclipse.ease.ui.scripts.test/0.8.0-SNAPSHOT/org.eclipse.ease.ui.scripts.test-0.8.0-SNAPSHOT-p2metadata.xml
23:56:51 [2021-05-22T03:56:51.393Z] [INFO] Installing /home/jenkins/agent/workspace/ease.verify.core.target.2018-12/tests/org.eclipse.ease.ui.scripts.test/target/p2artifacts.xml to /home/jenkins/.m2/repository/org/eclipse/ease/org.eclipse.ease.ui.scripts.test/0.8.0-SNAPSHOT/org.eclipse.ease.ui.scripts.test-0.8.0-SNAPSHOT-p2artifacts.xml
23:56:51 [2021-05-22T03:56:51.393Z] [INFO] 
23:56:51 [2021-05-22T03:56:51.393Z] [INFO] --- tycho-p2-plugin:2.2.0:update-local-index (default-update-local-index) @ org.eclipse.ease.ui.scripts.test ---
23:56:51 [2021-05-22T03:56:51.393Z] [INFO] 
23:56:51 [2021-05-22T03:56:51.393Z] [INFO] -------------< org.eclipse.ease:org.eclipse.ease.ui.test >--------------
23:56:51 [2021-05-22T03:56:51.393Z] [INFO] Building org.eclipse.ease.ui.test 0.8.0-SNAPSHOT                 [46/48]
23:56:51 [2021-05-22T03:56:51.393Z] [INFO] ------------------------[ eclipse-test-plugin ]-------------------------
23:56:51 [2021-05-22T03:56:51.393Z] [INFO] 
23:56:51 [2021-05-22T03:56:51.393Z] [INFO] --- maven-clean-plugin:2.5:clean (default-clean) @ org.eclipse.ease.ui.test ---
23:56:51 [2021-05-22T03:56:51.393Z] [INFO] 
23:56:51 [2021-05-22T03:56:51.393Z] [INFO] --- tycho-packaging-plugin:2.2.0:build-qualifier (default-build-qualifier) @ org.eclipse.ease.ui.test ---
23:56:51 [2021-05-22T03:56:51.393Z] [INFO] The project's OSGi version is 0.8.0.I202104091518
23:56:51 [2021-05-22T03:56:51.393Z] [INFO] 
23:56:51 [2021-05-22T03:56:51.393Z] [INFO] --- tycho-packaging-plugin:2.2.0:validate-id (default-validate-id) @ org.eclipse.ease.ui.test ---
23:56:51 [2021-05-22T03:56:51.393Z] [INFO] 
23:56:51 [2021-05-22T03:56:51.393Z] [INFO] --- tycho-packaging-plugin:2.2.0:validate-version (default-validate-version) @ org.eclipse.ease.ui.test ---
23:56:51 [2021-05-22T03:56:51.393Z] [INFO] 
23:56:51 [2021-05-22T03:56:51.393Z] [INFO] --- maven-resources-plugin:2.4.3:resources (default-resources) @ org.eclipse.ease.ui.test ---
23:56:51 [2021-05-22T03:56:51.393Z] [INFO] Using 'UTF-8' encoding to copy filtered resources.
23:56:51 [2021-05-22T03:56:51.393Z] [INFO] skip non existing resourceDirectory /home/jenkins/agent/workspace/ease.verify.core.target.2018-12/tests/org.eclipse.ease.ui.test/src/main/resources
23:56:51 [2021-05-22T03:56:51.393Z] [INFO] 
23:56:51 [2021-05-22T03:56:51.393Z] [INFO] --- tycho-compiler-plugin:2.2.0:compile (default-compile) @ org.eclipse.ease.ui.test ---
23:56:51 [2021-05-22T03:56:51.393Z] [INFO] Compiling 13 source files to /home/jenkins/agent/workspace/ease.verify.core.target.2018-12/tests/org.eclipse.ease.ui.test/target/classes
23:56:51 [2021-05-22T03:56:51.651Z] [INFO] 
23:56:51 [2021-05-22T03:56:51.651Z] [INFO] --- maven-resources-plugin:2.4.3:testResources (default-testResources) @ org.eclipse.ease.ui.test ---
23:56:51 [2021-05-22T03:56:51.651Z] [INFO] Using 'UTF-8' encoding to copy filtered resources.
23:56:51 [2021-05-22T03:56:51.651Z] [INFO] skip non existing resourceDirectory /home/jenkins/agent/workspace/ease.verify.core.target.2018-12/tests/org.eclipse.ease.ui.test/src/test/resources
23:56:51 [2021-05-22T03:56:51.651Z] [INFO] 
23:56:51 [2021-05-22T03:56:51.651Z] [INFO] --- target-platform-configuration:2.2.0:target-platform (default-target-platform) @ org.eclipse.ease.ui.test ---
23:56:51 [2021-05-22T03:56:51.651Z] [INFO] 
23:56:51 [2021-05-22T03:56:51.651Z] [INFO] --- tycho-packaging-plugin:2.2.0:package-plugin (default-package-plugin) @ org.eclipse.ease.ui.test ---
23:56:51 [2021-05-22T03:56:51.651Z] [INFO] Building jar: /home/jenkins/agent/workspace/ease.verify.core.target.2018-12/tests/org.eclipse.ease.ui.test/target/org.eclipse.ease.ui.test-0.8.0-SNAPSHOT.jar
23:56:51 [2021-05-22T03:56:51.651Z] [INFO] 
23:56:51 [2021-05-22T03:56:51.651Z] [INFO] --- tycho-p2-plugin:2.2.0:p2-metadata-default (default-p2-metadata-default) @ org.eclipse.ease.ui.test ---
23:56:51 [2021-05-22T03:56:51.651Z] [INFO] 
23:56:51 [2021-05-22T03:56:51.651Z] [INFO] --- jacoco-maven-plugin:0.8.6:prepare-agent (jacoco-initialize) @ org.eclipse.ease.ui.test ---
23:56:51 [2021-05-22T03:56:51.651Z] [INFO] tycho.testArgLine set to -javaagent:/home/jenkins/.m2/repository/org/jacoco/org.jacoco.agent/0.8.6/org.jacoco.agent-0.8.6-runtime.jar=destfile=/home/jenkins/agent/workspace/ease.verify.core.target.2018-12/tests/org.eclipse.ease.ui.test/target/jacoco.exec,output=file
23:56:51 [2021-05-22T03:56:51.651Z] [INFO] 
23:56:51 [2021-05-22T03:56:51.651Z] [INFO] --- tycho-surefire-plugin:2.2.0:test (default-test) @ org.eclipse.ease.ui.test ---
23:56:51 [2021-05-22T03:56:51.651Z] [INFO] Executing Test Runtime with timeout 0, logs (if any) will be placed at: /home/jenkins/agent/workspace/ease.verify.core.target.2018-12/tests/org.eclipse.ease.ui.test/target/work/data/.metadata/.log
23:56:51 [2021-05-22T03:56:51.651Z] [INFO] Command line:
23:56:51 [2021-05-22T03:56:51.651Z] 	[/opt/tools/java/openjdk/jdk-15/15.0.2+7/bin/java, -Dosgi.noShutdown=false, -Dosgi.os=linux, -Dosgi.ws=gtk, -Dosgi.arch=x86_64, -javaagent:/home/jenkins/.m2/repository/org/jacoco/org.jacoco.agent/0.8.6/org.jacoco.agent-0.8.6-runtime.jar=destfile=/home/jenkins/agent/workspace/ease.verify.core.target.2018-12/tests/org.eclipse.ease.ui.test/target/jacoco.exec,output=file, -Dosgi.clean=true, -jar, /home/jenkins/.m2/repository/p2/osgi/bundle/org.eclipse.equinox.launcher/1.6.0.v20200915-1508/org.eclipse.equinox.launcher-1.6.0.v20200915-1508.jar, -data, /home/jenkins/agent/workspace/ease.verify.core.target.2018-12/tests/org.eclipse.ease.ui.test/target/work/data, -install, /home/jenkins/agent/workspace/ease.verify.core.target.2018-12/tests/org.eclipse.ease.ui.test/target/work, -configuration, /home/jenkins/agent/workspace/ease.verify.core.target.2018-12/tests/org.eclipse.ease.ui.test/target/work/configuration, -application, org.eclipse.tycho.surefire.osgibooter.headlesstest, -testproperties, /home/jenkins/agent/workspace/ease.verify.core.target.2018-12/tests/org.eclipse.ease.ui.test/target/surefire.properties]
23:56:51 [2021-05-22T03:56:51.651Z] Picked up JAVA_TOOL_OPTIONS: -Dmaven.ext.class.path="/home/jenkins/agent/workspace/ease.verify.core.target.2018-12@tmp/withMaven20d5a577/pipeline-maven-spy.jar" -Dorg.jenkinsci.plugins.pipeline.maven.reportsFolder="/home/jenkins/agent/workspace/ease.verify.core.target.2018-12@tmp/withMaven20d5a577" 
23:56:56 [2021-05-22T03:56:56.132Z] May 22, 2021 3:56:55 AM org.junit.platform.launcher.core.DefaultLauncher handleThrowable
23:56:56 [2021-05-22T03:56:56.132Z] WARNING: TestEngine with ID 'junit-vintage' failed to discover tests
23:56:56 [2021-05-22T03:56:56.132Z] java.lang.NoClassDefFoundError: org/junit/runners/model/RunnerBuilder
23:56:56 [2021-05-22T03:56:56.132Z] 	at org.junit.vintage.engine.discovery.VintageDiscoverer.<init>(VintageDiscoverer.java:48)
23:56:56 [2021-05-22T03:56:56.132Z] 	at org.junit.vintage.engine.VintageTestEngine.discover(VintageTestEngine.java:65)
23:56:56 [2021-05-22T03:56:56.132Z] 	at org.junit.platform.launcher.core.DefaultLauncher.discoverEngineRoot(DefaultLauncher.java:130)
23:56:56 [2021-05-22T03:56:56.132Z] 	at org.junit.platform.launcher.core.DefaultLauncher.discoverRoot(DefaultLauncher.java:117)
23:56:56 [2021-05-22T03:56:56.132Z] 	at org.junit.platform.launcher.core.DefaultLauncher.discover(DefaultLauncher.java:82)
23:56:56 [2021-05-22T03:56:56.132Z] 	at org.apache.maven.surefire.junitplatform.TestPlanScannerFilter.accept(TestPlanScannerFilter.java:56)
23:56:56 [2021-05-22T03:56:56.132Z] 	at org.apache.maven.surefire.util.DefaultScanResult.applyFilter(DefaultScanResult.java:102)
23:56:56 [2021-05-22T03:56:56.132Z] 	at org.apache.maven.surefire.junitplatform.JUnitPlatformProvider.scanClasspath(JUnitPlatformProvider.java:143)
23:56:56 [2021-05-22T03:56:56.132Z] 	at org.apache.maven.surefire.junitplatform.JUnitPlatformProvider.invoke(JUnitPlatformProvider.java:124)
23:56:56 [2021-05-22T03:56:56.132Z] 	at java.base/jdk.internal.reflect.NativeMethodAccessorImpl.invoke0(Native Method)
23:56:56 [2021-05-22T03:56:56.132Z] 	at java.base/jdk.internal.reflect.NativeMethodAccessorImpl.invoke(NativeMethodAccessorImpl.java:64)
23:56:56 [2021-05-22T03:56:56.132Z] 	at java.base/jdk.internal.reflect.DelegatingMethodAccessorImpl.invoke(DelegatingMethodAccessorImpl.java:43)
23:56:56 [2021-05-22T03:56:56.132Z] 	at java.base/java.lang.reflect.Method.invoke(Method.java:564)
23:56:56 [2021-05-22T03:56:56.132Z] 	at org.apache.maven.surefire.util.ReflectionUtils.invokeMethodWithArray2(ReflectionUtils.java:206)
23:56:56 [2021-05-22T03:56:56.132Z] 	at org.apache.maven.surefire.booter.ProviderFactory$ProviderProxy.invoke(ProviderFactory.java:161)
23:56:56 [2021-05-22T03:56:56.132Z] 	at org.apache.maven.surefire.booter.ProviderFactory.invokeProvider(ProviderFactory.java:84)
23:56:56 [2021-05-22T03:56:56.132Z] 	at org.eclipse.tycho.surefire.osgibooter.OsgiSurefireBooter.run(OsgiSurefireBooter.java:116)
23:56:56 [2021-05-22T03:56:56.132Z] 	at org.eclipse.tycho.surefire.osgibooter.HeadlessTestApplication.start(HeadlessTestApplication.java:23)
23:56:56 [2021-05-22T03:56:56.132Z] 	at org.eclipse.equinox.internal.app.EclipseAppHandle.run(EclipseAppHandle.java:203)
23:56:56 [2021-05-22T03:56:56.132Z] 	at org.eclipse.core.runtime.internal.adaptor.EclipseAppLauncher.runApplication(EclipseAppLauncher.java:134)
23:56:56 [2021-05-22T03:56:56.132Z] 	at org.eclipse.core.runtime.internal.adaptor.EclipseAppLauncher.start(EclipseAppLauncher.java:104)
23:56:56 [2021-05-22T03:56:56.132Z] 	at org.eclipse.core.runtime.adaptor.EclipseStarter.run(EclipseStarter.java:401)
23:56:56 [2021-05-22T03:56:56.132Z] 	at org.eclipse.core.runtime.adaptor.EclipseStarter.run(EclipseStarter.java:255)
23:56:56 [2021-05-22T03:56:56.132Z] 	at java.base/jdk.internal.reflect.NativeMethodAccessorImpl.invoke0(Native Method)
23:56:56 [2021-05-22T03:56:56.132Z] 	at java.base/jdk.internal.reflect.NativeMethodAccessorImpl.invoke(NativeMethodAccessorImpl.java:64)
23:56:56 [2021-05-22T03:56:56.132Z] 	at java.base/jdk.internal.reflect.DelegatingMethodAccessorImpl.invoke(DelegatingMethodAccessorImpl.java:43)
23:56:56 [2021-05-22T03:56:56.132Z] 	at java.base/java.lang.reflect.Method.invoke(Method.java:564)
23:56:56 [2021-05-22T03:56:56.132Z] 	at org.eclipse.equinox.launcher.Main.invokeFramework(Main.java:653)
23:56:56 [2021-05-22T03:56:56.132Z] 	at org.eclipse.equinox.launcher.Main.basicRun(Main.java:590)
23:56:56 [2021-05-22T03:56:56.132Z] 	at org.eclipse.equinox.launcher.Main.run(Main.java:1461)
23:56:56 [2021-05-22T03:56:56.132Z] 	at org.eclipse.equinox.launcher.Main.main(Main.java:1434)
23:56:56 [2021-05-22T03:56:56.132Z] Caused by: java.lang.ClassNotFoundException: org.junit.runners.model.RunnerBuilder cannot be found by org.eclipse.tycho.surefire.osgibooter_2.2.0
23:56:56 [2021-05-22T03:56:56.133Z] 	at org.eclipse.osgi.internal.loader.BundleLoader.findClass(BundleLoader.java:516)
23:56:56 [2021-05-22T03:56:56.133Z] 	at org.eclipse.osgi.internal.loader.ModuleClassLoader.loadClass(ModuleClassLoader.java:171)
23:56:56 [2021-05-22T03:56:56.133Z] 	at java.base/java.lang.ClassLoader.loadClass(ClassLoader.java:522)
23:56:56 [2021-05-22T03:56:56.133Z] 	... 31 more
23:56:56 [2021-05-22T03:56:56.133Z] 
23:56:56 [2021-05-22T03:56:56.133Z] May 22, 2021 3:56:56 AM org.junit.platform.launcher.core.DefaultLauncher handleThrowable
23:56:56 [2021-05-22T03:56:56.133Z] WARNING: TestEngine with ID 'junit-vintage' failed to discover tests
23:56:56 [2021-05-22T03:56:56.133Z] java.lang.NoClassDefFoundError: org/junit/runners/model/RunnerBuilder
23:56:56 [2021-05-22T03:56:56.133Z] 	at org.junit.vintage.engine.discovery.VintageDiscoverer.<init>(VintageDiscoverer.java:48)
23:56:56 [2021-05-22T03:56:56.133Z] 	at org.junit.vintage.engine.VintageTestEngine.discover(VintageTestEngine.java:65)
23:56:56 [2021-05-22T03:56:56.133Z] 	at org.junit.platform.launcher.core.DefaultLauncher.discoverEngineRoot(DefaultLauncher.java:130)
23:56:56 [2021-05-22T03:56:56.133Z] 	at org.junit.platform.launcher.core.DefaultLauncher.discoverRoot(DefaultLauncher.java:117)
23:56:56 [2021-05-22T03:56:56.133Z] 	at org.junit.platform.launcher.core.DefaultLauncher.discover(DefaultLauncher.java:82)
23:56:56 [2021-05-22T03:56:56.133Z] 	at org.apache.maven.surefire.junitplatform.TestPlanScannerFilter.accept(TestPlanScannerFilter.java:56)
23:56:56 [2021-05-22T03:56:56.133Z] 	at org.apache.maven.surefire.util.DefaultScanResult.applyFilter(DefaultScanResult.java:102)
23:56:56 [2021-05-22T03:56:56.133Z] 	at org.apache.maven.surefire.junitplatform.JUnitPlatformProvider.scanClasspath(JUnitPlatformProvider.java:143)
23:56:56 [2021-05-22T03:56:56.133Z] 	at org.apache.maven.surefire.junitplatform.JUnitPlatformProvider.invoke(JUnitPlatformProvider.java:124)
23:56:56 [2021-05-22T03:56:56.133Z] 	at java.base/jdk.internal.reflect.NativeMethodAccessorImpl.invoke0(Native Method)
23:56:56 [2021-05-22T03:56:56.133Z] 	at java.base/jdk.internal.reflect.NativeMethodAccessorImpl.invoke(NativeMethodAccessorImpl.java:64)
23:56:56 [2021-05-22T03:56:56.133Z] 	at java.base/jdk.internal.reflect.DelegatingMethodAccessorImpl.invoke(DelegatingMethodAccessorImpl.java:43)
23:56:56 [2021-05-22T03:56:56.133Z] 	at java.base/java.lang.reflect.Method.invoke(Method.java:564)
23:56:56 [2021-05-22T03:56:56.133Z] 	at org.apache.maven.surefire.util.ReflectionUtils.invokeMethodWithArray2(ReflectionUtils.java:206)
23:56:56 [2021-05-22T03:56:56.133Z] 	at org.apache.maven.surefire.booter.ProviderFactory$ProviderProxy.invoke(ProviderFactory.java:161)
23:56:56 [2021-05-22T03:56:56.133Z] 	at org.apache.maven.surefire.booter.ProviderFactory.invokeProvider(ProviderFactory.java:84)
23:56:56 [2021-05-22T03:56:56.133Z] 	at org.eclipse.tycho.surefire.osgibooter.OsgiSurefireBooter.run(OsgiSurefireBooter.java:116)
23:56:56 [2021-05-22T03:56:56.133Z] 	at org.eclipse.tycho.surefire.osgibooter.HeadlessTestApplication.start(HeadlessTestApplication.java:23)
23:56:56 [2021-05-22T03:56:56.133Z] 	at org.eclipse.equinox.internal.app.EclipseAppHandle.run(EclipseAppHandle.java:203)
23:56:56 [2021-05-22T03:56:56.133Z] 	at org.eclipse.core.runtime.internal.adaptor.EclipseAppLauncher.runApplication(EclipseAppLauncher.java:134)
23:56:56 [2021-05-22T03:56:56.133Z] 	at org.eclipse.core.runtime.internal.adaptor.EclipseAppLauncher.start(EclipseAppLauncher.java:104)
23:56:56 [2021-05-22T03:56:56.133Z] 	at org.eclipse.core.runtime.adaptor.EclipseStarter.run(EclipseStarter.java:401)
23:56:56 [2021-05-22T03:56:56.133Z] 	at org.eclipse.core.runtime.adaptor.EclipseStarter.run(EclipseStarter.java:255)
23:56:56 [2021-05-22T03:56:56.133Z] 	at java.base/jdk.internal.reflect.NativeMethodAccessorImpl.invoke0(Native Method)
23:56:56 [2021-05-22T03:56:56.133Z] 	at java.base/jdk.internal.reflect.NativeMethodAccessorImpl.invoke(NativeMethodAccessorImpl.java:64)
23:56:56 [2021-05-22T03:56:56.133Z] 	at java.base/jdk.internal.reflect.DelegatingMethodAccessorImpl.invoke(DelegatingMethodAccessorImpl.java:43)
23:56:56 [2021-05-22T03:56:56.133Z] 	at java.base/java.lang.reflect.Method.invoke(Method.java:564)
23:56:56 [2021-05-22T03:56:56.133Z] 	at org.eclipse.equinox.launcher.Main.invokeFramework(Main.java:653)
23:56:56 [2021-05-22T03:56:56.133Z] 	at org.eclipse.equinox.launcher.Main.basicRun(Main.java:590)
23:56:56 [2021-05-22T03:56:56.133Z] 	at org.eclipse.equinox.launcher.Main.run(Main.java:1461)
23:56:56 [2021-05-22T03:56:56.133Z] 	at org.eclipse.equinox.launcher.Main.main(Main.java:1434)
23:56:56 [2021-05-22T03:56:56.133Z] Caused by: java.lang.ClassNotFoundException: org.junit.runners.model.RunnerBuilder cannot be found by org.eclipse.tycho.surefire.osgibooter_2.2.0
23:56:56 [2021-05-22T03:56:56.133Z] 	at org.eclipse.osgi.internal.loader.BundleLoader.findClass(BundleLoader.java:516)
23:56:56 [2021-05-22T03:56:56.133Z] 	at org.eclipse.osgi.internal.loader.ModuleClassLoader.loadClass(ModuleClassLoader.java:171)
23:56:56 [2021-05-22T03:56:56.133Z] 	at java.base/java.lang.ClassLoader.loadClass(ClassLoader.java:522)
23:56:56 [2021-05-22T03:56:56.133Z] 	... 31 more
23:56:56 [2021-05-22T03:56:56.133Z] 
23:56:56 [2021-05-22T03:56:56.133Z] May 22, 2021 3:56:56 AM org.junit.platform.launcher.core.DefaultLauncher handleThrowable
23:56:56 [2021-05-22T03:56:56.133Z] WARNING: TestEngine with ID 'junit-vintage' failed to discover tests
23:56:56 [2021-05-22T03:56:56.133Z] java.lang.NoClassDefFoundError: org/junit/runners/model/RunnerBuilder
23:56:56 [2021-05-22T03:56:56.133Z] 	at org.junit.vintage.engine.discovery.VintageDiscoverer.<init>(VintageDiscoverer.java:48)
23:56:56 [2021-05-22T03:56:56.133Z] 	at org.junit.vintage.engine.VintageTestEngine.discover(VintageTestEngine.java:65)
23:56:56 [2021-05-22T03:56:56.133Z] 	at org.junit.platform.launcher.core.DefaultLauncher.discoverEngineRoot(DefaultLauncher.java:130)
23:56:56 [2021-05-22T03:56:56.133Z] 	at org.junit.platform.launcher.core.DefaultLauncher.discoverRoot(DefaultLauncher.java:117)
23:56:56 [2021-05-22T03:56:56.133Z] 	at org.junit.platform.launcher.core.DefaultLauncher.discover(DefaultLauncher.java:82)
23:56:56 [2021-05-22T03:56:56.133Z] 	at org.apache.maven.surefire.junitplatform.TestPlanScannerFilter.accept(TestPlanScannerFilter.java:56)
23:56:56 [2021-05-22T03:56:56.133Z] 	at org.apache.maven.surefire.util.DefaultScanResult.applyFilter(DefaultScanResult.java:102)
23:56:56 [2021-05-22T03:56:56.133Z] 	at org.apache.maven.surefire.junitplatform.JUnitPlatformProvider.scanClasspath(JUnitPlatformProvider.java:143)
23:56:56 [2021-05-22T03:56:56.133Z] 	at org.apache.maven.surefire.junitplatform.JUnitPlatformProvider.invoke(JUnitPlatformProvider.java:124)
23:56:56 [2021-05-22T03:56:56.133Z] 	at java.base/jdk.internal.reflect.NativeMethodAccessorImpl.invoke0(Native Method)
23:56:56 [2021-05-22T03:56:56.133Z] 	at java.base/jdk.internal.reflect.NativeMethodAccessorImpl.invoke(NativeMethodAccessorImpl.java:64)
23:56:56 [2021-05-22T03:56:56.133Z] 	at java.base/jdk.internal.reflect.DelegatingMethodAccessorImpl.invoke(DelegatingMethodAccessorImpl.java:43)
23:56:56 [2021-05-22T03:56:56.133Z] 	at java.base/java.lang.reflect.Method.invoke(Method.java:564)
23:56:56 [2021-05-22T03:56:56.134Z] 	at org.apache.maven.surefire.util.ReflectionUtils.invokeMethodWithArray2(ReflectionUtils.java:206)
23:56:56 [2021-05-22T03:56:56.134Z] 	at org.apache.maven.surefire.booter.ProviderFactory$ProviderProxy.invoke(ProviderFactory.java:161)
23:56:56 [2021-05-22T03:56:56.134Z] 	at org.apache.maven.surefire.booter.ProviderFactory.invokeProvider(ProviderFactory.java:84)
23:56:56 [2021-05-22T03:56:56.134Z] 	at org.eclipse.tycho.surefire.osgibooter.OsgiSurefireBooter.run(OsgiSurefireBooter.java:116)
23:56:56 [2021-05-22T03:56:56.134Z] 	at org.eclipse.tycho.surefire.osgibooter.HeadlessTestApplication.start(HeadlessTestApplication.java:23)
23:56:56 [2021-05-22T03:56:56.134Z] 	at org.eclipse.equinox.internal.app.EclipseAppHandle.run(EclipseAppHandle.java:203)
23:56:56 [2021-05-22T03:56:56.134Z] 	at org.eclipse.core.runtime.internal.adaptor.EclipseAppLauncher.runApplication(EclipseAppLauncher.java:134)
23:56:56 [2021-05-22T03:56:56.134Z] 	at org.eclipse.core.runtime.internal.adaptor.EclipseAppLauncher.start(EclipseAppLauncher.java:104)
23:56:56 [2021-05-22T03:56:56.134Z] 	at org.eclipse.core.runtime.adaptor.EclipseStarter.run(EclipseStarter.java:401)
23:56:56 [2021-05-22T03:56:56.134Z] 	at org.eclipse.core.runtime.adaptor.EclipseStarter.run(EclipseStarter.java:255)
23:56:56 [2021-05-22T03:56:56.134Z] 	at java.base/jdk.internal.reflect.NativeMethodAccessorImpl.invoke0(Native Method)
23:56:56 [2021-05-22T03:56:56.134Z] 	at java.base/jdk.internal.reflect.NativeMethodAccessorImpl.invoke(NativeMethodAccessorImpl.java:64)
23:56:56 [2021-05-22T03:56:56.134Z] 	at java.base/jdk.internal.reflect.DelegatingMethodAccessorImpl.invoke(DelegatingMethodAccessorImpl.java:43)
23:56:56 [2021-05-22T03:56:56.134Z] 	at java.base/java.lang.reflect.Method.invoke(Method.java:564)
23:56:56 [2021-05-22T03:56:56.134Z] 	at org.eclipse.equinox.launcher.Main.invokeFramework(Main.java:653)
23:56:56 [2021-05-22T03:56:56.134Z] 	at org.eclipse.equinox.launcher.Main.basicRun(Main.java:590)
23:56:56 [2021-05-22T03:56:56.134Z] 	at org.eclipse.equinox.launcher.Main.run(Main.java:1461)
23:56:56 [2021-05-22T03:56:56.134Z] 	at org.eclipse.equinox.launcher.Main.main(Main.java:1434)
23:56:56 [2021-05-22T03:56:56.134Z] Caused by: java.lang.ClassNotFoundException: org.junit.runners.model.RunnerBuilder cannot be found by org.eclipse.tycho.surefire.osgibooter_2.2.0
23:56:56 [2021-05-22T03:56:56.134Z] 	at org.eclipse.osgi.internal.loader.BundleLoader.findClass(BundleLoader.java:516)
23:56:56 [2021-05-22T03:56:56.134Z] 	at org.eclipse.osgi.internal.loader.ModuleClassLoader.loadClass(ModuleClassLoader.java:171)
23:56:56 [2021-05-22T03:56:56.134Z] 	at java.base/java.lang.ClassLoader.loadClass(ClassLoader.java:522)
23:56:56 [2021-05-22T03:56:56.134Z] 	... 31 more
23:56:56 [2021-05-22T03:56:56.134Z] 
23:56:56 [2021-05-22T03:56:56.134Z] May 22, 2021 3:56:56 AM org.junit.platform.launcher.core.DefaultLauncher handleThrowable
23:56:56 [2021-05-22T03:56:56.134Z] WARNING: TestEngine with ID 'junit-vintage' failed to discover tests
23:56:56 [2021-05-22T03:56:56.134Z] java.lang.NoClassDefFoundError: org/junit/runners/model/RunnerBuilder
23:56:56 [2021-05-22T03:56:56.134Z] 	at org.junit.vintage.engine.discovery.VintageDiscoverer.<init>(VintageDiscoverer.java:48)
23:56:56 [2021-05-22T03:56:56.134Z] 	at org.junit.vintage.engine.VintageTestEngine.discover(VintageTestEngine.java:65)
23:56:56 [2021-05-22T03:56:56.134Z] 	at org.junit.platform.launcher.core.DefaultLauncher.discoverEngineRoot(DefaultLauncher.java:130)
23:56:56 [2021-05-22T03:56:56.134Z] 	at org.junit.platform.launcher.core.DefaultLauncher.discoverRoot(DefaultLauncher.java:117)
23:56:56 [2021-05-22T03:56:56.134Z] 	at org.junit.platform.launcher.core.DefaultLauncher.discover(DefaultLauncher.java:82)
23:56:56 [2021-05-22T03:56:56.134Z] 	at org.apache.maven.surefire.junitplatform.TestPlanScannerFilter.accept(TestPlanScannerFilter.java:56)
23:56:56 [2021-05-22T03:56:56.134Z] 	at org.apache.maven.surefire.util.DefaultScanResult.applyFilter(DefaultScanResult.java:102)
23:56:56 [2021-05-22T03:56:56.134Z] 	at org.apache.maven.surefire.junitplatform.JUnitPlatformProvider.scanClasspath(JUnitPlatformProvider.java:143)
23:56:56 [2021-05-22T03:56:56.134Z] 	at org.apache.maven.surefire.junitplatform.JUnitPlatformProvider.invoke(JUnitPlatformProvider.java:124)
23:56:56 [2021-05-22T03:56:56.134Z] 	at java.base/jdk.internal.reflect.NativeMethodAccessorImpl.invoke0(Native Method)
23:56:56 [2021-05-22T03:56:56.134Z] 	at java.base/jdk.internal.reflect.NativeMethodAccessorImpl.invoke(NativeMethodAccessorImpl.java:64)
23:56:56 [2021-05-22T03:56:56.134Z] 	at java.base/jdk.internal.reflect.DelegatingMethodAccessorImpl.invoke(DelegatingMethodAccessorImpl.java:43)
23:56:56 [2021-05-22T03:56:56.134Z] 	at java.base/java.lang.reflect.Method.invoke(Method.java:564)
23:56:56 [2021-05-22T03:56:56.134Z] 	at org.apache.maven.surefire.util.ReflectionUtils.invokeMethodWithArray2(ReflectionUtils.java:206)
23:56:56 [2021-05-22T03:56:56.134Z] 	at org.apache.maven.surefire.booter.ProviderFactory$ProviderProxy.invoke(ProviderFactory.java:161)
23:56:56 [2021-05-22T03:56:56.134Z] 	at org.apache.maven.surefire.booter.ProviderFactory.invokeProvider(ProviderFactory.java:84)
23:56:56 [2021-05-22T03:56:56.134Z] 	at org.eclipse.tycho.surefire.osgibooter.OsgiSurefireBooter.run(OsgiSurefireBooter.java:116)
23:56:56 [2021-05-22T03:56:56.134Z] 	at org.eclipse.tycho.surefire.osgibooter.HeadlessTestApplication.start(HeadlessTestApplication.java:23)
23:56:56 [2021-05-22T03:56:56.134Z] 	at org.eclipse.equinox.internal.app.EclipseAppHandle.run(EclipseAppHandle.java:203)
23:56:56 [2021-05-22T03:56:56.134Z] 	at org.eclipse.core.runtime.internal.adaptor.EclipseAppLauncher.runApplication(EclipseAppLauncher.java:134)
23:56:56 [2021-05-22T03:56:56.134Z] 	at org.eclipse.core.runtime.internal.adaptor.EclipseAppLauncher.start(EclipseAppLauncher.java:104)
23:56:56 [2021-05-22T03:56:56.134Z] 	at org.eclipse.core.runtime.adaptor.EclipseStarter.run(EclipseStarter.java:401)
23:56:56 [2021-05-22T03:56:56.134Z] 	at org.eclipse.core.runtime.adaptor.EclipseStarter.run(EclipseStarter.java:255)
23:56:56 [2021-05-22T03:56:56.134Z] 	at java.base/jdk.internal.reflect.NativeMethodAccessorImpl.invoke0(Native Method)
23:56:56 [2021-05-22T03:56:56.134Z] 	at java.base/jdk.internal.reflect.NativeMethodAccessorImpl.invoke(NativeMethodAccessorImpl.java:64)
23:56:56 [2021-05-22T03:56:56.134Z] 	at java.base/jdk.internal.reflect.DelegatingMethodAccessorImpl.invoke(DelegatingMethodAccessorImpl.java:43)
23:56:56 [2021-05-22T03:56:56.134Z] 	at java.base/java.lang.reflect.Method.invoke(Method.java:564)
23:56:56 [2021-05-22T03:56:56.134Z] 	at org.eclipse.equinox.launcher.Main.invokeFramework(Main.java:653)
23:56:56 [2021-05-22T03:56:56.134Z] 	at org.eclipse.equinox.launcher.Main.basicRun(Main.java:590)
23:56:56 [2021-05-22T03:56:56.134Z] 	at org.eclipse.equinox.launcher.Main.run(Main.java:1461)
23:56:56 [2021-05-22T03:56:56.134Z] 	at org.eclipse.equinox.launcher.Main.main(Main.java:1434)
23:56:56 [2021-05-22T03:56:56.135Z] Caused by: java.lang.ClassNotFoundException: org.junit.runners.model.RunnerBuilder cannot be found by org.eclipse.tycho.surefire.osgibooter_2.2.0
23:56:56 [2021-05-22T03:56:56.135Z] 	at org.eclipse.osgi.internal.loader.BundleLoader.findClass(BundleLoader.java:516)
23:56:56 [2021-05-22T03:56:56.135Z] 	at org.eclipse.osgi.internal.loader.ModuleClassLoader.loadClass(ModuleClassLoader.java:171)
23:56:56 [2021-05-22T03:56:56.135Z] 	at java.base/java.lang.ClassLoader.loadClass(ClassLoader.java:522)
23:56:56 [2021-05-22T03:56:56.135Z] 	... 31 more
23:56:56 [2021-05-22T03:56:56.135Z] 
23:56:56 [2021-05-22T03:56:56.135Z] May 22, 2021 3:56:56 AM org.junit.platform.launcher.core.DefaultLauncher handleThrowable
23:56:56 [2021-05-22T03:56:56.135Z] WARNING: TestEngine with ID 'junit-vintage' failed to discover tests
23:56:56 [2021-05-22T03:56:56.135Z] java.lang.NoClassDefFoundError: org/junit/runners/model/RunnerBuilder
23:56:56 [2021-05-22T03:56:56.135Z] 	at org.junit.vintage.engine.discovery.VintageDiscoverer.<init>(VintageDiscoverer.java:48)
23:56:56 [2021-05-22T03:56:56.135Z] 	at org.junit.vintage.engine.VintageTestEngine.discover(VintageTestEngine.java:65)
23:56:56 [2021-05-22T03:56:56.135Z] 	at org.junit.platform.launcher.core.DefaultLauncher.discoverEngineRoot(DefaultLauncher.java:130)
23:56:56 [2021-05-22T03:56:56.135Z] 	at org.junit.platform.launcher.core.DefaultLauncher.discoverRoot(DefaultLauncher.java:117)
23:56:56 [2021-05-22T03:56:56.135Z] 	at org.junit.platform.launcher.core.DefaultLauncher.discover(DefaultLauncher.java:82)
23:56:56 [2021-05-22T03:56:56.135Z] 	at org.apache.maven.surefire.junitplatform.TestPlanScannerFilter.accept(TestPlanScannerFilter.java:56)
23:56:56 [2021-05-22T03:56:56.135Z] 	at org.apache.maven.surefire.util.DefaultScanResult.applyFilter(DefaultScanResult.java:102)
23:56:56 [2021-05-22T03:56:56.135Z] 	at org.apache.maven.surefire.junitplatform.JUnitPlatformProvider.scanClasspath(JUnitPlatformProvider.java:143)
23:56:56 [2021-05-22T03:56:56.135Z] 	at org.apache.maven.surefire.junitplatform.JUnitPlatformProvider.invoke(JUnitPlatformProvider.java:124)
23:56:56 [2021-05-22T03:56:56.135Z] 	at java.base/jdk.internal.reflect.NativeMethodAccessorImpl.invoke0(Native Method)
23:56:56 [2021-05-22T03:56:56.135Z] 	at java.base/jdk.internal.reflect.NativeMethodAccessorImpl.invoke(NativeMethodAccessorImpl.java:64)
23:56:56 [2021-05-22T03:56:56.135Z] 	at java.base/jdk.internal.reflect.DelegatingMethodAccessorImpl.invoke(DelegatingMethodAccessorImpl.java:43)
23:56:56 [2021-05-22T03:56:56.135Z] 	at java.base/java.lang.reflect.Method.invoke(Method.java:564)
23:56:56 [2021-05-22T03:56:56.135Z] 	at org.apache.maven.surefire.util.ReflectionUtils.invokeMethodWithArray2(ReflectionUtils.java:206)
23:56:56 [2021-05-22T03:56:56.135Z] 	at org.apache.maven.surefire.booter.ProviderFactory$ProviderProxy.invoke(ProviderFactory.java:161)
23:56:56 [2021-05-22T03:56:56.135Z] 	at org.apache.maven.surefire.booter.ProviderFactory.invokeProvider(ProviderFactory.java:84)
23:56:56 [2021-05-22T03:56:56.135Z] 	at org.eclipse.tycho.surefire.osgibooter.OsgiSurefireBooter.run(OsgiSurefireBooter.java:116)
23:56:56 [2021-05-22T03:56:56.135Z] 	at org.eclipse.tycho.surefire.osgibooter.HeadlessTestApplication.start(HeadlessTestApplication.java:23)
23:56:56 [2021-05-22T03:56:56.135Z] 	at org.eclipse.equinox.internal.app.EclipseAppHandle.run(EclipseAppHandle.java:203)
23:56:56 [2021-05-22T03:56:56.135Z] 	at org.eclipse.core.runtime.internal.adaptor.EclipseAppLauncher.runApplication(EclipseAppLauncher.java:134)
23:56:56 [2021-05-22T03:56:56.135Z] 	at org.eclipse.core.runtime.internal.adaptor.EclipseAppLauncher.start(EclipseAppLauncher.java:104)
23:56:56 [2021-05-22T03:56:56.135Z] 	at org.eclipse.core.runtime.adaptor.EclipseStarter.run(EclipseStarter.java:401)
23:56:56 [2021-05-22T03:56:56.135Z] 	at org.eclipse.core.runtime.adaptor.EclipseStarter.run(EclipseStarter.java:255)
23:56:56 [2021-05-22T03:56:56.135Z] 	at java.base/jdk.internal.reflect.NativeMethodAccessorImpl.invoke0(Native Method)
23:56:56 [2021-05-22T03:56:56.135Z] 	at java.base/jdk.internal.reflect.NativeMethodAccessorImpl.invoke(NativeMethodAccessorImpl.java:64)
23:56:56 [2021-05-22T03:56:56.135Z] 	at java.base/jdk.internal.reflect.DelegatingMethodAccessorImpl.invoke(DelegatingMethodAccessorImpl.java:43)
23:56:56 [2021-05-22T03:56:56.135Z] 	at java.base/java.lang.reflect.Method.invoke(Method.java:564)
23:56:56 [2021-05-22T03:56:56.135Z] 	at org.eclipse.equinox.launcher.Main.invokeFramework(Main.java:653)
23:56:56 [2021-05-22T03:56:56.135Z] 	at org.eclipse.equinox.launcher.Main.basicRun(Main.java:590)
23:56:56 [2021-05-22T03:56:56.135Z] 	at org.eclipse.equinox.launcher.Main.run(Main.java:1461)
23:56:56 [2021-05-22T03:56:56.135Z] 	at org.eclipse.equinox.launcher.Main.main(Main.java:1434)
23:56:56 [2021-05-22T03:56:56.135Z] Caused by: java.lang.ClassNotFoundException: org.junit.runners.model.RunnerBuilder cannot be found by org.eclipse.tycho.surefire.osgibooter_2.2.0
23:56:56 [2021-05-22T03:56:56.135Z] 	at org.eclipse.osgi.internal.loader.BundleLoader.findClass(BundleLoader.java:516)
23:56:56 [2021-05-22T03:56:56.135Z] 	at org.eclipse.osgi.internal.loader.ModuleClassLoader.loadClass(ModuleClassLoader.java:171)
23:56:56 [2021-05-22T03:56:56.135Z] 	at java.base/java.lang.ClassLoader.loadClass(ClassLoader.java:522)
23:56:56 [2021-05-22T03:56:56.135Z] 	... 31 more
23:56:56 [2021-05-22T03:56:56.135Z] 
23:56:56 [2021-05-22T03:56:56.135Z] May 22, 2021 3:56:56 AM org.junit.platform.launcher.core.DefaultLauncher handleThrowable
23:56:56 [2021-05-22T03:56:56.135Z] WARNING: TestEngine with ID 'junit-vintage' failed to discover tests
23:56:56 [2021-05-22T03:56:56.135Z] java.lang.NoClassDefFoundError: org/junit/runners/model/RunnerBuilder
23:56:56 [2021-05-22T03:56:56.135Z] 	at org.junit.vintage.engine.discovery.VintageDiscoverer.<init>(VintageDiscoverer.java:48)
23:56:56 [2021-05-22T03:56:56.135Z] 	at org.junit.vintage.engine.VintageTestEngine.discover(VintageTestEngine.java:65)
23:56:56 [2021-05-22T03:56:56.135Z] 	at org.junit.platform.launcher.core.DefaultLauncher.discoverEngineRoot(DefaultLauncher.java:130)
23:56:56 [2021-05-22T03:56:56.135Z] 	at org.junit.platform.launcher.core.DefaultLauncher.discoverRoot(DefaultLauncher.java:117)
23:56:56 [2021-05-22T03:56:56.135Z] 	at org.junit.platform.launcher.core.DefaultLauncher.discover(DefaultLauncher.java:82)
23:56:56 [2021-05-22T03:56:56.135Z] 	at org.apache.maven.surefire.junitplatform.TestPlanScannerFilter.accept(TestPlanScannerFilter.java:56)
23:56:56 [2021-05-22T03:56:56.135Z] 	at org.apache.maven.surefire.util.DefaultScanResult.applyFilter(DefaultScanResult.java:102)
23:56:56 [2021-05-22T03:56:56.135Z] 	at org.apache.maven.surefire.junitplatform.JUnitPlatformProvider.scanClasspath(JUnitPlatformProvider.java:143)
23:56:56 [2021-05-22T03:56:56.135Z] 	at org.apache.maven.surefire.junitplatform.JUnitPlatformProvider.invoke(JUnitPlatformProvider.java:124)
23:56:56 [2021-05-22T03:56:56.136Z] 	at java.base/jdk.internal.reflect.NativeMethodAccessorImpl.invoke0(Native Method)
23:56:56 [2021-05-22T03:56:56.136Z] 	at java.base/jdk.internal.reflect.NativeMethodAccessorImpl.invoke(NativeMethodAccessorImpl.java:64)
23:56:56 [2021-05-22T03:56:56.136Z] 	at java.base/jdk.internal.reflect.DelegatingMethodAccessorImpl.invoke(DelegatingMethodAccessorImpl.java:43)
23:56:56 [2021-05-22T03:56:56.136Z] 	at java.base/java.lang.reflect.Method.invoke(Method.java:564)
23:56:56 [2021-05-22T03:56:56.136Z] 	at org.apache.maven.surefire.util.ReflectionUtils.invokeMethodWithArray2(ReflectionUtils.java:206)
23:56:56 [2021-05-22T03:56:56.136Z] 	at org.apache.maven.surefire.booter.ProviderFactory$ProviderProxy.invoke(ProviderFactory.java:161)
23:56:56 [2021-05-22T03:56:56.136Z] 	at org.apache.maven.surefire.booter.ProviderFactory.invokeProvider(ProviderFactory.java:84)
23:56:56 [2021-05-22T03:56:56.136Z] 	at org.eclipse.tycho.surefire.osgibooter.OsgiSurefireBooter.run(OsgiSurefireBooter.java:116)
23:56:56 [2021-05-22T03:56:56.136Z] 	at org.eclipse.tycho.surefire.osgibooter.HeadlessTestApplication.start(HeadlessTestApplication.java:23)
23:56:56 [2021-05-22T03:56:56.136Z] 	at org.eclipse.equinox.internal.app.EclipseAppHandle.run(EclipseAppHandle.java:203)
23:56:56 [2021-05-22T03:56:56.136Z] 	at org.eclipse.core.runtime.internal.adaptor.EclipseAppLauncher.runApplication(EclipseAppLauncher.java:134)
23:56:56 [2021-05-22T03:56:56.136Z] 	at org.eclipse.core.runtime.internal.adaptor.EclipseAppLauncher.start(EclipseAppLauncher.java:104)
23:56:56 [2021-05-22T03:56:56.136Z] 	at org.eclipse.core.runtime.adaptor.EclipseStarter.run(EclipseStarter.java:401)
23:56:56 [2021-05-22T03:56:56.136Z] 	at org.eclipse.core.runtime.adaptor.EclipseStarter.run(EclipseStarter.java:255)
23:56:56 [2021-05-22T03:56:56.136Z] 	at java.base/jdk.internal.reflect.NativeMethodAccessorImpl.invoke0(Native Method)
23:56:56 [2021-05-22T03:56:56.136Z] 	at java.base/jdk.internal.reflect.NativeMethodAccessorImpl.invoke(NativeMethodAccessorImpl.java:64)
23:56:56 [2021-05-22T03:56:56.136Z] 	at java.base/jdk.internal.reflect.DelegatingMethodAccessorImpl.invoke(DelegatingMethodAccessorImpl.java:43)
23:56:56 [2021-05-22T03:56:56.136Z] 	at java.base/java.lang.reflect.Method.invoke(Method.java:564)
23:56:56 [2021-05-22T03:56:56.136Z] 	at org.eclipse.equinox.launcher.Main.invokeFramework(Main.java:653)
23:56:56 [2021-05-22T03:56:56.136Z] 	at org.eclipse.equinox.launcher.Main.basicRun(Main.java:590)
23:56:56 [2021-05-22T03:56:56.136Z] 	at org.eclipse.equinox.launcher.Main.run(Main.java:1461)
23:56:56 [2021-05-22T03:56:56.136Z] 	at org.eclipse.equinox.launcher.Main.main(Main.java:1434)
23:56:56 [2021-05-22T03:56:56.136Z] Caused by: java.lang.ClassNotFoundException: org.junit.runners.model.RunnerBuilder cannot be found by org.eclipse.tycho.surefire.osgibooter_2.2.0
23:56:56 [2021-05-22T03:56:56.136Z] 	at org.eclipse.osgi.internal.loader.BundleLoader.findClass(BundleLoader.java:516)
23:56:56 [2021-05-22T03:56:56.136Z] 	at org.eclipse.osgi.internal.loader.ModuleClassLoader.loadClass(ModuleClassLoader.java:171)
23:56:56 [2021-05-22T03:56:56.136Z] 	at java.base/java.lang.ClassLoader.loadClass(ClassLoader.java:522)
23:56:56 [2021-05-22T03:56:56.136Z] 	... 31 more
23:56:56 [2021-05-22T03:56:56.136Z] 
23:56:56 [2021-05-22T03:56:56.136Z] May 22, 2021 3:56:56 AM org.junit.platform.launcher.core.DefaultLauncher handleThrowable
23:56:56 [2021-05-22T03:56:56.136Z] WARNING: TestEngine with ID 'junit-vintage' failed to discover tests
23:56:56 [2021-05-22T03:56:56.136Z] java.lang.NoClassDefFoundError: org/junit/runners/model/RunnerBuilder
23:56:56 [2021-05-22T03:56:56.136Z] 	at org.junit.vintage.engine.discovery.VintageDiscoverer.<init>(VintageDiscoverer.java:48)
23:56:56 [2021-05-22T03:56:56.136Z] 	at org.junit.vintage.engine.VintageTestEngine.discover(VintageTestEngine.java:65)
23:56:56 [2021-05-22T03:56:56.136Z] 	at org.junit.platform.launcher.core.DefaultLauncher.discoverEngineRoot(DefaultLauncher.java:130)
23:56:56 [2021-05-22T03:56:56.136Z] 	at org.junit.platform.launcher.core.DefaultLauncher.discoverRoot(DefaultLauncher.java:117)
23:56:56 [2021-05-22T03:56:56.136Z] 	at org.junit.platform.launcher.core.DefaultLauncher.discover(DefaultLauncher.java:82)
23:56:56 [2021-05-22T03:56:56.136Z] 	at org.apache.maven.surefire.junitplatform.TestPlanScannerFilter.accept(TestPlanScannerFilter.java:56)
23:56:56 [2021-05-22T03:56:56.136Z] 	at org.apache.maven.surefire.util.DefaultScanResult.applyFilter(DefaultScanResult.java:102)
23:56:56 [2021-05-22T03:56:56.136Z] 	at org.apache.maven.surefire.junitplatform.JUnitPlatformProvider.scanClasspath(JUnitPlatformProvider.java:143)
23:56:56 [2021-05-22T03:56:56.136Z] 	at org.apache.maven.surefire.junitplatform.JUnitPlatformProvider.invoke(JUnitPlatformProvider.java:124)
23:56:56 [2021-05-22T03:56:56.136Z] 	at java.base/jdk.internal.reflect.NativeMethodAccessorImpl.invoke0(Native Method)
23:56:56 [2021-05-22T03:56:56.136Z] 	at java.base/jdk.internal.reflect.NativeMethodAccessorImpl.invoke(NativeMethodAccessorImpl.java:64)
23:56:56 [2021-05-22T03:56:56.136Z] 	at java.base/jdk.internal.reflect.DelegatingMethodAccessorImpl.invoke(DelegatingMethodAccessorImpl.java:43)
23:56:56 [2021-05-22T03:56:56.136Z] 	at java.base/java.lang.reflect.Method.invoke(Method.java:564)
23:56:56 [2021-05-22T03:56:56.136Z] 	at org.apache.maven.surefire.util.ReflectionUtils.invokeMethodWithArray2(ReflectionUtils.java:206)
23:56:56 [2021-05-22T03:56:56.136Z] 	at org.apache.maven.surefire.booter.ProviderFactory$ProviderProxy.invoke(ProviderFactory.java:161)
23:56:56 [2021-05-22T03:56:56.136Z] 	at org.apache.maven.surefire.booter.ProviderFactory.invokeProvider(ProviderFactory.java:84)
23:56:56 [2021-05-22T03:56:56.136Z] 	at org.eclipse.tycho.surefire.osgibooter.OsgiSurefireBooter.run(OsgiSurefireBooter.java:116)
23:56:56 [2021-05-22T03:56:56.136Z] 	at org.eclipse.tycho.surefire.osgibooter.HeadlessTestApplication.start(HeadlessTestApplication.java:23)
23:56:56 [2021-05-22T03:56:56.136Z] 	at org.eclipse.equinox.internal.app.EclipseAppHandle.run(EclipseAppHandle.java:203)
23:56:56 [2021-05-22T03:56:56.136Z] 	at org.eclipse.core.runtime.internal.adaptor.EclipseAppLauncher.runApplication(EclipseAppLauncher.java:134)
23:56:56 [2021-05-22T03:56:56.136Z] 	at org.eclipse.core.runtime.internal.adaptor.EclipseAppLauncher.start(EclipseAppLauncher.java:104)
23:56:56 [2021-05-22T03:56:56.136Z] 	at org.eclipse.core.runtime.adaptor.EclipseStarter.run(EclipseStarter.java:401)
23:56:56 [2021-05-22T03:56:56.136Z] 	at org.eclipse.core.runtime.adaptor.EclipseStarter.run(EclipseStarter.java:255)
23:56:56 [2021-05-22T03:56:56.136Z] 	at java.base/jdk.internal.reflect.NativeMethodAccessorImpl.invoke0(Native Method)
23:56:56 [2021-05-22T03:56:56.136Z] 	at java.base/jdk.internal.reflect.NativeMethodAccessorImpl.invoke(NativeMethodAccessorImpl.java:64)
23:56:56 [2021-05-22T03:56:56.136Z] 	at java.base/jdk.internal.reflect.DelegatingMethodAccessorImpl.invoke(DelegatingMethodAccessorImpl.java:43)
23:56:56 [2021-05-22T03:56:56.136Z] 	at java.base/java.lang.reflect.Method.invoke(Method.java:564)
23:56:56 [2021-05-22T03:56:56.137Z] 	at org.eclipse.equinox.launcher.Main.invokeFramework(Main.java:653)
23:56:56 [2021-05-22T03:56:56.137Z] 	at org.eclipse.equinox.launcher.Main.basicRun(Main.java:590)
23:56:56 [2021-05-22T03:56:56.137Z] 	at org.eclipse.equinox.launcher.Main.run(Main.java:1461)
23:56:56 [2021-05-22T03:56:56.137Z] 	at org.eclipse.equinox.launcher.Main.main(Main.java:1434)
23:56:56 [2021-05-22T03:56:56.137Z] Caused by: java.lang.ClassNotFoundException: org.junit.runners.model.RunnerBuilder cannot be found by org.eclipse.tycho.surefire.osgibooter_2.2.0
23:56:56 [2021-05-22T03:56:56.137Z] 	at org.eclipse.osgi.internal.loader.BundleLoader.findClass(BundleLoader.java:516)
23:56:56 [2021-05-22T03:56:56.137Z] 	at org.eclipse.osgi.internal.loader.ModuleClassLoader.loadClass(ModuleClassLoader.java:171)
23:56:56 [2021-05-22T03:56:56.137Z] 	at java.base/java.lang.ClassLoader.loadClass(ClassLoader.java:522)
23:56:56 [2021-05-22T03:56:56.137Z] 	... 31 more
23:56:56 [2021-05-22T03:56:56.137Z] 
23:56:56 [2021-05-22T03:56:56.137Z] May 22, 2021 3:56:56 AM org.junit.platform.launcher.core.DefaultLauncher handleThrowable
23:56:56 [2021-05-22T03:56:56.137Z] WARNING: TestEngine with ID 'junit-vintage' failed to discover tests
23:56:56 [2021-05-22T03:56:56.137Z] java.lang.NoClassDefFoundError: org/junit/runners/model/RunnerBuilder
23:56:56 [2021-05-22T03:56:56.137Z] 	at org.junit.vintage.engine.discovery.VintageDiscoverer.<init>(VintageDiscoverer.java:48)
23:56:56 [2021-05-22T03:56:56.137Z] 	at org.junit.vintage.engine.VintageTestEngine.discover(VintageTestEngine.java:65)
23:56:56 [2021-05-22T03:56:56.137Z] 	at org.junit.platform.launcher.core.DefaultLauncher.discoverEngineRoot(DefaultLauncher.java:130)
23:56:56 [2021-05-22T03:56:56.137Z] 	at org.junit.platform.launcher.core.DefaultLauncher.discoverRoot(DefaultLauncher.java:117)
23:56:56 [2021-05-22T03:56:56.137Z] 	at org.junit.platform.launcher.core.DefaultLauncher.discover(DefaultLauncher.java:82)
23:56:56 [2021-05-22T03:56:56.137Z] 	at org.apache.maven.surefire.junitplatform.TestPlanScannerFilter.accept(TestPlanScannerFilter.java:56)
23:56:56 [2021-05-22T03:56:56.137Z] 	at org.apache.maven.surefire.util.DefaultScanResult.applyFilter(DefaultScanResult.java:102)
23:56:56 [2021-05-22T03:56:56.137Z] 	at org.apache.maven.surefire.junitplatform.JUnitPlatformProvider.scanClasspath(JUnitPlatformProvider.java:143)
23:56:56 [2021-05-22T03:56:56.137Z] 	at org.apache.maven.surefire.junitplatform.JUnitPlatformProvider.invoke(JUnitPlatformProvider.java:124)
23:56:56 [2021-05-22T03:56:56.137Z] 	at java.base/jdk.internal.reflect.NativeMethodAccessorImpl.invoke0(Native Method)
23:56:56 [2021-05-22T03:56:56.137Z] 	at java.base/jdk.internal.reflect.NativeMethodAccessorImpl.invoke(NativeMethodAccessorImpl.java:64)
23:56:56 [2021-05-22T03:56:56.137Z] 	at java.base/jdk.internal.reflect.DelegatingMethodAccessorImpl.invoke(DelegatingMethodAccessorImpl.java:43)
23:56:56 [2021-05-22T03:56:56.137Z] 	at java.base/java.lang.reflect.Method.invoke(Method.java:564)
23:56:56 [2021-05-22T03:56:56.137Z] 	at org.apache.maven.surefire.util.ReflectionUtils.invokeMethodWithArray2(ReflectionUtils.java:206)
23:56:56 [2021-05-22T03:56:56.137Z] 	at org.apache.maven.surefire.booter.ProviderFactory$ProviderProxy.invoke(ProviderFactory.java:161)
23:56:56 [2021-05-22T03:56:56.137Z] 	at org.apache.maven.surefire.booter.ProviderFactory.invokeProvider(ProviderFactory.java:84)
23:56:56 [2021-05-22T03:56:56.137Z] 	at org.eclipse.tycho.surefire.osgibooter.OsgiSurefireBooter.run(OsgiSurefireBooter.java:116)
23:56:56 [2021-05-22T03:56:56.137Z] 	at org.eclipse.tycho.surefire.osgibooter.HeadlessTestApplication.start(HeadlessTestApplication.java:23)
23:56:56 [2021-05-22T03:56:56.137Z] 	at org.eclipse.equinox.internal.app.EclipseAppHandle.run(EclipseAppHandle.java:203)
23:56:56 [2021-05-22T03:56:56.137Z] 	at org.eclipse.core.runtime.internal.adaptor.EclipseAppLauncher.runApplication(EclipseAppLauncher.java:134)
23:56:56 [2021-05-22T03:56:56.137Z] 	at org.eclipse.core.runtime.internal.adaptor.EclipseAppLauncher.start(EclipseAppLauncher.java:104)
23:56:56 [2021-05-22T03:56:56.137Z] 	at org.eclipse.core.runtime.adaptor.EclipseStarter.run(EclipseStarter.java:401)
23:56:56 [2021-05-22T03:56:56.137Z] 	at org.eclipse.core.runtime.adaptor.EclipseStarter.run(EclipseStarter.java:255)
23:56:56 [2021-05-22T03:56:56.137Z] 	at java.base/jdk.internal.reflect.NativeMethodAccessorImpl.invoke0(Native Method)
23:56:56 [2021-05-22T03:56:56.137Z] 	at java.base/jdk.internal.reflect.NativeMethodAccessorImpl.invoke(NativeMethodAccessorImpl.java:64)
23:56:56 [2021-05-22T03:56:56.137Z] 	at java.base/jdk.internal.reflect.DelegatingMethodAccessorImpl.invoke(DelegatingMethodAccessorImpl.java:43)
23:56:56 [2021-05-22T03:56:56.137Z] 	at java.base/java.lang.reflect.Method.invoke(Method.java:564)
23:56:56 [2021-05-22T03:56:56.137Z] 	at org.eclipse.equinox.launcher.Main.invokeFramework(Main.java:653)
23:56:56 [2021-05-22T03:56:56.137Z] 	at org.eclipse.equinox.launcher.Main.basicRun(Main.java:590)
23:56:56 [2021-05-22T03:56:56.137Z] 	at org.eclipse.equinox.launcher.Main.run(Main.java:1461)
23:56:56 [2021-05-22T03:56:56.137Z] 	at org.eclipse.equinox.launcher.Main.main(Main.java:1434)
23:56:56 [2021-05-22T03:56:56.137Z] Caused by: java.lang.ClassNotFoundException: org.junit.runners.model.RunnerBuilder cannot be found by org.eclipse.tycho.surefire.osgibooter_2.2.0
23:56:56 [2021-05-22T03:56:56.137Z] 	at org.eclipse.osgi.internal.loader.BundleLoader.findClass(BundleLoader.java:516)
23:56:56 [2021-05-22T03:56:56.137Z] 	at org.eclipse.osgi.internal.loader.ModuleClassLoader.loadClass(ModuleClassLoader.java:171)
23:56:56 [2021-05-22T03:56:56.137Z] 	at java.base/java.lang.ClassLoader.loadClass(ClassLoader.java:522)
23:56:56 [2021-05-22T03:56:56.137Z] 	... 31 more
23:56:56 [2021-05-22T03:56:56.137Z] 
23:56:56 [2021-05-22T03:56:56.137Z] May 22, 2021 3:56:56 AM org.junit.platform.launcher.core.DefaultLauncher handleThrowable
23:56:56 [2021-05-22T03:56:56.137Z] WARNING: TestEngine with ID 'junit-vintage' failed to discover tests
23:56:56 [2021-05-22T03:56:56.137Z] java.lang.NoClassDefFoundError: org/junit/runners/model/RunnerBuilder
23:56:56 [2021-05-22T03:56:56.137Z] 	at org.junit.vintage.engine.discovery.VintageDiscoverer.<init>(VintageDiscoverer.java:48)
23:56:56 [2021-05-22T03:56:56.137Z] 	at org.junit.vintage.engine.VintageTestEngine.discover(VintageTestEngine.java:65)
23:56:56 [2021-05-22T03:56:56.137Z] 	at org.junit.platform.launcher.core.DefaultLauncher.discoverEngineRoot(DefaultLauncher.java:130)
23:56:56 [2021-05-22T03:56:56.137Z] 	at org.junit.platform.launcher.core.DefaultLauncher.discoverRoot(DefaultLauncher.java:117)
23:56:56 [2021-05-22T03:56:56.137Z] 	at org.junit.platform.launcher.core.DefaultLauncher.discover(DefaultLauncher.java:82)
23:56:56 [2021-05-22T03:56:56.137Z] 	at org.apache.maven.surefire.junitplatform.TestPlanScannerFilter.accept(TestPlanScannerFilter.java:56)
23:56:56 [2021-05-22T03:56:56.137Z] 	at org.apache.maven.surefire.util.DefaultScanResult.applyFilter(DefaultScanResult.java:102)
23:56:56 [2021-05-22T03:56:56.137Z] 	at org.apache.maven.surefire.junitplatform.JUnitPlatformProvider.scanClasspath(JUnitPlatformProvider.java:143)
23:56:56 [2021-05-22T03:56:56.138Z] 	at org.apache.maven.surefire.junitplatform.JUnitPlatformProvider.invoke(JUnitPlatformProvider.java:124)
23:56:56 [2021-05-22T03:56:56.138Z] 	at java.base/jdk.internal.reflect.NativeMethodAccessorImpl.invoke0(Native Method)
23:56:56 [2021-05-22T03:56:56.138Z] 	at java.base/jdk.internal.reflect.NativeMethodAccessorImpl.invoke(NativeMethodAccessorImpl.java:64)
23:56:56 [2021-05-22T03:56:56.138Z] 	at java.base/jdk.internal.reflect.DelegatingMethodAccessorImpl.invoke(DelegatingMethodAccessorImpl.java:43)
23:56:56 [2021-05-22T03:56:56.138Z] 	at java.base/java.lang.reflect.Method.invoke(Method.java:564)
23:56:56 [2021-05-22T03:56:56.138Z] 	at org.apache.maven.surefire.util.ReflectionUtils.invokeMethodWithArray2(ReflectionUtils.java:206)
23:56:56 [2021-05-22T03:56:56.138Z] 	at org.apache.maven.surefire.booter.ProviderFactory$ProviderProxy.invoke(ProviderFactory.java:161)
23:56:56 [2021-05-22T03:56:56.138Z] 	at org.apache.maven.surefire.booter.ProviderFactory.invokeProvider(ProviderFactory.java:84)
23:56:56 [2021-05-22T03:56:56.138Z] 	at org.eclipse.tycho.surefire.osgibooter.OsgiSurefireBooter.run(OsgiSurefireBooter.java:116)
23:56:56 [2021-05-22T03:56:56.138Z] 	at org.eclipse.tycho.surefire.osgibooter.HeadlessTestApplication.start(HeadlessTestApplication.java:23)
23:56:56 [2021-05-22T03:56:56.138Z] 	at org.eclipse.equinox.internal.app.EclipseAppHandle.run(EclipseAppHandle.java:203)
23:56:56 [2021-05-22T03:56:56.138Z] 	at org.eclipse.core.runtime.internal.adaptor.EclipseAppLauncher.runApplication(EclipseAppLauncher.java:134)
23:56:56 [2021-05-22T03:56:56.138Z] 	at org.eclipse.core.runtime.internal.adaptor.EclipseAppLauncher.start(EclipseAppLauncher.java:104)
23:56:56 [2021-05-22T03:56:56.138Z] 	at org.eclipse.core.runtime.adaptor.EclipseStarter.run(EclipseStarter.java:401)
23:56:56 [2021-05-22T03:56:56.138Z] 	at org.eclipse.core.runtime.adaptor.EclipseStarter.run(EclipseStarter.java:255)
23:56:56 [2021-05-22T03:56:56.138Z] 	at java.base/jdk.internal.reflect.NativeMethodAccessorImpl.invoke0(Native Method)
23:56:56 [2021-05-22T03:56:56.138Z] 	at java.base/jdk.internal.reflect.NativeMethodAccessorImpl.invoke(NativeMethodAccessorImpl.java:64)
23:56:56 [2021-05-22T03:56:56.138Z] 	at java.base/jdk.internal.reflect.DelegatingMethodAccessorImpl.invoke(DelegatingMethodAccessorImpl.java:43)
23:56:56 [2021-05-22T03:56:56.138Z] 	at java.base/java.lang.reflect.Method.invoke(Method.java:564)
23:56:56 [2021-05-22T03:56:56.138Z] 	at org.eclipse.equinox.launcher.Main.invokeFramework(Main.java:653)
23:56:56 [2021-05-22T03:56:56.138Z] 	at org.eclipse.equinox.launcher.Main.basicRun(Main.java:590)
23:56:56 [2021-05-22T03:56:56.138Z] 	at org.eclipse.equinox.launcher.Main.run(Main.java:1461)
23:56:56 [2021-05-22T03:56:56.138Z] 	at org.eclipse.equinox.launcher.Main.main(Main.java:1434)
23:56:56 [2021-05-22T03:56:56.138Z] Caused by: java.lang.ClassNotFoundException: org.junit.runners.model.RunnerBuilder cannot be found by org.eclipse.tycho.surefire.osgibooter_2.2.0
23:56:56 [2021-05-22T03:56:56.138Z] 	at org.eclipse.osgi.internal.loader.BundleLoader.findClass(BundleLoader.java:516)
23:56:56 [2021-05-22T03:56:56.138Z] 	at org.eclipse.osgi.internal.loader.ModuleClassLoader.loadClass(ModuleClassLoader.java:171)
23:56:56 [2021-05-22T03:56:56.138Z] 	at java.base/java.lang.ClassLoader.loadClass(ClassLoader.java:522)
23:56:56 [2021-05-22T03:56:56.138Z] 	... 31 more
23:56:56 [2021-05-22T03:56:56.138Z] 
23:56:56 [2021-05-22T03:56:56.138Z] May 22, 2021 3:56:56 AM org.junit.platform.launcher.core.DefaultLauncher handleThrowable
23:56:56 [2021-05-22T03:56:56.138Z] WARNING: TestEngine with ID 'junit-vintage' failed to discover tests
23:56:56 [2021-05-22T03:56:56.138Z] java.lang.NoClassDefFoundError: org/junit/runners/model/RunnerBuilder
23:56:56 [2021-05-22T03:56:56.138Z] 	at org.junit.vintage.engine.discovery.VintageDiscoverer.<init>(VintageDiscoverer.java:48)
23:56:56 [2021-05-22T03:56:56.138Z] 	at org.junit.vintage.engine.VintageTestEngine.discover(VintageTestEngine.java:65)
23:56:56 [2021-05-22T03:56:56.138Z] 	at org.junit.platform.launcher.core.DefaultLauncher.discoverEngineRoot(DefaultLauncher.java:130)
23:56:56 [2021-05-22T03:56:56.138Z] 	at org.junit.platform.launcher.core.DefaultLauncher.discoverRoot(DefaultLauncher.java:117)
23:56:56 [2021-05-22T03:56:56.138Z] 	at org.junit.platform.launcher.core.DefaultLauncher.discover(DefaultLauncher.java:82)
23:56:56 [2021-05-22T03:56:56.138Z] 	at org.apache.maven.surefire.junitplatform.TestPlanScannerFilter.accept(TestPlanScannerFilter.java:56)
23:56:56 [2021-05-22T03:56:56.138Z] 	at org.apache.maven.surefire.util.DefaultScanResult.applyFilter(DefaultScanResult.java:102)
23:56:56 [2021-05-22T03:56:56.138Z] 	at org.apache.maven.surefire.junitplatform.JUnitPlatformProvider.scanClasspath(JUnitPlatformProvider.java:143)
23:56:56 [2021-05-22T03:56:56.138Z] 	at org.apache.maven.surefire.junitplatform.JUnitPlatformProvider.invoke(JUnitPlatformProvider.java:124)
23:56:56 [2021-05-22T03:56:56.138Z] 	at java.base/jdk.internal.reflect.NativeMethodAccessorImpl.invoke0(Native Method)
23:56:56 [2021-05-22T03:56:56.138Z] 	at java.base/jdk.internal.reflect.NativeMethodAccessorImpl.invoke(NativeMethodAccessorImpl.java:64)
23:56:56 [2021-05-22T03:56:56.138Z] 	at java.base/jdk.internal.reflect.DelegatingMethodAccessorImpl.invoke(DelegatingMethodAccessorImpl.java:43)
23:56:56 [2021-05-22T03:56:56.138Z] 	at java.base/java.lang.reflect.Method.invoke(Method.java:564)
23:56:56 [2021-05-22T03:56:56.138Z] 	at org.apache.maven.surefire.util.ReflectionUtils.invokeMethodWithArray2(ReflectionUtils.java:206)
23:56:56 [2021-05-22T03:56:56.138Z] 	at org.apache.maven.surefire.booter.ProviderFactory$ProviderProxy.invoke(ProviderFactory.java:161)
23:56:56 [2021-05-22T03:56:56.138Z] 	at org.apache.maven.surefire.booter.ProviderFactory.invokeProvider(ProviderFactory.java:84)
23:56:56 [2021-05-22T03:56:56.138Z] 	at org.eclipse.tycho.surefire.osgibooter.OsgiSurefireBooter.run(OsgiSurefireBooter.java:116)
23:56:56 [2021-05-22T03:56:56.138Z] 	at org.eclipse.tycho.surefire.osgibooter.HeadlessTestApplication.start(HeadlessTestApplication.java:23)
23:56:56 [2021-05-22T03:56:56.138Z] 	at org.eclipse.equinox.internal.app.EclipseAppHandle.run(EclipseAppHandle.java:203)
23:56:56 [2021-05-22T03:56:56.138Z] 	at org.eclipse.core.runtime.internal.adaptor.EclipseAppLauncher.runApplication(EclipseAppLauncher.java:134)
23:56:56 [2021-05-22T03:56:56.138Z] 	at org.eclipse.core.runtime.internal.adaptor.EclipseAppLauncher.start(EclipseAppLauncher.java:104)
23:56:56 [2021-05-22T03:56:56.138Z] 	at org.eclipse.core.runtime.adaptor.EclipseStarter.run(EclipseStarter.java:401)
23:56:56 [2021-05-22T03:56:56.138Z] 	at org.eclipse.core.runtime.adaptor.EclipseStarter.run(EclipseStarter.java:255)
23:56:56 [2021-05-22T03:56:56.138Z] 	at java.base/jdk.internal.reflect.NativeMethodAccessorImpl.invoke0(Native Method)
23:56:56 [2021-05-22T03:56:56.138Z] 	at java.base/jdk.internal.reflect.NativeMethodAccessorImpl.invoke(NativeMethodAccessorImpl.java:64)
23:56:56 [2021-05-22T03:56:56.139Z] 	at java.base/jdk.internal.reflect.DelegatingMethodAccessorImpl.invoke(DelegatingMethodAccessorImpl.java:43)
23:56:56 [2021-05-22T03:56:56.139Z] 	at java.base/java.lang.reflect.Method.invoke(Method.java:564)
23:56:56 [2021-05-22T03:56:56.139Z] 	at org.eclipse.equinox.launcher.Main.invokeFramework(Main.java:653)
23:56:56 [2021-05-22T03:56:56.139Z] 	at org.eclipse.equinox.launcher.Main.basicRun(Main.java:590)
23:56:56 [2021-05-22T03:56:56.139Z] 	at org.eclipse.equinox.launcher.Main.run(Main.java:1461)
23:56:56 [2021-05-22T03:56:56.139Z] 	at org.eclipse.equinox.launcher.Main.main(Main.java:1434)
23:56:56 [2021-05-22T03:56:56.139Z] Caused by: java.lang.ClassNotFoundException: org.junit.runners.model.RunnerBuilder cannot be found by org.eclipse.tycho.surefire.osgibooter_2.2.0
23:56:56 [2021-05-22T03:56:56.139Z] 	at org.eclipse.osgi.internal.loader.BundleLoader.findClass(BundleLoader.java:516)
23:56:56 [2021-05-22T03:56:56.139Z] 	at org.eclipse.osgi.internal.loader.ModuleClassLoader.loadClass(ModuleClassLoader.java:171)
23:56:56 [2021-05-22T03:56:56.139Z] 	at java.base/java.lang.ClassLoader.loadClass(ClassLoader.java:522)
23:56:56 [2021-05-22T03:56:56.139Z] 	... 31 more
23:56:56 [2021-05-22T03:56:56.139Z] 
23:56:56 [2021-05-22T03:56:56.139Z] May 22, 2021 3:56:56 AM org.junit.platform.launcher.core.DefaultLauncher handleThrowable
23:56:56 [2021-05-22T03:56:56.139Z] WARNING: TestEngine with ID 'junit-vintage' failed to discover tests
23:56:56 [2021-05-22T03:56:56.139Z] java.lang.NoClassDefFoundError: org/junit/runners/model/RunnerBuilder
23:56:56 [2021-05-22T03:56:56.139Z] 	at org.junit.vintage.engine.discovery.VintageDiscoverer.<init>(VintageDiscoverer.java:48)
23:56:56 [2021-05-22T03:56:56.139Z] 	at org.junit.vintage.engine.VintageTestEngine.discover(VintageTestEngine.java:65)
23:56:56 [2021-05-22T03:56:56.139Z] 	at org.junit.platform.launcher.core.DefaultLauncher.discoverEngineRoot(DefaultLauncher.java:130)
23:56:56 [2021-05-22T03:56:56.139Z] 	at org.junit.platform.launcher.core.DefaultLauncher.discoverRoot(DefaultLauncher.java:117)
23:56:56 [2021-05-22T03:56:56.139Z] 	at org.junit.platform.launcher.core.DefaultLauncher.discover(DefaultLauncher.java:82)
23:56:56 [2021-05-22T03:56:56.139Z] 	at org.apache.maven.surefire.junitplatform.TestPlanScannerFilter.accept(TestPlanScannerFilter.java:56)
23:56:56 [2021-05-22T03:56:56.139Z] 	at org.apache.maven.surefire.util.DefaultScanResult.applyFilter(DefaultScanResult.java:102)
23:56:56 [2021-05-22T03:56:56.139Z] 	at org.apache.maven.surefire.junitplatform.JUnitPlatformProvider.scanClasspath(JUnitPlatformProvider.java:143)
23:56:56 [2021-05-22T03:56:56.139Z] 	at org.apache.maven.surefire.junitplatform.JUnitPlatformProvider.invoke(JUnitPlatformProvider.java:124)
23:56:56 [2021-05-22T03:56:56.139Z] 	at java.base/jdk.internal.reflect.NativeMethodAccessorImpl.invoke0(Native Method)
23:56:56 [2021-05-22T03:56:56.139Z] 	at java.base/jdk.internal.reflect.NativeMethodAccessorImpl.invoke(NativeMethodAccessorImpl.java:64)
23:56:56 [2021-05-22T03:56:56.139Z] 	at java.base/jdk.internal.reflect.DelegatingMethodAccessorImpl.invoke(DelegatingMethodAccessorImpl.java:43)
23:56:56 [2021-05-22T03:56:56.139Z] 	at java.base/java.lang.reflect.Method.invoke(Method.java:564)
23:56:56 [2021-05-22T03:56:56.139Z] 	at org.apache.maven.surefire.util.ReflectionUtils.invokeMethodWithArray2(ReflectionUtils.java:206)
23:56:56 [2021-05-22T03:56:56.139Z] 	at org.apache.maven.surefire.booter.ProviderFactory$ProviderProxy.invoke(ProviderFactory.java:161)
23:56:56 [2021-05-22T03:56:56.139Z] 	at org.apache.maven.surefire.booter.ProviderFactory.invokeProvider(ProviderFactory.java:84)
23:56:56 [2021-05-22T03:56:56.139Z] 	at org.eclipse.tycho.surefire.osgibooter.OsgiSurefireBooter.run(OsgiSurefireBooter.java:116)
23:56:56 [2021-05-22T03:56:56.139Z] 	at org.eclipse.tycho.surefire.osgibooter.HeadlessTestApplication.start(HeadlessTestApplication.java:23)
23:56:56 [2021-05-22T03:56:56.139Z] 	at org.eclipse.equinox.internal.app.EclipseAppHandle.run(EclipseAppHandle.java:203)
23:56:56 [2021-05-22T03:56:56.139Z] 	at org.eclipse.core.runtime.internal.adaptor.EclipseAppLauncher.runApplication(EclipseAppLauncher.java:134)
23:56:56 [2021-05-22T03:56:56.139Z] 	at org.eclipse.core.runtime.internal.adaptor.EclipseAppLauncher.start(EclipseAppLauncher.java:104)
23:56:56 [2021-05-22T03:56:56.139Z] 	at org.eclipse.core.runtime.adaptor.EclipseStarter.run(EclipseStarter.java:401)
23:56:56 [2021-05-22T03:56:56.139Z] 	at org.eclipse.core.runtime.adaptor.EclipseStarter.run(EclipseStarter.java:255)
23:56:56 [2021-05-22T03:56:56.139Z] 	at java.base/jdk.internal.reflect.NativeMethodAccessorImpl.invoke0(Native Method)
23:56:56 [2021-05-22T03:56:56.139Z] 	at java.base/jdk.internal.reflect.NativeMethodAccessorImpl.invoke(NativeMethodAccessorImpl.java:64)
23:56:56 [2021-05-22T03:56:56.139Z] 	at java.base/jdk.internal.reflect.DelegatingMethodAccessorImpl.invoke(DelegatingMethodAccessorImpl.java:43)
23:56:56 [2021-05-22T03:56:56.139Z] 	at java.base/java.lang.reflect.Method.invoke(Method.java:564)
23:56:56 [2021-05-22T03:56:56.139Z] 	at org.eclipse.equinox.launcher.Main.invokeFramework(Main.java:653)
23:56:56 [2021-05-22T03:56:56.139Z] 	at org.eclipse.equinox.launcher.Main.basicRun(Main.java:590)
23:56:56 [2021-05-22T03:56:56.139Z] 	at org.eclipse.equinox.launcher.Main.run(Main.java:1461)
23:56:56 [2021-05-22T03:56:56.139Z] 	at org.eclipse.equinox.launcher.Main.main(Main.java:1434)
23:56:56 [2021-05-22T03:56:56.139Z] Caused by: java.lang.ClassNotFoundException: org.junit.runners.model.RunnerBuilder cannot be found by org.eclipse.tycho.surefire.osgibooter_2.2.0
23:56:56 [2021-05-22T03:56:56.139Z] 	at org.eclipse.osgi.internal.loader.BundleLoader.findClass(BundleLoader.java:516)
23:56:56 [2021-05-22T03:56:56.139Z] 	at org.eclipse.osgi.internal.loader.ModuleClassLoader.loadClass(ModuleClassLoader.java:171)
23:56:56 [2021-05-22T03:56:56.139Z] 	at java.base/java.lang.ClassLoader.loadClass(ClassLoader.java:522)
23:56:56 [2021-05-22T03:56:56.139Z] 	... 31 more
23:56:56 [2021-05-22T03:56:56.139Z] 
23:56:56 [2021-05-22T03:56:56.397Z] May 22, 2021 3:56:56 AM org.junit.platform.launcher.core.DefaultLauncher handleThrowable
23:56:56 [2021-05-22T03:56:56.397Z] WARNING: TestEngine with ID 'junit-vintage' failed to discover tests
23:56:56 [2021-05-22T03:56:56.397Z] java.lang.NoClassDefFoundError: org/junit/runners/model/RunnerBuilder
23:56:56 [2021-05-22T03:56:56.397Z] 	at org.junit.vintage.engine.discovery.VintageDiscoverer.<init>(VintageDiscoverer.java:48)
23:56:56 [2021-05-22T03:56:56.397Z] 	at org.junit.vintage.engine.VintageTestEngine.discover(VintageTestEngine.java:65)
23:56:56 [2021-05-22T03:56:56.397Z] 	at org.junit.platform.launcher.core.DefaultLauncher.discoverEngineRoot(DefaultLauncher.java:130)
23:56:56 [2021-05-22T03:56:56.397Z] 	at org.junit.platform.launcher.core.DefaultLauncher.discoverRoot(DefaultLauncher.java:117)
23:56:56 [2021-05-22T03:56:56.397Z] 	at org.junit.platform.launcher.core.DefaultLauncher.discover(DefaultLauncher.java:82)
23:56:56 [2021-05-22T03:56:56.397Z] 	at org.apache.maven.surefire.junitplatform.TestPlanScannerFilter.accept(TestPlanScannerFilter.java:56)
23:56:56 [2021-05-22T03:56:56.397Z] 	at org.apache.maven.surefire.util.DefaultScanResult.applyFilter(DefaultScanResult.java:102)
23:56:56 [2021-05-22T03:56:56.397Z] 	at org.apache.maven.surefire.junitplatform.JUnitPlatformProvider.scanClasspath(JUnitPlatformProvider.java:143)
23:56:56 [2021-05-22T03:56:56.397Z] 	at org.apache.maven.surefire.junitplatform.JUnitPlatformProvider.invoke(JUnitPlatformProvider.java:124)
23:56:56 [2021-05-22T03:56:56.397Z] 	at java.base/jdk.internal.reflect.NativeMethodAccessorImpl.invoke0(Native Method)
23:56:56 [2021-05-22T03:56:56.397Z] 	at java.base/jdk.internal.reflect.NativeMethodAccessorImpl.invoke(NativeMethodAccessorImpl.java:64)
23:56:56 [2021-05-22T03:56:56.397Z] 	at java.base/jdk.internal.reflect.DelegatingMethodAccessorImpl.invoke(DelegatingMethodAccessorImpl.java:43)
23:56:56 [2021-05-22T03:56:56.397Z] 	at java.base/java.lang.reflect.Method.invoke(Method.java:564)
23:56:56 [2021-05-22T03:56:56.397Z] 	at org.apache.maven.surefire.util.ReflectionUtils.invokeMethodWithArray2(ReflectionUtils.java:206)
23:56:56 [2021-05-22T03:56:56.397Z] 	at org.apache.maven.surefire.booter.ProviderFactory$ProviderProxy.invoke(ProviderFactory.java:161)
23:56:56 [2021-05-22T03:56:56.397Z] 	at org.apache.maven.surefire.booter.ProviderFactory.invokeProvider(ProviderFactory.java:84)
23:56:56 [2021-05-22T03:56:56.397Z] 	at org.eclipse.tycho.surefire.osgibooter.OsgiSurefireBooter.run(OsgiSurefireBooter.java:116)
23:56:56 [2021-05-22T03:56:56.397Z] 	at org.eclipse.tycho.surefire.osgibooter.HeadlessTestApplication.start(HeadlessTestApplication.java:23)
23:56:56 [2021-05-22T03:56:56.397Z] 	at org.eclipse.equinox.internal.app.EclipseAppHandle.run(EclipseAppHandle.java:203)
23:56:56 [2021-05-22T03:56:56.397Z] 	at org.eclipse.core.runtime.internal.adaptor.EclipseAppLauncher.runApplication(EclipseAppLauncher.java:134)
23:56:56 [2021-05-22T03:56:56.397Z] 	at org.eclipse.core.runtime.internal.adaptor.EclipseAppLauncher.start(EclipseAppLauncher.java:104)
23:56:56 [2021-05-22T03:56:56.397Z] 	at org.eclipse.core.runtime.adaptor.EclipseStarter.run(EclipseStarter.java:401)
23:56:56 [2021-05-22T03:56:56.397Z] 	at org.eclipse.core.runtime.adaptor.EclipseStarter.run(EclipseStarter.java:255)
23:56:56 [2021-05-22T03:56:56.397Z] 	at java.base/jdk.internal.reflect.NativeMethodAccessorImpl.invoke0(Native Method)
23:56:56 [2021-05-22T03:56:56.397Z] 	at java.base/jdk.internal.reflect.NativeMethodAccessorImpl.invoke(NativeMethodAccessorImpl.java:64)
23:56:56 [2021-05-22T03:56:56.397Z] 	at java.base/jdk.internal.reflect.DelegatingMethodAccessorImpl.invoke(DelegatingMethodAccessorImpl.java:43)
23:56:56 [2021-05-22T03:56:56.397Z] 	at java.base/java.lang.reflect.Method.invoke(Method.java:564)
23:56:56 [2021-05-22T03:56:56.398Z] 	at org.eclipse.equinox.launcher.Main.invokeFramework(Main.java:653)
23:56:56 [2021-05-22T03:56:56.398Z] 	at org.eclipse.equinox.launcher.Main.basicRun(Main.java:590)
23:56:56 [2021-05-22T03:56:56.398Z] 	at org.eclipse.equinox.launcher.Main.run(Main.java:1461)
23:56:56 [2021-05-22T03:56:56.398Z] 	at org.eclipse.equinox.launcher.Main.main(Main.java:1434)
23:56:56 [2021-05-22T03:56:56.398Z] Caused by: java.lang.ClassNotFoundException: org.junit.runners.model.RunnerBuilder cannot be found by org.eclipse.tycho.surefire.osgibooter_2.2.0
23:56:56 [2021-05-22T03:56:56.398Z] 	at org.eclipse.osgi.internal.loader.BundleLoader.findClass(BundleLoader.java:516)
23:56:56 [2021-05-22T03:56:56.398Z] 	at org.eclipse.osgi.internal.loader.ModuleClassLoader.loadClass(ModuleClassLoader.java:171)
23:56:56 [2021-05-22T03:56:56.398Z] 	at java.base/java.lang.ClassLoader.loadClass(ClassLoader.java:522)
23:56:56 [2021-05-22T03:56:56.398Z] 	... 31 more
23:56:56 [2021-05-22T03:56:56.398Z] 
23:56:56 [2021-05-22T03:56:56.398Z] May 22, 2021 3:56:56 AM org.junit.platform.launcher.core.DefaultLauncher handleThrowable
23:56:56 [2021-05-22T03:56:56.398Z] WARNING: TestEngine with ID 'junit-vintage' failed to discover tests
23:56:56 [2021-05-22T03:56:56.398Z] java.lang.NoClassDefFoundError: org/junit/runners/model/RunnerBuilder
23:56:56 [2021-05-22T03:56:56.398Z] 	at org.junit.vintage.engine.discovery.VintageDiscoverer.<init>(VintageDiscoverer.java:48)
23:56:56 [2021-05-22T03:56:56.398Z] 	at org.junit.vintage.engine.VintageTestEngine.discover(VintageTestEngine.java:65)
23:56:56 [2021-05-22T03:56:56.398Z] 	at org.junit.platform.launcher.core.DefaultLauncher.discoverEngineRoot(DefaultLauncher.java:130)
23:56:56 [2021-05-22T03:56:56.398Z] 	at org.junit.platform.launcher.core.DefaultLauncher.discoverRoot(DefaultLauncher.java:117)
23:56:56 [2021-05-22T03:56:56.398Z] 	at org.junit.platform.launcher.core.DefaultLauncher.execute(DefaultLauncher.java:90)
23:56:56 [2021-05-22T03:56:56.398Z] 	at org.apache.maven.surefire.junitplatform.JUnitPlatformProvider.invokeAllTests(JUnitPlatformProvider.java:150)
23:56:56 [2021-05-22T03:56:56.398Z] 	at org.apache.maven.surefire.junitplatform.JUnitPlatformProvider.invoke(JUnitPlatformProvider.java:124)
23:56:56 [2021-05-22T03:56:56.398Z] 	at java.base/jdk.internal.reflect.NativeMethodAccessorImpl.invoke0(Native Method)
23:56:56 [2021-05-22T03:56:56.398Z] 	at java.base/jdk.internal.reflect.NativeMethodAccessorImpl.invoke(NativeMethodAccessorImpl.java:64)
23:56:56 [2021-05-22T03:56:56.398Z] 	at java.base/jdk.internal.reflect.DelegatingMethodAccessorImpl.invoke(DelegatingMethodAccessorImpl.java:43)
23:56:56 [2021-05-22T03:56:56.398Z] 	at java.base/java.lang.reflect.Method.invoke(Method.java:564)
23:56:56 [2021-05-22T03:56:56.398Z] 	at org.apache.maven.surefire.util.ReflectionUtils.invokeMethodWithArray2(ReflectionUtils.java:206)
23:56:56 [2021-05-22T03:56:56.398Z] 	at org.apache.maven.surefire.booter.ProviderFactory$ProviderProxy.invoke(ProviderFactory.java:161)
23:56:56 [2021-05-22T03:56:56.398Z] 	at org.apache.maven.surefire.booter.ProviderFactory.invokeProvider(ProviderFactory.java:84)
23:56:56 [2021-05-22T03:56:56.398Z] 	at org.eclipse.tycho.surefire.osgibooter.OsgiSurefireBooter.run(OsgiSurefireBooter.java:116)
23:56:56 [2021-05-22T03:56:56.398Z] 	at org.eclipse.tycho.surefire.osgibooter.HeadlessTestApplication.start(HeadlessTestApplication.java:23)
23:56:56 [2021-05-22T03:56:56.398Z] 	at org.eclipse.equinox.internal.app.EclipseAppHandle.run(EclipseAppHandle.java:203)
23:56:56 [2021-05-22T03:56:56.398Z] 	at org.eclipse.core.runtime.internal.adaptor.EclipseAppLauncher.runApplication(EclipseAppLauncher.java:134)
23:56:56 [2021-05-22T03:56:56.398Z] 	at org.eclipse.core.runtime.internal.adaptor.EclipseAppLauncher.start(EclipseAppLauncher.java:104)
23:56:56 [2021-05-22T03:56:56.398Z] 	at org.eclipse.core.runtime.adaptor.EclipseStarter.run(EclipseStarter.java:401)
23:56:56 [2021-05-22T03:56:56.398Z] 	at org.eclipse.core.runtime.adaptor.EclipseStarter.run(EclipseStarter.java:255)
23:56:56 [2021-05-22T03:56:56.398Z] 	at java.base/jdk.internal.reflect.NativeMethodAccessorImpl.invoke0(Native Method)
23:56:56 [2021-05-22T03:56:56.398Z] 	at java.base/jdk.internal.reflect.NativeMethodAccessorImpl.invoke(NativeMethodAccessorImpl.java:64)
23:56:56 [2021-05-22T03:56:56.398Z] 	at java.base/jdk.internal.reflect.DelegatingMethodAccessorImpl.invoke(DelegatingMethodAccessorImpl.java:43)
23:56:56 [2021-05-22T03:56:56.398Z] 	at java.base/java.lang.reflect.Method.invoke(Method.java:564)
23:56:56 [2021-05-22T03:56:56.398Z] 	at org.eclipse.equinox.launcher.Main.invokeFramework(Main.java:653)
23:56:56 [2021-05-22T03:56:56.398Z] 	at org.eclipse.equinox.launcher.Main.basicRun(Main.java:590)
23:56:56 [2021-05-22T03:56:56.398Z] 	at org.eclipse.equinox.launcher.Main.run(Main.java:1461)
23:56:56 [2021-05-22T03:56:56.398Z] 	at org.eclipse.equinox.launcher.Main.main(Main.java:1434)
23:56:56 [2021-05-22T03:56:56.398Z] Caused by: java.lang.ClassNotFoundException: org.junit.runners.model.RunnerBuilder cannot be found by org.eclipse.tycho.surefire.osgibooter_2.2.0
23:56:56 [2021-05-22T03:56:56.398Z] 	at org.eclipse.osgi.internal.loader.BundleLoader.findClass(BundleLoader.java:516)
23:56:56 [2021-05-22T03:56:56.398Z] 	at org.eclipse.osgi.internal.loader.ModuleClassLoader.loadClass(ModuleClassLoader.java:171)
23:56:56 [2021-05-22T03:56:56.398Z] 	at java.base/java.lang.ClassLoader.loadClass(ClassLoader.java:522)
23:56:56 [2021-05-22T03:56:56.398Z] 	... 29 more
23:56:56 [2021-05-22T03:56:56.398Z] 
23:56:56 [2021-05-22T03:56:56.398Z] Running org.eclipse.ease.ui.views.shell.dropins.variables.VariablesComparatorTest
23:56:57 [2021-05-22T03:56:57.773Z] Tests run: 1, Failures: 0, Errors: 0, Skipped: 0, Time elapsed: 1.114 s - in org.eclipse.ease.ui.views.shell.dropins.variables.VariablesComparatorTest
23:56:57 [2021-05-22T03:56:57.773Z] lastExecutionResult_comes_before_debugVariable  Time elapsed: 1.106 s
23:56:57 [2021-05-22T03:56:57.773Z] Running org.eclipse.ease.ui.views.shell.dropins.variables.HiddenVariablesFilterTest
23:56:57 [2021-05-22T03:56:57.773Z] Tests run: 3, Failures: 0, Errors: 0, Skipped: 0, Time elapsed: 0.018 s - in org.eclipse.ease.ui.views.shell.dropins.variables.HiddenVariablesFilterTest
23:56:57 [2021-05-22T03:56:57.773Z] select_accepts_unknown_classes  Time elapsed: 0.001 s
23:56:57 [2021-05-22T03:56:57.773Z] select_accepts_script_variables  Time elapsed: 0.016 s
23:56:57 [2021-05-22T03:56:57.773Z] select_declines_hidden_script_variables  Time elapsed: 0.001 s
23:56:57 [2021-05-22T03:56:57.773Z] Running org.eclipse.ease.ui.views.shell.dropins.variables.ContentLabelProviderTest
23:56:57 [2021-05-22T03:56:57.773Z] Tests run: 1, Failures: 0, Errors: 0, Skipped: 0, Time elapsed: 0.081 s - in org.eclipse.ease.ui.views.shell.dropins.variables.ContentLabelProviderTest
23:56:57 [2021-05-22T03:56:57.773Z] getText_returns_variable_content  Time elapsed: 0.081 s
23:56:57 [2021-05-22T03:56:57.773Z] Running org.eclipse.ease.ui.views.shell.dropins.variables.VariablesLabelProviderTest
23:56:57 [2021-05-22T03:56:57.773Z] Tests run: 1, Failures: 0, Errors: 0, Skipped: 0, Time elapsed: 0.003 s - in org.eclipse.ease.ui.views.shell.dropins.variables.VariablesLabelProviderTest
23:56:57 [2021-05-22T03:56:57.773Z] getText_returns_variable_name  Time elapsed: 0.002 s
23:56:57 [2021-05-22T03:56:57.773Z] Running org.eclipse.ease.ui.views.shell.dropins.variables.VariablesContentProviderTest
23:56:57 [2021-05-22T03:56:57.773Z] Tests run: 5, Failures: 0, Errors: 0, Skipped: 0, Time elapsed: 0.083 s - in org.eclipse.ease.ui.views.shell.dropins.variables.VariablesContentProviderTest
23:56:57 [2021-05-22T03:56:57.773Z] hasChildren_true_when_child_nodes_are_available  Time elapsed: 0.001 s
23:56:57 [2021-05-22T03:56:57.773Z] getChildren_is_empty_when_no_child_nodes_are_available  Time elapsed: 0.004 s
23:56:57 [2021-05-22T03:56:57.773Z] getElements_contains_variables_from_engine  Time elapsed: 0.075 s
23:56:57 [2021-05-22T03:56:57.773Z] hasChildren_false_when_no_child_nodes_are_available  Time elapsed: 0.001 s
23:56:57 [2021-05-22T03:56:57.773Z] getChildren_not_empty_when_child_nodes_are_available  Time elapsed: 0.001 s
23:56:57 [2021-05-22T03:56:57.773Z] Running org.eclipse.ease.ui.views.shell.dropins.modules.ModulesStackContentProviderTest
23:56:57 [2021-05-22T03:56:57.773Z] Tests run: 2, Failures: 0, Errors: 0, Skipped: 0, Time elapsed: 0.107 s - in org.eclipse.ease.ui.views.shell.dropins.modules.ModulesStackContentProviderTest
23:56:57 [2021-05-22T03:56:57.773Z] getElements_returns_modules  Time elapsed: 0.106 s
23:56:57 [2021-05-22T03:56:57.773Z] getElements_returns_empty_list_without_environment  Time elapsed: 0.001 s
23:56:57 [2021-05-22T03:56:57.773Z] Running org.eclipse.ease.ui.views.shell.dropins.modules.ModulesStackLabelProviderTest
23:56:57 [2021-05-22T03:56:57.773Z] Tests run: 3, Failures: 0, Errors: 0, Skipped: 0, Time elapsed: 0.082 s - in org.eclipse.ease.ui.views.shell.dropins.modules.ModulesStackLabelProviderTest
23:56:57 [2021-05-22T03:56:57.773Z] getText_null_returns_empty_string  Time elapsed: 0.001 s
23:56:57 [2021-05-22T03:56:57.773Z] getText_returns_definition_name  Time elapsed: 0.08 s
23:56:57 [2021-05-22T03:56:57.773Z] getText_returns_full_class_name_name  Time elapsed: 0 s
23:56:57 [2021-05-22T03:56:57.773Z] Running org.eclipse.ease.ui.help.hovers.ModuleHelpTest
23:56:57 [2021-05-22T03:56:57.773Z] Tests run: 4, Failures: 0, Errors: 0, Skipped: 4, Time elapsed: 0.002 s - in org.eclipse.ease.ui.help.hovers.ModuleHelpTest
23:56:57 [2021-05-22T03:56:57.773Z] getModuleHelpLocation skipped
23:56:57 [2021-05-22T03:56:57.773Z] getModuleHelp skipped
23:56:57 [2021-05-22T03:56:57.773Z] getMethodHelp skipped
23:56:57 [2021-05-22T03:56:57.773Z] getConstantHelp skipped
23:56:57 [2021-05-22T03:56:57.773Z] Running org.eclipse.ease.ui.dnd.ModulesDropHandlerTest
23:56:58 [2021-05-22T03:56:58.031Z] Tests run: 2, Failures: 0, Errors: 0, Skipped: 0, Time elapsed: 0.021 s - in org.eclipse.ease.ui.dnd.ModulesDropHandlerTest
23:56:58 [2021-05-22T03:56:58.031Z] accepts_true_for_ModuleEntry  Time elapsed: 0.021 s
23:56:58 [2021-05-22T03:56:58.031Z] accepts_true_for_ModuleDefinition  Time elapsed: 0 s
23:56:58 [2021-05-22T03:56:58.031Z] Running org.eclipse.ease.ui.completion.CompletionContextTest
23:56:58 [2021-05-22T03:56:58.031Z] Tests run: 9, Failures: 0, Errors: 0, Skipped: 0, Time elapsed: 0.009 s - in org.eclipse.ease.ui.completion.CompletionContextTest
23:56:58 [2021-05-22T03:56:58.031Z] resolveStaticClass  Time elapsed: 0.005 s
23:56:58 [2021-05-22T03:56:58.031Z] resolveClassWithFilter  Time elapsed: 0 s
23:56:58 [2021-05-22T03:56:58.031Z] simplifyCalls  Time elapsed: 0 s
23:56:58 [2021-05-22T03:56:58.031Z] resolveClass  Time elapsed: 0 s
23:56:58 [2021-05-22T03:56:58.031Z] replaceEscapedStringLiterals  Time elapsed: 0.001 s
23:56:58 [2021-05-22T03:56:58.031Z] replaceSimpleStringLiterals  Time elapsed: 0 s
23:56:58 [2021-05-22T03:56:58.031Z] resolveStaticClassWithFilter  Time elapsed: 0 s
23:56:58 [2021-05-22T03:56:58.031Z] resolveClassWithParameters  Time elapsed: 0 s
23:56:58 [2021-05-22T03:56:58.031Z] replaceMultipleStringLiterals  Time elapsed: 0 s
23:56:58 [2021-05-22T03:56:58.031Z] Running org.eclipse.ease.ui.completion.provider.AbstractFileLocationCompletionProviderTest
23:56:58 [2021-05-22T03:56:58.031Z] Tests run: 8, Failures: 0, Errors: 0, Skipped: 8, Time elapsed: 0.034 s - in org.eclipse.ease.ui.completion.provider.AbstractFileLocationCompletionProviderTest
23:56:58 [2021-05-22T03:56:58.031Z] workspaceProjectProposals skipped
23:56:58 [2021-05-22T03:56:58.031Z] checkOperatingSystem skipped
23:56:58 [2021-05-22T03:56:58.031Z] absoluteRootWorkspaceProposals skipped
23:56:58 [2021-05-22T03:56:58.032Z] workspaceFolderProposals skipped
23:56:58 [2021-05-22T03:56:58.032Z] fileSystemFolderProposals skipped
23:56:58 [2021-05-22T03:56:58.032Z] workspaceProposals skipped
23:56:58 [2021-05-22T03:56:58.032Z] relativeRootWorkspaceProposals skipped
23:56:58 [2021-05-22T03:56:58.032Z] fileSystemRootProposals skipped
23:56:58 [2021-05-22T03:56:58.032Z] 
23:56:58 [2021-05-22T03:56:58.032Z] Results:
23:56:58 [2021-05-22T03:56:58.032Z] 
23:56:58 [2021-05-22T03:56:58.032Z] Tests run: 39, Failures: 0, Errors: 0, Skipped: 12
23:56:58 [2021-05-22T03:56:58.032Z] 
23:56:58 [2021-05-22T03:56:58.965Z] [INFO] All tests passed!
23:56:58 [2021-05-22T03:56:58.965Z] [INFO] 
23:56:58 [2021-05-22T03:56:58.965Z] [INFO] --- maven-pmd-plugin:3.14.0:pmd (pmd-integration) @ org.eclipse.ease.ui.test ---
23:56:59 [2021-05-22T03:56:59.928Z] [INFO] 
23:56:59 [2021-05-22T03:56:59.928Z] [INFO] --- maven-pmd-plugin:3.14.0:cpd (pmd-integration) @ org.eclipse.ease.ui.test ---
23:56:59 [2021-05-22T03:56:59.928Z] [INFO] 
23:56:59 [2021-05-22T03:56:59.928Z] [INFO] --- spotbugs-maven-plugin:4.1.4:spotbugs (spotbugs-integration) @ org.eclipse.ease.ui.test ---
23:56:59 [2021-05-22T03:56:59.928Z] [INFO] Fork Value is false
23:57:00 [2021-05-22T03:57:00.187Z]      [java] JVM args ignored when same JVM is used.
23:57:04 [2021-05-22T03:57:04.384Z] [INFO] Done SpotBugs Analysis....
23:57:04 [2021-05-22T03:57:04.384Z] [INFO] 
23:57:04 [2021-05-22T03:57:04.384Z] [INFO] --- maven-checkstyle-plugin:3.1.1:check (checkstyle-integration) @ org.eclipse.ease.ui.test ---
23:57:04 [2021-05-22T03:57:04.384Z] [INFO] You have 0 Checkstyle violations.
23:57:04 [2021-05-22T03:57:04.384Z] [INFO] 
23:57:04 [2021-05-22T03:57:04.384Z] [INFO] --- maven-install-plugin:2.3.1:install (default-install) @ org.eclipse.ease.ui.test ---
23:57:04 [2021-05-22T03:57:04.384Z] [INFO] Installing /home/jenkins/agent/workspace/ease.verify.core.target.2018-12/tests/org.eclipse.ease.ui.test/target/org.eclipse.ease.ui.test-0.8.0-SNAPSHOT.jar to /home/jenkins/.m2/repository/org/eclipse/ease/org.eclipse.ease.ui.test/0.8.0-SNAPSHOT/org.eclipse.ease.ui.test-0.8.0-SNAPSHOT.jar
23:57:04 [2021-05-22T03:57:04.384Z] [INFO] Installing /home/jenkins/agent/workspace/ease.verify.core.target.2018-12/tests/org.eclipse.ease.ui.test/pom.xml to /home/jenkins/.m2/repository/org/eclipse/ease/org.eclipse.ease.ui.test/0.8.0-SNAPSHOT/org.eclipse.ease.ui.test-0.8.0-SNAPSHOT.pom
23:57:04 [2021-05-22T03:57:04.384Z] [INFO] Installing /home/jenkins/agent/workspace/ease.verify.core.target.2018-12/tests/org.eclipse.ease.ui.test/target/p2content.xml to /home/jenkins/.m2/repository/org/eclipse/ease/org.eclipse.ease.ui.test/0.8.0-SNAPSHOT/org.eclipse.ease.ui.test-0.8.0-SNAPSHOT-p2metadata.xml
23:57:04 [2021-05-22T03:57:04.384Z] [INFO] Installing /home/jenkins/agent/workspace/ease.verify.core.target.2018-12/tests/org.eclipse.ease.ui.test/target/p2artifacts.xml to /home/jenkins/.m2/repository/org/eclipse/ease/org.eclipse.ease.ui.test/0.8.0-SNAPSHOT/org.eclipse.ease.ui.test-0.8.0-SNAPSHOT-p2artifacts.xml
23:57:04 [2021-05-22T03:57:04.384Z] [INFO] 
23:57:04 [2021-05-22T03:57:04.384Z] [INFO] --- tycho-p2-plugin:2.2.0:update-local-index (default-update-local-index) @ org.eclipse.ease.ui.test ---
23:57:04 [2021-05-22T03:57:04.384Z] [INFO] 
23:57:04 [2021-05-22T03:57:04.384Z] [INFO] ---------< org.eclipse.ease:org.eclipse.ease.releng.coverage >----------
23:57:04 [2021-05-22T03:57:04.384Z] [INFO] Building org.eclipse.ease.releng.coverage 0.8.0-SNAPSHOT         [47/48]
23:57:04 [2021-05-22T03:57:04.384Z] [INFO] --------------------------------[ pom ]---------------------------------
23:57:04 [2021-05-22T03:57:04.384Z] [INFO] 
23:57:04 [2021-05-22T03:57:04.384Z] [INFO] --- maven-clean-plugin:2.5:clean (default-clean) @ org.eclipse.ease.releng.coverage ---
23:57:04 [2021-05-22T03:57:04.384Z] [INFO] 
23:57:04 [2021-05-22T03:57:04.384Z] [INFO] --- jacoco-maven-plugin:0.8.6:report-aggregate (default) @ org.eclipse.ease.releng.coverage ---
23:57:04 [2021-05-22T03:57:04.642Z] [INFO] Loading execution data file /home/jenkins/agent/workspace/ease.verify.core.target.2018-12/tests/org.eclipse.ease.test/target/jacoco.exec
23:57:04 [2021-05-22T03:57:04.642Z] [INFO] Loading execution data file /home/jenkins/agent/workspace/ease.verify.core.target.2018-12/tests/org.eclipse.ease.lang.javascript.rhino.test/target/jacoco.exec
23:57:04 [2021-05-22T03:57:04.642Z] [INFO] Loading execution data file /home/jenkins/agent/workspace/ease.verify.core.target.2018-12/tests/org.eclipse.ease.lang.javascript.test/target/jacoco.exec
23:57:04 [2021-05-22T03:57:04.642Z] [INFO] Loading execution data file /home/jenkins/agent/workspace/ease.verify.core.target.2018-12/tests/org.eclipse.ease.lang.python.test/target/jacoco.exec
23:57:04 [2021-05-22T03:57:04.642Z] [INFO] Loading execution data file /home/jenkins/agent/workspace/ease.verify.core.target.2018-12/tests/org.eclipse.ease.lang.python.jython.test/target/jacoco.exec
23:57:04 [2021-05-22T03:57:04.642Z] [INFO] Loading execution data file /home/jenkins/agent/workspace/ease.verify.core.target.2018-12/tests/org.eclipse.ease.lang.scriptarchive.test/target/jacoco.exec
23:57:04 [2021-05-22T03:57:04.642Z] [INFO] Loading execution data file /home/jenkins/agent/workspace/ease.verify.core.target.2018-12/tests/org.eclipse.ease.ui.scripts.test/target/jacoco.exec
23:57:04 [2021-05-22T03:57:04.642Z] [INFO] Loading execution data file /home/jenkins/agent/workspace/ease.verify.core.target.2018-12/tests/org.eclipse.ease.ui.test/target/jacoco.exec
23:57:04 [2021-05-22T03:57:04.899Z] [INFO] Analyzed bundle 'org.eclipse.ease' with 106 classes
23:57:05 [2021-05-22T03:57:05.156Z] [INFO] Analyzed bundle 'org.eclipse.ease.classloader' with 1 classes
23:57:05 [2021-05-22T03:57:05.430Z] [INFO] Analyzed bundle 'org.eclipse.ease.ui' with 211 classes
23:57:05 [2021-05-22T03:57:05.687Z] [INFO] Analyzed bundle 'org.eclipse.ease.ui.completions.java' with 13 classes
23:57:05 [2021-05-22T03:57:05.945Z] [INFO] Analyzed bundle 'org.eclipse.ease.ui.scripts' with 157 classes
23:57:06 [2021-05-22T03:57:06.202Z] [INFO] Analyzed bundle 'org.eclipse.ease.help' with 0 classes
23:57:06 [2021-05-22T03:57:06.202Z] [INFO] Analyzed bundle 'org.eclipse.ease.lang.javascript' with 4 classes
23:57:06 [2021-05-22T03:57:06.202Z] [INFO] Analyzed bundle 'org.eclipse.ease.lang.javascript.ui' with 4 classes
23:57:06 [2021-05-22T03:57:06.460Z] [INFO] Analyzed bundle 'org.eclipse.ease.lang.javascript.rhino' with 21 classes
23:57:06 [2021-05-22T03:57:06.460Z] [INFO] Analyzed bundle 'org.eclipse.ease.lang.javascript.nashorn' with 2 classes
23:57:06 [2021-05-22T03:57:06.460Z] [INFO] Analyzed bundle 'org.eclipse.ease.lang.python' with 21 classes
23:57:06 [2021-05-22T03:57:06.460Z] [INFO] Analyzed bundle 'org.eclipse.ease.lang.python.jython' with 13 classes
23:57:06 [2021-05-22T03:57:06.460Z] [INFO] Analyzed bundle 'org.eclipse.ease.lang.python.py4j' with 11 classes
23:57:06 [2021-05-22T03:57:06.460Z] [INFO] Analyzed bundle 'org.eclipse.ease.lang.jvm.compiled' with 2 classes
23:57:06 [2021-05-22T03:57:06.718Z] [INFO] Analyzed bundle 'org.eclipse.ease.lang.groovy' with 3 classes
23:57:06 [2021-05-22T03:57:06.718Z] [INFO] Analyzed bundle 'org.eclipse.ease.lang.groovy.interpreter' with 3 classes
23:57:06 [2021-05-22T03:57:06.718Z] [INFO] Analyzed bundle 'org.eclipse.ease.lang.ruby' with 3 classes
23:57:06 [2021-05-22T03:57:06.718Z] [INFO] Analyzed bundle 'org.eclipse.ease.lang.ruby.jruby' with 2 classes
23:57:06 [2021-05-22T03:57:06.718Z] [INFO] Analyzed bundle 'org.eclipse.ease.lang.scriptarchive' with 3 classes
23:57:06 [2021-05-22T03:57:06.718Z] [INFO] Analyzed bundle 'org.eclipse.ease.lang.scriptarchive.ui' with 8 classes
23:57:06 [2021-05-22T03:57:06.718Z] [INFO] Analyzed bundle 'org.eclipse.ease.lang.unittest' with 50 classes
23:57:06 [2021-05-22T03:57:06.985Z] [INFO] Analyzed bundle 'org.eclipse.ease.lang.unittest.ui' with 79 classes
23:57:07 [2021-05-22T03:57:07.242Z] [INFO] 
23:57:07 [2021-05-22T03:57:07.242Z] [INFO] --- maven-install-plugin:2.4:install (default-install) @ org.eclipse.ease.releng.coverage ---
23:57:07 [2021-05-22T03:57:07.242Z] [INFO] Installing /home/jenkins/agent/workspace/ease.verify.core.target.2018-12/releng/org.eclipse.ease.releng.coverage/pom.xml to /home/jenkins/.m2/repository/org/eclipse/ease/org.eclipse.ease.releng.coverage/0.8.0-SNAPSHOT/org.eclipse.ease.releng.coverage-0.8.0-SNAPSHOT.pom
23:57:07 [2021-05-22T03:57:07.242Z] [INFO] 
23:57:07 [2021-05-22T03:57:07.242Z] [INFO] ---------------------< org.eclipse.ease:ease.core >---------------------
23:57:07 [2021-05-22T03:57:07.242Z] [INFO] Building EASE (Incubation) 0.4.0-SNAPSHOT                        [48/48]
23:57:07 [2021-05-22T03:57:07.242Z] [INFO] --------------------------------[ pom ]---------------------------------
23:57:07 [2021-05-22T03:57:07.242Z] [INFO] 
23:57:07 [2021-05-22T03:57:07.242Z] [INFO] --- maven-clean-plugin:2.5:clean (default-clean) @ ease.core ---
23:57:07 [2021-05-22T03:57:07.242Z] [INFO] 
23:57:07 [2021-05-22T03:57:07.243Z] [INFO] --- maven-install-plugin:2.4:install (default-install) @ ease.core ---
23:57:07 [2021-05-22T03:57:07.500Z] [INFO] Installing /home/jenkins/agent/workspace/ease.verify.core.target.2018-12/pom.xml to /home/jenkins/.m2/repository/org/eclipse/ease/ease.core/0.4.0-SNAPSHOT/ease.core-0.4.0-SNAPSHOT.pom
23:57:07 [2021-05-22T03:57:07.500Z] [INFO] ------------------------------------------------------------------------
23:57:07 [2021-05-22T03:57:07.500Z] [INFO] Reactor Summary:
23:57:07 [2021-05-22T03:57:07.500Z] [INFO] 
23:57:07 [2021-05-22T03:57:07.500Z] [INFO] org.eclipse.ease.classloader 0.8.0-SNAPSHOT ........ SUCCESS [ 55.527 s]
23:57:07 [2021-05-22T03:57:07.500Z] [INFO] org.eclipse.ease 0.8.0-SNAPSHOT .................... SUCCESS [ 22.651 s]
23:57:07 [2021-05-22T03:57:07.500Z] [INFO] org.eclipse.ease.ui 0.8.0-SNAPSHOT ................. SUCCESS [ 25.881 s]
23:57:07 [2021-05-22T03:57:07.500Z] [INFO] org.eclipse.ease.ui.completions.java 0.8.0-SNAPSHOT  SUCCESS [ 10.177 s]
23:57:07 [2021-05-22T03:57:07.500Z] [INFO] org.eclipse.ease.ui.scripts 0.8.0-SNAPSHOT ......... SUCCESS [ 21.189 s]
23:57:07 [2021-05-22T03:57:07.500Z] [INFO] org.eclipse.ease.releng 0.8.0-SNAPSHOT ............. SUCCESS [  0.894 s]
23:57:07 [2021-05-22T03:57:07.500Z] [INFO] org.eclipse.ease.lang.javascript 0.8.0-SNAPSHOT .... SUCCESS [  7.477 s]
23:57:07 [2021-05-22T03:57:07.500Z] [INFO] org.eclipse.ease.lang.scriptarchive 0.8.0-SNAPSHOT . SUCCESS [  6.424 s]
23:57:07 [2021-05-22T03:57:07.500Z] [INFO] org.eclipse.ease.lang.python 0.8.0-SNAPSHOT ........ SUCCESS [  8.992 s]
23:57:07 [2021-05-22T03:57:07.500Z] [INFO] org.eclipse.ease.lang.python.py4j 0.8.0-SNAPSHOT ... SUCCESS [  9.870 s]
23:57:07 [2021-05-22T03:57:07.500Z] [INFO] org.eclipse.ease.lang.groovy 0.8.0-SNAPSHOT ........ SUCCESS [  5.823 s]
23:57:07 [2021-05-22T03:57:07.500Z] [INFO] org.eclipse.ease.lang.groovy.interpreter 0.8.0-SNAPSHOT SUCCESS [  6.806 s]
23:57:07 [2021-05-22T03:57:07.500Z] [INFO] org.eclipse.ease.lang.unittest 0.8.0-SNAPSHOT ...... SUCCESS [ 13.350 s]
23:57:07 [2021-05-22T03:57:07.500Z] [INFO] org.eclipse.ease.lang.unittest.ui 0.8.0-SNAPSHOT ... SUCCESS [ 15.637 s]
23:57:07 [2021-05-22T03:57:07.500Z] [INFO] org.eclipse.ease.lang.ruby 0.8.0-SNAPSHOT .......... SUCCESS [  6.649 s]
23:57:07 [2021-05-22T03:57:07.500Z] [INFO] org.eclipse.ease.lang.ruby.jruby 0.8.0-SNAPSHOT .... SUCCESS [  6.610 s]
23:57:07 [2021-05-22T03:57:07.500Z] [INFO] org.eclipse.ease.lang.javascript.nashorn 0.8.0-SNAPSHOT SUCCESS [  6.701 s]
23:57:07 [2021-05-22T03:57:07.500Z] [INFO] org.eclipse.ease.lang.javascript.rhino 0.8.0-SNAPSHOT SUCCESS [  9.931 s]
23:57:07 [2021-05-22T03:57:07.500Z] [INFO] org.eclipse.ease.lang.python.jython 0.8.0-SNAPSHOT . SUCCESS [  9.862 s]
23:57:07 [2021-05-22T03:57:07.500Z] [INFO] org.eclipse.ease.lang.javascript.ui 0.8.0-SNAPSHOT . SUCCESS [  7.848 s]
23:57:07 [2021-05-22T03:57:07.500Z] [INFO] org.eclipse.ease.lang.jvm.compiled 0.8.0-SNAPSHOT .. SUCCESS [  6.914 s]
23:57:07 [2021-05-22T03:57:07.500Z] [INFO] org.eclipse.ease.lang.scriptarchive.ui 0.8.0-SNAPSHOT SUCCESS [  8.409 s]
23:57:07 [2021-05-22T03:57:07.500Z] [INFO] org.eclipse.ease.help 0.8.0-SNAPSHOT ............... SUCCESS [ 10.890 s]
23:57:07 [2021-05-22T03:57:07.500Z] [INFO] org.eclipse.ease.feature 0.8.0-SNAPSHOT ............ SUCCESS [  0.352 s]
23:57:07 [2021-05-22T03:57:07.500Z] [INFO] org.eclipse.ease.ui.feature 0.8.0-SNAPSHOT ......... SUCCESS [  0.278 s]
23:57:07 [2021-05-22T03:57:07.500Z] [INFO] org.eclipse.ease.lang.javascript.feature 0.8.0-SNAPSHOT SUCCESS [  0.161 s]
23:57:07 [2021-05-22T03:57:07.500Z] [INFO] org.eclipse.ease.lang.python.feature 0.8.0-SNAPSHOT  SUCCESS [  0.113 s]
23:57:07 [2021-05-22T03:57:07.500Z] [INFO] org.eclipse.ease.python.jython.feature 0.8.0-SNAPSHOT SUCCESS [  0.206 s]
23:57:07 [2021-05-22T03:57:07.500Z] [INFO] org.eclipse.ease.lang.python.py4j.feature 0.8.0-SNAPSHOT SUCCESS [  0.174 s]
23:57:07 [2021-05-22T03:57:07.500Z] [INFO] org.eclipse.ease.lang.jvm.feature 0.8.0-SNAPSHOT ... SUCCESS [  0.123 s]
23:57:07 [2021-05-22T03:57:07.501Z] [INFO] org.eclipse.ease.lang.groovy.feature 0.8.0-SNAPSHOT  SUCCESS [  0.163 s]
23:57:07 [2021-05-22T03:57:07.501Z] [INFO] org.eclipse.ease.lang.ruby.feature 0.8.0-SNAPSHOT .. SUCCESS [  0.124 s]
23:57:07 [2021-05-22T03:57:07.501Z] [INFO] org.eclipse.ease.lang.scriptarchive.feature 0.8.0-SNAPSHOT SUCCESS [  0.125 s]
23:57:07 [2021-05-22T03:57:07.501Z] [INFO] org.eclipse.ease.lang.unittest.feature 0.8.0-SNAPSHOT SUCCESS [  0.199 s]
23:57:07 [2021-05-22T03:57:07.501Z] [INFO] org.eclipse.ease.releng.target 0.8.0-SNAPSHOT ...... SUCCESS [  0.007 s]
23:57:07 [2021-05-22T03:57:07.501Z] [INFO] org.eclipse.ease.releng.p2 0.8.0-SNAPSHOT .......... SUCCESS [  9.951 s]
23:57:07 [2021-05-22T03:57:07.501Z] [INFO] org.eclipse.ease.testhelper 0.8.0-SNAPSHOT ......... SUCCESS [ 13.330 s]
23:57:07 [2021-05-22T03:57:07.501Z] [INFO] org.eclipse.ease.test 0.8.0-SNAPSHOT ............... SUCCESS [ 33.440 s]
23:57:07 [2021-05-22T03:57:07.501Z] [INFO] org.eclipse.ease.lang.javascript.rhino.test 0.8.0-SNAPSHOT SUCCESS [ 25.585 s]
23:57:07 [2021-05-22T03:57:07.501Z] [INFO] org.eclipse.ease.lang.javascript.test 0.8.0-SNAPSHOT SUCCESS [ 10.251 s]
23:57:07 [2021-05-22T03:57:07.501Z] [INFO] org.eclipse.ease.lang.python.test 0.8.0-SNAPSHOT ... SUCCESS [  9.610 s]
23:57:07 [2021-05-22T03:57:07.501Z] [INFO] org.eclipse.ease.lang.python.jython.test 0.8.0-SNAPSHOT SUCCESS [ 29.422 s]
23:57:07 [2021-05-22T03:57:07.501Z] [INFO] org.eclipse.ease.lang.scriptarchive.test 0.8.0-SNAPSHOT SUCCESS [ 10.616 s]
23:57:07 [2021-05-22T03:57:07.501Z] [INFO] org.eclipse.ease.lang.unittest.test 0.8.0-SNAPSHOT . SUCCESS [  7.091 s]
23:57:07 [2021-05-22T03:57:07.501Z] [INFO] org.eclipse.ease.ui.scripts.test 0.8.0-SNAPSHOT .... SUCCESS [  8.687 s]
23:57:07 [2021-05-22T03:57:07.501Z] [INFO] org.eclipse.ease.ui.test 0.8.0-SNAPSHOT ............ SUCCESS [ 13.239 s]
23:57:07 [2021-05-22T03:57:07.501Z] [INFO] org.eclipse.ease.releng.coverage 0.8.0-SNAPSHOT .... SUCCESS [  2.705 s]
23:57:07 [2021-05-22T03:57:07.501Z] [INFO] EASE (Incubation) 0.4.0-SNAPSHOT ................... SUCCESS [  0.244 s]
23:57:07 [2021-05-22T03:57:07.501Z] [INFO] ------------------------------------------------------------------------
23:57:07 [2021-05-22T03:57:07.501Z] [INFO] BUILD SUCCESS
23:57:07 [2021-05-22T03:57:07.501Z] [INFO] ------------------------------------------------------------------------
23:57:07 [2021-05-22T03:57:07.501Z] [INFO] Total time:  13:59 min
23:57:07 [2021-05-22T03:57:07.501Z] [INFO] Finished at: 2021-05-22T03:57:07Z
23:57:07 [2021-05-22T03:57:07.501Z] [INFO] ------------------------------------------------------------------------
23:57:07 [2021-05-22T03:57:07.501Z] [INFO] [jenkins-event-spy] Generated /home/jenkins/agent/workspace/ease.verify.core.target.2018-12@tmp/withMaven20d5a577/maven-spy-20210522-034307-53617291907711703326244.log